lucene-dev mailing list archives

Site index · List index
Message view « Date » · « Thread »
Top « Date » · « Thread »
From Apache Jenkins Server <jenk...@builds.apache.org>
Subject [JENKINS] Lucene-Solr-Tests-4.x-java7 - Build # 817 - Still Failing
Date Fri, 21 Dec 2012 01:24:55 GMT
Build: https://builds.apache.org/job/Lucene-Solr-Tests-4.x-java7/817/

2 tests failed.
FAILED:  org.apache.solr.cloud.BasicDistributedZkTest.testDistribSearch

Error Message:
Timeout occured while waiting response from server at: http://127.0.0.1:11382//oneInstanceCollection

Stack Trace:
org.apache.solr.client.solrj.SolrServerException: Timeout occured while waiting response from server at: http://127.0.0.1:11382//oneInstanceCollection
	at __randomizedtesting.SeedInfo.seed([DFA9194C7888B80C:5E4F97540FD7D830]:0)
	at org.apache.solr.client.solrj.impl.HttpSolrServer.request(HttpSolrServer.java:409)
	at org.apache.solr.client.solrj.impl.HttpSolrServer.request(HttpSolrServer.java:181)
	at org.apache.solr.client.solrj.request.QueryRequest.process(QueryRequest.java:90)
	at org.apache.solr.client.solrj.SolrServer.query(SolrServer.java:301)
	at org.apache.solr.cloud.BasicDistributedZkTest.testSearchByCollectionName(BasicDistributedZkTest.java:1077)
	at org.apache.solr.cloud.BasicDistributedZkTest.doTest(BasicDistributedZkTest.java:330)
	at org.apache.solr.BaseDistributedSearchTestCase.testDistribSearch(BaseDistributedSearchTestCase.java:794)
	at sun.reflect.NativeMethodAccessorImpl.invoke0(Native Method)
	at sun.reflect.NativeMethodAccessorImpl.invoke(NativeMethodAccessorImpl.java:57)
	at sun.reflect.DelegatingMethodAccessorImpl.invoke(DelegatingMethodAccessorImpl.java:43)
	at java.lang.reflect.Method.invoke(Method.java:601)
	at com.carrotsearch.randomizedtesting.RandomizedRunner.invoke(RandomizedRunner.java:1559)
	at com.carrotsearch.randomizedtesting.RandomizedRunner.access$600(RandomizedRunner.java:79)
	at com.carrotsearch.randomizedtesting.RandomizedRunner$6.evaluate(RandomizedRunner.java:737)
	at com.carrotsearch.randomizedtesting.RandomizedRunner$7.evaluate(RandomizedRunner.java:773)
	at com.carrotsearch.randomizedtesting.RandomizedRunner$8.evaluate(RandomizedRunner.java:787)
	at com.carrotsearch.randomizedtesting.rules.SystemPropertiesRestoreRule$1.evaluate(SystemPropertiesRestoreRule.java:53)
	at org.apache.lucene.util.TestRuleSetupTeardownChained$1.evaluate(TestRuleSetupTeardownChained.java:50)
	at org.apache.lucene.util.TestRuleFieldCacheSanity$1.evaluate(TestRuleFieldCacheSanity.java:51)
	at org.apache.lucene.util.AbstractBeforeAfterRule$1.evaluate(AbstractBeforeAfterRule.java:46)
	at com.carrotsearch.randomizedtesting.rules.SystemPropertiesInvariantRule$1.evaluate(SystemPropertiesInvariantRule.java:55)
	at org.apache.lucene.util.TestRuleThreadAndTestName$1.evaluate(TestRuleThreadAndTestName.java:49)
	at org.apache.lucene.util.TestRuleIgnoreAfterMaxFailures$1.evaluate(TestRuleIgnoreAfterMaxFailures.java:70)
	at org.apache.lucene.util.TestRuleMarkFailure$1.evaluate(TestRuleMarkFailure.java:48)
	at com.carrotsearch.randomizedtesting.rules.StatementAdapter.evaluate(StatementAdapter.java:36)
	at com.carrotsearch.randomizedtesting.ThreadLeakControl$StatementRunner.run(ThreadLeakControl.java:358)
	at com.carrotsearch.randomizedtesting.ThreadLeakControl.forkTimeoutingTask(ThreadLeakControl.java:782)
	at com.carrotsearch.randomizedtesting.ThreadLeakControl$3.evaluate(ThreadLeakControl.java:442)
	at com.carrotsearch.randomizedtesting.RandomizedRunner.runSingleTest(RandomizedRunner.java:746)
	at com.carrotsearch.randomizedtesting.RandomizedRunner$3.evaluate(RandomizedRunner.java:648)
	at com.carrotsearch.randomizedtesting.RandomizedRunner$4.evaluate(RandomizedRunner.java:682)
	at com.carrotsearch.randomizedtesting.RandomizedRunner$5.evaluate(RandomizedRunner.java:693)
	at com.carrotsearch.randomizedtesting.rules.StatementAdapter.evaluate(StatementAdapter.java:36)
	at com.carrotsearch.randomizedtesting.rules.SystemPropertiesRestoreRule$1.evaluate(SystemPropertiesRestoreRule.java:53)
	at org.apache.lucene.util.AbstractBeforeAfterRule$1.evaluate(AbstractBeforeAfterRule.java:46)
	at org.apache.lucene.util.TestRuleStoreClassName$1.evaluate(TestRuleStoreClassName.java:42)
	at com.carrotsearch.randomizedtesting.rules.SystemPropertiesInvariantRule$1.evaluate(SystemPropertiesInvariantRule.java:55)
	at com.carrotsearch.randomizedtesting.rules.NoShadowingOrOverridesOnMethodsRule$1.evaluate(NoShadowingOrOverridesOnMethodsRule.java:39)
	at com.carrotsearch.randomizedtesting.rules.NoShadowingOrOverridesOnMethodsRule$1.evaluate(NoShadowingOrOverridesOnMethodsRule.java:39)
	at com.carrotsearch.randomizedtesting.rules.StatementAdapter.evaluate(StatementAdapter.java:36)
	at org.apache.lucene.util.TestRuleAssertionsRequired$1.evaluate(TestRuleAssertionsRequired.java:43)
	at org.apache.lucene.util.TestRuleMarkFailure$1.evaluate(TestRuleMarkFailure.java:48)
	at org.apache.lucene.util.TestRuleIgnoreAfterMaxFailures$1.evaluate(TestRuleIgnoreAfterMaxFailures.java:70)
	at org.apache.lucene.util.TestRuleIgnoreTestSuites$1.evaluate(TestRuleIgnoreTestSuites.java:55)
	at com.carrotsearch.randomizedtesting.rules.StatementAdapter.evaluate(StatementAdapter.java:36)
	at com.carrotsearch.randomizedtesting.ThreadLeakControl$StatementRunner.run(ThreadLeakControl.java:358)
	at java.lang.Thread.run(Thread.java:722)
Caused by: java.net.SocketTimeoutException: Read timed out
	at java.net.SocketInputStream.socketRead0(Native Method)
	at java.net.SocketInputStream.read(SocketInputStream.java:150)
	at java.net.SocketInputStream.read(SocketInputStream.java:121)
	at org.apache.http.impl.io.AbstractSessionInputBuffer.fillBuffer(AbstractSessionInputBuffer.java:149)
	at org.apache.http.impl.io.SocketInputBuffer.fillBuffer(SocketInputBuffer.java:111)
	at org.apache.http.impl.io.AbstractSessionInputBuffer.readLine(AbstractSessionInputBuffer.java:264)
	at org.apache.http.impl.conn.DefaultResponseParser.parseHead(DefaultResponseParser.java:98)
	at org.apache.http.impl.io.AbstractMessageParser.parse(AbstractMessageParser.java:252)
	at org.apache.http.impl.AbstractHttpClientConnection.receiveResponseHeader(AbstractHttpClientConnection.java:282)
	at org.apache.http.impl.conn.DefaultClientConnection.receiveResponseHeader(DefaultClientConnection.java:247)
	at org.apache.http.impl.conn.AbstractClientConnAdapter.receiveResponseHeader(AbstractClientConnAdapter.java:216)
	at org.apache.http.protocol.HttpRequestExecutor.doReceiveResponse(HttpRequestExecutor.java:298)
	at org.apache.http.protocol.HttpRequestExecutor.execute(HttpRequestExecutor.java:125)
	at org.apache.http.impl.client.DefaultRequestDirector.tryExecute(DefaultRequestDirector.java:647)
	at org.apache.http.impl.client.DefaultRequestDirector.execute(DefaultRequestDirector.java:464)
	at org.apache.http.impl.client.AbstractHttpClient.execute(AbstractHttpClient.java:820)
	at org.apache.http.impl.client.AbstractHttpClient.execute(AbstractHttpClient.java:754)
	at org.apache.http.impl.client.AbstractHttpClient.execute(AbstractHttpClient.java:732)
	at org.apache.solr.client.solrj.impl.HttpSolrServer.request(HttpSolrServer.java:352)
	... 46 more


FAILED:  org.apache.solr.cloud.SyncSliceTest.testDistribSearch

Error Message:
shard1 should have just been set up to be inconsistent - but it's still consistent

Stack Trace:
java.lang.AssertionError: shard1 should have just been set up to be inconsistent - but it's still consistent
	at __randomizedtesting.SeedInfo.seed([DFA9194C7888B80C:5E4F97540FD7D830]:0)
	at org.junit.Assert.fail(Assert.java:93)
	at org.junit.Assert.assertTrue(Assert.java:43)
	at org.junit.Assert.assertNotNull(Assert.java:526)
	at org.apache.solr.cloud.SyncSliceTest.doTest(SyncSliceTest.java:220)
	at org.apache.solr.BaseDistributedSearchTestCase.testDistribSearch(BaseDistributedSearchTestCase.java:794)
	at sun.reflect.NativeMethodAccessorImpl.invoke0(Native Method)
	at sun.reflect.NativeMethodAccessorImpl.invoke(NativeMethodAccessorImpl.java:57)
	at sun.reflect.DelegatingMethodAccessorImpl.invoke(DelegatingMethodAccessorImpl.java:43)
	at java.lang.reflect.Method.invoke(Method.java:601)
	at com.carrotsearch.randomizedtesting.RandomizedRunner.invoke(RandomizedRunner.java:1559)
	at com.carrotsearch.randomizedtesting.RandomizedRunner.access$600(RandomizedRunner.java:79)
	at com.carrotsearch.randomizedtesting.RandomizedRunner$6.evaluate(RandomizedRunner.java:737)
	at com.carrotsearch.randomizedtesting.RandomizedRunner$7.evaluate(RandomizedRunner.java:773)
	at com.carrotsearch.randomizedtesting.RandomizedRunner$8.evaluate(RandomizedRunner.java:787)
	at com.carrotsearch.randomizedtesting.rules.SystemPropertiesRestoreRule$1.evaluate(SystemPropertiesRestoreRule.java:53)
	at org.apache.lucene.util.TestRuleSetupTeardownChained$1.evaluate(TestRuleSetupTeardownChained.java:50)
	at org.apache.lucene.util.TestRuleFieldCacheSanity$1.evaluate(TestRuleFieldCacheSanity.java:51)
	at org.apache.lucene.util.AbstractBeforeAfterRule$1.evaluate(AbstractBeforeAfterRule.java:46)
	at com.carrotsearch.randomizedtesting.rules.SystemPropertiesInvariantRule$1.evaluate(SystemPropertiesInvariantRule.java:55)
	at org.apache.lucene.util.TestRuleThreadAndTestName$1.evaluate(TestRuleThreadAndTestName.java:49)
	at org.apache.lucene.util.TestRuleIgnoreAfterMaxFailures$1.evaluate(TestRuleIgnoreAfterMaxFailures.java:70)
	at org.apache.lucene.util.TestRuleMarkFailure$1.evaluate(TestRuleMarkFailure.java:48)
	at com.carrotsearch.randomizedtesting.rules.StatementAdapter.evaluate(StatementAdapter.java:36)
	at com.carrotsearch.randomizedtesting.ThreadLeakControl$StatementRunner.run(ThreadLeakControl.java:358)
	at com.carrotsearch.randomizedtesting.ThreadLeakControl.forkTimeoutingTask(ThreadLeakControl.java:782)
	at com.carrotsearch.randomizedtesting.ThreadLeakControl$3.evaluate(ThreadLeakControl.java:442)
	at com.carrotsearch.randomizedtesting.RandomizedRunner.runSingleTest(RandomizedRunner.java:746)
	at com.carrotsearch.randomizedtesting.RandomizedRunner$3.evaluate(RandomizedRunner.java:648)
	at com.carrotsearch.randomizedtesting.RandomizedRunner$4.evaluate(RandomizedRunner.java:682)
	at com.carrotsearch.randomizedtesting.RandomizedRunner$5.evaluate(RandomizedRunner.java:693)
	at com.carrotsearch.randomizedtesting.rules.StatementAdapter.evaluate(StatementAdapter.java:36)
	at com.carrotsearch.randomizedtesting.rules.SystemPropertiesRestoreRule$1.evaluate(SystemPropertiesRestoreRule.java:53)
	at org.apache.lucene.util.AbstractBeforeAfterRule$1.evaluate(AbstractBeforeAfterRule.java:46)
	at org.apache.lucene.util.TestRuleStoreClassName$1.evaluate(TestRuleStoreClassName.java:42)
	at com.carrotsearch.randomizedtesting.rules.SystemPropertiesInvariantRule$1.evaluate(SystemPropertiesInvariantRule.java:55)
	at com.carrotsearch.randomizedtesting.rules.NoShadowingOrOverridesOnMethodsRule$1.evaluate(NoShadowingOrOverridesOnMethodsRule.java:39)
	at com.carrotsearch.randomizedtesting.rules.NoShadowingOrOverridesOnMethodsRule$1.evaluate(NoShadowingOrOverridesOnMethodsRule.java:39)
	at com.carrotsearch.randomizedtesting.rules.StatementAdapter.evaluate(StatementAdapter.java:36)
	at org.apache.lucene.util.TestRuleAssertionsRequired$1.evaluate(TestRuleAssertionsRequired.java:43)
	at org.apache.lucene.util.TestRuleMarkFailure$1.evaluate(TestRuleMarkFailure.java:48)
	at org.apache.lucene.util.TestRuleIgnoreAfterMaxFailures$1.evaluate(TestRuleIgnoreAfterMaxFailures.java:70)
	at org.apache.lucene.util.TestRuleIgnoreTestSuites$1.evaluate(TestRuleIgnoreTestSuites.java:55)
	at com.carrotsearch.randomizedtesting.rules.StatementAdapter.evaluate(StatementAdapter.java:36)
	at com.carrotsearch.randomizedtesting.ThreadLeakControl$StatementRunner.run(ThreadLeakControl.java:358)
	at java.lang.Thread.run(Thread.java:722)




Build Log:
[...truncated 8856 lines...]
[junit4:junit4] Suite: org.apache.solr.cloud.BasicDistributedZkTest
[junit4:junit4]   2> 0 T810 oas.BaseDistributedSearchTestCase.initHostContext Setting hostContext system property: /
[junit4:junit4]   2> 5 T810 oas.SolrTestCaseJ4.setUp ###Starting testDistribSearch
[junit4:junit4]   2> Creating dataDir: /usr/home/hudson/hudson-slave/workspace/Lucene-Solr-Tests-4.x-java7/solr/build/solr-core/test/J0/./solrtest-BasicDistributedZkTest-1356052453472
[junit4:junit4]   2> 6 T810 oasc.ZkTestServer.run STARTING ZK TEST SERVER
[junit4:junit4]   2> 6 T811 oasc.ZkTestServer$ZKServerMain.runFromConfig Starting server
[junit4:junit4]   2> 9 T811 oazs.ZooKeeperServer.setTickTime tickTime set to 1000
[junit4:junit4]   2> 9 T811 oazs.ZooKeeperServer.setMinSessionTimeout minSessionTimeout set to -1
[junit4:junit4]   2> 9 T811 oazs.ZooKeeperServer.setMaxSessionTimeout maxSessionTimeout set to -1
[junit4:junit4]   2> 10 T811 oazs.NIOServerCnxnFactory.configure binding to port 0.0.0.0/0.0.0.0:0
[junit4:junit4]   2> 10 T811 oazsp.FileTxnSnapLog.save Snapshotting: 0x0 to /usr/home/hudson/hudson-slave/workspace/Lucene-Solr-Tests-4.x-java7/solr/build/solr-core/test/J0/./org.apache.solr.cloud.BasicDistributedZkTest-1356052453472/zookeeper/server1/data/version-2/snapshot.0
[junit4:junit4]   2> 107 T810 oasc.ZkTestServer.run start zk server on port:11375
[junit4:junit4]   2> 108 T810 oaz.ZooKeeper.<init> Initiating client connection, connectString=127.0.0.1:11375 sessionTimeout=10000 watcher=org.apache.solr.common.cloud.ConnectionManager@40d4f387
[junit4:junit4]   2> 108 T810 oascc.ConnectionManager.waitForConnected Waiting for client to connect to ZooKeeper
[junit4:junit4]   2> 109 T816 oaz.ClientCnxn$SendThread.logStartConnect Opening socket connection to server localhost/127.0.0.1:11375. Will not attempt to authenticate using SASL (access denied ("javax.security.auth.AuthPermission" "getLoginConfiguration"))
[junit4:junit4]   2> 109 T816 oaz.ClientCnxn$SendThread.primeConnection Socket connection established to localhost/127.0.0.1:11375, initiating session
[junit4:junit4]   2> 110 T812 oazs.NIOServerCnxnFactory.run Accepted socket connection from /140.211.11.196:11376
[junit4:junit4]   2> 110 T812 oazs.ZooKeeperServer.processConnectRequest Client attempting to establish new session at /140.211.11.196:11376
[junit4:junit4]   2> 111 T814 oazsp.FileTxnLog.append Creating new log file: log.1
[junit4:junit4]   2> 114 T814 oazs.ZooKeeperServer.finishSessionInit Established session 0x13bbb0658660000 with negotiated timeout 10000 for client /140.211.11.196:11376
[junit4:junit4]   2> 114 T816 oaz.ClientCnxn$SendThread.onConnected Session establishment complete on server localhost/127.0.0.1:11375, sessionid = 0x13bbb0658660000, negotiated timeout = 10000
[junit4:junit4]   2> 114 T817 oascc.ConnectionManager.process Watcher org.apache.solr.common.cloud.ConnectionManager@40d4f387 name:ZooKeeperConnection Watcher:127.0.0.1:11375 got event WatchedEvent state:SyncConnected type:None path:null path:null type:None
[junit4:junit4]   2> 115 T810 oascc.ConnectionManager.waitForConnected Client is connected to ZooKeeper
[junit4:junit4]   2> 115 T810 oascc.SolrZkClient.makePath makePath: /solr
[junit4:junit4]   2> 130 T815 oazs.PrepRequestProcessor.pRequest2Txn Processed session termination for sessionid: 0x13bbb0658660000
[junit4:junit4]   2> 132 T817 oaz.ClientCnxn$EventThread.run EventThread shut down
[junit4:junit4]   2> 132 T812 oazs.NIOServerCnxn.closeSock Closed socket connection for client /140.211.11.196:11376 which had sessionid 0x13bbb0658660000
[junit4:junit4]   2> 132 T810 oaz.ZooKeeper.close Session: 0x13bbb0658660000 closed
[junit4:junit4]   2> 133 T810 oaz.ZooKeeper.<init> Initiating client connection, connectString=127.0.0.1:11375/solr sessionTimeout=10000 watcher=org.apache.solr.common.cloud.ConnectionManager@35d3f3f7
[junit4:junit4]   2> 134 T810 oascc.ConnectionManager.waitForConnected Waiting for client to connect to ZooKeeper
[junit4:junit4]   2> 134 T818 oaz.ClientCnxn$SendThread.logStartConnect Opening socket connection to server localhost/127.0.0.1:11375. Will not attempt to authenticate using SASL (access denied ("javax.security.auth.AuthPermission" "getLoginConfiguration"))
[junit4:junit4]   2> 134 T818 oaz.ClientCnxn$SendThread.primeConnection Socket connection established to localhost/127.0.0.1:11375, initiating session
[junit4:junit4]   2> 134 T812 oazs.NIOServerCnxnFactory.run Accepted socket connection from /140.211.11.196:11377
[junit4:junit4]   2> 135 T812 oazs.ZooKeeperServer.processConnectRequest Client attempting to establish new session at /140.211.11.196:11377
[junit4:junit4]   2> 136 T814 oazs.ZooKeeperServer.finishSessionInit Established session 0x13bbb0658660001 with negotiated timeout 10000 for client /140.211.11.196:11377
[junit4:junit4]   2> 136 T818 oaz.ClientCnxn$SendThread.onConnected Session establishment complete on server localhost/127.0.0.1:11375, sessionid = 0x13bbb0658660001, negotiated timeout = 10000
[junit4:junit4]   2> 137 T819 oascc.ConnectionManager.process Watcher org.apache.solr.common.cloud.ConnectionManager@35d3f3f7 name:ZooKeeperConnection Watcher:127.0.0.1:11375/solr got event WatchedEvent state:SyncConnected type:None path:null path:null type:None
[junit4:junit4]   2> 137 T810 oascc.ConnectionManager.waitForConnected Client is connected to ZooKeeper
[junit4:junit4]   2> 137 T810 oascc.SolrZkClient.makePath makePath: /collections/collection1
[junit4:junit4]   2> 142 T810 oascc.SolrZkClient.makePath makePath: /collections/collection1/shards
[junit4:junit4]   2> 150 T810 oascc.SolrZkClient.makePath makePath: /collections/control_collection
[junit4:junit4]   2> 153 T810 oascc.SolrZkClient.makePath makePath: /collections/control_collection/shards
[junit4:junit4]   2> 156 T810 oasc.AbstractZkTestCase.putConfig put /usr/home/hudson/hudson-slave/workspace/Lucene-Solr-Tests-4.x-java7/solr/build/solr-core/test-files/solr/collection1/conf/solrconfig.xml to /configs/conf1/solrconfig.xml
[junit4:junit4]   2> 157 T810 oascc.SolrZkClient.makePath makePath: /configs/conf1/solrconfig.xml
[junit4:junit4]   2> 168 T810 oasc.AbstractZkTestCase.putConfig put /usr/home/hudson/hudson-slave/workspace/Lucene-Solr-Tests-4.x-java7/solr/build/solr-core/test-files/solr/collection1/conf/schema.xml to /configs/conf1/schema.xml
[junit4:junit4]   2> 169 T810 oascc.SolrZkClient.makePath makePath: /configs/conf1/schema.xml
[junit4:junit4]   2> 273 T810 oasc.AbstractZkTestCase.putConfig put /usr/home/hudson/hudson-slave/workspace/Lucene-Solr-Tests-4.x-java7/solr/build/solr-core/test-files/solr/collection1/conf/stopwords.txt to /configs/conf1/stopwords.txt
[junit4:junit4]   2> 274 T810 oascc.SolrZkClient.makePath makePath: /configs/conf1/stopwords.txt
[junit4:junit4]   2> 278 T810 oasc.AbstractZkTestCase.putConfig put /usr/home/hudson/hudson-slave/workspace/Lucene-Solr-Tests-4.x-java7/solr/build/solr-core/test-files/solr/collection1/conf/protwords.txt to /configs/conf1/protwords.txt
[junit4:junit4]   2> 279 T810 oascc.SolrZkClient.makePath makePath: /configs/conf1/protwords.txt
[junit4:junit4]   2> 289 T810 oasc.AbstractZkTestCase.putConfig put /usr/home/hudson/hudson-slave/workspace/Lucene-Solr-Tests-4.x-java7/solr/build/solr-core/test-files/solr/collection1/conf/currency.xml to /configs/conf1/currency.xml
[junit4:junit4]   2> 290 T810 oascc.SolrZkClient.makePath makePath: /configs/conf1/currency.xml
[junit4:junit4]   2> 293 T810 oasc.AbstractZkTestCase.putConfig put /usr/home/hudson/hudson-slave/workspace/Lucene-Solr-Tests-4.x-java7/solr/build/solr-core/test-files/solr/collection1/conf/open-exchange-rates.json to /configs/conf1/open-exchange-rates.json
[junit4:junit4]   2> 294 T810 oascc.SolrZkClient.makePath makePath: /configs/conf1/open-exchange-rates.json
[junit4:junit4]   2> 297 T810 oasc.AbstractZkTestCase.putConfig put /usr/home/hudson/hudson-slave/workspace/Lucene-Solr-Tests-4.x-java7/solr/build/solr-core/test-files/solr/collection1/conf/mapping-ISOLatin1Accent.txt to /configs/conf1/mapping-ISOLatin1Accent.txt
[junit4:junit4]   2> 298 T810 oascc.SolrZkClient.makePath makePath: /configs/conf1/mapping-ISOLatin1Accent.txt
[junit4:junit4]   2> 301 T810 oasc.AbstractZkTestCase.putConfig put /usr/home/hudson/hudson-slave/workspace/Lucene-Solr-Tests-4.x-java7/solr/build/solr-core/test-files/solr/collection1/conf/old_synonyms.txt to /configs/conf1/old_synonyms.txt
[junit4:junit4]   2> 302 T810 oascc.SolrZkClient.makePath makePath: /configs/conf1/old_synonyms.txt
[junit4:junit4]   2> 305 T810 oasc.AbstractZkTestCase.putConfig put /usr/home/hudson/hudson-slave/workspace/Lucene-Solr-Tests-4.x-java7/solr/build/solr-core/test-files/solr/collection1/conf/synonyms.txt to /configs/conf1/synonyms.txt
[junit4:junit4]   2> 305 T810 oascc.SolrZkClient.makePath makePath: /configs/conf1/synonyms.txt
[junit4:junit4]   2> 308 T815 oazs.PrepRequestProcessor.pRequest2Txn Processed session termination for sessionid: 0x13bbb0658660001
[junit4:junit4]   2> 309 T819 oaz.ClientCnxn$EventThread.run EventThread shut down
[junit4:junit4]   2> 309 T812 oazs.NIOServerCnxn.closeSock Closed socket connection for client /140.211.11.196:11377 which had sessionid 0x13bbb0658660001
[junit4:junit4]   2> 309 T810 oaz.ZooKeeper.close Session: 0x13bbb0658660001 closed
[junit4:junit4]   2> 437 T810 oejs.Server.doStart jetty-8.1.8.v20121106
[junit4:junit4]   2> 441 T810 oejs.AbstractConnector.doStart Started SocketConnector@127.0.0.1:11378
[junit4:junit4]   2> 442 T810 oasc.SolrResourceLoader.locateSolrHome JNDI not configured for solr (NoInitialContextEx)
[junit4:junit4]   2> 442 T810 oasc.SolrResourceLoader.locateSolrHome using system property solr.solr.home: /usr/home/hudson/hudson-slave/workspace/Lucene-Solr-Tests-4.x-java7/solr/build/solr-core/test/J0/./org.apache.solr.cloud.BasicDistributedZkTest-controljetty-1356052453777
[junit4:junit4]   2> 443 T810 oasc.SolrResourceLoader.<init> new SolrResourceLoader for deduced Solr Home: '/usr/home/hudson/hudson-slave/workspace/Lucene-Solr-Tests-4.x-java7/solr/build/solr-core/test/J0/./org.apache.solr.cloud.BasicDistributedZkTest-controljetty-1356052453777/'
[junit4:junit4]   2> 481 T810 oass.SolrDispatchFilter.init SolrDispatchFilter.init()
[junit4:junit4]   2> 482 T810 oasc.SolrResourceLoader.locateSolrHome JNDI not configured for solr (NoInitialContextEx)
[junit4:junit4]   2> 483 T810 oasc.SolrResourceLoader.locateSolrHome using system property solr.solr.home: /usr/home/hudson/hudson-slave/workspace/Lucene-Solr-Tests-4.x-java7/solr/build/solr-core/test/J0/./org.apache.solr.cloud.BasicDistributedZkTest-controljetty-1356052453777
[junit4:junit4]   2> 483 T810 oasc.CoreContainer$Initializer.initialize looking for solr.xml: /usr/home/hudson/hudson-slave/workspace/Lucene-Solr-Tests-4.x-java7/solr/build/solr-core/test/J0/./org.apache.solr.cloud.BasicDistributedZkTest-controljetty-1356052453777/solr.xml
[junit4:junit4]   2> 484 T810 oasc.CoreContainer.<init> New CoreContainer 370420004
[junit4:junit4]   2> 484 T810 oasc.CoreContainer.load Loading CoreContainer using Solr Home: '/usr/home/hudson/hudson-slave/workspace/Lucene-Solr-Tests-4.x-java7/solr/build/solr-core/test/J0/./org.apache.solr.cloud.BasicDistributedZkTest-controljetty-1356052453777/'
[junit4:junit4]   2> 484 T810 oasc.SolrResourceLoader.<init> new SolrResourceLoader for directory: '/usr/home/hudson/hudson-slave/workspace/Lucene-Solr-Tests-4.x-java7/solr/build/solr-core/test/J0/./org.apache.solr.cloud.BasicDistributedZkTest-controljetty-1356052453777/'
[junit4:junit4]   2> 514 T810 oashc.HttpShardHandlerFactory.getParameter Setting socketTimeout to: 30000
[junit4:junit4]   2> 515 T810 oashc.HttpShardHandlerFactory.getParameter Setting urlScheme to: http://
[junit4:junit4]   2> 515 T810 oashc.HttpShardHandlerFactory.getParameter Setting connTimeout to: 15000
[junit4:junit4]   2> 516 T810 oashc.HttpShardHandlerFactory.getParameter Setting maxConnectionsPerHost to: 20
[junit4:junit4]   2> 516 T810 oashc.HttpShardHandlerFactory.getParameter Setting corePoolSize to: 0
[junit4:junit4]   2> 516 T810 oashc.HttpShardHandlerFactory.getParameter Setting maximumPoolSize to: 2147483647
[junit4:junit4]   2> 517 T810 oashc.HttpShardHandlerFactory.getParameter Setting maxThreadIdleTime to: 5
[junit4:junit4]   2> 517 T810 oashc.HttpShardHandlerFactory.getParameter Setting sizeOfQueue to: -1
[junit4:junit4]   2> 518 T810 oashc.HttpShardHandlerFactory.getParameter Setting fairnessPolicy to: false
[junit4:junit4]   2> 518 T810 oascsi.HttpClientUtil.createClient Creating new http client, config:maxConnectionsPerHost=20&maxConnections=10000&socketTimeout=30000&connTimeout=15000&retry=false
[junit4:junit4]   2> 541 T810 oasc.CoreContainer.load Registering Log Listener
[junit4:junit4]   2> 556 T810 oasc.CoreContainer.initZooKeeper Zookeeper client=127.0.0.1:11375/solr
[junit4:junit4]   2> 557 T810 oasc.ZkController.checkChrootPath zkHost includes chroot
[junit4:junit4]   2> 558 T810 oaz.ZooKeeper.<init> Initiating client connection, connectString=127.0.0.1:11375 sessionTimeout=60000 watcher=org.apache.solr.common.cloud.ConnectionManager@1564624e
[junit4:junit4]   2> 558 T810 oascc.ConnectionManager.waitForConnected Waiting for client to connect to ZooKeeper
[junit4:junit4]   2> 559 T829 oaz.ClientCnxn$SendThread.logStartConnect Opening socket connection to server localhost/127.0.0.1:11375. Will not attempt to authenticate using SASL (access denied ("javax.security.auth.AuthPermission" "getLoginConfiguration"))
[junit4:junit4]   2> 560 T829 oaz.ClientCnxn$SendThread.primeConnection Socket connection established to localhost/127.0.0.1:11375, initiating session
[junit4:junit4]   2> 560 T812 oazs.NIOServerCnxnFactory.run Accepted socket connection from /140.211.11.196:11379
[junit4:junit4]   2> 560 T812 oazs.ZooKeeperServer.processConnectRequest Client attempting to establish new session at /140.211.11.196:11379
[junit4:junit4]   2> 562 T814 oazs.ZooKeeperServer.finishSessionInit Established session 0x13bbb0658660002 with negotiated timeout 20000 for client /140.211.11.196:11379
[junit4:junit4]   2> 562 T829 oaz.ClientCnxn$SendThread.onConnected Session establishment complete on server localhost/127.0.0.1:11375, sessionid = 0x13bbb0658660002, negotiated timeout = 20000
[junit4:junit4]   2> 562 T830 oascc.ConnectionManager.process Watcher org.apache.solr.common.cloud.ConnectionManager@1564624e name:ZooKeeperConnection Watcher:127.0.0.1:11375 got event WatchedEvent state:SyncConnected type:None path:null path:null type:None
[junit4:junit4]   2> 562 T810 oascc.ConnectionManager.waitForConnected Client is connected to ZooKeeper
[junit4:junit4]   2> 564 T815 oazs.PrepRequestProcessor.pRequest2Txn Processed session termination for sessionid: 0x13bbb0658660002
[junit4:junit4]   2> 565 T830 oaz.ClientCnxn$EventThread.run EventThread shut down
[junit4:junit4]   2> 565 T812 oazs.NIOServerCnxn.closeSock Closed socket connection for client /140.211.11.196:11379 which had sessionid 0x13bbb0658660002
[junit4:junit4]   2> 565 T810 oaz.ZooKeeper.close Session: 0x13bbb0658660002 closed
[junit4:junit4]   2> 565 T810 oascsi.HttpClientUtil.createClient Creating new http client, config:maxConnections=500&maxConnectionsPerHost=16&socketTimeout=15000&connTimeout=30000
[junit4:junit4]   2> 573 T810 oaz.ZooKeeper.<init> Initiating client connection, connectString=127.0.0.1:11375/solr sessionTimeout=30000 watcher=org.apache.solr.common.cloud.ConnectionManager@664371ea
[junit4:junit4]   2> 574 T810 oascc.ConnectionManager.waitForConnected Waiting for client to connect to ZooKeeper
[junit4:junit4]   2> 575 T831 oaz.ClientCnxn$SendThread.logStartConnect Opening socket connection to server localhost/127.0.0.1:11375. Will not attempt to authenticate using SASL (access denied ("javax.security.auth.AuthPermission" "getLoginConfiguration"))
[junit4:junit4]   2> 575 T831 oaz.ClientCnxn$SendThread.primeConnection Socket connection established to localhost/127.0.0.1:11375, initiating session
[junit4:junit4]   2> 575 T812 oazs.NIOServerCnxnFactory.run Accepted socket connection from /140.211.11.196:11380
[junit4:junit4]   2> 576 T812 oazs.ZooKeeperServer.processConnectRequest Client attempting to establish new session at /140.211.11.196:11380
[junit4:junit4]   2> 577 T814 oazs.ZooKeeperServer.finishSessionInit Established session 0x13bbb0658660003 with negotiated timeout 20000 for client /140.211.11.196:11380
[junit4:junit4]   2> 577 T831 oaz.ClientCnxn$SendThread.onConnected Session establishment complete on server localhost/127.0.0.1:11375, sessionid = 0x13bbb0658660003, negotiated timeout = 20000
[junit4:junit4]   2> 578 T832 oascc.ConnectionManager.process Watcher org.apache.solr.common.cloud.ConnectionManager@664371ea name:ZooKeeperConnection Watcher:127.0.0.1:11375/solr got event WatchedEvent state:SyncConnected type:None path:null path:null type:None
[junit4:junit4]   2> 578 T810 oascc.ConnectionManager.waitForConnected Client is connected to ZooKeeper
[junit4:junit4]   2> 580 T815 oazs.PrepRequestProcessor.pRequest Got user-level KeeperException when processing sessionid:0x13bbb0658660003 type:create cxid:0x2 zxid:0x1a txntype:-1 reqpath:n/a Error Path:/solr/overseer Error:KeeperErrorCode = NodeExists for /solr/overseer
[junit4:junit4]   2> 589 T810 oascc.SolrZkClient.makePath makePath: /live_nodes
[junit4:junit4]   2> 592 T810 oasc.ZkController.createEphemeralLiveNode Register node as live in ZooKeeper:/live_nodes/127.0.0.1:11378_
[junit4:junit4]   2> 592 T815 oazs.PrepRequestProcessor.pRequest Got user-level KeeperException when processing sessionid:0x13bbb0658660003 type:delete cxid:0x7 zxid:0x1c txntype:-1 reqpath:n/a Error Path:/solr/live_nodes/127.0.0.1:11378_ Error:KeeperErrorCode = NoNode for /solr/live_nodes/127.0.0.1:11378_
[junit4:junit4]   2> 593 T810 oascc.SolrZkClient.makePath makePath: /live_nodes/127.0.0.1:11378_
[junit4:junit4]   2> 603 T810 oascc.SolrZkClient.makePath makePath: /overseer_elect/election
[junit4:junit4]   2> 617 T815 oazs.PrepRequestProcessor.pRequest Got user-level KeeperException when processing sessionid:0x13bbb0658660003 type:delete cxid:0x15 zxid:0x21 txntype:-1 reqpath:n/a Error Path:/solr/overseer_elect/leader Error:KeeperErrorCode = NoNode for /solr/overseer_elect/leader
[junit4:junit4]   2> 619 T810 oascc.SolrZkClient.makePath makePath: /overseer_elect/leader
[junit4:junit4]   2> 622 T810 oasc.Overseer.start Overseer (id=88870253591134211-127.0.0.1:11378_-n_0000000000) starting
[junit4:junit4]   2> 623 T815 oazs.PrepRequestProcessor.pRequest Got user-level KeeperException when processing sessionid:0x13bbb0658660003 type:create cxid:0x1a zxid:0x23 txntype:-1 reqpath:n/a Error Path:/solr/overseer Error:KeeperErrorCode = NodeExists for /solr/overseer
[junit4:junit4]   2> 630 T815 oazs.PrepRequestProcessor.pRequest Got user-level KeeperException when processing sessionid:0x13bbb0658660003 type:create cxid:0x1b zxid:0x24 txntype:-1 reqpath:n/a Error Path:/solr/overseer Error:KeeperErrorCode = NodeExists for /solr/overseer
[junit4:junit4]   2> 632 T815 oazs.PrepRequestProcessor.pRequest Got user-level KeeperException when processing sessionid:0x13bbb0658660003 type:create cxid:0x1c zxid:0x25 txntype:-1 reqpath:n/a Error Path:/solr/overseer Error:KeeperErrorCode = NodeExists for /solr/overseer
[junit4:junit4]   2> 634 T815 oazs.PrepRequestProcessor.pRequest Got user-level KeeperException when processing sessionid:0x13bbb0658660003 type:create cxid:0x1d zxid:0x26 txntype:-1 reqpath:n/a Error Path:/solr/overseer Error:KeeperErrorCode = NodeExists for /solr/overseer
[junit4:junit4]   2> 642 T834 oasc.OverseerCollectionProcessor.run Process current queue of collection messages
[junit4:junit4]   2> 643 T810 oascc.SolrZkClient.makePath makePath: /clusterstate.json
[junit4:junit4]   2> 646 T810 oascc.ZkStateReader.createClusterStateWatchersAndUpdate Updating cluster state from ZooKeeper... 
[junit4:junit4]   2> 648 T833 oasc.Overseer$ClusterStateUpdater.run Starting to work on the main queue
[junit4:junit4]   2> 653 T835 oasc.CoreContainer.create Creating SolrCore 'collection1' using instanceDir: /usr/home/hudson/hudson-slave/workspace/Lucene-Solr-Tests-4.x-java7/solr/build/solr-core/test/J0/./org.apache.solr.cloud.BasicDistributedZkTest-controljetty-1356052453777/collection1
[junit4:junit4]   2> 653 T835 oasc.ZkController.createCollectionZkNode Check for collection zkNode:control_collection
[junit4:junit4]   2> 654 T835 oasc.ZkController.createCollectionZkNode Collection zkNode exists
[junit4:junit4]   2> 654 T835 oasc.ZkController.readConfigName Load collection config from:/collections/control_collection
[junit4:junit4]   2> 656 T835 oasc.SolrResourceLoader.<init> new SolrResourceLoader for directory: '/usr/home/hudson/hudson-slave/workspace/Lucene-Solr-Tests-4.x-java7/solr/build/solr-core/test/J0/./org.apache.solr.cloud.BasicDistributedZkTest-controljetty-1356052453777/collection1/'
[junit4:junit4]   2> 656 T835 oasc.SolrResourceLoader.replaceClassLoader Adding 'file:/usr/home/hudson/hudson-slave/workspace/Lucene-Solr-Tests-4.x-java7/solr/build/solr-core/test/J0/org.apache.solr.cloud.BasicDistributedZkTest-controljetty-1356052453777/collection1/lib/README' to classloader
[junit4:junit4]   2> 657 T835 oasc.SolrResourceLoader.replaceClassLoader Adding 'file:/usr/home/hudson/hudson-slave/workspace/Lucene-Solr-Tests-4.x-java7/solr/build/solr-core/test/J0/org.apache.solr.cloud.BasicDistributedZkTest-controljetty-1356052453777/collection1/lib/classes/' to classloader
[junit4:junit4]   2> 705 T835 oasc.SolrConfig.<init> Using Lucene MatchVersion: LUCENE_41
[junit4:junit4]   2> 783 T835 oasc.SolrConfig.<init> Loaded SolrConfig: solrconfig.xml
[junit4:junit4]   2> 884 T835 oass.IndexSchema.readSchema Reading Solr Schema
[junit4:junit4]   2> 889 T835 oass.IndexSchema.readSchema Schema name=test
[junit4:junit4]   2> 1561 T835 oass.OpenExchangeRatesOrgProvider.init Initialized with rates=open-exchange-rates.json, refreshInterval=1440.
[junit4:junit4]   2> 1575 T835 oass.IndexSchema.readSchema default search field in schema is text
[junit4:junit4]   2> 1580 T835 oass.IndexSchema.readSchema unique key field: id
[junit4:junit4]   2> 1596 T835 oass.FileExchangeRateProvider.reload Reloading exchange rates from file currency.xml
[junit4:junit4]   2> 1602 T835 oass.FileExchangeRateProvider.reload Reloading exchange rates from file currency.xml
[junit4:junit4]   2> 1608 T835 oass.OpenExchangeRatesOrgProvider.reload Reloading exchange rates from open-exchange-rates.json
[junit4:junit4]   2> 1609 T835 oass.OpenExchangeRatesOrgProvider.reload Reloading exchange rates from open-exchange-rates.json
[junit4:junit4]   2> 1611 T835 oasc.SolrCore.<init> [collection1] Opening new SolrCore at /usr/home/hudson/hudson-slave/workspace/Lucene-Solr-Tests-4.x-java7/solr/build/solr-core/test/J0/./org.apache.solr.cloud.BasicDistributedZkTest-controljetty-1356052453777/collection1/, dataDir=./org.apache.solr.cloud.BasicDistributedZkTest-1356052453472/control/data/
[junit4:junit4]   2> 1611 T835 oasc.JmxMonitoredMap.<init> JMX monitoring is enabled. Adding Solr mbeans to JMX Server: com.sun.jmx.mbeanserver.JmxMBeanServer@5d8eaf0d
[junit4:junit4]   2> 1612 T835 oasc.SolrCore.initDirectoryFactory solr.StandardDirectoryFactory
[junit4:junit4]   2> 1663 T835 oasc.CachingDirectoryFactory.get return new directory for /usr/home/hudson/hudson-slave/workspace/Lucene-Solr-Tests-4.x-java7/solr/build/solr-core/test/J0/./org.apache.solr.cloud.BasicDistributedZkTest-1356052453472/control/data forceNew:false
[junit4:junit4]   2> 1664 T835 oasc.CachingDirectoryFactory.close Releasing directory:/usr/home/hudson/hudson-slave/workspace/Lucene-Solr-Tests-4.x-java7/solr/build/solr-core/test/J0/./org.apache.solr.cloud.BasicDistributedZkTest-1356052453472/control/data
[junit4:junit4]   2> 1664 T835 oasc.SolrCore.getNewIndexDir New index directory detected: old=null new=./org.apache.solr.cloud.BasicDistributedZkTest-1356052453472/control/data/index/
[junit4:junit4]   2> 1665 T835 oasc.SolrCore.initIndex WARNING [collection1] Solr index directory './org.apache.solr.cloud.BasicDistributedZkTest-1356052453472/control/data/index' doesn't exist. Creating new index...
[junit4:junit4]   2> 1667 T835 oasc.CachingDirectoryFactory.get return new directory for /usr/home/hudson/hudson-slave/workspace/Lucene-Solr-Tests-4.x-java7/solr/build/solr-core/test/J0/./org.apache.solr.cloud.BasicDistributedZkTest-1356052453472/control/data/index forceNew:false
[junit4:junit4]   2> 1673 T835 oasc.SolrDeletionPolicy.onCommit SolrDeletionPolicy.onCommit: commits:num=1
[junit4:junit4]   2> 		commit{dir=RateLimitedDirectoryWrapper(org.apache.lucene.store.NIOFSDirectory@/usr/home/hudson/hudson-slave/workspace/Lucene-Solr-Tests-4.x-java7/solr/build/solr-core/test/J0/org.apache.solr.cloud.BasicDistributedZkTest-1356052453472/control/data/index lockFactory=org.apache.lucene.store.NativeFSLockFactory@bf2e1e8),segFN=segments_1,generation=1,filenames=[segments_1]
[junit4:junit4]   2> 1673 T835 oasc.SolrDeletionPolicy.updateCommits newest commit = 1[segments_1]
[junit4:junit4]   2> 1674 T835 oasc.CachingDirectoryFactory.close Releasing directory:/usr/home/hudson/hudson-slave/workspace/Lucene-Solr-Tests-4.x-java7/solr/build/solr-core/test/J0/./org.apache.solr.cloud.BasicDistributedZkTest-1356052453472/control/data/index
[junit4:junit4]   2> 1674 T835 oasc.SolrCore.initWriters created xml: solr.XMLResponseWriter
[junit4:junit4]   2> 1676 T835 oasup.UpdateRequestProcessorChain.init inserting DistributedUpdateProcessorFactory into updateRequestProcessorChain "dedupe"
[junit4:junit4]   2> 1677 T835 oasup.UpdateRequestProcessorChain.init inserting DistributedUpdateProcessorFactory into updateRequestProcessorChain "dedupe-allfields"
[junit4:junit4]   2> 1677 T835 oasup.UpdateRequestProcessorChain.init inserting DistributedUpdateProcessorFactory into updateRequestProcessorChain "stored_sig"
[junit4:junit4]   2> 1678 T835 oasup.UpdateRequestProcessorChain.init inserting DistributedUpdateProcessorFactory into updateRequestProcessorChain "uniq-fields"
[junit4:junit4]   2> 1679 T835 oasup.UpdateRequestProcessorChain.init inserting DistributedUpdateProcessorFactory into updateRequestProcessorChain "distrib-dup-test-chain-implicit"
[junit4:junit4]   2> 1679 T835 oasc.RequestHandlers.initHandlersFromConfig adding lazy requestHandler: solr.ReplicationHandler
[junit4:junit4]   2> 1679 T835 oasc.RequestHandlers.initHandlersFromConfig created /replication: solr.ReplicationHandler
[junit4:junit4]   2> 1680 T835 oasc.RequestHandlers.initHandlersFromConfig created standard: solr.StandardRequestHandler
[junit4:junit4]   2> 1681 T835 oasc.RequestHandlers.initHandlersFromConfig created /get: solr.RealTimeGetHandler
[junit4:junit4]   2> 1683 T835 oasc.RequestHandlers.initHandlersFromConfig created dismax: solr.SearchHandler
[junit4:junit4]   2> 1684 T835 oasc.RequestHandlers.initHandlersFromConfig created mock: org.apache.solr.core.MockQuerySenderListenerReqHandler
[junit4:junit4]   2> 1684 T835 oasc.RequestHandlers.initHandlersFromConfig created /admin/: org.apache.solr.handler.admin.AdminHandlers
[junit4:junit4]   2> 1685 T835 oasc.RequestHandlers.initHandlersFromConfig created defaults: solr.StandardRequestHandler
[junit4:junit4]   2> 1685 T835 oasc.RequestHandlers.initHandlersFromConfig adding lazy requestHandler: solr.StandardRequestHandler
[junit4:junit4]   2> 1686 T835 oasc.RequestHandlers.initHandlersFromConfig created lazy: solr.StandardRequestHandler
[junit4:junit4]   2> 1687 T835 oasc.RequestHandlers.initHandlersFromConfig created /update: solr.UpdateRequestHandler
[junit4:junit4]   2> 1688 T835 oasc.RequestHandlers.initHandlersFromConfig created /terms: org.apache.solr.handler.component.SearchHandler
[junit4:junit4]   2> 1689 T835 oasc.RequestHandlers.initHandlersFromConfig created spellCheckCompRH: org.apache.solr.handler.component.SearchHandler
[junit4:junit4]   2> 1690 T835 oasc.RequestHandlers.initHandlersFromConfig created spellCheckCompRH_Direct: org.apache.solr.handler.component.SearchHandler
[junit4:junit4]   2> 1691 T835 oasc.RequestHandlers.initHandlersFromConfig created spellCheckWithWordbreak: org.apache.solr.handler.component.SearchHandler
[junit4:junit4]   2> 1692 T835 oasc.RequestHandlers.initHandlersFromConfig created spellCheckWithWordbreak_Direct: org.apache.solr.handler.component.SearchHandler
[junit4:junit4]   2> 1692 T835 oasc.RequestHandlers.initHandlersFromConfig created spellCheckCompRH1: org.apache.solr.handler.component.SearchHandler
[junit4:junit4]   2> 1693 T835 oasc.RequestHandlers.initHandlersFromConfig created mltrh: org.apache.solr.handler.component.SearchHandler
[junit4:junit4]   2> 1694 T835 oasc.RequestHandlers.initHandlersFromConfig created tvrh: org.apache.solr.handler.component.SearchHandler
[junit4:junit4]   2> 1695 T835 oasc.RequestHandlers.initHandlersFromConfig created /mlt: solr.MoreLikeThisHandler
[junit4:junit4]   2> 1696 T835 oasc.RequestHandlers.initHandlersFromConfig created /debug/dump: solr.DumpRequestHandler
[junit4:junit4]   2> 1713 T835 oashl.XMLLoader.init xsltCacheLifetimeSeconds=60
[junit4:junit4]   2> 1719 T835 oasc.SolrCore.initDeprecatedSupport WARNING solrconfig.xml uses deprecated <admin/gettableFiles>, Please update your config to use the ShowFileRequestHandler.
[junit4:junit4]   2> 1721 T835 oasc.SolrCore.initDeprecatedSupport WARNING adding ShowFileRequestHandler with hidden files: [SCHEMA.XML, OLD_SYNONYMS.TXT, STOPWORDS.TXT, PROTWORDS.TXT, OPEN-EXCHANGE-RATES.JSON, SYNONYMS.TXT, CURRENCY.XML, MAPPING-ISOLATIN1ACCENT.TXT]
[junit4:junit4]   2> 1724 T835 oasc.CachingDirectoryFactory.close Releasing directory:/usr/home/hudson/hudson-slave/workspace/Lucene-Solr-Tests-4.x-java7/solr/build/solr-core/test/J0/./org.apache.solr.cloud.BasicDistributedZkTest-1356052453472/control/data
[junit4:junit4]   2> 1726 T835 oass.SolrIndexSearcher.<init> Opening Searcher@32fba346 main
[junit4:junit4]   2> 1727 T835 oasu.CommitTracker.<init> Hard AutoCommit: disabled
[junit4:junit4]   2> 1727 T835 oasu.CommitTracker.<init> Soft AutoCommit: disabled
[junit4:junit4]   2> 1728 T835 oashc.SpellCheckComponent.inform Initializing spell checkers
[junit4:junit4]   2> 1737 T835 oass.DirectSolrSpellChecker.init init: {name=direct,classname=DirectSolrSpellChecker,field=lowerfilt,minQueryLength=3}
[junit4:junit4]   2> 1779 T836 oasc.SolrCore.registerSearcher [collection1] Registered new searcher Searcher@32fba346 main{StandardDirectoryReader(segments_1:1)}
[junit4:junit4]   2> 1784 T835 oasc.ZkController.publish publishing core=collection1 state=down
[junit4:junit4]   2> 1784 T835 oasc.ZkController.publish numShards not found on descriptor - reading it from system property
[junit4:junit4]   2> 1785 T815 oazs.PrepRequestProcessor.pRequest Got user-level KeeperException when processing sessionid:0x13bbb0658660003 type:create cxid:0x56 zxid:0x29 txntype:-1 reqpath:n/a Error Path:/solr/overseer/queue Error:KeeperErrorCode = NoNode for /solr/overseer/queue
[junit4:junit4]   2> 2185 T833 oascc.ZkStateReader.updateClusterState Updating cloud state from ZooKeeper... 
[junit4:junit4]   2> 2186 T833 oasc.Overseer$ClusterStateUpdater.updateState Update state numShards=1 message={
[junit4:junit4]   2> 	  "operation":"state",
[junit4:junit4]   2> 	  "numShards":"1",
[junit4:junit4]   2> 	  "shard":null,
[junit4:junit4]   2> 	  "roles":null,
[junit4:junit4]   2> 	  "state":"down",
[junit4:junit4]   2> 	  "core":"collection1",
[junit4:junit4]   2> 	  "collection":"control_collection",
[junit4:junit4]   2> 	  "node_name":"127.0.0.1:11378_",
[junit4:junit4]   2> 	  "base_url":"http://127.0.0.1:11378"}
[junit4:junit4]   2> 2186 T833 oasc.Overseer$ClusterStateUpdater.createCollection Create collection control_collection with numShards 1
[junit4:junit4]   2> 2186 T833 oasc.Overseer$ClusterStateUpdater.updateState Assigning new node to shard shard=shard1
[junit4:junit4]   2> 2187 T815 oazs.PrepRequestProcessor.pRequest Got user-level KeeperException when processing sessionid:0x13bbb0658660003 type:create cxid:0x5e zxid:0x2c txntype:-1 reqpath:n/a Error Path:/solr/overseer/queue-work Error:KeeperErrorCode = NoNode for /solr/overseer/queue-work
[junit4:junit4]   2> 2208 T832 oascc.ZkStateReader$2.process A cluster state change: WatchedEvent state:SyncConnected type:NodeDataChanged path:/clusterstate.json, has occurred - updating... (live nodes size: 1)
[junit4:junit4]   2> 2789 T835 oasc.CoreContainer.registerCore registering core: collection1
[junit4:junit4]   2> 2789 T835 oasc.ZkController.register Register replica - core:collection1 address:http://127.0.0.1:11378 collection:control_collection shard:shard1
[junit4:junit4]   2> 2790 T835 oascc.SolrZkClient.makePath makePath: /collections/control_collection/leader_elect/shard1/election
[junit4:junit4]   2> 2808 T815 oazs.PrepRequestProcessor.pRequest Got user-level KeeperException when processing sessionid:0x13bbb0658660003 type:delete cxid:0x7b zxid:0x36 txntype:-1 reqpath:n/a Error Path:/solr/collections/control_collection/leaders Error:KeeperErrorCode = NoNode for /solr/collections/control_collection/leaders
[junit4:junit4]   2> 2809 T835 oasc.ShardLeaderElectionContext.runLeaderProcess Running the leader process.
[junit4:junit4]   2> 2810 T815 oazs.PrepRequestProcessor.pRequest Got user-level KeeperException when processing sessionid:0x13bbb0658660003 type:create cxid:0x7c zxid:0x37 txntype:-1 reqpath:n/a Error Path:/solr/overseer Error:KeeperErrorCode = NodeExists for /solr/overseer
[junit4:junit4]   2> 2821 T835 oasc.ShardLeaderElectionContext.waitForReplicasToComeUp Enough replicas found to continue.
[junit4:junit4]   2> 2822 T835 oasc.ShardLeaderElectionContext.runLeaderProcess I may be the new leader - try and sync
[junit4:junit4]   2> 2822 T835 oasc.SyncStrategy.sync Sync replicas to http://127.0.0.1:11378/collection1/
[junit4:junit4]   2> 2822 T835 oasc.SyncStrategy.syncReplicas Sync Success - now sync replicas to me
[junit4:junit4]   2> 2822 T835 oasc.SyncStrategy.syncToMe http://127.0.0.1:11378/collection1/ has no replicas
[junit4:junit4]   2> 2823 T835 oasc.ShardLeaderElectionContext.runLeaderProcess I am the new leader: http://127.0.0.1:11378/collection1/
[junit4:junit4]   2> 2823 T835 oascc.SolrZkClient.makePath makePath: /collections/control_collection/leaders/shard1
[junit4:junit4]   2> 2827 T815 oazs.PrepRequestProcessor.pRequest Got user-level KeeperException when processing sessionid:0x13bbb0658660003 type:create cxid:0x86 zxid:0x3b txntype:-1 reqpath:n/a Error Path:/solr/overseer Error:KeeperErrorCode = NodeExists for /solr/overseer
[junit4:junit4]   2> 3215 T833 oascc.ZkStateReader.updateClusterState Updating cloud state from ZooKeeper... 
[junit4:junit4]   2> 3241 T832 oascc.ZkStateReader$2.process A cluster state change: WatchedEvent state:SyncConnected type:NodeDataChanged path:/clusterstate.json, has occurred - updating... (live nodes size: 1)
[junit4:junit4]   2> 3296 T835 oasc.ZkController.register We are http://127.0.0.1:11378/collection1/ and leader is http://127.0.0.1:11378/collection1/
[junit4:junit4]   2> 3296 T835 oasc.ZkController.register No LogReplay needed for core=collection1 baseURL=http://127.0.0.1:11378
[junit4:junit4]   2> 3296 T835 oasc.ZkController.checkRecovery I am the leader, no recovery necessary
[junit4:junit4]   2> 3297 T835 oasc.ZkController.publish publishing core=collection1 state=active
[junit4:junit4]   2> 3297 T835 oasc.ZkController.publish numShards not found on descriptor - reading it from system property
[junit4:junit4]   2> 3299 T835 oascc.ZkStateReader.updateClusterState Updating cloud state from ZooKeeper... 
[junit4:junit4]   2> 3299 T810 oass.SolrDispatchFilter.init user.dir=/usr/home/hudson/hudson-slave/workspace/Lucene-Solr-Tests-4.x-java7/solr/build/solr-core/test/J0
[junit4:junit4]   2> 3300 T810 oass.SolrDispatchFilter.init SolrDispatchFilter.init() done
[junit4:junit4]   2> 3301 T810 oascsi.HttpClientUtil.createClient Creating new http client, config:maxConnections=128&maxConnectionsPerHost=32&followRedirects=false
[junit4:junit4]   2> 3313 T810 oascsi.HttpClientUtil.createClient Creating new http client, config:
[junit4:junit4]   2> 3321 T810 oaz.ZooKeeper.<init> Initiating client connection, connectString=127.0.0.1:11375/solr sessionTimeout=10000 watcher=org.apache.solr.common.cloud.ConnectionManager@2bffd36a
[junit4:junit4]   2> 3322 T810 oascc.ConnectionManager.waitForConnected Waiting for client to connect to ZooKeeper
[junit4:junit4]   2> 3322 T837 oaz.ClientCnxn$SendThread.logStartConnect Opening socket connection to server localhost/127.0.0.1:11375. Will not attempt to authenticate using SASL (access denied ("javax.security.auth.AuthPermission" "getLoginConfiguration"))
[junit4:junit4]   2> 3323 T837 oaz.ClientCnxn$SendThread.primeConnection Socket connection established to localhost/127.0.0.1:11375, initiating session
[junit4:junit4]   2> 3323 T812 oazs.NIOServerCnxnFactory.run Accepted socket connection from /140.211.11.196:11381
[junit4:junit4]   2> 3323 T812 oazs.ZooKeeperServer.processConnectRequest Client attempting to establish new session at /140.211.11.196:11381
[junit4:junit4]   2> 3325 T814 oazs.ZooKeeperServer.finishSessionInit Established session 0x13bbb0658660004 with negotiated timeout 10000 for client /140.211.11.196:11381
[junit4:junit4]   2> 3325 T837 oaz.ClientCnxn$SendThread.onConnected Session establishment complete on server localhost/127.0.0.1:11375, sessionid = 0x13bbb0658660004, negotiated timeout = 10000
[junit4:junit4]   2> 3325 T838 oascc.ConnectionManager.process Watcher org.apache.solr.common.cloud.ConnectionManager@2bffd36a name:ZooKeeperConnection Watcher:127.0.0.1:11375/solr got event WatchedEvent state:SyncConnected type:None path:null path:null type:None
[junit4:junit4]   2> 3325 T810 oascc.ConnectionManager.waitForConnected Client is connected to ZooKeeper
[junit4:junit4]   2> 3326 T810 oascc.ZkStateReader.createClusterStateWatchersAndUpdate Updating cluster state from ZooKeeper... 
[junit4:junit4]   2> 3328 T810 oasc.ChaosMonkey.monkeyLog monkey: init - expire sessions:true cause connection loss:true
[junit4:junit4]   2> 3453 T810 oejs.Server.doStart jetty-8.1.8.v20121106
[junit4:junit4]   2> 3456 T810 oejs.AbstractConnector.doStart Started SocketConnector@127.0.0.1:11382
[junit4:junit4]   2> 3457 T810 oasc.SolrResourceLoader.locateSolrHome JNDI not configured for solr (NoInitialContextEx)
[junit4:junit4]   2> 3458 T810 oasc.SolrResourceLoader.locateSolrHome using system property solr.solr.home: /usr/home/hudson/hudson-slave/workspace/Lucene-Solr-Tests-4.x-java7/solr/build/solr-core/test/J0/./org.apache.solr.cloud.BasicDistributedZkTest-jetty1-1356052456795
[junit4:junit4]   2> 3458 T810 oasc.SolrResourceLoader.<init> new SolrResourceLoader for deduced Solr Home: '/usr/home/hudson/hudson-slave/workspace/Lucene-Solr-Tests-4.x-java7/solr/build/solr-core/test/J0/./org.apache.solr.cloud.BasicDistributedZkTest-jetty1-1356052456795/'
[junit4:junit4]   2> 3501 T810 oass.SolrDispatchFilter.init SolrDispatchFilter.init()
[junit4:junit4]   2> 3502 T810 oasc.SolrResourceLoader.locateSolrHome JNDI not configured for solr (NoInitialContextEx)
[junit4:junit4]   2> 3502 T810 oasc.SolrResourceLoader.locateSolrHome using system property solr.solr.home: /usr/home/hudson/hudson-slave/workspace/Lucene-Solr-Tests-4.x-java7/solr/build/solr-core/test/J0/./org.apache.solr.cloud.BasicDistributedZkTest-jetty1-1356052456795
[junit4:junit4]   2> 3502 T810 oasc.CoreContainer$Initializer.initialize looking for solr.xml: /usr/home/hudson/hudson-slave/workspace/Lucene-Solr-Tests-4.x-java7/solr/build/solr-core/test/J0/./org.apache.solr.cloud.BasicDistributedZkTest-jetty1-1356052456795/solr.xml
[junit4:junit4]   2> 3503 T810 oasc.CoreContainer.<init> New CoreContainer 1441392346
[junit4:junit4]   2> 3503 T810 oasc.CoreContainer.load Loading CoreContainer using Solr Home: '/usr/home/hudson/hudson-slave/workspace/Lucene-Solr-Tests-4.x-java7/solr/build/solr-core/test/J0/./org.apache.solr.cloud.BasicDistributedZkTest-jetty1-1356052456795/'
[junit4:junit4]   2> 3504 T810 oasc.SolrResourceLoader.<init> new SolrResourceLoader for directory: '/usr/home/hudson/hudson-slave/workspace/Lucene-Solr-Tests-4.x-java7/solr/build/solr-core/test/J0/./org.apache.solr.cloud.BasicDistributedZkTest-jetty1-1356052456795/'
[junit4:junit4]   2> 3529 T810 oashc.HttpShardHandlerFactory.getParameter Setting socketTimeout to: 30000
[junit4:junit4]   2> 3529 T810 oashc.HttpShardHandlerFactory.getParameter Setting urlScheme to: http://
[junit4:junit4]   2> 3530 T810 oashc.HttpShardHandlerFactory.getParameter Setting connTimeout to: 15000
[junit4:junit4]   2> 3530 T810 oashc.HttpShardHandlerFactory.getParameter Setting maxConnectionsPerHost to: 20
[junit4:junit4]   2> 3531 T810 oashc.HttpShardHandlerFactory.getParameter Setting corePoolSize to: 0
[junit4:junit4]   2> 3531 T810 oashc.HttpShardHandlerFactory.getParameter Setting maximumPoolSize to: 2147483647
[junit4:junit4]   2> 3531 T810 oashc.HttpShardHandlerFactory.getParameter Setting maxThreadIdleTime to: 5
[junit4:junit4]   2> 3532 T810 oashc.HttpShardHandlerFactory.getParameter Setting sizeOfQueue to: -1
[junit4:junit4]   2> 3532 T810 oashc.HttpShardHandlerFactory.getParameter Setting fairnessPolicy to: false
[junit4:junit4]   2> 3533 T810 oascsi.HttpClientUtil.createClient Creating new http client, config:maxConnectionsPerHost=20&maxConnections=10000&socketTimeout=30000&connTimeout=15000&retry=false
[junit4:junit4]   2> 3549 T810 oasc.CoreContainer.load Registering Log Listener
[junit4:junit4]   2> 3566 T810 oasc.CoreContainer.initZooKeeper Zookeeper client=127.0.0.1:11375/solr
[junit4:junit4]   2> 3566 T810 oasc.ZkController.checkChrootPath zkHost includes chroot
[junit4:junit4]   2> 3567 T810 oaz.ZooKeeper.<init> Initiating client connection, connectString=127.0.0.1:11375 sessionTimeout=60000 watcher=org.apache.solr.common.cloud.ConnectionManager@5766fea4
[junit4:junit4]   2> 3568 T810 oascc.ConnectionManager.waitForConnected Waiting for client to connect to ZooKeeper
[junit4:junit4]   2> 3568 T848 oaz.ClientCnxn$SendThread.logStartConnect Opening socket connection to server localhost/127.0.0.1:11375. Will not attempt to authenticate using SASL (access denied ("javax.security.auth.AuthPermission" "getLoginConfiguration"))
[junit4:junit4]   2> 3569 T848 oaz.ClientCnxn$SendThread.primeConnection Socket connection established to localhost/127.0.0.1:11375, initiating session
[junit4:junit4]   2> 3569 T812 oazs.NIOServerCnxnFactory.run Accepted socket connection from /140.211.11.196:11383
[junit4:junit4]   2> 3569 T812 oazs.ZooKeeperServer.processConnectRequest Client attempting to establish new session at /140.211.11.196:11383
[junit4:junit4]   2> 3571 T814 oazs.ZooKeeperServer.finishSessionInit Established session 0x13bbb0658660005 with negotiated timeout 20000 for client /140.211.11.196:11383
[junit4:junit4]   2> 3571 T848 oaz.ClientCnxn$SendThread.onConnected Session establishment complete on server localhost/127.0.0.1:11375, sessionid = 0x13bbb0658660005, negotiated timeout = 20000
[junit4:junit4]   2> 3571 T849 oascc.ConnectionManager.process Watcher org.apache.solr.common.cloud.ConnectionManager@5766fea4 name:ZooKeeperConnection Watcher:127.0.0.1:11375 got event WatchedEvent state:SyncConnected type:None path:null path:null type:None
[junit4:junit4]   2> 3572 T810 oascc.ConnectionManager.waitForConnected Client is connected to ZooKeeper
[junit4:junit4]   2> 3573 T815 oazs.PrepRequestProcessor.pRequest2Txn Processed session termination for sessionid: 0x13bbb0658660005
[junit4:junit4]   2> 3581 T849 oaz.ClientCnxn$EventThread.run EventThread shut down
[junit4:junit4]   2> 3581 T812 oazs.NIOServerCnxn.closeSock Closed socket connection for client /140.211.11.196:11383 which had sessionid 0x13bbb0658660005
[junit4:junit4]   2> 3581 T810 oaz.ZooKeeper.close Session: 0x13bbb0658660005 closed
[junit4:junit4]   2> 3582 T810 oascsi.HttpClientUtil.createClient Creating new http client, config:maxConnections=500&maxConnectionsPerHost=16&socketTimeout=15000&connTimeout=30000
[junit4:junit4]   2> 3591 T810 oaz.ZooKeeper.<init> Initiating client connection, connectString=127.0.0.1:11375/solr sessionTimeout=30000 watcher=org.apache.solr.common.cloud.ConnectionManager@75b6ecb9
[junit4:junit4]   2> 3592 T810 oascc.ConnectionManager.waitForConnected Waiting for client to connect to ZooKeeper
[junit4:junit4]   2> 3593 T850 oaz.ClientCnxn$SendThread.logStartConnect Opening socket connection to server localhost/127.0.0.1:11375. Will not attempt to authenticate using SASL (access denied ("javax.security.auth.AuthPermission" "getLoginConfiguration"))
[junit4:junit4]   2> 3593 T850 oaz.ClientCnxn$SendThread.primeConnection Socket connection established to localhost/127.0.0.1:11375, initiating session
[junit4:junit4]   2> 3594 T812 oazs.NIOServerCnxnFactory.run Accepted socket connection from /140.211.11.196:11384
[junit4:junit4]   2> 3594 T812 oazs.ZooKeeperServer.processConnectRequest Client attempting to establish new session at /140.211.11.196:11384
[junit4:junit4]   2> 3595 T814 oazs.ZooKeeperServer.finishSessionInit Established session 0x13bbb0658660006 with negotiated timeout 20000 for client /140.211.11.196:11384
[junit4:junit4]   2> 3595 T850 oaz.ClientCnxn$SendThread.onConnected Session establishment complete on server localhost/127.0.0.1:11375, sessionid = 0x13bbb0658660006, negotiated timeout = 20000
[junit4:junit4]   2> 3596 T851 oascc.ConnectionManager.process Watcher org.apache.solr.common.cloud.ConnectionManager@75b6ecb9 name:ZooKeeperConnection Watcher:127.0.0.1:11375/solr got event WatchedEvent state:SyncConnected type:None path:null path:null type:None
[junit4:junit4]   2> 3596 T810 oascc.ConnectionManager.waitForConnected Client is connected to ZooKeeper
[junit4:junit4]   2> 3597 T815 oazs.PrepRequestProcessor.pRequest Got user-level KeeperException when processing sessionid:0x13bbb0658660006 type:create cxid:0x1 zxid:0x49 txntype:-1 reqpath:n/a Error Path:/solr/overseer Error:KeeperErrorCode = NodeExists for /solr/overseer
[junit4:junit4]   2> 3598 T815 oazs.PrepRequestProcessor.pRequest Got user-level KeeperException when processing sessionid:0x13bbb0658660006 type:create cxid:0x2 zxid:0x4a txntype:-1 reqpath:n/a Error Path:/solr/overseer Error:KeeperErrorCode = NodeExists for /solr/overseer
[junit4:junit4]   2> 3606 T810 oasc.ZkController.createEphemeralLiveNode Register node as live in ZooKeeper:/live_nodes/127.0.0.1:11382_
[junit4:junit4]   2> 3606 T815 oazs.PrepRequestProcessor.pRequest Got user-level KeeperException when processing sessionid:0x13bbb0658660006 type:delete cxid:0x4 zxid:0x4b txntype:-1 reqpath:n/a Error Path:/solr/live_nodes/127.0.0.1:11382_ Error:KeeperErrorCode = NoNode for /solr/live_nodes/127.0.0.1:11382_
[junit4:junit4]   2> 3607 T810 oascc.SolrZkClient.makePath makePath: /live_nodes/127.0.0.1:11382_
[junit4:junit4]   2> 3610 T832 oascc.ZkStateReader$3.process Updating live nodes... (2)
[junit4:junit4]   2> 3611 T838 oascc.ZkStateReader$3.process Updating live nodes... (2)
[junit4:junit4]   2> 3611 T832 oascc.ZkStateReader$2.process A cluster state change: WatchedEvent state:SyncConnected type:NodeChildrenChanged path:/live_nodes, has occurred - updating... (live nodes size: 2)
[junit4:junit4]   2> 3613 T810 oascc.ZkStateReader.createClusterStateWatchersAndUpdate Updating cluster state from ZooKeeper... 
[junit4:junit4]   2> 3620 T852 oasc.CoreContainer.create Creating SolrCore 'collection1' using instanceDir: /usr/home/hudson/hudson-slave/workspace/Lucene-Solr-Tests-4.x-java7/solr/build/solr-core/test/J0/./org.apache.solr.cloud.BasicDistributedZkTest-jetty1-1356052456795/collection1
[junit4:junit4]   2> 3620 T852 oasc.ZkController.createCollectionZkNode Check for collection zkNode:collection1
[junit4:junit4]   2> 3621 T852 oasc.ZkController.createCollectionZkNode Collection zkNode exists
[junit4:junit4]   2> 3621 T852 oasc.ZkController.readConfigName Load collection config from:/collections/collection1
[junit4:junit4]   2> 3622 T852 oasc.SolrResourceLoader.<init> new SolrResourceLoader for directory: '/usr/home/hudson/hudson-slave/workspace/Lucene-Solr-Tests-4.x-java7/solr/build/solr-core/test/J0/./org.apache.solr.cloud.BasicDistributedZkTest-jetty1-1356052456795/collection1/'
[junit4:junit4]   2> 3623 T852 oasc.SolrResourceLoader.replaceClassLoader Adding 'file:/usr/home/hudson/hudson-slave/workspace/Lucene-Solr-Tests-4.x-java7/solr/build/solr-core/test/J0/org.apache.solr.cloud.BasicDistributedZkTest-jetty1-1356052456795/collection1/lib/classes/' to classloader
[junit4:junit4]   2> 3624 T852 oasc.SolrResourceLoader.replaceClassLoader Adding 'file:/usr/home/hudson/hudson-slave/workspace/Lucene-Solr-Tests-4.x-java7/solr/build/solr-core/test/J0/org.apache.solr.cloud.BasicDistributedZkTest-jetty1-1356052456795/collection1/lib/README' to classloader
[junit4:junit4]   2> 3669 T852 oasc.SolrConfig.<init> Using Lucene MatchVersion: LUCENE_41
[junit4:junit4]   2> 3747 T852 oasc.SolrConfig.<init> Loaded SolrConfig: solrconfig.xml
[junit4:junit4]   2> 3756 T833 oascc.ZkStateReader.updateClusterState Updating cloud state from ZooKeeper... 
[junit4:junit4]   2> 3757 T833 oasc.Overseer$ClusterStateUpdater.updateState Update state numShards=1 message={
[junit4:junit4]   2> 	  "operation":"state",
[junit4:junit4]   2> 	  "numShards":"1",
[junit4:junit4]   2> 	  "shard":"shard1",
[junit4:junit4]   2> 	  "roles":null,
[junit4:junit4]   2> 	  "state":"active",
[junit4:junit4]   2> 	  "core":"collection1",
[junit4:junit4]   2> 	  "collection":"control_collection",
[junit4:junit4]   2> 	  "node_name":"127.0.0.1:11378_",
[junit4:junit4]   2> 	  "base_url":"http://127.0.0.1:11378"}
[junit4:junit4]   2> 3769 T832 oascc.ZkStateReader$2.process A cluster state change: WatchedEvent state:SyncConnected type:NodeDataChanged path:/clusterstate.json, has occurred - updating... (live nodes size: 2)
[junit4:junit4]   2> 3769 T838 oascc.ZkStateReader$2.process A cluster state change: WatchedEvent state:SyncConnected type:NodeDataChanged path:/clusterstate.json, has occurred - updating... (live nodes size: 2)
[junit4:junit4]   2> 3849 T852 oass.IndexSchema.readSchema Reading Solr Schema
[junit4:junit4]   2> 3849 T851 oascc.ZkStateReader$2.process A cluster state change: WatchedEvent state:SyncConnected type:NodeDataChanged path:/clusterstate.json, has occurred - updating... (live nodes size: 2)
[junit4:junit4]   2> 3856 T852 oass.IndexSchema.readSchema Schema name=test
[junit4:junit4]   2> 4583 T852 oass.OpenExchangeRatesOrgProvider.init Initialized with rates=open-exchange-rates.json, refreshInterval=1440.
[junit4:junit4]   2> 4596 T852 oass.IndexSchema.readSchema default search field in schema is text
[junit4:junit4]   2> 4601 T852 oass.IndexSchema.readSchema unique key field: id
[junit4:junit4]   2> 4619 T852 oass.FileExchangeRateProvider.reload Reloading exchange rates from file currency.xml
[junit4:junit4]   2> 4624 T852 oass.FileExchangeRateProvider.reload Reloading exchange rates from file currency.xml
[junit4:junit4]   2> 4630 T852 oass.OpenExchangeRatesOrgProvider.reload Reloading exchange rates from open-exchange-rates.json
[junit4:junit4]   2> 4632 T852 oass.OpenExchangeRatesOrgProvider.reload Reloading exchange rates from open-exchange-rates.json
[junit4:junit4]   2> 4634 T852 oasc.SolrCore.<init> [collection1] Opening new SolrCore at /usr/home/hudson/hudson-slave/workspace/Lucene-Solr-Tests-4.x-java7/solr/build/solr-core/test/J0/./org.apache.solr.cloud.BasicDistributedZkTest-jetty1-1356052456795/collection1/, dataDir=./org.apache.solr.cloud.BasicDistributedZkTest-1356052453472/jetty1/
[junit4:junit4]   2> 4635 T852 oasc.JmxMonitoredMap.<init> JMX monitoring is enabled. Adding Solr mbeans to JMX Server: com.sun.jmx.mbeanserver.JmxMBeanServer@5d8eaf0d
[junit4:junit4]   2> 4636 T852 oasc.SolrCore.initDirectoryFactory solr.StandardDirectoryFactory
[junit4:junit4]   2> 4637 T852 oasc.CachingDirectoryFactory.get return new directory for /usr/home/hudson/hudson-slave/workspace/Lucene-Solr-Tests-4.x-java7/solr/build/solr-core/test/J0/./org.apache.solr.cloud.BasicDistributedZkTest-1356052453472/jetty1 forceNew:false
[junit4:junit4]   2> 4639 T852 oasc.CachingDirectoryFactory.close Releasing directory:/usr/home/hudson/hudson-slave/workspace/Lucene-Solr-Tests-4.x-java7/solr/build/solr-core/test/J0/./org.apache.solr.cloud.BasicDistributedZkTest-1356052453472/jetty1
[junit4:junit4]   2> 4639 T852 oasc.SolrCore.getNewIndexDir New index directory detected: old=null new=./org.apache.solr.cloud.BasicDistributedZkTest-1356052453472/jetty1/index/
[junit4:junit4]   2> 4640 T852 oasc.SolrCore.initIndex WARNING [collection1] Solr index directory './org.apache.solr.cloud.BasicDistributedZkTest-1356052453472/jetty1/index' doesn't exist. Creating new index...
[junit4:junit4]   2> 4642 T852 oasc.CachingDirectoryFactory.get return new directory for /usr/home/hudson/hudson-slave/workspace/Lucene-Solr-Tests-4.x-java7/solr/build/solr-core/test/J0/./org.apache.solr.cloud.BasicDistributedZkTest-1356052453472/jetty1/index forceNew:false
[junit4:junit4]   2> 4675 T852 oasc.SolrDeletionPolicy.onCommit SolrDeletionPolicy.onCommit: commits:num=1
[junit4:junit4]   2> 		commit{dir=RateLimitedDirectoryWrapper(org.apache.lucene.store.NIOFSDirectory@/usr/home/hudson/hudson-slave/workspace/Lucene-Solr-Tests-4.x-java7/solr/build/solr-core/test/J0/org.apache.solr.cloud.BasicDistributedZkTest-1356052453472/jetty1/index lockFactory=org.apache.lucene.store.NativeFSLockFactory@32458608),segFN=segments_1,generation=1,filenames=[segments_1]
[junit4:junit4]   2> 4676 T852 oasc.SolrDeletionPolicy.updateCommits newest commit = 1[segments_1]
[junit4:junit4]   2> 4676 T852 oasc.CachingDirectoryFactory.close Releasing directory:/usr/home/hudson/hudson-slave/workspace/Lucene-Solr-Tests-4.x-java7/solr/build/solr-core/test/J0/./org.apache.solr.cloud.BasicDistributedZkTest-1356052453472/jetty1/index
[junit4:junit4]   2> 4677 T852 oasc.SolrCore.initWriters created xml: solr.XMLResponseWriter
[junit4:junit4]   2> 4679 T852 oasup.UpdateRequestProcessorChain.init inserting DistributedUpdateProcessorFactory into updateRequestProcessorChain "dedupe"
[junit4:junit4]   2> 4680 T852 oasup.UpdateRequestProcessorChain.init inserting DistributedUpdateProcessorFactory into updateRequestProcessorChain "dedupe-allfields"
[junit4:junit4]   2> 4680 T852 oasup.UpdateRequestProcessorChain.init inserting DistributedUpdateProcessorFactory into updateRequestProcessorChain "stored_sig"
[junit4:junit4]   2> 4681 T852 oasup.UpdateRequestProcessorChain.init inserting DistributedUpdateProcessorFactory into updateRequestProcessorChain "uniq-fields"
[junit4:junit4]   2> 4681 T852 oasup.UpdateRequestProcessorChain.init inserting DistributedUpdateProcessorFactory into updateRequestProcessorChain "distrib-dup-test-chain-implicit"
[junit4:junit4]   2> 4682 T852 oasc.RequestHandlers.initHandlersFromConfig adding lazy requestHandler: solr.ReplicationHandler
[junit4:junit4]   2> 4682 T852 oasc.RequestHandlers.initHandlersFromConfig created /replication: solr.ReplicationHandler
[junit4:junit4]   2> 4683 T852 oasc.RequestHandlers.initHandlersFromConfig created standard: solr.StandardRequestHandler
[junit4:junit4]   2> 4685 T852 oasc.RequestHandlers.initHandlersFromConfig created /get: solr.RealTimeGetHandler
[junit4:junit4]   2> 4686 T852 oasc.RequestHandlers.initHandlersFromConfig created dismax: solr.SearchHandler
[junit4:junit4]   2> 4687 T852 oasc.RequestHandlers.initHandlersFromConfig created mock: org.apache.solr.core.MockQuerySenderListenerReqHandler
[junit4:junit4]   2> 4688 T852 oasc.RequestHandlers.initHandlersFromConfig created /admin/: org.apache.solr.handler.admin.AdminHandlers
[junit4:junit4]   2> 4689 T852 oasc.RequestHandlers.initHandlersFromConfig created defaults: solr.StandardRequestHandler
[junit4:junit4]   2> 4689 T852 oasc.RequestHandlers.initHandlersFromConfig adding lazy requestHandler: solr.StandardRequestHandler
[junit4:junit4]   2> 4690 T852 oasc.RequestHandlers.initHandlersFromConfig created lazy: solr.StandardRequestHandler
[junit4:junit4]   2> 4691 T852 oasc.RequestHandlers.initHandlersFromConfig created /update: solr.UpdateRequestHandler
[junit4:junit4]   2> 4692 T852 oasc.RequestHandlers.initHandlersFromConfig created /terms: org.apache.solr.handler.component.SearchHandler
[junit4:junit4]   2> 4693 T852 oasc.RequestHandlers.initHandlersFromConfig created spellCheckCompRH: org.apache.solr.handler.component.SearchHandler
[junit4:junit4]   2> 4694 T852 oasc.RequestHandlers.initHandlersFromConfig created spellCheckCompRH_Direct: org.apache.solr.handler.component.SearchHandler
[junit4:junit4]   2> 4695 T852 oasc.RequestHandlers.initHandlersFromConfig created spellCheckWithWordbreak: org.apache.solr.handler.component.SearchHandler
[junit4:junit4]   2> 4697 T852 oasc.RequestHandlers.initHandlersFromConfig created spellCheckWithWordbreak_Direct: org.apache.solr.handler.component.SearchHandler
[junit4:junit4]   2> 4698 T852 oasc.RequestHandlers.initHandlersFromConfig created spellCheckCompRH1: org.apache.solr.handler.component.SearchHandler
[junit4:junit4]   2> 4699 T852 oasc.RequestHandlers.initHandlersFromConfig created mltrh: org.apache.solr.handler.component.SearchHandler
[junit4:junit4]   2> 4700 T852 oasc.RequestHandlers.initHandlersFromConfig created tvrh: org.apache.solr.handler.component.SearchHandler
[junit4:junit4]   2> 4701 T852 oasc.RequestHandlers.initHandlersFromConfig created /mlt: solr.MoreLikeThisHandler
[junit4:junit4]   2> 4702 T852 oasc.RequestHandlers.initHandlersFromConfig created /debug/dump: solr.DumpRequestHandler
[junit4:junit4]   2> 4718 T852 oashl.XMLLoader.init xsltCacheLifetimeSeconds=60
[junit4:junit4]   2> 4724 T852 oasc.SolrCore.initDeprecatedSupport WARNING solrconfig.xml uses deprecated <admin/gettableFiles>, Please update your config to use the ShowFileRequestHandler.
[junit4:junit4]   2> 4726 T852 oasc.SolrCore.initDeprecatedSupport WARNING adding ShowFileRequestHandler with hidden files: [SCHEMA.XML, OLD_SYNONYMS.TXT, STOPWORDS.TXT, PROTWORDS.TXT, OPEN-EXCHANGE-RATES.JSON, SYNONYMS.TXT, CURRENCY.XML, MAPPING-ISOLATIN1ACCENT.TXT]
[junit4:junit4]   2> 4729 T852 oasc.CachingDirectoryFactory.close Releasing directory:/usr/home/hudson/hudson-slave/workspace/Lucene-Solr-Tests-4.x-java7/solr/build/solr-core/test/J0/./org.apache.solr.cloud.BasicDistributedZkTest-1356052453472/jetty1
[junit4:junit4]   2> 4731 T852 oass.SolrIndexSearcher.<init> Opening Searcher@c6098b1 main
[junit4:junit4]   2> 4732 T852 oasu.CommitTracker.<init> Hard AutoCommit: disabled
[junit4:junit4]   2> 4732 T852 oasu.CommitTracker.<init> Soft AutoCommit: disabled
[junit4:junit4]   2> 4733 T852 oashc.SpellCheckComponent.inform Initializing spell checkers
[junit4:junit4]   2> 4741 T852 oass.DirectSolrSpellChecker.init init: {name=direct,classname=DirectSolrSpellChecker,field=lowerfilt,minQueryLength=3}
[junit4:junit4]   2> 4800 T853 oasc.SolrCore.registerSearcher [collection1] Registered new searcher Searcher@c6098b1 main{StandardDirectoryReader(segments_1:1)}
[junit4:junit4]   2> 4806 T852 oasc.ZkController.publish publishing core=collection1 state=down
[junit4:junit4]   2> 4806 T852 oasc.ZkController.publish numShards not found on descriptor - reading it from system property
[junit4:junit4]   2> 5280 T833 oascc.ZkStateReader.updateClusterState Updating cloud state from ZooKeeper... 
[junit4:junit4]   2> 5281 T833 oasc.Overseer$ClusterStateUpdater.updateState Update state numShards=2 message={
[junit4:junit4]   2> 	  "operation":"state",
[junit4:junit4]   2> 	  "numShards":"2",
[junit4:junit4]   2> 	  "shard":null,
[junit4:junit4]   2> 	  "roles":null,
[junit4:junit4]   2> 	  "state":"down",
[junit4:junit4]   2> 	  "core":"collection1",
[junit4:junit4]   2> 	  "collection":"collection1",
[junit4:junit4]   2> 	  "node_name":"127.0.0.1:11382_",
[junit4:junit4]   2> 	  "base_url":"http://127.0.0.1:11382"}
[junit4:junit4]   2> 5281 T833 oasc.Overseer$ClusterStateUpdater.createCollection Create collection collection1 with numShards 2
[junit4:junit4]   2> 5282 T833 oasc.Overseer$ClusterStateUpdater.updateState Assigning new node to shard shard=shard1
[junit4:junit4]   2> 5295 T838 oascc.ZkStateReader$2.process A cluster state change: WatchedEvent state:SyncConnected type:NodeDataChanged path:/clusterstate.json, has occurred - updating... (live nodes size: 2)
[junit4:junit4]   2> 5295 T832 oascc.ZkStateReader$2.process A cluster state change: WatchedEvent state:SyncConnected type:NodeDataChanged path:/clusterstate.json, has occurred - updating... (live nodes size: 2)
[junit4:junit4]   2> 5296 T851 oascc.ZkStateReader$2.process A cluster state change: WatchedEvent state:SyncConnected type:NodeDataChanged path:/clusterstate.json, has occurred - updating... (live nodes size: 2)
[junit4:junit4]   2> 5809 T852 oasc.CoreContainer.registerCore registering core: collection1
[junit4:junit4]   2> 5809 T852 oasc.ZkController.register Register replica - core:collection1 address:http://127.0.0.1:11382 collection:collection1 shard:shard1
[junit4:junit4]   2> 5810 T852 oascc.SolrZkClient.makePath makePath: /collections/collection1/leader_elect/shard1/election
[junit4:junit4]   2> 5899 T815 oazs.PrepRequestProcessor.pRequest Got user-level KeeperException when processing sessionid:0x13bbb0658660006 type:delete cxid:0x45 zxid:0x5b txntype:-1 reqpath:n/a Error Path:/solr/collections/collection1/leaders Error:KeeperErrorCode = NoNode for /solr/collections/collection1/leaders
[junit4:junit4]   2> 5900 T852 oasc.ShardLeaderElectionContext.runLeaderProcess Running the leader process.
[junit4:junit4]   2> 5900 T815 oazs.PrepRequestProcessor.pRequest Got user-level KeeperException when processing sessionid:0x13bbb0658660006 type:create cxid:0x46 zxid:0x5c txntype:-1 reqpath:n/a Error Path:/solr/overseer Error:KeeperErrorCode = NodeExists for /solr/overseer
[junit4:junit4]   2> 5911 T852 oasc.ShardLeaderElectionContext.waitForReplicasToComeUp Enough replicas found to continue.
[junit4:junit4]   2> 5911 T852 oasc.ShardLeaderElectionContext.runLeaderProcess I may be the new leader - try and sync
[junit4:junit4]   2> 5912 T852 oasc.SyncStrategy.sync Sync replicas to http://127.0.0.1:11382/collection1/
[junit4:junit4]   2> 5912 T852 oasc.SyncStrategy.syncReplicas Sync Success - now sync replicas to me
[junit4:junit4]   2> 5912 T852 oasc.SyncStrategy.syncToMe http://127.0.0.1:11382/collection1/ has no replicas
[junit4:junit4]   2> 5912 T852 oasc.ShardLeaderElectionContext.runLeaderProcess I am the new leader: http://127.0.0.1:11382/collection1/
[junit4:junit4]   2> 5912 T852 oascc.SolrZkClient.makePath makePath: /collections/collection1/leaders/shard1
[junit4:junit4]   2> 5922 T815 oazs.PrepRequestProcessor.pRequest Got user-level KeeperException when processing sessionid:0x13bbb0658660006 type:create cxid:0x50 zxid:0x60 txntype:-1 reqpath:n/a Error Path:/solr/overseer Error:KeeperErrorCode = NodeExists for /solr/overseer
[junit4:junit4]   2> 6303 T833 oascc.ZkStateReader.updateClusterState Updating cloud state from ZooKeeper... 
[junit4:junit4]   2> 6325 T851 oascc.ZkStateReader$2.process A cluster state change: WatchedEvent state:SyncConnected type:NodeDataChanged path:/clusterstate.json, has occurred - updating... (live nodes size: 2)
[junit4:junit4]   2> 6325 T832 oascc.ZkStateReader$2.process A cluster state change: WatchedEvent state:SyncConnected type:NodeDataChanged path:/clusterstate.json, has occurred - updating... (live nodes size: 2)
[junit4:junit4]   2> 6325 T838 oascc.ZkStateReader$2.process A cluster state change: WatchedEvent state:SyncConnected type:NodeDataChanged path:/clusterstate.json, has occurred - updating... (live nodes size: 2)
[junit4:junit4]   2> 6337 T852 oasc.ZkController.register We are http://127.0.0.1:11382/collection1/ and leader is http://127.0.0.1:11382/collection1/
[junit4:junit4]   2> 6337 T852 oasc.ZkController.register No LogReplay needed for core=collection1 baseURL=http://127.0.0.1:11382
[junit4:junit4]   2> 6337 T852 oasc.ZkController.checkRecovery I am the leader, no recovery necessary
[junit4:junit4]   2> 6338 T852 oasc.ZkController.publish publishing core=collection1 state=active
[junit4:junit4]   2> 6338 T852 oasc.ZkController.publish numShards not found on descriptor - reading it from system property
[junit4:junit4]   2> 6341 T852 oascc.ZkStateReader.updateClusterState Updating cloud state from ZooKeeper... 
[junit4:junit4]   2> 6342 T810 oass.SolrDispatchFilter.init user.dir=/usr/home/hudson/hudson-slave/workspace/Lucene-Solr-Tests-4.x-java7/solr/build/solr-core/test/J0
[junit4:junit4]   2> 6343 T810 oass.SolrDispatchFilter.init SolrDispatchFilter.init() done
[junit4:junit4]   2> 6343 T810 oascsi.HttpClientUtil.createClient Creating new http client, config:maxConnections=128&maxConnectionsPerHost=32&followRedirects=false
[junit4:junit4]   2> 6526 T810 oejs.Server.doStart jetty-8.1.8.v20121106
[junit4:junit4]   2> 6529 T810 oejs.AbstractConnector.doStart Started SocketConnector@127.0.0.1:11389
[junit4:junit4]   2> 6530 T810 oasc.SolrResourceLoader.locateSolrHome JNDI not configured for solr (NoInitialContextEx)
[junit4:junit4]   2> 6531 T810 oasc.SolrResourceLoader.locateSolrHome using system property solr.solr.home: /usr/home/hudson/hudson-slave/workspace/Lucene-Solr-Tests-4.x-java7/solr/build/solr-core/test/J0/./org.apache.solr.cloud.BasicDistributedZkTest-jetty2-1356052459828
[junit4:junit4]   2> 6532 T810 oasc.SolrResourceLoader.<init> new SolrResourceLoader for deduced Solr Home: '/usr/home/hudson/hudson-slave/workspace/Lucene-Solr-Tests-4.x-java7/solr/build/solr-core/test/J0/./org.apache.solr.cloud.BasicDistributedZkTest-jetty2-1356052459828/'
[junit4:junit4]   2> 6575 T810 oass.SolrDispatchFilter.init SolrDispatchFilter.init()
[junit4:junit4]   2> 6576 T810 oasc.SolrResourceLoader.locateSolrHome JNDI not configured for solr (NoInitialContextEx)
[junit4:junit4]   2> 6577 T810 oasc.SolrResourceLoader.locateSolrHome using system property solr.solr.home: /usr/home/hudson/hudson-slave/workspace/Lucene-Solr-Tests-4.x-java7/solr/build/solr-core/test/J0/./org.apache.solr.cloud.BasicDistributedZkTest-jetty2-1356052459828
[junit4:junit4]   2> 6578 T810 oasc.CoreContainer$Initializer.initialize looking for solr.xml: /usr/home/hudson/hudson-slave/workspace/Lucene-Solr-Tests-4.x-java7/solr/build/solr-core/test/J0/./org.apache.solr.cloud.BasicDistributedZkTest-jetty2-1356052459828/solr.xml
[junit4:junit4]   2> 6578 T810 oasc.CoreContainer.<init> New CoreContainer 1234435691
[junit4:junit4]   2> 6579 T810 oasc.CoreContainer.load Loading CoreContainer using Solr Home: '/usr/home/hudson/hudson-slave/workspace/Lucene-Solr-Tests-4.x-java7/solr/build/solr-core/test/J0/./org.apache.solr.cloud.BasicDistributedZkTest-jetty2-1356052459828/'
[junit4:junit4]   2> 6580 T810 oasc.SolrResourceLoader.<init> new SolrResourceLoader for directory: '/usr/home/hudson/hudson-slave/workspace/Lucene-Solr-Tests-4.x-java7/solr/build/solr-core/test/J0/./org.apache.solr.cloud.BasicDistributedZkTest-jetty2-1356052459828/'
[junit4:junit4]   2> 6612 T810 oashc.HttpShardHandlerFactory.getParameter Setting socketTimeout to: 30000
[junit4:junit4]   2> 6613 T810 oashc.HttpShardHandlerFactory.getParameter Setting urlScheme to: http://
[junit4:junit4]   2> 6614 T810 oashc.HttpShardHandlerFactory.getParameter Setting connTimeout to: 15000
[junit4:junit4]   2> 6614 T810 oashc.HttpShardHandlerFactory.getParameter Setting maxConnectionsPerHost to: 20
[junit4:junit4]   2> 6615 T810 oashc.HttpShardHandlerFactory.getParameter Setting corePoolSize to: 0
[junit4:junit4]   2> 6616 T810 oashc.HttpShardHandlerFactory.getParameter Setting maximumPoolSize to: 2147483647
[junit4:junit4]   2> 6616 T810 oashc.HttpShardHandlerFactory.getParameter Setting maxThreadIdleTime to: 5
[junit4:junit4]   2> 6617 T810 oashc.HttpShardHandlerFactory.getParameter Setting sizeOfQueue to: -1
[junit4:junit4]   2> 6617 T810 oashc.HttpShardHandlerFactory.getParameter Setting fairnessPolicy to: false
[junit4:junit4]   2> 6618 T810 oascsi.HttpClientUtil.createClient Creating new http client, config:maxConnectionsPerHost=20&maxConnections=10000&socketTimeout=30000&connTimeout=15000&retry=false
[junit4:junit4]   2> 6646 T810 oasc.CoreContainer.load Registering Log Listener
[junit4:junit4]   2> 6666 T810 oasc.CoreContainer.initZooKeeper Zookeeper client=127.0.0.1:11375/solr
[junit4:junit4]   2> 6667 T810 oasc.ZkController.checkChrootPath zkHost includes chroot
[junit4:junit4]   2> 6668 T810 oaz.ZooKeeper.<init> Initiating client connection, connectString=127.0.0.1:11375 sessionTimeout=60000 watcher=org.apache.solr.common.cloud.ConnectionManager@685210de
[junit4:junit4]   2> 6669 T810 oascc.ConnectionManager.waitForConnected Waiting for client to connect to ZooKeeper
[junit4:junit4]   2> 6670 T863 oaz.ClientCnxn$SendThread.logStartConnect Opening socket connection to server localhost/127.0.0.1:11375. Will not attempt to authenticate using SASL (access denied ("javax.security.auth.AuthPermission" "getLoginConfiguration"))
[junit4:junit4]   2> 6671 T863 oaz.ClientCnxn$SendThread.primeConnection Socket connection established to localhost/127.0.0.1:11375, initiating session
[junit4:junit4]   2> 6671 T812 oazs.NIOServerCnxnFactory.run Accepted socket connection from /140.211.11.196:11390
[junit4:junit4]   2> 6671 T812 oazs.ZooKeeperServer.processConnectRequest Client attempting to establish new session at /140.211.11.196:11390
[junit4:junit4]   2> 6673 T814 oazs.ZooKeeperServer.finishSessionInit Established session 0x13bbb0658660007 with negotiated timeout 20000 for client /140.211.11.196:11390
[junit4:junit4]   2> 6673 T863 oaz.ClientCnxn$SendThread.onConnected Session establishment complete on server localhost/127.0.0.1:11375, sessionid = 0x13bbb0658660007, negotiated timeout = 20000
[junit4:junit4]   2> 6674 T864 oascc.ConnectionManager.process Watcher org.apache.solr.common.cloud.ConnectionManager@685210de name:ZooKeeperConnection Watcher:127.0.0.1:11375 got event WatchedEvent state:SyncConnected type:None path:null path:null type:None
[junit4:junit4]   2> 6674 T810 oascc.ConnectionManager.waitForConnected Client is connected to ZooKeeper
[junit4:junit4]   2> 6675 T815 oazs.PrepRequestProcessor.pRequest2Txn Processed session termination for sessionid: 0x13bbb0658660007
[junit4:junit4]   2> 6694 T864 oaz.ClientCnxn$EventThread.run EventThread shut down
[junit4:junit4]   2> 6694 T812 oazs.NIOServerCnxn.closeSock Closed socket connection for client /140.211.11.196:11390 which had sessionid 0x13bbb0658660007
[junit4:junit4]   2> 6694 T810 oaz.ZooKeeper.close Session: 0x13bbb0658660007 closed
[junit4:junit4]   2> 6695 T810 oascsi.HttpClientUtil.createClient Creating new http client, config:maxConnections=500&maxConnectionsPerHost=16&socketTimeout=15000&connTimeout=30000
[junit4:junit4]   2> 6708 T810 oaz.ZooKeeper.<init> Initiating client connection, connectString=127.0.0.1:11375/solr sessionTimeout=30000 watcher=org.apache.solr.common.cloud.ConnectionManager@7ceb3314
[junit4:junit4]   2> 6710 T810 oascc.ConnectionManager.waitForConnected Waiting for client to connect to ZooKeeper
[junit4:junit4]   2> 6710 T865 oaz.ClientCnxn$SendThread.logStartConnect Opening socket connection to server localhost/127.0.0.1:11375. Will not attempt to authenticate using SASL (access denied ("javax.security.auth.AuthPermission" "getLoginConfiguration"))
[junit4:junit4]   2> 6711 T865 oaz.ClientCnxn$SendThread.primeConnection Socket connection established to localhost/127.0.0.1:11375, initiating session
[junit4:junit4]   2> 6711 T812 oazs.NIOServerCnxnFactory.run Accepted socket connection from /140.211.11.196:11391
[junit4:junit4]   2> 6729 T812 oazs.ZooKeeperServer.processConnectRequest Client attempting to establish new session at /140.211.11.196:11391
[junit4:junit4]   2> 6731 T814 oazs.ZooKeeperServer.finishSessionInit Established session 0x13bbb0658660008 with negotiated timeout 20000 for client /140.211.11.196:11391
[junit4:junit4]   2> 6731 T865 oaz.ClientCnxn$SendThread.onConnected Session establishment complete on server localhost/127.0.0.1:11375, sessionid = 0x13bbb0658660008, negotiated timeout = 20000
[junit4:junit4]   2> 6731 T866 oascc.ConnectionManager.process Watcher org.apache.solr.common.cloud.ConnectionManager@7ceb3314 name:ZooKeeperConnection Watcher:127.0.0.1:11375/solr got event WatchedEvent state:SyncConnected type:None path:null path:null type:None
[junit4:junit4]   2> 6731 T810 oascc.ConnectionManager.waitForConnected Client is connected to ZooKeeper
[junit4:junit4]   2> 6733 T815 oazs.PrepRequestProcessor.pRequest Got user-level KeeperException when processing sessionid:0x13bbb0658660008 type:create cxid:0x1 zxid:0x6d txntype:-1 reqpath:n/a Error Path:/solr/overseer Error:KeeperErrorCode = NodeExists for /solr/overseer
[junit4:junit4]   2> 6734 T815 oazs.PrepRequestProcessor.pRequest Got user-level KeeperException when processing sessionid:0x13bbb0658660008 type:create cxid:0x2 zxid:0x6e txntype:-1 reqpath:n/a Error Path:/solr/overseer Error:KeeperErrorCode = NodeExists for /solr/overseer
[junit4:junit4]   2> 6741 T810 oasc.ZkController.createEphemeralLiveNode Register node as live in ZooKeeper:/live_nodes/127.0.0.1:11389_
[junit4:junit4]   2> 6743 T815 oazs.PrepRequestProcessor.pRequest Got user-level KeeperException when processing sessionid:0x13bbb0658660008 type:delete cxid:0x4 zxid:0x6f txntype:-1 reqpath:n/a Error Path:/solr/live_nodes/127.0.0.1:11389_ Error:KeeperErrorCode = NoNode for /solr/live_nodes/127.0.0.1:11389_
[junit4:junit4]   2> 6744 T810 oascc.SolrZkClient.makePath makePath: /live_nodes/127.0.0.1:11389_
[junit4:junit4]   2> 6747 T851 oascc.ZkStateReader$2.process A cluster state change: WatchedEvent state:SyncConnected type:NodeChildrenChanged path:/live_nodes, has occurred - updating... (live nodes size: 2)
[junit4:junit4]   2> 6747 T838 oascc.ZkStateReader$3.process Updating live nodes... (3)
[junit4:junit4]   2> 6747 T832 oascc.ZkStateReader$3.process Updating live nodes... (3)
[junit4:junit4]   2> 6748 T838 oascc.ZkStateReader$2.process A cluster state change: WatchedEvent state:SyncConnected type:NodeChildrenChanged path:/live_nodes, has occurred - updating... (live nodes size: 3)
[junit4:junit4]   2> 6748 T832 oascc.ZkStateReader$2.process A cluster state change: WatchedEvent state:SyncConnected type:NodeChildrenChanged path:/live_nodes, has occurred - updating... (live nodes size: 3)
[junit4:junit4]   2> 6749 T851 oascc.ZkStateReader$3.process Updating live nodes... (3)
[junit4:junit4]   2> 6754 T810 oascc.ZkStateReader.createClusterStateWatchersAndUpdate Updating cluster state from ZooKeeper... 
[junit4:junit4]   2> 6763 T867 oasc.CoreContainer.create Creating SolrCore 'collection1' using instanceDir: /usr/home/hudson/hudson-slave/workspace/Lucene-Solr-Tests-4.x-java7/solr/build/solr-core/test/J0/./org.apache.solr.cloud.BasicDistributedZkTest-jetty2-1356052459828/collection1
[junit4:junit4]   2> 6764 T867 oasc.ZkController.createCollectionZkNode Check for collection zkNode:collection1
[junit4:junit4]   2> 6765 T867 oasc.ZkController.createCollectionZkNode Collection zkNode exists
[junit4:junit4]   2> 6765 T867 oasc.ZkController.readConfigName Load collection config from:/collections/collection1
[junit4:junit4]   2> 6767 T867 oasc.SolrResourceLoader.<init> new SolrResourceLoader for directory: '/usr/home/hudson/hudson-slave/workspace/Lucene-Solr-Tests-4.x-java7/solr/build/solr-core/test/J0/./org.apache.solr.cloud.BasicDistributedZkTest-jetty2-1356052459828/collection1/'
[junit4:junit4]   2> 6768 T867 oasc.SolrResourceLoader.replaceClassLoader Adding 'file:/usr/home/hudson/hudson-slave/workspace/Lucene-Solr-Tests-4.x-java7/solr/build/solr-core/test/J0/org.apache.solr.cloud.BasicDistributedZkTest-jetty2-1356052459828/collection1/lib/classes/' to classloader
[junit4:junit4]   2> 6768 T867 oasc.SolrResourceLoader.replaceClassLoader Adding 'file:/usr/home/hudson/hudson-slave/workspace/Lucene-Solr-Tests-4.x-java7/solr/build/solr-core/test/J0/org.apache.solr.cloud.BasicDistributedZkTest-jetty2-1356052459828/collection1/lib/README' to classloader
[junit4:junit4]   2> 6808 T867 oasc.SolrConfig.<init> Using Lucene MatchVersion: LUCENE_41
[junit4:junit4]   2> 6840 T833 oascc.ZkStateReader.updateClusterState Updating cloud state from ZooKeeper... 
[junit4:junit4]   2> 6841 T833 oasc.Overseer$ClusterStateUpdater.updateState Update state numShards=2 message={
[junit4:junit4]   2> 	  "operation":"state",
[junit4:junit4]   2> 	  "numShards":"2",
[junit4:junit4]   2> 	  "shard":"shard1",
[junit4:junit4]   2> 	  "roles":null,
[junit4:junit4]   2> 	  "state":"active",
[junit4:junit4]   2> 	  "core":"collection1",
[junit4:junit4]   2> 	  "collection":"collection1",
[junit4:junit4]   2> 	  "node_name":"127.0.0.1:11382_",
[junit4:junit4]   2> 	  "base_url":"http://127.0.0.1:11382"}
[junit4:junit4]   2> 6854 T838 oascc.ZkStateReader$2.process A cluster state change: WatchedEvent state:SyncConnected type:NodeDataChanged path:/clusterstate.json, has occurred - updating... (live nodes size: 3)
[junit4:junit4]   2> 6854 T832 oascc.ZkStateReader$2.process A cluster state change: WatchedEvent state:SyncConnected type:NodeDataChanged path:/clusterstate.json, has occurred - updating... (live nodes size: 3)
[junit4:junit4]   2> 6854 T866 oascc.ZkStateReader$2.process A cluster state change: WatchedEvent state:SyncConnected type:NodeDataChanged path:/clusterstate.json, has occurred - updating... (live nodes size: 3)
[junit4:junit4]   2> 6854 T851 oascc.ZkStateReader$2.process A cluster state change: WatchedEvent state:SyncConnected type:NodeDataChanged path:/clusterstate.json, has occurred - updating... (live nodes size: 3)
[junit4:junit4]   2> 6860 T867 oasc.SolrConfig.<init> Loaded SolrConfig: solrconfig.xml
[junit4:junit4]   2> 6961 T867 oass.IndexSchema.readSchema Reading Solr Schema
[junit4:junit4]   2> 6968 T867 oass.IndexSchema.readSchema Schema name=test
[junit4:junit4]   2> 7586 T867 oass.OpenExchangeRatesOrgProvider.init Initialized with rates=open-exchange-rates.json, refreshInterval=1440.
[junit4:junit4]   2> 7596 T867 oass.IndexSchema.readSchema default search field in schema is text
[junit4:junit4]   2> 7600 T867 oass.IndexSchema.readSchema unique key field: id
[junit4:junit4]   2> 7614 T867 oass.FileExchangeRateProvider.reload Reloading exchange rates from file currency.xml
[junit4:junit4]   2> 7619 T867 oass.FileExchangeRateProvider.reload Reloading exchange rates from file currency.xml
[junit4:junit4]   2> 7624 T867 oass.OpenExchangeRatesOrgProvider.reload Reloading exchange rates from open-exchange-rates.json
[junit4:junit4]   2> 7626 T867 oass.OpenExchangeRatesOrgProvider.reload Reloading exchange rates from open-exchange-rates.json
[junit4:junit4]   2> 7627 T867 oasc.SolrCore.<init> [collection1] Opening new SolrCore at /usr/home/hudson/hudson-slave/workspace/Lucene-Solr-Tests-4.x-java7/solr/build/solr-core/test/J0/./org.apache.solr.cloud.BasicDistributedZkTest-jetty2-1356052459828/collection1/, dataDir=./org.apache.solr.cloud.BasicDistributedZkTest-1356052453472/jetty2/
[junit4:junit4]   2> 7627 T867 oasc.JmxMonitoredMap.<init> JMX monitoring is enabled. Adding Solr mbeans to JMX Server: com.sun.jmx.mbeanserver.JmxMBeanServer@5d8eaf0d
[junit4:junit4]   2> 7628 T867 oasc.SolrCore.initDirectoryFactory solr.StandardDirectoryFactory
[junit4:junit4]   2> 7629 T867 oasc.CachingDirectoryFactory.get return new directory for /usr/home/hudson/hudson-slave/workspace/Lucene-Solr-Tests-4.x-java7/solr/build/solr-core/test/J0/./org.apache.solr.cloud.BasicDistributedZkTest-1356052453472/jetty2 forceNew:false
[junit4:junit4]   2> 7630 T867 oasc.CachingDirectoryFactory.close Releasing directory:/usr/home/hudson/hudson-slave/workspace/Lucene-Solr-Tests-4.x-java7/solr/build/solr-core/test/J0/./org.apache.solr.cloud.BasicDistributedZkTest-1356052453472/jetty2
[junit4:junit4]   2> 7630 T867 oasc.SolrCore.getNewIndexDir New index directory detected: old=null new=./org.apache.solr.cloud.BasicDistributedZkTest-1356052453472/jetty2/index/
[junit4:junit4]   2> 7631 T867 oasc.SolrCore.initIndex WARNING [collection1] Solr index directory './org.apache.solr.cloud.BasicDistributedZkTest-1356052453472/jetty2/index' doesn't exist. Creating new index...
[junit4:junit4]   2> 7632 T867 oasc.CachingDirectoryFactory.get return new directory for /usr/home/hudson/hudson-slave/workspace/Lucene-Solr-Tests-4.x-java7/solr/build/solr-core/test/J0/./org.apache.solr.cloud.BasicDistributedZkTest-1356052453472/jetty2/index forceNew:false
[junit4:junit4]   2> 7666 T867 oasc.SolrDeletionPolicy.onCommit SolrDeletionPolicy.onCommit: commits:num=1
[junit4:junit4]   2> 		commit{dir=RateLimitedDirectoryWrapper(org.apache.lucene.store.NIOFSDirectory@/usr/home/hudson/hudson-slave/workspace/Lucene-Solr-Tests-4.x-java7/solr/build/solr-core/test/J0/org.apache.solr.cloud.BasicDistributedZkTest-1356052453472/jetty2/index lockFactory=org.apache.lucene.store.NativeFSLockFactory@99512c2),segFN=segments_1,generation=1,filenames=[segments_1]
[junit4:junit4]   2> 7666 T867 oasc.SolrDeletionPolicy.updateCommits newest commit = 1[segments_1]
[junit4:junit4]   2> 7667 T867 oasc.CachingDirectoryFactory.close Releasing directory:/usr/home/hudson/hudson-slave/workspace/Lucene-Solr-Tests-4.x-java7/solr/build/solr-core/test/J0/./org.apache.solr.cloud.BasicDistributedZkTest-1356052453472/jetty2/index
[junit4:junit4]   2> 7668 T867 oasc.SolrCore.initWriters created xml: solr.XMLResponseWriter
[junit4:junit4]   2> 7670 T867 oasup.UpdateRequestProcessorChain.init inserting DistributedUpdateProcessorFactory into updateRequestProcessorChain "dedupe"
[junit4:junit4]   2> 7670 T867 oasup.UpdateRequestProcessorChain.init inserting DistributedUpdateProcessorFactory into updateRequestProcessorChain "dedupe-allfields"
[junit4:junit4]   2> 7671 T867 oasup.UpdateRequestProcessorChain.init inserting DistributedUpdateProcessorFactory into updateRequestProcessorChain "stored_sig"
[junit4:junit4]   2> 7671 T867 oasup.UpdateRequestProcessorChain.init inserting DistributedUpdateProcessorFactory into updateRequestProcessorChain "uniq-fields"
[junit4:junit4]   2> 7672 T867 oasup.UpdateRequestProcessorChain.init inserting DistributedUpdateProcessorFactory into updateRequestProcessorChain "distrib-dup-test-chain-implicit"
[junit4:junit4]   2> 7672 T867 oasc.RequestHandlers.initHandlersFromConfig adding lazy requestHandler: solr.ReplicationHandler
[junit4:junit4]   2> 7673 T867 oasc.RequestHandlers.initHandlersFromConfig created /replication: solr.ReplicationHandler
[junit4:junit4]   2> 7674 T867 oasc.RequestHandlers.initHandlersFromConfig created standard: solr.StandardRequestHandler
[junit4:junit4]   2> 7675 T867 oasc.RequestHandlers.initHandlersFromConfig created /get: solr.RealTimeGetHandler
[junit4:junit4]   2> 7676 T867 oasc.RequestHandlers.initHandlersFromConfig created dismax: solr.SearchHandler
[junit4:junit4]   2> 7678 T867 oasc.RequestHandlers.initHandlersFromConfig created mock: org.apache.solr.core.MockQuerySenderListenerReqHandler
[junit4:junit4]   2> 7678 T867 oasc.RequestHandlers.initHandlersFromConfig created /admin/: org.apache.solr.handler.admin.AdminHandlers
[junit4:junit4]   2> 7679 T867 oasc.RequestHandlers.initHandlersFromConfig created defaults: solr.StandardRequestHandler
[junit4:junit4]   2> 7680 T867 oasc.RequestHandlers.initHandlersFromConfig adding lazy requestHandler: solr.StandardRequestHandler
[junit4:junit4]   2> 7680 T867 oasc.RequestHandlers.initHandlersFromConfig created lazy: solr.StandardRequestHandler
[junit4:junit4]   2> 7681 T867 oasc.RequestHandlers.initHandlersFromConfig created /update: solr.UpdateRequestHandler
[junit4:junit4]   2> 7682 T867 oasc.RequestHandlers.initHandlersFromConfig created /terms: org.apache.solr.handler.component.SearchHandler
[junit4:junit4]   2> 7683 T867 oasc.RequestHandlers.initHandlersFromConfig created spellCheckCompRH: org.apache.solr.handler.component.SearchHandler
[junit4:junit4]   2> 7684 T867 oasc.RequestHandlers.initHandlersFromConfig created spellCheckCompRH_Direct: org.apache.solr.handler.component.SearchHandler
[junit4:junit4]   2> 7685 T867 oasc.RequestHandlers.initHandlersFromConfig created spellCheckWithWordbreak: org.apache.solr.handler.component.SearchHandler
[junit4:junit4]   2> 7686 T867 oasc.RequestHandlers.initHandlersFromConfig created spellCheckWithWordbreak_Direct: org.apache.solr.handler.component.SearchHandler
[junit4:junit4]   2> 7687 T867 oasc.RequestHandlers.initHandlersFromConfig created spellCheckCompRH1: org.apache.solr.handler.component.SearchHandler
[junit4:junit4]   2> 7688 T867 oasc.RequestHandlers.initHandlersFromConfig created mltrh: org.apache.solr.handler.component.SearchHandler
[junit4:junit4]   2> 7689 T867 oasc.RequestHandlers.initHandlersFromConfig created tvrh: org.apache.solr.handler.component.SearchHandler
[junit4:junit4]   2> 7690 T867 oasc.RequestHandlers.initHandlersFromConfig created /mlt: solr.MoreLikeThisHandler
[junit4:junit4]   2> 7691 T867 oasc.RequestHandlers.initHandlersFromConfig created /debug/dump: solr.DumpRequestHandler
[junit4:junit4]   2> 7703 T867 oashl.XMLLoader.init xsltCacheLifetimeSeconds=60
[junit4:junit4]   2> 7707 T867 oasc.SolrCore.initDeprecatedSupport WARNING solrconfig.xml uses deprecated <admin/gettableFiles>, Please update your config to use the ShowFileRequestHandler.
[junit4:junit4]   2> 7709 T867 oasc.SolrCore.initDeprecatedSupport WARNING adding ShowFileRequestHandler with hidden files: [SCHEMA.XML, OLD_SYNONYMS.TXT, STOPWORDS.TXT, PROTWORDS.TXT, OPEN-EXCHANGE-RATES.JSON, SYNONYMS.TXT, CURRENCY.XML, MAPPING-ISOLATIN1ACCENT.TXT]
[junit4:junit4]   2> 7711 T867 oasc.CachingDirectoryFactory.close Releasing directory:/usr/home/hudson/hudson-slave/workspace/Lucene-Solr-Tests-4.x-java7/solr/build/solr-core/test/J0/./org.apache.solr.cloud.BasicDistributedZkTest-1356052453472/jetty2
[junit4:junit4]   2> 7713 T867 oass.SolrIndexSearcher.<init> Opening Searcher@65ee31d1 main
[junit4:junit4]   2> 7714 T867 oasu.CommitTracker.<init> Hard AutoCommit: disabled
[junit4:junit4]   2> 7714 T867 oasu.CommitTracker.<init> Soft AutoCommit: disabled
[junit4:junit4]   2> 7715 T867 oashc.SpellCheckComponent.inform Initializing spell checkers
[junit4:junit4]   2> 7722 T867 oass.DirectSolrSpellChecker.init init: {name=direct,classname=DirectSolrSpellChecker,field=lowerfilt,minQueryLength=3}
[junit4:junit4]   2> 7791 T868 oasc.SolrCore.registerSearcher [collection1] Registered new searcher Searcher@65ee31d1 main{StandardDirectoryReader(segments_1:1)}
[junit4:junit4]   2> 7799 T867 oasc.ZkController.publish publishing core=collection1 state=down
[junit4:junit4]   2> 7799 T867 oasc.ZkController.publish numShards not found on descriptor - reading it from system property
[junit4:junit4]   2> 7870 T833 oascc.ZkStateReader.updateClusterState Updating cloud state from ZooKeeper... 
[junit4:junit4]   2> 7871 T833 oasc.Overseer$ClusterStateUpdater.updateState Update state numShards=2 message={
[junit4:junit4]   2> 	  "operation":"state",
[junit4:junit4]   2> 	  "numShards":"2",
[junit4:junit4]   2> 	  "shard":null,
[junit4:junit4]   2> 	  "roles":null,
[junit4:junit4]   2> 	  "state":"down",
[junit4:junit4]   2> 	  "core":"collection1",
[junit4:junit4]   2> 	  "collection":"collection1",
[junit4:junit4]   2> 	  "node_name":"127.0.0.1:11389_",
[junit4:junit4]   2> 	  "base_url":"http://127.0.0.1:11389"}
[junit4:junit4]   2> 7872 T833 oasc.Overseer$ClusterStateUpdater.updateState Collection already exists with numShards=2
[junit4:junit4]   2> 7872 T833 oasc.Overseer$ClusterStateUpdater.updateState Assigning new node to shard shard=shard2
[junit4:junit4]   2> 7885 T866 oascc.ZkStateReader$2.process A cluster state change: WatchedEvent state:SyncConnected type:NodeDataChanged path:/clusterstate.json, has occurred - updating... (live nodes size: 3)
[junit4:junit4]   2> 7885 T851 oascc.ZkStateReader$2.process A cluster state change: WatchedEvent state:SyncConnected type:NodeDataChanged path:/clusterstate.json, has occurred - updating... (live nodes size: 3)
[junit4:junit4]   2> 7885 T832 oascc.ZkStateReader$2.process A cluster state change: WatchedEvent state:SyncConnected type:NodeDataChanged path:/clusterstate.json, has occurred - updating... (live nodes size: 3)
[junit4:junit4]   2> 7885 T838 oascc.ZkStateReader$2.process A cluster state change: WatchedEvent state:SyncConnected type:NodeDataChanged path:/clusterstate.json, has occurred - updating... (live nodes size: 3)
[junit4:junit4]   2> 8837 T867 oasc.CoreContainer.registerCore registering core: collection1
[junit4:junit4]   2> 8837 T867 oasc.ZkController.register Register replica - core:collection1 address:http://127.0.0.1:11389 collection:collection1 shard:shard2
[junit4:junit4]   2> 8838 T867 oascc.SolrZkClient.makePath makePath: /collections/collection1/leader_elect/shard2/election
[junit4:junit4]   2> 8856 T815 oazs.PrepRequestProcessor.pRequest Got user-level KeeperException when processing sessionid:0x13bbb0658660008 type:delete cxid:0x44 zxid:0x7e txntype:-1 reqpath:n/a Error Path:/solr/collections/collection1/leaders/shard2 Error:KeeperErrorCode = NoNode for /solr/collections/collection1/leaders/shard2
[junit4:junit4]   2> 8857 T867 oasc.ShardLeaderElectionContext.runLeaderProcess Running the leader process.
[junit4:junit4]   2> 8857 T815 oazs.PrepRequestProcessor.pRequest Got user-level KeeperException when processing sessionid:0x13bbb0658660008 type:create cxid:0x45 zxid:0x7f txntype:-1 reqpath:n/a Error Path:/solr/overseer Error:KeeperErrorCode = NodeExists for /solr/overseer
[junit4:junit4]   2> 8866 T867 oasc.ShardLeaderElectionContext.waitForReplicasToComeUp Enough replicas found to continue.
[junit4:junit4]   2> 8867 T867 oasc.ShardLeaderElectionContext.runLeaderProcess I may be the new leader - try and sync
[junit4:junit4]   2> 8867 T867 oasc.SyncStrategy.sync Sync replicas to http://127.0.0.1:11389/collection1/
[junit4:junit4]   2> 8867 T867 oasc.SyncStrategy.syncReplicas Sync Success - now sync replicas to me
[junit4:junit4]   2> 8867 T867 oasc.SyncStrategy.syncToMe http://127.0.0.1:11389/collection1/ has no replicas
[junit4:junit4]   2> 8868 T867 oasc.ShardLeaderElectionContext.runLeaderProcess I am the new leader: http://127.0.0.1:11389/collection1/
[junit4:junit4]   2> 8868 T867 oascc.SolrZkClient.makePath makePath: /collections/collection1/leaders/shard2
[junit4:junit4]   2> 8872 T815 oazs.PrepRequestProcessor.pRequest Got user-level KeeperException when processing sessionid:0x13bbb0658660008 type:create cxid:0x4e zxid:0x82 txntype:-1 reqpath:n/a Error Path:/solr/overseer Error:KeeperErrorCode = NodeExists for /solr/overseer
[junit4:junit4]   2> 8894 T833 oascc.ZkStateReader.updateClusterState Updating cloud state from ZooKeeper... 
[junit4:junit4]   2> 8902 T832 oascc.ZkStateReader$2.process A cluster state change: WatchedEvent state:SyncConnected type:NodeDataChanged path:/clusterstate.json, has occurred - updating... (live nodes size: 3)
[junit4:junit4]   2> 8902 T866 oascc.ZkStateReader$2.process A cluster state change: WatchedEvent state:SyncConnected type:NodeDataChanged path:/clusterstate.json, has occurred - updating... (live nodes size: 3)
[junit4:junit4]   2> 8902 T838 oascc.ZkStateReader$2.process A cluster state change: WatchedEvent state:SyncConnected type:NodeDataChanged path:/clusterstate.json, has occurred - updating... (live nodes size: 3)
[junit4:junit4]   2> 8902 T851 oascc.ZkStateReader$2.process A cluster state change: WatchedEvent state:SyncConnected type:NodeDataChanged path:/clusterstate.json, has occurred - updating... (live nodes size: 3)
[junit4:junit4]   2> 8924 T867 oasc.ZkController.register We are http://127.0.0.1:11389/collection1/ and leader is http://127.0.0.1:11389/collection1/
[junit4:junit4]   2> 8924 T867 oasc.ZkController.register No LogReplay needed for core=collection1 baseURL=http://127.0.0.1:11389
[junit4:junit4]   2> 8924 T867 oasc.ZkController.checkRecovery I am the leader, no recovery necessary
[junit4:junit4]   2> 8925 T867 oasc.ZkController.publish publishing core=collection1 state=active
[junit4:junit4]   2> 8925 T867 oasc.ZkController.publish numShards not found on descriptor - reading it from system property
[junit4:junit4]   2> 8928 T867 oascc.ZkStateReader.updateClusterState Updating cloud state from ZooKeeper... 
[junit4:junit4]   2> 8929 T810 oass.SolrDispatchFilter.init user.dir=/usr/home/hudson/hudson-slave/workspace/Lucene-Solr-Tests-4.x-java7/solr/build/solr-core/test/J0
[junit4:junit4]   2> 8930 T810 oass.SolrDispatchFilter.init SolrDispatchFilter.init() done
[junit4:junit4]   2> 8931 T810 oascsi.HttpClientUtil.createClient Creating new http client, config:maxConnections=128&maxConnectionsPerHost=32&followRedirects=false
[junit4:junit4]   2> 9090 T810 oejs.Server.doStart jetty-8.1.8.v20121106
[junit4:junit4]   2> 9093 T810 oejs.AbstractConnector.doStart Started SocketConnector@127.0.0.1:11398
[junit4:junit4]   2> 9094 T810 oasc.SolrResourceLoader.locateSolrHome JNDI not configured for solr (NoInitialContextEx)
[junit4:junit4]   2> 9094 T810 oasc.SolrResourceLoader.locateSolrHome using system property solr.solr.home: /usr/home/hudson/hudson-slave/workspace/Lucene-Solr-Tests-4.x-java7/solr/build/solr-core/test/J0/./org.apache.solr.cloud.BasicDistributedZkTest-jetty3-1356052462413
[junit4:junit4]   2> 9095 T810 oasc.SolrResourceLoader.<init> new SolrResourceLoader for deduced Solr Home: '/usr/home/hudson/hudson-slave/workspace/Lucene-Solr-Tests-4.x-java7/solr/build/solr-core/test/J0/./org.apache.solr.cloud.BasicDistributedZkTest-jetty3-1356052462413/'
[junit4:junit4]   2> 9132 T810 oass.SolrDispatchFilter.init SolrDispatchFilter.init()
[junit4:junit4]   2> 9133 T810 oasc.SolrResourceLoader.locateSolrHome JNDI not configured for solr (NoInitialContextEx)
[junit4:junit4]   2> 9133 T810 oasc.SolrResourceLoader.locateSolrHome using system property solr.solr.home: /usr/home/hudson/hudson-slave/workspace/Lucene-Solr-Tests-4.x-java7/solr/build/solr-core/test/J0/./org.apache.solr.cloud.BasicDistributedZkTest-jetty3-1356052462413
[junit4:junit4]   2> 9134 T810 oasc.CoreContainer$Initializer.initialize looking for solr.xml: /usr/home/hudson/hudson-slave/workspace/Lucene-Solr-Tests-4.x-java7/solr/build/solr-core/test/J0/./org.apache.solr.cloud.BasicDistributedZkTest-jetty3-1356052462413/solr.xml
[junit4:junit4]   2> 9134 T810 oasc.CoreContainer.<init> New CoreContainer 233744356
[junit4:junit4]   2> 9135 T810 oasc.CoreContainer.load Loading CoreContainer using Solr Home: '/usr/home/hudson/hudson-slave/workspace/Lucene-Solr-Tests-4.x-java7/solr/build/solr-core/test/J0/./org.apache.solr.cloud.BasicDistributedZkTest-jetty3-1356052462413/'
[junit4:junit4]   2> 9135 T810 oasc.SolrResourceLoader.<init> new SolrResourceLoader for directory: '/usr/home/hudson/hudson-slave/workspace/Lucene-Solr-Tests-4.x-java7/solr/build/solr-core/test/J0/./org.apache.solr.cloud.BasicDistributedZkTest-jetty3-1356052462413/'
[junit4:junit4]   2> 9162 T810 oashc.HttpShardHandlerFactory.getParameter Setting socketTimeout to: 30000
[junit4:junit4]   2> 9163 T810 oashc.HttpShardHandlerFactory.getParameter Setting urlScheme to: http://
[junit4:junit4]   2> 9164 T810 oashc.HttpShardHandlerFactory.getParameter Setting connTimeout to: 15000
[junit4:junit4]   2> 9164 T810 oashc.HttpShardHandlerFactory.getParameter Setting maxConnectionsPerHost to: 20
[junit4:junit4]   2> 9165 T810 oashc.HttpShardHandlerFactory.getParameter Setting corePoolSize to: 0
[junit4:junit4]   2> 9165 T810 oashc.HttpShardHandlerFactory.getParameter Setting maximumPoolSize to: 2147483647
[junit4:junit4]   2> 9166 T810 oashc.HttpShardHandlerFactory.getParameter Setting maxThreadIdleTime to: 5
[junit4:junit4]   2> 9166 T810 oashc.HttpShardHandlerFactory.getParameter Setting sizeOfQueue to: -1
[junit4:junit4]   2> 9167 T810 oashc.HttpShardHandlerFactory.getParameter Setting fairnessPolicy to: false
[junit4:junit4]   2> 9168 T810 oascsi.HttpClientUtil.createClient Creating new http client, config:maxConnectionsPerHost=20&maxConnections=10000&socketTimeout=30000&connTimeout=15000&retry=false
[junit4:junit4]   2> 9188 T810 oasc.CoreContainer.load Registering Log Listener
[junit4:junit4]   2> 9208 T810 oasc.CoreContainer.initZooKeeper Zookeeper client=127.0.0.1:11375/solr
[junit4:junit4]   2> 9209 T810 oasc.ZkController.checkChrootPath zkHost includes chroot
[junit4:junit4]   2> 9210 T810 oaz.ZooKeeper.<init> Initiating client connection, connectString=127.0.0.1:11375 sessionTimeout=60000 watcher=org.apache.solr.common.cloud.ConnectionManager@4a057f13
[junit4:junit4]   2> 9211 T810 oascc.ConnectionManager.waitForConnected Waiting for client to connect to ZooKeeper
[junit4:junit4]   2> 9211 T878 oaz.ClientCnxn$SendThread.logStartConnect Opening socket connection to server localhost/127.0.0.1:11375. Will not attempt to authenticate using SASL (access denied ("javax.security.auth.AuthPermission" "getLoginConfiguration"))
[junit4:junit4]   2> 9213 T878 oaz.ClientCnxn$SendThread.primeConnection Socket connection established to localhost/127.0.0.1:11375, initiating session
[junit4:junit4]   2> 9213 T812 oazs.NIOServerCnxnFactory.run Accepted socket connection from /140.211.11.196:11399
[junit4:junit4]   2> 9213 T812 oazs.ZooKeeperServer.processConnectRequest Client attempting to establish new session at /140.211.11.196:11399
[junit4:junit4]   2> 9215 T814 oazs.ZooKeeperServer.finishSessionInit Established session 0x13bbb0658660009 with negotiated timeout 20000 for client /140.211.11.196:11399
[junit4:junit4]   2> 9215 T878 oaz.ClientCnxn$SendThread.onConnected Session establishment complete on server localhost/127.0.0.1:11375, sessionid = 0x13bbb0658660009, negotiated timeout = 20000
[junit4:junit4]   2> 9216 T879 oascc.ConnectionManager.process Watcher org.apache.solr.common.cloud.ConnectionManager@4a057f13 name:ZooKeeperConnection Watcher:127.0.0.1:11375 got event WatchedEvent state:SyncConnected type:None path:null path:null type:None
[junit4:junit4]   2> 9216 T810 oascc.ConnectionManager.waitForConnected Client is connected to ZooKeeper
[junit4:junit4]   2> 9221 T815 oazs.PrepRequestProcessor.pRequest2Txn Processed session termination for sessionid: 0x13bbb0658660009
[junit4:junit4]   2> 9230 T879 oaz.ClientCnxn$EventThread.run EventThread shut down
[junit4:junit4]   2> 9230 T812 oazs.NIOServerCnxn.closeSock Closed socket connection for client /140.211.11.196:11399 which had sessionid 0x13bbb0658660009
[junit4:junit4]   2> 9230 T810 oaz.ZooKeeper.close Session: 0x13bbb0658660009 closed
[junit4:junit4]   2> 9231 T810 oascsi.HttpClientUtil.createClient Creating new http client, config:maxConnections=500&maxConnectionsPerHost=16&socketTimeout=15000&connTimeout=30000
[junit4:junit4]   2> 9244 T810 oaz.ZooKeeper.<init> Initiating client connection, connectString=127.0.0.1:11375/solr sessionTimeout=30000 watcher=org.apache.solr.common.cloud.ConnectionManager@7742530b
[junit4:junit4]   2> 9246 T810 oascc.ConnectionManager.waitForConnected Waiting for client to connect to ZooKeeper
[junit4:junit4]   2> 9246 T880 oaz.ClientCnxn$SendThread.logStartConnect Opening socket connection to server localhost/127.0.0.1:11375. Will not attempt to authenticate using SASL (access denied ("javax.security.auth.AuthPermission" "getLoginConfiguration"))
[junit4:junit4]   2> 9247 T880 oaz.ClientCnxn$SendThread.primeConnection Socket connection established to localhost/127.0.0.1:11375, initiating session
[junit4:junit4]   2> 9247 T812 oazs.NIOServerCnxnFactory.run Accepted socket connection from /140.211.11.196:11401
[junit4:junit4]   2> 9248 T812 oazs.ZooKeeperServer.processConnectRequest Client attempting to establish new session at /140.211.11.196:11401
[junit4:junit4]   2> 9249 T814 oazs.ZooKeeperServer.finishSessionInit Established session 0x13bbb065866000a with negotiated timeout 20000 for client /140.211.11.196:11401
[junit4:junit4]   2> 9249 T880 oaz.ClientCnxn$SendThread.onConnected Session establishment complete on server localhost/127.0.0.1:11375, sessionid = 0x13bbb065866000a, negotiated timeout = 20000
[junit4:junit4]   2> 9249 T881 oascc.ConnectionManager.process Watcher org.apache.solr.common.cloud.ConnectionManager@7742530b name:ZooKeeperConnection Watcher:127.0.0.1:11375/solr got event WatchedEvent state:SyncConnected type:None path:null path:null type:None
[junit4:junit4]   2> 9250 T810 oascc.ConnectionManager.waitForConnected Client is connected to ZooKeeper
[junit4:junit4]   2> 9251 T815 oazs.PrepRequestProcessor.pRequest Got user-level KeeperException when processing sessionid:0x13bbb065866000a type:create cxid:0x1 zxid:0x8f txntype:-1 reqpath:n/a Error Path:/solr/overseer Error:KeeperErrorCode = NodeExists for /solr/overseer
[junit4:junit4]   2> 9253 T815 oazs.PrepRequestProcessor.pRequest Got user-level KeeperException when processing sessionid:0x13bbb065866000a type:create cxid:0x2 zxid:0x90 txntype:-1 reqpath:n/a Error Path:/solr/overseer Error:KeeperErrorCode = NodeExists for /solr/overseer
[junit4:junit4]   2> 9255 T810 oasc.ZkController.createEphemeralLiveNode Register node as live in ZooKeeper:/live_nodes/127.0.0.1:11398_
[junit4:junit4]   2> 9256 T815 oazs.PrepRequestProcessor.pRequest Got user-level KeeperException when processing sessionid:0x13bbb065866000a type:delete cxid:0x4 zxid:0x91 txntype:-1 reqpath:n/a Error Path:/solr/live_nodes/127.0.0.1:11398_ Error:KeeperErrorCode = NoNode for /solr/live_nodes/127.0.0.1:11398_
[junit4:junit4]   2> 9257 T810 oascc.SolrZkClient.makePath makePath: /live_nodes/127.0.0.1:11398_
[junit4:junit4]   2> 9267 T851 oascc.ZkStateReader$2.process A cluster state change: WatchedEvent state:SyncConnected type:NodeChildrenChanged path:/live_nodes, has occurred - updating... (live nodes size: 3)
[junit4:junit4]   2> 9267 T838 oascc.ZkStateReader$3.process Updating live nodes... (4)
[junit4:junit4]   2> 9267 T866 oascc.ZkStateReader$3.process Updating live nodes... (4)
[junit4:junit4]   2> 9267 T832 oascc.ZkStateReader$3.process Updating live nodes... (4)
[junit4:junit4]   2> 9268 T838 oascc.ZkStateReader$2.process A cluster state change: WatchedEvent state:SyncConnected type:NodeChildrenChanged path:/live_nodes, has occurred - updating... (live nodes size: 4)
[junit4:junit4]   2> 9268 T832 oascc.ZkStateReader$2.process A cluster state change: WatchedEvent state:SyncConnected type:NodeChildrenChanged path:/live_nodes, has occurred - updating... (live nodes size: 4)
[junit4:junit4]   2> 9268 T866 oascc.ZkStateReader$2.process A cluster state change: WatchedEvent state:SyncConnected type:NodeChildrenChanged path:/live_nodes, has occurred - updating... (live nodes size: 4)
[junit4:junit4]   2> 9269 T851 oascc.ZkStateReader$3.process Updating live nodes... (4)
[junit4:junit4]   2> 9272 T810 oascc.ZkStateReader.createClusterStateWatchersAndUpdate Updating cluster state from ZooKeeper... 
[junit4:junit4]   2> 9281 T882 oasc.CoreContainer.create Creating SolrCore 'collection1' using instanceDir: /usr/home/hudson/hudson-slave/workspace/Lucene-Solr-Tests-4.x-java7/solr/build/solr-core/test/J0/./org.apache.solr.cloud.BasicDistributedZkTest-jetty3-1356052462413/collection1
[junit4:junit4]   2> 9281 T882 oasc.ZkController.createCollectionZkNode Check for collection zkNode:collection1
[junit4:junit4]   2> 9282 T882 oasc.ZkController.createCollectionZkNode Collection zkNode exists
[junit4:junit4]   2> 9283 T882 oasc.ZkController.readConfigName Load collection config from:/collections/collection1
[junit4:junit4]   2> 9284 T882 oasc.SolrResourceLoader.<init> new SolrResourceLoader for directory: '/usr/home/hudson/hudson-slave/workspace/Lucene-Solr-Tests-4.x-java7/solr/build/solr-core/test/J0/./org.apache.solr.cloud.BasicDistributedZkTest-jetty3-1356052462413/collection1/'
[junit4:junit4]   2> 9285 T882 oasc.SolrResourceLoader.replaceClassLoader Adding 'file:/usr/home/hudson/hudson-slave/workspace/Lucene-Solr-Tests-4.x-java7/solr/build/solr-core/test/J0/org.apache.solr.cloud.BasicDistributedZkTest-jetty3-1356052462413/collection1/lib/README' to classloader
[junit4:junit4]   2> 9286 T882 oasc.SolrResourceLoader.replaceClassLoader Adding 'file:/usr/home/hudson/hudson-slave/workspace/Lucene-Solr-Tests-4.x-java7/solr/build/solr-core/test/J0/org.apache.solr.cloud.BasicDistributedZkTest-jetty3-1356052462413/collection1/lib/classes/' to classloader
[junit4:junit4]   2> 9325 T882 oasc.SolrConfig.<init> Using Lucene MatchVersion: LUCENE_41
[junit4:junit4]   2> 9373 T882 oasc.SolrConfig.<init> Loaded SolrConfig: solrconfig.xml
[junit4:junit4]   2> 9410 T833 oascc.ZkStateReader.updateClusterState Updating cloud state from ZooKeeper... 
[junit4:junit4]   2> 9411 T833 oasc.Overseer$ClusterStateUpdater.updateState Update state numShards=2 message={
[junit4:junit4]   2> 	  "operation":"state",
[junit4:junit4]   2> 	  "numShards":"2",
[junit4:junit4]   2> 	  "shard":"shard2",
[junit4:junit4]   2> 	  "roles":null,
[junit4:junit4]   2> 	  "state":"active",
[junit4:junit4]   2> 	  "core":"collection1",
[junit4:junit4]   2> 	  "collection":"collection1",
[junit4:junit4]   2> 	  "node_name":"127.0.0.1:11389_",
[junit4:junit4]   2> 	  "base_url":"http://127.0.0.1:11389"}
[junit4:junit4]   2> 9418 T866 oascc.ZkStateReader$2.process A cluster state change: WatchedEvent state:SyncConnected type:NodeDataChanged path:/clusterstate.json, has occurred - updating... (live nodes size: 4)
[junit4:junit4]   2> 9418 T851 oascc.ZkStateReader$2.process A cluster state change: WatchedEvent state:SyncConnected type:NodeDataChanged path:/clusterstate.json, has occurred - updating... (live nodes size: 4)
[junit4:junit4]   2> 9419 T832 oascc.ZkStateReader$2.process A cluster state change: WatchedEvent state:SyncConnected type:NodeDataChanged path:/clusterstate.json, has occurred - updating... (live nodes size: 4)
[junit4:junit4]   2> 9418 T838 oascc.ZkStateReader$2.process A cluster state change: WatchedEvent state:SyncConnected type:NodeDataChanged path:/clusterstate.json, has occurred - updating... (live nodes size: 4)
[junit4:junit4]   2> 9475 T882 oass.IndexSchema.readSchema Reading Solr Schema
[junit4:junit4]   2> 9475 T881 oascc.ZkStateReader$2.process A cluster state change: WatchedEvent state:SyncConnected type:NodeDataChanged path:/clusterstate.json, has occurred - updating... (live nodes size: 4)
[junit4:junit4]   2> 9480 T882 oass.IndexSchema.readSchema Schema name=test
[junit4:junit4]   2> 9936 T882 oass.OpenExchangeRatesOrgProvider.init Initialized with rates=open-exchange-rates.json, refreshInterval=1440.
[junit4:junit4]   2> 9966 T882 oass.IndexSchema.readSchema default search field in schema is text
[junit4:junit4]   2> 9982 T882 oass.IndexSchema.readSchema unique key field: id
[junit4:junit4]   2> 10021 T882 oass.FileExchangeRateProvider.reload Reloading exchange rates from file currency.xml
[junit4:junit4]   2> 10027 T882 oass.FileExchangeRateProvider.reload Reloading exchange rates from file currency.xml
[junit4:junit4]   2> 10033 T882 oass.OpenExchangeRatesOrgProvider.reload Reloading exchange rates from open-exchange-rates.json
[junit4:junit4]   2> 10034 T882 oass.OpenExchangeRatesOrgProvider.reload Reloading exchange rates from open-exchange-rates.json
[junit4:junit4]   2> 10036 T882 oasc.SolrCore.<init> [collection1] Opening new SolrCore at /usr/home/hudson/hudson-slave/workspace/Lucene-Solr-Tests-4.x-java7/solr/build/solr-core/test/J0/./org.apache.solr.cloud.BasicDistributedZkTest-jetty3-1356052462413/collection1/, dataDir=./org.apache.solr.cloud.BasicDistributedZkTest-1356052453472/jetty3/
[junit4:junit4]   2> 10036 T882 oasc.JmxMonitoredMap.<init> JMX monitoring is enabled. Adding Solr mbeans to JMX Server: com.sun.jmx.mbeanserver.JmxMBeanServer@5d8eaf0d
[junit4:junit4]   2> 10037 T882 oasc.SolrCore.initDirectoryFactory solr.StandardDirectoryFactory
[junit4:junit4]   2> 10038 T882 oasc.CachingDirectoryFactory.get return new directory for /usr/home/hudson/hudson-slave/workspace/Lucene-Solr-Tests-4.x-java7/solr/build/solr-core/test/J0/./org.apache.solr.cloud.BasicDistributedZkTest-1356052453472/jetty3 forceNew:false
[junit4:junit4]   2> 10039 T882 oasc.CachingDirectoryFactory.close Releasing directory:/usr/home/hudson/hudson-slave/workspace/Lucene-Solr-Tests-4.x-java7/solr/build/solr-core/test/J0/./org.apache.solr.cloud.BasicDistributedZkTest-1356052453472/jetty3
[junit4:junit4]   2> 10039 T882 oasc.SolrCore.getNewIndexDir New index directory detected: old=null new=./org.apache.solr.cloud.BasicDistributedZkTest-1356052453472/jetty3/index/
[junit4:junit4]   2> 10040 T882 oasc.SolrCore.initIndex WARNING [collection1] Solr index directory './org.apache.solr.cloud.BasicDistributedZkTest-1356052453472/jetty3/index' doesn't exist. Creating new index...
[junit4:junit4]   2> 10041 T882 oasc.CachingDirectoryFactory.get return new directory for /usr/home/hudson/hudson-slave/workspace/Lucene-Solr-Tests-4.x-java7/solr/build/solr-core/test/J0/./org.apache.solr.cloud.BasicDistributedZkTest-1356052453472/jetty3/index forceNew:false
[junit4:junit4]   2> 10047 T882 oasc.SolrDeletionPolicy.onCommit SolrDeletionPolicy.onCommit: commits:num=1
[junit4:junit4]   2> 		commit{dir=RateLimitedDirectoryWrapper(org.apache.lucene.store.NIOFSDirectory@/usr/home/hudson/hudson-slave/workspace/Lucene-Solr-Tests-4.x-java7/solr/build/solr-core/test/J0/org.apache.solr.cloud.BasicDistributedZkTest-1356052453472/jetty3/index lockFactory=org.apache.lucene.store.NativeFSLockFactory@7a0e9d9e),segFN=segments_1,generation=1,filenames=[segments_1]
[junit4:junit4]   2> 10047 T882 oasc.SolrDeletionPolicy.updateCommits newest commit = 1[segments_1]
[junit4:junit4]   2> 10048 T882 oasc.CachingDirectoryFactory.close Releasing directory:/usr/home/hudson/hudson-slave/workspace/Lucene-Solr-Tests-4.x-java7/solr/build/solr-core/test/J0/./org.apache.solr.cloud.BasicDistributedZkTest-1356052453472/jetty3/index
[junit4:junit4]   2> 10048 T882 oasc.SolrCore.initWriters created xml: solr.XMLResponseWriter
[junit4:junit4]   2> 10051 T882 oasup.UpdateRequestProcessorChain.init inserting DistributedUpdateProcessorFactory into updateRequestProcessorChain "dedupe"
[junit4:junit4]   2> 10051 T882 oasup.UpdateRequestProcessorChain.init inserting DistributedUpdateProcessorFactory into updateRequestProcessorChain "dedupe-allfields"
[junit4:junit4]   2> 10052 T882 oasup.UpdateRequestProcessorChain.init inserting DistributedUpdateProcessorFactory into updateRequestProcessorChain "stored_sig"
[junit4:junit4]   2> 10052 T882 oasup.UpdateRequestProcessorChain.init inserting DistributedUpdateProcessorFactory into updateRequestProcessorChain "uniq-fields"
[junit4:junit4]   2> 10053 T882 oasup.UpdateRequestProcessorChain.init inserting DistributedUpdateProcessorFactory into updateRequestProcessorChain "distrib-dup-test-chain-implicit"
[junit4:junit4]   2> 10053 T882 oasc.RequestHandlers.initHandlersFromConfig adding lazy requestHandler: solr.ReplicationHandler
[junit4:junit4]   2> 10054 T882 oasc.RequestHandlers.initHandlersFromConfig created /replication: solr.ReplicationHandler
[junit4:junit4]   2> 10055 T882 oasc.RequestHandlers.initHandlersFromConfig created standard: solr.StandardRequestHandler
[junit4:junit4]   2> 10056 T882 oasc.RequestHandlers.initHandlersFromConfig created /get: solr.RealTimeGetHandler
[junit4:junit4]   2> 10057 T882 oasc.RequestHandlers.initHandlersFromConfig created dismax: solr.SearchHandler
[junit4:junit4]   2> 10058 T882 oasc.RequestHandlers.initHandlersFromConfig created mock: org.apache.solr.core.MockQuerySenderListenerReqHandler
[junit4:junit4]   2> 10059 T882 oasc.RequestHandlers.initHandlersFromConfig created /admin/: org.apache.solr.handler.admin.AdminHandlers
[junit4:junit4]   2> 10060 T882 oasc.RequestHandlers.initHandlersFromConfig created defaults: solr.StandardRequestHandler
[junit4:junit4]   2> 10060 T882 oasc.RequestHandlers.initHandlersFromConfig adding lazy requestHandler: solr.StandardRequestHandler
[junit4:junit4]   2> 10061 T882 oasc.RequestHandlers.initHandlersFromConfig created lazy: solr.StandardRequestHandler
[junit4:junit4]   2> 10063 T882 oasc.RequestHandlers.initHandlersFromConfig created /update: solr.UpdateRequestHandler
[junit4:junit4]   2> 10064 T882 oasc.RequestHandlers.initHandlersFromConfig created /terms: org.apache.solr.handler.component.SearchHandler
[junit4:junit4]   2> 10065 T882 oasc.RequestHandlers.initHandlersFromConfig created spellCheckCompRH: org.apache.solr.handler.component.SearchHandler
[junit4:junit4]   2> 10066 T882 oasc.RequestHandlers.initHandlersFromConfig created spellCheckCompRH_Direct: org.apache.solr.handler.component.SearchHandler
[junit4:junit4]   2> 10067 T882 oasc.RequestHandlers.initHandlersFromConfig created spellCheckWithWordbreak: org.apache.solr.handler.component.SearchHandler
[junit4:junit4]   2> 10068 T882 oasc.RequestHandlers.initHandlersFromConfig created spellCheckWithWordbreak_Direct: org.apache.solr.handler.component.SearchHandler
[junit4:junit4]   2> 10069 T882 oasc.RequestHandlers.initHandlersFromConfig created spellCheckCompRH1: org.apache.solr.handler.component.SearchHandler
[junit4:junit4]   2> 10071 T882 oasc.RequestHandlers.initHandlersFromConfig created mltrh: org.apache.solr.handler.component.SearchHandler
[junit4:junit4]   2> 10072 T882 oasc.RequestHandlers.initHandlersFromConfig created tvrh: org.apache.solr.handler.component.SearchHandler
[junit4:junit4]   2> 10073 T882 oasc.RequestHandlers.initHandlersFromConfig created /mlt: solr.MoreLikeThisHandler
[junit4:junit4]   2> 10074 T882 oasc.RequestHandlers.initHandlersFromConfig created /debug/dump: solr.DumpRequestHandler
[junit4:junit4]   2> 10087 T882 oashl.XMLLoader.init xsltCacheLifetimeSeconds=60
[junit4:junit4]   2> 10092 T882 oasc.SolrCore.initDeprecatedSupport WARNING solrconfig.xml uses deprecated <admin/gettableFiles>, Please update your config to use the ShowFileRequestHandler.
[junit4:junit4]   2> 10094 T882 oasc.SolrCore.initDeprecatedSupport WARNING adding ShowFileRequestHandler with hidden files: [SCHEMA.XML, OLD_SYNONYMS.TXT, STOPWORDS.TXT, PROTWORDS.TXT, OPEN-EXCHANGE-RATES.JSON, SYNONYMS.TXT, CURRENCY.XML, MAPPING-ISOLATIN1ACCENT.TXT]
[junit4:junit4]   2> 10097 T882 oasc.CachingDirectoryFactory.close Releasing directory:/usr/home/hudson/hudson-slave/workspace/Lucene-Solr-Tests-4.x-java7/solr/build/solr-core/test/J0/./org.apache.solr.cloud.BasicDistributedZkTest-1356052453472/jetty3
[junit4:junit4]   2> 10099 T882 oass.SolrIndexSearcher.<init> Opening Searcher@158167d main
[junit4:junit4]   2> 10100 T882 oasu.CommitTracker.<init> Hard AutoCommit: disabled
[junit4:junit4]   2> 10101 T882 oasu.CommitTracker.<init> Soft AutoCommit: disabled
[junit4:junit4]   2> 10101 T882 oashc.SpellCheckComponent.inform Initializing spell checkers
[junit4:junit4]   2> 10109 T882 oass.DirectSolrSpellChecker.init init: {name=direct,classname=DirectSolrSpellChecker,field=lowerfilt,minQueryLength=3}
[junit4:junit4]   2> 10168 T883 oasc.SolrCore.registerSearcher [collection1] Registered new searcher Searcher@158167d main{StandardDirectoryReader(segments_1:1)}
[junit4:junit4]   2> 10174 T882 oasc.ZkController.publish publishing core=collection1 state=down
[junit4:junit4]   2> 10175 T882 oasc.ZkController.publish numShards not found on descriptor - reading it from system property
[junit4:junit4]   2> 10434 T833 oascc.ZkStateReader.updateClusterState Updating cloud state from ZooKeeper... 
[junit4:junit4]   2> 10435 T833 oasc.Overseer$ClusterStateUpdater.updateState Update state numShards=2 message={
[junit4:junit4]   2> 	  "operation":"state",
[junit4:junit4]   2> 	  "numShards":"2",
[junit4:junit4]   2> 	  "shard":null,
[junit4:junit4]   2> 	  "roles":null,
[junit4:junit4]   2> 	  "state":"down",
[junit4:junit4]   2> 	  "core":"collection1",
[junit4:junit4]   2> 	  "collection":"collection1",
[junit4:junit4]   2> 	  "node_name":"127.0.0.1:11398_",
[junit4:junit4]   2> 	  "base_url":"http://127.0.0.1:11398"}
[junit4:junit4]   2> 10436 T833 oasc.Overseer$ClusterStateUpdater.updateState Collection already exists with numShards=2
[junit4:junit4]   2> 10436 T833 oasc.Overseer$ClusterStateUpdater.updateState Assigning new node to shard shard=shard1
[junit4:junit4]   2> 10450 T881 oascc.ZkStateReader$2.process A cluster state change: WatchedEvent state:SyncConnected type:NodeDataChanged path:/clusterstate.json, has occurred - updating... (live nodes size: 4)
[junit4:junit4]   2> 10450 T851 oascc.ZkStateReader$2.process A cluster state change: WatchedEvent state:SyncConnected type:NodeDataChanged path:/clusterstate.json, has occurred - updating... (live nodes size: 4)
[junit4:junit4]   2> 10450 T832 oascc.ZkStateReader$2.process A cluster state change: WatchedEvent state:SyncConnected type:NodeDataChanged path:/clusterstate.json, has occurred - updating... (live nodes size: 4)
[junit4:junit4]   2> 10450 T838 oascc.ZkStateReader$2.process A cluster state change: WatchedEvent state:SyncConnected type:NodeDataChanged path:/clusterstate.json, has occurred - updating... (live nodes size: 4)
[junit4:junit4]   2> 10450 T866 oascc.ZkStateReader$2.process A cluster state change: WatchedEvent state:SyncConnected type:NodeDataChanged path:/clusterstate.json, has occurred - updating... (live nodes size: 4)
[junit4:junit4]   2> 11178 T882 oasc.CoreContainer.registerCore registering core: collection1
[junit4:junit4]   2> 11178 T882 oasc.ZkController.register Register replica - core:collection1 address:http://127.0.0.1:11398 collection:collection1 shard:shard1
[junit4:junit4]   2> 11188 T882 oasc.ZkController.register We are http://127.0.0.1:11398/collection1/ and leader is http://127.0.0.1:11382/collection1/
[junit4:junit4]   2> 11189 T882 oasc.ZkController.register No LogReplay needed for core=collection1 baseURL=http://127.0.0.1:11398
[junit4:junit4]   2> 11189 T882 oasc.ZkController.checkRecovery Core needs to recover:collection1
[junit4:junit4]   2> 11189 T882 oasu.DefaultSolrCoreState.doRecovery Running recovery - first canceling any ongoing recovery
[junit4:junit4]   2> ASYNC  NEW_CORE C82 name=collection1 org.apache.solr.core.SolrCore@64ad7efb url=http://127.0.0.1:11398/collection1 node=127.0.0.1:11398_ C82_STATE=coll:collection1 core:collection1 props:{shard=null, roles=null, state=down, core=collection1, collection=collection1, node_name=127.0.0.1:11398_, base_url=http://127.0.0.1:11398}
[junit4:junit4]   2> 11196 T884 C82 P11398 oasc.RecoveryStrategy.run Starting recovery process.  core=collection1 recoveringAfterStartup=true
[junit4:junit4]   2> 11197 T882 oascc.ZkStateReader.updateClusterState Updating cloud state from ZooKeeper... 
[junit4:junit4]   2> 11197 T884 C82 P11398 oasc.RecoveryStrategy.doRecovery ###### startupVersions=[]
[junit4:junit4]   2> 11198 T884 C82 P11398 oasc.ZkController.publish publishing core=collection1 state=recovering
[junit4:junit4]   2> 11198 T884 C82 P11398 oasc.ZkController.publish numShards not found on descriptor - reading it from system property
[junit4:junit4]   2> 11198 T810 oass.SolrDispatchFilter.init user.dir=/usr/home/hudson/hudson-slave/workspace/Lucene-Solr-Tests-4.x-java7/solr/build/solr-core/test/J0
[junit4:junit4]   2> 11199 T810 oass.SolrDispatchFilter.init SolrDispatchFilter.init() done
[junit4:junit4]   2> 11200 T884 C82 P11398 oasc.RecoveryStrategy.doRecovery Attempting to PeerSync from http://127.0.0.1:11382/collection1/ core=collection1 - recoveringAfterStartup=true
[junit4:junit4]   2> 11200 T810 oascsi.HttpClientUtil.createClient Creating new http client, config:maxConnections=128&maxConnectionsPerHost=32&followRedirects=false
[junit4:junit4]   2> 11209 T884 C82 P11398 oascsi.HttpClientUtil.createClient Creating new http client, config:maxConnectionsPerHost=20&maxConnections=10000&connTimeout=30000&socketTimeout=30000&retry=false
[junit4:junit4]   2> 11231 T884 C82 P11398 oasu.PeerSync.sync PeerSync: core=collection1 url=http://127.0.0.1:11398 START replicas=[http://127.0.0.1:11382/collection1/] nUpdates=100
[junit4:junit4]   2> 11232 T884 C82 P11398 oasu.PeerSync.sync WARNING no frame of reference to tell of we've missed updates
[junit4:junit4]   2> 11233 T884 C82 P11398 oasc.RecoveryStrategy.doRecovery PeerSync Recovery was not successful - trying replication. core=collection1
[junit4:junit4]   2> 11233 T884 C82 P11398 oasc.RecoveryStrategy.doRecovery Starting Replication Recovery. core=collection1
[junit4:junit4]   2> 11234 T884 C82 P11398 oascsi.HttpClientUtil.createClient Creating new http client, config:maxConnections=128&maxConnectionsPerHost=32&followRedirects=false
[junit4:junit4]   2> ASYNC  NEW_CORE C83 name=collection1 org.apache.solr.core.SolrCore@6dee73ff url=http://127.0.0.1:11382/collection1 node=127.0.0.1:11382_ C83_STATE=coll:collection1 core:collection1 props:{shard=shard1, roles=null, state=active, core=collection1, collection=collection1, node_name=127.0.0.1:11382_, base_url=http://127.0.0.1:11382, leader=true}
[junit4:junit4]   2> 11241 T841 C83 P11382 REQ /get {distrib=false&qt=/get&wt=javabin&version=2&getVersions=100} status=0 QTime=0 
[junit4:junit4]   2> 11393 T810 oejs.Server.doStart jetty-8.1.8.v20121106
[junit4:junit4]   2> 11396 T810 oejs.AbstractConnector.doStart Started SocketConnector@127.0.0.1:11407
[junit4:junit4]   2> 11397 T810 oasc.SolrResourceLoader.locateSolrHome JNDI not configured for solr (NoInitialContextEx)
[junit4:junit4]   2> 11398 T810 oasc.SolrResourceLoader.locateSolrHome using system property solr.solr.home: /usr/home/hudson/hudson-slave/workspace/Lucene-Solr-Tests-4.x-java7/solr/build/solr-core/test/J0/./org.apache.solr.cloud.BasicDistributedZkTest-jetty4-1356052464684
[junit4:junit4]   2> 11399 T810 oasc.SolrResourceLoader.<init> new SolrResourceLoader for deduced Solr Home: '/usr/home/hudson/hudson-slave/workspace/Lucene-Solr-Tests-4.x-java7/solr/build/solr-core/test/J0/./org.apache.solr.cloud.BasicDistributedZkTest-jetty4-1356052464684/'
[junit4:junit4]   2> 11443 T810 oass.SolrDispatchFilter.init SolrDispatchFilter.init()
[junit4:junit4]   2> 11444 T810 oasc.SolrResourceLoader.locateSolrHome JNDI not configured for solr (NoInitialContextEx)
[junit4:junit4]   2> 11445 T810 oasc.SolrResourceLoader.locateSolrHome using system property solr.solr.home: /usr/home/hudson/hudson-slave/workspace/Lucene-Solr-Tests-4.x-java7/solr/build/solr-core/test/J0/./org.apache.solr.cloud.BasicDistributedZkTest-jetty4-1356052464684
[junit4:junit4]   2> 11446 T810 oasc.CoreContainer$Initializer.initialize looking for solr.xml: /usr/home/hudson/hudson-slave/workspace/Lucene-Solr-Tests-4.x-java7/solr/build/solr-core/test/J0/./org.apache.solr.cloud.BasicDistributedZkTest-jetty4-1356052464684/solr.xml
[junit4:junit4]   2> 11446 T810 oasc.CoreContainer.<init> New CoreContainer 1267545160
[junit4:junit4]   2> 11447 T810 oasc.CoreContainer.load Loading CoreContainer using Solr Home: '/usr/home/hudson/hudson-slave/workspace/Lucene-Solr-Tests-4.x-java7/solr/build/solr-core/test/J0/./org.apache.solr.cloud.BasicDistributedZkTest-jetty4-1356052464684/'
[junit4:junit4]   2> 11448 T810 oasc.SolrResourceLoader.<init> new SolrResourceLoader for directory: '/usr/home/hudson/hudson-slave/workspace/Lucene-Solr-Tests-4.x-java7/solr/build/solr-core/test/J0/./org.apache.solr.cloud.BasicDistributedZkTest-jetty4-1356052464684/'
[junit4:junit4]   2> 11466 T833 oascc.ZkStateReader.updateClusterState Updating cloud state from ZooKeeper... 
[junit4:junit4]   2> 11467 T833 oasc.Overseer$ClusterStateUpdater.updateState Update state numShards=2 message={
[junit4:junit4]   2> 	  "operation":"state",
[junit4:junit4]   2> 	  "numShards":"2",
[junit4:junit4]   2> 	  "shard":"shard1",
[junit4:junit4]   2> 	  "roles":null,
[junit4:junit4]   2> 	  "state":"recovering",
[junit4:junit4]   2> 	  "core":"collection1",
[junit4:junit4]   2> 	  "collection":"collection1",
[junit4:junit4]   2> 	  "node_name":"127.0.0.1:11398_",
[junit4:junit4]   2> 	  "base_url":"http://127.0.0.1:11398"}
[junit4:junit4]   2> 11481 T810 oashc.HttpShardHandlerFactory.getParameter Setting socketTimeout to: 30000
[junit4:junit4]   2> 11482 T810 oashc.HttpShardHandlerFactory.getParameter Setting urlScheme to: http://
[junit4:junit4]   2> 11483 T810 oashc.HttpShardHandlerFactory.getParameter Setting connTimeout to: 15000
[junit4:junit4]   2> 11484 T810 oashc.HttpShardHandlerFactory.getParameter Setting maxConnectionsPerHost to: 20
[junit4:junit4]   2> 11484 T810 oashc.HttpShardHandlerFactory.getParameter Setting corePoolSize to: 0
[junit4:junit4]   2> 11485 T810 oashc.HttpShardHandlerFactory.getParameter Setting maximumPoolSize to: 2147483647
[junit4:junit4]   2> 11485 T810 oashc.HttpShardHandlerFactory.getParameter Setting maxThreadIdleTime to: 5
[junit4:junit4]   2> 11486 T810 oashc.HttpShardHandlerFactory.getParameter Setting sizeOfQueue to: -1
[junit4:junit4]   2> 11487 T810 oashc.HttpShardHandlerFactory.getParameter Setting fairnessPolicy to: false
[junit4:junit4]   2> 11487 T810 oascsi.HttpClientUtil.createClient Creating new http client, config:maxConnectionsPerHost=20&maxConnections=10000&socketTimeout=30000&connTimeout=15000&retry=false
[junit4:junit4]   2> 11490 T851 oascc.ZkStateReader$2.process A cluster state change: WatchedEvent state:SyncConnected type:NodeDataChanged path:/clusterstate.json, has occurred - updating... (live nodes size: 4)
[junit4:junit4]   2> 11490 T832 oascc.ZkStateReader$2.process A cluster state change: WatchedEvent state:SyncConnected type:NodeDataChanged path:/clusterstate.json, has occurred - updating... (live nodes size: 4)
[junit4:junit4]   2> 11490 T838 oascc.ZkStateReader$2.process A cluster state change: WatchedEvent state:SyncConnected type:NodeDataChanged path:/clusterstate.json, has occurred - updating... (live nodes size: 4)
[junit4:junit4]   2> 11490 T881 oascc.ZkStateReader$2.process A cluster state change: WatchedEvent state:SyncConnected type:NodeDataChanged path:/clusterstate.json, has occurred - updating... (live nodes size: 4)
[junit4:junit4]   2> 11490 T866 oascc.ZkStateReader$2.process A cluster state change: WatchedEvent state:SyncConnected type:NodeDataChanged path:/clusterstate.json, has occurred - updating... (live nodes size: 4)
[junit4:junit4]   2> 11512 T810 oasc.CoreContainer.load Registering Log Listener
[junit4:junit4]   2> 11535 T810 oasc.CoreContainer.initZooKeeper Zookeeper client=127.0.0.1:11375/solr
[junit4:junit4]   2> 11536 T810 oasc.ZkController.checkChrootPath zkHost includes chroot
[junit4:junit4]   2> 11536 T810 oaz.ZooKeeper.<init> Initiating client connection, connectString=127.0.0.1:11375 sessionTimeout=60000 watcher=org.apache.solr.common.cloud.ConnectionManager@561ba52e
[junit4:junit4]   2> 11538 T810 oascc.ConnectionManager.waitForConnected Waiting for client to connect to ZooKeeper
[junit4:junit4]   2> 11538 T895 oaz.ClientCnxn$SendThread.logStartConnect Opening socket connection to server localhost/127.0.0.1:11375. Will not attempt to authenticate using SASL (access denied ("javax.security.auth.AuthPermission" "getLoginConfiguration"))
[junit4:junit4]   2> 11539 T895 oaz.ClientCnxn$SendThread.primeConnection Socket connection established to localhost/127.0.0.1:11375, initiating session
[junit4:junit4]   2> 11539 T812 oazs.NIOServerCnxnFactory.run Accepted socket connection from /140.211.11.196:11408
[junit4:junit4]   2> 11540 T812 oazs.ZooKeeperServer.processConnectRequest Client attempting to establish new session at /140.211.11.196:11408
[junit4:junit4]   2> 11541 T814 oazs.ZooKeeperServer.finishSessionInit Established session 0x13bbb065866000b with negotiated timeout 20000 for client /140.211.11.196:11408
[junit4:junit4]   2> 11541 T895 oaz.ClientCnxn$SendThread.onConnected Session establishment complete on server localhost/127.0.0.1:11375, sessionid = 0x13bbb065866000b, negotiated timeout = 20000
[junit4:junit4]   2> 11542 T896 oascc.ConnectionManager.process Watcher org.apache.solr.common.cloud.ConnectionManager@561ba52e name:ZooKeeperConnection Watcher:127.0.0.1:11375 got event WatchedEvent state:SyncConnected type:None path:null path:null type:None
[junit4:junit4]   2> 11542 T810 oascc.ConnectionManager.waitForConnected Client is connected to ZooKeeper
[junit4:junit4]   2> 11543 T815 oazs.PrepRequestProcessor.pRequest2Txn Processed session termination for sessionid: 0x13bbb065866000b
[junit4:junit4]   2> 11545 T896 oaz.ClientCnxn$EventThread.run EventThread shut down
[junit4:junit4]   2> 11545 T812 oazs.NIOServerCnxn.closeSock Closed socket connection for client /140.211.11.196:11408 which had sessionid 0x13bbb065866000b
[junit4:junit4]   2> 11545 T810 oaz.ZooKeeper.close Session: 0x13bbb065866000b closed
[junit4:junit4]   2> 11546 T810 oascsi.HttpClientUtil.createClient Creating new http client, config:maxConnections=500&maxConnectionsPerHost=16&socketTimeout=15000&connTimeout=30000
[junit4:junit4]   2> 11559 T810 oaz.ZooKeeper.<init> Initiating client connection, connectString=127.0.0.1:11375/solr sessionTimeout=30000 watcher=org.apache.solr.common.cloud.ConnectionManager@1ce674d0
[junit4:junit4]   2> 11560 T810 oascc.ConnectionManager.waitForConnected Waiting for client to connect to ZooKeeper
[junit4:junit4]   2> 11560 T897 oaz.ClientCnxn$SendThread.logStartConnect Opening socket connection to server localhost/127.0.0.1:11375. Will not attempt to authenticate using SASL (access denied ("javax.security.auth.AuthPermission" "getLoginConfiguration"))
[junit4:junit4]   2> 11561 T897 oaz.ClientCnxn$SendThread.primeConnection Socket connection established to localhost/127.0.0.1:11375, initiating session
[junit4:junit4]   2> 11561 T812 oazs.NIOServerCnxnFactory.run Accepted socket connection from /140.211.11.196:11409
[junit4:junit4]   2> 11562 T812 oazs.ZooKeeperServer.processConnectRequest Client attempting to establish new session at /140.211.11.196:11409
[junit4:junit4]   2> 11563 T814 oazs.ZooKeeperServer.finishSessionInit Established session 0x13bbb065866000c with negotiated timeout 20000 for client /140.211.11.196:11409
[junit4:junit4]   2> 11563 T897 oaz.ClientCnxn$SendThread.onConnected Session establishment complete on server localhost/127.0.0.1:11375, sessionid = 0x13bbb065866000c, negotiated timeout = 20000
[junit4:junit4]   2> 11563 T898 oascc.ConnectionManager.process Watcher org.apache.solr.common.cloud.ConnectionManager@1ce674d0 name:ZooKeeperConnection Watcher:127.0.0.1:11375/solr got event WatchedEvent state:SyncConnected type:None path:null path:null type:None
[junit4:junit4]   2> 11564 T810 oascc.ConnectionManager.waitForConnected Client is connected to ZooKeeper
[junit4:junit4]   2> 11565 T815 oazs.PrepRequestProcessor.pRequest Got user-level KeeperException when processing sessionid:0x13bbb065866000c type:create cxid:0x1 zxid:0xa6 txntype:-1 reqpath:n/a Error Path:/solr/overseer Error:KeeperErrorCode = NodeExists for /solr/overseer
[junit4:junit4]   2> 11566 T815 oazs.PrepRequestProcessor.pRequest Got user-level KeeperException when processing sessionid:0x13bbb065866000c type:create cxid:0x2 zxid:0xa7 txntype:-1 reqpath:n/a Error Path:/solr/overseer Error:KeeperErrorCode = NodeExists for /solr/overseer
[junit4:junit4]   2> 11574 T810 oasc.ZkController.createEphemeralLiveNode Register node as live in ZooKeeper:/live_nodes/127.0.0.1:11407_
[junit4:junit4]   2> 11575 T815 oazs.PrepRequestProcessor.pRequest Got user-level KeeperException when processing sessionid:0x13bbb065866000c type:delete cxid:0x4 zxid:0xa8 txntype:-1 reqpath:n/a Error Path:/solr/live_nodes/127.0.0.1:11407_ Error:KeeperErrorCode = NoNode for /solr/live_nodes/127.0.0.1:11407_
[junit4:junit4]   2> 11577 T810 oascc.SolrZkClient.makePath makePath: /live_nodes/127.0.0.1:11407_
[junit4:junit4]   2> 11580 T851 oascc.ZkStateReader$2.process A cluster state change: WatchedEvent state:SyncConnected type:NodeChildrenChanged path:/live_nodes, has occurred - updating... (live nodes size: 4)
[junit4:junit4]   2> 11580 T881 oascc.ZkStateReader$2.process A cluster state change: WatchedEvent state:SyncConnected type:NodeChildrenChanged path:/live_nodes, has occurred - updating... (live nodes size: 4)
[junit4:junit4]   2> 11581 T838 oascc.ZkStateReader$3.process Updating live nodes... (5)
[junit4:junit4]   2> 11581 T866 oascc.ZkStateReader$3.process Updating live nodes... (5)
[junit4:junit4]   2> 11581 T838 oascc.ZkStateReader$2.process A cluster state change: WatchedEvent state:SyncConnected type:NodeChildrenChanged path:/live_nodes, has occurred - updating... (live nodes size: 5)
[junit4:junit4]   2> 11581 T832 oascc.ZkStateReader$3.process Updating live nodes... (5)
[junit4:junit4]   2> 11581 T866 oascc.ZkStateReader$2.process A cluster state change: WatchedEvent state:SyncConnected type:NodeChildrenChanged path:/live_nodes, has occurred - updating... (live nodes size: 5)
[junit4:junit4]   2> 11582 T832 oascc.ZkStateReader$2.process A cluster state change: WatchedEvent state:SyncConnected type:NodeChildrenChanged path:/live_nodes, has occurred - updating... (live nodes size: 5)
[junit4:junit4]   2> 11583 T851 oascc.ZkStateReader$3.process Updating live nodes... (5)
[junit4:junit4]   2> 11583 T881 oascc.ZkStateReader$3.process Updating live nodes... (5)
[junit4:junit4]   2> 11585 T810 oascc.ZkStateReader.createClusterStateWatchersAndUpdate Updating cluster state from ZooKeeper... 
[junit4:junit4]   2> 11592 T899 oasc.CoreContainer.create Creating SolrCore 'collection1' using instanceDir: /usr/home/hudson/hudson-slave/workspace/Lucene-Solr-Tests-4.x-java7/solr/build/solr-core/test/J0/./org.apache.solr.cloud.BasicDistributedZkTest-jetty4-1356052464684/collection1
[junit4:junit4]   2> 11593 T899 oasc.ZkController.createCollectionZkNode Check for collection zkNode:collection1
[junit4:junit4]   2> 11594 T899 oasc.ZkController.createCollectionZkNode Collection zkNode exists
[junit4:junit4]   2> 11594 T899 oasc.ZkController.readConfigName Load collection config from:/collections/collection1
[junit4:junit4]   2> 11596 T899 oasc.SolrResourceLoader.<init> new SolrResourceLoader for directory: '/usr/home/hudson/hudson-slave/workspace/Lucene-Solr-Tests-4.x-java7/solr/build/solr-core/test/J0/./org.apache.solr.cloud.BasicDistributedZkTest-jetty4-1356052464684/collection1/'
[junit4:junit4]   2> 11597 T899 oasc.SolrResourceLoader.replaceClassLoader Adding 'file:/usr/home/hudson/hudson-slave/workspace/Lucene-Solr-Tests-4.x-java7/solr/build/solr-core/test/J0/org.apache.solr.cloud.BasicDistributedZkTest-jetty4-1356052464684/collection1/lib/README' to classloader
[junit4:junit4]   2> 11598 T899 oasc.SolrResourceLoader.replaceClassLoader Adding 'file:/usr/home/hudson/hudson-slave/workspace/Lucene-Solr-Tests-4.x-java7/solr/build/solr-core/test/J0/org.apache.solr.cloud.BasicDistributedZkTest-jetty4-1356052464684/collection1/lib/classes/' to classloader
[junit4:junit4]   2> 11656 T899 oasc.SolrConfig.<init> Using Lucene MatchVersion: LUCENE_41
[junit4:junit4]   2> 11734 T899 oasc.SolrConfig.<init> Loaded SolrConfig: solrconfig.xml
[junit4:junit4]   2> 11856 T899 oass.IndexSchema.readSchema Reading Solr Schema
[junit4:junit4]   2> 11863 T899 oass.IndexSchema.readSchema Schema name=test
[junit4:junit4]   2> 12534 T899 oass.OpenExchangeRatesOrgProvider.init Initialized with rates=open-exchange-rates.json, refreshInterval=1440.
[junit4:junit4]   2> 12545 T899 oass.IndexSchema.readSchema default search field in schema is text
[junit4:junit4]   2> 12549 T899 oass.IndexSchema.readSchema unique key field: id
[junit4:junit4]   2> 12565 T899 oass.FileExchangeRateProvider.reload Reloading exchange rates from file currency.xml
[junit4:junit4]   2> 12571 T899 oass.FileExchangeRateProvider.reload Reloading exchange rates from file currency.xml
[junit4:junit4]   2> 12576 T899 oass.OpenExchangeRatesOrgProvider.reload Reloading exchange rates from open-exchange-rates.json
[junit4:junit4]   2> 12578 T899 oass.OpenExchangeRatesOrgProvider.reload Reloading exchange rates from open-exchange-rates.json
[junit4:junit4]   2> 12580 T899 oasc.SolrCore.<init> [collection1] Opening new SolrCore at /usr/home/hudson/hudson-slave/workspace/Lucene-Solr-Tests-4.x-java7/solr/build/solr-core/test/J0/./org.apache.solr.cloud.BasicDistributedZkTest-jetty4-1356052464684/collection1/, dataDir=./org.apache.solr.cloud.BasicDistributedZkTest-1356052453472/jetty4/
[junit4:junit4]   2> 12580 T899 oasc.JmxMonitoredMap.<init> JMX monitoring is enabled. Adding Solr mbeans to JMX Server: com.sun.jmx.mbeanserver.JmxMBeanServer@5d8eaf0d
[junit4:junit4]   2> 12581 T899 oasc.SolrCore.initDirectoryFactory solr.StandardDirectoryFactory
[junit4:junit4]   2> 12582 T899 oasc.CachingDirectoryFactory.get return new directory for /usr/home/hudson/hudson-slave/workspace/Lucene-Solr-Tests-4.x-java7/solr/build/solr-core/test/J0/./org.apache.solr.cloud.BasicDistributedZkTest-1356052453472/jetty4 forceNew:false
[junit4:junit4]   2> 12582 T899 oasc.CachingDirectoryFactory.close Releasing directory:/usr/home/hudson/hudson-slave/workspace/Lucene-Solr-Tests-4.x-java7/solr/build/solr-core/test/J0/./org.apache.solr.cloud.BasicDistributedZkTest-1356052453472/jetty4
[junit4:junit4]   2> 12583 T899 oasc.SolrCore.getNewIndexDir New index directory detected: old=null new=./org.apache.solr.cloud.BasicDistributedZkTest-1356052453472/jetty4/index/
[junit4:junit4]   2> 12584 T899 oasc.SolrCore.initIndex WARNING [collection1] Solr index directory './org.apache.solr.cloud.BasicDistributedZkTest-1356052453472/jetty4/index' doesn't exist. Creating new index...
[junit4:junit4]   2> 12584 T899 oasc.CachingDirectoryFactory.get return new directory for /usr/home/hudson/hudson-slave/workspace/Lucene-Solr-Tests-4.x-java7/solr/build/solr-core/test/J0/./org.apache.solr.cloud.BasicDistributedZkTest-1356052453472/jetty4/index forceNew:false
[junit4:junit4]   2> 12619 T899 oasc.SolrDeletionPolicy.onCommit SolrDeletionPolicy.onCommit: commits:num=1
[junit4:junit4]   2> 		commit{dir=RateLimitedDirectoryWrapper(org.apache.lucene.store.NIOFSDirectory@/usr/home/hudson/hudson-slave/workspace/Lucene-Solr-Tests-4.x-java7/solr/build/solr-core/test/J0/org.apache.solr.cloud.BasicDistributedZkTest-1356052453472/jetty4/index lockFactory=org.apache.lucene.store.NativeFSLockFactory@78134d4c),segFN=segments_1,generation=1,filenames=[segments_1]
[junit4:junit4]   2> 12619 T899 oasc.SolrDeletionPolicy.updateCommits newest commit = 1[segments_1]
[junit4:junit4]   2> 12620 T899 oasc.CachingDirectoryFactory.close Releasing directory:/usr/home/hudson/hudson-slave/workspace/Lucene-Solr-Tests-4.x-java7/solr/build/solr-core/test/J0/./org.apache.solr.cloud.BasicDistributedZkTest-1356052453472/jetty4/index
[junit4:junit4]   2> 12621 T899 oasc.SolrCore.initWriters created xml: solr.XMLResponseWriter
[junit4:junit4]   2> 12623 T899 oasup.UpdateRequestProcessorChain.init inserting DistributedUpdateProcessorFactory into updateRequestProcessorChain "dedupe"
[junit4:junit4]   2> 12623 T899 oasup.UpdateRequestProcessorChain.init inserting DistributedUpdateProcessorFactory into updateRequestProcessorChain "dedupe-allfields"
[junit4:junit4]   2> 12624 T899 oasup.UpdateRequestProcessorChain.init inserting DistributedUpdateProcessorFactory into updateRequestProcessorChain "stored_sig"
[junit4:junit4]   2> 12624 T899 oasup.UpdateRequestProcessorChain.init inserting DistributedUpdateProcessorFactory into updateRequestProcessorChain "uniq-fields"
[junit4:junit4]   2> 12625 T899 oasup.UpdateRequestProcessorChain.init inserting DistributedUpdateProcessorFactory into updateRequestProcessorChain "distrib-dup-test-chain-implicit"
[junit4:junit4]   2> 12625 T899 oasc.RequestHandlers.initHandlersFromConfig adding lazy requestHandler: solr.ReplicationHandler
[junit4:junit4]   2> 12626 T899 oasc.RequestHandlers.initHandlersFromConfig created /replication: solr.ReplicationHandler
[junit4:junit4]   2> 12627 T899 oasc.RequestHandlers.initHandlersFromConfig created standard: solr.StandardRequestHandler
[junit4:junit4]   2> 12628 T899 oasc.RequestHandlers.initHandlersFromConfig created /get: solr.RealTimeGetHandler
[junit4:junit4]   2> 12630 T899 oasc.RequestHandlers.initHandlersFromConfig created dismax: solr.SearchHandler
[junit4:junit4]   2> 12631 T899 oasc.RequestHandlers.initHandlersFromConfig created mock: org.apache.solr.core.MockQuerySenderListenerReqHandler
[junit4:junit4]   2> 12631 T899 oasc.RequestHandlers.initHandlersFromConfig created /admin/: org.apache.solr.handler.admin.AdminHandlers
[junit4:junit4]   2> 12632 T899 oasc.RequestHandlers.initHandlersFromConfig created defaults: solr.StandardRequestHandler
[junit4:junit4]   2> 12633 T899 oasc.RequestHandlers.initHandlersFromConfig adding lazy requestHandler: solr.StandardRequestHandler
[junit4:junit4]   2> 12633 T899 oasc.RequestHandlers.initHandlersFromConfig created lazy: solr.StandardRequestHandler
[junit4:junit4]   2> 12634 T899 oasc.RequestHandlers.initHandlersFromConfig created /update: solr.UpdateRequestHandler
[junit4:junit4]   2> 12635 T899 oasc.RequestHandlers.initHandlersFromConfig created /terms: org.apache.solr.handler.component.SearchHandler
[junit4:junit4]   2> 12636 T899 oasc.RequestHandlers.initHandlersFromConfig created spellCheckCompRH: org.apache.solr.handler.component.SearchHandler
[junit4:junit4]   2> 12638 T899 oasc.RequestHandlers.initHandlersFromConfig created spellCheckCompRH_Direct: org.apache.solr.handler.component.SearchHandler
[junit4:junit4]   2> 12639 T899 oasc.RequestHandlers.initHandlersFromConfig created spellCheckWithWordbreak: org.apache.solr.handler.component.SearchHandler
[junit4:junit4]   2> 12640 T899 oasc.RequestHandlers.initHandlersFromConfig created spellCheckWithWordbreak_Direct: org.apache.solr.handler.component.SearchHandler
[junit4:junit4]   2> 12641 T899 oasc.RequestHandlers.initHandlersFromConfig created spellCheckCompRH1: org.apache.solr.handler.component.SearchHandler
[junit4:junit4]   2> 12642 T899 oasc.RequestHandlers.initHandlersFromConfig created mltrh: org.apache.solr.handler.component.SearchHandler
[junit4:junit4]   2> 12643 T899 oasc.RequestHandlers.initHandlersFromConfig created tvrh: org.apache.solr.handler.component.SearchHandler
[junit4:junit4]   2> 12645 T899 oasc.RequestHandlers.initHandlersFromConfig created /mlt: solr.MoreLikeThisHandler
[junit4:junit4]   2> 12646 T899 oasc.RequestHandlers.initHandlersFromConfig created /debug/dump: solr.DumpRequestHandler
[junit4:junit4]   2> 12659 T899 oashl.XMLLoader.init xsltCacheLifetimeSeconds=60
[junit4:junit4]   2> 12665 T899 oasc.SolrCore.initDeprecatedSupport WARNING solrconfig.xml uses deprecated <admin/gettableFiles>, Please update your config to use the ShowFileRequestHandler.
[junit4:junit4]   2> 12667 T899 oasc.SolrCore.initDeprecatedSupport WARNING adding ShowFileRequestHandler with hidden files: [SCHEMA.XML, OLD_SYNONYMS.TXT, STOPWORDS.TXT, PROTWORDS.TXT, OPEN-EXCHANGE-RATES.JSON, SYNONYMS.TXT, CURRENCY.XML, MAPPING-ISOLATIN1ACCENT.TXT]
[junit4:junit4]   2> 12669 T899 oasc.CachingDirectoryFactory.close Releasing directory:/usr/home/hudson/hudson-slave/workspace/Lucene-Solr-Tests-4.x-java7/solr/build/solr-core/test/J0/./org.apache.solr.cloud.BasicDistributedZkTest-1356052453472/jetty4
[junit4:junit4]   2> 12671 T899 oass.SolrIndexSearcher.<init> Opening Searcher@348b8a85 main
[junit4:junit4]   2> 12673 T899 oasu.CommitTracker.<init> Hard AutoCommit: disabled
[junit4:junit4]   2> 12673 T899 oasu.CommitTracker.<init> Soft AutoCommit: disabled
[junit4:junit4]   2> 12674 T899 oashc.SpellCheckComponent.inform Initializing spell checkers
[junit4:junit4]   2> 12681 T899 oass.DirectSolrSpellChecker.init init: {name=direct,classname=DirectSolrSpellChecker,field=lowerfilt,minQueryLength=3}
[junit4:junit4]   2> 12752 T900 oasc.SolrCore.registerSearcher [collection1] Registered new searcher Searcher@348b8a85 main{StandardDirectoryReader(segments_1:1)}
[junit4:junit4]   2> 12757 T899 oasc.ZkController.publish publishing core=collection1 state=down
[junit4:junit4]   2> 12758 T899 oasc.ZkController.publish numShards not found on descriptor - reading it from system property
[junit4:junit4]   2> 13005 T833 oascc.ZkStateReader.updateClusterState Updating cloud state from ZooKeeper... 
[junit4:junit4]   2> 13006 T833 oasc.Overseer$ClusterStateUpdater.updateState Update state numShards=2 message={
[junit4:junit4]   2> 	  "operation":"state",
[junit4:junit4]   2> 	  "numShards":"2",
[junit4:junit4]   2> 	  "shard":null,
[junit4:junit4]   2> 	  "roles":null,
[junit4:junit4]   2> 	  "state":"down",
[junit4:junit4]   2> 	  "core":"collection1",
[junit4:junit4]   2> 	  "collection":"collection1",
[junit4:junit4]   2> 	  "node_name":"127.0.0.1:11407_",
[junit4:junit4]   2> 	  "base_url":"http://127.0.0.1:11407"}
[junit4:junit4]   2> 13006 T833 oasc.Overseer$ClusterStateUpdater.updateState Collection already exists with numShards=2
[junit4:junit4]   2> 13006 T833 oasc.Overseer$ClusterStateUpdater.updateState Assigning new node to shard shard=shard2
[junit4:junit4]   2> 13019 T838 oascc.ZkStateReader$2.process A cluster state change: WatchedEvent state:SyncConnected type:NodeDataChanged path:/clusterstate.json, has occurred - updating... (live nodes size: 5)
[junit4:junit4]   2> 13019 T866 oascc.ZkStateReader$2.process A cluster state change: WatchedEvent state:SyncConnected type:NodeDataChanged path:/clusterstate.json, has occurred - updating... (live nodes size: 5)
[junit4:junit4]   2> 13019 T898 oascc.ZkStateReader$2.process A cluster state change: WatchedEvent state:SyncConnected type:NodeDataChanged path:/clusterstate.json, has occurred - updating... (live nodes size: 5)
[junit4:junit4]   2> 13019 T881 oascc.ZkStateReader$2.process A cluster state change: WatchedEvent state:SyncConnected type:NodeDataChanged path:/clusterstate.json, has occurred - updating... (live nodes size: 5)
[junit4:junit4]   2> 13019 T832 oascc.ZkStateReader$2.process A cluster state change: WatchedEvent state:SyncConnected type:NodeDataChanged path:/clusterstate.json, has occurred - updating... (live nodes size: 5)
[junit4:junit4]   2> 13019 T851 oascc.ZkStateReader$2.process A cluster state change: WatchedEvent state:SyncConnected type:NodeDataChanged path:/clusterstate.json, has occurred - updating... (live nodes size: 5)
[junit4:junit4]   2> 13761 T899 oasc.CoreContainer.registerCore registering core: collection1
[junit4:junit4]   2> 13761 T899 oasc.ZkController.register Register replica - core:collection1 address:http://127.0.0.1:11407 collection:collection1 shard:shard2
[junit4:junit4]   2> 13803 T899 oasc.ZkController.register We are http://127.0.0.1:11407/collection1/ and leader is http://127.0.0.1:11389/collection1/
[junit4:junit4]   2> 13804 T899 oasc.ZkController.register No LogReplay needed for core=collection1 baseURL=http://127.0.0.1:11407
[junit4:junit4]   2> 13804 T899 oasc.ZkController.checkRecovery Core needs to recover:collection1
[junit4:junit4]   2> 13804 T899 oasu.DefaultSolrCoreState.doRecovery Running recovery - first canceling any ongoing recovery
[junit4:junit4]   2> ASYNC  NEW_CORE C84 name=collection1 org.apache.solr.core.SolrCore@7bc08e47 url=http://127.0.0.1:11407/collection1 node=127.0.0.1:11407_ C84_STATE=coll:collection1 core:collection1 props:{shard=null, roles=null, state=down, core=collection1, collection=collection1, node_name=127.0.0.1:11407_, base_url=http://127.0.0.1:11407}
[junit4:junit4]   2> 13805 T901 C84 P11407 oasc.RecoveryStrategy.run Starting recovery process.  core=collection1 recoveringAfterStartup=true
[junit4:junit4]   2> 13805 T899 oascc.ZkStateReader.updateClusterState Updating cloud state from ZooKeeper... 
[junit4:junit4]   2> 13806 T901 C84 P11407 oasc.RecoveryStrategy.doRecovery ###### startupVersions=[]
[junit4:junit4]   2> 13806 T901 C84 P11407 oasc.ZkController.publish publishing core=collection1 state=recovering
[junit4:junit4]   2> 13806 T901 C84 P11407 oasc.ZkController.publish numShards not found on descriptor - reading it from system property
[junit4:junit4]   2> 13806 T810 oass.SolrDispatchFilter.init user.dir=/usr/home/hudson/hudson-slave/workspace/Lucene-Solr-Tests-4.x-java7/solr/build/solr-core/test/J0
[junit4:junit4]   2> 13807 T810 oass.SolrDispatchFilter.init SolrDispatchFilter.init() done
[junit4:junit4]   2> 13807 T901 C84 P11407 oasc.RecoveryStrategy.doRecovery Attempting to PeerSync from http://127.0.0.1:11389/collection1/ core=collection1 - recoveringAfterStartup=true
[junit4:junit4]   2> 13808 T901 C84 P11407 oasu.PeerSync.sync PeerSync: core=collection1 url=http://127.0.0.1:11407 START replicas=[http://127.0.0.1:11389/collection1/] nUpdates=100
[junit4:junit4]   2> 13808 T810 oascsi.HttpClientUtil.createClient Creating new http client, config:maxConnections=128&maxConnectionsPerHost=32&followRedirects=false
[junit4:junit4]   2> 13808 T901 C84 P11407 oasu.PeerSync.sync WARNING no frame of reference to tell of we've missed updates
[junit4:junit4]   2> 13809 T901 C84 P11407 oasc.RecoveryStrategy.doRecovery PeerSync Recovery was not successful - trying replication. core=collection1
[junit4:junit4]   2> 13809 T901 C84 P11407 oasc.RecoveryStrategy.doRecovery Starting Replication Recovery. core=collection1
[junit4:junit4]   2> 13809 T901 C84 P11407 oascsi.HttpClientUtil.createClient Creating new http client, config:maxConnections=128&maxConnectionsPerHost=32&followRedirects=false
[junit4:junit4]   2> ASYNC  NEW_CORE C85 name=collection1 org.apache.solr.core.SolrCore@612528ae url=http://127.0.0.1:11389/collection1 node=127.0.0.1:11389_ C85_STATE=coll:collection1 core:collection1 props:{shard=shard2, roles=null, state=active, core=collection1, collection=collection1, node_name=127.0.0.1:11389_, base_url=http://127.0.0.1:11389, leader=true}
[junit4:junit4]   2> 13816 T856 C85 P11389 REQ /get {distrib=false&qt=/get&wt=javabin&version=2&getVersions=100} status=0 QTime=0 
[junit4:junit4]   2> 13828 T810 oascc.ZkStateReader.updateClusterState Updating cloud state from ZooKeeper... 
[junit4:junit4]   2> 13830 T810 oasc.AbstractDistribZkTestBase.waitForRecoveriesToFinish Wait for recoveries to finish - collection: collection1 failOnTimeout:true timeout (sec):230
[junit4:junit4]   2> 13831 T810 oascc.ZkStateReader.updateClusterState Updating cloud state from ZooKeeper... 
[junit4:junit4]   2> 14027 T833 oascc.ZkStateReader.updateClusterState Updating cloud state from ZooKeeper... 
[junit4:junit4]   2> 14028 T833 oasc.Overseer$ClusterStateUpdater.updateState Update state numShards=2 message={
[junit4:junit4]   2> 	  "operation":"state",
[junit4:junit4]   2> 	  "numShards":"2",
[junit4:junit4]   2> 	  "shard":"shard2",
[junit4:junit4]   2> 	  "roles":null,
[junit4:junit4]   2> 	  "state":"recovering",
[junit4:junit4]   2> 	  "core":"collection1",
[junit4:junit4]   2> 	  "collection":"collection1",
[junit4:junit4]   2> 	  "node_name":"127.0.0.1:11407_",
[junit4:junit4]   2> 	  "base_url":"http://127.0.0.1:11407"}
[junit4:junit4]   2> 14033 T851 oascc.ZkStateReader$2.process A cluster state change: WatchedEvent state:SyncConnected type:NodeDataChanged path:/clusterstate.json, has occurred - updating... (live nodes size: 5)
[junit4:junit4]   2> 14033 T898 oascc.ZkStateReader$2.process A cluster state change: WatchedEvent state:SyncConnected type:NodeDataChanged path:/clusterstate.json, has occurred - updating... (live nodes size: 5)
[junit4:junit4]   2> 14033 T866 oascc.ZkStateReader$2.process A cluster state change: WatchedEvent state:SyncConnected type:NodeDataChanged path:/clusterstate.json, has occurred - updating... (live nodes size: 5)
[junit4:junit4]   2> 14033 T832 oascc.ZkStateReader$2.process A cluster state change: WatchedEvent state:SyncConnected type:NodeDataChanged path:/clusterstate.json, has occurred - updating... (live nodes size: 5)
[junit4:junit4]   2> 14033 T838 oascc.ZkStateReader$2.process A cluster state change: WatchedEvent state:SyncConnected type:NodeDataChanged path:/clusterstate.json, has occurred - updating... (live nodes size: 5)
[junit4:junit4]   2> 14033 T881 oascc.ZkStateReader$2.process A cluster state change: WatchedEvent state:SyncConnected type:NodeDataChanged path:/clusterstate.json, has occurred - updating... (live nodes size: 5)
[junit4:junit4]   2>  C82_STATE=coll:collection1 core:collection1 props:{shard=shard1, roles=null, state=recovering, core=collection1, collection=collection1, node_name=127.0.0.1:11398_, base_url=http://127.0.0.1:11398}
[junit4:junit4]   2> 14257 T884 C82 P11398 oasc.RecoveryStrategy.doRecovery Begin buffering updates. core=collection1
[junit4:junit4]   2> 14257 T884 C82 P11398 oasu.UpdateLog.bufferUpdates Starting to buffer updates. FSUpdateLog{state=ACTIVE, tlog=null}
[junit4:junit4]   2> 14257 T884 C82 P11398 oasc.RecoveryStrategy.replicate Attempting to replicate from http://127.0.0.1:11382/collection1/. core=collection1
[junit4:junit4]   2> 14258 T884 C82 P11398 oascsi.HttpClientUtil.createClient Creating new http client, config:maxConnections=128&maxConnectionsPerHost=32&followRedirects=false
[junit4:junit4]   2> 14282 T843 C83 P11382 oasu.DirectUpdateHandler2.commit start commit{flags=0,_version_=0,optimize=false,openSearcher=false,waitSearcher=true,expungeDeletes=false,softCommit=false}
[junit4:junit4]   2> 14283 T843 C83 P11382 oasc.CachingDirectoryFactory.close Releasing directory:/usr/home/hudson/hudson-slave/workspace/Lucene-Solr-Tests-4.x-java7/solr/build/solr-core/test/J0/./org.apache.solr.cloud.BasicDistributedZkTest-1356052453472/jetty1
[junit4:junit4]   2> 14287 T843 C83 P11382 oasc.SolrDeletionPolicy.onInit SolrDeletionPolicy.onInit: commits:num=1
[junit4:junit4]   2> 		commit{dir=RateLimitedDirectoryWrapper(org.apache.lucene.store.NIOFSDirectory@/usr/home/hudson/hudson-slave/workspace/Lucene-Solr-Tests-4.x-java7/solr/build/solr-core/test/J0/org.apache.solr.cloud.BasicDistributedZkTest-1356052453472/jetty1/index lockFactory=org.apache.lucene.store.NativeFSLockFactory@32458608),segFN=segments_1,generation=1,filenames=[segments_1]
[junit4:junit4]   2> 14287 T843 C83 P11382 oasc.SolrDeletionPolicy.updateCommits newest commit = 1[segments_1]
[junit4:junit4]   2> 14290 T843 C83 P11382 oasc.SolrDeletionPolicy.onCommit SolrDeletionPolicy.onCommit: commits:num=2
[junit4:junit4]   2> 		commit{dir=RateLimitedDirectoryWrapper(org.apache.lucene.store.NIOFSDirectory@/usr/home/hudson/hudson-slave/workspace/Lucene-Solr-Tests-4.x-java7/solr/build/solr-core/test/J0/org.apache.solr.cloud.BasicDistributedZkTest-1356052453472/jetty1/index lockFactory=org.apache.lucene.store.NativeFSLockFactory@32458608),segFN=segments_1,generation=1,filenames=[segments_1]
[junit4:junit4]   2> 		commit{dir=RateLimitedDirectoryWrapper(org.apache.lucene.store.NIOFSDirectory@/usr/home/hudson/hudson-slave/workspace/Lucene-Solr-Tests-4.x-java7/solr/build/solr-core/test/J0/org.apache.solr.cloud.BasicDistributedZkTest-1356052453472/jetty1/index lockFactory=org.apache.lucene.store.NativeFSLockFactory@32458608),segFN=segments_2,generation=2,filenames=[segments_2]
[junit4:junit4]   2> 14291 T843 C83 P11382 oasc.SolrDeletionPolicy.updateCommits newest commit = 2[segments_2]
[junit4:junit4]   2> 14292 T843 C83 P11382 oasc.CachingDirectoryFactory.close Releasing directory:/usr/home/hudson/hudson-slave/workspace/Lucene-Solr-Tests-4.x-java7/solr/build/solr-core/test/J0/./org.apache.solr.cloud.BasicDistributedZkTest-1356052453472/jetty1
[junit4:junit4]   2> 14292 T843 C83 P11382 oass.SolrIndexSearcher.<init> Opening Searcher@679cceca realtime
[junit4:junit4]   2> 14293 T843 C83 P11382 oasu.DirectUpdateHandler2.commit end_commit_flush
[junit4:junit4]   2> 14293 T843 C83 P11382 /update {waitSearcher=true&openSearcher=false&commit=true&commit_end_point=true&wt=javabin&softCommit=false&version=2} {commit=} 0 24
[junit4:junit4]   2> 14295 T884 C82 P11398 oash.ReplicationHandler.inform Commits will be reserved for  10000
[junit4:junit4]   2> 14295 T884 C82 P11398 oascsi.HttpClientUtil.createClient Creating new http client, config:connTimeout=5000&socketTimeout=20000&allowCompression=false&maxConnections=10000&maxConnectionsPerHost=10000
[junit4:junit4]   2> 14317 T884 C82 P11398 oash.SnapPuller.<init>  No value set for 'pollInterval'. Timer Task not started.
[junit4:junit4]   2> 14321 T844 C83 P11382 oash.ReplicationHandler.inform Commits will be reserved for  10000
[junit4:junit4]   2> 14322 T844 C83 P11382 REQ /replication {command=indexversion&wt=javabin&qt=/replication&version=2} status=0 QTime=3 
[junit4:junit4]   2> 14323 T884 C82 P11398 oash.SnapPuller.fetchLatestIndex Master's generation: 2
[junit4:junit4]   2> 14323 T884 C82 P11398 oash.SnapPuller.fetchLatestIndex Slave's generation: 1
[junit4:junit4]   2> 14323 T884 C82 P11398 oash.SnapPuller.fetchLatestIndex Starting replication process
[junit4:junit4]   2> 14326 T844 C83 P11382 oasc.CachingDirectoryFactory.close Releasing directory:/usr/home/hudson/hudson-slave/workspace/Lucene-Solr-Tests-4.x-java7/solr/build/solr-core/test/J0/./org.apache.solr.cloud.BasicDistributedZkTest-1356052453472/jetty1
[junit4:junit4]   2> 14327 T844 C83 P11382 oasc.CachingDirectoryFactory.close Releasing directory:/usr/home/hudson/hudson-slave/workspace/Lucene-Solr-Tests-4.x-java7/solr/build/solr-core/test/J0/./org.apache.solr.cloud.BasicDistributedZkTest-1356052453472/jetty1/index
[junit4:junit4]   2> 14328 T844 C83 P11382 REQ /replication {command=filelist&generation=2&wt=javabin&qt=/replication&version=2} status=0 QTime=2 
[junit4:junit4]   2> 14329 T884 C82 P11398 oash.SnapPuller.fetchLatestIndex Number of files in latest index in master: 1
[junit4:junit4]   2> 14330 T884 C82 P11398 oasc.CachingDirectoryFactory.get return new directory for /usr/home/hudson/hudson-slave/workspace/Lucene-Solr-Tests-4.x-java7/solr/build/solr-core/test/J0/./org.apache.solr.cloud.BasicDistributedZkTest-1356052453472/jetty3/index.20121220181427796 forceNew:false
[junit4:junit4]   2> 14330 T884 C82 P11398 oasc.CachingDirectoryFactory.close Releasing directory:/usr/home/hudson/hudson-slave/workspace/Lucene-Solr-Tests-4.x-java7/solr/build/solr-core/test/J0/./org.apache.solr.cloud.BasicDistributedZkTest-1356052453472/jetty3
[junit4:junit4]   2> 14331 T884 C82 P11398 oash.SnapPuller.fetchLatestIndex Starting download to RateLimitedDirectoryWrapper(org.apache.lucene.store.NIOFSDirectory@/usr/home/hudson/hudson-slave/workspace/Lucene-Solr-Tests-4.x-java7/solr/build/solr-core/test/J0/org.apache.solr.cloud.BasicDistributedZkTest-1356052453472/jetty3/index.20121220181427796 lockFactory=org.apache.lucene.store.NativeFSLockFactory@198ef226) fullCopy=true
[junit4:junit4]   2> 14343 T844 C83 P11382 REQ /replication {file=segments_2&command=filecontent&checksum=true&generation=2&qt=/replication&wt=filestream} status=0 QTime=4 
[junit4:junit4]   2> 14356 T884 C82 P11398 oasc.CachingDirectoryFactory.close Releasing directory:/usr/home/hudson/hudson-slave/workspace/Lucene-Solr-Tests-4.x-java7/solr/build/solr-core/test/J0/./org.apache.solr.cloud.BasicDistributedZkTest-1356052453472/jetty3/index
[junit4:junit4]   2> 14356 T884 C82 P11398 oash.SnapPuller.fetchLatestIndex Total time taken for download : 0 secs
[junit4:junit4]   2> 14357 T884 C82 P11398 oash.SnapPuller.modifyIndexProps New index installed. Updating index properties... index=index.20121220181427796
[junit4:junit4]   2> 14359 T884 C82 P11398 oasc.CachingDirectoryFactory.close Releasing directory:/usr/home/hudson/hudson-slave/workspace/Lucene-Solr-Tests-4.x-java7/solr/build/solr-core/test/J0/./org.apache.solr.cloud.BasicDistributedZkTest-1356052453472/jetty3
[junit4:junit4]   2> 14359 T884 C82 P11398 oasc.CachingDirectoryFactory.close Releasing directory:/usr/home/hudson/hudson-slave/workspace/Lucene-Solr-Tests-4.x-java7/solr/build/solr-core/test/J0/./org.apache.solr.cloud.BasicDistributedZkTest-1356052453472/jetty3
[junit4:junit4]   2> 14360 T884 C82 P11398 oasc.SolrCore.getNewIndexDir New index directory detected: old=./org.apache.solr.cloud.BasicDistributedZkTest-1356052453472/jetty3/index/ new=./org.apache.solr.cloud.BasicDistributedZkTest-1356052453472/jetty3/index.20121220181427796
[junit4:junit4]   2> 14362 T884 C82 P11398 oasc.SolrDeletionPolicy.onInit SolrDeletionPolicy.onInit: commits:num=1
[junit4:junit4]   2> 		commit{dir=RateLimitedDirectoryWrapper(org.apache.lucene.store.NIOFSDirectory@/usr/home/hudson/hudson-slave/workspace/Lucene-Solr-Tests-4.x-java7/solr/build/solr-core/test/J0/org.apache.solr.cloud.BasicDistributedZkTest-1356052453472/jetty3/index.20121220181427796 lockFactory=org.apache.lucene.store.NativeFSLockFactory@198ef226),segFN=segments_2,generation=2,filenames=[segments_2]
[junit4:junit4]   2> 14364 T884 C82 P11398 oasc.SolrDeletionPolicy.updateCommits newest commit = 2[segments_2]
[junit4:junit4]   2> 14366 T884 C82 P11398 oasc.CachingDirectoryFactory.close Releasing directory:/usr/home/hudson/hudson-slave/workspace/Lucene-Solr-Tests-4.x-java7/solr/build/solr-core/test/J0/./org.apache.solr.cloud.BasicDistributedZkTest-1356052453472/jetty3
[junit4:junit4]   2> 14369 T884 C82 P11398 oasu.DefaultSolrCoreState.newIndexWriter Creating new IndexWriter...
[junit4:junit4]   2> 14369 T884 C82 P11398 oasu.DefaultSolrCoreState.newIndexWriter Waiting until IndexWriter is unused... core=collection1
[junit4:junit4]   2> 14370 T884 C82 P11398 oasu.DefaultSolrCoreState.newIndexWriter Rollback old IndexWriter... core=collection1
[junit4:junit4]   2> 14370 T884 C82 P11398 oasc.CachingDirectoryFactory.close Releasing directory:/usr/home/hudson/hudson-slave/workspace/Lucene-Solr-Tests-4.x-java7/solr/build/solr-core/test/J0/./org.apache.solr.cloud.BasicDistributedZkTest-1356052453472/jetty3/index.20121220181427796
[junit4:junit4]   2> 14371 T884 C82 P11398 oasc.CachingDirectoryFactory.close Releasing directory:/usr/home/hudson/hudson-slave/workspace/Lucene-Solr-Tests-4.x-java7/solr/build/solr-core/test/J0/./org.apache.solr.cloud.BasicDistributedZkTest-1356052453472/jetty3
[junit4:junit4]   2> 14374 T884 C82 P11398 oasc.SolrDeletionPolicy.onInit SolrDeletionPolicy.onInit: commits:num=1
[junit4:junit4]   2> 		commit{dir=RateLimitedDirectoryWrapper(org.apache.lucene.store.NIOFSDirectory@/usr/home/hudson/hudson-slave/workspace/Lucene-Solr-Tests-4.x-java7/solr/build/solr-core/test/J0/org.apache.solr.cloud.BasicDistributedZkTest-1356052453472/jetty3/index.20121220181427796 lockFactory=org.apache.lucene.store.NativeFSLockFactory@198ef226),segFN=segments_2,generation=2,filenames=[segments_2]
[junit4:junit4]   2> 14374 T884 C82 P11398 oasc.SolrDeletionPolicy.updateCommits newest commit = 2[segments_2]
[junit4:junit4]   2> 14375 T884 C82 P11398 oasu.DefaultSolrCoreState.newIndexWriter New IndexWriter is ready to be used.
[junit4:junit4]   2> 14375 T884 C82 P11398 oasc.CachingDirectoryFactory.close Releasing directory:/usr/home/hudson/hudson-slave/workspace/Lucene-Solr-Tests-4.x-java7/solr/build/solr-core/test/J0/./org.apache.solr.cloud.BasicDistributedZkTest-1356052453472/jetty3
[junit4:junit4]   2> 14375 T884 C82 P11398 oass.SolrIndexSearcher.<init> Opening Searcher@4594274c main
[junit4:junit4]   2> 14377 T883 oasc.SolrCore.registerSearcher [collection1] Registered new searcher Searcher@4594274c main{StandardDirectoryReader(segments_2:1:nrt)}
[junit4:junit4]   2> 14378 T883 oasc.CachingDirectoryFactory.close Releasing directory:/usr/home/hudson/hudson-slave/workspace/Lucene-Solr-Tests-4.x-java7/solr/build/solr-core/test/J0/./org.apache.solr.cloud.BasicDistributedZkTest-1356052453472/jetty3/index
[junit4:junit4]   2> 14378 T884 C82 P11398 oasu.DirectUpdateHandler2.commit start commit{flags=0,_version_=0,optimize=false,openSearcher=false,waitSearcher=false,expungeDeletes=false,softCommit=false}
[junit4:junit4]   2> 14380 T884 C82 P11398 oasc.SolrDeletionPolicy.onCommit SolrDeletionPolicy.onCommit: commits:num=2
[junit4:junit4]   2> 		commit{dir=RateLimitedDirectoryWrapper(org.apache.lucene.store.NIOFSDirectory@/usr/home/hudson/hudson-slave/workspace/Lucene-Solr-Tests-4.x-java7/solr/build/solr-core/test/J0/org.apache.solr.cloud.BasicDistributedZkTest-1356052453472/jetty3/index.20121220181427796 lockFactory=org.apache.lucene.store.NativeFSLockFactory@198ef226),segFN=segments_2,generation=2,filenames=[segments_2]
[junit4:junit4]   2> 		commit{dir=RateLimitedDirectoryWrapper(org.apache.lucene.store.NIOFSDirectory@/usr/home/hudson/hudson-slave/workspace/Lucene-Solr-Tests-4.x-java7/solr/build/solr-core/test/J0/org.apache.solr.cloud.BasicDistributedZkTest-1356052453472/jetty3/index.20121220181427796 lockFactory=org.apache.lucene.store.NativeFSLockFactory@198ef226),segFN=segments_3,generation=3,filenames=[segments_3]
[junit4:junit4]   2> 14380 T884 C82 P11398 oasc.SolrDeletionPolicy.updateCommits newest commit = 3[segments_3]
[junit4:junit4]   2> 14381 T884 C82 P11398 oasc.CachingDirectoryFactory.close Releasing directory:/usr/home/hudson/hudson-slave/workspace/Lucene-Solr-Tests-4.x-java7/solr/build/solr-core/test/J0/./org.apache.solr.cloud.BasicDistributedZkTest-1356052453472/jetty3
[junit4:junit4]   2> 14381 T884 C82 P11398 oasu.DirectUpdateHandler2.commit end_commit_flush
[junit4:junit4]   2> 14382 T884 C82 P11398 oasc.CachingDirectoryFactory.close Releasing directory:/usr/home/hudson/hudson-slave/workspace/Lucene-Solr-Tests-4.x-java7/solr/build/solr-core/test/J0/./org.apache.solr.cloud.BasicDistributedZkTest-1356052453472/jetty3/index.20121220181427796
[junit4:junit4]   2> 14382 T884 C82 P11398 oasc.CachingDirectoryFactory.close Releasing directory:/usr/home/hudson/hudson-slave/workspace/Lucene-Solr-Tests-4.x-java7/solr/build/solr-core/test/J0/./org.apache.solr.cloud.BasicDistributedZkTest-1356052453472/jetty3/index
[junit4:junit4]   2> 14382 T884 C82 P11398 oasc.RecoveryStrategy.replay No replay needed. core=collection1
[junit4:junit4]   2> 14382 T884 C82 P11398 oasc.RecoveryStrategy.doRecovery Replication Recovery was successful - registering as Active. core=collection1
[junit4:junit4]   2> 14383 T884 C82 P11398 oasc.ZkController.publish publishing core=collection1 state=active
[junit4:junit4]   2> 14383 T884 C82 P11398 oasc.ZkController.publish numShards not found on descriptor - reading it from system property
[junit4:junit4]   2> 14390 T884 C82 P11398 oasc.RecoveryStrategy.doRecovery Finished recovery process. core=collection1
[junit4:junit4]   2> 14545 T833 oascc.ZkStateReader.updateClusterState Updating cloud state from ZooKeeper... 
[junit4:junit4]   2> 14546 T833 oasc.Overseer$ClusterStateUpdater.updateState Update state numShards=2 message={
[junit4:junit4]   2> 	  "operation":"state",
[junit4:junit4]   2> 	  "numShards":"2",
[junit4:junit4]   2> 	  "shard":"shard1",
[junit4:junit4]   2> 	  "roles":null,
[junit4:junit4]   2> 	  "state":"active",
[junit4:junit4]   2> 	  "core":"collection1",
[junit4:junit4]   2> 	  "collection":"collection1",
[junit4:junit4]   2> 	  "node_name":"127.0.0.1:11398_",
[junit4:junit4]   2> 	  "base_url":"http://127.0.0.1:11398"}
[junit4:junit4]   2> 14552 T881 oascc.ZkStateReader$2.process A cluster state change: WatchedEvent state:SyncConnected type:NodeDataChanged path:/clusterstate.json, has occurred - updating... (live nodes size: 5)
[junit4:junit4]   2> 14552 T898 oascc.ZkStateReader$2.process A cluster state change: WatchedEvent state:SyncConnected type:NodeDataChanged path:/clusterstate.json, has occurred - updating... (live nodes size: 5)
[junit4:junit4]   2> 14552 T866 oascc.ZkStateReader$2.process A cluster state change: WatchedEvent state:SyncConnected type:NodeDataChanged path:/clusterstate.json, has occurred - updating... (live nodes size: 5)
[junit4:junit4]   2> 14552 T851 oascc.ZkStateReader$2.process A cluster state change: WatchedEvent state:SyncConnected type:NodeDataChanged path:/clusterstate.json, has occurred - updating... (live nodes size: 5)
[junit4:junit4]   2> 14552 T832 oascc.ZkStateReader$2.process A cluster state change: WatchedEvent state:SyncConnected type:NodeDataChanged path:/clusterstate.json, has occurred - updating... (live nodes size: 5)
[junit4:junit4]   2> 14552 T838 oascc.ZkStateReader$2.process A cluster state change: WatchedEvent state:SyncConnected type:NodeDataChanged path:/clusterstate.json, has occurred - updating... (live nodes size: 5)
[junit4:junit4]   2> 14832 T810 oascc.ZkStateReader.updateClusterState Updating cloud state from ZooKeeper... 
[junit4:junit4]   2> 15835 T810 oascc.ZkStateReader.updateClusterState Updating cloud state from ZooKeeper... 
[junit4:junit4]   2>  C84_STATE=coll:collection1 core:collection1 props:{shard=shard2, roles=null, state=recovering, core=collection1, collection=collection1, node_name=127.0.0.1:11407_, base_url=http://127.0.0.1:11407}
[junit4:junit4]   2> 16830 T901 C84 P11407 oasc.RecoveryStrategy.doRecovery Begin buffering updates. core=collection1
[junit4:junit4]   2> 16830 T901 C84 P11407 oasu.UpdateLog.bufferUpdates Starting to buffer updates. FSUpdateLog{state=ACTIVE, tlog=null}
[junit4:junit4]   2> 16830 T901 C84 P11407 oasc.RecoveryStrategy.replicate Attempting to replicate from http://127.0.0.1:11389/collection1/. core=collection1
[junit4:junit4]   2> 16831 T901 C84 P11407 oascsi.HttpClientUtil.createClient Creating new http client, config:maxConnections=128&maxConnectionsPerHost=32&followRedirects=false
[junit4:junit4]   2> 16838 T810 oascc.ZkStateReader.updateClusterState Updating cloud state from ZooKeeper... 
[junit4:junit4]   2> 16852 T858 C85 P11389 oasu.DirectUpdateHandler2.commit start commit{flags=0,_version_=0,optimize=false,openSearcher=false,waitSearcher=true,expungeDeletes=false,softCommit=false}
[junit4:junit4]   2> 16853 T858 C85 P11389 oasc.CachingDirectoryFactory.close Releasing directory:/usr/home/hudson/hudson-slave/workspace/Lucene-Solr-Tests-4.x-java7/solr/build/solr-core/test/J0/./org.apache.solr.cloud.BasicDistributedZkTest-1356052453472/jetty2
[junit4:junit4]   2> 16856 T858 C85 P11389 oasc.SolrDeletionPolicy.onInit SolrDeletionPolicy.onInit: commits:num=1
[junit4:junit4]   2> 		commit{dir=RateLimitedDirectoryWrapper(org.apache.lucene.store.NIOFSDirectory@/usr/home/hudson/hudson-slave/workspace/Lucene-Solr-Tests-4.x-java7/solr/build/solr-core/test/J0/org.apache.solr.cloud.BasicDistributedZkTest-1356052453472/jetty2/index lockFactory=org.apache.lucene.store.NativeFSLockFactory@99512c2),segFN=segments_1,generation=1,filenames=[segments_1]
[junit4:junit4]   2> 16857 T858 C85 P11389 oasc.SolrDeletionPolicy.updateCommits newest commit = 1[segments_1]
[junit4:junit4]   2> 16861 T858 C85 P11389 oasc.SolrDeletionPolicy.onCommit SolrDeletionPolicy.onCommit: commits:num=2
[junit4:junit4]   2> 		commit{dir=RateLimitedDirectoryWrapper(org.apache.lucene.store.NIOFSDirectory@/usr/home/hudson/hudson-slave/workspace/Lucene-Solr-Tests-4.x-java7/solr/build/solr-core/test/J0/org.apache.solr.cloud.BasicDistributedZkTest-1356052453472/jetty2/index lockFactory=org.apache.lucene.store.NativeFSLockFactory@99512c2),segFN=segments_1,generation=1,filenames=[segments_1]
[junit4:junit4]   2> 		commit{dir=RateLimitedDirectoryWrapper(org.apache.lucene.store.NIOFSDirectory@/usr/home/hudson/hudson-slave/workspace/Lucene-Solr-Tests-4.x-java7/solr/build/solr-core/test/J0/org.apache.solr.cloud.BasicDistributedZkTest-1356052453472/jetty2/index lockFactory=org.apache.lucene.store.NativeFSLockFactory@99512c2),segFN=segments_2,generation=2,filenames=[segments_2]
[junit4:junit4]   2> 16861 T858 C85 P11389 oasc.SolrDeletionPolicy.updateCommits newest commit = 2[segments_2]
[junit4:junit4]   2> 16862 T858 C85 P11389 oasc.CachingDirectoryFactory.close Releasing directory:/usr/home/hudson/hudson-slave/workspace/Lucene-Solr-Tests-4.x-java7/solr/build/solr-core/test/J0/./org.apache.solr.cloud.BasicDistributedZkTest-1356052453472/jetty2
[junit4:junit4]   2> 16863 T858 C85 P11389 oass.SolrIndexSearcher.<init> Opening Searcher@6d64f83e realtime
[junit4:junit4]   2> 16863 T858 C85 P11389 oasu.DirectUpdateHandler2.commit end_commit_flush
[junit4:junit4]   2> 16864 T858 C85 P11389 /update {waitSearcher=true&openSearcher=false&commit=true&commit_end_point=true&wt=javabin&softCommit=false&version=2} {commit=} 0 22
[junit4:junit4]   2> 16865 T901 C84 P11407 oash.ReplicationHandler.inform Commits will be reserved for  10000
[junit4:junit4]   2> 16867 T901 C84 P11407 oash.SnapPuller.<init>  No value set for 'pollInterval'. Timer Task not started.
[junit4:junit4]   2> 16870 T859 C85 P11389 oash.ReplicationHandler.inform Commits will be reserved for  10000
[junit4:junit4]   2> 16870 T859 C85 P11389 REQ /replication {command=indexversion&wt=javabin&qt=/replication&version=2} status=0 QTime=1 
[junit4:junit4]   2> 16871 T901 C84 P11407 oash.SnapPuller.fetchLatestIndex Master's generation: 2
[junit4:junit4]   2> 16871 T901 C84 P11407 oash.SnapPuller.fetchLatestIndex Slave's generation: 1
[junit4:junit4]   2> 16872 T901 C84 P11407 oash.SnapPuller.fetchLatestIndex Starting replication process
[junit4:junit4]   2> 16874 T859 C85 P11389 oasc.CachingDirectoryFactory.close Releasing directory:/usr/home/hudson/hudson-slave/workspace/Lucene-Solr-Tests-4.x-java7/solr/build/solr-core/test/J0/./org.apache.solr.cloud.BasicDistributedZkTest-1356052453472/jetty2
[junit4:junit4]   2> 16875 T859 C85 P11389 oasc.CachingDirectoryFactory.close Releasing directory:/usr/home/hudson/hudson-slave/workspace/Lucene-Solr-Tests-4.x-java7/solr/build/solr-core/test/J0/./org.apache.solr.cloud.BasicDistributedZkTest-1356052453472/jetty2/index
[junit4:junit4]   2> 16876 T859 C85 P11389 REQ /replication {command=filelist&generation=2&wt=javabin&qt=/replication&version=2} status=0 QTime=2 
[junit4:junit4]   2> 16876 T901 C84 P11407 oash.SnapPuller.fetchLatestIndex Number of files in latest index in master: 1
[junit4:junit4]   2> 16878 T901 C84 P11407 oasc.CachingDirectoryFactory.get return new directory for /usr/home/hudson/hudson-slave/workspace/Lucene-Solr-Tests-4.x-java7/solr/build/solr-core/test/J0/./org.apache.solr.cloud.BasicDistributedZkTest-1356052453472/jetty4/index.20121220181430344 forceNew:false
[junit4:junit4]   2> 16878 T901 C84 P11407 oasc.CachingDirectoryFactory.close Releasing directory:/usr/home/hudson/hudson-slave/workspace/Lucene-Solr-Tests-4.x-java7/solr/build/solr-core/test/J0/./org.apache.solr.cloud.BasicDistributedZkTest-1356052453472/jetty4
[junit4:junit4]   2> 16879 T901 C84 P11407 oash.SnapPuller.fetchLatestIndex Starting download to RateLimitedDirectoryWrapper(org.apache.lucene.store.NIOFSDirectory@/usr/home/hudson/hudson-slave/workspace/Lucene-Solr-Tests-4.x-java7/solr/build/solr-core/test/J0/org.apache.solr.cloud.BasicDistributedZkTest-1356052453472/jetty4/index.20121220181430344 lockFactory=org.apache.lucene.store.NativeFSLockFactory@3b37ae7b) fullCopy=true
[junit4:junit4]   2> 16917 T859 C85 P11389 REQ /replication {file=segments_2&command=filecontent&checksum=true&generation=2&qt=/replication&wt=filestream} status=0 QTime=0 
[junit4:junit4]   2> 16920 T901 C84 P11407 oasc.CachingDirectoryFactory.close Releasing directory:/usr/home/hudson/hudson-slave/workspace/Lucene-Solr-Tests-4.x-java7/solr/build/solr-core/test/J0/./org.apache.solr.cloud.BasicDistributedZkTest-1356052453472/jetty4/index
[junit4:junit4]   2> 16920 T901 C84 P11407 oash.SnapPuller.fetchLatestIndex Total time taken for download : 0 secs
[junit4:junit4]   2> 16920 T901 C84 P11407 oash.SnapPuller.modifyIndexProps New index installed. Updating index properties... index=index.20121220181430344
[junit4:junit4]   2> 16922 T901 C84 P11407 oasc.CachingDirectoryFactory.close Releasing directory:/usr/home/hudson/hudson-slave/workspace/Lucene-Solr-Tests-4.x-java7/solr/build/solr-core/test/J0/./org.apache.solr.cloud.BasicDistributedZkTest-1356052453472/jetty4
[junit4:junit4]   2> 16922 T901 C84 P11407 oasc.CachingDirectoryFactory.close Releasing directory:/usr/home/hudson/hudson-slave/workspace/Lucene-Solr-Tests-4.x-java7/solr/build/solr-core/test/J0/./org.apache.solr.cloud.BasicDistributedZkTest-1356052453472/jetty4
[junit4:junit4]   2> 16923 T901 C84 P11407 oasc.SolrCore.getNewIndexDir New index directory detected: old=./org.apache.solr.cloud.BasicDistributedZkTest-1356052453472/jetty4/index/ new=./org.apache.solr.cloud.BasicDistributedZkTest-1356052453472/jetty4/index.20121220181430344
[junit4:junit4]   2> 16926 T901 C84 P11407 oasc.SolrDeletionPolicy.onInit SolrDeletionPolicy.onInit: commits:num=1
[junit4:junit4]   2> 		commit{dir=RateLimitedDirectoryWrapper(org.apache.lucene.store.NIOFSDirectory@/usr/home/hudson/hudson-slave/workspace/Lucene-Solr-Tests-4.x-java7/solr/build/solr-core/test/J0/org.apache.solr.cloud.BasicDistributedZkTest-1356052453472/jetty4/index.20121220181430344 lockFactory=org.apache.lucene.store.NativeFSLockFactory@3b37ae7b),segFN=segments_2,generation=2,filenames=[segments_2]
[junit4:junit4]   2> 16926 T901 C84 P11407 oasc.SolrDeletionPolicy.updateCommits newest commit = 2[segments_2]
[junit4:junit4]   2> 16927 T901 C84 P11407 oasc.CachingDirectoryFactory.close Releasing directory:/usr/home/hudson/hudson-slave/workspace/Lucene-Solr-Tests-4.x-java7/solr/build/solr-core/test/J0/./org.apache.solr.cloud.BasicDistributedZkTest-1356052453472/jetty4
[junit4:junit4]   2> 16928 T901 C84 P11407 oasu.DefaultSolrCoreState.newIndexWriter Creating new IndexWriter...
[junit4:junit4]   2> 16928 T901 C84 P11407 oasu.DefaultSolrCoreState.newIndexWriter Waiting until IndexWriter is unused... core=collection1
[junit4:junit4]   2> 16928 T901 C84 P11407 oasu.DefaultSolrCoreState.newIndexWriter Rollback old IndexWriter... core=collection1
[junit4:junit4]   2> 16929 T901 C84 P11407 oasc.CachingDirectoryFactory.close Releasing directory:/usr/home/hudson/hudson-slave/workspace/Lucene-Solr-Tests-4.x-java7/solr/build/solr-core/test/J0/./org.apache.solr.cloud.BasicDistributedZkTest-1356052453472/jetty4/index.20121220181430344
[junit4:junit4]   2> 16929 T901 C84 P11407 oasc.CachingDirectoryFactory.close Releasing directory:/usr/home/hudson/hudson-slave/workspace/Lucene-Solr-Tests-4.x-java7/solr/build/solr-core/test/J0/./org.apache.solr.cloud.BasicDistributedZkTest-1356052453472/jetty4
[junit4:junit4]   2> 16932 T901 C84 P11407 oasc.SolrDeletionPolicy.onInit SolrDeletionPolicy.onInit: commits:num=1
[junit4:junit4]   2> 		commit{dir=RateLimitedDirectoryWrapper(org.apache.lucene.store.NIOFSDirectory@/usr/home/hudson/hudson-slave/workspace/Lucene-Solr-Tests-4.x-java7/solr/build/solr-core/test/J0/org.apache.solr.cloud.BasicDistributedZkTest-1356052453472/jetty4/index.20121220181430344 lockFactory=org.apache.lucene.store.NativeFSLockFactory@3b37ae7b),segFN=segments_2,generation=2,filenames=[segments_2]
[junit4:junit4]   2> 16932 T901 C84 P11407 oasc.SolrDeletionPolicy.updateCommits newest commit = 2[segments_2]
[junit4:junit4]   2> 16933 T901 C84 P11407 oasu.DefaultSolrCoreState.newIndexWriter New IndexWriter is ready to be used

[...truncated too long message...]

earch
[junit4:junit4]   1> client port:0.0.0.0/0.0.0.0:0
[junit4:junit4]   2> NOTE: reproduce with: ant test  -Dtestcase=SyncSliceTest -Dtests.method=testDistribSearch -Dtests.seed=DFA9194C7888B80C -Dtests.multiplier=3 -Dtests.slow=true -Dtests.locale=sl_SI -Dtests.timezone=Asia/Choibalsan -Dtests.file.encoding=US-ASCII
[junit4:junit4] FAILURE  126s J0 | SyncSliceTest.testDistribSearch <<<
[junit4:junit4]    > Throwable #1: java.lang.AssertionError: shard1 should have just been set up to be inconsistent - but it's still consistent
[junit4:junit4]    > 	at __randomizedtesting.SeedInfo.seed([DFA9194C7888B80C:5E4F97540FD7D830]:0)
[junit4:junit4]    > 	at org.junit.Assert.fail(Assert.java:93)
[junit4:junit4]    > 	at org.junit.Assert.assertTrue(Assert.java:43)
[junit4:junit4]    > 	at org.junit.Assert.assertNotNull(Assert.java:526)
[junit4:junit4]    > 	at org.apache.solr.cloud.SyncSliceTest.doTest(SyncSliceTest.java:220)
[junit4:junit4]    > 	at org.apache.solr.BaseDistributedSearchTestCase.testDistribSearch(BaseDistributedSearchTestCase.java:794)
[junit4:junit4]    > 	at sun.reflect.NativeMethodAccessorImpl.invoke0(Native Method)
[junit4:junit4]    > 	at sun.reflect.NativeMethodAccessorImpl.invoke(NativeMethodAccessorImpl.java:57)
[junit4:junit4]    > 	at sun.reflect.DelegatingMethodAccessorImpl.invoke(DelegatingMethodAccessorImpl.java:43)
[junit4:junit4]    > 	at java.lang.reflect.Method.invoke(Method.java:601)
[junit4:junit4]    > 	at com.carrotsearch.randomizedtesting.RandomizedRunner.invoke(RandomizedRunner.java:1559)
[junit4:junit4]    > 	at com.carrotsearch.randomizedtesting.RandomizedRunner.access$600(RandomizedRunner.java:79)
[junit4:junit4]    > 	at com.carrotsearch.randomizedtesting.RandomizedRunner$6.evaluate(RandomizedRunner.java:737)
[junit4:junit4]    > 	at com.carrotsearch.randomizedtesting.RandomizedRunner$7.evaluate(RandomizedRunner.java:773)
[junit4:junit4]    > 	at com.carrotsearch.randomizedtesting.RandomizedRunner$8.evaluate(RandomizedRunner.java:787)
[junit4:junit4]    > 	at com.carrotsearch.randomizedtesting.rules.SystemPropertiesRestoreRule$1.evaluate(SystemPropertiesRestoreRule.java:53)
[junit4:junit4]    > 	at org.apache.lucene.util.TestRuleSetupTeardownChained$1.evaluate(TestRuleSetupTeardownChained.java:50)
[junit4:junit4]    > 	at org.apache.lucene.util.TestRuleFieldCacheSanity$1.evaluate(TestRuleFieldCacheSanity.java:51)
[junit4:junit4]    > 	at org.apache.lucene.util.AbstractBeforeAfterRule$1.evaluate(AbstractBeforeAfterRule.java:46)
[junit4:junit4]    > 	at com.carrotsearch.randomizedtesting.rules.SystemPropertiesInvariantRule$1.evaluate(SystemPropertiesInvariantRule.java:55)
[junit4:junit4]    > 	at org.apache.lucene.util.TestRuleThreadAndTestName$1.evaluate(TestRuleThreadAndTestName.java:49)
[junit4:junit4]    > 	at org.apache.lucene.util.TestRuleIgnoreAfterMaxFailures$1.evaluate(TestRuleIgnoreAfterMaxFailures.java:70)
[junit4:junit4]    > 	at org.apache.lucene.util.TestRuleMarkFailure$1.evaluate(TestRuleMarkFailure.java:48)
[junit4:junit4]    > 	at com.carrotsearch.randomizedtesting.rules.StatementAdapter.evaluate(StatementAdapter.java:36)
[junit4:junit4]    > 	at com.carrotsearch.randomizedtesting.ThreadLeakControl$StatementRunner.run(ThreadLeakControl.java:358)
[junit4:junit4]    > 	at com.carrotsearch.randomizedtesting.ThreadLeakControl.forkTimeoutingTask(ThreadLeakControl.java:782)
[junit4:junit4]    > 	at com.carrotsearch.randomizedtesting.ThreadLeakControl$3.evaluate(ThreadLeakControl.java:442)
[junit4:junit4]    > 	at com.carrotsearch.randomizedtesting.RandomizedRunner.runSingleTest(RandomizedRunner.java:746)
[junit4:junit4]    > 	at com.carrotsearch.randomizedtesting.RandomizedRunner$3.evaluate(RandomizedRunner.java:648)
[junit4:junit4]    > 	at com.carrotsearch.randomizedtesting.RandomizedRunner$4.evaluate(RandomizedRunner.java:682)
[junit4:junit4]    > 	at com.carrotsearch.randomizedtesting.RandomizedRunner$5.evaluate(RandomizedRunner.java:693)
[junit4:junit4]    > 	at com.carrotsearch.randomizedtesting.rules.StatementAdapter.evaluate(StatementAdapter.java:36)
[junit4:junit4]    > 	at com.carrotsearch.randomizedtesting.rules.SystemPropertiesRestoreRule$1.evaluate(SystemPropertiesRestoreRule.java:53)
[junit4:junit4]    > 	at org.apache.lucene.util.AbstractBeforeAfterRule$1.evaluate(AbstractBeforeAfterRule.java:46)
[junit4:junit4]    > 	at org.apache.lucene.util.TestRuleStoreClassName$1.evaluate(TestRuleStoreClassName.java:42)
[junit4:junit4]    > 	at com.carrotsearch.randomizedtesting.rules.SystemPropertiesInvariantRule$1.evaluate(SystemPropertiesInvariantRule.java:55)
[junit4:junit4]    > 	at com.carrotsearch.randomizedtesting.rules.NoShadowingOrOverridesOnMethodsRule$1.evaluate(NoShadowingOrOverridesOnMethodsRule.java:39)
[junit4:junit4]    > 	at com.carrotsearch.randomizedtesting.rules.NoShadowingOrOverridesOnMethodsRule$1.evaluate(NoShadowingOrOverridesOnMethodsRule.java:39)
[junit4:junit4]    > 	at com.carrotsearch.randomizedtesting.rules.StatementAdapter.evaluate(StatementAdapter.java:36)
[junit4:junit4]    > 	at org.apache.lucene.util.TestRuleAssertionsRequired$1.evaluate(TestRuleAssertionsRequired.java:43)
[junit4:junit4]    > 	at org.apache.lucene.util.TestRuleMarkFailure$1.evaluate(TestRuleMarkFailure.java:48)
[junit4:junit4]    > 	at org.apache.lucene.util.TestRuleIgnoreAfterMaxFailures$1.evaluate(TestRuleIgnoreAfterMaxFailures.java:70)
[junit4:junit4]    > 	at org.apache.lucene.util.TestRuleIgnoreTestSuites$1.evaluate(TestRuleIgnoreTestSuites.java:55)
[junit4:junit4]    > 	at com.carrotsearch.randomizedtesting.rules.StatementAdapter.evaluate(StatementAdapter.java:36)
[junit4:junit4]    > 	at com.carrotsearch.randomizedtesting.ThreadLeakControl$StatementRunner.run(ThreadLeakControl.java:358)
[junit4:junit4]    > 	at java.lang.Thread.run(Thread.java:722)
[junit4:junit4]   2> 125598 T2229 oas.SolrTestCaseJ4.deleteCore ###deleteCore
[junit4:junit4]   2> NOTE: test params are: codec=Asserting, sim=RandomSimilarityProvider(queryNorm=true,coord=no): {}, locale=sl_SI, timezone=Asia/Choibalsan
[junit4:junit4]   2> NOTE: FreeBSD 9.0-RELEASE amd64/Oracle Corporation 1.7.0_09 (64-bit)/cpus=16,threads=2,free=88325264,total=535822336
[junit4:junit4]   2> NOTE: All tests run in this JVM: [TestRangeQuery, CSVRequestHandlerTest, FastVectorHighlighterTest, NumericFieldsTest, BadComponentTest, OverseerCollectionProcessorTest, NotRequiredUniqueKeyTest, SystemInfoHandlerTest, MinimalSchemaTest, SimpleFacetsTest, TestFastWriter, IndexBasedSpellCheckerTest, DefaultValueUpdateProcessorTest, TestSuggestSpellingConverter, TestDocumentBuilder, JsonLoaderTest, CopyFieldTest, ClusterStateTest, SolrCoreCheckLockOnStartupTest, TestStressRecovery, TestCollationField, TestPseudoReturnFields, UniqFieldsUpdateProcessorFactoryTest, TestNumberUtils, DirectUpdateHandlerOptimizeTest, ShardRoutingCustomTest, SampleTest, TestReload, LeaderElectionIntegrationTest, TestFaceting, TestCoreContainer, DateMathParserTest, SimplePostToolTest, TestLMJelinekMercerSimilarityFactory, WordBreakSolrSpellCheckerTest, TestIBSimilarityFactory, TestIndexSearcher, FieldAnalysisRequestHandlerTest, MBeansHandlerTest, DistributedMLTComponentTest, SpellCheckComponentTest, SpatialFilterTest, TestLFUCache, CoreAdminHandlerTest, TestLMDirichletSimilarityFactory, TestBadConfig, DistanceFunctionTest, SpellCheckCollatorTest, DistributedSpellCheckComponentTest, TestConfig, TermVectorComponentDistributedTest, BasicDistributedZkTest, ResourceLoaderTest, TestJoin, SolrCmdDistributorTest, DistributedTermsComponentTest, JSONWriterTest, RequestHandlersTest, LeaderElectionTest, ZkControllerTest, TestRandomFaceting, TestMultiCoreConfBootstrap, LukeRequestHandlerTest, TestGroupingSearch, FileBasedSpellCheckerTest, QueryElevationComponentTest, SortByFunctionTest, BasicFunctionalityTest, SolrRequestParserTest, DirectSolrConnectionTest, TestRemoteStreaming, TestWordDelimiterFilterFactory, TestCSVResponseWriter, DocumentBuilderTest, CurrencyFieldTest, BinaryUpdateRequestHandlerTest, StandardRequestHandlerTest, TestPHPSerializedResponseWriter, XmlUpdateRequestHandlerTest, IndexSchemaRuntimeFieldTest, TestSolrQueryParser, TestValueSourceCache, DebugComponentTest, TestOmitPositions, TestArbitraryIndexDir, LoggingHandlerTest, TestSolrDeletionPolicy1, TestIndexingPerformance, FieldMutatingUpdateProcessorTest, TestBinaryField, SOLR749Test, TestPropInjectDefaults, TestXIncludeConfig, OutputWriterTest, TestJmxMonitoredMap, SpellPossibilityIteratorTest, TestPerFieldSimilarity, LegacyHTMLStripCharFilterTest, TimeZoneUtilsTest, PluginInfoTest, TestSystemIdResolver, TestSolrXMLSerializer, DateFieldTest, SpellingQueryConverterTest, DOMUtilTest, ZkNodePropsTest, PathHierarchyTokenizerFactoryTest, CollectionsAPIDistributedZkTest, SyncSliceTest]
[junit4:junit4] Completed on J0 in 125.63s, 1 test, 1 failure <<< FAILURES!

[...truncated 11 lines...]
BUILD FAILED
/usr/home/hudson/hudson-slave/workspace/Lucene-Solr-Tests-4.x-java7/build.xml:353: The following error occurred while executing this line:
/usr/home/hudson/hudson-slave/workspace/Lucene-Solr-Tests-4.x-java7/build.xml:39: The following error occurred while executing this line:
/usr/home/hudson/hudson-slave/workspace/Lucene-Solr-Tests-4.x-java7/solr/build.xml:178: The following error occurred while executing this line:
/usr/home/hudson/hudson-slave/workspace/Lucene-Solr-Tests-4.x-java7/solr/common-build.xml:438: The following error occurred while executing this line:
/usr/home/hudson/hudson-slave/workspace/Lucene-Solr-Tests-4.x-java7/lucene/common-build.xml:1175: The following error occurred while executing this line:
/usr/home/hudson/hudson-slave/workspace/Lucene-Solr-Tests-4.x-java7/lucene/common-build.xml:840: There were test failures: 244 suites, 1011 tests, 1 error, 1 failure, 21 ignored (3 assumptions)

Total time: 37 minutes 23 seconds
Build step 'Invoke Ant' marked build as failure
Archiving artifacts
Recording test results
Email was triggered for: Failure
Sending email for trigger: Failure



Mime
View raw message