lucene-dev mailing list archives

Site index · List index
Message view « Date » · « Thread »
Top « Date » · « Thread »
From Apache Jenkins Server <jenk...@builds.apache.org>
Subject [JENKINS] Lucene-Solr-NightlyTests-trunk - Build # 123 - Failure
Date Tue, 18 Dec 2012 21:08:46 GMT
Build: https://builds.apache.org/job/Lucene-Solr-NightlyTests-trunk/123/

47 tests failed.
FAILED:  junit.framework.TestSuite.org.apache.solr.AnalysisAfterCoreReloadTest

Error Message:
org.apache.solr.common.SolrException: Error Instantiating Update Handler, solr.DirectUpdateHandler2 failed to instantiate org.apache.solr.update.UpdateHandler

Stack Trace:
java.lang.RuntimeException: org.apache.solr.common.SolrException: Error Instantiating Update Handler, solr.DirectUpdateHandler2 failed to instantiate org.apache.solr.update.UpdateHandler
	at __randomizedtesting.SeedInfo.seed([8BADF50C402C6C84]:0)
	at org.apache.solr.util.TestHarness.<init>(TestHarness.java:137)
	at org.apache.solr.util.TestHarness.<init>(TestHarness.java:122)
	at org.apache.solr.util.TestHarness.<init>(TestHarness.java:112)
	at org.apache.solr.SolrTestCaseJ4.createCore(SolrTestCaseJ4.java:384)
	at org.apache.solr.SolrTestCaseJ4.initCore(SolrTestCaseJ4.java:376)
	at org.apache.solr.SolrTestCaseJ4.initCore(SolrTestCaseJ4.java:188)
	at org.apache.solr.AnalysisAfterCoreReloadTest.beforeClass(AnalysisAfterCoreReloadTest.java:48)
	at sun.reflect.NativeMethodAccessorImpl.invoke0(Native Method)
	at sun.reflect.NativeMethodAccessorImpl.invoke(NativeMethodAccessorImpl.java:57)
	at sun.reflect.DelegatingMethodAccessorImpl.invoke(DelegatingMethodAccessorImpl.java:43)
	at java.lang.reflect.Method.invoke(Method.java:616)
	at com.carrotsearch.randomizedtesting.RandomizedRunner.invoke(RandomizedRunner.java:1559)
	at com.carrotsearch.randomizedtesting.RandomizedRunner.access$600(RandomizedRunner.java:79)
	at com.carrotsearch.randomizedtesting.RandomizedRunner$4.evaluate(RandomizedRunner.java:677)
	at com.carrotsearch.randomizedtesting.RandomizedRunner$5.evaluate(RandomizedRunner.java:693)
	at com.carrotsearch.randomizedtesting.rules.StatementAdapter.evaluate(StatementAdapter.java:36)
	at com.carrotsearch.randomizedtesting.rules.SystemPropertiesRestoreRule$1.evaluate(SystemPropertiesRestoreRule.java:53)
	at org.apache.lucene.util.AbstractBeforeAfterRule$1.evaluate(AbstractBeforeAfterRule.java:46)
	at org.apache.lucene.util.TestRuleStoreClassName$1.evaluate(TestRuleStoreClassName.java:42)
	at com.carrotsearch.randomizedtesting.rules.SystemPropertiesInvariantRule$1.evaluate(SystemPropertiesInvariantRule.java:55)
	at com.carrotsearch.randomizedtesting.rules.NoShadowingOrOverridesOnMethodsRule$1.evaluate(NoShadowingOrOverridesOnMethodsRule.java:39)
	at com.carrotsearch.randomizedtesting.rules.NoShadowingOrOverridesOnMethodsRule$1.evaluate(NoShadowingOrOverridesOnMethodsRule.java:39)
	at com.carrotsearch.randomizedtesting.rules.StatementAdapter.evaluate(StatementAdapter.java:36)
	at org.apache.lucene.util.TestRuleAssertionsRequired$1.evaluate(TestRuleAssertionsRequired.java:43)
	at org.apache.lucene.util.TestRuleMarkFailure$1.evaluate(TestRuleMarkFailure.java:48)
	at org.apache.lucene.util.TestRuleIgnoreAfterMaxFailures$1.evaluate(TestRuleIgnoreAfterMaxFailures.java:70)
	at org.apache.lucene.util.TestRuleIgnoreTestSuites$1.evaluate(TestRuleIgnoreTestSuites.java:55)
	at com.carrotsearch.randomizedtesting.rules.StatementAdapter.evaluate(StatementAdapter.java:36)
	at com.carrotsearch.randomizedtesting.ThreadLeakControl$StatementRunner.run(ThreadLeakControl.java:358)
	at java.lang.Thread.run(Thread.java:679)
Caused by: org.apache.solr.common.SolrException: Error Instantiating Update Handler, solr.DirectUpdateHandler2 failed to instantiate org.apache.solr.update.UpdateHandler
	at org.apache.solr.core.SolrCore.<init>(SolrCore.java:789)
	at org.apache.solr.core.SolrCore.<init>(SolrCore.java:602)
	at org.apache.solr.util.TestHarness$Initializer.initialize(TestHarness.java:205)
	at org.apache.solr.util.TestHarness.<init>(TestHarness.java:128)
	... 29 more
Caused by: org.apache.solr.common.SolrException: Error Instantiating Update Handler, solr.DirectUpdateHandler2 failed to instantiate org.apache.solr.update.UpdateHandler
	at org.apache.solr.core.SolrCore.createInstance(SolrCore.java:526)
	at org.apache.solr.core.SolrCore.createUpdateHandler(SolrCore.java:580)
	at org.apache.solr.core.SolrCore.<init>(SolrCore.java:773)
	... 32 more
Caused by: java.lang.reflect.InvocationTargetException
	at sun.reflect.GeneratedConstructorAccessor119.newInstance(Unknown Source)
	at sun.reflect.DelegatingConstructorAccessorImpl.newInstance(DelegatingConstructorAccessorImpl.java:45)
	at java.lang.reflect.Constructor.newInstance(Constructor.java:532)
	at org.apache.solr.core.SolrCore.createInstance(SolrCore.java:512)
	... 34 more
Caused by: java.lang.NullPointerException
	at org.apache.solr.update.UpdateLog.getTlogDir(UpdateLog.java:1399)
	at org.apache.solr.update.UpdateHandler.clearLog(UpdateHandler.java:88)
	at org.apache.solr.update.UpdateHandler.<init>(UpdateHandler.java:127)
	at org.apache.solr.update.DirectUpdateHandler2.<init>(DirectUpdateHandler2.java:96)
	... 38 more


FAILED:  junit.framework.TestSuite.org.apache.solr.MinimalSchemaTest

Error Message:
org.apache.solr.common.SolrException: Error Instantiating Update Handler, solr.DirectUpdateHandler2 failed to instantiate org.apache.solr.update.UpdateHandler

Stack Trace:
java.lang.RuntimeException: org.apache.solr.common.SolrException: Error Instantiating Update Handler, solr.DirectUpdateHandler2 failed to instantiate org.apache.solr.update.UpdateHandler
	at __randomizedtesting.SeedInfo.seed([8BADF50C402C6C84]:0)
	at org.apache.solr.util.TestHarness.<init>(TestHarness.java:137)
	at org.apache.solr.util.TestHarness.<init>(TestHarness.java:122)
	at org.apache.solr.util.TestHarness.<init>(TestHarness.java:112)
	at org.apache.solr.SolrTestCaseJ4.createCore(SolrTestCaseJ4.java:384)
	at org.apache.solr.SolrTestCaseJ4.initCore(SolrTestCaseJ4.java:376)
	at org.apache.solr.SolrTestCaseJ4.initCore(SolrTestCaseJ4.java:188)
	at org.apache.solr.SolrTestCaseJ4.initCore(SolrTestCaseJ4.java:175)
	at org.apache.solr.MinimalSchemaTest.beforeClass(MinimalSchemaTest.java:40)
	at sun.reflect.NativeMethodAccessorImpl.invoke0(Native Method)
	at sun.reflect.NativeMethodAccessorImpl.invoke(NativeMethodAccessorImpl.java:57)
	at sun.reflect.DelegatingMethodAccessorImpl.invoke(DelegatingMethodAccessorImpl.java:43)
	at java.lang.reflect.Method.invoke(Method.java:616)
	at com.carrotsearch.randomizedtesting.RandomizedRunner.invoke(RandomizedRunner.java:1559)
	at com.carrotsearch.randomizedtesting.RandomizedRunner.access$600(RandomizedRunner.java:79)
	at com.carrotsearch.randomizedtesting.RandomizedRunner$4.evaluate(RandomizedRunner.java:677)
	at com.carrotsearch.randomizedtesting.RandomizedRunner$5.evaluate(RandomizedRunner.java:693)
	at com.carrotsearch.randomizedtesting.rules.StatementAdapter.evaluate(StatementAdapter.java:36)
	at com.carrotsearch.randomizedtesting.rules.SystemPropertiesRestoreRule$1.evaluate(SystemPropertiesRestoreRule.java:53)
	at org.apache.lucene.util.AbstractBeforeAfterRule$1.evaluate(AbstractBeforeAfterRule.java:46)
	at org.apache.lucene.util.TestRuleStoreClassName$1.evaluate(TestRuleStoreClassName.java:42)
	at com.carrotsearch.randomizedtesting.rules.SystemPropertiesInvariantRule$1.evaluate(SystemPropertiesInvariantRule.java:55)
	at com.carrotsearch.randomizedtesting.rules.NoShadowingOrOverridesOnMethodsRule$1.evaluate(NoShadowingOrOverridesOnMethodsRule.java:39)
	at com.carrotsearch.randomizedtesting.rules.NoShadowingOrOverridesOnMethodsRule$1.evaluate(NoShadowingOrOverridesOnMethodsRule.java:39)
	at com.carrotsearch.randomizedtesting.rules.StatementAdapter.evaluate(StatementAdapter.java:36)
	at org.apache.lucene.util.TestRuleAssertionsRequired$1.evaluate(TestRuleAssertionsRequired.java:43)
	at org.apache.lucene.util.TestRuleMarkFailure$1.evaluate(TestRuleMarkFailure.java:48)
	at org.apache.lucene.util.TestRuleIgnoreAfterMaxFailures$1.evaluate(TestRuleIgnoreAfterMaxFailures.java:70)
	at org.apache.lucene.util.TestRuleIgnoreTestSuites$1.evaluate(TestRuleIgnoreTestSuites.java:55)
	at com.carrotsearch.randomizedtesting.rules.StatementAdapter.evaluate(StatementAdapter.java:36)
	at com.carrotsearch.randomizedtesting.ThreadLeakControl$StatementRunner.run(ThreadLeakControl.java:358)
	at java.lang.Thread.run(Thread.java:679)
Caused by: org.apache.solr.common.SolrException: Error Instantiating Update Handler, solr.DirectUpdateHandler2 failed to instantiate org.apache.solr.update.UpdateHandler
	at org.apache.solr.core.SolrCore.<init>(SolrCore.java:789)
	at org.apache.solr.core.SolrCore.<init>(SolrCore.java:602)
	at org.apache.solr.util.TestHarness$Initializer.initialize(TestHarness.java:205)
	at org.apache.solr.util.TestHarness.<init>(TestHarness.java:128)
	... 30 more
Caused by: org.apache.solr.common.SolrException: Error Instantiating Update Handler, solr.DirectUpdateHandler2 failed to instantiate org.apache.solr.update.UpdateHandler
	at org.apache.solr.core.SolrCore.createInstance(SolrCore.java:526)
	at org.apache.solr.core.SolrCore.createUpdateHandler(SolrCore.java:580)
	at org.apache.solr.core.SolrCore.<init>(SolrCore.java:773)
	... 33 more
Caused by: java.lang.reflect.InvocationTargetException
	at sun.reflect.NativeConstructorAccessorImpl.newInstance0(Native Method)
	at sun.reflect.NativeConstructorAccessorImpl.newInstance(NativeConstructorAccessorImpl.java:57)
	at sun.reflect.DelegatingConstructorAccessorImpl.newInstance(DelegatingConstructorAccessorImpl.java:45)
	at java.lang.reflect.Constructor.newInstance(Constructor.java:532)
	at org.apache.solr.core.SolrCore.createInstance(SolrCore.java:512)
	... 35 more
Caused by: java.lang.NullPointerException
	at org.apache.solr.update.UpdateLog.getTlogDir(UpdateLog.java:1399)
	at org.apache.solr.update.UpdateHandler.clearLog(UpdateHandler.java:88)
	at org.apache.solr.update.UpdateHandler.<init>(UpdateHandler.java:127)
	at org.apache.solr.update.DirectUpdateHandler2.<init>(DirectUpdateHandler2.java:96)
	... 40 more


FAILED:  junit.framework.TestSuite.org.apache.solr.TestRandomFaceting

Error Message:
org.apache.solr.common.SolrException: Error Instantiating Update Handler, solr.DirectUpdateHandler2 failed to instantiate org.apache.solr.update.UpdateHandler

Stack Trace:
java.lang.RuntimeException: org.apache.solr.common.SolrException: Error Instantiating Update Handler, solr.DirectUpdateHandler2 failed to instantiate org.apache.solr.update.UpdateHandler
	at __randomizedtesting.SeedInfo.seed([8BADF50C402C6C84]:0)
	at org.apache.solr.util.TestHarness.<init>(TestHarness.java:137)
	at org.apache.solr.util.TestHarness.<init>(TestHarness.java:122)
	at org.apache.solr.util.TestHarness.<init>(TestHarness.java:112)
	at org.apache.solr.SolrTestCaseJ4.createCore(SolrTestCaseJ4.java:384)
	at org.apache.solr.SolrTestCaseJ4.initCore(SolrTestCaseJ4.java:376)
	at org.apache.solr.SolrTestCaseJ4.initCore(SolrTestCaseJ4.java:188)
	at org.apache.solr.SolrTestCaseJ4.initCore(SolrTestCaseJ4.java:175)
	at org.apache.solr.TestRandomFaceting.beforeTests(TestRandomFaceting.java:40)
	at sun.reflect.NativeMethodAccessorImpl.invoke0(Native Method)
	at sun.reflect.NativeMethodAccessorImpl.invoke(NativeMethodAccessorImpl.java:57)
	at sun.reflect.DelegatingMethodAccessorImpl.invoke(DelegatingMethodAccessorImpl.java:43)
	at java.lang.reflect.Method.invoke(Method.java:616)
	at com.carrotsearch.randomizedtesting.RandomizedRunner.invoke(RandomizedRunner.java:1559)
	at com.carrotsearch.randomizedtesting.RandomizedRunner.access$600(RandomizedRunner.java:79)
	at com.carrotsearch.randomizedtesting.RandomizedRunner$4.evaluate(RandomizedRunner.java:677)
	at com.carrotsearch.randomizedtesting.RandomizedRunner$5.evaluate(RandomizedRunner.java:693)
	at com.carrotsearch.randomizedtesting.rules.StatementAdapter.evaluate(StatementAdapter.java:36)
	at com.carrotsearch.randomizedtesting.rules.SystemPropertiesRestoreRule$1.evaluate(SystemPropertiesRestoreRule.java:53)
	at org.apache.lucene.util.AbstractBeforeAfterRule$1.evaluate(AbstractBeforeAfterRule.java:46)
	at org.apache.lucene.util.TestRuleStoreClassName$1.evaluate(TestRuleStoreClassName.java:42)
	at com.carrotsearch.randomizedtesting.rules.SystemPropertiesInvariantRule$1.evaluate(SystemPropertiesInvariantRule.java:55)
	at com.carrotsearch.randomizedtesting.rules.NoShadowingOrOverridesOnMethodsRule$1.evaluate(NoShadowingOrOverridesOnMethodsRule.java:39)
	at com.carrotsearch.randomizedtesting.rules.NoShadowingOrOverridesOnMethodsRule$1.evaluate(NoShadowingOrOverridesOnMethodsRule.java:39)
	at com.carrotsearch.randomizedtesting.rules.StatementAdapter.evaluate(StatementAdapter.java:36)
	at org.apache.lucene.util.TestRuleAssertionsRequired$1.evaluate(TestRuleAssertionsRequired.java:43)
	at org.apache.lucene.util.TestRuleMarkFailure$1.evaluate(TestRuleMarkFailure.java:48)
	at org.apache.lucene.util.TestRuleIgnoreAfterMaxFailures$1.evaluate(TestRuleIgnoreAfterMaxFailures.java:70)
	at org.apache.lucene.util.TestRuleIgnoreTestSuites$1.evaluate(TestRuleIgnoreTestSuites.java:55)
	at com.carrotsearch.randomizedtesting.rules.StatementAdapter.evaluate(StatementAdapter.java:36)
	at com.carrotsearch.randomizedtesting.ThreadLeakControl$StatementRunner.run(ThreadLeakControl.java:358)
	at java.lang.Thread.run(Thread.java:679)
Caused by: org.apache.solr.common.SolrException: Error Instantiating Update Handler, solr.DirectUpdateHandler2 failed to instantiate org.apache.solr.update.UpdateHandler
	at org.apache.solr.core.SolrCore.<init>(SolrCore.java:789)
	at org.apache.solr.core.SolrCore.<init>(SolrCore.java:602)
	at org.apache.solr.util.TestHarness$Initializer.initialize(TestHarness.java:205)
	at org.apache.solr.util.TestHarness.<init>(TestHarness.java:128)
	... 30 more
Caused by: org.apache.solr.common.SolrException: Error Instantiating Update Handler, solr.DirectUpdateHandler2 failed to instantiate org.apache.solr.update.UpdateHandler
	at org.apache.solr.core.SolrCore.createInstance(SolrCore.java:526)
	at org.apache.solr.core.SolrCore.createUpdateHandler(SolrCore.java:580)
	at org.apache.solr.core.SolrCore.<init>(SolrCore.java:773)
	... 33 more
Caused by: java.lang.reflect.InvocationTargetException
	at sun.reflect.NativeConstructorAccessorImpl.newInstance0(Native Method)
	at sun.reflect.NativeConstructorAccessorImpl.newInstance(NativeConstructorAccessorImpl.java:57)
	at sun.reflect.DelegatingConstructorAccessorImpl.newInstance(DelegatingConstructorAccessorImpl.java:45)
	at java.lang.reflect.Constructor.newInstance(Constructor.java:532)
	at org.apache.solr.core.SolrCore.createInstance(SolrCore.java:512)
	... 35 more
Caused by: java.lang.NullPointerException
	at org.apache.solr.update.UpdateLog.getTlogDir(UpdateLog.java:1399)
	at org.apache.solr.update.UpdateHandler.clearLog(UpdateHandler.java:88)
	at org.apache.solr.update.UpdateHandler.<init>(UpdateHandler.java:127)
	at org.apache.solr.update.DirectUpdateHandler2.<init>(DirectUpdateHandler2.java:96)
	... 40 more


FAILED:  junit.framework.TestSuite.org.apache.solr.analysis.PathHierarchyTokenizerFactoryTest

Error Message:
org.apache.solr.common.SolrException: Error Instantiating Update Handler, solr.DirectUpdateHandler2 failed to instantiate org.apache.solr.update.UpdateHandler

Stack Trace:
java.lang.RuntimeException: org.apache.solr.common.SolrException: Error Instantiating Update Handler, solr.DirectUpdateHandler2 failed to instantiate org.apache.solr.update.UpdateHandler
	at __randomizedtesting.SeedInfo.seed([8BADF50C402C6C84]:0)
	at org.apache.solr.util.TestHarness.<init>(TestHarness.java:137)
	at org.apache.solr.util.TestHarness.<init>(TestHarness.java:122)
	at org.apache.solr.util.TestHarness.<init>(TestHarness.java:112)
	at org.apache.solr.SolrTestCaseJ4.createCore(SolrTestCaseJ4.java:384)
	at org.apache.solr.SolrTestCaseJ4.initCore(SolrTestCaseJ4.java:376)
	at org.apache.solr.SolrTestCaseJ4.initCore(SolrTestCaseJ4.java:188)
	at org.apache.solr.SolrTestCaseJ4.initCore(SolrTestCaseJ4.java:175)
	at org.apache.solr.analysis.PathHierarchyTokenizerFactoryTest.beforeTests(PathHierarchyTokenizerFactoryTest.java:31)
	at sun.reflect.NativeMethodAccessorImpl.invoke0(Native Method)
	at sun.reflect.NativeMethodAccessorImpl.invoke(NativeMethodAccessorImpl.java:57)
	at sun.reflect.DelegatingMethodAccessorImpl.invoke(DelegatingMethodAccessorImpl.java:43)
	at java.lang.reflect.Method.invoke(Method.java:616)
	at com.carrotsearch.randomizedtesting.RandomizedRunner.invoke(RandomizedRunner.java:1559)
	at com.carrotsearch.randomizedtesting.RandomizedRunner.access$600(RandomizedRunner.java:79)
	at com.carrotsearch.randomizedtesting.RandomizedRunner$4.evaluate(RandomizedRunner.java:677)
	at com.carrotsearch.randomizedtesting.RandomizedRunner$5.evaluate(RandomizedRunner.java:693)
	at com.carrotsearch.randomizedtesting.rules.StatementAdapter.evaluate(StatementAdapter.java:36)
	at com.carrotsearch.randomizedtesting.rules.SystemPropertiesRestoreRule$1.evaluate(SystemPropertiesRestoreRule.java:53)
	at org.apache.lucene.util.AbstractBeforeAfterRule$1.evaluate(AbstractBeforeAfterRule.java:46)
	at org.apache.lucene.util.TestRuleStoreClassName$1.evaluate(TestRuleStoreClassName.java:42)
	at com.carrotsearch.randomizedtesting.rules.SystemPropertiesInvariantRule$1.evaluate(SystemPropertiesInvariantRule.java:55)
	at com.carrotsearch.randomizedtesting.rules.NoShadowingOrOverridesOnMethodsRule$1.evaluate(NoShadowingOrOverridesOnMethodsRule.java:39)
	at com.carrotsearch.randomizedtesting.rules.NoShadowingOrOverridesOnMethodsRule$1.evaluate(NoShadowingOrOverridesOnMethodsRule.java:39)
	at com.carrotsearch.randomizedtesting.rules.StatementAdapter.evaluate(StatementAdapter.java:36)
	at org.apache.lucene.util.TestRuleAssertionsRequired$1.evaluate(TestRuleAssertionsRequired.java:43)
	at org.apache.lucene.util.TestRuleMarkFailure$1.evaluate(TestRuleMarkFailure.java:48)
	at org.apache.lucene.util.TestRuleIgnoreAfterMaxFailures$1.evaluate(TestRuleIgnoreAfterMaxFailures.java:70)
	at org.apache.lucene.util.TestRuleIgnoreTestSuites$1.evaluate(TestRuleIgnoreTestSuites.java:55)
	at com.carrotsearch.randomizedtesting.rules.StatementAdapter.evaluate(StatementAdapter.java:36)
	at com.carrotsearch.randomizedtesting.ThreadLeakControl$StatementRunner.run(ThreadLeakControl.java:358)
	at java.lang.Thread.run(Thread.java:679)
Caused by: org.apache.solr.common.SolrException: Error Instantiating Update Handler, solr.DirectUpdateHandler2 failed to instantiate org.apache.solr.update.UpdateHandler
	at org.apache.solr.core.SolrCore.<init>(SolrCore.java:789)
	at org.apache.solr.core.SolrCore.<init>(SolrCore.java:602)
	at org.apache.solr.util.TestHarness$Initializer.initialize(TestHarness.java:205)
	at org.apache.solr.util.TestHarness.<init>(TestHarness.java:128)
	... 30 more
Caused by: org.apache.solr.common.SolrException: Error Instantiating Update Handler, solr.DirectUpdateHandler2 failed to instantiate org.apache.solr.update.UpdateHandler
	at org.apache.solr.core.SolrCore.createInstance(SolrCore.java:526)
	at org.apache.solr.core.SolrCore.createUpdateHandler(SolrCore.java:580)
	at org.apache.solr.core.SolrCore.<init>(SolrCore.java:773)
	... 33 more
Caused by: java.lang.reflect.InvocationTargetException
	at sun.reflect.GeneratedConstructorAccessor119.newInstance(Unknown Source)
	at sun.reflect.DelegatingConstructorAccessorImpl.newInstance(DelegatingConstructorAccessorImpl.java:45)
	at java.lang.reflect.Constructor.newInstance(Constructor.java:532)
	at org.apache.solr.core.SolrCore.createInstance(SolrCore.java:512)
	... 35 more
Caused by: java.lang.NullPointerException
	at org.apache.solr.update.UpdateLog.getTlogDir(UpdateLog.java:1399)
	at org.apache.solr.update.UpdateHandler.clearLog(UpdateHandler.java:88)
	at org.apache.solr.update.UpdateHandler.<init>(UpdateHandler.java:127)
	at org.apache.solr.update.DirectUpdateHandler2.<init>(DirectUpdateHandler2.java:96)
	... 39 more


FAILED:  junit.framework.TestSuite.org.apache.solr.analysis.TestCharFilters

Error Message:
org.apache.solr.common.SolrException: Error Instantiating Update Handler, org.apache.solr.update.DirectUpdateHandler2 failed to instantiate org.apache.solr.update.UpdateHandler

Stack Trace:
java.lang.RuntimeException: org.apache.solr.common.SolrException: Error Instantiating Update Handler, org.apache.solr.update.DirectUpdateHandler2 failed to instantiate org.apache.solr.update.UpdateHandler
	at __randomizedtesting.SeedInfo.seed([8BADF50C402C6C84]:0)
	at org.apache.solr.util.TestHarness.<init>(TestHarness.java:137)
	at org.apache.solr.util.TestHarness.<init>(TestHarness.java:122)
	at org.apache.solr.util.TestHarness.<init>(TestHarness.java:112)
	at org.apache.solr.SolrTestCaseJ4.createCore(SolrTestCaseJ4.java:384)
	at org.apache.solr.SolrTestCaseJ4.initCore(SolrTestCaseJ4.java:376)
	at org.apache.solr.SolrTestCaseJ4.initCore(SolrTestCaseJ4.java:188)
	at org.apache.solr.SolrTestCaseJ4.initCore(SolrTestCaseJ4.java:175)
	at org.apache.solr.analysis.TestCharFilters.beforeClass(TestCharFilters.java:31)
	at sun.reflect.NativeMethodAccessorImpl.invoke0(Native Method)
	at sun.reflect.NativeMethodAccessorImpl.invoke(NativeMethodAccessorImpl.java:57)
	at sun.reflect.DelegatingMethodAccessorImpl.invoke(DelegatingMethodAccessorImpl.java:43)
	at java.lang.reflect.Method.invoke(Method.java:616)
	at com.carrotsearch.randomizedtesting.RandomizedRunner.invoke(RandomizedRunner.java:1559)
	at com.carrotsearch.randomizedtesting.RandomizedRunner.access$600(RandomizedRunner.java:79)
	at com.carrotsearch.randomizedtesting.RandomizedRunner$4.evaluate(RandomizedRunner.java:677)
	at com.carrotsearch.randomizedtesting.RandomizedRunner$5.evaluate(RandomizedRunner.java:693)
	at com.carrotsearch.randomizedtesting.rules.StatementAdapter.evaluate(StatementAdapter.java:36)
	at com.carrotsearch.randomizedtesting.rules.SystemPropertiesRestoreRule$1.evaluate(SystemPropertiesRestoreRule.java:53)
	at org.apache.lucene.util.AbstractBeforeAfterRule$1.evaluate(AbstractBeforeAfterRule.java:46)
	at org.apache.lucene.util.TestRuleStoreClassName$1.evaluate(TestRuleStoreClassName.java:42)
	at com.carrotsearch.randomizedtesting.rules.SystemPropertiesInvariantRule$1.evaluate(SystemPropertiesInvariantRule.java:55)
	at com.carrotsearch.randomizedtesting.rules.NoShadowingOrOverridesOnMethodsRule$1.evaluate(NoShadowingOrOverridesOnMethodsRule.java:39)
	at com.carrotsearch.randomizedtesting.rules.NoShadowingOrOverridesOnMethodsRule$1.evaluate(NoShadowingOrOverridesOnMethodsRule.java:39)
	at com.carrotsearch.randomizedtesting.rules.StatementAdapter.evaluate(StatementAdapter.java:36)
	at org.apache.lucene.util.TestRuleAssertionsRequired$1.evaluate(TestRuleAssertionsRequired.java:43)
	at org.apache.lucene.util.TestRuleMarkFailure$1.evaluate(TestRuleMarkFailure.java:48)
	at org.apache.lucene.util.TestRuleIgnoreAfterMaxFailures$1.evaluate(TestRuleIgnoreAfterMaxFailures.java:70)
	at org.apache.lucene.util.TestRuleIgnoreTestSuites$1.evaluate(TestRuleIgnoreTestSuites.java:55)
	at com.carrotsearch.randomizedtesting.rules.StatementAdapter.evaluate(StatementAdapter.java:36)
	at com.carrotsearch.randomizedtesting.ThreadLeakControl$StatementRunner.run(ThreadLeakControl.java:358)
	at java.lang.Thread.run(Thread.java:679)
Caused by: org.apache.solr.common.SolrException: Error Instantiating Update Handler, org.apache.solr.update.DirectUpdateHandler2 failed to instantiate org.apache.solr.update.UpdateHandler
	at org.apache.solr.core.SolrCore.<init>(SolrCore.java:789)
	at org.apache.solr.core.SolrCore.<init>(SolrCore.java:602)
	at org.apache.solr.util.TestHarness$Initializer.initialize(TestHarness.java:205)
	at org.apache.solr.util.TestHarness.<init>(TestHarness.java:128)
	... 30 more
Caused by: org.apache.solr.common.SolrException: Error Instantiating Update Handler, org.apache.solr.update.DirectUpdateHandler2 failed to instantiate org.apache.solr.update.UpdateHandler
	at org.apache.solr.core.SolrCore.createInstance(SolrCore.java:526)
	at org.apache.solr.core.SolrCore.createUpdateHandler(SolrCore.java:580)
	at org.apache.solr.core.SolrCore.<init>(SolrCore.java:773)
	... 33 more
Caused by: java.lang.reflect.InvocationTargetException
	at sun.reflect.GeneratedConstructorAccessor119.newInstance(Unknown Source)
	at sun.reflect.DelegatingConstructorAccessorImpl.newInstance(DelegatingConstructorAccessorImpl.java:45)
	at java.lang.reflect.Constructor.newInstance(Constructor.java:532)
	at org.apache.solr.core.SolrCore.createInstance(SolrCore.java:512)
	... 35 more
Caused by: java.lang.NullPointerException
	at org.apache.solr.update.UpdateLog.getTlogDir(UpdateLog.java:1399)
	at org.apache.solr.update.UpdateHandler.clearLog(UpdateHandler.java:88)
	at org.apache.solr.update.UpdateHandler.<init>(UpdateHandler.java:127)
	at org.apache.solr.update.DirectUpdateHandler2.<init>(DirectUpdateHandler2.java:96)
	... 39 more


FAILED:  junit.framework.TestSuite.org.apache.solr.analysis.TestLuceneMatchVersion

Error Message:
org.apache.solr.common.SolrException: Error Instantiating Update Handler, solr.DirectUpdateHandler2 failed to instantiate org.apache.solr.update.UpdateHandler

Stack Trace:
java.lang.RuntimeException: org.apache.solr.common.SolrException: Error Instantiating Update Handler, solr.DirectUpdateHandler2 failed to instantiate org.apache.solr.update.UpdateHandler
	at __randomizedtesting.SeedInfo.seed([8BADF50C402C6C84]:0)
	at org.apache.solr.util.TestHarness.<init>(TestHarness.java:137)
	at org.apache.solr.util.TestHarness.<init>(TestHarness.java:122)
	at org.apache.solr.util.TestHarness.<init>(TestHarness.java:112)
	at org.apache.solr.SolrTestCaseJ4.createCore(SolrTestCaseJ4.java:384)
	at org.apache.solr.SolrTestCaseJ4.initCore(SolrTestCaseJ4.java:376)
	at org.apache.solr.SolrTestCaseJ4.initCore(SolrTestCaseJ4.java:188)
	at org.apache.solr.SolrTestCaseJ4.initCore(SolrTestCaseJ4.java:175)
	at org.apache.solr.analysis.TestLuceneMatchVersion.beforeClass(TestLuceneMatchVersion.java:38)
	at sun.reflect.NativeMethodAccessorImpl.invoke0(Native Method)
	at sun.reflect.NativeMethodAccessorImpl.invoke(NativeMethodAccessorImpl.java:57)
	at sun.reflect.DelegatingMethodAccessorImpl.invoke(DelegatingMethodAccessorImpl.java:43)
	at java.lang.reflect.Method.invoke(Method.java:616)
	at com.carrotsearch.randomizedtesting.RandomizedRunner.invoke(RandomizedRunner.java:1559)
	at com.carrotsearch.randomizedtesting.RandomizedRunner.access$600(RandomizedRunner.java:79)
	at com.carrotsearch.randomizedtesting.RandomizedRunner$4.evaluate(RandomizedRunner.java:677)
	at com.carrotsearch.randomizedtesting.RandomizedRunner$5.evaluate(RandomizedRunner.java:693)
	at com.carrotsearch.randomizedtesting.rules.StatementAdapter.evaluate(StatementAdapter.java:36)
	at com.carrotsearch.randomizedtesting.rules.SystemPropertiesRestoreRule$1.evaluate(SystemPropertiesRestoreRule.java:53)
	at org.apache.lucene.util.AbstractBeforeAfterRule$1.evaluate(AbstractBeforeAfterRule.java:46)
	at org.apache.lucene.util.TestRuleStoreClassName$1.evaluate(TestRuleStoreClassName.java:42)
	at com.carrotsearch.randomizedtesting.rules.SystemPropertiesInvariantRule$1.evaluate(SystemPropertiesInvariantRule.java:55)
	at com.carrotsearch.randomizedtesting.rules.NoShadowingOrOverridesOnMethodsRule$1.evaluate(NoShadowingOrOverridesOnMethodsRule.java:39)
	at com.carrotsearch.randomizedtesting.rules.NoShadowingOrOverridesOnMethodsRule$1.evaluate(NoShadowingOrOverridesOnMethodsRule.java:39)
	at com.carrotsearch.randomizedtesting.rules.StatementAdapter.evaluate(StatementAdapter.java:36)
	at org.apache.lucene.util.TestRuleAssertionsRequired$1.evaluate(TestRuleAssertionsRequired.java:43)
	at org.apache.lucene.util.TestRuleMarkFailure$1.evaluate(TestRuleMarkFailure.java:48)
	at org.apache.lucene.util.TestRuleIgnoreAfterMaxFailures$1.evaluate(TestRuleIgnoreAfterMaxFailures.java:70)
	at org.apache.lucene.util.TestRuleIgnoreTestSuites$1.evaluate(TestRuleIgnoreTestSuites.java:55)
	at com.carrotsearch.randomizedtesting.rules.StatementAdapter.evaluate(StatementAdapter.java:36)
	at com.carrotsearch.randomizedtesting.ThreadLeakControl$StatementRunner.run(ThreadLeakControl.java:358)
	at java.lang.Thread.run(Thread.java:679)
Caused by: org.apache.solr.common.SolrException: Error Instantiating Update Handler, solr.DirectUpdateHandler2 failed to instantiate org.apache.solr.update.UpdateHandler
	at org.apache.solr.core.SolrCore.<init>(SolrCore.java:789)
	at org.apache.solr.core.SolrCore.<init>(SolrCore.java:602)
	at org.apache.solr.util.TestHarness$Initializer.initialize(TestHarness.java:205)
	at org.apache.solr.util.TestHarness.<init>(TestHarness.java:128)
	... 30 more
Caused by: org.apache.solr.common.SolrException: Error Instantiating Update Handler, solr.DirectUpdateHandler2 failed to instantiate org.apache.solr.update.UpdateHandler
	at org.apache.solr.core.SolrCore.createInstance(SolrCore.java:526)
	at org.apache.solr.core.SolrCore.createUpdateHandler(SolrCore.java:580)
	at org.apache.solr.core.SolrCore.<init>(SolrCore.java:773)
	... 33 more
Caused by: java.lang.reflect.InvocationTargetException
	at sun.reflect.NativeConstructorAccessorImpl.newInstance0(Native Method)
	at sun.reflect.NativeConstructorAccessorImpl.newInstance(NativeConstructorAccessorImpl.java:57)
	at sun.reflect.DelegatingConstructorAccessorImpl.newInstance(DelegatingConstructorAccessorImpl.java:45)
	at java.lang.reflect.Constructor.newInstance(Constructor.java:532)
	at org.apache.solr.core.SolrCore.createInstance(SolrCore.java:512)
	... 35 more
Caused by: java.lang.NullPointerException
	at org.apache.solr.update.UpdateLog.getTlogDir(UpdateLog.java:1399)
	at org.apache.solr.update.UpdateHandler.clearLog(UpdateHandler.java:88)
	at org.apache.solr.update.UpdateHandler.<init>(UpdateHandler.java:127)
	at org.apache.solr.update.DirectUpdateHandler2.<init>(DirectUpdateHandler2.java:96)
	... 40 more


FAILED:  junit.framework.TestSuite.org.apache.solr.analysis.TestWordDelimiterFilterFactory

Error Message:
org.apache.solr.common.SolrException: Error Instantiating Update Handler, solr.DirectUpdateHandler2 failed to instantiate org.apache.solr.update.UpdateHandler

Stack Trace:
java.lang.RuntimeException: org.apache.solr.common.SolrException: Error Instantiating Update Handler, solr.DirectUpdateHandler2 failed to instantiate org.apache.solr.update.UpdateHandler
	at __randomizedtesting.SeedInfo.seed([8BADF50C402C6C84]:0)
	at org.apache.solr.util.TestHarness.<init>(TestHarness.java:137)
	at org.apache.solr.util.TestHarness.<init>(TestHarness.java:122)
	at org.apache.solr.util.TestHarness.<init>(TestHarness.java:112)
	at org.apache.solr.SolrTestCaseJ4.createCore(SolrTestCaseJ4.java:384)
	at org.apache.solr.SolrTestCaseJ4.initCore(SolrTestCaseJ4.java:376)
	at org.apache.solr.SolrTestCaseJ4.initCore(SolrTestCaseJ4.java:188)
	at org.apache.solr.SolrTestCaseJ4.initCore(SolrTestCaseJ4.java:175)
	at org.apache.solr.analysis.TestWordDelimiterFilterFactory.beforeClass(TestWordDelimiterFilterFactory.java:42)
	at sun.reflect.NativeMethodAccessorImpl.invoke0(Native Method)
	at sun.reflect.NativeMethodAccessorImpl.invoke(NativeMethodAccessorImpl.java:57)
	at sun.reflect.DelegatingMethodAccessorImpl.invoke(DelegatingMethodAccessorImpl.java:43)
	at java.lang.reflect.Method.invoke(Method.java:616)
	at com.carrotsearch.randomizedtesting.RandomizedRunner.invoke(RandomizedRunner.java:1559)
	at com.carrotsearch.randomizedtesting.RandomizedRunner.access$600(RandomizedRunner.java:79)
	at com.carrotsearch.randomizedtesting.RandomizedRunner$4.evaluate(RandomizedRunner.java:677)
	at com.carrotsearch.randomizedtesting.RandomizedRunner$5.evaluate(RandomizedRunner.java:693)
	at com.carrotsearch.randomizedtesting.rules.StatementAdapter.evaluate(StatementAdapter.java:36)
	at com.carrotsearch.randomizedtesting.rules.SystemPropertiesRestoreRule$1.evaluate(SystemPropertiesRestoreRule.java:53)
	at org.apache.lucene.util.AbstractBeforeAfterRule$1.evaluate(AbstractBeforeAfterRule.java:46)
	at org.apache.lucene.util.TestRuleStoreClassName$1.evaluate(TestRuleStoreClassName.java:42)
	at com.carrotsearch.randomizedtesting.rules.SystemPropertiesInvariantRule$1.evaluate(SystemPropertiesInvariantRule.java:55)
	at com.carrotsearch.randomizedtesting.rules.NoShadowingOrOverridesOnMethodsRule$1.evaluate(NoShadowingOrOverridesOnMethodsRule.java:39)
	at com.carrotsearch.randomizedtesting.rules.NoShadowingOrOverridesOnMethodsRule$1.evaluate(NoShadowingOrOverridesOnMethodsRule.java:39)
	at com.carrotsearch.randomizedtesting.rules.StatementAdapter.evaluate(StatementAdapter.java:36)
	at org.apache.lucene.util.TestRuleAssertionsRequired$1.evaluate(TestRuleAssertionsRequired.java:43)
	at org.apache.lucene.util.TestRuleMarkFailure$1.evaluate(TestRuleMarkFailure.java:48)
	at org.apache.lucene.util.TestRuleIgnoreAfterMaxFailures$1.evaluate(TestRuleIgnoreAfterMaxFailures.java:70)
	at org.apache.lucene.util.TestRuleIgnoreTestSuites$1.evaluate(TestRuleIgnoreTestSuites.java:55)
	at com.carrotsearch.randomizedtesting.rules.StatementAdapter.evaluate(StatementAdapter.java:36)
	at com.carrotsearch.randomizedtesting.ThreadLeakControl$StatementRunner.run(ThreadLeakControl.java:358)
	at java.lang.Thread.run(Thread.java:679)
Caused by: org.apache.solr.common.SolrException: Error Instantiating Update Handler, solr.DirectUpdateHandler2 failed to instantiate org.apache.solr.update.UpdateHandler
	at org.apache.solr.core.SolrCore.<init>(SolrCore.java:789)
	at org.apache.solr.core.SolrCore.<init>(SolrCore.java:602)
	at org.apache.solr.util.TestHarness$Initializer.initialize(TestHarness.java:205)
	at org.apache.solr.util.TestHarness.<init>(TestHarness.java:128)
	... 30 more
Caused by: org.apache.solr.common.SolrException: Error Instantiating Update Handler, solr.DirectUpdateHandler2 failed to instantiate org.apache.solr.update.UpdateHandler
	at org.apache.solr.core.SolrCore.createInstance(SolrCore.java:526)
	at org.apache.solr.core.SolrCore.createUpdateHandler(SolrCore.java:580)
	at org.apache.solr.core.SolrCore.<init>(SolrCore.java:773)
	... 33 more
Caused by: java.lang.reflect.InvocationTargetException
	at sun.reflect.GeneratedConstructorAccessor119.newInstance(Unknown Source)
	at sun.reflect.DelegatingConstructorAccessorImpl.newInstance(DelegatingConstructorAccessorImpl.java:45)
	at java.lang.reflect.Constructor.newInstance(Constructor.java:532)
	at org.apache.solr.core.SolrCore.createInstance(SolrCore.java:512)
	... 35 more
Caused by: java.lang.NullPointerException
	at org.apache.solr.update.UpdateLog.getTlogDir(UpdateLog.java:1399)
	at org.apache.solr.update.UpdateHandler.clearLog(UpdateHandler.java:88)
	at org.apache.solr.update.UpdateHandler.<init>(UpdateHandler.java:127)
	at org.apache.solr.update.DirectUpdateHandler2.<init>(DirectUpdateHandler2.java:96)
	... 39 more


FAILED:  junit.framework.TestSuite.org.apache.solr.cloud.BasicZkTest

Error Message:
org.apache.solr.common.SolrException: Error Instantiating Update Handler, solr.DirectUpdateHandler2 failed to instantiate org.apache.solr.update.UpdateHandler

Stack Trace:
java.lang.RuntimeException: org.apache.solr.common.SolrException: Error Instantiating Update Handler, solr.DirectUpdateHandler2 failed to instantiate org.apache.solr.update.UpdateHandler
	at __randomizedtesting.SeedInfo.seed([8BADF50C402C6C84]:0)
	at org.apache.solr.util.TestHarness.<init>(TestHarness.java:137)
	at org.apache.solr.util.TestHarness.<init>(TestHarness.java:122)
	at org.apache.solr.util.TestHarness.<init>(TestHarness.java:112)
	at org.apache.solr.SolrTestCaseJ4.createCore(SolrTestCaseJ4.java:384)
	at org.apache.solr.SolrTestCaseJ4.initCore(SolrTestCaseJ4.java:376)
	at org.apache.solr.SolrTestCaseJ4.initCore(SolrTestCaseJ4.java:188)
	at org.apache.solr.SolrTestCaseJ4.initCore(SolrTestCaseJ4.java:175)
	at org.apache.solr.cloud.AbstractZkTestCase.azt_beforeClass(AbstractZkTestCase.java:78)
	at sun.reflect.NativeMethodAccessorImpl.invoke0(Native Method)
	at sun.reflect.NativeMethodAccessorImpl.invoke(NativeMethodAccessorImpl.java:57)
	at sun.reflect.DelegatingMethodAccessorImpl.invoke(DelegatingMethodAccessorImpl.java:43)
	at java.lang.reflect.Method.invoke(Method.java:616)
	at com.carrotsearch.randomizedtesting.RandomizedRunner.invoke(RandomizedRunner.java:1559)
	at com.carrotsearch.randomizedtesting.RandomizedRunner.access$600(RandomizedRunner.java:79)
	at com.carrotsearch.randomizedtesting.RandomizedRunner$4.evaluate(RandomizedRunner.java:677)
	at com.carrotsearch.randomizedtesting.RandomizedRunner$5.evaluate(RandomizedRunner.java:693)
	at com.carrotsearch.randomizedtesting.rules.StatementAdapter.evaluate(StatementAdapter.java:36)
	at com.carrotsearch.randomizedtesting.rules.SystemPropertiesRestoreRule$1.evaluate(SystemPropertiesRestoreRule.java:53)
	at org.apache.lucene.util.AbstractBeforeAfterRule$1.evaluate(AbstractBeforeAfterRule.java:46)
	at org.apache.lucene.util.TestRuleStoreClassName$1.evaluate(TestRuleStoreClassName.java:42)
	at com.carrotsearch.randomizedtesting.rules.SystemPropertiesInvariantRule$1.evaluate(SystemPropertiesInvariantRule.java:55)
	at com.carrotsearch.randomizedtesting.rules.NoShadowingOrOverridesOnMethodsRule$1.evaluate(NoShadowingOrOverridesOnMethodsRule.java:39)
	at com.carrotsearch.randomizedtesting.rules.NoShadowingOrOverridesOnMethodsRule$1.evaluate(NoShadowingOrOverridesOnMethodsRule.java:39)
	at com.carrotsearch.randomizedtesting.rules.StatementAdapter.evaluate(StatementAdapter.java:36)
	at org.apache.lucene.util.TestRuleAssertionsRequired$1.evaluate(TestRuleAssertionsRequired.java:43)
	at org.apache.lucene.util.TestRuleMarkFailure$1.evaluate(TestRuleMarkFailure.java:48)
	at org.apache.lucene.util.TestRuleIgnoreAfterMaxFailures$1.evaluate(TestRuleIgnoreAfterMaxFailures.java:70)
	at org.apache.lucene.util.TestRuleIgnoreTestSuites$1.evaluate(TestRuleIgnoreTestSuites.java:55)
	at com.carrotsearch.randomizedtesting.rules.StatementAdapter.evaluate(StatementAdapter.java:36)
	at com.carrotsearch.randomizedtesting.ThreadLeakControl$StatementRunner.run(ThreadLeakControl.java:358)
	at java.lang.Thread.run(Thread.java:679)
Caused by: org.apache.solr.common.SolrException: Error Instantiating Update Handler, solr.DirectUpdateHandler2 failed to instantiate org.apache.solr.update.UpdateHandler
	at org.apache.solr.core.SolrCore.<init>(SolrCore.java:789)
	at org.apache.solr.core.SolrCore.<init>(SolrCore.java:602)
	at org.apache.solr.util.TestHarness$Initializer.initialize(TestHarness.java:205)
	at org.apache.solr.util.TestHarness.<init>(TestHarness.java:128)
	... 30 more
Caused by: org.apache.solr.common.SolrException: Error Instantiating Update Handler, solr.DirectUpdateHandler2 failed to instantiate org.apache.solr.update.UpdateHandler
	at org.apache.solr.core.SolrCore.createInstance(SolrCore.java:526)
	at org.apache.solr.core.SolrCore.createUpdateHandler(SolrCore.java:580)
	at org.apache.solr.core.SolrCore.<init>(SolrCore.java:773)
	... 33 more
Caused by: java.lang.reflect.InvocationTargetException
	at sun.reflect.NativeConstructorAccessorImpl.newInstance0(Native Method)
	at sun.reflect.NativeConstructorAccessorImpl.newInstance(NativeConstructorAccessorImpl.java:57)
	at sun.reflect.DelegatingConstructorAccessorImpl.newInstance(DelegatingConstructorAccessorImpl.java:45)
	at java.lang.reflect.Constructor.newInstance(Constructor.java:532)
	at org.apache.solr.core.SolrCore.createInstance(SolrCore.java:512)
	... 35 more
Caused by: java.lang.NullPointerException
	at org.apache.solr.update.UpdateLog.getTlogDir(UpdateLog.java:1399)
	at org.apache.solr.update.UpdateHandler.clearLog(UpdateHandler.java:88)
	at org.apache.solr.update.UpdateHandler.<init>(UpdateHandler.java:127)
	at org.apache.solr.update.DirectUpdateHandler2.<init>(DirectUpdateHandler2.java:96)
	... 40 more


FAILED:  junit.framework.TestSuite.org.apache.solr.cloud.BasicZkTest

Error Message:
ERROR: SolrZkClient opens=4 closes=3

Stack Trace:
java.lang.AssertionError: ERROR: SolrZkClient opens=4 closes=3
	at __randomizedtesting.SeedInfo.seed([8BADF50C402C6C84]:0)
	at org.junit.Assert.fail(Assert.java:93)
	at org.apache.solr.SolrTestCaseJ4.endTrackingZkClients(SolrTestCaseJ4.java:258)
	at org.apache.solr.SolrTestCaseJ4.afterClass(SolrTestCaseJ4.java:98)
	at sun.reflect.NativeMethodAccessorImpl.invoke0(Native Method)
	at sun.reflect.NativeMethodAccessorImpl.invoke(NativeMethodAccessorImpl.java:57)
	at sun.reflect.DelegatingMethodAccessorImpl.invoke(DelegatingMethodAccessorImpl.java:43)
	at java.lang.reflect.Method.invoke(Method.java:616)
	at com.carrotsearch.randomizedtesting.RandomizedRunner.invoke(RandomizedRunner.java:1559)
	at com.carrotsearch.randomizedtesting.RandomizedRunner.access$600(RandomizedRunner.java:79)
	at com.carrotsearch.randomizedtesting.RandomizedRunner$5.evaluate(RandomizedRunner.java:700)
	at com.carrotsearch.randomizedtesting.rules.StatementAdapter.evaluate(StatementAdapter.java:36)
	at com.carrotsearch.randomizedtesting.rules.SystemPropertiesRestoreRule$1.evaluate(SystemPropertiesRestoreRule.java:53)
	at org.apache.lucene.util.AbstractBeforeAfterRule$1.evaluate(AbstractBeforeAfterRule.java:46)
	at org.apache.lucene.util.TestRuleStoreClassName$1.evaluate(TestRuleStoreClassName.java:42)
	at com.carrotsearch.randomizedtesting.rules.SystemPropertiesInvariantRule$1.evaluate(SystemPropertiesInvariantRule.java:55)
	at com.carrotsearch.randomizedtesting.rules.NoShadowingOrOverridesOnMethodsRule$1.evaluate(NoShadowingOrOverridesOnMethodsRule.java:39)
	at com.carrotsearch.randomizedtesting.rules.NoShadowingOrOverridesOnMethodsRule$1.evaluate(NoShadowingOrOverridesOnMethodsRule.java:39)
	at com.carrotsearch.randomizedtesting.rules.StatementAdapter.evaluate(StatementAdapter.java:36)
	at org.apache.lucene.util.TestRuleAssertionsRequired$1.evaluate(TestRuleAssertionsRequired.java:43)
	at org.apache.lucene.util.TestRuleMarkFailure$1.evaluate(TestRuleMarkFailure.java:48)
	at org.apache.lucene.util.TestRuleIgnoreAfterMaxFailures$1.evaluate(TestRuleIgnoreAfterMaxFailures.java:70)
	at org.apache.lucene.util.TestRuleIgnoreTestSuites$1.evaluate(TestRuleIgnoreTestSuites.java:55)
	at com.carrotsearch.randomizedtesting.rules.StatementAdapter.evaluate(StatementAdapter.java:36)
	at com.carrotsearch.randomizedtesting.ThreadLeakControl$StatementRunner.run(ThreadLeakControl.java:358)
	at java.lang.Thread.run(Thread.java:679)


FAILED:  junit.framework.TestSuite.org.apache.solr.cloud.BasicZkTest

Error Message:
3 threads leaked from SUITE scope at org.apache.solr.cloud.BasicZkTest:     1) Thread[id=23, name=SUITE-BasicZkTest-seed#[8BADF50C402C6C84]-worker-EventThread, state=WAITING, group=TGRP-BasicZkTest]         at sun.misc.Unsafe.park(Native Method)         at java.util.concurrent.locks.LockSupport.park(LockSupport.java:186)         at java.util.concurrent.locks.AbstractQueuedSynchronizer$ConditionObject.await(AbstractQueuedSynchronizer.java:2043)         at java.util.concurrent.LinkedBlockingQueue.take(LinkedBlockingQueue.java:386)         at org.apache.zookeeper.ClientCnxn$EventThread.run(ClientCnxn.java:491)    2) Thread[id=24, name=Thread-2, state=TIMED_WAITING, group=Overseer state updater.]         at java.lang.Thread.sleep(Native Method)         at org.apache.solr.common.cloud.ZkCmdExecutor.retryDelay(ZkCmdExecutor.java:111)         at org.apache.solr.common.cloud.ZkCmdExecutor.retryOperation(ZkCmdExecutor.java:79)         at org.apache.solr.common.cloud.SolrZkClient.getData(SolrZkClient.java:250)         at org.apache.solr.cloud.Overseer$ClusterStateUpdater.amILeader(Overseer.java:200)         at org.apache.solr.cloud.Overseer$ClusterStateUpdater.run(Overseer.java:123)         at java.lang.Thread.run(Thread.java:679)    3) Thread[id=22, name=SUITE-BasicZkTest-seed#[8BADF50C402C6C84]-worker-SendThread(localhost:48793), state=RUNNABLE, group=TGRP-BasicZkTest]         at sun.nio.ch.KqueueArrayWrapper.kevent(Native Method)         at sun.nio.ch.KqueueArrayWrapper.poll(KqueueArrayWrapper.java:146)         at sun.nio.ch.KqueueSelectorImpl.doSelect(KqueueSelectorImpl.java:69)         at sun.nio.ch.SelectorImpl.lockAndDoSelect(SelectorImpl.java:87)         at sun.nio.ch.SelectorImpl.select(SelectorImpl.java:98)         at org.apache.zookeeper.ClientCnxnSocketNIO.doTransport(ClientCnxnSocketNIO.java:338)         at org.apache.zookeeper.ClientCnxn$SendThread.run(ClientCnxn.java:1068)

Stack Trace:
com.carrotsearch.randomizedtesting.ThreadLeakError: 3 threads leaked from SUITE scope at org.apache.solr.cloud.BasicZkTest: 
   1) Thread[id=23, name=SUITE-BasicZkTest-seed#[8BADF50C402C6C84]-worker-EventThread, state=WAITING, group=TGRP-BasicZkTest]
        at sun.misc.Unsafe.park(Native Method)
        at java.util.concurrent.locks.LockSupport.park(LockSupport.java:186)
        at java.util.concurrent.locks.AbstractQueuedSynchronizer$ConditionObject.await(AbstractQueuedSynchronizer.java:2043)
        at java.util.concurrent.LinkedBlockingQueue.take(LinkedBlockingQueue.java:386)
        at org.apache.zookeeper.ClientCnxn$EventThread.run(ClientCnxn.java:491)
   2) Thread[id=24, name=Thread-2, state=TIMED_WAITING, group=Overseer state updater.]
        at java.lang.Thread.sleep(Native Method)
        at org.apache.solr.common.cloud.ZkCmdExecutor.retryDelay(ZkCmdExecutor.java:111)
        at org.apache.solr.common.cloud.ZkCmdExecutor.retryOperation(ZkCmdExecutor.java:79)
        at org.apache.solr.common.cloud.SolrZkClient.getData(SolrZkClient.java:250)
        at org.apache.solr.cloud.Overseer$ClusterStateUpdater.amILeader(Overseer.java:200)
        at org.apache.solr.cloud.Overseer$ClusterStateUpdater.run(Overseer.java:123)
        at java.lang.Thread.run(Thread.java:679)
   3) Thread[id=22, name=SUITE-BasicZkTest-seed#[8BADF50C402C6C84]-worker-SendThread(localhost:48793), state=RUNNABLE, group=TGRP-BasicZkTest]
        at sun.nio.ch.KqueueArrayWrapper.kevent(Native Method)
        at sun.nio.ch.KqueueArrayWrapper.poll(KqueueArrayWrapper.java:146)
        at sun.nio.ch.KqueueSelectorImpl.doSelect(KqueueSelectorImpl.java:69)
        at sun.nio.ch.SelectorImpl.lockAndDoSelect(SelectorImpl.java:87)
        at sun.nio.ch.SelectorImpl.select(SelectorImpl.java:98)
        at org.apache.zookeeper.ClientCnxnSocketNIO.doTransport(ClientCnxnSocketNIO.java:338)
        at org.apache.zookeeper.ClientCnxn$SendThread.run(ClientCnxn.java:1068)
	at __randomizedtesting.SeedInfo.seed([8BADF50C402C6C84]:0)


FAILED:  junit.framework.TestSuite.org.apache.solr.cloud.BasicZkTest

Error Message:
There are still zombie threads that couldn't be terminated:    1) Thread[id=22, name=SUITE-BasicZkTest-seed#[8BADF50C402C6C84]-worker-SendThread(localhost:48793), state=RUNNABLE, group=TGRP-BasicZkTest]         at sun.nio.ch.KqueueArrayWrapper.interrupt(Native Method)         at sun.nio.ch.KqueueArrayWrapper.interrupt(KqueueArrayWrapper.java:206)         at sun.nio.ch.KqueueSelectorImpl.wakeup(KqueueSelectorImpl.java:194)         at java.nio.channels.spi.AbstractSelector$1.interrupt(AbstractSelector.java:210)         at java.nio.channels.spi.AbstractSelector.begin(AbstractSelector.java:215)         at sun.nio.ch.KqueueSelectorImpl.doSelect(KqueueSelectorImpl.java:68)         at sun.nio.ch.SelectorImpl.lockAndDoSelect(SelectorImpl.java:87)         at sun.nio.ch.SelectorImpl.select(SelectorImpl.java:98)         at org.apache.zookeeper.ClientCnxnSocketNIO.doTransport(ClientCnxnSocketNIO.java:338)         at org.apache.zookeeper.ClientCnxn$SendThread.run(ClientCnxn.java:1068)

Stack Trace:
com.carrotsearch.randomizedtesting.ThreadLeakError: There are still zombie threads that couldn't be terminated:
   1) Thread[id=22, name=SUITE-BasicZkTest-seed#[8BADF50C402C6C84]-worker-SendThread(localhost:48793), state=RUNNABLE, group=TGRP-BasicZkTest]
        at sun.nio.ch.KqueueArrayWrapper.interrupt(Native Method)
        at sun.nio.ch.KqueueArrayWrapper.interrupt(KqueueArrayWrapper.java:206)
        at sun.nio.ch.KqueueSelectorImpl.wakeup(KqueueSelectorImpl.java:194)
        at java.nio.channels.spi.AbstractSelector$1.interrupt(AbstractSelector.java:210)
        at java.nio.channels.spi.AbstractSelector.begin(AbstractSelector.java:215)
        at sun.nio.ch.KqueueSelectorImpl.doSelect(KqueueSelectorImpl.java:68)
        at sun.nio.ch.SelectorImpl.lockAndDoSelect(SelectorImpl.java:87)
        at sun.nio.ch.SelectorImpl.select(SelectorImpl.java:98)
        at org.apache.zookeeper.ClientCnxnSocketNIO.doTransport(ClientCnxnSocketNIO.java:338)
        at org.apache.zookeeper.ClientCnxn$SendThread.run(ClientCnxn.java:1068)
	at __randomizedtesting.SeedInfo.seed([8BADF50C402C6C84]:0)


FAILED:  junit.framework.TestSuite.org.apache.solr.core.TestXIncludeConfig

Error Message:
org.apache.solr.common.SolrException: Error Instantiating Update Handler, org.apache.solr.update.DirectUpdateHandler2 failed to instantiate org.apache.solr.update.UpdateHandler

Stack Trace:
java.lang.RuntimeException: org.apache.solr.common.SolrException: Error Instantiating Update Handler, org.apache.solr.update.DirectUpdateHandler2 failed to instantiate org.apache.solr.update.UpdateHandler
	at __randomizedtesting.SeedInfo.seed([8BADF50C402C6C84]:0)
	at org.apache.solr.util.TestHarness.<init>(TestHarness.java:137)
	at org.apache.solr.util.TestHarness.<init>(TestHarness.java:122)
	at org.apache.solr.util.TestHarness.<init>(TestHarness.java:112)
	at org.apache.solr.SolrTestCaseJ4.createCore(SolrTestCaseJ4.java:384)
	at org.apache.solr.SolrTestCaseJ4.initCore(SolrTestCaseJ4.java:376)
	at org.apache.solr.SolrTestCaseJ4.initCore(SolrTestCaseJ4.java:188)
	at org.apache.solr.SolrTestCaseJ4.initCore(SolrTestCaseJ4.java:175)
	at org.apache.solr.core.TestXIncludeConfig.beforeClass(TestXIncludeConfig.java:32)
	at sun.reflect.NativeMethodAccessorImpl.invoke0(Native Method)
	at sun.reflect.NativeMethodAccessorImpl.invoke(NativeMethodAccessorImpl.java:57)
	at sun.reflect.DelegatingMethodAccessorImpl.invoke(DelegatingMethodAccessorImpl.java:43)
	at java.lang.reflect.Method.invoke(Method.java:616)
	at com.carrotsearch.randomizedtesting.RandomizedRunner.invoke(RandomizedRunner.java:1559)
	at com.carrotsearch.randomizedtesting.RandomizedRunner.access$600(RandomizedRunner.java:79)
	at com.carrotsearch.randomizedtesting.RandomizedRunner$4.evaluate(RandomizedRunner.java:677)
	at com.carrotsearch.randomizedtesting.RandomizedRunner$5.evaluate(RandomizedRunner.java:693)
	at com.carrotsearch.randomizedtesting.rules.StatementAdapter.evaluate(StatementAdapter.java:36)
	at com.carrotsearch.randomizedtesting.rules.SystemPropertiesRestoreRule$1.evaluate(SystemPropertiesRestoreRule.java:53)
	at org.apache.lucene.util.AbstractBeforeAfterRule$1.evaluate(AbstractBeforeAfterRule.java:46)
	at org.apache.lucene.util.TestRuleStoreClassName$1.evaluate(TestRuleStoreClassName.java:42)
	at com.carrotsearch.randomizedtesting.rules.SystemPropertiesInvariantRule$1.evaluate(SystemPropertiesInvariantRule.java:55)
	at com.carrotsearch.randomizedtesting.rules.NoShadowingOrOverridesOnMethodsRule$1.evaluate(NoShadowingOrOverridesOnMethodsRule.java:39)
	at com.carrotsearch.randomizedtesting.rules.NoShadowingOrOverridesOnMethodsRule$1.evaluate(NoShadowingOrOverridesOnMethodsRule.java:39)
	at com.carrotsearch.randomizedtesting.rules.StatementAdapter.evaluate(StatementAdapter.java:36)
	at org.apache.lucene.util.TestRuleAssertionsRequired$1.evaluate(TestRuleAssertionsRequired.java:43)
	at org.apache.lucene.util.TestRuleMarkFailure$1.evaluate(TestRuleMarkFailure.java:48)
	at org.apache.lucene.util.TestRuleIgnoreAfterMaxFailures$1.evaluate(TestRuleIgnoreAfterMaxFailures.java:70)
	at org.apache.lucene.util.TestRuleIgnoreTestSuites$1.evaluate(TestRuleIgnoreTestSuites.java:55)
	at com.carrotsearch.randomizedtesting.rules.StatementAdapter.evaluate(StatementAdapter.java:36)
	at com.carrotsearch.randomizedtesting.ThreadLeakControl$StatementRunner.run(ThreadLeakControl.java:358)
	at java.lang.Thread.run(Thread.java:679)
Caused by: org.apache.solr.common.SolrException: Error Instantiating Update Handler, org.apache.solr.update.DirectUpdateHandler2 failed to instantiate org.apache.solr.update.UpdateHandler
	at org.apache.solr.core.SolrCore.<init>(SolrCore.java:789)
	at org.apache.solr.core.SolrCore.<init>(SolrCore.java:602)
	at org.apache.solr.util.TestHarness$Initializer.initialize(TestHarness.java:205)
	at org.apache.solr.util.TestHarness.<init>(TestHarness.java:128)
	... 30 more
Caused by: org.apache.solr.common.SolrException: Error Instantiating Update Handler, org.apache.solr.update.DirectUpdateHandler2 failed to instantiate org.apache.solr.update.UpdateHandler
	at org.apache.solr.core.SolrCore.createInstance(SolrCore.java:526)
	at org.apache.solr.core.SolrCore.createUpdateHandler(SolrCore.java:580)
	at org.apache.solr.core.SolrCore.<init>(SolrCore.java:773)
	... 33 more
Caused by: java.lang.reflect.InvocationTargetException
	at sun.reflect.GeneratedConstructorAccessor119.newInstance(Unknown Source)
	at sun.reflect.DelegatingConstructorAccessorImpl.newInstance(DelegatingConstructorAccessorImpl.java:45)
	at java.lang.reflect.Constructor.newInstance(Constructor.java:532)
	at org.apache.solr.core.SolrCore.createInstance(SolrCore.java:512)
	... 35 more
Caused by: java.lang.NullPointerException
	at org.apache.solr.update.UpdateLog.getTlogDir(UpdateLog.java:1399)
	at org.apache.solr.update.UpdateHandler.clearLog(UpdateHandler.java:88)
	at org.apache.solr.update.UpdateHandler.<init>(UpdateHandler.java:127)
	at org.apache.solr.update.DirectUpdateHandler2.<init>(DirectUpdateHandler2.java:96)
	... 39 more


FAILED:  junit.framework.TestSuite.org.apache.solr.handler.BinaryUpdateRequestHandlerTest

Error Message:
org.apache.solr.common.SolrException: Error Instantiating Update Handler, solr.DirectUpdateHandler2 failed to instantiate org.apache.solr.update.UpdateHandler

Stack Trace:
java.lang.RuntimeException: org.apache.solr.common.SolrException: Error Instantiating Update Handler, solr.DirectUpdateHandler2 failed to instantiate org.apache.solr.update.UpdateHandler
	at __randomizedtesting.SeedInfo.seed([8BADF50C402C6C84]:0)
	at org.apache.solr.util.TestHarness.<init>(TestHarness.java:137)
	at org.apache.solr.util.TestHarness.<init>(TestHarness.java:122)
	at org.apache.solr.util.TestHarness.<init>(TestHarness.java:112)
	at org.apache.solr.SolrTestCaseJ4.createCore(SolrTestCaseJ4.java:384)
	at org.apache.solr.SolrTestCaseJ4.initCore(SolrTestCaseJ4.java:376)
	at org.apache.solr.SolrTestCaseJ4.initCore(SolrTestCaseJ4.java:188)
	at org.apache.solr.SolrTestCaseJ4.initCore(SolrTestCaseJ4.java:175)
	at org.apache.solr.handler.BinaryUpdateRequestHandlerTest.beforeTests(BinaryUpdateRequestHandlerTest.java:37)
	at sun.reflect.NativeMethodAccessorImpl.invoke0(Native Method)
	at sun.reflect.NativeMethodAccessorImpl.invoke(NativeMethodAccessorImpl.java:57)
	at sun.reflect.DelegatingMethodAccessorImpl.invoke(DelegatingMethodAccessorImpl.java:43)
	at java.lang.reflect.Method.invoke(Method.java:616)
	at com.carrotsearch.randomizedtesting.RandomizedRunner.invoke(RandomizedRunner.java:1559)
	at com.carrotsearch.randomizedtesting.RandomizedRunner.access$600(RandomizedRunner.java:79)
	at com.carrotsearch.randomizedtesting.RandomizedRunner$4.evaluate(RandomizedRunner.java:677)
	at com.carrotsearch.randomizedtesting.RandomizedRunner$5.evaluate(RandomizedRunner.java:693)
	at com.carrotsearch.randomizedtesting.rules.StatementAdapter.evaluate(StatementAdapter.java:36)
	at com.carrotsearch.randomizedtesting.rules.SystemPropertiesRestoreRule$1.evaluate(SystemPropertiesRestoreRule.java:53)
	at org.apache.lucene.util.AbstractBeforeAfterRule$1.evaluate(AbstractBeforeAfterRule.java:46)
	at org.apache.lucene.util.TestRuleStoreClassName$1.evaluate(TestRuleStoreClassName.java:42)
	at com.carrotsearch.randomizedtesting.rules.SystemPropertiesInvariantRule$1.evaluate(SystemPropertiesInvariantRule.java:55)
	at com.carrotsearch.randomizedtesting.rules.NoShadowingOrOverridesOnMethodsRule$1.evaluate(NoShadowingOrOverridesOnMethodsRule.java:39)
	at com.carrotsearch.randomizedtesting.rules.NoShadowingOrOverridesOnMethodsRule$1.evaluate(NoShadowingOrOverridesOnMethodsRule.java:39)
	at com.carrotsearch.randomizedtesting.rules.StatementAdapter.evaluate(StatementAdapter.java:36)
	at org.apache.lucene.util.TestRuleAssertionsRequired$1.evaluate(TestRuleAssertionsRequired.java:43)
	at org.apache.lucene.util.TestRuleMarkFailure$1.evaluate(TestRuleMarkFailure.java:48)
	at org.apache.lucene.util.TestRuleIgnoreAfterMaxFailures$1.evaluate(TestRuleIgnoreAfterMaxFailures.java:70)
	at org.apache.lucene.util.TestRuleIgnoreTestSuites$1.evaluate(TestRuleIgnoreTestSuites.java:55)
	at com.carrotsearch.randomizedtesting.rules.StatementAdapter.evaluate(StatementAdapter.java:36)
	at com.carrotsearch.randomizedtesting.ThreadLeakControl$StatementRunner.run(ThreadLeakControl.java:358)
	at java.lang.Thread.run(Thread.java:679)
Caused by: org.apache.solr.common.SolrException: Error Instantiating Update Handler, solr.DirectUpdateHandler2 failed to instantiate org.apache.solr.update.UpdateHandler
	at org.apache.solr.core.SolrCore.<init>(SolrCore.java:789)
	at org.apache.solr.core.SolrCore.<init>(SolrCore.java:602)
	at org.apache.solr.util.TestHarness$Initializer.initialize(TestHarness.java:205)
	at org.apache.solr.util.TestHarness.<init>(TestHarness.java:128)
	... 30 more
Caused by: org.apache.solr.common.SolrException: Error Instantiating Update Handler, solr.DirectUpdateHandler2 failed to instantiate org.apache.solr.update.UpdateHandler
	at org.apache.solr.core.SolrCore.createInstance(SolrCore.java:526)
	at org.apache.solr.core.SolrCore.createUpdateHandler(SolrCore.java:580)
	at org.apache.solr.core.SolrCore.<init>(SolrCore.java:773)
	... 33 more
Caused by: java.lang.reflect.InvocationTargetException
	at sun.reflect.GeneratedConstructorAccessor119.newInstance(Unknown Source)
	at sun.reflect.DelegatingConstructorAccessorImpl.newInstance(DelegatingConstructorAccessorImpl.java:45)
	at java.lang.reflect.Constructor.newInstance(Constructor.java:532)
	at org.apache.solr.core.SolrCore.createInstance(SolrCore.java:512)
	... 35 more
Caused by: java.lang.NullPointerException
	at org.apache.solr.update.UpdateLog.getTlogDir(UpdateLog.java:1399)
	at org.apache.solr.update.UpdateHandler.clearLog(UpdateHandler.java:88)
	at org.apache.solr.update.UpdateHandler.<init>(UpdateHandler.java:127)
	at org.apache.solr.update.DirectUpdateHandler2.<init>(DirectUpdateHandler2.java:96)
	... 39 more


FAILED:  junit.framework.TestSuite.org.apache.solr.handler.admin.LoggingHandlerTest

Error Message:
org.apache.solr.common.SolrException: Error Instantiating Update Handler, solr.DirectUpdateHandler2 failed to instantiate org.apache.solr.update.UpdateHandler

Stack Trace:
java.lang.RuntimeException: org.apache.solr.common.SolrException: Error Instantiating Update Handler, solr.DirectUpdateHandler2 failed to instantiate org.apache.solr.update.UpdateHandler
	at __randomizedtesting.SeedInfo.seed([8BADF50C402C6C84]:0)
	at org.apache.solr.util.TestHarness.<init>(TestHarness.java:137)
	at org.apache.solr.util.TestHarness.<init>(TestHarness.java:122)
	at org.apache.solr.util.TestHarness.<init>(TestHarness.java:112)
	at org.apache.solr.SolrTestCaseJ4.createCore(SolrTestCaseJ4.java:384)
	at org.apache.solr.SolrTestCaseJ4.initCore(SolrTestCaseJ4.java:376)
	at org.apache.solr.SolrTestCaseJ4.initCore(SolrTestCaseJ4.java:188)
	at org.apache.solr.SolrTestCaseJ4.initCore(SolrTestCaseJ4.java:175)
	at org.apache.solr.handler.admin.LoggingHandlerTest.beforeClass(LoggingHandlerTest.java:32)
	at sun.reflect.NativeMethodAccessorImpl.invoke0(Native Method)
	at sun.reflect.NativeMethodAccessorImpl.invoke(NativeMethodAccessorImpl.java:57)
	at sun.reflect.DelegatingMethodAccessorImpl.invoke(DelegatingMethodAccessorImpl.java:43)
	at java.lang.reflect.Method.invoke(Method.java:616)
	at com.carrotsearch.randomizedtesting.RandomizedRunner.invoke(RandomizedRunner.java:1559)
	at com.carrotsearch.randomizedtesting.RandomizedRunner.access$600(RandomizedRunner.java:79)
	at com.carrotsearch.randomizedtesting.RandomizedRunner$4.evaluate(RandomizedRunner.java:677)
	at com.carrotsearch.randomizedtesting.RandomizedRunner$5.evaluate(RandomizedRunner.java:693)
	at com.carrotsearch.randomizedtesting.rules.StatementAdapter.evaluate(StatementAdapter.java:36)
	at com.carrotsearch.randomizedtesting.rules.SystemPropertiesRestoreRule$1.evaluate(SystemPropertiesRestoreRule.java:53)
	at org.apache.lucene.util.AbstractBeforeAfterRule$1.evaluate(AbstractBeforeAfterRule.java:46)
	at org.apache.lucene.util.TestRuleStoreClassName$1.evaluate(TestRuleStoreClassName.java:42)
	at com.carrotsearch.randomizedtesting.rules.SystemPropertiesInvariantRule$1.evaluate(SystemPropertiesInvariantRule.java:55)
	at com.carrotsearch.randomizedtesting.rules.NoShadowingOrOverridesOnMethodsRule$1.evaluate(NoShadowingOrOverridesOnMethodsRule.java:39)
	at com.carrotsearch.randomizedtesting.rules.NoShadowingOrOverridesOnMethodsRule$1.evaluate(NoShadowingOrOverridesOnMethodsRule.java:39)
	at com.carrotsearch.randomizedtesting.rules.StatementAdapter.evaluate(StatementAdapter.java:36)
	at org.apache.lucene.util.TestRuleAssertionsRequired$1.evaluate(TestRuleAssertionsRequired.java:43)
	at org.apache.lucene.util.TestRuleMarkFailure$1.evaluate(TestRuleMarkFailure.java:48)
	at org.apache.lucene.util.TestRuleIgnoreAfterMaxFailures$1.evaluate(TestRuleIgnoreAfterMaxFailures.java:70)
	at org.apache.lucene.util.TestRuleIgnoreTestSuites$1.evaluate(TestRuleIgnoreTestSuites.java:55)
	at com.carrotsearch.randomizedtesting.rules.StatementAdapter.evaluate(StatementAdapter.java:36)
	at com.carrotsearch.randomizedtesting.ThreadLeakControl$StatementRunner.run(ThreadLeakControl.java:358)
	at java.lang.Thread.run(Thread.java:679)
Caused by: org.apache.solr.common.SolrException: Error Instantiating Update Handler, solr.DirectUpdateHandler2 failed to instantiate org.apache.solr.update.UpdateHandler
	at org.apache.solr.core.SolrCore.<init>(SolrCore.java:789)
	at org.apache.solr.core.SolrCore.<init>(SolrCore.java:602)
	at org.apache.solr.util.TestHarness$Initializer.initialize(TestHarness.java:205)
	at org.apache.solr.util.TestHarness.<init>(TestHarness.java:128)
	... 30 more
Caused by: org.apache.solr.common.SolrException: Error Instantiating Update Handler, solr.DirectUpdateHandler2 failed to instantiate org.apache.solr.update.UpdateHandler
	at org.apache.solr.core.SolrCore.createInstance(SolrCore.java:526)
	at org.apache.solr.core.SolrCore.createUpdateHandler(SolrCore.java:580)
	at org.apache.solr.core.SolrCore.<init>(SolrCore.java:773)
	... 33 more
Caused by: java.lang.reflect.InvocationTargetException
	at sun.reflect.GeneratedConstructorAccessor119.newInstance(Unknown Source)
	at sun.reflect.DelegatingConstructorAccessorImpl.newInstance(DelegatingConstructorAccessorImpl.java:45)
	at java.lang.reflect.Constructor.newInstance(Constructor.java:532)
	at org.apache.solr.core.SolrCore.createInstance(SolrCore.java:512)
	... 35 more
Caused by: java.lang.NullPointerException
	at org.apache.solr.update.UpdateLog.getTlogDir(UpdateLog.java:1399)
	at org.apache.solr.update.UpdateHandler.clearLog(UpdateHandler.java:88)
	at org.apache.solr.update.UpdateHandler.<init>(UpdateHandler.java:127)
	at org.apache.solr.update.DirectUpdateHandler2.<init>(DirectUpdateHandler2.java:96)
	... 39 more


REGRESSION:  org.apache.solr.handler.component.DistributedTermsComponentTest.testDistribSearch

Error Message:
Server at http://127.0.0.1:22910 returned non ok status:404, message:Can not find: /update

Stack Trace:
org.apache.solr.common.SolrException: Server at http://127.0.0.1:22910 returned non ok status:404, message:Can not find: /update
	at __randomizedtesting.SeedInfo.seed([8BADF50C402C6C84:A4B7B1437730CB8]:0)
	at org.apache.solr.client.solrj.impl.HttpSolrServer.request(HttpSolrServer.java:372)
	at org.apache.solr.client.solrj.impl.HttpSolrServer.request(HttpSolrServer.java:181)
	at org.apache.solr.client.solrj.request.AbstractUpdateRequest.process(AbstractUpdateRequest.java:117)
	at org.apache.solr.client.solrj.SolrServer.deleteByQuery(SolrServer.java:285)
	at org.apache.solr.client.solrj.SolrServer.deleteByQuery(SolrServer.java:271)
	at org.apache.solr.BaseDistributedSearchTestCase.del(BaseDistributedSearchTestCase.java:453)
	at org.apache.solr.handler.component.DistributedTermsComponentTest.doTest(DistributedTermsComponentTest.java:32)
	at org.apache.solr.BaseDistributedSearchTestCase.testDistribSearch(BaseDistributedSearchTestCase.java:800)
	at sun.reflect.NativeMethodAccessorImpl.invoke0(Native Method)
	at sun.reflect.NativeMethodAccessorImpl.invoke(NativeMethodAccessorImpl.java:57)
	at sun.reflect.DelegatingMethodAccessorImpl.invoke(DelegatingMethodAccessorImpl.java:43)
	at java.lang.reflect.Method.invoke(Method.java:616)
	at com.carrotsearch.randomizedtesting.RandomizedRunner.invoke(RandomizedRunner.java:1559)
	at com.carrotsearch.randomizedtesting.RandomizedRunner.access$600(RandomizedRunner.java:79)
	at com.carrotsearch.randomizedtesting.RandomizedRunner$6.evaluate(RandomizedRunner.java:737)
	at com.carrotsearch.randomizedtesting.RandomizedRunner$7.evaluate(RandomizedRunner.java:773)
	at com.carrotsearch.randomizedtesting.RandomizedRunner$8.evaluate(RandomizedRunner.java:787)
	at com.carrotsearch.randomizedtesting.rules.SystemPropertiesRestoreRule$1.evaluate(SystemPropertiesRestoreRule.java:53)
	at org.apache.lucene.util.TestRuleSetupTeardownChained$1.evaluate(TestRuleSetupTeardownChained.java:50)
	at org.apache.lucene.util.TestRuleFieldCacheSanity$1.evaluate(TestRuleFieldCacheSanity.java:51)
	at org.apache.lucene.util.AbstractBeforeAfterRule$1.evaluate(AbstractBeforeAfterRule.java:46)
	at com.carrotsearch.randomizedtesting.rules.SystemPropertiesInvariantRule$1.evaluate(SystemPropertiesInvariantRule.java:55)
	at org.apache.lucene.util.TestRuleThreadAndTestName$1.evaluate(TestRuleThreadAndTestName.java:49)
	at org.apache.lucene.util.TestRuleIgnoreAfterMaxFailures$1.evaluate(TestRuleIgnoreAfterMaxFailures.java:70)
	at org.apache.lucene.util.TestRuleMarkFailure$1.evaluate(TestRuleMarkFailure.java:48)
	at com.carrotsearch.randomizedtesting.rules.StatementAdapter.evaluate(StatementAdapter.java:36)
	at com.carrotsearch.randomizedtesting.ThreadLeakControl$StatementRunner.run(ThreadLeakControl.java:358)
	at com.carrotsearch.randomizedtesting.ThreadLeakControl.forkTimeoutingTask(ThreadLeakControl.java:782)
	at com.carrotsearch.randomizedtesting.ThreadLeakControl$3.evaluate(ThreadLeakControl.java:442)
	at com.carrotsearch.randomizedtesting.RandomizedRunner.runSingleTest(RandomizedRunner.java:746)
	at com.carrotsearch.randomizedtesting.RandomizedRunner$3.evaluate(RandomizedRunner.java:648)
	at com.carrotsearch.randomizedtesting.RandomizedRunner$4.evaluate(RandomizedRunner.java:682)
	at com.carrotsearch.randomizedtesting.RandomizedRunner$5.evaluate(RandomizedRunner.java:693)
	at com.carrotsearch.randomizedtesting.rules.StatementAdapter.evaluate(StatementAdapter.java:36)
	at com.carrotsearch.randomizedtesting.rules.SystemPropertiesRestoreRule$1.evaluate(SystemPropertiesRestoreRule.java:53)
	at org.apache.lucene.util.AbstractBeforeAfterRule$1.evaluate(AbstractBeforeAfterRule.java:46)
	at org.apache.lucene.util.TestRuleStoreClassName$1.evaluate(TestRuleStoreClassName.java:42)
	at com.carrotsearch.randomizedtesting.rules.SystemPropertiesInvariantRule$1.evaluate(SystemPropertiesInvariantRule.java:55)
	at com.carrotsearch.randomizedtesting.rules.NoShadowingOrOverridesOnMethodsRule$1.evaluate(NoShadowingOrOverridesOnMethodsRule.java:39)
	at com.carrotsearch.randomizedtesting.rules.NoShadowingOrOverridesOnMethodsRule$1.evaluate(NoShadowingOrOverridesOnMethodsRule.java:39)
	at com.carrotsearch.randomizedtesting.rules.StatementAdapter.evaluate(StatementAdapter.java:36)
	at org.apache.lucene.util.TestRuleAssertionsRequired$1.evaluate(TestRuleAssertionsRequired.java:43)
	at org.apache.lucene.util.TestRuleMarkFailure$1.evaluate(TestRuleMarkFailure.java:48)
	at org.apache.lucene.util.TestRuleIgnoreAfterMaxFailures$1.evaluate(TestRuleIgnoreAfterMaxFailures.java:70)
	at org.apache.lucene.util.TestRuleIgnoreTestSuites$1.evaluate(TestRuleIgnoreTestSuites.java:55)
	at com.carrotsearch.randomizedtesting.rules.StatementAdapter.evaluate(StatementAdapter.java:36)
	at com.carrotsearch.randomizedtesting.ThreadLeakControl$StatementRunner.run(ThreadLeakControl.java:358)
	at java.lang.Thread.run(Thread.java:679)


REGRESSION:  org.apache.solr.handler.component.QueryElevationComponentTest.testElevationReloading

Error Message:
org.apache.solr.common.SolrException: Error Instantiating Update Handler, solr.DirectUpdateHandler2 failed to instantiate org.apache.solr.update.UpdateHandler

Stack Trace:
java.lang.RuntimeException: org.apache.solr.common.SolrException: Error Instantiating Update Handler, solr.DirectUpdateHandler2 failed to instantiate org.apache.solr.update.UpdateHandler
	at __randomizedtesting.SeedInfo.seed([8BADF50C402C6C84:365A7FBB908A7E0]:0)
	at org.apache.solr.util.TestHarness.<init>(TestHarness.java:137)
	at org.apache.solr.util.TestHarness.<init>(TestHarness.java:122)
	at org.apache.solr.util.TestHarness.<init>(TestHarness.java:112)
	at org.apache.solr.SolrTestCaseJ4.createCore(SolrTestCaseJ4.java:384)
	at org.apache.solr.SolrTestCaseJ4.initCore(SolrTestCaseJ4.java:376)
	at org.apache.solr.SolrTestCaseJ4.initCore(SolrTestCaseJ4.java:188)
	at org.apache.solr.SolrTestCaseJ4.initCore(SolrTestCaseJ4.java:175)
	at org.apache.solr.handler.component.QueryElevationComponentTest.init(QueryElevationComponentTest.java:66)
	at org.apache.solr.handler.component.QueryElevationComponentTest.init(QueryElevationComponentTest.java:54)
	at org.apache.solr.handler.component.QueryElevationComponentTest.testElevationReloading(QueryElevationComponentTest.java:467)
	at sun.reflect.NativeMethodAccessorImpl.invoke0(Native Method)
	at sun.reflect.NativeMethodAccessorImpl.invoke(NativeMethodAccessorImpl.java:57)
	at sun.reflect.DelegatingMethodAccessorImpl.invoke(DelegatingMethodAccessorImpl.java:43)
	at java.lang.reflect.Method.invoke(Method.java:616)
	at com.carrotsearch.randomizedtesting.RandomizedRunner.invoke(RandomizedRunner.java:1559)
	at com.carrotsearch.randomizedtesting.RandomizedRunner.access$600(RandomizedRunner.java:79)
	at com.carrotsearch.randomizedtesting.RandomizedRunner$6.evaluate(RandomizedRunner.java:737)
	at com.carrotsearch.randomizedtesting.RandomizedRunner$7.evaluate(RandomizedRunner.java:773)
	at com.carrotsearch.randomizedtesting.RandomizedRunner$8.evaluate(RandomizedRunner.java:787)
	at com.carrotsearch.randomizedtesting.rules.SystemPropertiesRestoreRule$1.evaluate(SystemPropertiesRestoreRule.java:53)
	at org.apache.lucene.util.TestRuleSetupTeardownChained$1.evaluate(TestRuleSetupTeardownChained.java:50)
	at org.apache.lucene.util.TestRuleFieldCacheSanity$1.evaluate(TestRuleFieldCacheSanity.java:51)
	at org.apache.lucene.util.AbstractBeforeAfterRule$1.evaluate(AbstractBeforeAfterRule.java:46)
	at com.carrotsearch.randomizedtesting.rules.SystemPropertiesInvariantRule$1.evaluate(SystemPropertiesInvariantRule.java:55)
	at org.apache.lucene.util.TestRuleThreadAndTestName$1.evaluate(TestRuleThreadAndTestName.java:49)
	at org.apache.lucene.util.TestRuleIgnoreAfterMaxFailures$1.evaluate(TestRuleIgnoreAfterMaxFailures.java:70)
	at org.apache.lucene.util.TestRuleMarkFailure$1.evaluate(TestRuleMarkFailure.java:48)
	at com.carrotsearch.randomizedtesting.rules.StatementAdapter.evaluate(StatementAdapter.java:36)
	at com.carrotsearch.randomizedtesting.ThreadLeakControl$StatementRunner.run(ThreadLeakControl.java:358)
	at com.carrotsearch.randomizedtesting.ThreadLeakControl.forkTimeoutingTask(ThreadLeakControl.java:782)
	at com.carrotsearch.randomizedtesting.ThreadLeakControl$3.evaluate(ThreadLeakControl.java:442)
	at com.carrotsearch.randomizedtesting.RandomizedRunner.runSingleTest(RandomizedRunner.java:746)
	at com.carrotsearch.randomizedtesting.RandomizedRunner$3.evaluate(RandomizedRunner.java:648)
	at com.carrotsearch.randomizedtesting.RandomizedRunner$4.evaluate(RandomizedRunner.java:682)
	at com.carrotsearch.randomizedtesting.RandomizedRunner$5.evaluate(RandomizedRunner.java:693)
	at com.carrotsearch.randomizedtesting.rules.StatementAdapter.evaluate(StatementAdapter.java:36)
	at com.carrotsearch.randomizedtesting.rules.SystemPropertiesRestoreRule$1.evaluate(SystemPropertiesRestoreRule.java:53)
	at org.apache.lucene.util.AbstractBeforeAfterRule$1.evaluate(AbstractBeforeAfterRule.java:46)
	at org.apache.lucene.util.TestRuleStoreClassName$1.evaluate(TestRuleStoreClassName.java:42)
	at com.carrotsearch.randomizedtesting.rules.SystemPropertiesInvariantRule$1.evaluate(SystemPropertiesInvariantRule.java:55)
	at com.carrotsearch.randomizedtesting.rules.NoShadowingOrOverridesOnMethodsRule$1.evaluate(NoShadowingOrOverridesOnMethodsRule.java:39)
	at com.carrotsearch.randomizedtesting.rules.NoShadowingOrOverridesOnMethodsRule$1.evaluate(NoShadowingOrOverridesOnMethodsRule.java:39)
	at com.carrotsearch.randomizedtesting.rules.StatementAdapter.evaluate(StatementAdapter.java:36)
	at org.apache.lucene.util.TestRuleAssertionsRequired$1.evaluate(TestRuleAssertionsRequired.java:43)
	at org.apache.lucene.util.TestRuleMarkFailure$1.evaluate(TestRuleMarkFailure.java:48)
	at org.apache.lucene.util.TestRuleIgnoreAfterMaxFailures$1.evaluate(TestRuleIgnoreAfterMaxFailures.java:70)
	at org.apache.lucene.util.TestRuleIgnoreTestSuites$1.evaluate(TestRuleIgnoreTestSuites.java:55)
	at com.carrotsearch.randomizedtesting.rules.StatementAdapter.evaluate(StatementAdapter.java:36)
	at com.carrotsearch.randomizedtesting.ThreadLeakControl$StatementRunner.run(ThreadLeakControl.java:358)
	at java.lang.Thread.run(Thread.java:679)
Caused by: org.apache.solr.common.SolrException: Error Instantiating Update Handler, solr.DirectUpdateHandler2 failed to instantiate org.apache.solr.update.UpdateHandler
	at org.apache.solr.core.SolrCore.<init>(SolrCore.java:789)
	at org.apache.solr.core.SolrCore.<init>(SolrCore.java:602)
	at org.apache.solr.util.TestHarness$Initializer.initialize(TestHarness.java:205)
	at org.apache.solr.util.TestHarness.<init>(TestHarness.java:128)
	... 49 more
Caused by: org.apache.solr.common.SolrException: Error Instantiating Update Handler, solr.DirectUpdateHandler2 failed to instantiate org.apache.solr.update.UpdateHandler
	at org.apache.solr.core.SolrCore.createInstance(SolrCore.java:526)
	at org.apache.solr.core.SolrCore.createUpdateHandler(SolrCore.java:580)
	at org.apache.solr.core.SolrCore.<init>(SolrCore.java:773)
	... 52 more
Caused by: java.lang.reflect.InvocationTargetException
	at sun.reflect.GeneratedConstructorAccessor119.newInstance(Unknown Source)
	at sun.reflect.DelegatingConstructorAccessorImpl.newInstance(DelegatingConstructorAccessorImpl.java:45)
	at java.lang.reflect.Constructor.newInstance(Constructor.java:532)
	at org.apache.solr.core.SolrCore.createInstance(SolrCore.java:512)
	... 54 more
Caused by: java.lang.NullPointerException
	at org.apache.solr.update.UpdateLog.getTlogDir(UpdateLog.java:1399)
	at org.apache.solr.update.UpdateHandler.clearLog(UpdateHandler.java:88)
	at org.apache.solr.update.UpdateHandler.<init>(UpdateHandler.java:127)
	at org.apache.solr.update.DirectUpdateHandler2.<init>(DirectUpdateHandler2.java:96)
	... 58 more


REGRESSION:  org.apache.solr.handler.component.QueryElevationComponentTest.testFieldType

Error Message:
org.apache.solr.common.SolrException: Error Instantiating Update Handler, solr.DirectUpdateHandler2 failed to instantiate org.apache.solr.update.UpdateHandler

Stack Trace:
java.lang.RuntimeException: org.apache.solr.common.SolrException: Error Instantiating Update Handler, solr.DirectUpdateHandler2 failed to instantiate org.apache.solr.update.UpdateHandler
	at __randomizedtesting.SeedInfo.seed([8BADF50C402C6C84:46C3AD2A8E576854]:0)
	at org.apache.solr.util.TestHarness.<init>(TestHarness.java:137)
	at org.apache.solr.util.TestHarness.<init>(TestHarness.java:122)
	at org.apache.solr.util.TestHarness.<init>(TestHarness.java:112)
	at org.apache.solr.SolrTestCaseJ4.createCore(SolrTestCaseJ4.java:384)
	at org.apache.solr.SolrTestCaseJ4.initCore(SolrTestCaseJ4.java:376)
	at org.apache.solr.SolrTestCaseJ4.initCore(SolrTestCaseJ4.java:188)
	at org.apache.solr.SolrTestCaseJ4.initCore(SolrTestCaseJ4.java:175)
	at org.apache.solr.handler.component.QueryElevationComponentTest.init(QueryElevationComponentTest.java:66)
	at org.apache.solr.handler.component.QueryElevationComponentTest.init(QueryElevationComponentTest.java:54)
	at org.apache.solr.handler.component.QueryElevationComponentTest.testFieldType(QueryElevationComponentTest.java:78)
	at sun.reflect.NativeMethodAccessorImpl.invoke0(Native Method)
	at sun.reflect.NativeMethodAccessorImpl.invoke(NativeMethodAccessorImpl.java:57)
	at sun.reflect.DelegatingMethodAccessorImpl.invoke(DelegatingMethodAccessorImpl.java:43)
	at java.lang.reflect.Method.invoke(Method.java:616)
	at com.carrotsearch.randomizedtesting.RandomizedRunner.invoke(RandomizedRunner.java:1559)
	at com.carrotsearch.randomizedtesting.RandomizedRunner.access$600(RandomizedRunner.java:79)
	at com.carrotsearch.randomizedtesting.RandomizedRunner$6.evaluate(RandomizedRunner.java:737)
	at com.carrotsearch.randomizedtesting.RandomizedRunner$7.evaluate(RandomizedRunner.java:773)
	at com.carrotsearch.randomizedtesting.RandomizedRunner$8.evaluate(RandomizedRunner.java:787)
	at com.carrotsearch.randomizedtesting.rules.SystemPropertiesRestoreRule$1.evaluate(SystemPropertiesRestoreRule.java:53)
	at org.apache.lucene.util.TestRuleSetupTeardownChained$1.evaluate(TestRuleSetupTeardownChained.java:50)
	at org.apache.lucene.util.TestRuleFieldCacheSanity$1.evaluate(TestRuleFieldCacheSanity.java:51)
	at org.apache.lucene.util.AbstractBeforeAfterRule$1.evaluate(AbstractBeforeAfterRule.java:46)
	at com.carrotsearch.randomizedtesting.rules.SystemPropertiesInvariantRule$1.evaluate(SystemPropertiesInvariantRule.java:55)
	at org.apache.lucene.util.TestRuleThreadAndTestName$1.evaluate(TestRuleThreadAndTestName.java:49)
	at org.apache.lucene.util.TestRuleIgnoreAfterMaxFailures$1.evaluate(TestRuleIgnoreAfterMaxFailures.java:70)
	at org.apache.lucene.util.TestRuleMarkFailure$1.evaluate(TestRuleMarkFailure.java:48)
	at com.carrotsearch.randomizedtesting.rules.StatementAdapter.evaluate(StatementAdapter.java:36)
	at com.carrotsearch.randomizedtesting.ThreadLeakControl$StatementRunner.run(ThreadLeakControl.java:358)
	at com.carrotsearch.randomizedtesting.ThreadLeakControl.forkTimeoutingTask(ThreadLeakControl.java:782)
	at com.carrotsearch.randomizedtesting.ThreadLeakControl$3.evaluate(ThreadLeakControl.java:442)
	at com.carrotsearch.randomizedtesting.RandomizedRunner.runSingleTest(RandomizedRunner.java:746)
	at com.carrotsearch.randomizedtesting.RandomizedRunner$3.evaluate(RandomizedRunner.java:648)
	at com.carrotsearch.randomizedtesting.RandomizedRunner$4.evaluate(RandomizedRunner.java:682)
	at com.carrotsearch.randomizedtesting.RandomizedRunner$5.evaluate(RandomizedRunner.java:693)
	at com.carrotsearch.randomizedtesting.rules.StatementAdapter.evaluate(StatementAdapter.java:36)
	at com.carrotsearch.randomizedtesting.rules.SystemPropertiesRestoreRule$1.evaluate(SystemPropertiesRestoreRule.java:53)
	at org.apache.lucene.util.AbstractBeforeAfterRule$1.evaluate(AbstractBeforeAfterRule.java:46)
	at org.apache.lucene.util.TestRuleStoreClassName$1.evaluate(TestRuleStoreClassName.java:42)
	at com.carrotsearch.randomizedtesting.rules.SystemPropertiesInvariantRule$1.evaluate(SystemPropertiesInvariantRule.java:55)
	at com.carrotsearch.randomizedtesting.rules.NoShadowingOrOverridesOnMethodsRule$1.evaluate(NoShadowingOrOverridesOnMethodsRule.java:39)
	at com.carrotsearch.randomizedtesting.rules.NoShadowingOrOverridesOnMethodsRule$1.evaluate(NoShadowingOrOverridesOnMethodsRule.java:39)
	at com.carrotsearch.randomizedtesting.rules.StatementAdapter.evaluate(StatementAdapter.java:36)
	at org.apache.lucene.util.TestRuleAssertionsRequired$1.evaluate(TestRuleAssertionsRequired.java:43)
	at org.apache.lucene.util.TestRuleMarkFailure$1.evaluate(TestRuleMarkFailure.java:48)
	at org.apache.lucene.util.TestRuleIgnoreAfterMaxFailures$1.evaluate(TestRuleIgnoreAfterMaxFailures.java:70)
	at org.apache.lucene.util.TestRuleIgnoreTestSuites$1.evaluate(TestRuleIgnoreTestSuites.java:55)
	at com.carrotsearch.randomizedtesting.rules.StatementAdapter.evaluate(StatementAdapter.java:36)
	at com.carrotsearch.randomizedtesting.ThreadLeakControl$StatementRunner.run(ThreadLeakControl.java:358)
	at java.lang.Thread.run(Thread.java:679)
Caused by: org.apache.solr.common.SolrException: Error Instantiating Update Handler, solr.DirectUpdateHandler2 failed to instantiate org.apache.solr.update.UpdateHandler
	at org.apache.solr.core.SolrCore.<init>(SolrCore.java:789)
	at org.apache.solr.core.SolrCore.<init>(SolrCore.java:602)
	at org.apache.solr.util.TestHarness$Initializer.initialize(TestHarness.java:205)
	at org.apache.solr.util.TestHarness.<init>(TestHarness.java:128)
	... 49 more
Caused by: org.apache.solr.common.SolrException: Error Instantiating Update Handler, solr.DirectUpdateHandler2 failed to instantiate org.apache.solr.update.UpdateHandler
	at org.apache.solr.core.SolrCore.createInstance(SolrCore.java:526)
	at org.apache.solr.core.SolrCore.createUpdateHandler(SolrCore.java:580)
	at org.apache.solr.core.SolrCore.<init>(SolrCore.java:773)
	... 52 more
Caused by: java.lang.reflect.InvocationTargetException
	at sun.reflect.GeneratedConstructorAccessor119.newInstance(Unknown Source)
	at sun.reflect.DelegatingConstructorAccessorImpl.newInstance(DelegatingConstructorAccessorImpl.java:45)
	at java.lang.reflect.Constructor.newInstance(Constructor.java:532)
	at org.apache.solr.core.SolrCore.createInstance(SolrCore.java:512)
	... 54 more
Caused by: java.lang.NullPointerException
	at org.apache.solr.update.UpdateLog.getTlogDir(UpdateLog.java:1399)
	at org.apache.solr.update.UpdateHandler.clearLog(UpdateHandler.java:88)
	at org.apache.solr.update.UpdateHandler.<init>(UpdateHandler.java:127)
	at org.apache.solr.update.DirectUpdateHandler2.<init>(DirectUpdateHandler2.java:96)
	... 58 more


REGRESSION:  org.apache.solr.handler.component.QueryElevationComponentTest.testInterface

Error Message:
org.apache.solr.common.SolrException: Error Instantiating Update Handler, solr.DirectUpdateHandler2 failed to instantiate org.apache.solr.update.UpdateHandler

Stack Trace:
java.lang.RuntimeException: org.apache.solr.common.SolrException: Error Instantiating Update Handler, solr.DirectUpdateHandler2 failed to instantiate org.apache.solr.update.UpdateHandler
	at __randomizedtesting.SeedInfo.seed([8BADF50C402C6C84:F6E889BE58B98AD2]:0)
	at org.apache.solr.util.TestHarness.<init>(TestHarness.java:137)
	at org.apache.solr.util.TestHarness.<init>(TestHarness.java:122)
	at org.apache.solr.util.TestHarness.<init>(TestHarness.java:112)
	at org.apache.solr.SolrTestCaseJ4.createCore(SolrTestCaseJ4.java:384)
	at org.apache.solr.SolrTestCaseJ4.initCore(SolrTestCaseJ4.java:376)
	at org.apache.solr.SolrTestCaseJ4.initCore(SolrTestCaseJ4.java:188)
	at org.apache.solr.SolrTestCaseJ4.initCore(SolrTestCaseJ4.java:175)
	at org.apache.solr.handler.component.QueryElevationComponentTest.init(QueryElevationComponentTest.java:66)
	at org.apache.solr.handler.component.QueryElevationComponentTest.init(QueryElevationComponentTest.java:54)
	at org.apache.solr.handler.component.QueryElevationComponentTest.testInterface(QueryElevationComponentTest.java:145)
	at sun.reflect.NativeMethodAccessorImpl.invoke0(Native Method)
	at sun.reflect.NativeMethodAccessorImpl.invoke(NativeMethodAccessorImpl.java:57)
	at sun.reflect.DelegatingMethodAccessorImpl.invoke(DelegatingMethodAccessorImpl.java:43)
	at java.lang.reflect.Method.invoke(Method.java:616)
	at com.carrotsearch.randomizedtesting.RandomizedRunner.invoke(RandomizedRunner.java:1559)
	at com.carrotsearch.randomizedtesting.RandomizedRunner.access$600(RandomizedRunner.java:79)
	at com.carrotsearch.randomizedtesting.RandomizedRunner$6.evaluate(RandomizedRunner.java:737)
	at com.carrotsearch.randomizedtesting.RandomizedRunner$7.evaluate(RandomizedRunner.java:773)
	at com.carrotsearch.randomizedtesting.RandomizedRunner$8.evaluate(RandomizedRunner.java:787)
	at com.carrotsearch.randomizedtesting.rules.SystemPropertiesRestoreRule$1.evaluate(SystemPropertiesRestoreRule.java:53)
	at org.apache.lucene.util.TestRuleSetupTeardownChained$1.evaluate(TestRuleSetupTeardownChained.java:50)
	at org.apache.lucene.util.TestRuleFieldCacheSanity$1.evaluate(TestRuleFieldCacheSanity.java:51)
	at org.apache.lucene.util.AbstractBeforeAfterRule$1.evaluate(AbstractBeforeAfterRule.java:46)
	at com.carrotsearch.randomizedtesting.rules.SystemPropertiesInvariantRule$1.evaluate(SystemPropertiesInvariantRule.java:55)
	at org.apache.lucene.util.TestRuleThreadAndTestName$1.evaluate(TestRuleThreadAndTestName.java:49)
	at org.apache.lucene.util.TestRuleIgnoreAfterMaxFailures$1.evaluate(TestRuleIgnoreAfterMaxFailures.java:70)
	at org.apache.lucene.util.TestRuleMarkFailure$1.evaluate(TestRuleMarkFailure.java:48)
	at com.carrotsearch.randomizedtesting.rules.StatementAdapter.evaluate(StatementAdapter.java:36)
	at com.carrotsearch.randomizedtesting.ThreadLeakControl$StatementRunner.run(ThreadLeakControl.java:358)
	at com.carrotsearch.randomizedtesting.ThreadLeakControl.forkTimeoutingTask(ThreadLeakControl.java:782)
	at com.carrotsearch.randomizedtesting.ThreadLeakControl$3.evaluate(ThreadLeakControl.java:442)
	at com.carrotsearch.randomizedtesting.RandomizedRunner.runSingleTest(RandomizedRunner.java:746)
	at com.carrotsearch.randomizedtesting.RandomizedRunner$3.evaluate(RandomizedRunner.java:648)
	at com.carrotsearch.randomizedtesting.RandomizedRunner$4.evaluate(RandomizedRunner.java:682)
	at com.carrotsearch.randomizedtesting.RandomizedRunner$5.evaluate(RandomizedRunner.java:693)
	at com.carrotsearch.randomizedtesting.rules.StatementAdapter.evaluate(StatementAdapter.java:36)
	at com.carrotsearch.randomizedtesting.rules.SystemPropertiesRestoreRule$1.evaluate(SystemPropertiesRestoreRule.java:53)
	at org.apache.lucene.util.AbstractBeforeAfterRule$1.evaluate(AbstractBeforeAfterRule.java:46)
	at org.apache.lucene.util.TestRuleStoreClassName$1.evaluate(TestRuleStoreClassName.java:42)
	at com.carrotsearch.randomizedtesting.rules.SystemPropertiesInvariantRule$1.evaluate(SystemPropertiesInvariantRule.java:55)
	at com.carrotsearch.randomizedtesting.rules.NoShadowingOrOverridesOnMethodsRule$1.evaluate(NoShadowingOrOverridesOnMethodsRule.java:39)
	at com.carrotsearch.randomizedtesting.rules.NoShadowingOrOverridesOnMethodsRule$1.evaluate(NoShadowingOrOverridesOnMethodsRule.java:39)
	at com.carrotsearch.randomizedtesting.rules.StatementAdapter.evaluate(StatementAdapter.java:36)
	at org.apache.lucene.util.TestRuleAssertionsRequired$1.evaluate(TestRuleAssertionsRequired.java:43)
	at org.apache.lucene.util.TestRuleMarkFailure$1.evaluate(TestRuleMarkFailure.java:48)
	at org.apache.lucene.util.TestRuleIgnoreAfterMaxFailures$1.evaluate(TestRuleIgnoreAfterMaxFailures.java:70)
	at org.apache.lucene.util.TestRuleIgnoreTestSuites$1.evaluate(TestRuleIgnoreTestSuites.java:55)
	at com.carrotsearch.randomizedtesting.rules.StatementAdapter.evaluate(StatementAdapter.java:36)
	at com.carrotsearch.randomizedtesting.ThreadLeakControl$StatementRunner.run(ThreadLeakControl.java:358)
	at java.lang.Thread.run(Thread.java:679)
Caused by: org.apache.solr.common.SolrException: Error Instantiating Update Handler, solr.DirectUpdateHandler2 failed to instantiate org.apache.solr.update.UpdateHandler
	at org.apache.solr.core.SolrCore.<init>(SolrCore.java:789)
	at org.apache.solr.core.SolrCore.<init>(SolrCore.java:602)
	at org.apache.solr.util.TestHarness$Initializer.initialize(TestHarness.java:205)
	at org.apache.solr.util.TestHarness.<init>(TestHarness.java:128)
	... 49 more
Caused by: org.apache.solr.common.SolrException: Error Instantiating Update Handler, solr.DirectUpdateHandler2 failed to instantiate org.apache.solr.update.UpdateHandler
	at org.apache.solr.core.SolrCore.createInstance(SolrCore.java:526)
	at org.apache.solr.core.SolrCore.createUpdateHandler(SolrCore.java:580)
	at org.apache.solr.core.SolrCore.<init>(SolrCore.java:773)
	... 52 more
Caused by: java.lang.reflect.InvocationTargetException
	at sun.reflect.GeneratedConstructorAccessor119.newInstance(Unknown Source)
	at sun.reflect.DelegatingConstructorAccessorImpl.newInstance(DelegatingConstructorAccessorImpl.java:45)
	at java.lang.reflect.Constructor.newInstance(Constructor.java:532)
	at org.apache.solr.core.SolrCore.createInstance(SolrCore.java:512)
	... 54 more
Caused by: java.lang.NullPointerException
	at org.apache.solr.update.UpdateLog.getTlogDir(UpdateLog.java:1399)
	at org.apache.solr.update.UpdateHandler.clearLog(UpdateHandler.java:88)
	at org.apache.solr.update.UpdateHandler.<init>(UpdateHandler.java:127)
	at org.apache.solr.update.DirectUpdateHandler2.<init>(DirectUpdateHandler2.java:96)
	... 58 more


REGRESSION:  org.apache.solr.handler.component.QueryElevationComponentTest.testSorting

Error Message:
org.apache.solr.common.SolrException: Error Instantiating Update Handler, solr.DirectUpdateHandler2 failed to instantiate org.apache.solr.update.UpdateHandler

Stack Trace:
java.lang.RuntimeException: org.apache.solr.common.SolrException: Error Instantiating Update Handler, solr.DirectUpdateHandler2 failed to instantiate org.apache.solr.update.UpdateHandler
	at __randomizedtesting.SeedInfo.seed([8BADF50C402C6C84:6201B94E922450E3]:0)
	at org.apache.solr.util.TestHarness.<init>(TestHarness.java:137)
	at org.apache.solr.util.TestHarness.<init>(TestHarness.java:122)
	at org.apache.solr.util.TestHarness.<init>(TestHarness.java:112)
	at org.apache.solr.SolrTestCaseJ4.createCore(SolrTestCaseJ4.java:384)
	at org.apache.solr.SolrTestCaseJ4.initCore(SolrTestCaseJ4.java:376)
	at org.apache.solr.SolrTestCaseJ4.initCore(SolrTestCaseJ4.java:188)
	at org.apache.solr.SolrTestCaseJ4.initCore(SolrTestCaseJ4.java:175)
	at org.apache.solr.handler.component.QueryElevationComponentTest.init(QueryElevationComponentTest.java:66)
	at org.apache.solr.handler.component.QueryElevationComponentTest.init(QueryElevationComponentTest.java:54)
	at org.apache.solr.handler.component.QueryElevationComponentTest.testSorting(QueryElevationComponentTest.java:323)
	at sun.reflect.NativeMethodAccessorImpl.invoke0(Native Method)
	at sun.reflect.NativeMethodAccessorImpl.invoke(NativeMethodAccessorImpl.java:57)
	at sun.reflect.DelegatingMethodAccessorImpl.invoke(DelegatingMethodAccessorImpl.java:43)
	at java.lang.reflect.Method.invoke(Method.java:616)
	at com.carrotsearch.randomizedtesting.RandomizedRunner.invoke(RandomizedRunner.java:1559)
	at com.carrotsearch.randomizedtesting.RandomizedRunner.access$600(RandomizedRunner.java:79)
	at com.carrotsearch.randomizedtesting.RandomizedRunner$6.evaluate(RandomizedRunner.java:737)
	at com.carrotsearch.randomizedtesting.RandomizedRunner$7.evaluate(RandomizedRunner.java:773)
	at com.carrotsearch.randomizedtesting.RandomizedRunner$8.evaluate(RandomizedRunner.java:787)
	at com.carrotsearch.randomizedtesting.rules.SystemPropertiesRestoreRule$1.evaluate(SystemPropertiesRestoreRule.java:53)
	at org.apache.lucene.util.TestRuleSetupTeardownChained$1.evaluate(TestRuleSetupTeardownChained.java:50)
	at org.apache.lucene.util.TestRuleFieldCacheSanity$1.evaluate(TestRuleFieldCacheSanity.java:51)
	at org.apache.lucene.util.AbstractBeforeAfterRule$1.evaluate(AbstractBeforeAfterRule.java:46)
	at com.carrotsearch.randomizedtesting.rules.SystemPropertiesInvariantRule$1.evaluate(SystemPropertiesInvariantRule.java:55)
	at org.apache.lucene.util.TestRuleThreadAndTestName$1.evaluate(TestRuleThreadAndTestName.java:49)
	at org.apache.lucene.util.TestRuleIgnoreAfterMaxFailures$1.evaluate(TestRuleIgnoreAfterMaxFailures.java:70)
	at org.apache.lucene.util.TestRuleMarkFailure$1.evaluate(TestRuleMarkFailure.java:48)
	at com.carrotsearch.randomizedtesting.rules.StatementAdapter.evaluate(StatementAdapter.java:36)
	at com.carrotsearch.randomizedtesting.ThreadLeakControl$StatementRunner.run(ThreadLeakControl.java:358)
	at com.carrotsearch.randomizedtesting.ThreadLeakControl.forkTimeoutingTask(ThreadLeakControl.java:782)
	at com.carrotsearch.randomizedtesting.ThreadLeakControl$3.evaluate(ThreadLeakControl.java:442)
	at com.carrotsearch.randomizedtesting.RandomizedRunner.runSingleTest(RandomizedRunner.java:746)
	at com.carrotsearch.randomizedtesting.RandomizedRunner$3.evaluate(RandomizedRunner.java:648)
	at com.carrotsearch.randomizedtesting.RandomizedRunner$4.evaluate(RandomizedRunner.java:682)
	at com.carrotsearch.randomizedtesting.RandomizedRunner$5.evaluate(RandomizedRunner.java:693)
	at com.carrotsearch.randomizedtesting.rules.StatementAdapter.evaluate(StatementAdapter.java:36)
	at com.carrotsearch.randomizedtesting.rules.SystemPropertiesRestoreRule$1.evaluate(SystemPropertiesRestoreRule.java:53)
	at org.apache.lucene.util.AbstractBeforeAfterRule$1.evaluate(AbstractBeforeAfterRule.java:46)
	at org.apache.lucene.util.TestRuleStoreClassName$1.evaluate(TestRuleStoreClassName.java:42)
	at com.carrotsearch.randomizedtesting.rules.SystemPropertiesInvariantRule$1.evaluate(SystemPropertiesInvariantRule.java:55)
	at com.carrotsearch.randomizedtesting.rules.NoShadowingOrOverridesOnMethodsRule$1.evaluate(NoShadowingOrOverridesOnMethodsRule.java:39)
	at com.carrotsearch.randomizedtesting.rules.NoShadowingOrOverridesOnMethodsRule$1.evaluate(NoShadowingOrOverridesOnMethodsRule.java:39)
	at com.carrotsearch.randomizedtesting.rules.StatementAdapter.evaluate(StatementAdapter.java:36)
	at org.apache.lucene.util.TestRuleAssertionsRequired$1.evaluate(TestRuleAssertionsRequired.java:43)
	at org.apache.lucene.util.TestRuleMarkFailure$1.evaluate(TestRuleMarkFailure.java:48)
	at org.apache.lucene.util.TestRuleIgnoreAfterMaxFailures$1.evaluate(TestRuleIgnoreAfterMaxFailures.java:70)
	at org.apache.lucene.util.TestRuleIgnoreTestSuites$1.evaluate(TestRuleIgnoreTestSuites.java:55)
	at com.carrotsearch.randomizedtesting.rules.StatementAdapter.evaluate(StatementAdapter.java:36)
	at com.carrotsearch.randomizedtesting.ThreadLeakControl$StatementRunner.run(ThreadLeakControl.java:358)
	at java.lang.Thread.run(Thread.java:679)
Caused by: org.apache.solr.common.SolrException: Error Instantiating Update Handler, solr.DirectUpdateHandler2 failed to instantiate org.apache.solr.update.UpdateHandler
	at org.apache.solr.core.SolrCore.<init>(SolrCore.java:789)
	at org.apache.solr.core.SolrCore.<init>(SolrCore.java:602)
	at org.apache.solr.util.TestHarness$Initializer.initialize(TestHarness.java:205)
	at org.apache.solr.util.TestHarness.<init>(TestHarness.java:128)
	... 49 more
Caused by: org.apache.solr.common.SolrException: Error Instantiating Update Handler, solr.DirectUpdateHandler2 failed to instantiate org.apache.solr.update.UpdateHandler
	at org.apache.solr.core.SolrCore.createInstance(SolrCore.java:526)
	at org.apache.solr.core.SolrCore.createUpdateHandler(SolrCore.java:580)
	at org.apache.solr.core.SolrCore.<init>(SolrCore.java:773)
	... 52 more
Caused by: java.lang.reflect.InvocationTargetException
	at sun.reflect.GeneratedConstructorAccessor119.newInstance(Unknown Source)
	at sun.reflect.DelegatingConstructorAccessorImpl.newInstance(DelegatingConstructorAccessorImpl.java:45)
	at java.lang.reflect.Constructor.newInstance(Constructor.java:532)
	at org.apache.solr.core.SolrCore.createInstance(SolrCore.java:512)
	... 54 more
Caused by: java.lang.NullPointerException
	at org.apache.solr.update.UpdateLog.getTlogDir(UpdateLog.java:1399)
	at org.apache.solr.update.UpdateHandler.clearLog(UpdateHandler.java:88)
	at org.apache.solr.update.UpdateHandler.<init>(UpdateHandler.java:127)
	at org.apache.solr.update.DirectUpdateHandler2.<init>(DirectUpdateHandler2.java:96)
	... 58 more


REGRESSION:  org.apache.solr.handler.component.QueryElevationComponentTest.testMarker

Error Message:
org.apache.solr.common.SolrException: Error Instantiating Update Handler, solr.DirectUpdateHandler2 failed to instantiate org.apache.solr.update.UpdateHandler

Stack Trace:
java.lang.RuntimeException: org.apache.solr.common.SolrException: Error Instantiating Update Handler, solr.DirectUpdateHandler2 failed to instantiate org.apache.solr.update.UpdateHandler
	at __randomizedtesting.SeedInfo.seed([8BADF50C402C6C84:4933A8D12F3BC055]:0)
	at org.apache.solr.util.TestHarness.<init>(TestHarness.java:137)
	at org.apache.solr.util.TestHarness.<init>(TestHarness.java:122)
	at org.apache.solr.util.TestHarness.<init>(TestHarness.java:112)
	at org.apache.solr.SolrTestCaseJ4.createCore(SolrTestCaseJ4.java:384)
	at org.apache.solr.SolrTestCaseJ4.initCore(SolrTestCaseJ4.java:376)
	at org.apache.solr.SolrTestCaseJ4.initCore(SolrTestCaseJ4.java:188)
	at org.apache.solr.SolrTestCaseJ4.initCore(SolrTestCaseJ4.java:175)
	at org.apache.solr.handler.component.QueryElevationComponentTest.init(QueryElevationComponentTest.java:66)
	at org.apache.solr.handler.component.QueryElevationComponentTest.init(QueryElevationComponentTest.java:54)
	at org.apache.solr.handler.component.QueryElevationComponentTest.testMarker(QueryElevationComponentTest.java:201)
	at sun.reflect.NativeMethodAccessorImpl.invoke0(Native Method)
	at sun.reflect.NativeMethodAccessorImpl.invoke(NativeMethodAccessorImpl.java:57)
	at sun.reflect.DelegatingMethodAccessorImpl.invoke(DelegatingMethodAccessorImpl.java:43)
	at java.lang.reflect.Method.invoke(Method.java:616)
	at com.carrotsearch.randomizedtesting.RandomizedRunner.invoke(RandomizedRunner.java:1559)
	at com.carrotsearch.randomizedtesting.RandomizedRunner.access$600(RandomizedRunner.java:79)
	at com.carrotsearch.randomizedtesting.RandomizedRunner$6.evaluate(RandomizedRunner.java:737)
	at com.carrotsearch.randomizedtesting.RandomizedRunner$7.evaluate(RandomizedRunner.java:773)
	at com.carrotsearch.randomizedtesting.RandomizedRunner$8.evaluate(RandomizedRunner.java:787)
	at com.carrotsearch.randomizedtesting.rules.SystemPropertiesRestoreRule$1.evaluate(SystemPropertiesRestoreRule.java:53)
	at org.apache.lucene.util.TestRuleSetupTeardownChained$1.evaluate(TestRuleSetupTeardownChained.java:50)
	at org.apache.lucene.util.TestRuleFieldCacheSanity$1.evaluate(TestRuleFieldCacheSanity.java:51)
	at org.apache.lucene.util.AbstractBeforeAfterRule$1.evaluate(AbstractBeforeAfterRule.java:46)
	at com.carrotsearch.randomizedtesting.rules.SystemPropertiesInvariantRule$1.evaluate(SystemPropertiesInvariantRule.java:55)
	at org.apache.lucene.util.TestRuleThreadAndTestName$1.evaluate(TestRuleThreadAndTestName.java:49)
	at org.apache.lucene.util.TestRuleIgnoreAfterMaxFailures$1.evaluate(TestRuleIgnoreAfterMaxFailures.java:70)
	at org.apache.lucene.util.TestRuleMarkFailure$1.evaluate(TestRuleMarkFailure.java:48)
	at com.carrotsearch.randomizedtesting.rules.StatementAdapter.evaluate(StatementAdapter.java:36)
	at com.carrotsearch.randomizedtesting.ThreadLeakControl$StatementRunner.run(ThreadLeakControl.java:358)
	at com.carrotsearch.randomizedtesting.ThreadLeakControl.forkTimeoutingTask(ThreadLeakControl.java:782)
	at com.carrotsearch.randomizedtesting.ThreadLeakControl$3.evaluate(ThreadLeakControl.java:442)
	at com.carrotsearch.randomizedtesting.RandomizedRunner.runSingleTest(RandomizedRunner.java:746)
	at com.carrotsearch.randomizedtesting.RandomizedRunner$3.evaluate(RandomizedRunner.java:648)
	at com.carrotsearch.randomizedtesting.RandomizedRunner$4.evaluate(RandomizedRunner.java:682)
	at com.carrotsearch.randomizedtesting.RandomizedRunner$5.evaluate(RandomizedRunner.java:693)
	at com.carrotsearch.randomizedtesting.rules.StatementAdapter.evaluate(StatementAdapter.java:36)
	at com.carrotsearch.randomizedtesting.rules.SystemPropertiesRestoreRule$1.evaluate(SystemPropertiesRestoreRule.java:53)
	at org.apache.lucene.util.AbstractBeforeAfterRule$1.evaluate(AbstractBeforeAfterRule.java:46)
	at org.apache.lucene.util.TestRuleStoreClassName$1.evaluate(TestRuleStoreClassName.java:42)
	at com.carrotsearch.randomizedtesting.rules.SystemPropertiesInvariantRule$1.evaluate(SystemPropertiesInvariantRule.java:55)
	at com.carrotsearch.randomizedtesting.rules.NoShadowingOrOverridesOnMethodsRule$1.evaluate(NoShadowingOrOverridesOnMethodsRule.java:39)
	at com.carrotsearch.randomizedtesting.rules.NoShadowingOrOverridesOnMethodsRule$1.evaluate(NoShadowingOrOverridesOnMethodsRule.java:39)
	at com.carrotsearch.randomizedtesting.rules.StatementAdapter.evaluate(StatementAdapter.java:36)
	at org.apache.lucene.util.TestRuleAssertionsRequired$1.evaluate(TestRuleAssertionsRequired.java:43)
	at org.apache.lucene.util.TestRuleMarkFailure$1.evaluate(TestRuleMarkFailure.java:48)
	at org.apache.lucene.util.TestRuleIgnoreAfterMaxFailures$1.evaluate(TestRuleIgnoreAfterMaxFailures.java:70)
	at org.apache.lucene.util.TestRuleIgnoreTestSuites$1.evaluate(TestRuleIgnoreTestSuites.java:55)
	at com.carrotsearch.randomizedtesting.rules.StatementAdapter.evaluate(StatementAdapter.java:36)
	at com.carrotsearch.randomizedtesting.ThreadLeakControl$StatementRunner.run(ThreadLeakControl.java:358)
	at java.lang.Thread.run(Thread.java:679)
Caused by: org.apache.solr.common.SolrException: Error Instantiating Update Handler, solr.DirectUpdateHandler2 failed to instantiate org.apache.solr.update.UpdateHandler
	at org.apache.solr.core.SolrCore.<init>(SolrCore.java:789)
	at org.apache.solr.core.SolrCore.<init>(SolrCore.java:602)
	at org.apache.solr.util.TestHarness$Initializer.initialize(TestHarness.java:205)
	at org.apache.solr.util.TestHarness.<init>(TestHarness.java:128)
	... 49 more
Caused by: org.apache.solr.common.SolrException: Error Instantiating Update Handler, solr.DirectUpdateHandler2 failed to instantiate org.apache.solr.update.UpdateHandler
	at org.apache.solr.core.SolrCore.createInstance(SolrCore.java:526)
	at org.apache.solr.core.SolrCore.createUpdateHandler(SolrCore.java:580)
	at org.apache.solr.core.SolrCore.<init>(SolrCore.java:773)
	... 52 more
Caused by: java.lang.reflect.InvocationTargetException
	at sun.reflect.GeneratedConstructorAccessor119.newInstance(Unknown Source)
	at sun.reflect.DelegatingConstructorAccessorImpl.newInstance(DelegatingConstructorAccessorImpl.java:45)
	at java.lang.reflect.Constructor.newInstance(Constructor.java:532)
	at org.apache.solr.core.SolrCore.createInstance(SolrCore.java:512)
	... 54 more
Caused by: java.lang.NullPointerException
	at org.apache.solr.update.UpdateLog.getTlogDir(UpdateLog.java:1399)
	at org.apache.solr.update.UpdateHandler.clearLog(UpdateHandler.java:88)
	at org.apache.solr.update.UpdateHandler.<init>(UpdateHandler.java:127)
	at org.apache.solr.update.DirectUpdateHandler2.<init>(DirectUpdateHandler2.java:96)
	... 58 more


REGRESSION:  org.apache.solr.handler.component.QueryElevationComponentTest.testMarkExcludes

Error Message:
org.apache.solr.common.SolrException: Error Instantiating Update Handler, solr.DirectUpdateHandler2 failed to instantiate org.apache.solr.update.UpdateHandler

Stack Trace:
java.lang.RuntimeException: org.apache.solr.common.SolrException: Error Instantiating Update Handler, solr.DirectUpdateHandler2 failed to instantiate org.apache.solr.update.UpdateHandler
	at __randomizedtesting.SeedInfo.seed([8BADF50C402C6C84:1E944CFDD9C24D19]:0)
	at org.apache.solr.util.TestHarness.<init>(TestHarness.java:137)
	at org.apache.solr.util.TestHarness.<init>(TestHarness.java:122)
	at org.apache.solr.util.TestHarness.<init>(TestHarness.java:112)
	at org.apache.solr.SolrTestCaseJ4.createCore(SolrTestCaseJ4.java:384)
	at org.apache.solr.SolrTestCaseJ4.initCore(SolrTestCaseJ4.java:376)
	at org.apache.solr.SolrTestCaseJ4.initCore(SolrTestCaseJ4.java:188)
	at org.apache.solr.SolrTestCaseJ4.initCore(SolrTestCaseJ4.java:175)
	at org.apache.solr.handler.component.QueryElevationComponentTest.init(QueryElevationComponentTest.java:66)
	at org.apache.solr.handler.component.QueryElevationComponentTest.init(QueryElevationComponentTest.java:54)
	at org.apache.solr.handler.component.QueryElevationComponentTest.testMarkExcludes(QueryElevationComponentTest.java:245)
	at sun.reflect.NativeMethodAccessorImpl.invoke0(Native Method)
	at sun.reflect.NativeMethodAccessorImpl.invoke(NativeMethodAccessorImpl.java:57)
	at sun.reflect.DelegatingMethodAccessorImpl.invoke(DelegatingMethodAccessorImpl.java:43)
	at java.lang.reflect.Method.invoke(Method.java:616)
	at com.carrotsearch.randomizedtesting.RandomizedRunner.invoke(RandomizedRunner.java:1559)
	at com.carrotsearch.randomizedtesting.RandomizedRunner.access$600(RandomizedRunner.java:79)
	at com.carrotsearch.randomizedtesting.RandomizedRunner$6.evaluate(RandomizedRunner.java:737)
	at com.carrotsearch.randomizedtesting.RandomizedRunner$7.evaluate(RandomizedRunner.java:773)
	at com.carrotsearch.randomizedtesting.RandomizedRunner$8.evaluate(RandomizedRunner.java:787)
	at com.carrotsearch.randomizedtesting.rules.SystemPropertiesRestoreRule$1.evaluate(SystemPropertiesRestoreRule.java:53)
	at org.apache.lucene.util.TestRuleSetupTeardownChained$1.evaluate(TestRuleSetupTeardownChained.java:50)
	at org.apache.lucene.util.TestRuleFieldCacheSanity$1.evaluate(TestRuleFieldCacheSanity.java:51)
	at org.apache.lucene.util.AbstractBeforeAfterRule$1.evaluate(AbstractBeforeAfterRule.java:46)
	at com.carrotsearch.randomizedtesting.rules.SystemPropertiesInvariantRule$1.evaluate(SystemPropertiesInvariantRule.java:55)
	at org.apache.lucene.util.TestRuleThreadAndTestName$1.evaluate(TestRuleThreadAndTestName.java:49)
	at org.apache.lucene.util.TestRuleIgnoreAfterMaxFailures$1.evaluate(TestRuleIgnoreAfterMaxFailures.java:70)
	at org.apache.lucene.util.TestRuleMarkFailure$1.evaluate(TestRuleMarkFailure.java:48)
	at com.carrotsearch.randomizedtesting.rules.StatementAdapter.evaluate(StatementAdapter.java:36)
	at com.carrotsearch.randomizedtesting.ThreadLeakControl$StatementRunner.run(ThreadLeakControl.java:358)
	at com.carrotsearch.randomizedtesting.ThreadLeakControl.forkTimeoutingTask(ThreadLeakControl.java:782)
	at com.carrotsearch.randomizedtesting.ThreadLeakControl$3.evaluate(ThreadLeakControl.java:442)
	at com.carrotsearch.randomizedtesting.RandomizedRunner.runSingleTest(RandomizedRunner.java:746)
	at com.carrotsearch.randomizedtesting.RandomizedRunner$3.evaluate(RandomizedRunner.java:648)
	at com.carrotsearch.randomizedtesting.RandomizedRunner$4.evaluate(RandomizedRunner.java:682)
	at com.carrotsearch.randomizedtesting.RandomizedRunner$5.evaluate(RandomizedRunner.java:693)
	at com.carrotsearch.randomizedtesting.rules.StatementAdapter.evaluate(StatementAdapter.java:36)
	at com.carrotsearch.randomizedtesting.rules.SystemPropertiesRestoreRule$1.evaluate(SystemPropertiesRestoreRule.java:53)
	at org.apache.lucene.util.AbstractBeforeAfterRule$1.evaluate(AbstractBeforeAfterRule.java:46)
	at org.apache.lucene.util.TestRuleStoreClassName$1.evaluate(TestRuleStoreClassName.java:42)
	at com.carrotsearch.randomizedtesting.rules.SystemPropertiesInvariantRule$1.evaluate(SystemPropertiesInvariantRule.java:55)
	at com.carrotsearch.randomizedtesting.rules.NoShadowingOrOverridesOnMethodsRule$1.evaluate(NoShadowingOrOverridesOnMethodsRule.java:39)
	at com.carrotsearch.randomizedtesting.rules.NoShadowingOrOverridesOnMethodsRule$1.evaluate(NoShadowingOrOverridesOnMethodsRule.java:39)
	at com.carrotsearch.randomizedtesting.rules.StatementAdapter.evaluate(StatementAdapter.java:36)
	at org.apache.lucene.util.TestRuleAssertionsRequired$1.evaluate(TestRuleAssertionsRequired.java:43)
	at org.apache.lucene.util.TestRuleMarkFailure$1.evaluate(TestRuleMarkFailure.java:48)
	at org.apache.lucene.util.TestRuleIgnoreAfterMaxFailures$1.evaluate(TestRuleIgnoreAfterMaxFailures.java:70)
	at org.apache.lucene.util.TestRuleIgnoreTestSuites$1.evaluate(TestRuleIgnoreTestSuites.java:55)
	at com.carrotsearch.randomizedtesting.rules.StatementAdapter.evaluate(StatementAdapter.java:36)
	at com.carrotsearch.randomizedtesting.ThreadLeakControl$StatementRunner.run(ThreadLeakControl.java:358)
	at java.lang.Thread.run(Thread.java:679)
Caused by: org.apache.solr.common.SolrException: Error Instantiating Update Handler, solr.DirectUpdateHandler2 failed to instantiate org.apache.solr.update.UpdateHandler
	at org.apache.solr.core.SolrCore.<init>(SolrCore.java:789)
	at org.apache.solr.core.SolrCore.<init>(SolrCore.java:602)
	at org.apache.solr.util.TestHarness$Initializer.initialize(TestHarness.java:205)
	at org.apache.solr.util.TestHarness.<init>(TestHarness.java:128)
	... 49 more
Caused by: org.apache.solr.common.SolrException: Error Instantiating Update Handler, solr.DirectUpdateHandler2 failed to instantiate org.apache.solr.update.UpdateHandler
	at org.apache.solr.core.SolrCore.createInstance(SolrCore.java:526)
	at org.apache.solr.core.SolrCore.createUpdateHandler(SolrCore.java:580)
	at org.apache.solr.core.SolrCore.<init>(SolrCore.java:773)
	... 52 more
Caused by: java.lang.reflect.InvocationTargetException
	at sun.reflect.GeneratedConstructorAccessor119.newInstance(Unknown Source)
	at sun.reflect.DelegatingConstructorAccessorImpl.newInstance(DelegatingConstructorAccessorImpl.java:45)
	at java.lang.reflect.Constructor.newInstance(Constructor.java:532)
	at org.apache.solr.core.SolrCore.createInstance(SolrCore.java:512)
	... 54 more
Caused by: java.lang.NullPointerException
	at org.apache.solr.update.UpdateLog.getTlogDir(UpdateLog.java:1399)
	at org.apache.solr.update.UpdateHandler.clearLog(UpdateHandler.java:88)
	at org.apache.solr.update.UpdateHandler.<init>(UpdateHandler.java:127)
	at org.apache.solr.update.DirectUpdateHandler2.<init>(DirectUpdateHandler2.java:96)
	... 58 more


REGRESSION:  org.apache.solr.handler.component.QueryElevationComponentTest.testTrieFieldType

Error Message:
org.apache.solr.common.SolrException: Error Instantiating Update Handler, solr.DirectUpdateHandler2 failed to instantiate org.apache.solr.update.UpdateHandler

Stack Trace:
java.lang.RuntimeException: org.apache.solr.common.SolrException: Error Instantiating Update Handler, solr.DirectUpdateHandler2 failed to instantiate org.apache.solr.update.UpdateHandler
	at __randomizedtesting.SeedInfo.seed([8BADF50C402C6C84:5EA2A5B1E5F8EEEC]:0)
	at org.apache.solr.util.TestHarness.<init>(TestHarness.java:137)
	at org.apache.solr.util.TestHarness.<init>(TestHarness.java:122)
	at org.apache.solr.util.TestHarness.<init>(TestHarness.java:112)
	at org.apache.solr.SolrTestCaseJ4.createCore(SolrTestCaseJ4.java:384)
	at org.apache.solr.SolrTestCaseJ4.initCore(SolrTestCaseJ4.java:376)
	at org.apache.solr.SolrTestCaseJ4.initCore(SolrTestCaseJ4.java:188)
	at org.apache.solr.SolrTestCaseJ4.initCore(SolrTestCaseJ4.java:175)
	at org.apache.solr.handler.component.QueryElevationComponentTest.init(QueryElevationComponentTest.java:66)
	at org.apache.solr.handler.component.QueryElevationComponentTest.init(QueryElevationComponentTest.java:54)
	at org.apache.solr.handler.component.QueryElevationComponentTest.testTrieFieldType(QueryElevationComponentTest.java:111)
	at sun.reflect.NativeMethodAccessorImpl.invoke0(Native Method)
	at sun.reflect.NativeMethodAccessorImpl.invoke(NativeMethodAccessorImpl.java:57)
	at sun.reflect.DelegatingMethodAccessorImpl.invoke(DelegatingMethodAccessorImpl.java:43)
	at java.lang.reflect.Method.invoke(Method.java:616)
	at com.carrotsearch.randomizedtesting.RandomizedRunner.invoke(RandomizedRunner.java:1559)
	at com.carrotsearch.randomizedtesting.RandomizedRunner.access$600(RandomizedRunner.java:79)
	at com.carrotsearch.randomizedtesting.RandomizedRunner$6.evaluate(RandomizedRunner.java:737)
	at com.carrotsearch.randomizedtesting.RandomizedRunner$7.evaluate(RandomizedRunner.java:773)
	at com.carrotsearch.randomizedtesting.RandomizedRunner$8.evaluate(RandomizedRunner.java:787)
	at com.carrotsearch.randomizedtesting.rules.SystemPropertiesRestoreRule$1.evaluate(SystemPropertiesRestoreRule.java:53)
	at org.apache.lucene.util.TestRuleSetupTeardownChained$1.evaluate(TestRuleSetupTeardownChained.java:50)
	at org.apache.lucene.util.TestRuleFieldCacheSanity$1.evaluate(TestRuleFieldCacheSanity.java:51)
	at org.apache.lucene.util.AbstractBeforeAfterRule$1.evaluate(AbstractBeforeAfterRule.java:46)
	at com.carrotsearch.randomizedtesting.rules.SystemPropertiesInvariantRule$1.evaluate(SystemPropertiesInvariantRule.java:55)
	at org.apache.lucene.util.TestRuleThreadAndTestName$1.evaluate(TestRuleThreadAndTestName.java:49)
	at org.apache.lucene.util.TestRuleIgnoreAfterMaxFailures$1.evaluate(TestRuleIgnoreAfterMaxFailures.java:70)
	at org.apache.lucene.util.TestRuleMarkFailure$1.evaluate(TestRuleMarkFailure.java:48)
	at com.carrotsearch.randomizedtesting.rules.StatementAdapter.evaluate(StatementAdapter.java:36)
	at com.carrotsearch.randomizedtesting.ThreadLeakControl$StatementRunner.run(ThreadLeakControl.java:358)
	at com.carrotsearch.randomizedtesting.ThreadLeakControl.forkTimeoutingTask(ThreadLeakControl.java:782)
	at com.carrotsearch.randomizedtesting.ThreadLeakControl$3.evaluate(ThreadLeakControl.java:442)
	at com.carrotsearch.randomizedtesting.RandomizedRunner.runSingleTest(RandomizedRunner.java:746)
	at com.carrotsearch.randomizedtesting.RandomizedRunner$3.evaluate(RandomizedRunner.java:648)
	at com.carrotsearch.randomizedtesting.RandomizedRunner$4.evaluate(RandomizedRunner.java:682)
	at com.carrotsearch.randomizedtesting.RandomizedRunner$5.evaluate(RandomizedRunner.java:693)
	at com.carrotsearch.randomizedtesting.rules.StatementAdapter.evaluate(StatementAdapter.java:36)
	at com.carrotsearch.randomizedtesting.rules.SystemPropertiesRestoreRule$1.evaluate(SystemPropertiesRestoreRule.java:53)
	at org.apache.lucene.util.AbstractBeforeAfterRule$1.evaluate(AbstractBeforeAfterRule.java:46)
	at org.apache.lucene.util.TestRuleStoreClassName$1.evaluate(TestRuleStoreClassName.java:42)
	at com.carrotsearch.randomizedtesting.rules.SystemPropertiesInvariantRule$1.evaluate(SystemPropertiesInvariantRule.java:55)
	at com.carrotsearch.randomizedtesting.rules.NoShadowingOrOverridesOnMethodsRule$1.evaluate(NoShadowingOrOverridesOnMethodsRule.java:39)
	at com.carrotsearch.randomizedtesting.rules.NoShadowingOrOverridesOnMethodsRule$1.evaluate(NoShadowingOrOverridesOnMethodsRule.java:39)
	at com.carrotsearch.randomizedtesting.rules.StatementAdapter.evaluate(StatementAdapter.java:36)
	at org.apache.lucene.util.TestRuleAssertionsRequired$1.evaluate(TestRuleAssertionsRequired.java:43)
	at org.apache.lucene.util.TestRuleMarkFailure$1.evaluate(TestRuleMarkFailure.java:48)
	at org.apache.lucene.util.TestRuleIgnoreAfterMaxFailures$1.evaluate(TestRuleIgnoreAfterMaxFailures.java:70)
	at org.apache.lucene.util.TestRuleIgnoreTestSuites$1.evaluate(TestRuleIgnoreTestSuites.java:55)
	at com.carrotsearch.randomizedtesting.rules.StatementAdapter.evaluate(StatementAdapter.java:36)
	at com.carrotsearch.randomizedtesting.ThreadLeakControl$StatementRunner.run(ThreadLeakControl.java:358)
	at java.lang.Thread.run(Thread.java:679)
Caused by: org.apache.solr.common.SolrException: Error Instantiating Update Handler, solr.DirectUpdateHandler2 failed to instantiate org.apache.solr.update.UpdateHandler
	at org.apache.solr.core.SolrCore.<init>(SolrCore.java:789)
	at org.apache.solr.core.SolrCore.<init>(SolrCore.java:602)
	at org.apache.solr.util.TestHarness$Initializer.initialize(TestHarness.java:205)
	at org.apache.solr.util.TestHarness.<init>(TestHarness.java:128)
	... 49 more
Caused by: org.apache.solr.common.SolrException: Error Instantiating Update Handler, solr.DirectUpdateHandler2 failed to instantiate org.apache.solr.update.UpdateHandler
	at org.apache.solr.core.SolrCore.createInstance(SolrCore.java:526)
	at org.apache.solr.core.SolrCore.createUpdateHandler(SolrCore.java:580)
	at org.apache.solr.core.SolrCore.<init>(SolrCore.java:773)
	... 52 more
Caused by: java.lang.reflect.InvocationTargetException
	at sun.reflect.GeneratedConstructorAccessor119.newInstance(Unknown Source)
	at sun.reflect.DelegatingConstructorAccessorImpl.newInstance(DelegatingConstructorAccessorImpl.java:45)
	at java.lang.reflect.Constructor.newInstance(Constructor.java:532)
	at org.apache.solr.core.SolrCore.createInstance(SolrCore.java:512)
	... 54 more
Caused by: java.lang.NullPointerException
	at org.apache.solr.update.UpdateLog.getTlogDir(UpdateLog.java:1399)
	at org.apache.solr.update.UpdateHandler.clearLog(UpdateHandler.java:88)
	at org.apache.solr.update.UpdateHandler.<init>(UpdateHandler.java:127)
	at org.apache.solr.update.DirectUpdateHandler2.<init>(DirectUpdateHandler2.java:96)
	... 58 more


FAILED:  junit.framework.TestSuite.org.apache.solr.handler.component.SearchHandlerTest

Error Message:
org.apache.solr.common.SolrException: Error Instantiating Update Handler, solr.DirectUpdateHandler2 failed to instantiate org.apache.solr.update.UpdateHandler

Stack Trace:
java.lang.RuntimeException: org.apache.solr.common.SolrException: Error Instantiating Update Handler, solr.DirectUpdateHandler2 failed to instantiate org.apache.solr.update.UpdateHandler
	at __randomizedtesting.SeedInfo.seed([8BADF50C402C6C84]:0)
	at org.apache.solr.util.TestHarness.<init>(TestHarness.java:137)
	at org.apache.solr.util.TestHarness.<init>(TestHarness.java:122)
	at org.apache.solr.util.TestHarness.<init>(TestHarness.java:112)
	at org.apache.solr.SolrTestCaseJ4.createCore(SolrTestCaseJ4.java:384)
	at org.apache.solr.SolrTestCaseJ4.initCore(SolrTestCaseJ4.java:376)
	at org.apache.solr.SolrTestCaseJ4.initCore(SolrTestCaseJ4.java:188)
	at org.apache.solr.SolrTestCaseJ4.initCore(SolrTestCaseJ4.java:175)
	at org.apache.solr.handler.component.SearchHandlerTest.beforeTests(SearchHandlerTest.java:34)
	at sun.reflect.NativeMethodAccessorImpl.invoke0(Native Method)
	at sun.reflect.NativeMethodAccessorImpl.invoke(NativeMethodAccessorImpl.java:57)
	at sun.reflect.DelegatingMethodAccessorImpl.invoke(DelegatingMethodAccessorImpl.java:43)
	at java.lang.reflect.Method.invoke(Method.java:616)
	at com.carrotsearch.randomizedtesting.RandomizedRunner.invoke(RandomizedRunner.java:1559)
	at com.carrotsearch.randomizedtesting.RandomizedRunner.access$600(RandomizedRunner.java:79)
	at com.carrotsearch.randomizedtesting.RandomizedRunner$4.evaluate(RandomizedRunner.java:677)
	at com.carrotsearch.randomizedtesting.RandomizedRunner$5.evaluate(RandomizedRunner.java:693)
	at com.carrotsearch.randomizedtesting.rules.StatementAdapter.evaluate(StatementAdapter.java:36)
	at com.carrotsearch.randomizedtesting.rules.SystemPropertiesRestoreRule$1.evaluate(SystemPropertiesRestoreRule.java:53)
	at org.apache.lucene.util.AbstractBeforeAfterRule$1.evaluate(AbstractBeforeAfterRule.java:46)
	at org.apache.lucene.util.TestRuleStoreClassName$1.evaluate(TestRuleStoreClassName.java:42)
	at com.carrotsearch.randomizedtesting.rules.SystemPropertiesInvariantRule$1.evaluate(SystemPropertiesInvariantRule.java:55)
	at com.carrotsearch.randomizedtesting.rules.NoShadowingOrOverridesOnMethodsRule$1.evaluate(NoShadowingOrOverridesOnMethodsRule.java:39)
	at com.carrotsearch.randomizedtesting.rules.NoShadowingOrOverridesOnMethodsRule$1.evaluate(NoShadowingOrOverridesOnMethodsRule.java:39)
	at com.carrotsearch.randomizedtesting.rules.StatementAdapter.evaluate(StatementAdapter.java:36)
	at org.apache.lucene.util.TestRuleAssertionsRequired$1.evaluate(TestRuleAssertionsRequired.java:43)
	at org.apache.lucene.util.TestRuleMarkFailure$1.evaluate(TestRuleMarkFailure.java:48)
	at org.apache.lucene.util.TestRuleIgnoreAfterMaxFailures$1.evaluate(TestRuleIgnoreAfterMaxFailures.java:70)
	at org.apache.lucene.util.TestRuleIgnoreTestSuites$1.evaluate(TestRuleIgnoreTestSuites.java:55)
	at com.carrotsearch.randomizedtesting.rules.StatementAdapter.evaluate(StatementAdapter.java:36)
	at com.carrotsearch.randomizedtesting.ThreadLeakControl$StatementRunner.run(ThreadLeakControl.java:358)
	at java.lang.Thread.run(Thread.java:679)
Caused by: org.apache.solr.common.SolrException: Error Instantiating Update Handler, solr.DirectUpdateHandler2 failed to instantiate org.apache.solr.update.UpdateHandler
	at org.apache.solr.core.SolrCore.<init>(SolrCore.java:789)
	at org.apache.solr.core.SolrCore.<init>(SolrCore.java:602)
	at org.apache.solr.util.TestHarness$Initializer.initialize(TestHarness.java:205)
	at org.apache.solr.util.TestHarness.<init>(TestHarness.java:128)
	... 30 more
Caused by: org.apache.solr.common.SolrException: Error Instantiating Update Handler, solr.DirectUpdateHandler2 failed to instantiate org.apache.solr.update.UpdateHandler
	at org.apache.solr.core.SolrCore.createInstance(SolrCore.java:526)
	at org.apache.solr.core.SolrCore.createUpdateHandler(SolrCore.java:580)
	at org.apache.solr.core.SolrCore.<init>(SolrCore.java:773)
	... 33 more
Caused by: java.lang.reflect.InvocationTargetException
	at sun.reflect.GeneratedConstructorAccessor119.newInstance(Unknown Source)
	at sun.reflect.DelegatingConstructorAccessorImpl.newInstance(DelegatingConstructorAccessorImpl.java:45)
	at java.lang.reflect.Constructor.newInstance(Constructor.java:532)
	at org.apache.solr.core.SolrCore.createInstance(SolrCore.java:512)
	... 35 more
Caused by: java.lang.NullPointerException
	at org.apache.solr.update.UpdateLog.getTlogDir(UpdateLog.java:1399)
	at org.apache.solr.update.UpdateHandler.clearLog(UpdateHandler.java:88)
	at org.apache.solr.update.UpdateHandler.<init>(UpdateHandler.java:127)
	at org.apache.solr.update.DirectUpdateHandler2.<init>(DirectUpdateHandler2.java:96)
	... 39 more


FAILED:  junit.framework.TestSuite.org.apache.solr.handler.component.SpellCheckComponentTest

Error Message:
org.apache.solr.common.SolrException: Error Instantiating Update Handler, org.apache.solr.update.DirectUpdateHandler2 failed to instantiate org.apache.solr.update.UpdateHandler

Stack Trace:
java.lang.RuntimeException: org.apache.solr.common.SolrException: Error Instantiating Update Handler, org.apache.solr.update.DirectUpdateHandler2 failed to instantiate org.apache.solr.update.UpdateHandler
	at __randomizedtesting.SeedInfo.seed([8BADF50C402C6C84]:0)
	at org.apache.solr.util.TestHarness.<init>(TestHarness.java:137)
	at org.apache.solr.util.TestHarness.<init>(TestHarness.java:122)
	at org.apache.solr.util.TestHarness.<init>(TestHarness.java:112)
	at org.apache.solr.SolrTestCaseJ4.createCore(SolrTestCaseJ4.java:384)
	at org.apache.solr.SolrTestCaseJ4.initCore(SolrTestCaseJ4.java:376)
	at org.apache.solr.SolrTestCaseJ4.initCore(SolrTestCaseJ4.java:188)
	at org.apache.solr.SolrTestCaseJ4.initCore(SolrTestCaseJ4.java:175)
	at org.apache.solr.handler.component.SpellCheckComponentTest.beforeClass(SpellCheckComponentTest.java:51)
	at sun.reflect.NativeMethodAccessorImpl.invoke0(Native Method)
	at sun.reflect.NativeMethodAccessorImpl.invoke(NativeMethodAccessorImpl.java:57)
	at sun.reflect.DelegatingMethodAccessorImpl.invoke(DelegatingMethodAccessorImpl.java:43)
	at java.lang.reflect.Method.invoke(Method.java:616)
	at com.carrotsearch.randomizedtesting.RandomizedRunner.invoke(RandomizedRunner.java:1559)
	at com.carrotsearch.randomizedtesting.RandomizedRunner.access$600(RandomizedRunner.java:79)
	at com.carrotsearch.randomizedtesting.RandomizedRunner$4.evaluate(RandomizedRunner.java:677)
	at com.carrotsearch.randomizedtesting.RandomizedRunner$5.evaluate(RandomizedRunner.java:693)
	at com.carrotsearch.randomizedtesting.rules.StatementAdapter.evaluate(StatementAdapter.java:36)
	at com.carrotsearch.randomizedtesting.rules.SystemPropertiesRestoreRule$1.evaluate(SystemPropertiesRestoreRule.java:53)
	at org.apache.lucene.util.AbstractBeforeAfterRule$1.evaluate(AbstractBeforeAfterRule.java:46)
	at org.apache.lucene.util.TestRuleStoreClassName$1.evaluate(TestRuleStoreClassName.java:42)
	at com.carrotsearch.randomizedtesting.rules.SystemPropertiesInvariantRule$1.evaluate(SystemPropertiesInvariantRule.java:55)
	at com.carrotsearch.randomizedtesting.rules.NoShadowingOrOverridesOnMethodsRule$1.evaluate(NoShadowingOrOverridesOnMethodsRule.java:39)
	at com.carrotsearch.randomizedtesting.rules.NoShadowingOrOverridesOnMethodsRule$1.evaluate(NoShadowingOrOverridesOnMethodsRule.java:39)
	at com.carrotsearch.randomizedtesting.rules.StatementAdapter.evaluate(StatementAdapter.java:36)
	at org.apache.lucene.util.TestRuleAssertionsRequired$1.evaluate(TestRuleAssertionsRequired.java:43)
	at org.apache.lucene.util.TestRuleMarkFailure$1.evaluate(TestRuleMarkFailure.java:48)
	at org.apache.lucene.util.TestRuleIgnoreAfterMaxFailures$1.evaluate(TestRuleIgnoreAfterMaxFailures.java:70)
	at org.apache.lucene.util.TestRuleIgnoreTestSuites$1.evaluate(TestRuleIgnoreTestSuites.java:55)
	at com.carrotsearch.randomizedtesting.rules.StatementAdapter.evaluate(StatementAdapter.java:36)
	at com.carrotsearch.randomizedtesting.ThreadLeakControl$StatementRunner.run(ThreadLeakControl.java:358)
	at java.lang.Thread.run(Thread.java:679)
Caused by: org.apache.solr.common.SolrException: Error Instantiating Update Handler, org.apache.solr.update.DirectUpdateHandler2 failed to instantiate org.apache.solr.update.UpdateHandler
	at org.apache.solr.core.SolrCore.<init>(SolrCore.java:789)
	at org.apache.solr.core.SolrCore.<init>(SolrCore.java:602)
	at org.apache.solr.util.TestHarness$Initializer.initialize(TestHarness.java:205)
	at org.apache.solr.util.TestHarness.<init>(TestHarness.java:128)
	... 30 more
Caused by: org.apache.solr.common.SolrException: Error Instantiating Update Handler, org.apache.solr.update.DirectUpdateHandler2 failed to instantiate org.apache.solr.update.UpdateHandler
	at org.apache.solr.core.SolrCore.createInstance(SolrCore.java:526)
	at org.apache.solr.core.SolrCore.createUpdateHandler(SolrCore.java:580)
	at org.apache.solr.core.SolrCore.<init>(SolrCore.java:773)
	... 33 more
Caused by: java.lang.reflect.InvocationTargetException
	at sun.reflect.GeneratedConstructorAccessor119.newInstance(Unknown Source)
	at sun.reflect.DelegatingConstructorAccessorImpl.newInstance(DelegatingConstructorAccessorImpl.java:45)
	at java.lang.reflect.Constructor.newInstance(Constructor.java:532)
	at org.apache.solr.core.SolrCore.createInstance(SolrCore.java:512)
	... 35 more
Caused by: java.lang.NullPointerException
	at org.apache.solr.update.UpdateLog.getTlogDir(UpdateLog.java:1399)
	at org.apache.solr.update.UpdateHandler.clearLog(UpdateHandler.java:88)
	at org.apache.solr.update.UpdateHandler.<init>(UpdateHandler.java:127)
	at org.apache.solr.update.DirectUpdateHandler2.<init>(DirectUpdateHandler2.java:96)
	... 39 more


FAILED:  junit.framework.TestSuite.org.apache.solr.highlight.HighlighterConfigTest

Error Message:
org.apache.solr.common.SolrException: Error Instantiating Update Handler, solr.DirectUpdateHandler2 failed to instantiate org.apache.solr.update.UpdateHandler

Stack Trace:
java.lang.RuntimeException: org.apache.solr.common.SolrException: Error Instantiating Update Handler, solr.DirectUpdateHandler2 failed to instantiate org.apache.solr.update.UpdateHandler
	at __randomizedtesting.SeedInfo.seed([8BADF50C402C6C84]:0)
	at org.apache.solr.util.TestHarness.<init>(TestHarness.java:137)
	at org.apache.solr.util.TestHarness.<init>(TestHarness.java:122)
	at org.apache.solr.util.TestHarness.<init>(TestHarness.java:112)
	at org.apache.solr.SolrTestCaseJ4.createCore(SolrTestCaseJ4.java:384)
	at org.apache.solr.SolrTestCaseJ4.initCore(SolrTestCaseJ4.java:376)
	at org.apache.solr.SolrTestCaseJ4.initCore(SolrTestCaseJ4.java:188)
	at org.apache.solr.SolrTestCaseJ4.initCore(SolrTestCaseJ4.java:175)
	at org.apache.solr.highlight.HighlighterConfigTest.beforeClass(HighlighterConfigTest.java:30)
	at sun.reflect.NativeMethodAccessorImpl.invoke0(Native Method)
	at sun.reflect.NativeMethodAccessorImpl.invoke(NativeMethodAccessorImpl.java:57)
	at sun.reflect.DelegatingMethodAccessorImpl.invoke(DelegatingMethodAccessorImpl.java:43)
	at java.lang.reflect.Method.invoke(Method.java:616)
	at com.carrotsearch.randomizedtesting.RandomizedRunner.invoke(RandomizedRunner.java:1559)
	at com.carrotsearch.randomizedtesting.RandomizedRunner.access$600(RandomizedRunner.java:79)
	at com.carrotsearch.randomizedtesting.RandomizedRunner$4.evaluate(RandomizedRunner.java:677)
	at com.carrotsearch.randomizedtesting.RandomizedRunner$5.evaluate(RandomizedRunner.java:693)
	at com.carrotsearch.randomizedtesting.rules.StatementAdapter.evaluate(StatementAdapter.java:36)
	at com.carrotsearch.randomizedtesting.rules.SystemPropertiesRestoreRule$1.evaluate(SystemPropertiesRestoreRule.java:53)
	at org.apache.lucene.util.AbstractBeforeAfterRule$1.evaluate(AbstractBeforeAfterRule.java:46)
	at org.apache.lucene.util.TestRuleStoreClassName$1.evaluate(TestRuleStoreClassName.java:42)
	at com.carrotsearch.randomizedtesting.rules.SystemPropertiesInvariantRule$1.evaluate(SystemPropertiesInvariantRule.java:55)
	at com.carrotsearch.randomizedtesting.rules.NoShadowingOrOverridesOnMethodsRule$1.evaluate(NoShadowingOrOverridesOnMethodsRule.java:39)
	at com.carrotsearch.randomizedtesting.rules.NoShadowingOrOverridesOnMethodsRule$1.evaluate(NoShadowingOrOverridesOnMethodsRule.java:39)
	at com.carrotsearch.randomizedtesting.rules.StatementAdapter.evaluate(StatementAdapter.java:36)
	at org.apache.lucene.util.TestRuleAssertionsRequired$1.evaluate(TestRuleAssertionsRequired.java:43)
	at org.apache.lucene.util.TestRuleMarkFailure$1.evaluate(TestRuleMarkFailure.java:48)
	at org.apache.lucene.util.TestRuleIgnoreAfterMaxFailures$1.evaluate(TestRuleIgnoreAfterMaxFailures.java:70)
	at org.apache.lucene.util.TestRuleIgnoreTestSuites$1.evaluate(TestRuleIgnoreTestSuites.java:55)
	at com.carrotsearch.randomizedtesting.rules.StatementAdapter.evaluate(StatementAdapter.java:36)
	at com.carrotsearch.randomizedtesting.ThreadLeakControl$StatementRunner.run(ThreadLeakControl.java:358)
	at java.lang.Thread.run(Thread.java:679)
Caused by: org.apache.solr.common.SolrException: Error Instantiating Update Handler, solr.DirectUpdateHandler2 failed to instantiate org.apache.solr.update.UpdateHandler
	at org.apache.solr.core.SolrCore.<init>(SolrCore.java:789)
	at org.apache.solr.core.SolrCore.<init>(SolrCore.java:602)
	at org.apache.solr.util.TestHarness$Initializer.initialize(TestHarness.java:205)
	at org.apache.solr.util.TestHarness.<init>(TestHarness.java:128)
	... 30 more
Caused by: org.apache.solr.common.SolrException: Error Instantiating Update Handler, solr.DirectUpdateHandler2 failed to instantiate org.apache.solr.update.UpdateHandler
	at org.apache.solr.core.SolrCore.createInstance(SolrCore.java:526)
	at org.apache.solr.core.SolrCore.createUpdateHandler(SolrCore.java:580)
	at org.apache.solr.core.SolrCore.<init>(SolrCore.java:773)
	... 33 more
Caused by: java.lang.reflect.InvocationTargetException
	at sun.reflect.NativeConstructorAccessorImpl.newInstance0(Native Method)
	at sun.reflect.NativeConstructorAccessorImpl.newInstance(NativeConstructorAccessorImpl.java:57)
	at sun.reflect.DelegatingConstructorAccessorImpl.newInstance(DelegatingConstructorAccessorImpl.java:45)
	at java.lang.reflect.Constructor.newInstance(Constructor.java:532)
	at org.apache.solr.core.SolrCore.createInstance(SolrCore.java:512)
	... 35 more
Caused by: java.lang.NullPointerException
	at org.apache.solr.update.UpdateLog.getTlogDir(UpdateLog.java:1399)
	at org.apache.solr.update.UpdateHandler.clearLog(UpdateHandler.java:88)
	at org.apache.solr.update.UpdateHandler.<init>(UpdateHandler.java:127)
	at org.apache.solr.update.DirectUpdateHandler2.<init>(DirectUpdateHandler2.java:96)
	... 40 more


FAILED:  junit.framework.TestSuite.org.apache.solr.request.SimpleFacetsTest

Error Message:
org.apache.solr.common.SolrException: Error Instantiating Update Handler, solr.DirectUpdateHandler2 failed to instantiate org.apache.solr.update.UpdateHandler

Stack Trace:
java.lang.RuntimeException: org.apache.solr.common.SolrException: Error Instantiating Update Handler, solr.DirectUpdateHandler2 failed to instantiate org.apache.solr.update.UpdateHandler
	at __randomizedtesting.SeedInfo.seed([8BADF50C402C6C84]:0)
	at org.apache.solr.util.TestHarness.<init>(TestHarness.java:137)
	at org.apache.solr.util.TestHarness.<init>(TestHarness.java:122)
	at org.apache.solr.util.TestHarness.<init>(TestHarness.java:112)
	at org.apache.solr.SolrTestCaseJ4.createCore(SolrTestCaseJ4.java:384)
	at org.apache.solr.SolrTestCaseJ4.initCore(SolrTestCaseJ4.java:376)
	at org.apache.solr.SolrTestCaseJ4.initCore(SolrTestCaseJ4.java:188)
	at org.apache.solr.SolrTestCaseJ4.initCore(SolrTestCaseJ4.java:175)
	at org.apache.solr.request.SimpleFacetsTest.beforeClass(SimpleFacetsTest.java:39)
	at sun.reflect.NativeMethodAccessorImpl.invoke0(Native Method)
	at sun.reflect.NativeMethodAccessorImpl.invoke(NativeMethodAccessorImpl.java:57)
	at sun.reflect.DelegatingMethodAccessorImpl.invoke(DelegatingMethodAccessorImpl.java:43)
	at java.lang.reflect.Method.invoke(Method.java:616)
	at com.carrotsearch.randomizedtesting.RandomizedRunner.invoke(RandomizedRunner.java:1559)
	at com.carrotsearch.randomizedtesting.RandomizedRunner.access$600(RandomizedRunner.java:79)
	at com.carrotsearch.randomizedtesting.RandomizedRunner$4.evaluate(RandomizedRunner.java:677)
	at com.carrotsearch.randomizedtesting.RandomizedRunner$5.evaluate(RandomizedRunner.java:693)
	at com.carrotsearch.randomizedtesting.rules.StatementAdapter.evaluate(StatementAdapter.java:36)
	at com.carrotsearch.randomizedtesting.rules.SystemPropertiesRestoreRule$1.evaluate(SystemPropertiesRestoreRule.java:53)
	at org.apache.lucene.util.AbstractBeforeAfterRule$1.evaluate(AbstractBeforeAfterRule.java:46)
	at org.apache.lucene.util.TestRuleStoreClassName$1.evaluate(TestRuleStoreClassName.java:42)
	at com.carrotsearch.randomizedtesting.rules.SystemPropertiesInvariantRule$1.evaluate(SystemPropertiesInvariantRule.java:55)
	at com.carrotsearch.randomizedtesting.rules.NoShadowingOrOverridesOnMethodsRule$1.evaluate(NoShadowingOrOverridesOnMethodsRule.java:39)
	at com.carrotsearch.randomizedtesting.rules.NoShadowingOrOverridesOnMethodsRule$1.evaluate(NoShadowingOrOverridesOnMethodsRule.java:39)
	at com.carrotsearch.randomizedtesting.rules.StatementAdapter.evaluate(StatementAdapter.java:36)
	at org.apache.lucene.util.TestRuleAssertionsRequired$1.evaluate(TestRuleAssertionsRequired.java:43)
	at org.apache.lucene.util.TestRuleMarkFailure$1.evaluate(TestRuleMarkFailure.java:48)
	at org.apache.lucene.util.TestRuleIgnoreAfterMaxFailures$1.evaluate(TestRuleIgnoreAfterMaxFailures.java:70)
	at org.apache.lucene.util.TestRuleIgnoreTestSuites$1.evaluate(TestRuleIgnoreTestSuites.java:55)
	at com.carrotsearch.randomizedtesting.rules.StatementAdapter.evaluate(StatementAdapter.java:36)
	at com.carrotsearch.randomizedtesting.ThreadLeakControl$StatementRunner.run(ThreadLeakControl.java:358)
	at java.lang.Thread.run(Thread.java:679)
Caused by: org.apache.solr.common.SolrException: Error Instantiating Update Handler, solr.DirectUpdateHandler2 failed to instantiate org.apache.solr.update.UpdateHandler
	at org.apache.solr.core.SolrCore.<init>(SolrCore.java:789)
	at org.apache.solr.core.SolrCore.<init>(SolrCore.java:602)
	at org.apache.solr.util.TestHarness$Initializer.initialize(TestHarness.java:205)
	at org.apache.solr.util.TestHarness.<init>(TestHarness.java:128)
	... 30 more
Caused by: org.apache.solr.common.SolrException: Error Instantiating Update Handler, solr.DirectUpdateHandler2 failed to instantiate org.apache.solr.update.UpdateHandler
	at org.apache.solr.core.SolrCore.createInstance(SolrCore.java:526)
	at org.apache.solr.core.SolrCore.createUpdateHandler(SolrCore.java:580)
	at org.apache.solr.core.SolrCore.<init>(SolrCore.java:773)
	... 33 more
Caused by: java.lang.reflect.InvocationTargetException
	at sun.reflect.GeneratedConstructorAccessor119.newInstance(Unknown Source)
	at sun.reflect.DelegatingConstructorAccessorImpl.newInstance(DelegatingConstructorAccessorImpl.java:45)
	at java.lang.reflect.Constructor.newInstance(Constructor.java:532)
	at org.apache.solr.core.SolrCore.createInstance(SolrCore.java:512)
	... 35 more
Caused by: java.lang.NullPointerException
	at org.apache.solr.update.UpdateLog.getTlogDir(UpdateLog.java:1399)
	at org.apache.solr.update.UpdateHandler.clearLog(UpdateHandler.java:88)
	at org.apache.solr.update.UpdateHandler.<init>(UpdateHandler.java:127)
	at org.apache.solr.update.DirectUpdateHandler2.<init>(DirectUpdateHandler2.java:96)
	... 39 more


FAILED:  junit.framework.TestSuite.org.apache.solr.request.TestBinaryResponseWriter

Error Message:
org.apache.solr.common.SolrException: Error Instantiating Update Handler, solr.DirectUpdateHandler2 failed to instantiate org.apache.solr.update.UpdateHandler

Stack Trace:
java.lang.RuntimeException: org.apache.solr.common.SolrException: Error Instantiating Update Handler, solr.DirectUpdateHandler2 failed to instantiate org.apache.solr.update.UpdateHandler
	at __randomizedtesting.SeedInfo.seed([8BADF50C402C6C84]:0)
	at org.apache.solr.util.TestHarness.<init>(TestHarness.java:137)
	at org.apache.solr.util.TestHarness.<init>(TestHarness.java:122)
	at org.apache.solr.util.TestHarness.<init>(TestHarness.java:112)
	at org.apache.solr.SolrTestCaseJ4.createCore(SolrTestCaseJ4.java:384)
	at org.apache.solr.SolrTestCaseJ4.initCore(SolrTestCaseJ4.java:376)
	at org.apache.solr.SolrTestCaseJ4.initCore(SolrTestCaseJ4.java:188)
	at org.apache.solr.SolrTestCaseJ4.initCore(SolrTestCaseJ4.java:175)
	at org.apache.solr.request.TestBinaryResponseWriter.beforeClass(TestBinaryResponseWriter.java:47)
	at sun.reflect.NativeMethodAccessorImpl.invoke0(Native Method)
	at sun.reflect.NativeMethodAccessorImpl.invoke(NativeMethodAccessorImpl.java:57)
	at sun.reflect.DelegatingMethodAccessorImpl.invoke(DelegatingMethodAccessorImpl.java:43)
	at java.lang.reflect.Method.invoke(Method.java:616)
	at com.carrotsearch.randomizedtesting.RandomizedRunner.invoke(RandomizedRunner.java:1559)
	at com.carrotsearch.randomizedtesting.RandomizedRunner.access$600(RandomizedRunner.java:79)
	at com.carrotsearch.randomizedtesting.RandomizedRunner$4.evaluate(RandomizedRunner.java:677)
	at com.carrotsearch.randomizedtesting.RandomizedRunner$5.evaluate(RandomizedRunner.java:693)
	at com.carrotsearch.randomizedtesting.rules.StatementAdapter.evaluate(StatementAdapter.java:36)
	at com.carrotsearch.randomizedtesting.rules.SystemPropertiesRestoreRule$1.evaluate(SystemPropertiesRestoreRule.java:53)
	at org.apache.lucene.util.AbstractBeforeAfterRule$1.evaluate(AbstractBeforeAfterRule.java:46)
	at org.apache.lucene.util.TestRuleStoreClassName$1.evaluate(TestRuleStoreClassName.java:42)
	at com.carrotsearch.randomizedtesting.rules.SystemPropertiesInvariantRule$1.evaluate(SystemPropertiesInvariantRule.java:55)
	at com.carrotsearch.randomizedtesting.rules.NoShadowingOrOverridesOnMethodsRule$1.evaluate(NoShadowingOrOverridesOnMethodsRule.java:39)
	at com.carrotsearch.randomizedtesting.rules.NoShadowingOrOverridesOnMethodsRule$1.evaluate(NoShadowingOrOverridesOnMethodsRule.java:39)
	at com.carrotsearch.randomizedtesting.rules.StatementAdapter.evaluate(StatementAdapter.java:36)
	at org.apache.lucene.util.TestRuleAssertionsRequired$1.evaluate(TestRuleAssertionsRequired.java:43)
	at org.apache.lucene.util.TestRuleMarkFailure$1.evaluate(TestRuleMarkFailure.java:48)
	at org.apache.lucene.util.TestRuleIgnoreAfterMaxFailures$1.evaluate(TestRuleIgnoreAfterMaxFailures.java:70)
	at org.apache.lucene.util.TestRuleIgnoreTestSuites$1.evaluate(TestRuleIgnoreTestSuites.java:55)
	at com.carrotsearch.randomizedtesting.rules.StatementAdapter.evaluate(StatementAdapter.java:36)
	at com.carrotsearch.randomizedtesting.ThreadLeakControl$StatementRunner.run(ThreadLeakControl.java:358)
	at java.lang.Thread.run(Thread.java:679)
Caused by: org.apache.solr.common.SolrException: Error Instantiating Update Handler, solr.DirectUpdateHandler2 failed to instantiate org.apache.solr.update.UpdateHandler
	at org.apache.solr.core.SolrCore.<init>(SolrCore.java:789)
	at org.apache.solr.core.SolrCore.<init>(SolrCore.java:602)
	at org.apache.solr.util.TestHarness$Initializer.initialize(TestHarness.java:205)
	at org.apache.solr.util.TestHarness.<init>(TestHarness.java:128)
	... 30 more
Caused by: org.apache.solr.common.SolrException: Error Instantiating Update Handler, solr.DirectUpdateHandler2 failed to instantiate org.apache.solr.update.UpdateHandler
	at org.apache.solr.core.SolrCore.createInstance(SolrCore.java:526)
	at org.apache.solr.core.SolrCore.createUpdateHandler(SolrCore.java:580)
	at org.apache.solr.core.SolrCore.<init>(SolrCore.java:773)
	... 33 more
Caused by: java.lang.reflect.InvocationTargetException
	at sun.reflect.GeneratedConstructorAccessor119.newInstance(Unknown Source)
	at sun.reflect.DelegatingConstructorAccessorImpl.newInstance(DelegatingConstructorAccessorImpl.java:45)
	at java.lang.reflect.Constructor.newInstance(Constructor.java:532)
	at org.apache.solr.core.SolrCore.createInstance(SolrCore.java:512)
	... 35 more
Caused by: java.lang.NullPointerException
	at org.apache.solr.update.UpdateLog.getTlogDir(UpdateLog.java:1399)
	at org.apache.solr.update.UpdateHandler.clearLog(UpdateHandler.java:88)
	at org.apache.solr.update.UpdateHandler.<init>(UpdateHandler.java:127)
	at org.apache.solr.update.DirectUpdateHandler2.<init>(DirectUpdateHandler2.java:96)
	... 39 more


FAILED:  junit.framework.TestSuite.org.apache.solr.request.TestFaceting

Error Message:
org.apache.solr.common.SolrException: Error Instantiating Update Handler, solr.DirectUpdateHandler2 failed to instantiate org.apache.solr.update.UpdateHandler

Stack Trace:
java.lang.RuntimeException: org.apache.solr.common.SolrException: Error Instantiating Update Handler, solr.DirectUpdateHandler2 failed to instantiate org.apache.solr.update.UpdateHandler
	at __randomizedtesting.SeedInfo.seed([8BADF50C402C6C84]:0)
	at org.apache.solr.util.TestHarness.<init>(TestHarness.java:137)
	at org.apache.solr.util.TestHarness.<init>(TestHarness.java:122)
	at org.apache.solr.util.TestHarness.<init>(TestHarness.java:112)
	at org.apache.solr.SolrTestCaseJ4.createCore(SolrTestCaseJ4.java:384)
	at org.apache.solr.SolrTestCaseJ4.initCore(SolrTestCaseJ4.java:376)
	at org.apache.solr.SolrTestCaseJ4.initCore(SolrTestCaseJ4.java:188)
	at org.apache.solr.SolrTestCaseJ4.initCore(SolrTestCaseJ4.java:175)
	at org.apache.solr.request.TestFaceting.beforeClass(TestFaceting.java:38)
	at sun.reflect.NativeMethodAccessorImpl.invoke0(Native Method)
	at sun.reflect.NativeMethodAccessorImpl.invoke(NativeMethodAccessorImpl.java:57)
	at sun.reflect.DelegatingMethodAccessorImpl.invoke(DelegatingMethodAccessorImpl.java:43)
	at java.lang.reflect.Method.invoke(Method.java:616)
	at com.carrotsearch.randomizedtesting.RandomizedRunner.invoke(RandomizedRunner.java:1559)
	at com.carrotsearch.randomizedtesting.RandomizedRunner.access$600(RandomizedRunner.java:79)
	at com.carrotsearch.randomizedtesting.RandomizedRunner$4.evaluate(RandomizedRunner.java:677)
	at com.carrotsearch.randomizedtesting.RandomizedRunner$5.evaluate(RandomizedRunner.java:693)
	at com.carrotsearch.randomizedtesting.rules.StatementAdapter.evaluate(StatementAdapter.java:36)
	at com.carrotsearch.randomizedtesting.rules.SystemPropertiesRestoreRule$1.evaluate(SystemPropertiesRestoreRule.java:53)
	at org.apache.lucene.util.AbstractBeforeAfterRule$1.evaluate(AbstractBeforeAfterRule.java:46)
	at org.apache.lucene.util.TestRuleStoreClassName$1.evaluate(TestRuleStoreClassName.java:42)
	at com.carrotsearch.randomizedtesting.rules.SystemPropertiesInvariantRule$1.evaluate(SystemPropertiesInvariantRule.java:55)
	at com.carrotsearch.randomizedtesting.rules.NoShadowingOrOverridesOnMethodsRule$1.evaluate(NoShadowingOrOverridesOnMethodsRule.java:39)
	at com.carrotsearch.randomizedtesting.rules.NoShadowingOrOverridesOnMethodsRule$1.evaluate(NoShadowingOrOverridesOnMethodsRule.java:39)
	at com.carrotsearch.randomizedtesting.rules.StatementAdapter.evaluate(StatementAdapter.java:36)
	at org.apache.lucene.util.TestRuleAssertionsRequired$1.evaluate(TestRuleAssertionsRequired.java:43)
	at org.apache.lucene.util.TestRuleMarkFailure$1.evaluate(TestRuleMarkFailure.java:48)
	at org.apache.lucene.util.TestRuleIgnoreAfterMaxFailures$1.evaluate(TestRuleIgnoreAfterMaxFailures.java:70)
	at org.apache.lucene.util.TestRuleIgnoreTestSuites$1.evaluate(TestRuleIgnoreTestSuites.java:55)
	at com.carrotsearch.randomizedtesting.rules.StatementAdapter.evaluate(StatementAdapter.java:36)
	at com.carrotsearch.randomizedtesting.ThreadLeakControl$StatementRunner.run(ThreadLeakControl.java:358)
	at java.lang.Thread.run(Thread.java:679)
Caused by: org.apache.solr.common.SolrException: Error Instantiating Update Handler, solr.DirectUpdateHandler2 failed to instantiate org.apache.solr.update.UpdateHandler
	at org.apache.solr.core.SolrCore.<init>(SolrCore.java:789)
	at org.apache.solr.core.SolrCore.<init>(SolrCore.java:602)
	at org.apache.solr.util.TestHarness$Initializer.initialize(TestHarness.java:205)
	at org.apache.solr.util.TestHarness.<init>(TestHarness.java:128)
	... 30 more
Caused by: org.apache.solr.common.SolrException: Error Instantiating Update Handler, solr.DirectUpdateHandler2 failed to instantiate org.apache.solr.update.UpdateHandler
	at org.apache.solr.core.SolrCore.createInstance(SolrCore.java:526)
	at org.apache.solr.core.SolrCore.createUpdateHandler(SolrCore.java:580)
	at org.apache.solr.core.SolrCore.<init>(SolrCore.java:773)
	... 33 more
Caused by: java.lang.reflect.InvocationTargetException
	at sun.reflect.GeneratedConstructorAccessor119.newInstance(Unknown Source)
	at sun.reflect.DelegatingConstructorAccessorImpl.newInstance(DelegatingConstructorAccessorImpl.java:45)
	at java.lang.reflect.Constructor.newInstance(Constructor.java:532)
	at org.apache.solr.core.SolrCore.createInstance(SolrCore.java:512)
	... 35 more
Caused by: java.lang.NullPointerException
	at org.apache.solr.update.UpdateLog.getTlogDir(UpdateLog.java:1399)
	at org.apache.solr.update.UpdateHandler.clearLog(UpdateHandler.java:88)
	at org.apache.solr.update.UpdateHandler.<init>(UpdateHandler.java:127)
	at org.apache.solr.update.DirectUpdateHandler2.<init>(DirectUpdateHandler2.java:96)
	... 39 more


FAILED:  junit.framework.TestSuite.org.apache.solr.response.TestPHPSerializedResponseWriter

Error Message:
org.apache.solr.common.SolrException: Error Instantiating Update Handler, solr.DirectUpdateHandler2 failed to instantiate org.apache.solr.update.UpdateHandler

Stack Trace:
java.lang.RuntimeException: org.apache.solr.common.SolrException: Error Instantiating Update Handler, solr.DirectUpdateHandler2 failed to instantiate org.apache.solr.update.UpdateHandler
	at __randomizedtesting.SeedInfo.seed([8BADF50C402C6C84]:0)
	at org.apache.solr.util.TestHarness.<init>(TestHarness.java:137)
	at org.apache.solr.util.TestHarness.<init>(TestHarness.java:122)
	at org.apache.solr.util.TestHarness.<init>(TestHarness.java:112)
	at org.apache.solr.SolrTestCaseJ4.createCore(SolrTestCaseJ4.java:384)
	at org.apache.solr.SolrTestCaseJ4.initCore(SolrTestCaseJ4.java:376)
	at org.apache.solr.SolrTestCaseJ4.initCore(SolrTestCaseJ4.java:188)
	at org.apache.solr.SolrTestCaseJ4.initCore(SolrTestCaseJ4.java:175)
	at org.apache.solr.response.TestPHPSerializedResponseWriter.beforeClass(TestPHPSerializedResponseWriter.java:43)
	at sun.reflect.NativeMethodAccessorImpl.invoke0(Native Method)
	at sun.reflect.NativeMethodAccessorImpl.invoke(NativeMethodAccessorImpl.java:57)
	at sun.reflect.DelegatingMethodAccessorImpl.invoke(DelegatingMethodAccessorImpl.java:43)
	at java.lang.reflect.Method.invoke(Method.java:616)
	at com.carrotsearch.randomizedtesting.RandomizedRunner.invoke(RandomizedRunner.java:1559)
	at com.carrotsearch.randomizedtesting.RandomizedRunner.access$600(RandomizedRunner.java:79)
	at com.carrotsearch.randomizedtesting.RandomizedRunner$4.evaluate(RandomizedRunner.java:677)
	at com.carrotsearch.randomizedtesting.RandomizedRunner$5.evaluate(RandomizedRunner.java:693)
	at com.carrotsearch.randomizedtesting.rules.StatementAdapter.evaluate(StatementAdapter.java:36)
	at com.carrotsearch.randomizedtesting.rules.SystemPropertiesRestoreRule$1.evaluate(SystemPropertiesRestoreRule.java:53)
	at org.apache.lucene.util.AbstractBeforeAfterRule$1.evaluate(AbstractBeforeAfterRule.java:46)
	at org.apache.lucene.util.TestRuleStoreClassName$1.evaluate(TestRuleStoreClassName.java:42)
	at com.carrotsearch.randomizedtesting.rules.SystemPropertiesInvariantRule$1.evaluate(SystemPropertiesInvariantRule.java:55)
	at com.carrotsearch.randomizedtesting.rules.NoShadowingOrOverridesOnMethodsRule$1.evaluate(NoShadowingOrOverridesOnMethodsRule.java:39)
	at com.carrotsearch.randomizedtesting.rules.NoShadowingOrOverridesOnMethodsRule$1.evaluate(NoShadowingOrOverridesOnMethodsRule.java:39)
	at com.carrotsearch.randomizedtesting.rules.StatementAdapter.evaluate(StatementAdapter.java:36)
	at org.apache.lucene.util.TestRuleAssertionsRequired$1.evaluate(TestRuleAssertionsRequired.java:43)
	at org.apache.lucene.util.TestRuleMarkFailure$1.evaluate(TestRuleMarkFailure.java:48)
	at org.apache.lucene.util.TestRuleIgnoreAfterMaxFailures$1.evaluate(TestRuleIgnoreAfterMaxFailures.java:70)
	at org.apache.lucene.util.TestRuleIgnoreTestSuites$1.evaluate(TestRuleIgnoreTestSuites.java:55)
	at com.carrotsearch.randomizedtesting.rules.StatementAdapter.evaluate(StatementAdapter.java:36)
	at com.carrotsearch.randomizedtesting.ThreadLeakControl$StatementRunner.run(ThreadLeakControl.java:358)
	at java.lang.Thread.run(Thread.java:679)
Caused by: org.apache.solr.common.SolrException: Error Instantiating Update Handler, solr.DirectUpdateHandler2 failed to instantiate org.apache.solr.update.UpdateHandler
	at org.apache.solr.core.SolrCore.<init>(SolrCore.java:789)
	at org.apache.solr.core.SolrCore.<init>(SolrCore.java:602)
	at org.apache.solr.util.TestHarness$Initializer.initialize(TestHarness.java:205)
	at org.apache.solr.util.TestHarness.<init>(TestHarness.java:128)
	... 30 more
Caused by: org.apache.solr.common.SolrException: Error Instantiating Update Handler, solr.DirectUpdateHandler2 failed to instantiate org.apache.solr.update.UpdateHandler
	at org.apache.solr.core.SolrCore.createInstance(SolrCore.java:526)
	at org.apache.solr.core.SolrCore.createUpdateHandler(SolrCore.java:580)
	at org.apache.solr.core.SolrCore.<init>(SolrCore.java:773)
	... 33 more
Caused by: java.lang.reflect.InvocationTargetException
	at sun.reflect.GeneratedConstructorAccessor119.newInstance(Unknown Source)
	at sun.reflect.DelegatingConstructorAccessorImpl.newInstance(DelegatingConstructorAccessorImpl.java:45)
	at java.lang.reflect.Constructor.newInstance(Constructor.java:532)
	at org.apache.solr.core.SolrCore.createInstance(SolrCore.java:512)
	... 35 more
Caused by: java.lang.NullPointerException
	at org.apache.solr.update.UpdateLog.getTlogDir(UpdateLog.java:1399)
	at org.apache.solr.update.UpdateHandler.clearLog(UpdateHandler.java:88)
	at org.apache.solr.update.UpdateHandler.<init>(UpdateHandler.java:127)
	at org.apache.solr.update.DirectUpdateHandler2.<init>(DirectUpdateHandler2.java:96)
	... 39 more


FAILED:  junit.framework.TestSuite.org.apache.solr.schema.CopyFieldTest

Error Message:
org.apache.solr.common.SolrException: Error Instantiating Update Handler, solr.DirectUpdateHandler2 failed to instantiate org.apache.solr.update.UpdateHandler

Stack Trace:
java.lang.RuntimeException: org.apache.solr.common.SolrException: Error Instantiating Update Handler, solr.DirectUpdateHandler2 failed to instantiate org.apache.solr.update.UpdateHandler
	at __randomizedtesting.SeedInfo.seed([8BADF50C402C6C84]:0)
	at org.apache.solr.util.TestHarness.<init>(TestHarness.java:137)
	at org.apache.solr.util.TestHarness.<init>(TestHarness.java:122)
	at org.apache.solr.util.TestHarness.<init>(TestHarness.java:112)
	at org.apache.solr.SolrTestCaseJ4.createCore(SolrTestCaseJ4.java:384)
	at org.apache.solr.SolrTestCaseJ4.initCore(SolrTestCaseJ4.java:376)
	at org.apache.solr.SolrTestCaseJ4.initCore(SolrTestCaseJ4.java:188)
	at org.apache.solr.SolrTestCaseJ4.initCore(SolrTestCaseJ4.java:175)
	at org.apache.solr.schema.CopyFieldTest.beforeClass(CopyFieldTest.java:41)
	at sun.reflect.NativeMethodAccessorImpl.invoke0(Native Method)
	at sun.reflect.NativeMethodAccessorImpl.invoke(NativeMethodAccessorImpl.java:57)
	at sun.reflect.DelegatingMethodAccessorImpl.invoke(DelegatingMethodAccessorImpl.java:43)
	at java.lang.reflect.Method.invoke(Method.java:616)
	at com.carrotsearch.randomizedtesting.RandomizedRunner.invoke(RandomizedRunner.java:1559)
	at com.carrotsearch.randomizedtesting.RandomizedRunner.access$600(RandomizedRunner.java:79)
	at com.carrotsearch.randomizedtesting.RandomizedRunner$4.evaluate(RandomizedRunner.java:677)
	at com.carrotsearch.randomizedtesting.RandomizedRunner$5.evaluate(RandomizedRunner.java:693)
	at com.carrotsearch.randomizedtesting.rules.StatementAdapter.evaluate(StatementAdapter.java:36)
	at com.carrotsearch.randomizedtesting.rules.SystemPropertiesRestoreRule$1.evaluate(SystemPropertiesRestoreRule.java:53)
	at org.apache.lucene.util.AbstractBeforeAfterRule$1.evaluate(AbstractBeforeAfterRule.java:46)
	at org.apache.lucene.util.TestRuleStoreClassName$1.evaluate(TestRuleStoreClassName.java:42)
	at com.carrotsearch.randomizedtesting.rules.SystemPropertiesInvariantRule$1.evaluate(SystemPropertiesInvariantRule.java:55)
	at com.carrotsearch.randomizedtesting.rules.NoShadowingOrOverridesOnMethodsRule$1.evaluate(NoShadowingOrOverridesOnMethodsRule.java:39)
	at com.carrotsearch.randomizedtesting.rules.NoShadowingOrOverridesOnMethodsRule$1.evaluate(NoShadowingOrOverridesOnMethodsRule.java:39)
	at com.carrotsearch.randomizedtesting.rules.StatementAdapter.evaluate(StatementAdapter.java:36)
	at org.apache.lucene.util.TestRuleAssertionsRequired$1.evaluate(TestRuleAssertionsRequired.java:43)
	at org.apache.lucene.util.TestRuleMarkFailure$1.evaluate(TestRuleMarkFailure.java:48)
	at org.apache.lucene.util.TestRuleIgnoreAfterMaxFailures$1.evaluate(TestRuleIgnoreAfterMaxFailures.java:70)
	at org.apache.lucene.util.TestRuleIgnoreTestSuites$1.evaluate(TestRuleIgnoreTestSuites.java:55)
	at com.carrotsearch.randomizedtesting.rules.StatementAdapter.evaluate(StatementAdapter.java:36)
	at com.carrotsearch.randomizedtesting.ThreadLeakControl$StatementRunner.run(ThreadLeakControl.java:358)
	at java.lang.Thread.run(Thread.java:679)
Caused by: org.apache.solr.common.SolrException: Error Instantiating Update Handler, solr.DirectUpdateHandler2 failed to instantiate org.apache.solr.update.UpdateHandler
	at org.apache.solr.core.SolrCore.<init>(SolrCore.java:789)
	at org.apache.solr.core.SolrCore.<init>(SolrCore.java:602)
	at org.apache.solr.util.TestHarness$Initializer.initialize(TestHarness.java:205)
	at org.apache.solr.util.TestHarness.<init>(TestHarness.java:128)
	... 30 more
Caused by: org.apache.solr.common.SolrException: Error Instantiating Update Handler, solr.DirectUpdateHandler2 failed to instantiate org.apache.solr.update.UpdateHandler
	at org.apache.solr.core.SolrCore.createInstance(SolrCore.java:526)
	at org.apache.solr.core.SolrCore.createUpdateHandler(SolrCore.java:580)
	at org.apache.solr.core.SolrCore.<init>(SolrCore.java:773)
	... 33 more
Caused by: java.lang.reflect.InvocationTargetException
	at sun.reflect.GeneratedConstructorAccessor119.newInstance(Unknown Source)
	at sun.reflect.DelegatingConstructorAccessorImpl.newInstance(DelegatingConstructorAccessorImpl.java:45)
	at java.lang.reflect.Constructor.newInstance(Constructor.java:532)
	at org.apache.solr.core.SolrCore.createInstance(SolrCore.java:512)
	... 35 more
Caused by: java.lang.NullPointerException
	at org.apache.solr.update.UpdateLog.getTlogDir(UpdateLog.java:1399)
	at org.apache.solr.update.UpdateHandler.clearLog(UpdateHandler.java:88)
	at org.apache.solr.update.UpdateHandler.<init>(UpdateHandler.java:127)
	at org.apache.solr.update.DirectUpdateHandler2.<init>(DirectUpdateHandler2.java:96)
	... 39 more


FAILED:  junit.framework.TestSuite.org.apache.solr.schema.CurrencyFieldTest

Error Message:
org.apache.solr.common.SolrException: Error Instantiating Update Handler, solr.DirectUpdateHandler2 failed to instantiate org.apache.solr.update.UpdateHandler

Stack Trace:
java.lang.RuntimeException: org.apache.solr.common.SolrException: Error Instantiating Update Handler, solr.DirectUpdateHandler2 failed to instantiate org.apache.solr.update.UpdateHandler
	at __randomizedtesting.SeedInfo.seed([8BADF50C402C6C84]:0)
	at org.apache.solr.util.TestHarness.<init>(TestHarness.java:137)
	at org.apache.solr.util.TestHarness.<init>(TestHarness.java:122)
	at org.apache.solr.util.TestHarness.<init>(TestHarness.java:112)
	at org.apache.solr.SolrTestCaseJ4.createCore(SolrTestCaseJ4.java:384)
	at org.apache.solr.SolrTestCaseJ4.initCore(SolrTestCaseJ4.java:376)
	at org.apache.solr.SolrTestCaseJ4.initCore(SolrTestCaseJ4.java:188)
	at org.apache.solr.SolrTestCaseJ4.initCore(SolrTestCaseJ4.java:175)
	at org.apache.solr.schema.CurrencyFieldTest.beforeClass(CurrencyFieldTest.java:35)
	at sun.reflect.NativeMethodAccessorImpl.invoke0(Native Method)
	at sun.reflect.NativeMethodAccessorImpl.invoke(NativeMethodAccessorImpl.java:57)
	at sun.reflect.DelegatingMethodAccessorImpl.invoke(DelegatingMethodAccessorImpl.java:43)
	at java.lang.reflect.Method.invoke(Method.java:616)
	at com.carrotsearch.randomizedtesting.RandomizedRunner.invoke(RandomizedRunner.java:1559)
	at com.carrotsearch.randomizedtesting.RandomizedRunner.access$600(RandomizedRunner.java:79)
	at com.carrotsearch.randomizedtesting.RandomizedRunner$4.evaluate(RandomizedRunner.java:677)
	at com.carrotsearch.randomizedtesting.RandomizedRunner$5.evaluate(RandomizedRunner.java:693)
	at com.carrotsearch.randomizedtesting.rules.StatementAdapter.evaluate(StatementAdapter.java:36)
	at com.carrotsearch.randomizedtesting.rules.SystemPropertiesRestoreRule$1.evaluate(SystemPropertiesRestoreRule.java:53)
	at org.apache.lucene.util.AbstractBeforeAfterRule$1.evaluate(AbstractBeforeAfterRule.java:46)
	at org.apache.lucene.util.TestRuleStoreClassName$1.evaluate(TestRuleStoreClassName.java:42)
	at com.carrotsearch.randomizedtesting.rules.SystemPropertiesInvariantRule$1.evaluate(SystemPropertiesInvariantRule.java:55)
	at com.carrotsearch.randomizedtesting.rules.NoShadowingOrOverridesOnMethodsRule$1.evaluate(NoShadowingOrOverridesOnMethodsRule.java:39)
	at com.carrotsearch.randomizedtesting.rules.NoShadowingOrOverridesOnMethodsRule$1.evaluate(NoShadowingOrOverridesOnMethodsRule.java:39)
	at com.carrotsearch.randomizedtesting.rules.StatementAdapter.evaluate(StatementAdapter.java:36)
	at org.apache.lucene.util.TestRuleAssertionsRequired$1.evaluate(TestRuleAssertionsRequired.java:43)
	at org.apache.lucene.util.TestRuleMarkFailure$1.evaluate(TestRuleMarkFailure.java:48)
	at org.apache.lucene.util.TestRuleIgnoreAfterMaxFailures$1.evaluate(TestRuleIgnoreAfterMaxFailures.java:70)
	at org.apache.lucene.util.TestRuleIgnoreTestSuites$1.evaluate(TestRuleIgnoreTestSuites.java:55)
	at com.carrotsearch.randomizedtesting.rules.StatementAdapter.evaluate(StatementAdapter.java:36)
	at com.carrotsearch.randomizedtesting.ThreadLeakControl$StatementRunner.run(ThreadLeakControl.java:358)
	at java.lang.Thread.run(Thread.java:679)
Caused by: org.apache.solr.common.SolrException: Error Instantiating Update Handler, solr.DirectUpdateHandler2 failed to instantiate org.apache.solr.update.UpdateHandler
	at org.apache.solr.core.SolrCore.<init>(SolrCore.java:789)
	at org.apache.solr.core.SolrCore.<init>(SolrCore.java:602)
	at org.apache.solr.util.TestHarness$Initializer.initialize(TestHarness.java:205)
	at org.apache.solr.util.TestHarness.<init>(TestHarness.java:128)
	... 30 more
Caused by: org.apache.solr.common.SolrException: Error Instantiating Update Handler, solr.DirectUpdateHandler2 failed to instantiate org.apache.solr.update.UpdateHandler
	at org.apache.solr.core.SolrCore.createInstance(SolrCore.java:526)
	at org.apache.solr.core.SolrCore.createUpdateHandler(SolrCore.java:580)
	at org.apache.solr.core.SolrCore.<init>(SolrCore.java:773)
	... 33 more
Caused by: java.lang.reflect.InvocationTargetException
	at sun.reflect.GeneratedConstructorAccessor119.newInstance(Unknown Source)
	at sun.reflect.DelegatingConstructorAccessorImpl.newInstance(DelegatingConstructorAccessorImpl.java:45)
	at java.lang.reflect.Constructor.newInstance(Constructor.java:532)
	at org.apache.solr.core.SolrCore.createInstance(SolrCore.java:512)
	... 35 more
Caused by: java.lang.NullPointerException
	at org.apache.solr.update.UpdateLog.getTlogDir(UpdateLog.java:1399)
	at org.apache.solr.update.UpdateHandler.clearLog(UpdateHandler.java:88)
	at org.apache.solr.update.UpdateHandler.<init>(UpdateHandler.java:127)
	at org.apache.solr.update.DirectUpdateHandler2.<init>(DirectUpdateHandler2.java:96)
	... 39 more


FAILED:  junit.framework.TestSuite.org.apache.solr.schema.NotRequiredUniqueKeyTest

Error Message:
org.apache.solr.common.SolrException: Error Instantiating Update Handler, solr.DirectUpdateHandler2 failed to instantiate org.apache.solr.update.UpdateHandler

Stack Trace:
java.lang.RuntimeException: org.apache.solr.common.SolrException: Error Instantiating Update Handler, solr.DirectUpdateHandler2 failed to instantiate org.apache.solr.update.UpdateHandler
	at __randomizedtesting.SeedInfo.seed([8BADF50C402C6C84]:0)
	at org.apache.solr.util.TestHarness.<init>(TestHarness.java:137)
	at org.apache.solr.util.TestHarness.<init>(TestHarness.java:122)
	at org.apache.solr.util.TestHarness.<init>(TestHarness.java:112)
	at org.apache.solr.SolrTestCaseJ4.createCore(SolrTestCaseJ4.java:384)
	at org.apache.solr.SolrTestCaseJ4.initCore(SolrTestCaseJ4.java:376)
	at org.apache.solr.SolrTestCaseJ4.initCore(SolrTestCaseJ4.java:188)
	at org.apache.solr.SolrTestCaseJ4.initCore(SolrTestCaseJ4.java:175)
	at org.apache.solr.schema.NotRequiredUniqueKeyTest.beforeTests(NotRequiredUniqueKeyTest.java:36)
	at sun.reflect.NativeMethodAccessorImpl.invoke0(Native Method)
	at sun.reflect.NativeMethodAccessorImpl.invoke(NativeMethodAccessorImpl.java:57)
	at sun.reflect.DelegatingMethodAccessorImpl.invoke(DelegatingMethodAccessorImpl.java:43)
	at java.lang.reflect.Method.invoke(Method.java:616)
	at com.carrotsearch.randomizedtesting.RandomizedRunner.invoke(RandomizedRunner.java:1559)
	at com.carrotsearch.randomizedtesting.RandomizedRunner.access$600(RandomizedRunner.java:79)
	at com.carrotsearch.randomizedtesting.RandomizedRunner$4.evaluate(RandomizedRunner.java:677)
	at com.carrotsearch.randomizedtesting.RandomizedRunner$5.evaluate(RandomizedRunner.java:693)
	at com.carrotsearch.randomizedtesting.rules.StatementAdapter.evaluate(StatementAdapter.java:36)
	at com.carrotsearch.randomizedtesting.rules.SystemPropertiesRestoreRule$1.evaluate(SystemPropertiesRestoreRule.java:53)
	at org.apache.lucene.util.AbstractBeforeAfterRule$1.evaluate(AbstractBeforeAfterRule.java:46)
	at org.apache.lucene.util.TestRuleStoreClassName$1.evaluate(TestRuleStoreClassName.java:42)
	at com.carrotsearch.randomizedtesting.rules.SystemPropertiesInvariantRule$1.evaluate(SystemPropertiesInvariantRule.java:55)
	at com.carrotsearch.randomizedtesting.rules.NoShadowingOrOverridesOnMethodsRule$1.evaluate(NoShadowingOrOverridesOnMethodsRule.java:39)
	at com.carrotsearch.randomizedtesting.rules.NoShadowingOrOverridesOnMethodsRule$1.evaluate(NoShadowingOrOverridesOnMethodsRule.java:39)
	at com.carrotsearch.randomizedtesting.rules.StatementAdapter.evaluate(StatementAdapter.java:36)
	at org.apache.lucene.util.TestRuleAssertionsRequired$1.evaluate(TestRuleAssertionsRequired.java:43)
	at org.apache.lucene.util.TestRuleMarkFailure$1.evaluate(TestRuleMarkFailure.java:48)
	at org.apache.lucene.util.TestRuleIgnoreAfterMaxFailures$1.evaluate(TestRuleIgnoreAfterMaxFailures.java:70)
	at org.apache.lucene.util.TestRuleIgnoreTestSuites$1.evaluate(TestRuleIgnoreTestSuites.java:55)
	at com.carrotsearch.randomizedtesting.rules.StatementAdapter.evaluate(StatementAdapter.java:36)
	at com.carrotsearch.randomizedtesting.ThreadLeakControl$StatementRunner.run(ThreadLeakControl.java:358)
	at java.lang.Thread.run(Thread.java:679)
Caused by: org.apache.solr.common.SolrException: Error Instantiating Update Handler, solr.DirectUpdateHandler2 failed to instantiate org.apache.solr.update.UpdateHandler
	at org.apache.solr.core.SolrCore.<init>(SolrCore.java:789)
	at org.apache.solr.core.SolrCore.<init>(SolrCore.java:602)
	at org.apache.solr.util.TestHarness$Initializer.initialize(TestHarness.java:205)
	at org.apache.solr.util.TestHarness.<init>(TestHarness.java:128)
	... 30 more
Caused by: org.apache.solr.common.SolrException: Error Instantiating Update Handler, solr.DirectUpdateHandler2 failed to instantiate org.apache.solr.update.UpdateHandler
	at org.apache.solr.core.SolrCore.createInstance(SolrCore.java:526)
	at org.apache.solr.core.SolrCore.createUpdateHandler(SolrCore.java:580)
	at org.apache.solr.core.SolrCore.<init>(SolrCore.java:773)
	... 33 more
Caused by: java.lang.reflect.InvocationTargetException
	at sun.reflect.GeneratedConstructorAccessor119.newInstance(Unknown Source)
	at sun.reflect.DelegatingConstructorAccessorImpl.newInstance(DelegatingConstructorAccessorImpl.java:45)
	at java.lang.reflect.Constructor.newInstance(Constructor.java:532)
	at org.apache.solr.core.SolrCore.createInstance(SolrCore.java:512)
	... 35 more
Caused by: java.lang.NullPointerException
	at org.apache.solr.update.UpdateLog.getTlogDir(UpdateLog.java:1399)
	at org.apache.solr.update.UpdateHandler.clearLog(UpdateHandler.java:88)
	at org.apache.solr.update.UpdateHandler.<init>(UpdateHandler.java:127)
	at org.apache.solr.update.DirectUpdateHandler2.<init>(DirectUpdateHandler2.java:96)
	... 39 more


FAILED:  junit.framework.TestSuite.org.apache.solr.search.TestRangeQuery

Error Message:
org.apache.solr.common.SolrException: Error Instantiating Update Handler, solr.DirectUpdateHandler2 failed to instantiate org.apache.solr.update.UpdateHandler

Stack Trace:
java.lang.RuntimeException: org.apache.solr.common.SolrException: Error Instantiating Update Handler, solr.DirectUpdateHandler2 failed to instantiate org.apache.solr.update.UpdateHandler
	at __randomizedtesting.SeedInfo.seed([8BADF50C402C6C84]:0)
	at org.apache.solr.util.TestHarness.<init>(TestHarness.java:137)
	at org.apache.solr.util.TestHarness.<init>(TestHarness.java:122)
	at org.apache.solr.util.TestHarness.<init>(TestHarness.java:112)
	at org.apache.solr.SolrTestCaseJ4.createCore(SolrTestCaseJ4.java:384)
	at org.apache.solr.SolrTestCaseJ4.initCore(SolrTestCaseJ4.java:376)
	at org.apache.solr.SolrTestCaseJ4.initCore(SolrTestCaseJ4.java:188)
	at org.apache.solr.SolrTestCaseJ4.initCore(SolrTestCaseJ4.java:175)
	at org.apache.solr.search.TestRangeQuery.beforeClass(TestRangeQuery.java:34)
	at sun.reflect.NativeMethodAccessorImpl.invoke0(Native Method)
	at sun.reflect.NativeMethodAccessorImpl.invoke(NativeMethodAccessorImpl.java:57)
	at sun.reflect.DelegatingMethodAccessorImpl.invoke(DelegatingMethodAccessorImpl.java:43)
	at java.lang.reflect.Method.invoke(Method.java:616)
	at com.carrotsearch.randomizedtesting.RandomizedRunner.invoke(RandomizedRunner.java:1559)
	at com.carrotsearch.randomizedtesting.RandomizedRunner.access$600(RandomizedRunner.java:79)
	at com.carrotsearch.randomizedtesting.RandomizedRunner$4.evaluate(RandomizedRunner.java:677)
	at com.carrotsearch.randomizedtesting.RandomizedRunner$5.evaluate(RandomizedRunner.java:693)
	at com.carrotsearch.randomizedtesting.rules.StatementAdapter.evaluate(StatementAdapter.java:36)
	at com.carrotsearch.randomizedtesting.rules.SystemPropertiesRestoreRule$1.evaluate(SystemPropertiesRestoreRule.java:53)
	at org.apache.lucene.util.AbstractBeforeAfterRule$1.evaluate(AbstractBeforeAfterRule.java:46)
	at org.apache.lucene.util.TestRuleStoreClassName$1.evaluate(TestRuleStoreClassName.java:42)
	at com.carrotsearch.randomizedtesting.rules.SystemPropertiesInvariantRule$1.evaluate(SystemPropertiesInvariantRule.java:55)
	at com.carrotsearch.randomizedtesting.rules.NoShadowingOrOverridesOnMethodsRule$1.evaluate(NoShadowingOrOverridesOnMethodsRule.java:39)
	at com.carrotsearch.randomizedtesting.rules.NoShadowingOrOverridesOnMethodsRule$1.evaluate(NoShadowingOrOverridesOnMethodsRule.java:39)
	at com.carrotsearch.randomizedtesting.rules.StatementAdapter.evaluate(StatementAdapter.java:36)
	at org.apache.lucene.util.TestRuleAssertionsRequired$1.evaluate(TestRuleAssertionsRequired.java:43)
	at org.apache.lucene.util.TestRuleMarkFailure$1.evaluate(TestRuleMarkFailure.java:48)
	at org.apache.lucene.util.TestRuleIgnoreAfterMaxFailures$1.evaluate(TestRuleIgnoreAfterMaxFailures.java:70)
	at org.apache.lucene.util.TestRuleIgnoreTestSuites$1.evaluate(TestRuleIgnoreTestSuites.java:55)
	at com.carrotsearch.randomizedtesting.rules.StatementAdapter.evaluate(StatementAdapter.java:36)
	at com.carrotsearch.randomizedtesting.ThreadLeakControl$StatementRunner.run(ThreadLeakControl.java:358)
	at java.lang.Thread.run(Thread.java:679)
Caused by: org.apache.solr.common.SolrException: Error Instantiating Update Handler, solr.DirectUpdateHandler2 failed to instantiate org.apache.solr.update.UpdateHandler
	at org.apache.solr.core.SolrCore.<init>(SolrCore.java:789)
	at org.apache.solr.core.SolrCore.<init>(SolrCore.java:602)
	at org.apache.solr.util.TestHarness$Initializer.initialize(TestHarness.java:205)
	at org.apache.solr.util.TestHarness.<init>(TestHarness.java:128)
	... 30 more
Caused by: org.apache.solr.common.SolrException: Error Instantiating Update Handler, solr.DirectUpdateHandler2 failed to instantiate org.apache.solr.update.UpdateHandler
	at org.apache.solr.core.SolrCore.createInstance(SolrCore.java:526)
	at org.apache.solr.core.SolrCore.createUpdateHandler(SolrCore.java:580)
	at org.apache.solr.core.SolrCore.<init>(SolrCore.java:773)
	... 33 more
Caused by: java.lang.reflect.InvocationTargetException
	at sun.reflect.GeneratedConstructorAccessor119.newInstance(Unknown Source)
	at sun.reflect.DelegatingConstructorAccessorImpl.newInstance(DelegatingConstructorAccessorImpl.java:45)
	at java.lang.reflect.Constructor.newInstance(Constructor.java:532)
	at org.apache.solr.core.SolrCore.createInstance(SolrCore.java:512)
	... 35 more
Caused by: java.lang.NullPointerException
	at org.apache.solr.update.UpdateLog.getTlogDir(UpdateLog.java:1399)
	at org.apache.solr.update.UpdateHandler.clearLog(UpdateHandler.java:88)
	at org.apache.solr.update.UpdateHandler.<init>(UpdateHandler.java:127)
	at org.apache.solr.update.DirectUpdateHandler2.<init>(DirectUpdateHandler2.java:96)
	... 39 more


FAILED:  junit.framework.TestSuite.org.apache.solr.search.function.SortByFunctionTest

Error Message:
org.apache.solr.common.SolrException: Error Instantiating Update Handler, solr.DirectUpdateHandler2 failed to instantiate org.apache.solr.update.UpdateHandler

Stack Trace:
java.lang.RuntimeException: org.apache.solr.common.SolrException: Error Instantiating Update Handler, solr.DirectUpdateHandler2 failed to instantiate org.apache.solr.update.UpdateHandler
	at __randomizedtesting.SeedInfo.seed([8BADF50C402C6C84]:0)
	at org.apache.solr.util.TestHarness.<init>(TestHarness.java:137)
	at org.apache.solr.util.TestHarness.<init>(TestHarness.java:122)
	at org.apache.solr.util.TestHarness.<init>(TestHarness.java:112)
	at org.apache.solr.SolrTestCaseJ4.createCore(SolrTestCaseJ4.java:384)
	at org.apache.solr.SolrTestCaseJ4.initCore(SolrTestCaseJ4.java:376)
	at org.apache.solr.SolrTestCaseJ4.initCore(SolrTestCaseJ4.java:188)
	at org.apache.solr.SolrTestCaseJ4.initCore(SolrTestCaseJ4.java:175)
	at org.apache.solr.search.function.SortByFunctionTest.beforeClass(SortByFunctionTest.java:32)
	at sun.reflect.NativeMethodAccessorImpl.invoke0(Native Method)
	at sun.reflect.NativeMethodAccessorImpl.invoke(NativeMethodAccessorImpl.java:57)
	at sun.reflect.DelegatingMethodAccessorImpl.invoke(DelegatingMethodAccessorImpl.java:43)
	at java.lang.reflect.Method.invoke(Method.java:616)
	at com.carrotsearch.randomizedtesting.RandomizedRunner.invoke(RandomizedRunner.java:1559)
	at com.carrotsearch.randomizedtesting.RandomizedRunner.access$600(RandomizedRunner.java:79)
	at com.carrotsearch.randomizedtesting.RandomizedRunner$4.evaluate(RandomizedRunner.java:677)
	at com.carrotsearch.randomizedtesting.RandomizedRunner$5.evaluate(RandomizedRunner.java:693)
	at com.carrotsearch.randomizedtesting.rules.StatementAdapter.evaluate(StatementAdapter.java:36)
	at com.carrotsearch.randomizedtesting.rules.SystemPropertiesRestoreRule$1.evaluate(SystemPropertiesRestoreRule.java:53)
	at org.apache.lucene.util.AbstractBeforeAfterRule$1.evaluate(AbstractBeforeAfterRule.java:46)
	at org.apache.lucene.util.TestRuleStoreClassName$1.evaluate(TestRuleStoreClassName.java:42)
	at com.carrotsearch.randomizedtesting.rules.SystemPropertiesInvariantRule$1.evaluate(SystemPropertiesInvariantRule.java:55)
	at com.carrotsearch.randomizedtesting.rules.NoShadowingOrOverridesOnMethodsRule$1.evaluate(NoShadowingOrOverridesOnMethodsRule.java:39)
	at com.carrotsearch.randomizedtesting.rules.NoShadowingOrOverridesOnMethodsRule$1.evaluate(NoShadowingOrOverridesOnMethodsRule.java:39)
	at com.carrotsearch.randomizedtesting.rules.StatementAdapter.evaluate(StatementAdapter.java:36)
	at org.apache.lucene.util.TestRuleAssertionsRequired$1.evaluate(TestRuleAssertionsRequired.java:43)
	at org.apache.lucene.util.TestRuleMarkFailure$1.evaluate(TestRuleMarkFailure.java:48)
	at org.apache.lucene.util.TestRuleIgnoreAfterMaxFailures$1.evaluate(TestRuleIgnoreAfterMaxFailures.java:70)
	at org.apache.lucene.util.TestRuleIgnoreTestSuites$1.evaluate(TestRuleIgnoreTestSuites.java:55)
	at com.carrotsearch.randomizedtesting.rules.StatementAdapter.evaluate(StatementAdapter.java:36)
	at com.carrotsearch.randomizedtesting.ThreadLeakControl$StatementRunner.run(ThreadLeakControl.java:358)
	at java.lang.Thread.run(Thread.java:679)
Caused by: org.apache.solr.common.SolrException: Error Instantiating Update Handler, solr.DirectUpdateHandler2 failed to instantiate org.apache.solr.update.UpdateHandler
	at org.apache.solr.core.SolrCore.<init>(SolrCore.java:789)
	at org.apache.solr.core.SolrCore.<init>(SolrCore.java:602)
	at org.apache.solr.util.TestHarness$Initializer.initialize(TestHarness.java:205)
	at org.apache.solr.util.TestHarness.<init>(TestHarness.java:128)
	... 30 more
Caused by: org.apache.solr.common.SolrException: Error Instantiating Update Handler, solr.DirectUpdateHandler2 failed to instantiate org.apache.solr.update.UpdateHandler
	at org.apache.solr.core.SolrCore.createInstance(SolrCore.java:526)
	at org.apache.solr.core.SolrCore.createUpdateHandler(SolrCore.java:580)
	at org.apache.solr.core.SolrCore.<init>(SolrCore.java:773)
	... 33 more
Caused by: java.lang.reflect.InvocationTargetException
	at sun.reflect.NativeConstructorAccessorImpl.newInstance0(Native Method)
	at sun.reflect.NativeConstructorAccessorImpl.newInstance(NativeConstructorAccessorImpl.java:57)
	at sun.reflect.DelegatingConstructorAccessorImpl.newInstance(DelegatingConstructorAccessorImpl.java:45)
	at java.lang.reflect.Constructor.newInstance(Constructor.java:532)
	at org.apache.solr.core.SolrCore.createInstance(SolrCore.java:512)
	... 35 more
Caused by: java.lang.NullPointerException
	at org.apache.solr.update.UpdateLog.getTlogDir(UpdateLog.java:1399)
	at org.apache.solr.update.UpdateHandler.clearLog(UpdateHandler.java:88)
	at org.apache.solr.update.UpdateHandler.<init>(UpdateHandler.java:127)
	at org.apache.solr.update.DirectUpdateHandler2.<init>(DirectUpdateHandler2.java:96)
	... 40 more


FAILED:  junit.framework.TestSuite.org.apache.solr.search.function.distance.DistanceFunctionTest

Error Message:
org.apache.solr.common.SolrException: Error Instantiating Update Handler, solr.DirectUpdateHandler2 failed to instantiate org.apache.solr.update.UpdateHandler

Stack Trace:
java.lang.RuntimeException: org.apache.solr.common.SolrException: Error Instantiating Update Handler, solr.DirectUpdateHandler2 failed to instantiate org.apache.solr.update.UpdateHandler
	at __randomizedtesting.SeedInfo.seed([8BADF50C402C6C84]:0)
	at org.apache.solr.util.TestHarness.<init>(TestHarness.java:137)
	at org.apache.solr.util.TestHarness.<init>(TestHarness.java:122)
	at org.apache.solr.util.TestHarness.<init>(TestHarness.java:112)
	at org.apache.solr.SolrTestCaseJ4.createCore(SolrTestCaseJ4.java:384)
	at org.apache.solr.SolrTestCaseJ4.initCore(SolrTestCaseJ4.java:376)
	at org.apache.solr.SolrTestCaseJ4.initCore(SolrTestCaseJ4.java:188)
	at org.apache.solr.SolrTestCaseJ4.initCore(SolrTestCaseJ4.java:175)
	at org.apache.solr.search.function.distance.DistanceFunctionTest.beforeClass(DistanceFunctionTest.java:33)
	at sun.reflect.NativeMethodAccessorImpl.invoke0(Native Method)
	at sun.reflect.NativeMethodAccessorImpl.invoke(NativeMethodAccessorImpl.java:57)
	at sun.reflect.DelegatingMethodAccessorImpl.invoke(DelegatingMethodAccessorImpl.java:43)
	at java.lang.reflect.Method.invoke(Method.java:616)
	at com.carrotsearch.randomizedtesting.RandomizedRunner.invoke(RandomizedRunner.java:1559)
	at com.carrotsearch.randomizedtesting.RandomizedRunner.access$600(RandomizedRunner.java:79)
	at com.carrotsearch.randomizedtesting.RandomizedRunner$4.evaluate(RandomizedRunner.java:677)
	at com.carrotsearch.randomizedtesting.RandomizedRunner$5.evaluate(RandomizedRunner.java:693)
	at com.carrotsearch.randomizedtesting.rules.StatementAdapter.evaluate(StatementAdapter.java:36)
	at com.carrotsearch.randomizedtesting.rules.SystemPropertiesRestoreRule$1.evaluate(SystemPropertiesRestoreRule.java:53)
	at org.apache.lucene.util.AbstractBeforeAfterRule$1.evaluate(AbstractBeforeAfterRule.java:46)
	at org.apache.lucene.util.TestRuleStoreClassName$1.evaluate(TestRuleStoreClassName.java:42)
	at com.carrotsearch.randomizedtesting.rules.SystemPropertiesInvariantRule$1.evaluate(SystemPropertiesInvariantRule.java:55)
	at com.carrotsearch.randomizedtesting.rules.NoShadowingOrOverridesOnMethodsRule$1.evaluate(NoShadowingOrOverridesOnMethodsRule.java:39)
	at com.carrotsearch.randomizedtesting.rules.NoShadowingOrOverridesOnMethodsRule$1.evaluate(NoShadowingOrOverridesOnMethodsRule.java:39)
	at com.carrotsearch.randomizedtesting.rules.StatementAdapter.evaluate(StatementAdapter.java:36)
	at org.apache.lucene.util.TestRuleAssertionsRequired$1.evaluate(TestRuleAssertionsRequired.java:43)
	at org.apache.lucene.util.TestRuleMarkFailure$1.evaluate(TestRuleMarkFailure.java:48)
	at org.apache.lucene.util.TestRuleIgnoreAfterMaxFailures$1.evaluate(TestRuleIgnoreAfterMaxFailures.java:70)
	at org.apache.lucene.util.TestRuleIgnoreTestSuites$1.evaluate(TestRuleIgnoreTestSuites.java:55)
	at com.carrotsearch.randomizedtesting.rules.StatementAdapter.evaluate(StatementAdapter.java:36)
	at com.carrotsearch.randomizedtesting.ThreadLeakControl$StatementRunner.run(ThreadLeakControl.java:358)
	at java.lang.Thread.run(Thread.java:679)
Caused by: org.apache.solr.common.SolrException: Error Instantiating Update Handler, solr.DirectUpdateHandler2 failed to instantiate org.apache.solr.update.UpdateHandler
	at org.apache.solr.core.SolrCore.<init>(SolrCore.java:789)
	at org.apache.solr.core.SolrCore.<init>(SolrCore.java:602)
	at org.apache.solr.util.TestHarness$Initializer.initialize(TestHarness.java:205)
	at org.apache.solr.util.TestHarness.<init>(TestHarness.java:128)
	... 30 more
Caused by: org.apache.solr.common.SolrException: Error Instantiating Update Handler, solr.DirectUpdateHandler2 failed to instantiate org.apache.solr.update.UpdateHandler
	at org.apache.solr.core.SolrCore.createInstance(SolrCore.java:526)
	at org.apache.solr.core.SolrCore.createUpdateHandler(SolrCore.java:580)
	at org.apache.solr.core.SolrCore.<init>(SolrCore.java:773)
	... 33 more
Caused by: java.lang.reflect.InvocationTargetException
	at sun.reflect.GeneratedConstructorAccessor119.newInstance(Unknown Source)
	at sun.reflect.DelegatingConstructorAccessorImpl.newInstance(DelegatingConstructorAccessorImpl.java:45)
	at java.lang.reflect.Constructor.newInstance(Constructor.java:532)
	at org.apache.solr.core.SolrCore.createInstance(SolrCore.java:512)
	... 35 more
Caused by: java.lang.NullPointerException
	at org.apache.solr.update.UpdateLog.getTlogDir(UpdateLog.java:1399)
	at org.apache.solr.update.UpdateHandler.clearLog(UpdateHandler.java:88)
	at org.apache.solr.update.UpdateHandler.<init>(UpdateHandler.java:127)
	at org.apache.solr.update.DirectUpdateHandler2.<init>(DirectUpdateHandler2.java:96)
	... 39 more


REGRESSION:  org.apache.solr.servlet.CacheHeaderTest.testCacheControl

Error Message:
Unknown request response expected:<0> but was:<404>

Stack Trace:
java.lang.AssertionError: Unknown request response expected:<0> but was:<404>
	at __randomizedtesting.SeedInfo.seed([8BADF50C402C6C84:8C3E11DFE98ADE3B]:0)
	at org.junit.Assert.fail(Assert.java:93)
	at org.junit.Assert.failNotEquals(Assert.java:647)
	at org.junit.Assert.assertEquals(Assert.java:128)
	at org.junit.Assert.assertEquals(Assert.java:472)
	at org.apache.solr.servlet.CacheHeaderTestBase.checkResponseBody(CacheHeaderTestBase.java:121)
	at org.apache.solr.servlet.CacheHeaderTest.doCacheControl(CacheHeaderTest.java:233)
	at org.apache.solr.servlet.CacheHeaderTestBase.testCacheControl(CacheHeaderTestBase.java:145)
	at sun.reflect.NativeMethodAccessorImpl.invoke0(Native Method)
	at sun.reflect.NativeMethodAccessorImpl.invoke(NativeMethodAccessorImpl.java:57)
	at sun.reflect.DelegatingMethodAccessorImpl.invoke(DelegatingMethodAccessorImpl.java:43)
	at java.lang.reflect.Method.invoke(Method.java:616)
	at com.carrotsearch.randomizedtesting.RandomizedRunner.invoke(RandomizedRunner.java:1559)
	at com.carrotsearch.randomizedtesting.RandomizedRunner.access$600(RandomizedRunner.java:79)
	at com.carrotsearch.randomizedtesting.RandomizedRunner$6.evaluate(RandomizedRunner.java:737)
	at com.carrotsearch.randomizedtesting.RandomizedRunner$7.evaluate(RandomizedRunner.java:773)
	at com.carrotsearch.randomizedtesting.RandomizedRunner$8.evaluate(RandomizedRunner.java:787)
	at com.carrotsearch.randomizedtesting.rules.SystemPropertiesRestoreRule$1.evaluate(SystemPropertiesRestoreRule.java:53)
	at org.apache.lucene.util.TestRuleSetupTeardownChained$1.evaluate(TestRuleSetupTeardownChained.java:50)
	at org.apache.lucene.util.TestRuleFieldCacheSanity$1.evaluate(TestRuleFieldCacheSanity.java:51)
	at org.apache.lucene.util.AbstractBeforeAfterRule$1.evaluate(AbstractBeforeAfterRule.java:46)
	at com.carrotsearch.randomizedtesting.rules.SystemPropertiesInvariantRule$1.evaluate(SystemPropertiesInvariantRule.java:55)
	at org.apache.lucene.util.TestRuleThreadAndTestName$1.evaluate(TestRuleThreadAndTestName.java:49)
	at org.apache.lucene.util.TestRuleIgnoreAfterMaxFailures$1.evaluate(TestRuleIgnoreAfterMaxFailures.java:70)
	at org.apache.lucene.util.TestRuleMarkFailure$1.evaluate(TestRuleMarkFailure.java:48)
	at com.carrotsearch.randomizedtesting.rules.StatementAdapter.evaluate(StatementAdapter.java:36)
	at com.carrotsearch.randomizedtesting.ThreadLeakControl$StatementRunner.run(ThreadLeakControl.java:358)
	at com.carrotsearch.randomizedtesting.ThreadLeakControl.forkTimeoutingTask(ThreadLeakControl.java:782)
	at com.carrotsearch.randomizedtesting.ThreadLeakControl$3.evaluate(ThreadLeakControl.java:442)
	at com.carrotsearch.randomizedtesting.RandomizedRunner.runSingleTest(RandomizedRunner.java:746)
	at com.carrotsearch.randomizedtesting.RandomizedRunner$3.evaluate(RandomizedRunner.java:648)
	at com.carrotsearch.randomizedtesting.RandomizedRunner$4.evaluate(RandomizedRunner.java:682)
	at com.carrotsearch.randomizedtesting.RandomizedRunner$5.evaluate(RandomizedRunner.java:693)
	at com.carrotsearch.randomizedtesting.rules.StatementAdapter.evaluate(StatementAdapter.java:36)
	at com.carrotsearch.randomizedtesting.rules.SystemPropertiesRestoreRule$1.evaluate(SystemPropertiesRestoreRule.java:53)
	at org.apache.lucene.util.AbstractBeforeAfterRule$1.evaluate(AbstractBeforeAfterRule.java:46)
	at org.apache.lucene.util.TestRuleStoreClassName$1.evaluate(TestRuleStoreClassName.java:42)
	at com.carrotsearch.randomizedtesting.rules.SystemPropertiesInvariantRule$1.evaluate(SystemPropertiesInvariantRule.java:55)
	at com.carrotsearch.randomizedtesting.rules.NoShadowingOrOverridesOnMethodsRule$1.evaluate(NoShadowingOrOverridesOnMethodsRule.java:39)
	at com.carrotsearch.randomizedtesting.rules.NoShadowingOrOverridesOnMethodsRule$1.evaluate(NoShadowingOrOverridesOnMethodsRule.java:39)
	at com.carrotsearch.randomizedtesting.rules.StatementAdapter.evaluate(StatementAdapter.java:36)
	at org.apache.lucene.util.TestRuleAssertionsRequired$1.evaluate(TestRuleAssertionsRequired.java:43)
	at org.apache.lucene.util.TestRuleMarkFailure$1.evaluate(TestRuleMarkFailure.java:48)
	at org.apache.lucene.util.TestRuleIgnoreAfterMaxFailures$1.evaluate(TestRuleIgnoreAfterMaxFailures.java:70)
	at org.apache.lucene.util.TestRuleIgnoreTestSuites$1.evaluate(TestRuleIgnoreTestSuites.java:55)
	at com.carrotsearch.randomizedtesting.rules.StatementAdapter.evaluate(StatementAdapter.java:36)
	at com.carrotsearch.randomizedtesting.ThreadLeakControl$StatementRunner.run(ThreadLeakControl.java:358)
	at java.lang.Thread.run(Thread.java:679)


REGRESSION:  org.apache.solr.servlet.CacheHeaderTest.testEtag

Error Message:
Unknown request response expected:<0> but was:<404>

Stack Trace:
java.lang.AssertionError: Unknown request response expected:<0> but was:<404>
	at __randomizedtesting.SeedInfo.seed([8BADF50C402C6C84:D1B4FB8A3652E72C]:0)
	at org.junit.Assert.fail(Assert.java:93)
	at org.junit.Assert.failNotEquals(Assert.java:647)
	at org.junit.Assert.assertEquals(Assert.java:128)
	at org.junit.Assert.assertEquals(Assert.java:472)
	at org.apache.solr.servlet.CacheHeaderTestBase.checkResponseBody(CacheHeaderTestBase.java:121)
	at org.apache.solr.servlet.CacheHeaderTest.doETag(CacheHeaderTest.java:150)
	at org.apache.solr.servlet.CacheHeaderTestBase.testEtag(CacheHeaderTestBase.java:139)
	at sun.reflect.NativeMethodAccessorImpl.invoke0(Native Method)
	at sun.reflect.NativeMethodAccessorImpl.invoke(NativeMethodAccessorImpl.java:57)
	at sun.reflect.DelegatingMethodAccessorImpl.invoke(DelegatingMethodAccessorImpl.java:43)
	at java.lang.reflect.Method.invoke(Method.java:616)
	at com.carrotsearch.randomizedtesting.RandomizedRunner.invoke(RandomizedRunner.java:1559)
	at com.carrotsearch.randomizedtesting.RandomizedRunner.access$600(RandomizedRunner.java:79)
	at com.carrotsearch.randomizedtesting.RandomizedRunner$6.evaluate(RandomizedRunner.java:737)
	at com.carrotsearch.randomizedtesting.RandomizedRunner$7.evaluate(RandomizedRunner.java:773)
	at com.carrotsearch.randomizedtesting.RandomizedRunner$8.evaluate(RandomizedRunner.java:787)
	at com.carrotsearch.randomizedtesting.rules.SystemPropertiesRestoreRule$1.evaluate(SystemPropertiesRestoreRule.java:53)
	at org.apache.lucene.util.TestRuleSetupTeardownChained$1.evaluate(TestRuleSetupTeardownChained.java:50)
	at org.apache.lucene.util.TestRuleFieldCacheSanity$1.evaluate(TestRuleFieldCacheSanity.java:51)
	at org.apache.lucene.util.AbstractBeforeAfterRule$1.evaluate(AbstractBeforeAfterRule.java:46)
	at com.carrotsearch.randomizedtesting.rules.SystemPropertiesInvariantRule$1.evaluate(SystemPropertiesInvariantRule.java:55)
	at org.apache.lucene.util.TestRuleThreadAndTestName$1.evaluate(TestRuleThreadAndTestName.java:49)
	at org.apache.lucene.util.TestRuleIgnoreAfterMaxFailures$1.evaluate(TestRuleIgnoreAfterMaxFailures.java:70)
	at org.apache.lucene.util.TestRuleMarkFailure$1.evaluate(TestRuleMarkFailure.java:48)
	at com.carrotsearch.randomizedtesting.rules.StatementAdapter.evaluate(StatementAdapter.java:36)
	at com.carrotsearch.randomizedtesting.ThreadLeakControl$StatementRunner.run(ThreadLeakControl.java:358)
	at com.carrotsearch.randomizedtesting.ThreadLeakControl.forkTimeoutingTask(ThreadLeakControl.java:782)
	at com.carrotsearch.randomizedtesting.ThreadLeakControl$3.evaluate(ThreadLeakControl.java:442)
	at com.carrotsearch.randomizedtesting.RandomizedRunner.runSingleTest(RandomizedRunner.java:746)
	at com.carrotsearch.randomizedtesting.RandomizedRunner$3.evaluate(RandomizedRunner.java:648)
	at com.carrotsearch.randomizedtesting.RandomizedRunner$4.evaluate(RandomizedRunner.java:682)
	at com.carrotsearch.randomizedtesting.RandomizedRunner$5.evaluate(RandomizedRunner.java:693)
	at com.carrotsearch.randomizedtesting.rules.StatementAdapter.evaluate(StatementAdapter.java:36)
	at com.carrotsearch.randomizedtesting.rules.SystemPropertiesRestoreRule$1.evaluate(SystemPropertiesRestoreRule.java:53)
	at org.apache.lucene.util.AbstractBeforeAfterRule$1.evaluate(AbstractBeforeAfterRule.java:46)
	at org.apache.lucene.util.TestRuleStoreClassName$1.evaluate(TestRuleStoreClassName.java:42)
	at com.carrotsearch.randomizedtesting.rules.SystemPropertiesInvariantRule$1.evaluate(SystemPropertiesInvariantRule.java:55)
	at com.carrotsearch.randomizedtesting.rules.NoShadowingOrOverridesOnMethodsRule$1.evaluate(NoShadowingOrOverridesOnMethodsRule.java:39)
	at com.carrotsearch.randomizedtesting.rules.NoShadowingOrOverridesOnMethodsRule$1.evaluate(NoShadowingOrOverridesOnMethodsRule.java:39)
	at com.carrotsearch.randomizedtesting.rules.StatementAdapter.evaluate(StatementAdapter.java:36)
	at org.apache.lucene.util.TestRuleAssertionsRequired$1.evaluate(TestRuleAssertionsRequired.java:43)
	at org.apache.lucene.util.TestRuleMarkFailure$1.evaluate(TestRuleMarkFailure.java:48)
	at org.apache.lucene.util.TestRuleIgnoreAfterMaxFailures$1.evaluate(TestRuleIgnoreAfterMaxFailures.java:70)
	at org.apache.lucene.util.TestRuleIgnoreTestSuites$1.evaluate(TestRuleIgnoreTestSuites.java:55)
	at com.carrotsearch.randomizedtesting.rules.StatementAdapter.evaluate(StatementAdapter.java:36)
	at com.carrotsearch.randomizedtesting.ThreadLeakControl$StatementRunner.run(ThreadLeakControl.java:358)
	at java.lang.Thread.run(Thread.java:679)


REGRESSION:  org.apache.solr.servlet.CacheHeaderTest.testCacheVetoException

Error Message:
We got no Pragma header

Stack Trace:
java.lang.AssertionError: We got no Pragma header
	at __randomizedtesting.SeedInfo.seed([8BADF50C402C6C84:80E2633B63FAAFA]:0)
	at org.junit.Assert.fail(Assert.java:93)
	at org.junit.Assert.assertTrue(Assert.java:43)
	at org.junit.Assert.assertNotNull(Assert.java:526)
	at org.apache.solr.servlet.CacheHeaderTest.checkVetoHeaders(CacheHeaderTest.java:78)
	at org.apache.solr.servlet.CacheHeaderTest.testCacheVetoException(CacheHeaderTest.java:68)
	at sun.reflect.NativeMethodAccessorImpl.invoke0(Native Method)
	at sun.reflect.NativeMethodAccessorImpl.invoke(NativeMethodAccessorImpl.java:57)
	at sun.reflect.DelegatingMethodAccessorImpl.invoke(DelegatingMethodAccessorImpl.java:43)
	at java.lang.reflect.Method.invoke(Method.java:616)
	at com.carrotsearch.randomizedtesting.RandomizedRunner.invoke(RandomizedRunner.java:1559)
	at com.carrotsearch.randomizedtesting.RandomizedRunner.access$600(RandomizedRunner.java:79)
	at com.carrotsearch.randomizedtesting.RandomizedRunner$6.evaluate(RandomizedRunner.java:737)
	at com.carrotsearch.randomizedtesting.RandomizedRunner$7.evaluate(RandomizedRunner.java:773)
	at com.carrotsearch.randomizedtesting.RandomizedRunner$8.evaluate(Rand

[...truncated too long message...]

asing directory:/usr/home/hudson/hudson-slave/workspace/Lucene-Solr-NightlyTests-trunk/solr/build/solr-core/test/J0/./solrtest-AnalysisAfterCoreReloadTest-1355864911729/index
[junit4:junit4]   2> 943 T1692 oasc.CachingDirectoryFactory.close Closing directory when closing factory:/usr/home/hudson/hudson-slave/workspace/Lucene-Solr-NightlyTests-trunk/solr/build/solr-core/test/J0/./solrtest-AnalysisAfterCoreReloadTest-1355864911729
[junit4:junit4]   2> 943 T1692 oasc.CachingDirectoryFactory.close Closing directory when closing factory:/usr/home/hudson/hudson-slave/workspace/Lucene-Solr-NightlyTests-trunk/solr/build/solr-core/test/J0/./solrtest-AnalysisAfterCoreReloadTest-1355864911729/index
[junit4:junit4]   2> 992 T1692 oas.SolrTestCaseJ4.deleteCore ###deleteCore
[junit4:junit4]   2> NOTE: test params are: codec=SimpleText, sim=RandomSimilarityProvider(queryNorm=true,coord=no): {}, locale=mk, timezone=Europe/Ljubljana
[junit4:junit4]   2> NOTE: FreeBSD 9.0-RELEASE amd64/Sun Microsystems Inc. 1.6.0_32 (64-bit)/cpus=16,threads=1,free=112458328,total=427753472
[junit4:junit4]   2> NOTE: All tests run in this JVM: [SortByFunctionTest, IndexBasedSpellCheckerTest, SpellCheckCollatorTest, TestJmxMonitoredMap, TestLuceneMatchVersion, DistributedTermsComponentTest, HighlighterConfigTest, TestRandomFaceting, MinimalSchemaTest, BasicDistributedZkTest, BadComponentTest, TestFaceting, TestWordDelimiterFilterFactory, CurrencyFieldTest, DirectSolrConnectionTest, NotRequiredUniqueKeyTest, FileBasedSpellCheckerTest, CollectionsAPIDistributedZkTest, PathHierarchyTokenizerFactoryTest, ClusterStateTest, TestXIncludeConfig, SolrCmdDistributorTest, SystemInfoHandlerTest, PreAnalyzedFieldTest, TestPHPSerializedResponseWriter, SimpleFacetsTest, TestFuzzyAnalyzedSuggestions, SpellPossibilityIteratorTest, LoggingHandlerTest, TestIndexingPerformance, CopyFieldTest, SolrRequestParserTest, AlternateDirectoryTest, SolrPluginUtilsTest, DistanceFunctionTest, CacheHeaderTest, TestReload, SpellCheckComponentTest, TestCharFilters, QueryElevationComponentTest, DistributedSpellCheckComponentTest, TestRangeQuery, TestRTGBase, TestBinaryResponseWriter, TestNumberUtils, SearchHandlerTest, BinaryUpdateRequestHandlerTest, ZkControllerTest, SimplePostToolTest, TestSuggestSpellingConverter, UpdateRequestProcessorFactoryTest, SampleTest, AnalysisAfterCoreReloadTest]
[junit4:junit4]   2> NOTE: download the large Jenkins line-docs file by running 'ant get-jenkins-line-docs' in the lucene directory.
[junit4:junit4]   2> NOTE: reproduce with: ant test  -Dtestcase=AnalysisAfterCoreReloadTest -Dtests.seed=8BADF50C402C6C84 -Dtests.multiplier=2 -Dtests.nightly=true -Dtests.slow=true -Dtests.linedocsfile=/home/hudson/lucene-data/enwiki.random.lines.txt -Dtests.locale=mk -Dtests.timezone=Europe/Ljubljana -Dtests.file.encoding=ISO-8859-1
[junit4:junit4] ERROR   0.00s J0 | AnalysisAfterCoreReloadTest (suite) <<<
[junit4:junit4]    > Throwable #1: java.lang.RuntimeException: org.apache.solr.common.SolrException: Error Instantiating Update Handler, solr.DirectUpdateHandler2 failed to instantiate org.apache.solr.update.UpdateHandler
[junit4:junit4]    > 	at __randomizedtesting.SeedInfo.seed([8BADF50C402C6C84]:0)
[junit4:junit4]    > 	at org.apache.solr.util.TestHarness.<init>(TestHarness.java:137)
[junit4:junit4]    > 	at org.apache.solr.util.TestHarness.<init>(TestHarness.java:122)
[junit4:junit4]    > 	at org.apache.solr.util.TestHarness.<init>(TestHarness.java:112)
[junit4:junit4]    > 	at org.apache.solr.SolrTestCaseJ4.createCore(SolrTestCaseJ4.java:384)
[junit4:junit4]    > 	at org.apache.solr.SolrTestCaseJ4.initCore(SolrTestCaseJ4.java:376)
[junit4:junit4]    > 	at org.apache.solr.SolrTestCaseJ4.initCore(SolrTestCaseJ4.java:188)
[junit4:junit4]    > 	at org.apache.solr.AnalysisAfterCoreReloadTest.beforeClass(AnalysisAfterCoreReloadTest.java:48)
[junit4:junit4]    > 	at sun.reflect.NativeMethodAccessorImpl.invoke0(Native Method)
[junit4:junit4]    > 	at sun.reflect.NativeMethodAccessorImpl.invoke(NativeMethodAccessorImpl.java:57)
[junit4:junit4]    > 	at sun.reflect.DelegatingMethodAccessorImpl.invoke(DelegatingMethodAccessorImpl.java:43)
[junit4:junit4]    > 	at java.lang.reflect.Method.invoke(Method.java:616)
[junit4:junit4]    > 	at com.carrotsearch.randomizedtesting.RandomizedRunner.invoke(RandomizedRunner.java:1559)
[junit4:junit4]    > 	at com.carrotsearch.randomizedtesting.RandomizedRunner.access$600(RandomizedRunner.java:79)
[junit4:junit4]    > 	at com.carrotsearch.randomizedtesting.RandomizedRunner$4.evaluate(RandomizedRunner.java:677)
[junit4:junit4]    > 	at com.carrotsearch.randomizedtesting.RandomizedRunner$5.evaluate(RandomizedRunner.java:693)
[junit4:junit4]    > 	at com.carrotsearch.randomizedtesting.rules.StatementAdapter.evaluate(StatementAdapter.java:36)
[junit4:junit4]    > 	at com.carrotsearch.randomizedtesting.rules.SystemPropertiesRestoreRule$1.evaluate(SystemPropertiesRestoreRule.java:53)
[junit4:junit4]    > 	at org.apache.lucene.util.AbstractBeforeAfterRule$1.evaluate(AbstractBeforeAfterRule.java:46)
[junit4:junit4]    > 	at org.apache.lucene.util.TestRuleStoreClassName$1.evaluate(TestRuleStoreClassName.java:42)
[junit4:junit4]    > 	at com.carrotsearch.randomizedtesting.rules.SystemPropertiesInvariantRule$1.evaluate(SystemPropertiesInvariantRule.java:55)
[junit4:junit4]    > 	at com.carrotsearch.randomizedtesting.rules.NoShadowingOrOverridesOnMethodsRule$1.evaluate(NoShadowingOrOverridesOnMethodsRule.java:39)
[junit4:junit4]    > 	at com.carrotsearch.randomizedtesting.rules.NoShadowingOrOverridesOnMethodsRule$1.evaluate(NoShadowingOrOverridesOnMethodsRule.java:39)
[junit4:junit4]    > 	at com.carrotsearch.randomizedtesting.rules.StatementAdapter.evaluate(StatementAdapter.java:36)
[junit4:junit4]    > 	at org.apache.lucene.util.TestRuleAssertionsRequired$1.evaluate(TestRuleAssertionsRequired.java:43)
[junit4:junit4]    > 	at org.apache.lucene.util.TestRuleMarkFailure$1.evaluate(TestRuleMarkFailure.java:48)
[junit4:junit4]    > 	at org.apache.lucene.util.TestRuleIgnoreAfterMaxFailures$1.evaluate(TestRuleIgnoreAfterMaxFailures.java:70)
[junit4:junit4]    > 	at org.apache.lucene.util.TestRuleIgnoreTestSuites$1.evaluate(TestRuleIgnoreTestSuites.java:55)
[junit4:junit4]    > 	at com.carrotsearch.randomizedtesting.rules.StatementAdapter.evaluate(StatementAdapter.java:36)
[junit4:junit4]    > 	at com.carrotsearch.randomizedtesting.ThreadLeakControl$StatementRunner.run(ThreadLeakControl.java:358)
[junit4:junit4]    > 	at java.lang.Thread.run(Thread.java:679)
[junit4:junit4]    > Caused by: org.apache.solr.common.SolrException: Error Instantiating Update Handler, solr.DirectUpdateHandler2 failed to instantiate org.apache.solr.update.UpdateHandler
[junit4:junit4]    > 	at org.apache.solr.core.SolrCore.<init>(SolrCore.java:789)
[junit4:junit4]    > 	at org.apache.solr.core.SolrCore.<init>(SolrCore.java:602)
[junit4:junit4]    > 	at org.apache.solr.util.TestHarness$Initializer.initialize(TestHarness.java:205)
[junit4:junit4]    > 	at org.apache.solr.util.TestHarness.<init>(TestHarness.java:128)
[junit4:junit4]    > 	... 29 more
[junit4:junit4]    > Caused by: org.apache.solr.common.SolrException: Error Instantiating Update Handler, solr.DirectUpdateHandler2 failed to instantiate org.apache.solr.update.UpdateHandler
[junit4:junit4]    > 	at org.apache.solr.core.SolrCore.createInstance(SolrCore.java:526)
[junit4:junit4]    > 	at org.apache.solr.core.SolrCore.createUpdateHandler(SolrCore.java:580)
[junit4:junit4]    > 	at org.apache.solr.core.SolrCore.<init>(SolrCore.java:773)
[junit4:junit4]    > 	... 32 more
[junit4:junit4]    > Caused by: java.lang.reflect.InvocationTargetException
[junit4:junit4]    > 	at sun.reflect.GeneratedConstructorAccessor119.newInstance(Unknown Source)
[junit4:junit4]    > 	at sun.reflect.DelegatingConstructorAccessorImpl.newInstance(DelegatingConstructorAccessorImpl.java:45)
[junit4:junit4]    > 	at java.lang.reflect.Constructor.newInstance(Constructor.java:532)
[junit4:junit4]    > 	at org.apache.solr.core.SolrCore.createInstance(SolrCore.java:512)
[junit4:junit4]    > 	... 34 more
[junit4:junit4]    > Caused by: java.lang.NullPointerException
[junit4:junit4]    > 	at org.apache.solr.update.UpdateLog.getTlogDir(UpdateLog.java:1399)
[junit4:junit4]    > 	at org.apache.solr.update.UpdateHandler.clearLog(UpdateHandler.java:88)
[junit4:junit4]    > 	at org.apache.solr.update.UpdateHandler.<init>(UpdateHandler.java:127)
[junit4:junit4]    > 	at org.apache.solr.update.DirectUpdateHandler2.<init>(DirectUpdateHandler2.java:96)
[junit4:junit4]    > 	... 38 more
[junit4:junit4] Completed on J0 in 1.02s, 0 tests, 1 error <<< FAILURES!

[...truncated 25 lines...]
BUILD FAILED
/usr/home/hudson/hudson-slave/workspace/Lucene-Solr-NightlyTests-trunk/build.xml:373: The following error occurred while executing this line:
/usr/home/hudson/hudson-slave/workspace/Lucene-Solr-NightlyTests-trunk/build.xml:353: The following error occurred while executing this line:
/usr/home/hudson/hudson-slave/workspace/Lucene-Solr-NightlyTests-trunk/build.xml:39: The following error occurred while executing this line:
/usr/home/hudson/hudson-slave/workspace/Lucene-Solr-NightlyTests-trunk/solr/build.xml:178: The following error occurred while executing this line:
/usr/home/hudson/hudson-slave/workspace/Lucene-Solr-NightlyTests-trunk/solr/common-build.xml:438: The following error occurred while executing this line:
/usr/home/hudson/hudson-slave/workspace/Lucene-Solr-NightlyTests-trunk/lucene/common-build.xml:1175: The following error occurred while executing this line:
/usr/home/hudson/hudson-slave/workspace/Lucene-Solr-NightlyTests-trunk/lucene/common-build.xml:840: There were test failures: 242 suites, 882 tests, 34 suite-level errors, 8 errors, 5 failures, 740 ignored

Total time: 51 minutes 56 seconds
Build step 'Invoke Ant' marked build as failure
Archiving artifacts
Recording test results
Email was triggered for: Failure
Sending email for trigger: Failure



Mime
View raw message