lucene-dev mailing list archives

Site index · List index
Message view « Date » · « Thread »
Top « Date » · « Thread »
From Apache Jenkins Server <jenk...@builds.apache.org>
Subject [JENKINS] Lucene-Solr-Tests-4.x-java7 - Build # 820 - Failure
Date Fri, 21 Dec 2012 15:20:13 GMT
Build: https://builds.apache.org/job/Lucene-Solr-Tests-4.x-java7/820/

1 tests failed.
REGRESSION:  org.apache.solr.cloud.SyncSliceTest.testDistribSearch

Error Message:
shard1 should have just been set up to be inconsistent - but it's still consistent

Stack Trace:
java.lang.AssertionError: shard1 should have just been set up to be inconsistent - but it's still consistent
	at __randomizedtesting.SeedInfo.seed([6F3182D7790245E9:EED70CCF0E5D25D5]:0)
	at org.junit.Assert.fail(Assert.java:93)
	at org.junit.Assert.assertTrue(Assert.java:43)
	at org.junit.Assert.assertNotNull(Assert.java:526)
	at org.apache.solr.cloud.SyncSliceTest.doTest(SyncSliceTest.java:220)
	at org.apache.solr.BaseDistributedSearchTestCase.testDistribSearch(BaseDistributedSearchTestCase.java:794)
	at sun.reflect.NativeMethodAccessorImpl.invoke0(Native Method)
	at sun.reflect.NativeMethodAccessorImpl.invoke(NativeMethodAccessorImpl.java:57)
	at sun.reflect.DelegatingMethodAccessorImpl.invoke(DelegatingMethodAccessorImpl.java:43)
	at java.lang.reflect.Method.invoke(Method.java:601)
	at com.carrotsearch.randomizedtesting.RandomizedRunner.invoke(RandomizedRunner.java:1559)
	at com.carrotsearch.randomizedtesting.RandomizedRunner.access$600(RandomizedRunner.java:79)
	at com.carrotsearch.randomizedtesting.RandomizedRunner$6.evaluate(RandomizedRunner.java:737)
	at com.carrotsearch.randomizedtesting.RandomizedRunner$7.evaluate(RandomizedRunner.java:773)
	at com.carrotsearch.randomizedtesting.RandomizedRunner$8.evaluate(RandomizedRunner.java:787)
	at com.carrotsearch.randomizedtesting.rules.SystemPropertiesRestoreRule$1.evaluate(SystemPropertiesRestoreRule.java:53)
	at org.apache.lucene.util.TestRuleSetupTeardownChained$1.evaluate(TestRuleSetupTeardownChained.java:50)
	at org.apache.lucene.util.TestRuleFieldCacheSanity$1.evaluate(TestRuleFieldCacheSanity.java:51)
	at org.apache.lucene.util.AbstractBeforeAfterRule$1.evaluate(AbstractBeforeAfterRule.java:46)
	at com.carrotsearch.randomizedtesting.rules.SystemPropertiesInvariantRule$1.evaluate(SystemPropertiesInvariantRule.java:55)
	at org.apache.lucene.util.TestRuleThreadAndTestName$1.evaluate(TestRuleThreadAndTestName.java:49)
	at org.apache.lucene.util.TestRuleIgnoreAfterMaxFailures$1.evaluate(TestRuleIgnoreAfterMaxFailures.java:70)
	at org.apache.lucene.util.TestRuleMarkFailure$1.evaluate(TestRuleMarkFailure.java:48)
	at com.carrotsearch.randomizedtesting.rules.StatementAdapter.evaluate(StatementAdapter.java:36)
	at com.carrotsearch.randomizedtesting.ThreadLeakControl$StatementRunner.run(ThreadLeakControl.java:358)
	at com.carrotsearch.randomizedtesting.ThreadLeakControl.forkTimeoutingTask(ThreadLeakControl.java:782)
	at com.carrotsearch.randomizedtesting.ThreadLeakControl$3.evaluate(ThreadLeakControl.java:442)
	at com.carrotsearch.randomizedtesting.RandomizedRunner.runSingleTest(RandomizedRunner.java:746)
	at com.carrotsearch.randomizedtesting.RandomizedRunner$3.evaluate(RandomizedRunner.java:648)
	at com.carrotsearch.randomizedtesting.RandomizedRunner$4.evaluate(RandomizedRunner.java:682)
	at com.carrotsearch.randomizedtesting.RandomizedRunner$5.evaluate(RandomizedRunner.java:693)
	at com.carrotsearch.randomizedtesting.rules.StatementAdapter.evaluate(StatementAdapter.java:36)
	at com.carrotsearch.randomizedtesting.rules.SystemPropertiesRestoreRule$1.evaluate(SystemPropertiesRestoreRule.java:53)
	at org.apache.lucene.util.AbstractBeforeAfterRule$1.evaluate(AbstractBeforeAfterRule.java:46)
	at org.apache.lucene.util.TestRuleStoreClassName$1.evaluate(TestRuleStoreClassName.java:42)
	at com.carrotsearch.randomizedtesting.rules.SystemPropertiesInvariantRule$1.evaluate(SystemPropertiesInvariantRule.java:55)
	at com.carrotsearch.randomizedtesting.rules.NoShadowingOrOverridesOnMethodsRule$1.evaluate(NoShadowingOrOverridesOnMethodsRule.java:39)
	at com.carrotsearch.randomizedtesting.rules.NoShadowingOrOverridesOnMethodsRule$1.evaluate(NoShadowingOrOverridesOnMethodsRule.java:39)
	at com.carrotsearch.randomizedtesting.rules.StatementAdapter.evaluate(StatementAdapter.java:36)
	at org.apache.lucene.util.TestRuleAssertionsRequired$1.evaluate(TestRuleAssertionsRequired.java:43)
	at org.apache.lucene.util.TestRuleMarkFailure$1.evaluate(TestRuleMarkFailure.java:48)
	at org.apache.lucene.util.TestRuleIgnoreAfterMaxFailures$1.evaluate(TestRuleIgnoreAfterMaxFailures.java:70)
	at org.apache.lucene.util.TestRuleIgnoreTestSuites$1.evaluate(TestRuleIgnoreTestSuites.java:55)
	at com.carrotsearch.randomizedtesting.rules.StatementAdapter.evaluate(StatementAdapter.java:36)
	at com.carrotsearch.randomizedtesting.ThreadLeakControl$StatementRunner.run(ThreadLeakControl.java:358)
	at java.lang.Thread.run(Thread.java:722)




Build Log:
[...truncated 9278 lines...]
[junit4:junit4] Suite: org.apache.solr.cloud.SyncSliceTest
[junit4:junit4]   2> 0 T1815 oas.BaseDistributedSearchTestCase.initHostContext Setting hostContext system property: /jjj/
[junit4:junit4]   2> 5 T1815 oas.SolrTestCaseJ4.setUp ###Starting testDistribSearch
[junit4:junit4]   2> Creating dataDir: /usr/home/hudson/hudson-slave/workspace/Lucene-Solr-Tests-4.x-java7/solr/build/solr-core/test/J0/./solrtest-SyncSliceTest-1356103013917
[junit4:junit4]   2> 6 T1815 oasc.ZkTestServer.run STARTING ZK TEST SERVER
[junit4:junit4]   2> 7 T1816 oasc.ZkTestServer$ZKServerMain.runFromConfig Starting server
[junit4:junit4]   2> 11 T1816 oazs.ZooKeeperServer.setTickTime tickTime set to 1000
[junit4:junit4]   2> 11 T1816 oazs.ZooKeeperServer.setMinSessionTimeout minSessionTimeout set to -1
[junit4:junit4]   2> 11 T1816 oazs.ZooKeeperServer.setMaxSessionTimeout maxSessionTimeout set to -1
[junit4:junit4]   2> 12 T1816 oazs.NIOServerCnxnFactory.configure binding to port 0.0.0.0/0.0.0.0:0
[junit4:junit4]   2> 13 T1816 oazsp.FileTxnSnapLog.save Snapshotting: 0x0 to /usr/home/hudson/hudson-slave/workspace/Lucene-Solr-Tests-4.x-java7/solr/build/solr-core/test/J0/./org.apache.solr.cloud.SyncSliceTest-1356103013916/zookeeper/server1/data/version-2/snapshot.0
[junit4:junit4]   2> 108 T1815 oasc.ZkTestServer.run start zk server on port:54946
[junit4:junit4]   2> 109 T1815 oaz.ZooKeeper.<init> Initiating client connection, connectString=127.0.0.1:54946 sessionTimeout=10000 watcher=org.apache.solr.common.cloud.ConnectionManager@7e94d888
[junit4:junit4]   2> 110 T1815 oascc.ConnectionManager.waitForConnected Waiting for client to connect to ZooKeeper
[junit4:junit4]   2> 110 T1821 oaz.ClientCnxn$SendThread.logStartConnect Opening socket connection to server localhost/127.0.0.1:54946. Will not attempt to authenticate using SASL (access denied ("javax.security.auth.AuthPermission" "getLoginConfiguration"))
[junit4:junit4]   2> 111 T1821 oaz.ClientCnxn$SendThread.primeConnection Socket connection established to localhost/127.0.0.1:54946, initiating session
[junit4:junit4]   2> 111 T1817 oazs.NIOServerCnxnFactory.run Accepted socket connection from /140.211.11.196:54947
[junit4:junit4]   2> 112 T1817 oazs.ZooKeeperServer.processConnectRequest Client attempting to establish new session at /140.211.11.196:54947
[junit4:junit4]   2> 112 T1819 oazsp.FileTxnLog.append Creating new log file: log.1
[junit4:junit4]   2> 115 T1819 oazs.ZooKeeperServer.finishSessionInit Established session 0x13bbe09d6250000 with negotiated timeout 10000 for client /140.211.11.196:54947
[junit4:junit4]   2> 115 T1821 oaz.ClientCnxn$SendThread.onConnected Session establishment complete on server localhost/127.0.0.1:54946, sessionid = 0x13bbe09d6250000, negotiated timeout = 10000
[junit4:junit4]   2> 115 T1822 oascc.ConnectionManager.process Watcher org.apache.solr.common.cloud.ConnectionManager@7e94d888 name:ZooKeeperConnection Watcher:127.0.0.1:54946 got event WatchedEvent state:SyncConnected type:None path:null path:null type:None
[junit4:junit4]   2> 116 T1815 oascc.ConnectionManager.waitForConnected Client is connected to ZooKeeper
[junit4:junit4]   2> 116 T1815 oascc.SolrZkClient.makePath makePath: /solr
[junit4:junit4]   2> 120 T1820 oazs.PrepRequestProcessor.pRequest2Txn Processed session termination for sessionid: 0x13bbe09d6250000
[junit4:junit4]   2> 121 T1822 oaz.ClientCnxn$EventThread.run EventThread shut down
[junit4:junit4]   2> 121 T1817 oazs.NIOServerCnxn.closeSock Closed socket connection for client /140.211.11.196:54947 which had sessionid 0x13bbe09d6250000
[junit4:junit4]   2> 121 T1815 oaz.ZooKeeper.close Session: 0x13bbe09d6250000 closed
[junit4:junit4]   2> 122 T1815 oaz.ZooKeeper.<init> Initiating client connection, connectString=127.0.0.1:54946/solr sessionTimeout=10000 watcher=org.apache.solr.common.cloud.ConnectionManager@3bca3a40
[junit4:junit4]   2> 123 T1823 oaz.ClientCnxn$SendThread.logStartConnect Opening socket connection to server localhost/127.0.0.1:54946. Will not attempt to authenticate using SASL (access denied ("javax.security.auth.AuthPermission" "getLoginConfiguration"))
[junit4:junit4]   2> 123 T1815 oascc.ConnectionManager.waitForConnected Waiting for client to connect to ZooKeeper
[junit4:junit4]   2> 124 T1823 oaz.ClientCnxn$SendThread.primeConnection Socket connection established to localhost/127.0.0.1:54946, initiating session
[junit4:junit4]   2> 124 T1817 oazs.NIOServerCnxnFactory.run Accepted socket connection from /140.211.11.196:54948
[junit4:junit4]   2> 125 T1817 oazs.ZooKeeperServer.processConnectRequest Client attempting to establish new session at /140.211.11.196:54948
[junit4:junit4]   2> 130 T1819 oazs.ZooKeeperServer.finishSessionInit Established session 0x13bbe09d6250001 with negotiated timeout 10000 for client /140.211.11.196:54948
[junit4:junit4]   2> 130 T1823 oaz.ClientCnxn$SendThread.onConnected Session establishment complete on server localhost/127.0.0.1:54946, sessionid = 0x13bbe09d6250001, negotiated timeout = 10000
[junit4:junit4]   2> 131 T1824 oascc.ConnectionManager.process Watcher org.apache.solr.common.cloud.ConnectionManager@3bca3a40 name:ZooKeeperConnection Watcher:127.0.0.1:54946/solr got event WatchedEvent state:SyncConnected type:None path:null path:null type:None
[junit4:junit4]   2> 131 T1815 oascc.ConnectionManager.waitForConnected Client is connected to ZooKeeper
[junit4:junit4]   2> 132 T1815 oascc.SolrZkClient.makePath makePath: /collections/collection1
[junit4:junit4]   2> 136 T1815 oascc.SolrZkClient.makePath makePath: /collections/collection1/shards
[junit4:junit4]   2> 146 T1815 oascc.SolrZkClient.makePath makePath: /collections/control_collection
[junit4:junit4]   2> 148 T1815 oascc.SolrZkClient.makePath makePath: /collections/control_collection/shards
[junit4:junit4]   2> 151 T1815 oasc.AbstractZkTestCase.putConfig put /usr/home/hudson/hudson-slave/workspace/Lucene-Solr-Tests-4.x-java7/solr/build/solr-core/test-files/solr/collection1/conf/solrconfig.xml to /configs/conf1/solrconfig.xml
[junit4:junit4]   2> 153 T1815 oascc.SolrZkClient.makePath makePath: /configs/conf1/solrconfig.xml
[junit4:junit4]   2> 165 T1815 oasc.AbstractZkTestCase.putConfig put /usr/home/hudson/hudson-slave/workspace/Lucene-Solr-Tests-4.x-java7/solr/build/solr-core/test-files/solr/collection1/conf/schema.xml to /configs/conf1/schema.xml
[junit4:junit4]   2> 166 T1815 oascc.SolrZkClient.makePath makePath: /configs/conf1/schema.xml
[junit4:junit4]   2> 270 T1815 oasc.AbstractZkTestCase.putConfig put /usr/home/hudson/hudson-slave/workspace/Lucene-Solr-Tests-4.x-java7/solr/build/solr-core/test-files/solr/collection1/conf/stopwords.txt to /configs/conf1/stopwords.txt
[junit4:junit4]   2> 271 T1815 oascc.SolrZkClient.makePath makePath: /configs/conf1/stopwords.txt
[junit4:junit4]   2> 275 T1815 oasc.AbstractZkTestCase.putConfig put /usr/home/hudson/hudson-slave/workspace/Lucene-Solr-Tests-4.x-java7/solr/build/solr-core/test-files/solr/collection1/conf/protwords.txt to /configs/conf1/protwords.txt
[junit4:junit4]   2> 275 T1815 oascc.SolrZkClient.makePath makePath: /configs/conf1/protwords.txt
[junit4:junit4]   2> 285 T1815 oasc.AbstractZkTestCase.putConfig put /usr/home/hudson/hudson-slave/workspace/Lucene-Solr-Tests-4.x-java7/solr/build/solr-core/test-files/solr/collection1/conf/currency.xml to /configs/conf1/currency.xml
[junit4:junit4]   2> 285 T1815 oascc.SolrZkClient.makePath makePath: /configs/conf1/currency.xml
[junit4:junit4]   2> 289 T1815 oasc.AbstractZkTestCase.putConfig put /usr/home/hudson/hudson-slave/workspace/Lucene-Solr-Tests-4.x-java7/solr/build/solr-core/test-files/solr/collection1/conf/open-exchange-rates.json to /configs/conf1/open-exchange-rates.json
[junit4:junit4]   2> 290 T1815 oascc.SolrZkClient.makePath makePath: /configs/conf1/open-exchange-rates.json
[junit4:junit4]   2> 293 T1815 oasc.AbstractZkTestCase.putConfig put /usr/home/hudson/hudson-slave/workspace/Lucene-Solr-Tests-4.x-java7/solr/build/solr-core/test-files/solr/collection1/conf/mapping-ISOLatin1Accent.txt to /configs/conf1/mapping-ISOLatin1Accent.txt
[junit4:junit4]   2> 295 T1815 oascc.SolrZkClient.makePath makePath: /configs/conf1/mapping-ISOLatin1Accent.txt
[junit4:junit4]   2> 298 T1815 oasc.AbstractZkTestCase.putConfig put /usr/home/hudson/hudson-slave/workspace/Lucene-Solr-Tests-4.x-java7/solr/build/solr-core/test-files/solr/collection1/conf/old_synonyms.txt to /configs/conf1/old_synonyms.txt
[junit4:junit4]   2> 299 T1815 oascc.SolrZkClient.makePath makePath: /configs/conf1/old_synonyms.txt
[junit4:junit4]   2> 302 T1815 oasc.AbstractZkTestCase.putConfig put /usr/home/hudson/hudson-slave/workspace/Lucene-Solr-Tests-4.x-java7/solr/build/solr-core/test-files/solr/collection1/conf/synonyms.txt to /configs/conf1/synonyms.txt
[junit4:junit4]   2> 303 T1815 oascc.SolrZkClient.makePath makePath: /configs/conf1/synonyms.txt
[junit4:junit4]   2> 306 T1820 oazs.PrepRequestProcessor.pRequest2Txn Processed session termination for sessionid: 0x13bbe09d6250001
[junit4:junit4]   2> 308 T1824 oaz.ClientCnxn$EventThread.run EventThread shut down
[junit4:junit4]   2> 308 T1817 oazs.NIOServerCnxn.closeSock Closed socket connection for client /140.211.11.196:54948 which had sessionid 0x13bbe09d6250001
[junit4:junit4]   2> 308 T1815 oaz.ZooKeeper.close Session: 0x13bbe09d6250001 closed
[junit4:junit4]   2> 465 T1815 oejs.Server.doStart jetty-8.1.8.v20121106
[junit4:junit4]   2> 470 T1815 oejs.AbstractConnector.doStart Started SocketConnector@127.0.0.1:54949
[junit4:junit4]   2> 471 T1815 oasc.SolrResourceLoader.locateSolrHome JNDI not configured for solr (NoInitialContextEx)
[junit4:junit4]   2> 472 T1815 oasc.SolrResourceLoader.locateSolrHome using system property solr.solr.home: /usr/home/hudson/hudson-slave/workspace/Lucene-Solr-Tests-4.x-java7/solr/build/solr-core/test/J0/./org.apache.solr.cloud.SyncSliceTest-controljetty-1356103014220
[junit4:junit4]   2> 473 T1815 oasc.SolrResourceLoader.<init> new SolrResourceLoader for deduced Solr Home: '/usr/home/hudson/hudson-slave/workspace/Lucene-Solr-Tests-4.x-java7/solr/build/solr-core/test/J0/./org.apache.solr.cloud.SyncSliceTest-controljetty-1356103014220/'
[junit4:junit4]   2> 518 T1815 oass.SolrDispatchFilter.init SolrDispatchFilter.init()
[junit4:junit4]   2> 519 T1815 oasc.SolrResourceLoader.locateSolrHome JNDI not configured for solr (NoInitialContextEx)
[junit4:junit4]   2> 520 T1815 oasc.SolrResourceLoader.locateSolrHome using system property solr.solr.home: /usr/home/hudson/hudson-slave/workspace/Lucene-Solr-Tests-4.x-java7/solr/build/solr-core/test/J0/./org.apache.solr.cloud.SyncSliceTest-controljetty-1356103014220
[junit4:junit4]   2> 521 T1815 oasc.CoreContainer$Initializer.initialize looking for solr.xml: /usr/home/hudson/hudson-slave/workspace/Lucene-Solr-Tests-4.x-java7/solr/build/solr-core/test/J0/./org.apache.solr.cloud.SyncSliceTest-controljetty-1356103014220/solr.xml
[junit4:junit4]   2> 521 T1815 oasc.CoreContainer.<init> New CoreContainer 1669241139
[junit4:junit4]   2> 522 T1815 oasc.CoreContainer.load Loading CoreContainer using Solr Home: '/usr/home/hudson/hudson-slave/workspace/Lucene-Solr-Tests-4.x-java7/solr/build/solr-core/test/J0/./org.apache.solr.cloud.SyncSliceTest-controljetty-1356103014220/'
[junit4:junit4]   2> 523 T1815 oasc.SolrResourceLoader.<init> new SolrResourceLoader for directory: '/usr/home/hudson/hudson-slave/workspace/Lucene-Solr-Tests-4.x-java7/solr/build/solr-core/test/J0/./org.apache.solr.cloud.SyncSliceTest-controljetty-1356103014220/'
[junit4:junit4]   2> 558 T1815 oashc.HttpShardHandlerFactory.getParameter Setting socketTimeout to: 30000
[junit4:junit4]   2> 559 T1815 oashc.HttpShardHandlerFactory.getParameter Setting urlScheme to: http://
[junit4:junit4]   2> 560 T1815 oashc.HttpShardHandlerFactory.getParameter Setting connTimeout to: 15000
[junit4:junit4]   2> 561 T1815 oashc.HttpShardHandlerFactory.getParameter Setting maxConnectionsPerHost to: 20
[junit4:junit4]   2> 562 T1815 oashc.HttpShardHandlerFactory.getParameter Setting corePoolSize to: 0
[junit4:junit4]   2> 562 T1815 oashc.HttpShardHandlerFactory.getParameter Setting maximumPoolSize to: 2147483647
[junit4:junit4]   2> 563 T1815 oashc.HttpShardHandlerFactory.getParameter Setting maxThreadIdleTime to: 5
[junit4:junit4]   2> 564 T1815 oashc.HttpShardHandlerFactory.getParameter Setting sizeOfQueue to: -1
[junit4:junit4]   2> 565 T1815 oashc.HttpShardHandlerFactory.getParameter Setting fairnessPolicy to: false
[junit4:junit4]   2> 566 T1815 oascsi.HttpClientUtil.createClient Creating new http client, config:maxConnectionsPerHost=20&maxConnections=10000&socketTimeout=30000&connTimeout=15000&retry=false
[junit4:junit4]   2> 589 T1815 oasc.CoreContainer.load Registering Log Listener
[junit4:junit4]   2> 609 T1815 oasc.CoreContainer.initZooKeeper Zookeeper client=127.0.0.1:54946/solr
[junit4:junit4]   2> 611 T1815 oasc.ZkController.checkChrootPath zkHost includes chroot
[junit4:junit4]   2> 612 T1815 oaz.ZooKeeper.<init> Initiating client connection, connectString=127.0.0.1:54946 sessionTimeout=60000 watcher=org.apache.solr.common.cloud.ConnectionManager@49cba2c1
[junit4:junit4]   2> 614 T1834 oaz.ClientCnxn$SendThread.logStartConnect Opening socket connection to server localhost/127.0.0.1:54946. Will not attempt to authenticate using SASL (access denied ("javax.security.auth.AuthPermission" "getLoginConfiguration"))
[junit4:junit4]   2> 613 T1815 oascc.ConnectionManager.waitForConnected Waiting for client to connect to ZooKeeper
[junit4:junit4]   2> 614 T1834 oaz.ClientCnxn$SendThread.primeConnection Socket connection established to localhost/127.0.0.1:54946, initiating session
[junit4:junit4]   2> 615 T1817 oazs.NIOServerCnxnFactory.run Accepted socket connection from /140.211.11.196:54950
[junit4:junit4]   2> 615 T1817 oazs.ZooKeeperServer.processConnectRequest Client attempting to establish new session at /140.211.11.196:54950
[junit4:junit4]   2> 617 T1819 oazs.ZooKeeperServer.finishSessionInit Established session 0x13bbe09d6250002 with negotiated timeout 20000 for client /140.211.11.196:54950
[junit4:junit4]   2> 617 T1834 oaz.ClientCnxn$SendThread.onConnected Session establishment complete on server localhost/127.0.0.1:54946, sessionid = 0x13bbe09d6250002, negotiated timeout = 20000
[junit4:junit4]   2> 617 T1835 oascc.ConnectionManager.process Watcher org.apache.solr.common.cloud.ConnectionManager@49cba2c1 name:ZooKeeperConnection Watcher:127.0.0.1:54946 got event WatchedEvent state:SyncConnected type:None path:null path:null type:None
[junit4:junit4]   2> 618 T1815 oascc.ConnectionManager.waitForConnected Client is connected to ZooKeeper
[junit4:junit4]   2> 620 T1820 oazs.PrepRequestProcessor.pRequest2Txn Processed session termination for sessionid: 0x13bbe09d6250002
[junit4:junit4]   2> 622 T1835 oaz.ClientCnxn$EventThread.run EventThread shut down
[junit4:junit4]   2> 622 T1817 oazs.NIOServerCnxn.closeSock Closed socket connection for client /140.211.11.196:54950 which had sessionid 0x13bbe09d6250002
[junit4:junit4]   2> 622 T1815 oaz.ZooKeeper.close Session: 0x13bbe09d6250002 closed
[junit4:junit4]   2> 623 T1815 oascsi.HttpClientUtil.createClient Creating new http client, config:maxConnections=500&maxConnectionsPerHost=16&socketTimeout=15000&connTimeout=30000
[junit4:junit4]   2> 635 T1815 oaz.ZooKeeper.<init> Initiating client connection, connectString=127.0.0.1:54946/solr sessionTimeout=30000 watcher=org.apache.solr.common.cloud.ConnectionManager@9f9e90e
[junit4:junit4]   2> 636 T1836 oaz.ClientCnxn$SendThread.logStartConnect Opening socket connection to server localhost/127.0.0.1:54946. Will not attempt to authenticate using SASL (access denied ("javax.security.auth.AuthPermission" "getLoginConfiguration"))
[junit4:junit4]   2> 636 T1815 oascc.ConnectionManager.waitForConnected Waiting for client to connect to ZooKeeper
[junit4:junit4]   2> 637 T1836 oaz.ClientCnxn$SendThread.primeConnection Socket connection established to localhost/127.0.0.1:54946, initiating session
[junit4:junit4]   2> 637 T1817 oazs.NIOServerCnxnFactory.run Accepted socket connection from /140.211.11.196:54951
[junit4:junit4]   2> 637 T1817 oazs.ZooKeeperServer.processConnectRequest Client attempting to establish new session at /140.211.11.196:54951
[junit4:junit4]   2> 639 T1819 oazs.ZooKeeperServer.finishSessionInit Established session 0x13bbe09d6250003 with negotiated timeout 20000 for client /140.211.11.196:54951
[junit4:junit4]   2> 639 T1836 oaz.ClientCnxn$SendThread.onConnected Session establishment complete on server localhost/127.0.0.1:54946, sessionid = 0x13bbe09d6250003, negotiated timeout = 20000
[junit4:junit4]   2> 639 T1837 oascc.ConnectionManager.process Watcher org.apache.solr.common.cloud.ConnectionManager@9f9e90e name:ZooKeeperConnection Watcher:127.0.0.1:54946/solr got event WatchedEvent state:SyncConnected type:None path:null path:null type:None
[junit4:junit4]   2> 640 T1815 oascc.ConnectionManager.waitForConnected Client is connected to ZooKeeper
[junit4:junit4]   2> 642 T1820 oazs.PrepRequestProcessor.pRequest Got user-level KeeperException when processing sessionid:0x13bbe09d6250003 type:create cxid:0x2 zxid:0x1a txntype:-1 reqpath:n/a Error Path:/solr/overseer Error:KeeperErrorCode = NodeExists for /solr/overseer
[junit4:junit4]   2> 649 T1815 oascc.SolrZkClient.makePath makePath: /live_nodes
[junit4:junit4]   2> 652 T1815 oasc.ZkController.createEphemeralLiveNode Register node as live in ZooKeeper:/live_nodes/127.0.0.1:54949_jjj
[junit4:junit4]   2> 653 T1820 oazs.PrepRequestProcessor.pRequest Got user-level KeeperException when processing sessionid:0x13bbe09d6250003 type:delete cxid:0x7 zxid:0x1c txntype:-1 reqpath:n/a Error Path:/solr/live_nodes/127.0.0.1:54949_jjj Error:KeeperErrorCode = NoNode for /solr/live_nodes/127.0.0.1:54949_jjj
[junit4:junit4]   2> 655 T1815 oascc.SolrZkClient.makePath makePath: /live_nodes/127.0.0.1:54949_jjj
[junit4:junit4]   2> 664 T1815 oascc.SolrZkClient.makePath makePath: /overseer_elect/election
[junit4:junit4]   2> 678 T1820 oazs.PrepRequestProcessor.pRequest Got user-level KeeperException when processing sessionid:0x13bbe09d6250003 type:delete cxid:0x15 zxid:0x21 txntype:-1 reqpath:n/a Error Path:/solr/overseer_elect/leader Error:KeeperErrorCode = NoNode for /solr/overseer_elect/leader
[junit4:junit4]   2> 679 T1815 oascc.SolrZkClient.makePath makePath: /overseer_elect/leader
[junit4:junit4]   2> 682 T1815 oasc.Overseer.start Overseer (id=88873567120588803-127.0.0.1:54949_jjj-n_0000000000) starting
[junit4:junit4]   2> 683 T1820 oazs.PrepRequestProcessor.pRequest Got user-level KeeperException when processing sessionid:0x13bbe09d6250003 type:create cxid:0x1a zxid:0x23 txntype:-1 reqpath:n/a Error Path:/solr/overseer Error:KeeperErrorCode = NodeExists for /solr/overseer
[junit4:junit4]   2> 690 T1820 oazs.PrepRequestProcessor.pRequest Got user-level KeeperException when processing sessionid:0x13bbe09d6250003 type:create cxid:0x1b zxid:0x24 txntype:-1 reqpath:n/a Error Path:/solr/overseer Error:KeeperErrorCode = NodeExists for /solr/overseer
[junit4:junit4]   2> 691 T1820 oazs.PrepRequestProcessor.pRequest Got user-level KeeperException when processing sessionid:0x13bbe09d6250003 type:create cxid:0x1c zxid:0x25 txntype:-1 reqpath:n/a Error Path:/solr/overseer Error:KeeperErrorCode = NodeExists for /solr/overseer
[junit4:junit4]   2> 693 T1820 oazs.PrepRequestProcessor.pRequest Got user-level KeeperException when processing sessionid:0x13bbe09d6250003 type:create cxid:0x1d zxid:0x26 txntype:-1 reqpath:n/a Error Path:/solr/overseer Error:KeeperErrorCode = NodeExists for /solr/overseer
[junit4:junit4]   2> 694 T1839 oasc.OverseerCollectionProcessor.run Process current queue of collection messages
[junit4:junit4]   2> 695 T1815 oascc.SolrZkClient.makePath makePath: /clusterstate.json
[junit4:junit4]   2> 698 T1815 oascc.ZkStateReader.createClusterStateWatchersAndUpdate Updating cluster state from ZooKeeper... 
[junit4:junit4]   2> 700 T1838 oasc.Overseer$ClusterStateUpdater.run Starting to work on the main queue
[junit4:junit4]   2> 706 T1840 oasc.CoreContainer.create Creating SolrCore 'collection1' using instanceDir: /usr/home/hudson/hudson-slave/workspace/Lucene-Solr-Tests-4.x-java7/solr/build/solr-core/test/J0/./org.apache.solr.cloud.SyncSliceTest-controljetty-1356103014220/collection1
[junit4:junit4]   2> 707 T1840 oasc.ZkController.createCollectionZkNode Check for collection zkNode:control_collection
[junit4:junit4]   2> 707 T1840 oasc.ZkController.createCollectionZkNode Collection zkNode exists
[junit4:junit4]   2> 708 T1840 oasc.ZkController.readConfigName Load collection config from:/collections/control_collection
[junit4:junit4]   2> 709 T1840 oasc.SolrResourceLoader.<init> new SolrResourceLoader for directory: '/usr/home/hudson/hudson-slave/workspace/Lucene-Solr-Tests-4.x-java7/solr/build/solr-core/test/J0/./org.apache.solr.cloud.SyncSliceTest-controljetty-1356103014220/collection1/'
[junit4:junit4]   2> 711 T1840 oasc.SolrResourceLoader.replaceClassLoader Adding 'file:/usr/home/hudson/hudson-slave/workspace/Lucene-Solr-Tests-4.x-java7/solr/build/solr-core/test/J0/org.apache.solr.cloud.SyncSliceTest-controljetty-1356103014220/collection1/lib/README' to classloader
[junit4:junit4]   2> 711 T1840 oasc.SolrResourceLoader.replaceClassLoader Adding 'file:/usr/home/hudson/hudson-slave/workspace/Lucene-Solr-Tests-4.x-java7/solr/build/solr-core/test/J0/org.apache.solr.cloud.SyncSliceTest-controljetty-1356103014220/collection1/lib/classes/' to classloader
[junit4:junit4]   2> 767 T1840 oasc.SolrConfig.<init> Using Lucene MatchVersion: LUCENE_41
[junit4:junit4]   2> 839 T1840 oasc.SolrConfig.<init> Loaded SolrConfig: solrconfig.xml
[junit4:junit4]   2> 940 T1840 oass.IndexSchema.readSchema Reading Solr Schema
[junit4:junit4]   2> 947 T1840 oass.IndexSchema.readSchema Schema name=test
[junit4:junit4]   2> 1076 T3 oasc.CoreContainer.finalize SEVERE CoreContainer was not shutdown prior to finalize(), indicates a bug -- POSSIBLE RESOURCE LEAK!!!  instance=822129873
[junit4:junit4]   2> 1602 T1840 oass.OpenExchangeRatesOrgProvider.init Initialized with rates=open-exchange-rates.json, refreshInterval=1440.
[junit4:junit4]   2> 1614 T1840 oass.IndexSchema.readSchema default search field in schema is text
[junit4:junit4]   2> 1618 T1840 oass.IndexSchema.readSchema unique key field: id
[junit4:junit4]   2> 1631 T1840 oass.FileExchangeRateProvider.reload Reloading exchange rates from file currency.xml
[junit4:junit4]   2> 1636 T1840 oass.FileExchangeRateProvider.reload Reloading exchange rates from file currency.xml
[junit4:junit4]   2> 1641 T1840 oass.OpenExchangeRatesOrgProvider.reload Reloading exchange rates from open-exchange-rates.json
[junit4:junit4]   2> 1643 T1840 oass.OpenExchangeRatesOrgProvider.reload Reloading exchange rates from open-exchange-rates.json
[junit4:junit4]   2> 1644 T1840 oasc.SolrCore.<init> [collection1] Opening new SolrCore at /usr/home/hudson/hudson-slave/workspace/Lucene-Solr-Tests-4.x-java7/solr/build/solr-core/test/J0/./org.apache.solr.cloud.SyncSliceTest-controljetty-1356103014220/collection1/, dataDir=./org.apache.solr.cloud.SyncSliceTest-1356103013916/control/data/
[junit4:junit4]   2> 1644 T1840 oasc.JmxMonitoredMap.<init> JMX monitoring is enabled. Adding Solr mbeans to JMX Server: com.sun.jmx.mbeanserver.JmxMBeanServer@26058825
[junit4:junit4]   2> 1645 T1840 oasc.SolrCore.initDirectoryFactory solr.NRTCachingDirectoryFactory
[junit4:junit4]   2> 1646 T1840 oasc.CachingDirectoryFactory.get return new directory for /usr/home/hudson/hudson-slave/workspace/Lucene-Solr-Tests-4.x-java7/solr/build/solr-core/test/J0/./org.apache.solr.cloud.SyncSliceTest-1356103013916/control/data forceNew:false
[junit4:junit4]   2> 1647 T1840 oasc.CachingDirectoryFactory.close Releasing directory:/usr/home/hudson/hudson-slave/workspace/Lucene-Solr-Tests-4.x-java7/solr/build/solr-core/test/J0/./org.apache.solr.cloud.SyncSliceTest-1356103013916/control/data
[junit4:junit4]   2> 1648 T1840 oasc.SolrCore.getNewIndexDir New index directory detected: old=null new=./org.apache.solr.cloud.SyncSliceTest-1356103013916/control/data/index/
[junit4:junit4]   2> 1649 T1840 oasc.SolrCore.initIndex WARNING [collection1] Solr index directory './org.apache.solr.cloud.SyncSliceTest-1356103013916/control/data/index' doesn't exist. Creating new index...
[junit4:junit4]   2> 1650 T1840 oasc.CachingDirectoryFactory.get return new directory for /usr/home/hudson/hudson-slave/workspace/Lucene-Solr-Tests-4.x-java7/solr/build/solr-core/test/J0/./org.apache.solr.cloud.SyncSliceTest-1356103013916/control/data/index forceNew:false
[junit4:junit4]   2> 1657 T1840 oasc.SolrDeletionPolicy.onCommit SolrDeletionPolicy.onCommit: commits:num=1
[junit4:junit4]   2> 		commit{dir=RateLimitedDirectoryWrapper(NRTCachingDirectory(org.apache.lucene.store.NIOFSDirectory@/usr/home/hudson/hudson-slave/workspace/Lucene-Solr-Tests-4.x-java7/solr/build/solr-core/test/J0/org.apache.solr.cloud.SyncSliceTest-1356103013916/control/data/index lockFactory=org.apache.lucene.store.NativeFSLockFactory@425575d1; maxCacheMB=48.0 maxMergeSizeMB=4.0)),segFN=segments_1,generation=1,filenames=[segments_1]
[junit4:junit4]   2> 1657 T1840 oasc.SolrDeletionPolicy.updateCommits newest commit = 1[segments_1]
[junit4:junit4]   2> 1658 T1840 oasc.CachingDirectoryFactory.close Releasing directory:/usr/home/hudson/hudson-slave/workspace/Lucene-Solr-Tests-4.x-java7/solr/build/solr-core/test/J0/./org.apache.solr.cloud.SyncSliceTest-1356103013916/control/data/index
[junit4:junit4]   2> 1659 T1840 oasc.SolrCore.initWriters created xml: solr.XMLResponseWriter
[junit4:junit4]   2> 1661 T1840 oasup.UpdateRequestProcessorChain.init inserting DistributedUpdateProcessorFactory into updateRequestProcessorChain "dedupe"
[junit4:junit4]   2> 1661 T1840 oasup.UpdateRequestProcessorChain.init inserting DistributedUpdateProcessorFactory into updateRequestProcessorChain "dedupe-allfields"
[junit4:junit4]   2> 1662 T1840 oasup.UpdateRequestProcessorChain.init inserting DistributedUpdateProcessorFactory into updateRequestProcessorChain "stored_sig"
[junit4:junit4]   2> 1662 T1840 oasup.UpdateRequestProcessorChain.init inserting DistributedUpdateProcessorFactory into updateRequestProcessorChain "uniq-fields"
[junit4:junit4]   2> 1663 T1840 oasup.UpdateRequestProcessorChain.init inserting DistributedUpdateProcessorFactory into updateRequestProcessorChain "distrib-dup-test-chain-implicit"
[junit4:junit4]   2> 1664 T1840 oasc.RequestHandlers.initHandlersFromConfig adding lazy requestHandler: solr.ReplicationHandler
[junit4:junit4]   2> 1664 T1840 oasc.RequestHandlers.initHandlersFromConfig created /replication: solr.ReplicationHandler
[junit4:junit4]   2> 1665 T1840 oasc.RequestHandlers.initHandlersFromConfig created standard: solr.StandardRequestHandler
[junit4:junit4]   2> 1666 T1840 oasc.RequestHandlers.initHandlersFromConfig created /get: solr.RealTimeGetHandler
[junit4:junit4]   2> 1667 T1840 oasc.RequestHandlers.initHandlersFromConfig created dismax: solr.SearchHandler
[junit4:junit4]   2> 1668 T1840 oasc.RequestHandlers.initHandlersFromConfig created mock: org.apache.solr.core.MockQuerySenderListenerReqHandler
[junit4:junit4]   2> 1668 T1840 oasc.RequestHandlers.initHandlersFromConfig created /admin/: org.apache.solr.handler.admin.AdminHandlers
[junit4:junit4]   2> 1669 T1840 oasc.RequestHandlers.initHandlersFromConfig created defaults: solr.StandardRequestHandler
[junit4:junit4]   2> 1670 T1840 oasc.RequestHandlers.initHandlersFromConfig adding lazy requestHandler: solr.StandardRequestHandler
[junit4:junit4]   2> 1670 T1840 oasc.RequestHandlers.initHandlersFromConfig created lazy: solr.StandardRequestHandler
[junit4:junit4]   2> 1671 T1840 oasc.RequestHandlers.initHandlersFromConfig created /update: solr.UpdateRequestHandler
[junit4:junit4]   2> 1672 T1840 oasc.RequestHandlers.initHandlersFromConfig created /terms: org.apache.solr.handler.component.SearchHandler
[junit4:junit4]   2> 1673 T1840 oasc.RequestHandlers.initHandlersFromConfig created spellCheckCompRH: org.apache.solr.handler.component.SearchHandler
[junit4:junit4]   2> 1674 T1840 oasc.RequestHandlers.initHandlersFromConfig created spellCheckCompRH_Direct: org.apache.solr.handler.component.SearchHandler
[junit4:junit4]   2> 1675 T1840 oasc.RequestHandlers.initHandlersFromConfig created spellCheckWithWordbreak: org.apache.solr.handler.component.SearchHandler
[junit4:junit4]   2> 1676 T1840 oasc.RequestHandlers.initHandlersFromConfig created spellCheckWithWordbreak_Direct: org.apache.solr.handler.component.SearchHandler
[junit4:junit4]   2> 1677 T1840 oasc.RequestHandlers.initHandlersFromConfig created spellCheckCompRH1: org.apache.solr.handler.component.SearchHandler
[junit4:junit4]   2> 1678 T1840 oasc.RequestHandlers.initHandlersFromConfig created mltrh: org.apache.solr.handler.component.SearchHandler
[junit4:junit4]   2> 1678 T1840 oasc.RequestHandlers.initHandlersFromConfig created tvrh: org.apache.solr.handler.component.SearchHandler
[junit4:junit4]   2> 1679 T1840 oasc.RequestHandlers.initHandlersFromConfig created /mlt: solr.MoreLikeThisHandler
[junit4:junit4]   2> 1680 T1840 oasc.RequestHandlers.initHandlersFromConfig created /debug/dump: solr.DumpRequestHandler
[junit4:junit4]   2> 1695 T1840 oashl.XMLLoader.init xsltCacheLifetimeSeconds=60
[junit4:junit4]   2> 1700 T1840 oasc.SolrCore.initDeprecatedSupport WARNING solrconfig.xml uses deprecated <admin/gettableFiles>, Please update your config to use the ShowFileRequestHandler.
[junit4:junit4]   2> 1701 T1840 oasc.SolrCore.initDeprecatedSupport WARNING adding ShowFileRequestHandler with hidden files: [SCHEMA.XML, OLD_SYNONYMS.TXT, STOPWORDS.TXT, PROTWORDS.TXT, OPEN-EXCHANGE-RATES.JSON, SYNONYMS.TXT, CURRENCY.XML, MAPPING-ISOLATIN1ACCENT.TXT]
[junit4:junit4]   2> 1704 T1840 oasc.CachingDirectoryFactory.close Releasing directory:/usr/home/hudson/hudson-slave/workspace/Lucene-Solr-Tests-4.x-java7/solr/build/solr-core/test/J0/./org.apache.solr.cloud.SyncSliceTest-1356103013916/control/data
[junit4:junit4]   2> 1706 T1840 oass.SolrIndexSearcher.<init> Opening Searcher@75054213 main
[junit4:junit4]   2> 1707 T1840 oasu.CommitTracker.<init> Hard AutoCommit: disabled
[junit4:junit4]   2> 1708 T1840 oasu.CommitTracker.<init> Soft AutoCommit: disabled
[junit4:junit4]   2> 1709 T1840 oashc.SpellCheckComponent.inform Initializing spell checkers
[junit4:junit4]   2> 1716 T1840 oass.DirectSolrSpellChecker.init init: {name=direct,classname=DirectSolrSpellChecker,field=lowerfilt,minQueryLength=3}
[junit4:junit4]   2> 1773 T1841 oasc.SolrCore.registerSearcher [collection1] Registered new searcher Searcher@75054213 main{StandardDirectoryReader(segments_1:1)}
[junit4:junit4]   2> 1777 T1840 oasc.ZkController.publish publishing core=collection1 state=down
[junit4:junit4]   2> 1777 T1840 oasc.ZkController.publish numShards not found on descriptor - reading it from system property
[junit4:junit4]   2> 1778 T1820 oazs.PrepRequestProcessor.pRequest Got user-level KeeperException when processing sessionid:0x13bbe09d6250003 type:create cxid:0x56 zxid:0x29 txntype:-1 reqpath:n/a Error Path:/solr/overseer/queue Error:KeeperErrorCode = NoNode for /solr/overseer/queue
[junit4:junit4]   2> 2208 T1838 oascc.ZkStateReader.updateClusterState Updating cloud state from ZooKeeper... 
[junit4:junit4]   2> 2209 T1838 oasc.Overseer$ClusterStateUpdater.updateState Update state numShards=1 message={
[junit4:junit4]   2> 	  "operation":"state",
[junit4:junit4]   2> 	  "numShards":"1",
[junit4:junit4]   2> 	  "shard":null,
[junit4:junit4]   2> 	  "roles":null,
[junit4:junit4]   2> 	  "state":"down",
[junit4:junit4]   2> 	  "core":"collection1",
[junit4:junit4]   2> 	  "collection":"control_collection",
[junit4:junit4]   2> 	  "node_name":"127.0.0.1:54949_jjj",
[junit4:junit4]   2> 	  "base_url":"http://127.0.0.1:54949/jjj"}
[junit4:junit4]   2> 2209 T1838 oasc.Overseer$ClusterStateUpdater.createCollection Create collection control_collection with numShards 1
[junit4:junit4]   2> 2209 T1838 oasc.Overseer$ClusterStateUpdater.updateState Assigning new node to shard shard=shard1
[junit4:junit4]   2> 2210 T1820 oazs.PrepRequestProcessor.pRequest Got user-level KeeperException when processing sessionid:0x13bbe09d6250003 type:create cxid:0x5e zxid:0x2c txntype:-1 reqpath:n/a Error Path:/solr/overseer/queue-work Error:KeeperErrorCode = NoNode for /solr/overseer/queue-work
[junit4:junit4]   2> 2226 T1837 oascc.ZkStateReader$2.process A cluster state change: WatchedEvent state:SyncConnected type:NodeDataChanged path:/clusterstate.json, has occurred - updating... (live nodes size: 1)
[junit4:junit4]   2> 2791 T1840 oasc.CoreContainer.registerCore registering core: collection1
[junit4:junit4]   2> 2791 T1840 oasc.ZkController.register Register replica - core:collection1 address:http://127.0.0.1:54949/jjj collection:control_collection shard:shard1
[junit4:junit4]   2> 2792 T1840 oascc.SolrZkClient.makePath makePath: /collections/control_collection/leader_elect/shard1/election
[junit4:junit4]   2> 2808 T1820 oazs.PrepRequestProcessor.pRequest Got user-level KeeperException when processing sessionid:0x13bbe09d6250003 type:delete cxid:0x7b zxid:0x36 txntype:-1 reqpath:n/a Error Path:/solr/collections/control_collection/leaders Error:KeeperErrorCode = NoNode for /solr/collections/control_collection/leaders
[junit4:junit4]   2> 2809 T1840 oasc.ShardLeaderElectionContext.runLeaderProcess Running the leader process.
[junit4:junit4]   2> 2810 T1820 oazs.PrepRequestProcessor.pRequest Got user-level KeeperException when processing sessionid:0x13bbe09d6250003 type:create cxid:0x7c zxid:0x37 txntype:-1 reqpath:n/a Error Path:/solr/overseer Error:KeeperErrorCode = NodeExists for /solr/overseer
[junit4:junit4]   2> 2819 T1840 oasc.ShardLeaderElectionContext.waitForReplicasToComeUp Enough replicas found to continue.
[junit4:junit4]   2> 2819 T1840 oasc.ShardLeaderElectionContext.runLeaderProcess I may be the new leader - try and sync
[junit4:junit4]   2> 2820 T1840 oasc.SyncStrategy.sync Sync replicas to http://127.0.0.1:54949/jjj/collection1/
[junit4:junit4]   2> 2820 T1840 oasc.SyncStrategy.syncReplicas Sync Success - now sync replicas to me
[junit4:junit4]   2> 2820 T1840 oasc.SyncStrategy.syncToMe http://127.0.0.1:54949/jjj/collection1/ has no replicas
[junit4:junit4]   2> 2821 T1840 oasc.ShardLeaderElectionContext.runLeaderProcess I am the new leader: http://127.0.0.1:54949/jjj/collection1/
[junit4:junit4]   2> 2821 T1840 oascc.SolrZkClient.makePath makePath: /collections/control_collection/leaders/shard1
[junit4:junit4]   2> 2826 T1820 oazs.PrepRequestProcessor.pRequest Got user-level KeeperException when processing sessionid:0x13bbe09d6250003 type:create cxid:0x86 zxid:0x3b txntype:-1 reqpath:n/a Error Path:/solr/overseer Error:KeeperErrorCode = NodeExists for /solr/overseer
[junit4:junit4]   2> 3239 T1838 oascc.ZkStateReader.updateClusterState Updating cloud state from ZooKeeper... 
[junit4:junit4]   2> 3255 T1837 oascc.ZkStateReader$2.process A cluster state change: WatchedEvent state:SyncConnected type:NodeDataChanged path:/clusterstate.json, has occurred - updating... (live nodes size: 1)
[junit4:junit4]   2> 3287 T1840 oasc.ZkController.register We are http://127.0.0.1:54949/jjj/collection1/ and leader is http://127.0.0.1:54949/jjj/collection1/
[junit4:junit4]   2> 3288 T1840 oasc.ZkController.register No LogReplay needed for core=collection1 baseURL=http://127.0.0.1:54949/jjj
[junit4:junit4]   2> 3288 T1840 oasc.ZkController.checkRecovery I am the leader, no recovery necessary
[junit4:junit4]   2> 3289 T1840 oasc.ZkController.publish publishing core=collection1 state=active
[junit4:junit4]   2> 3289 T1840 oasc.ZkController.publish numShards not found on descriptor - reading it from system property
[junit4:junit4]   2> 3346 T1840 oascc.ZkStateReader.updateClusterState Updating cloud state from ZooKeeper... 
[junit4:junit4]   2> 3347 T1815 oass.SolrDispatchFilter.init user.dir=/usr/home/hudson/hudson-slave/workspace/Lucene-Solr-Tests-4.x-java7/solr/build/solr-core/test/J0
[junit4:junit4]   2> 3349 T1815 oass.SolrDispatchFilter.init SolrDispatchFilter.init() done
[junit4:junit4]   2> 3349 T1815 oascsi.HttpClientUtil.createClient Creating new http client, config:maxConnections=128&maxConnectionsPerHost=32&followRedirects=false
[junit4:junit4]   2> 3363 T1815 oascsi.HttpClientUtil.createClient Creating new http client, config:
[junit4:junit4]   2> 3372 T1815 oaz.ZooKeeper.<init> Initiating client connection, connectString=127.0.0.1:54946/solr sessionTimeout=10000 watcher=org.apache.solr.common.cloud.ConnectionManager@b98438e
[junit4:junit4]   2> 3373 T1815 oascc.ConnectionManager.waitForConnected Waiting for client to connect to ZooKeeper
[junit4:junit4]   2> 3373 T1842 oaz.ClientCnxn$SendThread.logStartConnect Opening socket connection to server localhost/127.0.0.1:54946. Will not attempt to authenticate using SASL (access denied ("javax.security.auth.AuthPermission" "getLoginConfiguration"))
[junit4:junit4]   2> 3374 T1842 oaz.ClientCnxn$SendThread.primeConnection Socket connection established to localhost/127.0.0.1:54946, initiating session
[junit4:junit4]   2> 3374 T1817 oazs.NIOServerCnxnFactory.run Accepted socket connection from /140.211.11.196:54956
[junit4:junit4]   2> 3375 T1817 oazs.ZooKeeperServer.processConnectRequest Client attempting to establish new session at /140.211.11.196:54956
[junit4:junit4]   2> 3377 T1819 oazs.ZooKeeperServer.finishSessionInit Established session 0x13bbe09d6250004 with negotiated timeout 10000 for client /140.211.11.196:54956
[junit4:junit4]   2> 3377 T1842 oaz.ClientCnxn$SendThread.onConnected Session establishment complete on server localhost/127.0.0.1:54946, sessionid = 0x13bbe09d6250004, negotiated timeout = 10000
[junit4:junit4]   2> 3378 T1843 oascc.ConnectionManager.process Watcher org.apache.solr.common.cloud.ConnectionManager@b98438e name:ZooKeeperConnection Watcher:127.0.0.1:54946/solr got event WatchedEvent state:SyncConnected type:None path:null path:null type:None
[junit4:junit4]   2> 3378 T1815 oascc.ConnectionManager.waitForConnected Client is connected to ZooKeeper
[junit4:junit4]   2> 3380 T1815 oascc.ZkStateReader.createClusterStateWatchersAndUpdate Updating cluster state from ZooKeeper... 
[junit4:junit4]   2> 3382 T1815 oasc.ChaosMonkey.monkeyLog monkey: init - expire sessions:true cause connection loss:true
[junit4:junit4]   2> 3542 T1815 oejs.Server.doStart jetty-8.1.8.v20121106
[junit4:junit4]   2> 3546 T1815 oejs.AbstractConnector.doStart Started SocketConnector@127.0.0.1:54957
[junit4:junit4]   2> 3547 T1815 oasc.SolrResourceLoader.locateSolrHome JNDI not configured for solr (NoInitialContextEx)
[junit4:junit4]   2> 3548 T1815 oasc.SolrResourceLoader.locateSolrHome using system property solr.solr.home: /usr/home/hudson/hudson-slave/workspace/Lucene-Solr-Tests-4.x-java7/solr/build/solr-core/test/J0/./org.apache.solr.cloud.SyncSliceTest-jetty1-1356103017294
[junit4:junit4]   2> 3549 T1815 oasc.SolrResourceLoader.<init> new SolrResourceLoader for deduced Solr Home: '/usr/home/hudson/hudson-slave/workspace/Lucene-Solr-Tests-4.x-java7/solr/build/solr-core/test/J0/./org.apache.solr.cloud.SyncSliceTest-jetty1-1356103017294/'
[junit4:junit4]   2> 3592 T1815 oass.SolrDispatchFilter.init SolrDispatchFilter.init()
[junit4:junit4]   2> 3594 T1815 oasc.SolrResourceLoader.locateSolrHome JNDI not configured for solr (NoInitialContextEx)
[junit4:junit4]   2> 3594 T1815 oasc.SolrResourceLoader.locateSolrHome using system property solr.solr.home: /usr/home/hudson/hudson-slave/workspace/Lucene-Solr-Tests-4.x-java7/solr/build/solr-core/test/J0/./org.apache.solr.cloud.SyncSliceTest-jetty1-1356103017294
[junit4:junit4]   2> 3595 T1815 oasc.CoreContainer$Initializer.initialize looking for solr.xml: /usr/home/hudson/hudson-slave/workspace/Lucene-Solr-Tests-4.x-java7/solr/build/solr-core/test/J0/./org.apache.solr.cloud.SyncSliceTest-jetty1-1356103017294/solr.xml
[junit4:junit4]   2> 3596 T1815 oasc.CoreContainer.<init> New CoreContainer 896788609
[junit4:junit4]   2> 3597 T1815 oasc.CoreContainer.load Loading CoreContainer using Solr Home: '/usr/home/hudson/hudson-slave/workspace/Lucene-Solr-Tests-4.x-java7/solr/build/solr-core/test/J0/./org.apache.solr.cloud.SyncSliceTest-jetty1-1356103017294/'
[junit4:junit4]   2> 3598 T1815 oasc.SolrResourceLoader.<init> new SolrResourceLoader for directory: '/usr/home/hudson/hudson-slave/workspace/Lucene-Solr-Tests-4.x-java7/solr/build/solr-core/test/J0/./org.apache.solr.cloud.SyncSliceTest-jetty1-1356103017294/'
[junit4:junit4]   2> 3630 T1815 oashc.HttpShardHandlerFactory.getParameter Setting socketTimeout to: 30000
[junit4:junit4]   2> 3631 T1815 oashc.HttpShardHandlerFactory.getParameter Setting urlScheme to: http://
[junit4:junit4]   2> 3632 T1815 oashc.HttpShardHandlerFactory.getParameter Setting connTimeout to: 15000
[junit4:junit4]   2> 3633 T1815 oashc.HttpShardHandlerFactory.getParameter Setting maxConnectionsPerHost to: 20
[junit4:junit4]   2> 3634 T1815 oashc.HttpShardHandlerFactory.getParameter Setting corePoolSize to: 0
[junit4:junit4]   2> 3634 T1815 oashc.HttpShardHandlerFactory.getParameter Setting maximumPoolSize to: 2147483647
[junit4:junit4]   2> 3635 T1815 oashc.HttpShardHandlerFactory.getParameter Setting maxThreadIdleTime to: 5
[junit4:junit4]   2> 3636 T1815 oashc.HttpShardHandlerFactory.getParameter Setting sizeOfQueue to: -1
[junit4:junit4]   2> 3637 T1815 oashc.HttpShardHandlerFactory.getParameter Setting fairnessPolicy to: false
[junit4:junit4]   2> 3638 T1815 oascsi.HttpClientUtil.createClient Creating new http client, config:maxConnectionsPerHost=20&maxConnections=10000&socketTimeout=30000&connTimeout=15000&retry=false
[junit4:junit4]   2> 3658 T1815 oasc.CoreContainer.load Registering Log Listener
[junit4:junit4]   2> 3679 T1815 oasc.CoreContainer.initZooKeeper Zookeeper client=127.0.0.1:54946/solr
[junit4:junit4]   2> 3681 T1815 oasc.ZkController.checkChrootPath zkHost includes chroot
[junit4:junit4]   2> 3682 T1815 oaz.ZooKeeper.<init> Initiating client connection, connectString=127.0.0.1:54946 sessionTimeout=60000 watcher=org.apache.solr.common.cloud.ConnectionManager@5a2088ee
[junit4:junit4]   2> 3683 T1853 oaz.ClientCnxn$SendThread.logStartConnect Opening socket connection to server localhost/127.0.0.1:54946. Will not attempt to authenticate using SASL (access denied ("javax.security.auth.AuthPermission" "getLoginConfiguration"))
[junit4:junit4]   2> 3683 T1815 oascc.ConnectionManager.waitForConnected Waiting for client to connect to ZooKeeper
[junit4:junit4]   2> 3684 T1853 oaz.ClientCnxn$SendThread.primeConnection Socket connection established to localhost/127.0.0.1:54946, initiating session
[junit4:junit4]   2> 3684 T1817 oazs.NIOServerCnxnFactory.run Accepted socket connection from /140.211.11.196:54958
[junit4:junit4]   2> 3685 T1817 oazs.ZooKeeperServer.processConnectRequest Client attempting to establish new session at /140.211.11.196:54958
[junit4:junit4]   2> 3686 T1819 oazs.ZooKeeperServer.finishSessionInit Established session 0x13bbe09d6250005 with negotiated timeout 20000 for client /140.211.11.196:54958
[junit4:junit4]   2> 3686 T1853 oaz.ClientCnxn$SendThread.onConnected Session establishment complete on server localhost/127.0.0.1:54946, sessionid = 0x13bbe09d6250005, negotiated timeout = 20000
[junit4:junit4]   2> 3687 T1854 oascc.ConnectionManager.process Watcher org.apache.solr.common.cloud.ConnectionManager@5a2088ee name:ZooKeeperConnection Watcher:127.0.0.1:54946 got event WatchedEvent state:SyncConnected type:None path:null path:null type:None
[junit4:junit4]   2> 3687 T1815 oascc.ConnectionManager.waitForConnected Client is connected to ZooKeeper
[junit4:junit4]   2> 3689 T1820 oazs.PrepRequestProcessor.pRequest2Txn Processed session termination for sessionid: 0x13bbe09d6250005
[junit4:junit4]   2> 3690 T1854 oaz.ClientCnxn$EventThread.run EventThread shut down
[junit4:junit4]   2> 3690 T1817 oazs.NIOServerCnxn.closeSock Closed socket connection for client /140.211.11.196:54958 which had sessionid 0x13bbe09d6250005
[junit4:junit4]   2> 3690 T1815 oaz.ZooKeeper.close Session: 0x13bbe09d6250005 closed
[junit4:junit4]   2> 3692 T1815 oascsi.HttpClientUtil.createClient Creating new http client, config:maxConnections=500&maxConnectionsPerHost=16&socketTimeout=15000&connTimeout=30000
[junit4:junit4]   2> 3702 T1815 oaz.ZooKeeper.<init> Initiating client connection, connectString=127.0.0.1:54946/solr sessionTimeout=30000 watcher=org.apache.solr.common.cloud.ConnectionManager@28c61840
[junit4:junit4]   2> 3704 T1855 oaz.ClientCnxn$SendThread.logStartConnect Opening socket connection to server localhost/127.0.0.1:54946. Will not attempt to authenticate using SASL (access denied ("javax.security.auth.AuthPermission" "getLoginConfiguration"))
[junit4:junit4]   2> 3703 T1815 oascc.ConnectionManager.waitForConnected Waiting for client to connect to ZooKeeper
[junit4:junit4]   2> 3704 T1855 oaz.ClientCnxn$SendThread.primeConnection Socket connection established to localhost/127.0.0.1:54946, initiating session
[junit4:junit4]   2> 3704 T1817 oazs.NIOServerCnxnFactory.run Accepted socket connection from /140.211.11.196:54959
[junit4:junit4]   2> 3705 T1817 oazs.ZooKeeperServer.processConnectRequest Client attempting to establish new session at /140.211.11.196:54959
[junit4:junit4]   2> 3706 T1819 oazs.ZooKeeperServer.finishSessionInit Established session 0x13bbe09d6250006 with negotiated timeout 20000 for client /140.211.11.196:54959
[junit4:junit4]   2> 3706 T1855 oaz.ClientCnxn$SendThread.onConnected Session establishment complete on server localhost/127.0.0.1:54946, sessionid = 0x13bbe09d6250006, negotiated timeout = 20000
[junit4:junit4]   2> 3707 T1856 oascc.ConnectionManager.process Watcher org.apache.solr.common.cloud.ConnectionManager@28c61840 name:ZooKeeperConnection Watcher:127.0.0.1:54946/solr got event WatchedEvent state:SyncConnected type:None path:null path:null type:None
[junit4:junit4]   2> 3707 T1815 oascc.ConnectionManager.waitForConnected Client is connected to ZooKeeper
[junit4:junit4]   2> 3709 T1820 oazs.PrepRequestProcessor.pRequest Got user-level KeeperException when processing sessionid:0x13bbe09d6250006 type:create cxid:0x1 zxid:0x49 txntype:-1 reqpath:n/a Error Path:/solr/overseer Error:KeeperErrorCode = NodeExists for /solr/overseer
[junit4:junit4]   2> 3710 T1820 oazs.PrepRequestProcessor.pRequest Got user-level KeeperException when processing sessionid:0x13bbe09d6250006 type:create cxid:0x2 zxid:0x4a txntype:-1 reqpath:n/a Error Path:/solr/overseer Error:KeeperErrorCode = NodeExists for /solr/overseer
[junit4:junit4]   2> 3712 T1815 oasc.ZkController.createEphemeralLiveNode Register node as live in ZooKeeper:/live_nodes/127.0.0.1:54957_jjj
[junit4:junit4]   2> 3713 T1820 oazs.PrepRequestProcessor.pRequest Got user-level KeeperException when processing sessionid:0x13bbe09d6250006 type:delete cxid:0x4 zxid:0x4b txntype:-1 reqpath:n/a Error Path:/solr/live_nodes/127.0.0.1:54957_jjj Error:KeeperErrorCode = NoNode for /solr/live_nodes/127.0.0.1:54957_jjj
[junit4:junit4]   2> 3714 T1815 oascc.SolrZkClient.makePath makePath: /live_nodes/127.0.0.1:54957_jjj
[junit4:junit4]   2> 3717 T1837 oascc.ZkStateReader$2.process A cluster state change: WatchedEvent state:SyncConnected type:NodeChildrenChanged path:/live_nodes, has occurred - updating... (live nodes size: 1)
[junit4:junit4]   2> 3718 T1843 oascc.ZkStateReader$3.process Updating live nodes... (2)
[junit4:junit4]   2> 3719 T1837 oascc.ZkStateReader$3.process Updating live nodes... (2)
[junit4:junit4]   2> 3721 T1815 oascc.ZkStateReader.createClusterStateWatchersAndUpdate Updating cluster state from ZooKeeper... 
[junit4:junit4]   2> 3730 T1857 oasc.CoreContainer.create Creating SolrCore 'collection1' using instanceDir: /usr/home/hudson/hudson-slave/workspace/Lucene-Solr-Tests-4.x-java7/solr/build/solr-core/test/J0/./org.apache.solr.cloud.SyncSliceTest-jetty1-1356103017294/collection1
[junit4:junit4]   2> 3731 T1857 oasc.ZkController.createCollectionZkNode Check for collection zkNode:collection1
[junit4:junit4]   2> 3732 T1857 oasc.ZkController.createCollectionZkNode Collection zkNode exists
[junit4:junit4]   2> 3732 T1857 oasc.ZkController.readConfigName Load collection config from:/collections/collection1
[junit4:junit4]   2> 3733 T1857 oasc.SolrResourceLoader.<init> new SolrResourceLoader for directory: '/usr/home/hudson/hudson-slave/workspace/Lucene-Solr-Tests-4.x-java7/solr/build/solr-core/test/J0/./org.apache.solr.cloud.SyncSliceTest-jetty1-1356103017294/collection1/'
[junit4:junit4]   2> 3735 T1857 oasc.SolrResourceLoader.replaceClassLoader Adding 'file:/usr/home/hudson/hudson-slave/workspace/Lucene-Solr-Tests-4.x-java7/solr/build/solr-core/test/J0/org.apache.solr.cloud.SyncSliceTest-jetty1-1356103017294/collection1/lib/classes/' to classloader
[junit4:junit4]   2> 3736 T1857 oasc.SolrResourceLoader.replaceClassLoader Adding 'file:/usr/home/hudson/hudson-slave/workspace/Lucene-Solr-Tests-4.x-java7/solr/build/solr-core/test/J0/org.apache.solr.cloud.SyncSliceTest-jetty1-1356103017294/collection1/lib/README' to classloader
[junit4:junit4]   2> 3768 T1838 oascc.ZkStateReader.updateClusterState Updating cloud state from ZooKeeper... 
[junit4:junit4]   2> 3769 T1838 oasc.Overseer$ClusterStateUpdater.updateState Update state numShards=1 message={
[junit4:junit4]   2> 	  "operation":"state",
[junit4:junit4]   2> 	  "numShards":"1",
[junit4:junit4]   2> 	  "shard":"shard1",
[junit4:junit4]   2> 	  "roles":null,
[junit4:junit4]   2> 	  "state":"active",
[junit4:junit4]   2> 	  "core":"collection1",
[junit4:junit4]   2> 	  "collection":"control_collection",
[junit4:junit4]   2> 	  "node_name":"127.0.0.1:54949_jjj",
[junit4:junit4]   2> 	  "base_url":"http://127.0.0.1:54949/jjj"}
[junit4:junit4]   2> 3785 T1856 oascc.ZkStateReader$2.process A cluster state change: WatchedEvent state:SyncConnected type:NodeDataChanged path:/clusterstate.json, has occurred - updating... (live nodes size: 2)
[junit4:junit4]   2> 3785 T1843 oascc.ZkStateReader$2.process A cluster state change: WatchedEvent state:SyncConnected type:NodeDataChanged path:/clusterstate.json, has occurred - updating... (live nodes size: 2)
[junit4:junit4]   2> 3785 T1837 oascc.ZkStateReader$2.process A cluster state change: WatchedEvent state:SyncConnected type:NodeDataChanged path:/clusterstate.json, has occurred - updating... (live nodes size: 2)
[junit4:junit4]   2> 3792 T1857 oasc.SolrConfig.<init> Using Lucene MatchVersion: LUCENE_41
[junit4:junit4]   2> 3863 T1857 oasc.SolrConfig.<init> Loaded SolrConfig: solrconfig.xml
[junit4:junit4]   2> 3964 T1857 oass.IndexSchema.readSchema Reading Solr Schema
[junit4:junit4]   2> 3971 T1857 oass.IndexSchema.readSchema Schema name=test
[junit4:junit4]   2> 4673 T1857 oass.OpenExchangeRatesOrgProvider.init Initialized with rates=open-exchange-rates.json, refreshInterval=1440.
[junit4:junit4]   2> 4685 T1857 oass.IndexSchema.readSchema default search field in schema is text
[junit4:junit4]   2> 4690 T1857 oass.IndexSchema.readSchema unique key field: id
[junit4:junit4]   2> 4704 T1857 oass.FileExchangeRateProvider.reload Reloading exchange rates from file currency.xml
[junit4:junit4]   2> 4709 T1857 oass.FileExchangeRateProvider.reload Reloading exchange rates from file currency.xml
[junit4:junit4]   2> 4714 T1857 oass.OpenExchangeRatesOrgProvider.reload Reloading exchange rates from open-exchange-rates.json
[junit4:junit4]   2> 4716 T1857 oass.OpenExchangeRatesOrgProvider.reload Reloading exchange rates from open-exchange-rates.json
[junit4:junit4]   2> 4717 T1857 oasc.SolrCore.<init> [collection1] Opening new SolrCore at /usr/home/hudson/hudson-slave/workspace/Lucene-Solr-Tests-4.x-java7/solr/build/solr-core/test/J0/./org.apache.solr.cloud.SyncSliceTest-jetty1-1356103017294/collection1/, dataDir=./org.apache.solr.cloud.SyncSliceTest-1356103013916/jetty1/
[junit4:junit4]   2> 4718 T1857 oasc.JmxMonitoredMap.<init> JMX monitoring is enabled. Adding Solr mbeans to JMX Server: com.sun.jmx.mbeanserver.JmxMBeanServer@26058825
[junit4:junit4]   2> 4718 T1857 oasc.SolrCore.initDirectoryFactory solr.NRTCachingDirectoryFactory
[junit4:junit4]   2> 4720 T1857 oasc.CachingDirectoryFactory.get return new directory for /usr/home/hudson/hudson-slave/workspace/Lucene-Solr-Tests-4.x-java7/solr/build/solr-core/test/J0/./org.apache.solr.cloud.SyncSliceTest-1356103013916/jetty1 forceNew:false
[junit4:junit4]   2> 4721 T1857 oasc.CachingDirectoryFactory.close Releasing directory:/usr/home/hudson/hudson-slave/workspace/Lucene-Solr-Tests-4.x-java7/solr/build/solr-core/test/J0/./org.apache.solr.cloud.SyncSliceTest-1356103013916/jetty1
[junit4:junit4]   2> 4721 T1857 oasc.SolrCore.getNewIndexDir New index directory detected: old=null new=./org.apache.solr.cloud.SyncSliceTest-1356103013916/jetty1/index/
[junit4:junit4]   2> 4722 T1857 oasc.SolrCore.initIndex WARNING [collection1] Solr index directory './org.apache.solr.cloud.SyncSliceTest-1356103013916/jetty1/index' doesn't exist. Creating new index...
[junit4:junit4]   2> 4723 T1857 oasc.CachingDirectoryFactory.get return new directory for /usr/home/hudson/hudson-slave/workspace/Lucene-Solr-Tests-4.x-java7/solr/build/solr-core/test/J0/./org.apache.solr.cloud.SyncSliceTest-1356103013916/jetty1/index forceNew:false
[junit4:junit4]   2> 4754 T1857 oasc.SolrDeletionPolicy.onCommit SolrDeletionPolicy.onCommit: commits:num=1
[junit4:junit4]   2> 		commit{dir=RateLimitedDirectoryWrapper(NRTCachingDirectory(org.apache.lucene.store.NIOFSDirectory@/usr/home/hudson/hudson-slave/workspace/Lucene-Solr-Tests-4.x-java7/solr/build/solr-core/test/J0/org.apache.solr.cloud.SyncSliceTest-1356103013916/jetty1/index lockFactory=org.apache.lucene.store.NativeFSLockFactory@38656ebd; maxCacheMB=48.0 maxMergeSizeMB=4.0)),segFN=segments_1,generation=1,filenames=[segments_1]
[junit4:junit4]   2> 4755 T1857 oasc.SolrDeletionPolicy.updateCommits newest commit = 1[segments_1]
[junit4:junit4]   2> 4756 T1857 oasc.CachingDirectoryFactory.close Releasing directory:/usr/home/hudson/hudson-slave/workspace/Lucene-Solr-Tests-4.x-java7/solr/build/solr-core/test/J0/./org.apache.solr.cloud.SyncSliceTest-1356103013916/jetty1/index
[junit4:junit4]   2> 4757 T1857 oasc.SolrCore.initWriters created xml: solr.XMLResponseWriter
[junit4:junit4]   2> 4760 T1857 oasup.UpdateRequestProcessorChain.init inserting DistributedUpdateProcessorFactory into updateRequestProcessorChain "dedupe"
[junit4:junit4]   2> 4760 T1857 oasup.UpdateRequestProcessorChain.init inserting DistributedUpdateProcessorFactory into updateRequestProcessorChain "dedupe-allfields"
[junit4:junit4]   2> 4761 T1857 oasup.UpdateRequestProcessorChain.init inserting DistributedUpdateProcessorFactory into updateRequestProcessorChain "stored_sig"
[junit4:junit4]   2> 4761 T1857 oasup.UpdateRequestProcessorChain.init inserting DistributedUpdateProcessorFactory into updateRequestProcessorChain "uniq-fields"
[junit4:junit4]   2> 4762 T1857 oasup.UpdateRequestProcessorChain.init inserting DistributedUpdateProcessorFactory into updateRequestProcessorChain "distrib-dup-test-chain-implicit"
[junit4:junit4]   2> 4762 T1857 oasc.RequestHandlers.initHandlersFromConfig adding lazy requestHandler: solr.ReplicationHandler
[junit4:junit4]   2> 4763 T1857 oasc.RequestHandlers.initHandlersFromConfig created /replication: solr.ReplicationHandler
[junit4:junit4]   2> 4764 T1857 oasc.RequestHandlers.initHandlersFromConfig created standard: solr.StandardRequestHandler
[junit4:junit4]   2> 4765 T1857 oasc.RequestHandlers.initHandlersFromConfig created /get: solr.RealTimeGetHandler
[junit4:junit4]   2> 4766 T1857 oasc.RequestHandlers.initHandlersFromConfig created dismax: solr.SearchHandler
[junit4:junit4]   2> 4768 T1857 oasc.RequestHandlers.initHandlersFromConfig created mock: org.apache.solr.core.MockQuerySenderListenerReqHandler
[junit4:junit4]   2> 4768 T1857 oasc.RequestHandlers.initHandlersFromConfig created /admin/: org.apache.solr.handler.admin.AdminHandlers
[junit4:junit4]   2> 4769 T1857 oasc.RequestHandlers.initHandlersFromConfig created defaults: solr.StandardRequestHandler
[junit4:junit4]   2> 4770 T1857 oasc.RequestHandlers.initHandlersFromConfig adding lazy requestHandler: solr.StandardRequestHandler
[junit4:junit4]   2> 4770 T1857 oasc.RequestHandlers.initHandlersFromConfig created lazy: solr.StandardRequestHandler
[junit4:junit4]   2> 4771 T1857 oasc.RequestHandlers.initHandlersFromConfig created /update: solr.UpdateRequestHandler
[junit4:junit4]   2> 4772 T1857 oasc.RequestHandlers.initHandlersFromConfig created /terms: org.apache.solr.handler.component.SearchHandler
[junit4:junit4]   2> 4773 T1857 oasc.RequestHandlers.initHandlersFromConfig created spellCheckCompRH: org.apache.solr.handler.component.SearchHandler
[junit4:junit4]   2> 4774 T1857 oasc.RequestHandlers.initHandlersFromConfig created spellCheckCompRH_Direct: org.apache.solr.handler.component.SearchHandler
[junit4:junit4]   2> 4776 T1857 oasc.RequestHandlers.initHandlersFromConfig created spellCheckWithWordbreak: org.apache.solr.handler.component.SearchHandler
[junit4:junit4]   2> 4777 T1857 oasc.RequestHandlers.initHandlersFromConfig created spellCheckWithWordbreak_Direct: org.apache.solr.handler.component.SearchHandler
[junit4:junit4]   2> 4778 T1857 oasc.RequestHandlers.initHandlersFromConfig created spellCheckCompRH1: org.apache.solr.handler.component.SearchHandler
[junit4:junit4]   2> 4779 T1857 oasc.RequestHandlers.initHandlersFromConfig created mltrh: org.apache.solr.handler.component.SearchHandler
[junit4:junit4]   2> 4780 T1857 oasc.RequestHandlers.initHandlersFromConfig created tvrh: org.apache.solr.handler.component.SearchHandler
[junit4:junit4]   2> 4781 T1857 oasc.RequestHandlers.initHandlersFromConfig created /mlt: solr.MoreLikeThisHandler
[junit4:junit4]   2> 4782 T1857 oasc.RequestHandlers.initHandlersFromConfig created /debug/dump: solr.DumpRequestHandler
[junit4:junit4]   2> 4798 T1857 oashl.XMLLoader.init xsltCacheLifetimeSeconds=60
[junit4:junit4]   2> 4804 T1857 oasc.SolrCore.initDeprecatedSupport WARNING solrconfig.xml uses deprecated <admin/gettableFiles>, Please update your config to use the ShowFileRequestHandler.
[junit4:junit4]   2> 4806 T1857 oasc.SolrCore.initDeprecatedSupport WARNING adding ShowFileRequestHandler with hidden files: [SCHEMA.XML, OLD_SYNONYMS.TXT, STOPWORDS.TXT, PROTWORDS.TXT, OPEN-EXCHANGE-RATES.JSON, SYNONYMS.TXT, CURRENCY.XML, MAPPING-ISOLATIN1ACCENT.TXT]
[junit4:junit4]   2> 4809 T1857 oasc.CachingDirectoryFactory.close Releasing directory:/usr/home/hudson/hudson-slave/workspace/Lucene-Solr-Tests-4.x-java7/solr/build/solr-core/test/J0/./org.apache.solr.cloud.SyncSliceTest-1356103013916/jetty1
[junit4:junit4]   2> 4811 T1857 oass.SolrIndexSearcher.<init> Opening Searcher@ad342a5 main
[junit4:junit4]   2> 4812 T1857 oasu.CommitTracker.<init> Hard AutoCommit: disabled
[junit4:junit4]   2> 4813 T1857 oasu.CommitTracker.<init> Soft AutoCommit: disabled
[junit4:junit4]   2> 4813 T1857 oashc.SpellCheckComponent.inform Initializing spell checkers
[junit4:junit4]   2> 4821 T1857 oass.DirectSolrSpellChecker.init init: {name=direct,classname=DirectSolrSpellChecker,field=lowerfilt,minQueryLength=3}
[junit4:junit4]   2> 4880 T1858 oasc.SolrCore.registerSearcher [collection1] Registered new searcher Searcher@ad342a5 main{StandardDirectoryReader(segments_1:1)}
[junit4:junit4]   2> 4885 T1857 oasc.ZkController.publish publishing core=collection1 state=down
[junit4:junit4]   2> 4886 T1857 oasc.ZkController.publish numShards not found on descriptor - reading it from system property
[junit4:junit4]   2> 5296 T1838 oascc.ZkStateReader.updateClusterState Updating cloud state from ZooKeeper... 
[junit4:junit4]   2> 5297 T1838 oasc.Overseer$ClusterStateUpdater.updateState Update state numShards=1 message={
[junit4:junit4]   2> 	  "operation":"state",
[junit4:junit4]   2> 	  "numShards":"1",
[junit4:junit4]   2> 	  "shard":null,
[junit4:junit4]   2> 	  "roles":null,
[junit4:junit4]   2> 	  "state":"down",
[junit4:junit4]   2> 	  "core":"collection1",
[junit4:junit4]   2> 	  "collection":"collection1",
[junit4:junit4]   2> 	  "node_name":"127.0.0.1:54957_jjj",
[junit4:junit4]   2> 	  "base_url":"http://127.0.0.1:54957/jjj"}
[junit4:junit4]   2> 5297 T1838 oasc.Overseer$ClusterStateUpdater.createCollection Create collection collection1 with numShards 1
[junit4:junit4]   2> 5297 T1838 oasc.Overseer$ClusterStateUpdater.updateState Assigning new node to shard shard=shard1
[junit4:junit4]   2> 5311 T1837 oascc.ZkStateReader$2.process A cluster state change: WatchedEvent state:SyncConnected type:NodeDataChanged path:/clusterstate.json, has occurred - updating... (live nodes size: 2)
[junit4:junit4]   2> 5311 T1843 oascc.ZkStateReader$2.process A cluster state change: WatchedEvent state:SyncConnected type:NodeDataChanged path:/clusterstate.json, has occurred - updating... (live nodes size: 2)
[junit4:junit4]   2> 5311 T1856 oascc.ZkStateReader$2.process A cluster state change: WatchedEvent state:SyncConnected type:NodeDataChanged path:/clusterstate.json, has occurred - updating... (live nodes size: 2)
[junit4:junit4]   2> 5889 T1857 oasc.CoreContainer.registerCore registering core: collection1
[junit4:junit4]   2> 5889 T1857 oasc.ZkController.register Register replica - core:collection1 address:http://127.0.0.1:54957/jjj collection:collection1 shard:shard1
[junit4:junit4]   2> 5890 T1857 oascc.SolrZkClient.makePath makePath: /collections/collection1/leader_elect/shard1/election
[junit4:junit4]   2> 5906 T1820 oazs.PrepRequestProcessor.pRequest Got user-level KeeperException when processing sessionid:0x13bbe09d6250006 type:delete cxid:0x45 zxid:0x5b txntype:-1 reqpath:n/a Error Path:/solr/collections/collection1/leaders Error:KeeperErrorCode = NoNode for /solr/collections/collection1/leaders
[junit4:junit4]   2> 5907 T1857 oasc.ShardLeaderElectionContext.runLeaderProcess Running the leader process.
[junit4:junit4]   2> 5907 T1820 oazs.PrepRequestProcessor.pRequest Got user-level KeeperException when processing sessionid:0x13bbe09d6250006 type:create cxid:0x46 zxid:0x5c txntype:-1 reqpath:n/a Error Path:/solr/overseer Error:KeeperErrorCode = NodeExists for /solr/overseer
[junit4:junit4]   2> 5917 T1857 oasc.ShardLeaderElectionContext.waitForReplicasToComeUp Enough replicas found to continue.
[junit4:junit4]   2> 5918 T1857 oasc.ShardLeaderElectionContext.runLeaderProcess I may be the new leader - try and sync
[junit4:junit4]   2> 5918 T1857 oasc.SyncStrategy.sync Sync replicas to http://127.0.0.1:54957/jjj/collection1/
[junit4:junit4]   2> 5918 T1857 oasc.SyncStrategy.syncReplicas Sync Success - now sync replicas to me
[junit4:junit4]   2> 5919 T1857 oasc.SyncStrategy.syncToMe http://127.0.0.1:54957/jjj/collection1/ has no replicas
[junit4:junit4]   2> 5919 T1857 oasc.ShardLeaderElectionContext.runLeaderProcess I am the new leader: http://127.0.0.1:54957/jjj/collection1/
[junit4:junit4]   2> 5920 T1857 oascc.SolrZkClient.makePath makePath: /collections/collection1/leaders/shard1
[junit4:junit4]   2> 5924 T1820 oazs.PrepRequestProcessor.pRequest Got user-level KeeperException when processing sessionid:0x13bbe09d6250006 type:create cxid:0x50 zxid:0x60 txntype:-1 reqpath:n/a Error Path:/solr/overseer Error:KeeperErrorCode = NodeExists for /solr/overseer
[junit4:junit4]   2> 6317 T1838 oascc.ZkStateReader.updateClusterState Updating cloud state from ZooKeeper... 
[junit4:junit4]   2> 6333 T1837 oascc.ZkStateReader$2.process A cluster state change: WatchedEvent state:SyncConnected type:NodeDataChanged path:/clusterstate.json, has occurred - updating... (live nodes size: 2)
[junit4:junit4]   2> 6333 T1856 oascc.ZkStateReader$2.process A cluster state change: WatchedEvent state:SyncConnected type:NodeDataChanged path:/clusterstate.json, has occurred - updating... (live nodes size: 2)
[junit4:junit4]   2> 6333 T1843 oascc.ZkStateReader$2.process A cluster state change: WatchedEvent state:SyncConnected type:NodeDataChanged path:/clusterstate.json, has occurred - updating... (live nodes size: 2)
[junit4:junit4]   2> 6385 T1857 oasc.ZkController.register We are http://127.0.0.1:54957/jjj/collection1/ and leader is http://127.0.0.1:54957/jjj/collection1/
[junit4:junit4]   2> 6385 T1857 oasc.ZkController.register No LogReplay needed for core=collection1 baseURL=http://127.0.0.1:54957/jjj
[junit4:junit4]   2> 6385 T1857 oasc.ZkController.checkRecovery I am the leader, no recovery necessary
[junit4:junit4]   2> 6386 T1857 oasc.ZkController.publish publishing core=collection1 state=active
[junit4:junit4]   2> 6386 T1857 oasc.ZkController.publish numShards not found on descriptor - reading it from system property
[junit4:junit4]   2> 6388 T1857 oascc.ZkStateReader.updateClusterState Updating cloud state from ZooKeeper... 
[junit4:junit4]   2> 6389 T1815 oass.SolrDispatchFilter.init user.dir=/usr/home/hudson/hudson-slave/workspace/Lucene-Solr-Tests-4.x-java7/solr/build/solr-core/test/J0
[junit4:junit4]   2> 6390 T1815 oass.SolrDispatchFilter.init SolrDispatchFilter.init() done
[junit4:junit4]   2> 6391 T1815 oascsi.HttpClientUtil.createClient Creating new http client, config:maxConnections=128&maxConnectionsPerHost=32&followRedirects=false
[junit4:junit4]   2> 6566 T1815 oejs.Server.doStart jetty-8.1.8.v20121106
[junit4:junit4]   2> 6570 T1815 oejs.AbstractConnector.doStart Started SocketConnector@127.0.0.1:54963
[junit4:junit4]   2> 6571 T1815 oasc.SolrResourceLoader.locateSolrHome JNDI not configured for solr (NoInitialContextEx)
[junit4:junit4]   2> 6572 T1815 oasc.SolrResourceLoader.locateSolrHome using system property solr.solr.home: /usr/home/hudson/hudson-slave/workspace/Lucene-Solr-Tests-4.x-java7/solr/build/solr-core/test/J0/./org.apache.solr.cloud.SyncSliceTest-jetty2-1356103020316
[junit4:junit4]   2> 6573 T1815 oasc.SolrResourceLoader.<init> new SolrResourceLoader for deduced Solr Home: '/usr/home/hudson/hudson-slave/workspace/Lucene-Solr-Tests-4.x-java7/solr/build/solr-core/test/J0/./org.apache.solr.cloud.SyncSliceTest-jetty2-1356103020316/'
[junit4:junit4]   2> 6617 T1815 oass.SolrDispatchFilter.init SolrDispatchFilter.init()
[junit4:junit4]   2> 6618 T1815 oasc.SolrResourceLoader.locateSolrHome JNDI not configured for solr (NoInitialContextEx)
[junit4:junit4]   2> 6619 T1815 oasc.SolrResourceLoader.locateSolrHome using system property solr.solr.home: /usr/home/hudson/hudson-slave/workspace/Lucene-Solr-Tests-4.x-java7/solr/build/solr-core/test/J0/./org.apache.solr.cloud.SyncSliceTest-jetty2-1356103020316
[junit4:junit4]   2> 6620 T1815 oasc.CoreContainer$Initializer.initialize looking for solr.xml: /usr/home/hudson/hudson-slave/workspace/Lucene-Solr-Tests-4.x-java7/solr/build/solr-core/test/J0/./org.apache.solr.cloud.SyncSliceTest-jetty2-1356103020316/solr.xml
[junit4:junit4]   2> 6621 T1815 oasc.CoreContainer.<init> New CoreContainer 871501934
[junit4:junit4]   2> 6622 T1815 oasc.CoreContainer.load Loading CoreContainer using Solr Home: '/usr/home/hudson/hudson-slave/workspace/Lucene-Solr-Tests-4.x-java7/solr/build/solr-core/test/J0/./org.apache.solr.cloud.SyncSliceTest-jetty2-1356103020316/'
[junit4:junit4]   2> 6623 T1815 oasc.SolrResourceLoader.<init> new SolrResourceLoader for directory: '/usr/home/hudson/hudson-slave/workspace/Lucene-Solr-Tests-4.x-java7/solr/build/solr-core/test/J0/./org.apache.solr.cloud.SyncSliceTest-jetty2-1356103020316/'
[junit4:junit4]   2> 6654 T1815 oashc.HttpShardHandlerFactory.getParameter Setting socketTimeout to: 30000
[junit4:junit4]   2> 6655 T1815 oashc.HttpShardHandlerFactory.getParameter Setting urlScheme to: http://
[junit4:junit4]   2> 6656 T1815 oashc.HttpShardHandlerFactory.getParameter Setting connTimeout to: 15000
[junit4:junit4]   2> 6657 T1815 oashc.HttpShardHandlerFactory.getParameter Setting maxConnectionsPerHost to: 20
[junit4:junit4]   2> 6658 T1815 oashc.HttpShardHandlerFactory.getParameter Setting corePoolSize to: 0
[junit4:junit4]   2> 6659 T1815 oashc.HttpShardHandlerFactory.getParameter Setting maximumPoolSize to: 2147483647
[junit4:junit4]   2> 6659 T1815 oashc.HttpShardHandlerFactory.getParameter Setting maxThreadIdleTime to: 5
[junit4:junit4]   2> 6660 T1815 oashc.HttpShardHandlerFactory.getParameter Setting sizeOfQueue to: -1
[junit4:junit4]   2> 6661 T1815 oashc.HttpShardHandlerFactory.getParameter Setting fairnessPolicy to: false
[junit4:junit4]   2> 6662 T1815 oascsi.HttpClientUtil.createClient Creating new http client, config:maxConnectionsPerHost=20&maxConnections=10000&socketTimeout=30000&connTimeout=15000&retry=false
[junit4:junit4]   2> 6682 T1815 oasc.CoreContainer.load Registering Log Listener
[junit4:junit4]   2> 6702 T1815 oasc.CoreContainer.initZooKeeper Zookeeper client=127.0.0.1:54946/solr
[junit4:junit4]   2> 6703 T1815 oasc.ZkController.checkChrootPath zkHost includes chroot
[junit4:junit4]   2> 6704 T1815 oaz.ZooKeeper.<init> Initiating client connection, connectString=127.0.0.1:54946 sessionTimeout=60000 watcher=org.apache.solr.common.cloud.ConnectionManager@15ed6446
[junit4:junit4]   2> 6706 T1868 oaz.ClientCnxn$SendThread.logStartConnect Opening socket connection to server localhost/127.0.0.1:54946. Will not attempt to authenticate using SASL (access denied ("javax.security.auth.AuthPermission" "getLoginConfiguration"))
[junit4:junit4]   2> 6706 T1815 oascc.ConnectionManager.waitForConnected Waiting for client to connect to ZooKeeper
[junit4:junit4]   2> 6707 T1868 oaz.ClientCnxn$SendThread.primeConnection Socket connection established to localhost/127.0.0.1:54946, initiating session
[junit4:junit4]   2> 6707 T1817 oazs.NIOServerCnxnFactory.run Accepted socket connection from /140.211.11.196:54964
[junit4:junit4]   2> 6708 T1817 oazs.ZooKeeperServer.processConnectRequest Client attempting to establish new session at /140.211.11.196:54964
[junit4:junit4]   2> 6709 T1819 oazs.ZooKeeperServer.finishSessionInit Established session 0x13bbe09d6250007 with negotiated timeout 20000 for client /140.211.11.196:54964
[junit4:junit4]   2> 6709 T1868 oaz.ClientCnxn$SendThread.onConnected Session establishment complete on server localhost/127.0.0.1:54946, sessionid = 0x13bbe09d6250007, negotiated timeout = 20000
[junit4:junit4]   2> 6710 T1869 oascc.ConnectionManager.process Watcher org.apache.solr.common.cloud.ConnectionManager@15ed6446 name:ZooKeeperConnection Watcher:127.0.0.1:54946 got event WatchedEvent state:SyncConnected type:None path:null path:null type:None
[junit4:junit4]   2> 6710 T1815 oascc.ConnectionManager.waitForConnected Client is connected to ZooKeeper
[junit4:junit4]   2> 6712 T1820 oazs.PrepRequestProcessor.pRequest2Txn Processed session termination for sessionid: 0x13bbe09d6250007
[junit4:junit4]   2> 6714 T1869 oaz.ClientCnxn$EventThread.run EventThread shut down
[junit4:junit4]   2> 6714 T1817 oazs.NIOServerCnxn.closeSock Closed socket connection for client /140.211.11.196:54964 which had sessionid 0x13bbe09d6250007
[junit4:junit4]   2> 6714 T1815 oaz.ZooKeeper.close Session: 0x13bbe09d6250007 closed
[junit4:junit4]   2> 6715 T1815 oascsi.HttpClientUtil.createClient Creating new http client, config:maxConnections=500&maxConnectionsPerHost=16&socketTimeout=15000&connTimeout=30000
[junit4:junit4]   2> 6727 T1815 oaz.ZooKeeper.<init> Initiating client connection, connectString=127.0.0.1:54946/solr sessionTimeout=30000 watcher=org.apache.solr.common.cloud.ConnectionManager@2a864afa
[junit4:junit4]   2> 6729 T1870 oaz.ClientCnxn$SendThread.logStartConnect Opening socket connection to server localhost/127.0.0.1:54946. Will not attempt to authenticate using SASL (access denied ("javax.security.auth.AuthPermission" "getLoginConfiguration"))
[junit4:junit4]   2> 6729 T1815 oascc.ConnectionManager.waitForConnected Waiting for client to connect to ZooKeeper
[junit4:junit4]   2> 6730 T1870 oaz.ClientCnxn$SendThread.primeConnection Socket connection established to localhost/127.0.0.1:54946, initiating session
[junit4:junit4]   2> 6730 T1817 oazs.NIOServerCnxnFactory.run Accepted socket connection from /140.211.11.196:54965
[junit4:junit4]   2> 6731 T1817 oazs.ZooKeeperServer.processConnectRequest Client attempting to establish new session at /140.211.11.196:54965
[junit4:junit4]   2> 6732 T1819 oazs.ZooKeeperServer.finishSessionInit Established session 0x13bbe09d6250008 with negotiated timeout 20000 for client /140.211.11.196:54965
[junit4:junit4]   2> 6732 T1870 oaz.ClientCnxn$SendThread.onConnected Session establishment complete on server localhost/127.0.0.1:54946, sessionid = 0x13bbe09d6250008, negotiated timeout = 20000
[junit4:junit4]   2> 6733 T1871 oascc.ConnectionManager.process Watcher org.apache.solr.common.cloud.ConnectionManager@2a864afa name:ZooKeeperConnection Watcher:127.0.0.1:54946/solr got event WatchedEvent state:SyncConnected type:None path:null path:null type:None
[junit4:junit4]   2> 6733 T1815 oascc.ConnectionManager.waitForConnected Client is connected to ZooKeeper
[junit4:junit4]   2> 6735 T1820 oazs.PrepRequestProcessor.pRequest Got user-level KeeperException when processing sessionid:0x13bbe09d6250008 type:create cxid:0x1 zxid:0x6d txntype:-1 reqpath:n/a Error Path:/solr/overseer Error:KeeperErrorCode = NodeExists for /solr/overseer
[junit4:junit4]   2> 6737 T1820 oazs.PrepRequestProcessor.pRequest Got user-level KeeperException when processing sessionid:0x13bbe09d6250008 type:create cxid:0x2 zxid:0x6e txntype:-1 reqpath:n/a Error Path:/solr/overseer Error:KeeperErrorCode = NodeExists for /solr/overseer
[junit4:junit4]   2> 6738 T1815 oasc.ZkController.createEphemeralLiveNode Register node as live in ZooKeeper:/live_nodes/127.0.0.1:54963_jjj
[junit4:junit4]   2> 6740 T1820 oazs.PrepRequestProcessor.pRequest Got user-level KeeperException when processing sessionid:0x13bbe09d6250008 type:delete cxid:0x4 zxid:0x6f txntype:-1 reqpath:n/a Error Path:/solr/live_nodes/127.0.0.1:54963_jjj Error:KeeperErrorCode = NoNode for /solr/live_nodes/127.0.0.1:54963_jjj
[junit4:junit4]   2> 6741 T1815 oascc.SolrZkClient.makePath makePath: /live_nodes/127.0.0.1:54963_jjj
[junit4:junit4]   2> 6744 T1837 oascc.ZkStateReader$2.process A cluster state change: WatchedEvent state:SyncConnected type:NodeChildrenChanged path:/live_nodes, has occurred - updating... (live nodes size: 2)
[junit4:junit4]   2> 6744 T1843 oascc.ZkStateReader$2.process A cluster state change: WatchedEvent state:SyncConnected type:NodeChildrenChanged path:/live_nodes, has occurred - updating... (live nodes size: 2)
[junit4:junit4]   2> 6744 T1856 oascc.ZkStateReader$2.process A cluster state change: WatchedEvent state:SyncConnected type:NodeChildrenChanged path:/live_nodes, has occurred - updating... (live nodes size: 2)
[junit4:junit4]   2> 6745 T1837 oascc.ZkStateReader$3.process Updating live nodes... (3)
[junit4:junit4]   2> 6746 T1843 oascc.ZkStateReader$3.process Updating live nodes... (3)
[junit4:junit4]   2> 6746 T1856 oascc.ZkStateReader$3.process Updating live nodes... (3)
[junit4:junit4]   2> 6747 T1815 oascc.ZkStateReader.createClusterStateWatchersAndUpdate Updating cluster state from ZooKeeper... 
[junit4:junit4]   2> 6756 T1872 oasc.CoreContainer.create Creating SolrCore 'collection1' using instanceDir: /usr/home/hudson/hudson-slave/workspace/Lucene-Solr-Tests-4.x-java7/solr/build/solr-core/test/J0/./org.apache.solr.cloud.SyncSliceTest-jetty2-1356103020316/collection1
[junit4:junit4]   2> 6757 T1872 oasc.ZkController.createCollectionZkNode Check for collection zkNode:collection1
[junit4:junit4]   2> 6758 T1872 oasc.ZkController.createCollectionZkNode Collection zkNode exists
[junit4:junit4]   2> 6758 T1872 oasc.ZkController.readConfigName Load collection config from:/collections/collection1
[junit4:junit4]   2> 6760 T1872 oasc.SolrResourceLoader.<init> new SolrResourceLoader for directory: '/usr/home/hudson/hudson-slave/workspace/Lucene-Solr-Tests-4.x-java7/solr/build/solr-core/test/J0/./org.apache.solr.cloud.SyncSliceTest-jetty2-1356103020316/collection1/'
[junit4:junit4]   2> 6761 T1872 oasc.SolrResourceLoader.replaceClassLoader Adding 'file:/usr/home/hudson/hudson-slave/workspace/Lucene-Solr-Tests-4.x-java7/solr/build/solr-core/test/J0/org.apache.solr.cloud.SyncSliceTest-jetty2-1356103020316/collection1/lib/classes/' to classloader
[junit4:junit4]   2> 6762 T1872 oasc.SolrResourceLoader.replaceClassLoader Adding 'file:/usr/home/hudson/hudson-slave/workspace/Lucene-Solr-Tests-4.x-java7/solr/build/solr-core/test/J0/org.apache.solr.cloud.SyncSliceTest-jetty2-1356103020316/collection1/lib/README' to classloader
[junit4:junit4]   2> 6818 T1872 oasc.SolrConfig.<init> Using Lucene MatchVersion: LUCENE_41
[junit4:junit4]   2> 6846 T1838 oascc.ZkStateReader.updateClusterState Updating cloud state from ZooKeeper... 
[junit4:junit4]   2> 6847 T1838 oasc.Overseer$ClusterStateUpdater.updateState Update state numShards=1 message={
[junit4:junit4]   2> 	  "operation":"state",
[junit4:junit4]   2> 	  "numShards":"1",
[junit4:junit4]   2> 	  "shard":"shard1",
[junit4:junit4]   2> 	  "roles":null,
[junit4:junit4]   2> 	  "state":"active",
[junit4:junit4]   2> 	  "core":"collection1",
[junit4:junit4]   2> 	  "collection":"collection1",
[junit4:junit4]   2> 	  "node_name":"127.0.0.1:54957_jjj",
[junit4:junit4]   2> 	  "base_url":"http://127.0.0.1:54957/jjj"}
[junit4:junit4]   2> 6861 T1856 oascc.ZkStateReader$2.process A cluster state change: WatchedEvent state:SyncConnected type:NodeDataChanged path:/clusterstate.json, has occurred - updating... (live nodes size: 3)
[junit4:junit4]   2> 6861 T1843 oascc.ZkStateReader$2.process A cluster state change: WatchedEvent state:SyncConnected type:NodeDataChanged path:/clusterstate.json, has occurred - updating... (live nodes size: 3)
[junit4:junit4]   2> 6861 T1837 oascc.ZkStateReader$2.process A cluster state change: WatchedEvent state:SyncConnected type:NodeDataChanged path:/clusterstate.json, has occurred - updating... (live nodes size: 3)
[junit4:junit4]   2> 6861 T1871 oascc.ZkStateReader$2.process A cluster state change: WatchedEvent state:SyncConnected type:NodeDataChanged path:/clusterstate.json, has occurred - updating... (live nodes size: 3)
[junit4:junit4]   2> 6914 T1872 oasc.SolrConfig.<init> Loaded SolrConfig: solrconfig.xml
[junit4:junit4]   2> 7015 T1872 oass.IndexSchema.readSchema Reading Solr Schema
[junit4:junit4]   2> 7022 T1872 oass.IndexSchema.readSchema Schema name=test
[junit4:junit4]   2> 7668 T1872 oass.OpenExchangeRatesOrgProvider.init Initialized with rates=open-exchange-rates.json, refreshInterval=1440.
[junit4:junit4]   2> 7681 T1872 oass.IndexSchema.readSchema default search field in schema is text
[junit4:junit4]   2> 7685 T1872 oass.IndexSchema.readSchema unique key field: id
[junit4:junit4]   2> 7699 T1872 oass.FileExchangeRateProvider.reload Reloading exchange rates from file currency.xml
[junit4:junit4]   2> 7704 T1872 oass.FileExchangeRateProvider.reload Reloading exchange rates from file currency.xml
[junit4:junit4]   2> 7709 T1872 oass.OpenExchangeRatesOrgProvider.reload Reloading exchange rates from open-exchange-rates.json
[junit4:junit4]   2> 7711 T1872 oass.OpenExchangeRatesOrgProvider.reload Reloading exchange rates from open-exchange-rates.json
[junit4:junit4]   2> 7712 T1872 oasc.SolrCore.<init> [collection1] Opening new SolrCore at /usr/home/hudson/hudson-slave/workspace/Lucene-Solr-Tests-4.x-java7/solr/build/solr-core/test/J0/./org.apache.solr.cloud.SyncSliceTest-jetty2-1356103020316/collection1/, dataDir=./org.apache.solr.cloud.SyncSliceTest-1356103013916/jetty2/
[junit4:junit4]   2> 7713 T1872 oasc.JmxMonitoredMap.<init> JMX monitoring is enabled. Adding Solr mbeans to JMX Server: com.sun.jmx.mbeanserver.JmxMBeanServer@26058825
[junit4:junit4]   2> 7713 T1872 oasc.SolrCore.initDirectoryFactory solr.NRTCachingDirectoryFactory
[junit4:junit4]   2> 7714 T1872 oasc.CachingDirectoryFactory.get return new directory for /usr/home/hudson/hudson-slave/workspace/Lucene-Solr-Tests-4.x-java7/solr/build/solr-core/test/J0/./org.apache.solr.cloud.SyncSliceTest-1356103013916/jetty2 forceNew:false
[junit4:junit4]   2> 7715 T1872 oasc.CachingDirectoryFactory.close Releasing directory:/usr/home/hudson/hudson-slave/workspace/Lucene-Solr-Tests-4.x-java7/solr/build/solr-core/test/J0/./org.apache.solr.cloud.SyncSliceTest-1356103013916/jetty2
[junit4:junit4]   2> 7716 T1872 oasc.SolrCore.getNewIndexDir New index directory detected: old=null new=./org.apache.solr.cloud.SyncSliceTest-1356103013916/jetty2/index/
[junit4:junit4]   2> 7716 T1872 oasc.SolrCore.initIndex WARNING [collection1] Solr index directory './org.apache.solr.cloud.SyncSliceTest-1356103013916/jetty2/index' doesn't exist. Creating new index...
[junit4:junit4]   2> 7717 T1872 oasc.CachingDirectoryFactory.get return new directory for /usr/home/hudson/hudson-slave/workspace/Lucene-Solr-Tests-4.x-java7/solr/build/solr-core/test/J0/./org.apache.solr.cloud.SyncSliceTest-1356103013916/jetty2/index forceNew:false
[junit4:junit4]   2> 7724 T1872 oasc.SolrDeletionPolicy.onCommit SolrDeletionPolicy.onCommit: commits:num=1
[junit4:junit4]   2> 		commit{dir=RateLimitedDirectoryWrapper(NRTCachingDirectory(org.apache.lucene.store.NIOFSDirectory@/usr/home/hudson/hudson-slave/workspace/Lucene-Solr-Tests-4.x-java7/solr/build/solr-core/test/J0/org.apache.solr.cloud.SyncSliceTest-1356103013916/jetty2/index lockFactory=org.apache.lucene.store.NativeFSLockFactory@52d6b35e; maxCacheMB=48.0 maxMergeSizeMB=4.0)),segFN=segments_1,generation=1,filenames=[segments_1]
[junit4:junit4]   2> 7725 T1872 oasc.SolrDeletionPolicy.updateCommits newest commit = 1[segments_1]
[junit4:junit4]   2> 7726 T1872 oasc.CachingDirectoryFactory.close Releasing directory:/usr/home/hudson/hudson-slave/workspace/Lucene-Solr-Tests-4.x-java7/solr/build/solr-core/test/J0/./org.apache.solr.cloud.SyncSliceTest-1356103013916/jetty2/index
[junit4:junit4]   2> 7726 T1872 oasc.SolrCore.initWriters created xml: solr.XMLResponseWriter
[junit4:junit4]   2> 7729 T1872 oasup.UpdateRequestProcessorChain.init inserting DistributedUpdateProcessorFactory into updateRequestProcessorChain "dedupe"
[junit4:junit4]   2> 7729 T1872 oasup.UpdateRequestProcessorChain.init inserting DistributedUpdateProcessorFactory into updateRequestProcessorChain "dedupe-allfields"
[junit4:junit4]   2> 7730 T1872 oasup.UpdateRequestProcessorChain.init inserting DistributedUpdateProcessorFactory into updateRequestProcessorChain "stored_sig"
[junit4:junit4]   2> 7730 T1872 oasup.UpdateRequestProcessorChain.init inserting DistributedUpdateProcessorFactory into updateRequestProcessorChain "uniq-fields"
[junit4:junit4]   2> 7731 T1872 oasup.UpdateRequestProcessorChain.init inserting DistributedUpdateProcessorFactory into updateRequestProcessorChain "distrib-dup-test-chain-implicit"
[junit4:junit4]   2> 7732 T1872 oasc.RequestHandlers.initHandlersFromConfig adding lazy requestHandler: solr.ReplicationHandler
[junit4:junit4]   2> 7732 T1872 oasc.RequestHandlers.initHandlersFromConfig created /replication: solr.ReplicationHandler
[junit4:junit4]   2> 7733 T1872 oasc.RequestHandlers.initHandlersFromConfig created standard: solr.StandardRequestHandler
[junit4:junit4]   2> 7735 T1872 oasc.RequestHandlers.initHandlersFromConfig created /get: solr.RealTimeGetHandler
[junit4:junit4]   2> 7736 T1872 oasc.RequestHandlers.initHandlersFromConfig created dismax: solr.SearchHandler
[junit4:junit4]   2> 7737 T1872 oasc.RequestHandlers.initHandlersFromConfig created mock: org.apache.solr.core.MockQuerySenderListenerReqHandler
[junit4:junit4]   2> 7737 T1872 oasc.RequestHandlers.initHandlersFromConfig created /admin/: org.apache.solr.handler.admin.AdminHandlers
[junit4:junit4]   2> 7739 T1872 oasc.RequestHandlers.initHandlersFromConfig created defaults: solr.StandardRequestHandler
[junit4:junit4]   2> 7739 T1872 oasc.RequestHandlers.initHandlersFromConfig adding lazy requestHandler: solr.StandardRequestHandler
[junit4:junit4]   2> 7739 T1872 oasc.RequestHandlers.initHandlersFromConfig created lazy: solr.StandardRequestHandler
[junit4:junit4]   2> 7741 T1872 oasc.RequestHandlers.initHandlersFromConfig created /update: solr.UpdateRequestHandler
[junit4:junit4]   2> 7742 T1872 oasc.RequestHandlers.initHandlersFromConfig created /terms: org.apache.solr.handler.component.SearchHandler
[junit4:junit4]   2> 7743 T1872 oasc.RequestHandlers.initHandlersFromConfig created spellCheckCompRH: org.apache.solr.handler.component.SearchHandler
[junit4:junit4]   2> 7744 T1872 oasc.RequestHandlers.initHandlersFromConfig created spellCheckCompRH_Direct: org.apache.solr.handler.component.SearchHandler
[junit4:junit4]   2> 7745 T1872 oasc.RequestHandlers.initHandlersFromConfig created spellCheckWithWordbreak: org.apache.solr.handler.component.SearchHandler
[junit4:junit4]   2> 7746 T1872 oasc.RequestHandlers.initHandlersFromConfig created spellCheckWithWordbreak_Direct: org.apache.solr.handler.component.SearchHandler
[junit4:junit4]   2> 7747 T1872 oasc.RequestHandlers.initHandlersFromConfig created spellCheckCompRH1: org.apache.solr.handler.component.SearchHandler
[junit4:junit4]   2> 7748 T1872 oasc.RequestHandlers.initHandlersFromConfig created mltrh: org.apache.solr.handler.component.SearchHandler
[junit4:junit4]   2> 7749 T1872 oasc.RequestHandlers.initHandlersFromConfig created tvrh: org.apache.solr.handler.component.SearchHandler
[junit4:junit4]   2> 7750 T1872 oasc.RequestHandlers.initHandlersFromConfig created /mlt: solr.MoreLikeThisHandler
[junit4:junit4]   2> 7752 T1872 oasc.RequestHandlers.initHandlersFromConfig created /debug/dump: solr.DumpRequestHandler
[junit4:junit4]   2> 7768 T1872 oashl.XMLLoader.init xsltCacheLifetimeSeconds=60
[junit4:junit4]   2> 7774 T1872 oasc.SolrCore.initDeprecatedSupport WARNING solrconfig.xml uses deprecated <admin/gettableFiles>, Please update your config to use the ShowFileRequestHandler.
[junit4:junit4]   2> 7776 T1872 oasc.SolrCore.initDeprecatedSupport WARNING adding ShowFileRequestHandler with hidden files: [SCHEMA.XML, OLD_SYNONYMS.TXT, STOPWORDS.TXT, PROTWORDS.TXT, OPEN-EXCHANGE-RATES.JSON, SYNONYMS.TXT, CURRENCY.XML, MAPPING-ISOLATIN1ACCENT.TXT]
[junit4:junit4]   2> 7779 T1872 oasc.CachingDirectoryFactory.close Releasing directory:/usr/home/hudson/hudson-slave/workspace/Lucene-Solr-Tests-4.x-java7/solr/build/solr-core/test/J0/./org.apache.solr.cloud.SyncSliceTest-1356103013916/jetty2
[junit4:junit4]   2> 7781 T1872 oass.SolrIndexSearcher.<init> Opening Searcher@69139be5 main
[junit4:junit4]   2> 7782 T1872 oasu.CommitTracker.<init> Hard AutoCommit: disabled
[junit4:junit4]   2> 7783 T1872 oasu.CommitTracker.<init> Soft AutoCommit: disabled
[junit4:junit4]   2> 7783 T1872 oashc.SpellCheckComponent.inform Initializing spell checkers
[junit4:junit4]   2> 7791 T1872 oass.DirectSolrSpellChecker.init init: {name=direct,classname=DirectSolrSpellChecker,field=lowerfilt,minQueryLength=3}
[junit4:junit4]   2> 7849 T1873 oasc.SolrCore.registerSearcher [collection1] Registered new searcher Searcher@69139be5 main{StandardDirectoryReader(segments_1:1)}
[junit4:junit4]   2> 7853 T1872 oasc.ZkController.publish publishing core=collection1 state=down
[junit4:junit4]   2> 7854 T1872 oasc.ZkController.publish numShards not found on descriptor - reading it from system property
[junit4:junit4]   2> 7891 T1838 oascc.ZkStateReader.updateClusterState Updating cloud state from ZooKeeper... 
[junit4:junit4]   2> 7893 T1838 oasc.Overseer$ClusterStateUpdater.updateState Update state numShards=1 message={
[junit4:junit4]   2> 	  "operation":"state",
[junit4:junit4]   2> 	  "numShards":"1",
[junit4:junit4]   2> 	  "shard":null,
[junit4:junit4]   2> 	  "roles":null,
[junit4:junit4]   2> 	  "state":"down",
[junit4:junit4]   2> 	  "core":"collection1",
[junit4:junit4]   2> 	  "collection":"collection1",
[junit4:junit4]   2> 	  "node_name":"127.0.0.1:54963_jjj",
[junit4:junit4]   2> 	  "base_url":"http://127.0.0.1:54963/jjj"}
[junit4:junit4]   2> 7893 T1838 oasc.Overseer$ClusterStateUpdater.updateState Collection already exists with numShards=1
[junit4:junit4]   2> 7893 T1838 oasc.Overseer$ClusterStateUpdater.updateState Assigning new node to shard shard=shard1
[junit4:junit4]   2> 7905 T1837 oascc.ZkStateReader$2.process A cluster state change: WatchedEvent state:SyncConnected type:NodeDataChanged path:/clusterstate.json, has occurred - updating... (live nodes size: 3)
[junit4:junit4]   2> 7906 T1856 oascc.ZkStateReader$2.process A cluster state change: WatchedEvent state:SyncConnected type:NodeDataChanged path:/clusterstate.json, has occurred - updating... (live nodes size: 3)
[junit4:junit4]   2> 7906 T1871 oascc.ZkStateReader$2.process A cluster state change: WatchedEvent state:SyncConnected type:NodeDataChanged path:/clusterstate.json, has occurred - updating... (live nodes size: 3)
[junit4:junit4]   2> 7906 T1843 oascc.ZkStateReader$2.process A cluster state change: WatchedEvent state:SyncConnected type:NodeDataChanged path:/clusterstate.json, has occurred - updating... (live nodes size: 3)
[junit4:junit4]   2> 8857 T1872 oasc.CoreContainer.registerCore registering core: collection1
[junit4:junit4]   2> 8857 T1872 oasc.ZkController.register Register replica - core:collection1 address:http://127.0.0.1:54963/jjj collection:collection1 shard:shard1
[junit4:junit4]   2> 8866 T1872 oasc.ZkController.register We are http://127.0.0.1:54963/jjj/collection1/ and leader is http://127.0.0.1:54957/jjj/collection1/
[junit4:junit4]   2> 8867 T1872 oasc.ZkController.register No LogReplay needed for core=collection1 baseURL=http://127.0.0.1:54963/jjj
[junit4:junit4]   2> 8867 T1872 oasc.ZkController.checkRecovery Core needs to recover:collection1
[junit4:junit4]   2> 8868 T1872 oasu.DefaultSolrCoreState.doRecovery Running recovery - first canceling any ongoing recovery
[junit4:junit4]   2> ASYNC  NEW_CORE C176 name=collection1 org.apache.solr.core.SolrCore@7c8bc2fb url=http://127.0.0.1:54963/jjj/collection1 node=127.0.0.1:54963_jjj C176_STATE=coll:collection1 core:collection1 props:{shard=null, roles=null, state=down, core=collection1, collection=collection1, node_name=127.0.0.1:54963_jjj, base_url=http://127.0.0.1:54963/jjj}
[junit4:junit4]   2> 8868 T1874 C176 P54963 oasc.RecoveryStrategy.run Starting recovery process.  core=collection1 recoveringAfterStartup=true
[junit4:junit4]   2> 8869 T1872 oascc.ZkStateReader.updateClusterState Updating cloud state from ZooKeeper... 
[junit4:junit4]   2> 8870 T1874 C176 P54963 oasc.RecoveryStrategy.doRecovery ###### startupVersions=[]
[junit4:junit4]   2> 8870 T1874 C176 P54963 oasc.ZkController.publish publishing core=collection1 state=recovering
[junit4:junit4]   2> 8870 T1874 C176 P54963 oasc.ZkController.publish numShards not found on descriptor - reading it from system property
[junit4:junit4]   2> 8871 T1815 oass.SolrDispatchFilter.init user.dir=/usr/home/hudson/hudson-slave/workspace/Lucene-Solr-Tests-4.x-java7/solr/build/solr-core/test/J0
[junit4:junit4]   2> 8872 T1874 C176 P54963 oasc.RecoveryStrategy.doRecovery Attempting to PeerSync from http://127.0.0.1:54957/jjj/collection1/ core=collection1 - recoveringAfterStartup=true
[junit4:junit4]   2> 8872 T1874 C176 P54963 oasu.PeerSync.sync PeerSync: core=collection1 url=http://127.0.0.1:54963/jjj START replicas=[http://127.0.0.1:54957/jjj/collection1/] nUpdates=100
[junit4:junit4]   2> 8872 T1815 oass.SolrDispatchFilter.init SolrDispatchFilter.init() done
[junit4:junit4]   2> 8873 T1874 C176 P54963 oasu.PeerSync.sync WARNING no frame of reference to tell of we've missed updates
[junit4:junit4]   2> 8873 T1874 C176 P54963 oasc.RecoveryStrategy.doRecovery PeerSync Recovery was not successful - trying replication. core=collection1
[junit4:junit4]   2> 8873 T1815 oascsi.HttpClientUtil.createClient Creating new http client, config:maxConnections=128&maxConnectionsPerHost=32&followRedirects=false
[junit4:junit4]   2> 8874 T1874 C176 P54963 oasc.RecoveryStrategy.doRecovery Starting Replication Recovery. core=collection1
[junit4:junit4]   2> 8874 T1874 C176 P54963 oascsi.HttpClientUtil.createClient Creating new http client, config:maxConnections=128&maxConnectionsPerHost=32&followRedirects=false
[junit4:junit4]   2> ASYNC  NEW_CORE C177 name=collection1 org.apache.solr.core.SolrCore@72ced429 url=http://127.0.0.1:54957/jjj/collection1 node=127.0.0.1:54957_jjj C177_STATE=coll:collection1 core:collection1 props:{shard=shard1, roles=null, state=active, core=collection1, collection=collection1, node_name=127.0.0.1:54957_jjj, base_url=http://127.0.0.1:54957/jjj, leader=true}
[junit4:junit4]   2> 8883 T1846 C177 P54957 REQ /get {distrib=false&qt=/get&wt=javabin&version=2&getVersions=100} status=0 QTime=1 
[junit4:junit4]   2> 8912 T1838 oascc.ZkStateReader.updateClusterState Updating cloud state from ZooKeeper... 
[junit4:junit4]   2> 8913 T1838 oasc.Overseer$ClusterStateUpdater.updateState Update state numShards=1 message={
[junit4:junit4]   2> 	  "operation":"state",
[junit4:junit4]   2> 	  "numShards":"1",
[junit4:junit4]   2> 	  "shard":"shard1",
[junit4:junit4]   2> 	  "roles":null,
[junit4:junit4]   2> 	  "state":"recovering",
[junit4:junit4]   2> 	  "core":"collection1",
[junit4:junit4]   2> 	  "collection":"collection1",
[junit4:junit4]   2> 	  "node_name":"127.0.0.1:54963_jjj",
[junit4:junit4]   2> 	  "base_url":"http://127.0.0.1:54963/jjj"}
[junit4:junit4]   2> 8926 T1871 oascc.ZkStateReader$2.process A cluster state change: WatchedEvent state:SyncConnected type:NodeDataChanged path:/clusterstate.json, has occurred - updating... (live nodes size: 3)
[junit4:junit4]   2> 8926 T1856 oascc.ZkStateReader$2.process A cluster state change: WatchedEvent state:SyncConnected type:NodeDataChanged path:/clusterstate.json, has occurred - updating... (live nodes size: 3)
[junit4:junit4]   2> 8926 T1837 oascc.ZkStateReader$2.process A cluster state change: WatchedEvent state:SyncConnected type:NodeDataChanged path:/clusterstate.json, has occurred - updating... (live nodes size: 3)
[junit4:junit4]   2> 8926 T1843 oascc.ZkStateReader$2.process A cluster state change: WatchedEvent state:SyncConnected type:NodeDataChanged path:/clusterstate.json, has occurred - updating... (live nodes size: 3)
[junit4:junit4]   2> 9057 T1815 oejs.Server.doStart jetty-8.1.8.v20121106
[junit4:junit4]   2> 9061 T1815 oejs.AbstractConnector.doStart Started SocketConnector@127.0.0.1:54971
[junit4:junit4]   2> 9062 T1815 oasc.SolrResourceLoader.locateSolrHome JNDI not configured for solr (NoInitialContextEx)
[junit4:junit4]   2> 9063 T1815 oasc.SolrResourceLoader.locateSolrHome using system property solr.solr.home: /usr/home/hudson/hudson-slave/workspace/Lucene-Solr-Tests-4.x-java7/solr/build/solr-core/test/J0/./org.apache.solr.cloud.SyncSliceTest-jetty3-1356103022803
[junit4:junit4]   2> 9064 T1815 oasc.SolrResourceLoader.<init> new SolrResourceLoader for deduced Solr Home: '/usr/home/hudson/hudson-slave/workspace/Lucene-Solr-Tests-4.x-java7/solr/build/solr-core/test/J0/./org.apache.solr.cloud.SyncSliceTest-jetty3-1356103022803/'
[junit4:junit4]   2> 9107 T1815 oass.SolrDispatchFilter.init SolrDispatchFilter.init()
[junit4:junit4]   2> 9109 T1815 oasc.SolrResourceLoader.locateSolrHome JNDI not configured for solr (NoInitialContextEx)
[junit4:junit4]   2> 9110 T1815 oasc.SolrResourceLoader.locateSolrHome using system property solr.solr.home: /usr/home/hudson/hudson-slave/workspace/Lucene-Solr-Tests-4.x-java7/solr/build/solr-core/test/J0/./org.apache.solr.cloud.SyncSliceTest-jetty3-1356103022803
[junit4:junit4]   2> 9111 T1815 oasc.CoreContainer$Initializer.initialize looking for solr.xml: /usr/home/hudson/hudson-slave/workspace/Lucene-Solr-Tests-4.x-java7/solr/build/solr-core/test/J0/./org.apache.solr.cloud.SyncSliceTest-jetty3-1356103022803/solr.xml
[junit4:junit4]   2> 9111 T1815 oasc.CoreContainer.<init> New CoreContainer 766339705
[junit4:junit4]   2> 9113 T1815 oasc.CoreContainer.load Loading CoreContainer using Solr Home: '/usr/home/hudson/hudson-slave/workspace/Lucene-Solr-Tests-4.x-java7/solr/build/solr-core/test/J0/./org.apache.solr.cloud.SyncSliceTest-jetty3-1356103022803/'
[junit4:junit4]   2> 9113 T1815 oasc.SolrResourceLoader.<init> new SolrResourceLoader for directory: '/usr/home/hudson/hudson-slave/workspace/Lucene-Solr-Tests-4.x-java7/solr/build/solr-core/test/J0/./org.apache.solr.cloud.SyncSliceTest-jetty3-1356103022803/'
[junit4:junit4]   2> 9146 T1815 oashc.HttpShardHandlerFactory.getParameter Setting socketTimeout to: 30000
[junit4:junit4]   2> 9147 T1815 oashc.HttpShardHandlerFactory.getParameter Setting urlScheme to: http://
[junit4:junit4]   2> 9148 T1815 oashc.HttpShardHandlerFactory.getParameter Setting connTimeout to: 15000
[junit4:junit4]   2> 9149 T1815 oashc.HttpShardHandlerFactory.getParameter Setting maxConnectionsPerHost to: 20
[junit4:junit4]   2> 9149 T1815 oashc.HttpShardHandlerFactory.getParameter Setting corePoolSize to: 0
[junit4:junit4]   2> 9150 T1815 oashc.HttpShardHandlerFactory.getParameter Setting maximumPoolSize to: 2147483647
[junit4:junit4]   2> 9151 T1815 oashc.HttpShardHandlerFactory.getParameter Setting maxThreadIdleTime to: 5
[junit4:junit4]   2> 9152 T1815 oashc.HttpShardHandlerFactory.getParameter Setting sizeOfQueue to: -1
[junit4:junit4]   2> 9153 T1815 oashc.HttpShardHandlerFactory.getParameter Setting fairnessPolicy to: false
[junit4:junit4]   2> 9153 T1815 oascsi.HttpClientUtil.createClient Creating new http client, config:maxConnectionsPerHost=20&maxConnections=10000&socketTimeout=30000&connTimeout=15000&retry=false
[junit4:junit4]   2> 9175 T1815 oasc.CoreContainer.load Registering Log Listener
[junit4:junit4]   2> 9195 T1815 oasc.CoreContainer.initZooKeeper Zookeeper client=127.0.0.1:54946/solr
[junit4:junit4]   2> 9197 T1815 oasc.ZkController.checkChrootPath zkHost includes chroot
[junit4:junit4]   2> 9198 T1815 oaz.ZooKeeper.<init> Initiating client connection, connectString=127.0.0.1:54946 sessionTimeout=60000 watcher=org.apache.solr.common.cloud.ConnectionManager@6002cfaa
[junit4:junit4]   2> 9199 T1885 oaz.ClientCnxn$SendThread.logStartConnect Opening socket connection to server localhost/127.0.0.1:54946. Will not attempt to authenticate using SASL (access denied ("javax.security.auth.AuthPermission" "getLoginConfiguration"))
[junit4:junit4]   2> 9199 T1815 oascc.ConnectionManager.waitForConnected Waiting for client to connect to ZooKeeper
[junit4:junit4]   2> 9200 T1885 oaz.ClientCnxn$SendThread.primeConnection Socket connection established to localhost/127.0.0.1:54946, initiating session
[junit4:junit4]   2> 9200 T1817 oazs.NIOServerCnxnFactory.run Accepted socket connection from /140.211.11.196:54972
[junit4:junit4]   2> 9201 T1817 oazs.ZooKeeperServer.processConnectRequest Client attempting to establish new session at /140.211.11.196:54972
[junit4:junit4]   2> 9202 T1819 oazs.ZooKeeperServer.finishSessionInit Established session 0x13bbe09d6250009 with negotiated timeout 20000 for client /140.211.11.196:54972
[junit4:junit4]   2> 9202 T1885 oaz.ClientCnxn$SendThread.onConnected Session establishment complete on server localhost/127.0.0.1:54946, sessionid = 0x13bbe09d6250009, negotiated timeout = 20000
[junit4:junit4]   2> 9203 T1886 oascc.ConnectionManager.process Watcher org.apache.solr.common.cloud.ConnectionManager@6002cfaa name:ZooKeeperConnection Watcher:127.0.0.1:54946 got event WatchedEvent state:SyncConnected type:None path:null path:null type:None
[junit4:junit4]   2> 9203 T1815 oascc.ConnectionManager.waitForConnected Client is connected to ZooKeeper
[junit4:junit4]   2> 9205 T1820 oazs.PrepRequestProcessor.pRequest2Txn Processed session termination for sessionid: 0x13bbe09d6250009
[junit4:junit4]   2> 9206 T1886 oaz.ClientCnxn$EventThread.run EventThread shut down
[junit4:junit4]   2> 9207 T1817 oazs.NIOServerCnxn.closeSock Closed socket connection for client /140.211.11.196:54972 which had sessionid 0x13bbe09d6250009
[junit4:junit4]   2> 9206 T1815 oaz.ZooKeeper.close Session: 0x13bbe09d6250009 closed
[junit4:junit4]   2> 9208 T1815 oascsi.HttpClientUtil.createClient Creating new http client, config:maxConnections=500&maxConnectionsPerHost=16&socketTimeout=15000&connTimeout=30000
[junit4:junit4]   2> 9220 T1815 oaz.ZooKeeper.<init> Initiating client connection, connectString=127.0.0.1:54946/solr sessionTimeout=30000 watcher=org.apache.solr.common.cloud.ConnectionManager@58ada8e5
[junit4:junit4]   2> 9221 T1887 oaz.ClientCnxn$SendThread.logStartConnect Opening socket connection to server localhost/127.0.0.1:54946. Will not attempt to authenticate using SASL (access denied ("javax.security.auth.AuthPermission" "getLoginConfiguration"))
[junit4:junit4]   2> 9221 T1815 oascc.ConnectionManager.waitForConnected Waiting for client to connect to ZooKeeper
[junit4:junit4]   2> 9222 T1887 oaz.ClientCnxn$SendThread.primeConnection Socket connection established to localhost/127.0.0.1:54946, initiating session
[junit4:junit4]   2> 9222 T1817 oazs.NIOServerCnxnFactory.run Accepted socket connection from /140.211.11.196:54973
[junit4:junit4]   2> 9222 T1817 oazs.ZooKeeperServer.processConnectRequest Client attempting to establish new session at /140.211.11.196:54973
[junit4:junit4]   2> 9224 T1819 oazs.ZooKeeperServer.finishSessionInit Established session 0x13bbe09d625000a with negotiated timeout 20000 for client /140.211.11.196:54973
[junit4:junit4]   2> 9224 T1887 oaz.ClientCnxn$SendThread.onConnected Session establishment complete on server localhost/127.0.0.1:54946, sessionid = 0x13bbe09d625000a, negotiated timeout = 20000
[junit4:junit4]   2> 9224 T1888 oascc.ConnectionManager.process Watcher org.apache.solr.common.cloud.ConnectionManager@58ada8e5 name:ZooKeeperConnection Watcher:127.0.0.1:54946/solr got event WatchedEvent state:SyncConnected type:None path:null path:null type:None
[junit4:junit4]   2> 9225 T1815 oascc.ConnectionManager.waitForConnected Client is connected to ZooKeeper
[junit4:junit4]   2> 9227 T1820 oazs.PrepRequestProcessor.pRequest Got user-level KeeperException when processing sessionid:0x13bbe09d625000a type:create cxid:0x1 zxid:0x84 txntype:-1 reqpath:n/a Error Path:/solr/overseer Error:KeeperErrorCode = NodeExists for /solr/overseer
[junit4:junit4]   2> 9228 T1820 oazs.PrepRequestProcessor.pRequest Got user-level KeeperException when processing sessionid:0x13bbe09d625000a type:create cxid:0x2 zxid:0x85 txntype:-1 reqpath:n/a Error Path:/solr/overseer Error:KeeperErrorCode = NodeExists for /solr/overseer
[junit4:junit4]   2> 9230 T1815 oasc.ZkController.createEphemeralLiveNode Register node as live in ZooKeeper:/live_nodes/127.0.0.1:54971_jjj
[junit4:junit4]   2> 9231 T1820 oazs.PrepRequestProcessor.pRequest Got user-level KeeperException when processing sessionid:0x13bbe09d625000a type:delete cxid:0x4 zxid:0x86 txntype:-1 reqpath:n/a Error Path:/solr/live_nodes/127.0.0.1:54971_jjj Error:KeeperErrorCode = NoNode for /solr/live_nodes/127.0.0.1:54971_jjj
[junit4:junit4]   2> 9238 T1815 oascc.SolrZkClient.makePath makePath: /live_nodes/127.0.0.1:54971_jjj
[junit4:junit4]   2> 9241 T1837 oascc.ZkStateReader$2.process A cluster state change: WatchedEvent state:SyncConnected type:NodeChildrenChanged path:/live_nodes, has occurred - updating... (live nodes size: 3)
[junit4:junit4]   2> 9241 T1843 oascc.ZkStateReader$2.process A cluster state change: WatchedEvent state:SyncConnected type:NodeChildrenChanged path:/live_nodes, has occurred - updating... (live nodes size: 3)
[junit4:junit4]   2> 9241 T1856 oascc.ZkStateReader$2.process A cluster state change: WatchedEvent state:SyncConnected type:NodeChildrenChanged path:/live_nodes, has occurred - updating... (live nodes size: 3)
[junit4:junit4]   2> 9242 T1871 oascc.ZkStateReader$3.process Updating live nodes... (4)
[junit4:junit4]   2> 9242 T1871 oascc.ZkStateReader$2.process A cluster state change: WatchedEvent state:SyncConnected type:NodeChildrenChanged path:/live_nodes, has occurred - updating... (live nodes size: 4)
[junit4:junit4]   2> 9245 T1843 oascc.ZkStateReader$3.process Updating live nodes... (4)
[junit4:junit4]   2> 9245 T1837 oascc.ZkStateReader$3.process Updating live nodes... (4)
[junit4:junit4]   2> 9245 T1856 oascc.ZkStateReader$3.process Updating live nodes... (4)
[junit4:junit4]   2> 9246 T1815 oascc.ZkStateReader.createClusterStateWatchersAndUpdate Updating cluster state from ZooKeeper... 
[junit4:junit4]   2> 9255 T1889 oasc.CoreContainer.create Creating SolrCore 'collection1' using instanceDir: /usr/home/hudson/hudson-slave/workspace/Lucene-Solr-Tests-4.x-java7/solr/build/solr-core/test/J0/./org.apache.solr.cloud.SyncSliceTest-jetty3-1356103022803/collection1
[junit4:junit4]   2> 9255 T1889 oasc.ZkController.createCollectionZkNode Check for collection zkNode:collection1
[junit4:junit4]   2> 9256 T1889 oasc.ZkController.createCollectionZkNode Collection zkNode exists
[junit4:junit4]   2> 9256 T1889 oasc.ZkController.readConfigName Load collection config from:/collections/collection1
[junit4:junit4]   2> 9258 T1889 oasc.SolrResourceLoader.<init> new SolrResourceLoader for directory: '/usr/home/hudson/hudson-slave/workspace/Lucene-Solr-Tests-4.x-java7/solr/build/solr-core/test/J0/./org.apache.solr.cloud.SyncSliceTest-jetty3-1356103022803/collection1/'
[junit4:junit4]   2> 9259 T1889 oasc.SolrResourceLoader.replaceClassLoader Adding 'file:/usr/home/hudson/hudson-slave/workspace/Lucene-Solr-Tests-4.x-java7/solr/build/solr-core/test/J0/org.apache.solr.cloud.SyncSliceTest-jetty3-1356103022803/collection1/lib/classes/' to classloader
[junit4:junit4]   2> 9260 T1889 oasc.SolrResourceLoader.replaceClassLoader Adding 'file:/usr/home/hudson/hudson-slave/workspace/Lucene-Solr-Tests-4.x-java7/solr/build/solr-core/test/J0/org.apache.solr.cloud.SyncSliceTest-jetty3-1356103022803/collection1/lib/README' to classloader
[junit4:junit4]   2> 9340 T1889 oasc.SolrConfig.<init> Using Lucene MatchVersion: LUCENE_41
[junit4:junit4]   2> 9411 T1889 oasc.SolrConfig.<init> Loaded SolrConfig: solrconfig.xml
[junit4:junit4]   2> 9513 T1889 oass.IndexSchema.readSchema Reading Solr Schema
[junit4:junit4]   2> 9520 T1889 oass.IndexSchema.readSchema Schema name=test
[junit4:junit4]   2> 10191 T1889 oass.OpenExchangeRatesOrgProvider.init Initialized with rates=open-exchange-rates.json, refreshInterval=1440.
[junit4:junit4]   2> 10205 T1889 oass.IndexSchema.readSchema default search field in schema is text
[junit4:junit4]   2> 10209 T1889 oass.IndexSchema.readSchema unique key field: id
[junit4:junit4]   2> 10224 T1889 oass.FileExchangeRateProvider.reload Reloading exchange rates from file currency.xml
[junit4:junit4]   2> 10229 T1889 oass.FileExchangeRateProvider.reload Reloading exchange rates from file currency.xml
[junit4:junit4]   2> 10234 T1889 oass.OpenExchangeRatesOrgProvider.reload Reloading exchange rates from open-exchange-rates.json
[junit4:junit4]   2> 10235 T1889 oass.OpenExchangeRatesOrgProvider.reload Reloading exchange rates from open-exchange-rates.json
[junit4:junit4]   2> 10237 T1889 oasc.SolrCore.<init> [collection1] Opening new SolrCore at /usr/home/hudson/hudson-slave/workspace/Lucene-Solr-Tests-4.x-java7/solr/build/solr-core/test/J0/./org.apache.solr.cloud.SyncSliceTest-jetty3-1356103022803/collection1/, dataDir=./org.apache.solr.cloud.SyncSliceTest-1356103013916/jetty3/
[junit4:junit4]   2> 10237 T1889 oasc.JmxMonitoredMap.<init> JMX monitoring is enabled. Adding Solr mbeans to JMX Server: com.sun.jmx.mbeanserver.JmxMBeanServer@26058825
[junit4:junit4]   2> 10238 T1889 oasc.SolrCore.initDirectoryFactory solr.NRTCachingDirectoryFactory
[junit4:junit4]   2> 10239 T1889 oasc.CachingDirectoryFactory.get return new directory for /usr/home/hudson/hudson-slave/workspace/Lucene-Solr-Tests-4.x-java7/solr/build/solr-core/test/J0/./org.apache.solr.cloud.SyncSliceTest-1356103013916/jetty3 forceNew:false
[junit4:junit4]   2> 10240 T1889 oasc.CachingDirectoryFactory.close Releasing directory:/usr/home/hudson/hudson-slave/workspace/Lucene-Solr-Tests-4.x-java7/solr/build/solr-core/test/J0/./org.apache.solr.cloud.SyncSliceTest-1356103013916/jetty3
[junit4:junit4]   2> 10240 T1889 oasc.SolrCore.getNewIndexDir New index directory detected: old=null new=./org.apache.solr.cloud.SyncSliceTest-1356103013916/jetty3/index/
[junit4:junit4]   2> 10241 T1889 oasc.SolrCore.initIndex WARNING [collection1] Solr index directory './org.apache.solr.cloud.SyncSliceTest-1356103013916/jetty3/index' doesn't exist. Creating new index...
[junit4:junit4]   2> 10242 T1889 oasc.CachingDirectoryFactory.get return new directory for /usr/home/hudson/hudson-slave/workspace/Lucene-Solr-Tests-4.x-java7/solr/build/solr-core/test/J0/./org.apache.solr.cloud.SyncSliceTest-1356103013916/jetty3/index forceNew:false
[junit4:junit4]   2> 10248 T1889 oasc.SolrDeletionPolicy.onCommit SolrDeletionPolicy.onCommit: commits:num=1
[junit4:junit4]   2> 		commit{dir=RateLimitedDirectoryWrapper(NRTCachingDirectory(org.apache.lucene.store.NIOFSDirectory@/usr/home/hudson/hudson-slave/workspace/Lucene-Solr-Tests-4.x-java7/solr/build/solr-core/test/J0/org.apache.solr.cloud.SyncSliceTest-1356103013916/jetty3/index lockFactory=org.apache.lucene.store.NativeFSLockFactory@fad25f9; maxCacheMB=48.0 maxMergeSizeMB=4.0)),segFN=segments_1,generation=1,filenames=[segments_1]
[junit4:junit4]   2> 10249 T1889 oasc.SolrDeletionPolicy.updateCommits newest commit = 1[segments_1]
[junit4:junit4]   2> 10250 T1889 oasc.CachingDirectoryFactory.close Releasing directory:/usr/home/hudson/hudson-slave/workspace/Lucene-Solr-Tests-4.x-java7/solr/build/solr-core/test/J0/./org.apache.solr.cloud.SyncSliceTest-1356103013916/jetty3/index
[junit4:junit4]   2> 10251 T1889 oasc.SolrCore.initWriters created xml: solr.XMLResponseWriter
[junit4:junit4]   2> 10253 T1889 oasup.UpdateRequestProcessorChain.init inserting DistributedUpdateProcessorFactory into updateRequestProcessorChain "dedupe"
[junit4:junit4]   2> 10254 T1889 oasup.UpdateRequestProcessorChain.init inserting DistributedUpdateProcessorFactory into updateRequestProcessorChain "dedupe-allfields"
[junit4:junit4]   2> 10254 T1889 oasup.UpdateRequestProcessorChain.init inserting DistributedUpdateProcessorFactory into updateRequestProcessorChain "stored_sig"
[junit4:junit4]   2> 10255 T1889 oasup.UpdateRequestProcessorChain.init inserting DistributedUpdateProcessorFactory into updateRequestProcessorChain "uniq-fields"
[junit4:junit4]   2> 10255 T1889 oasup.UpdateRequestProcessorChain.init inserting DistributedUpdateProcessorFactory into updateRequestProcessorChain "distrib-dup-test-chain-implicit"
[junit4:junit4]   2> 10256 T1889 oasc.RequestHandlers.initHandlersFromConfig adding lazy requestHandler: solr.ReplicationHandler
[junit4:junit4]   2> 10256 T1889 oasc.RequestHandlers.initHandlersFromConfig created /replication: solr.ReplicationHandler
[junit4:junit4]   2> 10258 T1889 oasc.RequestHandlers.initHandlersFromConfig created standard: solr.StandardRequestHandler
[junit4:junit4]   2> 10259 T1889 oasc.RequestHandlers.initHandlersFromConfig created /get: solr.RealTimeGetHandler
[junit4:junit4]   2> 10260 T1889 oasc.RequestHandlers.initHandlersFromConfig created dismax: solr.SearchHandler
[junit4:junit4]   2> 10261 T1889 oasc.RequestHandlers.initHandlersFromConfig created mock: org.apache.solr.core.MockQuerySenderListenerReqHandler
[junit4:junit4]   2> 10262 T1889 oasc.RequestHandlers.initHandlersFromConfig created /admin/: org.apache.solr.handler.admin.AdminHandlers
[junit4:junit4]   2> 10263 T1889 oasc.RequestHandlers.initHandlersFromConfig created defaults: solr.StandardRequestHandler
[junit4:junit4]   2> 10263 T1889 oasc.RequestHandlers.initHandlersFromConfig adding lazy requestHandler: solr.StandardRequestHandler
[junit4:junit4]   2> 10264 T1889 oasc.RequestHandlers.initHandlersFromConfig created lazy: solr.StandardRequestHandler
[junit4:junit4]   2> 10265 T1889 oasc.RequestHandlers.initHandlersFromConfig created /update: solr.UpdateRequestHandler
[junit4:junit4]   2> 10266 T1889 oasc.RequestHandlers.initHandlersFromConfig created /terms: org.apache.solr.handler.component.SearchHandler
[junit4:junit4]   2> 10267 T1889 oasc.RequestHandlers.initHandlersFromConfig created spellCheckCompRH: org.apache.solr.handler.component.SearchHandler
[junit4:junit4]   2> 10268 T1889 oasc.RequestHandlers.initHandlersFromConfig created spellCheckCompRH_Direct: org.apache.solr.handler.component.SearchHandler
[junit4:junit4]   2> 10269 T1889 oasc.RequestHandlers.initHandlersFromConfig created spellCheckWithWordbreak: org.apache.solr.handler.component.SearchHandler
[junit4:junit4]   2> 10270 T1889 oasc.RequestHandlers.initHandlersFromConfig created spellCheckWithWordbreak_Direct: org.apache.solr.handler.component.SearchHandler
[junit4:junit4]   2> 10271 T1889 oasc.RequestHandlers.initHandlersFromConfig created spellCheckCompRH1: org.apache.solr.handler.component.SearchHandler
[junit4:junit4]   2> 10272 T1889 oasc.RequestHandlers.initHandlersFromConfig created mltrh: org.apache.solr.handler.component.SearchHandler
[junit4:junit4]   2> 10273 T1889 oasc.RequestHandlers.initHandlersFromConfig created tvrh: org.apache.solr.handler.component.SearchHandler
[junit4:junit4]   2> 10275 T1889 oasc.RequestHandlers.initHandlersFromConfig created /mlt: solr.MoreLikeThisHandler
[junit4:junit4]   2> 10276 T1889 oasc.RequestHandlers.initHandlersFromConfig created /debug/dump: solr.DumpRequestHandler
[junit4:junit4]   2> 10289 T1889 oashl.XMLLoader.init xsltCacheLifetimeSeconds=60
[junit4:junit4]   2> 10294 T1889 oasc.SolrCore.initDeprecatedSupport WARNING solrconfig.xml uses deprecated <admin/gettableFiles>, Please update your config to use the ShowFileRequestHandler.
[junit4:junit4]   2> 10295 T1889 oasc.SolrCore.initDeprecatedSupport WARNING adding ShowFileRequestHandler with hidden files: [SCHEMA.XML, OLD_SYNONYMS.TXT, STOPWORDS.TXT, PROTWORDS.TXT, OPEN-EXCHANGE-RATES.JSON, SYNONYMS.TXT, CURRENCY.XML, MAPPING-ISOLATIN1ACCENT.TXT]
[junit4:junit4]   2> 10298 T1889 oasc.CachingDirectoryFactory.close Releasing directory:/usr/home/hudson/hudson-slave/workspace/Lucene-Solr-Tests-4.x-java7/solr/build/solr-core/test/J0/./org.apache.solr.cloud.SyncSliceTest-1356103013916/jetty3
[junit4:junit4]   2> 10300 T1889 oass.SolrIndexSearcher.<init> Opening Searcher@3a8f69ac main
[junit4:junit4]   2> 10301 T1889 oasu.CommitTracker.<init> Hard AutoCommit: disabled
[junit4:junit4]   2> 10302 T1889 oasu.CommitTracker.<init> Soft AutoCommit: disabled
[junit4:junit4]   2> 10303 T1889 oashc.SpellCheckComponent.inform Initializing spell checkers
[junit4:junit4]   2> 10310 T1889 oass.DirectSolrSpellChecker.init init: {name=direct,classname=DirectSolrSpellChecker,field=lowerfilt,minQueryLength=3}
[junit4:junit4]   2> 10368 T1890 oasc.SolrCore.registerSearcher [collection1] Registered new searcher Searcher@3a8f69ac main{StandardDirectoryReader(segments_1:1)}
[junit4:junit4]   2> 10373 T1889 oasc.ZkController.publish publishing core=collection1 state=down
[junit4:junit4]   2> 10373 T1889 oasc.ZkController.publish numShards not found on descriptor - reading it from system property
[junit4:junit4]   2> 10435 T1838 oascc.ZkStateReader.updateClusterState Updating cloud state from ZooKeeper... 
[junit4:junit4]   2> 10436 T1838 oasc.Overseer$ClusterStateUpdater.updateState Update state numShards=1 message={
[junit4:junit4]   2> 	  "operation":"state",
[junit4:junit4]   2> 	  "numShards":"1",
[junit4:junit4]   2> 	  "shard":null,
[junit4:junit4]   2> 	  "roles":null,
[junit4:junit4]   2> 	  "state":"down",
[junit4:junit4]   2> 	  "core":"collection1",
[junit4:junit4]   2> 	  "collection":"collection1",
[junit4:junit4]   2> 	  "node_name":"127.0.0.1:54971_jjj",
[junit4:junit4]   2> 	  "base_url":"http://127.0.0.1:54971/jjj"}
[junit4:junit4]   2> 10436 T1838 oasc.Overseer$ClusterStateUpdater.updateState Collection already exists with numShards=1
[junit4:junit4]   2> 10437 T1838 oasc.Overseer$ClusterStateUpdater.updateState Assigning new node to shard shard=shard1
[junit4:junit4]   2> 10449 T1837 oascc.ZkStateReader$2.process A cluster state change: WatchedEvent state:SyncConnected type:NodeDataChanged path:/clusterstate.json, has occurred - updating... (live nodes size: 4)
[junit4:junit4]   2> 10449 T1856 oascc.ZkStateReader$2.process A cluster state change: WatchedEvent state:SyncConnected type:NodeDataChanged path:/clusterstate.json, has occurred - updating... (live nodes size: 4)
[junit4:junit4]   2> 10449 T1843 oascc.ZkStateReader$2.process A cluster state change: WatchedEvent state:SyncConnected type:NodeDataChanged path:/clusterstate.json, has occurred - updating... (live nodes size: 4)
[junit4:junit4]   2> 10449 T1871 oascc.ZkStateReader$2.process A cluster state change: WatchedEvent state:SyncConnected type:NodeDataChanged path:/clusterstate.json, has occurred - updating... (live nodes size: 4)
[junit4:junit4]   2> 10449 T1888 oascc.ZkStateReader$2.process A cluster state change: WatchedEvent state:SyncConnected type:NodeDataChanged path:/clusterstate.json, has occurred - updating... (live nodes size: 4)
[junit4:junit4]   2> 11376 T1889 oasc.CoreContainer.registerCore registering core: collection1
[junit4:junit4]   2> 11376 T1889 oasc.ZkController.register Register replica - core:collection1 address:http://127.0.0.1:54971/jjj collection:collection1 shard:shard1
[junit4:junit4]   2> 11380 T1889 oasc.ZkController.register We are http://127.0.0.1:54971/jjj/collection1/ and leader is http://127.0.0.1:54957/jjj/collection1/
[junit4:junit4]   2> 11381 T1889 oasc.ZkController.register No LogReplay needed for core=collection1 baseURL=http://127.0.0.1:54971/jjj
[junit4:junit4]   2> 11381 T1889 oasc.ZkController.checkRecovery Core needs to recover:collection1
[junit4:junit4]   2> 11381 T1889 oasu.DefaultSolrCoreState.doRecovery Running recovery - first canceling any ongoing recovery
[junit4:junit4]   2> ASYNC  NEW_CORE C178 name=collection1 org.apache.solr.core.SolrCore@144e0fa3 url=http://127.0.0.1:54971/jjj/collection1 node=127.0.0.1:54971_jjj C178_STATE=coll:collection1 core:collection1 props:{shard=null, roles=null, state=down, core=collection1, collection=collection1, node_name=127.0.0.1:54971_jjj, base_url=http://127.0.0.1:54971/jjj}
[junit4:junit4]   2> 11382 T1891 C178 P54971 oasc.RecoveryStrategy.run Starting recovery process.  core=collection1 recoveringAfterStartup=true
[junit4:junit4]   2> 11382 T1889 oascc.ZkStateReader.updateClusterState Updating cloud state from ZooKeeper... 
[junit4:junit4]   2> 11383 T1891 C178 P54971 oasc.RecoveryStrategy.doRecovery ###### startupVersions=[]
[junit4:junit4]   2> 11384 T1891 C178 P54971 oasc.ZkController.publish publishing core=collection1 state=recovering
[junit4:junit4]   2> 11384 T1891 C178 P54971 oasc.ZkController.publish numShards not found on descriptor - reading it from system property
[junit4:junit4]   2> 11384 T1815 oass.SolrDispatchFilter.init user.dir=/usr/home/hudson/hudson-slave/workspace/Lucene-Solr-Tests-4.x-java7/solr/build/solr-core/test/J0
[junit4:junit4]   2> 11386 T1891 C178 P54971 oasc.RecoveryStrategy.doRecovery Attempting to PeerSync from http://127.0.0.1:54957/jjj/collection1/ core=collection1 - recoveringAfterStartup=true
[junit4:junit4]   2> 11386 T1891 C178 P54971 oasu.PeerSync.sync PeerSync: core=collection1 url=http://127.0.0.1:54971/jjj START replicas=[http://127.0.0.1:54957/jjj/collection1/] nUpdates=100
[junit4:junit4]   2> 11386 T1815 oass.SolrDispatchFilter.init SolrDispatchFilter.init() done
[junit4:junit4]   2> 11387 T1891 C178 P54971 oasu.PeerSync.sync WARNING no frame of reference to tell of we've missed updates
[junit4:junit4]   2> 11387 T1891 C178 P54971 oasc.RecoveryStrategy.doRecovery PeerSync Recovery was not successful - trying replication. core=collection1
[junit4:junit4]   2> 11387 T1815 oascsi.HttpClientUtil.createClient Creating new http client, config:maxConnections=128&maxConnectionsPerHost=32&followRedirects=false
[junit4:junit4]   2> 11388 T1891 C178 P54971 oasc.RecoveryStrategy.doRecovery Starting Replication Recovery. core=collection1
[junit4:junit4]   2> 11388 T1891 C178 P54971 oascsi.HttpClientUtil.createClient Creating new http client, config:maxConnections=128&maxConnectionsPerHost=32&followRedirects=false
[junit4:junit4]   2> 11389 T1846 C177 P54957 REQ /get {distrib=false&qt=/get&wt=javabin&version=2&getVersions=100} status=0 QTime=0 
[junit4:junit4]   2> 11456 T1838 oascc.ZkStateReader.updateClusterState Updating cloud state from ZooKeeper... 
[junit4:junit4]   2> 11457 T1838 oasc.Overseer$ClusterStateUpdater.updateState Update state numShards=1 message={
[junit4:junit4]   2> 	  "operation":"state",
[junit4:junit4]   2> 	  "numShards":"1",
[junit4:junit4]   2> 	  "shard":"shard1",
[junit4:junit4]   2> 	  "roles":null,
[junit4:junit4]   2> 	  "state":"recovering",
[junit4:junit4]   2> 	  "core":"collection1",
[junit4:junit4]   2> 	  "collection":"collection1",
[junit4:junit4]   2> 	  "node_name":"127.0.0.1:54971_jjj",
[junit4:junit4]   2> 	  "base_url":"http://127.0.0.1:54971/jjj"}
[junit4:junit4]   2> 11470 T1837 oascc.ZkStateReader$2.process A cluster state change: WatchedEvent state:SyncConnected type:NodeDataChanged path:/clusterstate.json, has occurred - updating... (live nodes size: 4)
[junit4:junit4]   2> 11471 T1871 oascc.ZkStateReader$2.process A cluster state change: WatchedEvent state:SyncConnected type:NodeDataChanged path:/clusterstate.json, has occurred - updating... (live nodes size: 4)
[junit4:junit4]   2> 11470 T1843 oascc.ZkStateReader$2.process A cluster state change: WatchedEvent state:SyncConnected type:NodeDataChanged path:/clusterstate.json, has occurred - updating... (live nodes size: 4)
[junit4:junit4]   2> 11470 T1888 oascc.ZkStateReader$2.process A cluster state change: WatchedEvent state:SyncConnected type:NodeDataChanged path:/clusterstate.json, has occurred - updating... (live nodes size: 4)
[junit4:junit4]   2> 11470 T1856 oascc.ZkStateReader$2.process A cluster state change: WatchedEvent state:SyncConnected type:NodeDataChanged path:/clusterstate.json, has occurred - updating... (live nodes size: 4)
[junit4:junit4]   2> 11597 T1815 oejs.Server.doStart jetty-8.1.8.v20121106
[junit4:junit4]   2> 11601 T1815 oejs.AbstractConnector.doStart Started SocketConnector@127.0.0.1:54980
[junit4:junit4]   2> 11602 T1815 oasc.SolrResourceLoader.locateSolrHome JNDI not configured for solr (NoInitialContextEx)
[junit4:junit4]   2> 11603 T1815 oasc.SolrResourceLoader.locateSolrHome using system property solr.solr.home: /usr/home/hudson/hudson-slave/workspace/Lucene-Solr-Tests-4.x-java7/solr/build/solr-core/test/J0/./org.apache.solr.cloud.SyncSliceTest-jetty4-1356103025320
[junit4:junit4]   2> 11604 T1815 oasc.SolrResourceLoader.<init> new SolrResourceLoader for deduced Solr Home: '/usr/home/hudson/hudson-slave/workspace/Lucene-Solr-Tests-4.x-java7/solr/build/solr-core/test/J0/./org.apache.solr.cloud.SyncSliceTest-jetty4-1356103025320/'
[junit4:junit4]   2> 11648 T1815 oass.SolrDispatchFilter.init SolrDispatchFilter.init()
[junit4:junit4]   2> 11649 T1815 oasc.SolrResourceLoader.locateSolrHome JNDI not configured for solr (NoInitialContextEx)
[junit4:junit4]   2> 11650 T1815 oasc.SolrResourceLoader.locateSolrHome using system property solr.solr.home: /usr/home/hudson/hudson-slave/workspace/Lucene-Solr-Tests-4.x-java7/solr/build/solr-core/test/J0/./org.apache.solr.cloud.SyncSliceTest-jetty4-1356103025320
[junit4:junit4]   2> 11651 T1815 oasc.CoreContainer$Initializer.initialize looking for solr.xml: /usr/home/hudson/hudson-slave/workspace/Lucene-Solr-Tests-4.x-java7/solr/build/solr-core/test/J0/./org.apache.solr.cloud.SyncSliceTest-jetty4-1356103025320/solr.xml
[junit4:junit4]   2> 11651 T1815 oasc.CoreContainer.<init> New CoreContainer 1216742623
[junit4:junit4]   2> 11652 T1815 oasc.CoreContainer.load Loading CoreContainer using Solr Home: '/usr/home/hudson/hudson-slave/workspace/Lucene-Solr-Tests-4.x-java7/solr/build/solr-core/test/J0/./org.apache.solr.cloud.SyncSliceTest-jetty4-1356103025320/'
[junit4:junit4]   2> 11653 T1815 oasc.SolrResourceLoader.<init> new SolrResourceLoader for directory: '/usr/home/hudson/hudson-slave/workspace/Lucene-Solr-Tests-4.x-java7/solr/build/solr-core/test/J0/./org.apache.solr.cloud.SyncSliceTest-jetty4-1356103025320/'
[junit4:junit4]   2> 11686 T1815 oashc.HttpShardHandlerFactory.getParameter Setting socketTimeout to: 30000
[junit4:junit4]   2> 11687 T1815 oashc.HttpShardHandlerFactory.getParameter Setting urlScheme to: http://
[junit4:junit4]   2> 11688 T1815 oashc.HttpShardHandlerFactory.getParameter Setting connTimeout to: 15000
[junit4:junit4]   2> 11689 T1815 oashc.HttpShardHandlerFactory.getParameter Setting maxConnectionsPerHost to: 20
[junit4:junit4]   2> 11690 T1815 oashc.HttpShardHandlerFactory.getParameter Setting corePoolSize to: 0
[junit4:junit4]   2> 11690 T1815 oashc.HttpShardHandlerFactory.getParameter Setting maximumPoolSize to: 2147483647
[junit4:junit4]   2> 11691 T1815 oashc.HttpShardHandlerFactory.getParameter Setting maxThreadIdleTime to: 5
[junit4:junit4]   2> 11692 T1815 oashc.HttpShardHandlerFactory.getParameter Setting sizeOfQueue to: -1
[junit4:junit4]   2> 11693 T1815 oashc.HttpShardHandlerFactory.getParameter Setting fairnessPolicy to: false
[junit4:junit4]   2> 11694 T1815 oascsi.HttpClientUtil.createClient Creating new http client, config:maxConnectionsPerHost=20&maxConnections=10000&socketTimeout=30000&connTimeout=15000&retry=false
[junit4:junit4]   2> 11714 T1815 oasc.CoreContainer.load Registering Log Listener
[junit4:junit4]   2> 11734 T1815 oasc.CoreContainer.initZooKeeper Zookeeper client=127.0.0.1:54946/solr
[junit4:junit4]   2> 11736 T1815 oasc.ZkController.checkChrootPath zkHost includes chroot
[junit4:junit4]   2> 11737 T1815 oaz.ZooKeeper.<init> Initiating client connection, connectString=127.0.0.1:54946 sessionTimeout=60000 watcher=org.apache.solr.common.cloud.ConnectionManager@2435de86
[junit4:junit4]   2> 11738 T1903 oaz.ClientCnxn$SendThread.logStartConnect Opening socket connection to server localhost/127.0.0.1:54946. Will not attempt to authenticate using SASL (access denied ("javax.security.auth.AuthPermission" "getLoginConfiguration"))
[junit4:junit4]   2> 11738 T1815 oascc.ConnectionManager.waitForConnected Waiting for client to connect to ZooKeeper
[junit4:junit4]   2> 11739 T1903 oaz.ClientCnxn$SendThread.primeConnection Socket connection established to localhost/127.0.0.1:54946, initiating session
[junit4:junit4]   2> 11739 T1817 oazs.NIOServerCnxnFactory.run Accepted socket connection from /140.211.11.196:54982
[junit4:junit4]   2> 11740 T1817 oazs.ZooKeeperServer.processConnectRequest Client attempting to establish new session at /140.211.11.196:54982
[junit4:junit4]   2> 11741 T1819 oazs.ZooKeeperServer.finishSessionInit Established session 0x13bbe09d625000b with negotiated timeout 20000 for client /140.211.11.196:54982
[junit4:junit4]   2> 11742 T1903 oaz.ClientCnxn$SendThread.onConnected Session establishment complete on server localhost/127.0.0.1:54946, sessionid = 0x13bbe09d625000b, negotiated timeout = 20000
[junit4:junit4]   2> 11742 T1904 oascc.ConnectionManager.process Watcher org.apache.solr.common.cloud.ConnectionManager@2435de86 name:ZooKeeperConnection Watcher:127.0.0.1:54946 got event WatchedEvent state:SyncConnected type:None path:null path:null type:None
[junit4:junit4]   2> 11742 T1815 oascc.ConnectionManager.waitForConnected Client is connected to ZooKeeper
[junit4:junit4]   2> 11745 T1820 oazs.PrepRequestProcessor.pRequest2Txn Processed session termination for sessionid: 0x13bbe09d625000b
[junit4:junit4]   2> 11746 T1904 oaz.ClientCnxn$EventThread.run EventThread shut down
[junit4:junit4]   2> 11746 T1817 oazs.NIOServerCnxn.closeSock Closed socket connection for client /140.211.11.196:54982 which had sessionid 0x13bbe09d625000b
[junit4:junit4]   2> 11746 T1815 oaz.ZooKeeper.close Session: 0x13bbe09d625000b closed
[junit4:junit4]   2> 11747 T1815 oascsi.HttpClientUtil.createClient Creating new http client, config:maxConnections=500&maxConnectionsPerHost=16&socketTimeout=15000&connTimeout=30000
[junit4:junit4]   2> 11757 T1815 oaz.ZooKeeper.<init> Initiating client connection, connectString=127.0.0.1:54946/solr sessionTimeout=30000 watcher=org.apache.solr.common.cloud.ConnectionManager@7e00df2
[junit4:junit4]   2> 11759 T1905 oaz.ClientCnxn$SendThread.logStartConnect Opening socket connection to server localhost/127.0.0.1:54946. Will not attempt to authenticate using SASL (access denied ("javax.security.auth.AuthPermission" "getLoginConfiguration"))
[junit4:junit4]   2> 11759 T1815 oascc.ConnectionManager.waitForConnected Waiting for client to connect to ZooKeeper
[junit4:junit4]   2> 11760 T1905 oaz.ClientCnxn$SendThread.primeConnection Socket connection established to localhost/127.0.0.1:54946, initiating session
[junit4:junit4]   2> 11760 T1817 oazs.NIOServerCnxnFactory.run Accepted socket connection from /140.211.11.196:54983
[junit4:junit4]   2> 11760 T1817 oazs.ZooKeeperServer.processConnectRequest Client attempting to establish new session at /140.211.11.196:54983
[junit4:junit4]   2> 11762 T1819 oazs.ZooKeeperServer.finishSessionInit Established session 0x13bbe09d625000c with negotiated timeout 20000 for client /140.211.11.196:54983
[junit4:junit4]   2> 11762 T1905 oaz.ClientCnxn$SendThread.onConnected Session establishment complete on server localhost/127.0.0.1:54946, sessionid = 0x13bbe09d625000c, negotiated timeout = 20000
[junit4:junit4]   2> 11762 T1906 oascc.ConnectionManager.process Watcher org.apache.solr.common.cloud.ConnectionManager@7e00df2 name:ZooKeeperConnection Watcher:127.0.0.1:54946/solr got event WatchedEvent state:SyncConnected type:None path:null path:null type:None
[junit4:junit4]   2> 11762 T1815 oascc.ConnectionManager.waitForConnected Client is connected to ZooKeeper
[junit4:junit4]   2> 11764 T1820 oazs.PrepRequestProcessor.pRequest Got user-level KeeperException when processing sessionid:0x13bbe09d625000c type:create cxid:0x1 zxid:0x97 txntype:-1 reqpath:n/a Error Path:/solr/overseer Error:KeeperErrorCode = NodeExists for /solr/overseer
[junit4:junit4]   2> 11765 T1820 oazs.PrepRequestProcessor.pRequest Got user-level KeeperException when processing sessionid:0x13bbe09d625000c type:create cxid:0x2 zxid:0x98 txntype:-1 reqpath:n/a Error Path:/solr/overseer Error:KeeperErrorCode = NodeExists for /solr/overseer
[junit4:junit4]   2> 11773 T1815 oasc.ZkController.createEphemeralLiveNode Register node as live in ZooKeeper:/live_nodes/127.0.0.1:54980_jjj
[junit4:junit4]   2> 11774 T1820 oazs.PrepRequestProcessor.pRequest Got user-level KeeperException when processing sessionid:0x13bbe09d625000c type:delete cxid:0x4 zxid:0x99 txntype:-1 reqpath:n/a Error Path:/solr/live_nodes/127.0.0.1:54980_jjj Error:KeeperErrorCode = NoNode for /solr/live_nodes/127.0.0.1:54980_jjj
[junit4:junit4]   2> 11775 T1815 oascc.SolrZkClient.makePath makePath: /live_nodes/127.0.0.1:54980_jjj
[junit4:junit4]   2> 11778 T1837 oascc.ZkStateReader$2.process A cluster state change: WatchedEvent state:SyncConnected type:NodeChildrenChanged path:/live_nodes, has occurred - updating... (live nodes size: 4)
[junit4:junit4]   2> 11779 T1843 oascc.ZkStateReader$2.process A cluster state change: WatchedEvent state:SyncConnected type:NodeChildrenChanged path:/live_nodes, has occurred - updating... (live nodes size: 4)
[junit4:junit4]   2> 11778 T1856 oascc.ZkStateReader$2.process A cluster state change: WatchedEvent state:SyncConnected type:NodeChildrenChanged path:/live_nodes, has occurred - updating... (live nodes size: 4)
[junit4:junit4]   2> 11779 T1888 oascc.ZkStateReader$3.process Updating live nodes... (5)
[junit4:junit4]   2> 11779 T1871 oascc.ZkStateReader$3.process Updating live nodes... (5)
[junit4:junit4]   2> 11780 T1888 oascc.ZkStateReader$2.process A cluster state change: WatchedEvent state:SyncConnected type:NodeChildrenChanged path:/live_nodes, has occurred - updating... (live nodes size: 5)
[junit4:junit4]   2> 11780 T1871 oascc.ZkStateReader$2.process A cluster state change: WatchedEvent state:SyncConnected type:NodeChildrenChanged path:/live_nodes, has occurred - updating... (live nodes size: 5)
[junit4:junit4]   2> 11780 T1837 oascc.ZkStateReader$3.process Updating live nodes... (5)
[junit4:junit4]   2> 11781 T1843 oascc.ZkStateReader$3.process Updating live nodes... (5)
[junit4:junit4]   2> 11781 T1856 oascc.ZkStateReader$3.process Updating live nodes... (5)
[junit4:junit4]   2> 11783 T1815 oascc.ZkStateReader.createClusterStateWatchersAndUpdate Updating cluster state from ZooKeeper... 
[junit4:junit4]   2> 11791 T1907 oasc.CoreContainer.create Creating SolrCore 'collection1' using instanceDir: /usr/home/hudson/hudson-slave/workspace/Lucene-Solr-Tests-4.x-java7/solr/build/solr-core/test/J0/./org.apache.solr.cloud.SyncSliceTest-jetty4-1356103025320/collection1
[junit4:junit4]   2> 11791 T1907 oasc.ZkController.createCollectionZkNode Check for collection zkNode:collection1
[junit4:junit4]   2> 11792 T1907 oasc.ZkController.createCollectionZkNode Collection zkNode exists
[junit4:junit4]   2> 11792 T1907 oasc.ZkController.readConfigName Load collection config from:/collections/collection1
[junit4:junit4]   2> 11794 T1907 oasc.SolrResourceLoader.<init> new SolrResourceLoader for directory: '/usr/home/hudson/hudson-slave/workspace/Lucene-Solr-Tests-4.x-java7/solr/build/solr-core/test/J0/./org.apache.solr.cloud.SyncSliceTest-jetty4-1356103025320/collection1/'
[junit4:junit4]   2> 11795 T1907 oasc.SolrResourceLoader.replaceClassLoader Adding 'file:/usr/home/hudson/hudson-slave/workspace/Lucene-Solr-Tests-4.x-java7/solr/build/solr-core/test/J0/org.apache.solr.cloud.SyncSliceTest-jetty4-1356103025320/collection1/lib/classes/' to classloader
[junit4:junit4]   2> 11796 T1907 oasc.SolrResourceLoader.replaceClassLoader Adding 'file:/usr/home/hudson/hudson-slave/workspace/Lucene-Solr-Tests-4.x-java7/solr/build/solr-core/test/J0/org.apache.solr.cloud.SyncSliceTest-jetty4-1356103025320/collection1/lib/README' to classloader
[junit4:junit4]   2> 11848 T1907 oasc.SolrConfig.<init> Using Lucene MatchVersion: LUCENE_41
[junit4:junit4]   2>  C176_STATE=coll:collection1 core:collection1 props:{shard=shard1, roles=null, state=recovering, core=collection1, collection=collection1, node_name=127.0.0.1:54963_jjj, base_url=http://127.0.0.1:54963/jjj}
[junit4:junit4]   2> 11896 T1874 C176 P54963 oasc.RecoveryStrategy.doRecovery Begin buffering updates. core=collection1
[junit4:junit4]   2> 11896 T1874 C176 P54963 oasu.UpdateLog.bufferUpdates Starting to buffer updates. FSUpdateLog{state=ACTIVE, tlog=null}
[junit4:junit4]   2> 11896 T1874 C176 P54963 oasc.RecoveryStrategy.replicate Attempting to replicate from http://127.0.0.1:54957/jjj/collection1/. core=collection1
[junit4:junit4]   2> 11897 T1874 C176 P54963 oascsi.HttpClientUtil.createClient Creating new http client, config:maxConnections=128&maxConnectionsPerHost=32&followRedirects=false
[junit4:junit4]   2> 11908 T1849 C177 P54957 oasu.DirectUpdateHandler2.commit start commit{flags=0,_version_=0,optimize=false,openSearcher=false,waitSearcher=true,expungeDeletes=false,softCommit=false}
[junit4:junit4]   2> 11911 T1849 C177 P54957 oasc.CachingDirectoryFactory.close Releasing directory:/usr/home/hudson/hudson-slave/workspace/Lucene-Solr-Tests-4.x-java7/solr/build/solr-core/test/J0/./org.apache.solr.cloud.SyncSliceTest-1356103013916/jetty1
[junit4:junit4]   2> 11915 T1849 C177 P54957 oasc.SolrDeletionPolicy.onInit SolrDeletionPolicy.onInit: commits:num=1
[junit4:junit4]   2> 		commit{dir=RateLimitedDirectoryWrapper(NRTCachingDirectory(org.apache.lucene.store.NIOFSDirectory@/usr/home/hudson/hudson-slave/workspace/Lucene-Solr-Tests-4.x-java7/solr/build/solr-core/test/J0/org.apache.solr.cloud.SyncSliceTest-1356103013916/jetty1/index lockFactory=org.apache.lucene.store.NativeFSLockFactory@38656ebd; maxCacheMB=48.0 maxMergeSizeMB=4.0)),segFN=segments_1,generation=1,filenames=[segments_1]
[junit4:junit4]   2> 11916 T1849 C177 P54957 oasc.SolrDeletionPolicy.updateCommits newest commit = 1[segments_1]
[junit4:junit4]   2> 11917 T1907 oasc.SolrConfig.<init> Loaded SolrConfig: solrconfig.xml
[junit4:junit4]   2> 11921 T1849 C177 P54957 oasc.SolrDeletionPolicy.onCommit SolrDeletionPolicy.onCommit: commits:num=2
[junit4:junit4]   2> 		commit{dir=RateLimitedDirectoryWrapper(NRTCachingDirectory(org.apache.lucene.store.NIOFSDirectory@/usr/home/hudson/hudson-slave/workspace/Lucene-Solr-Tests-4.x-java7/solr/build/solr-core/test/J0/org.apache.solr.cloud.SyncSliceTest-1356103013916/jetty1/index lockFactory=org.apache.lucene.store.NativeFSLockFactory@38656ebd; maxCacheMB=48.0 maxMergeSizeMB=4.0)),segFN=segments_1,generation=1,filenames=[segments_1]
[junit4:junit4]   2> 		commit{dir=RateLimitedDirectoryWrapper(NRTCachingDirectory(org.apache.lucene.store.NIOFSDirectory@/usr/home/hudson/hudson-slave/workspace/Lucene-Solr-Tests-4.x-java7/solr/build/solr-core/test/J0/org.apache.solr.cloud.SyncSliceTest-1356103013916/jetty1/index lockFactory=org.apache.lucene.store.NativeFSLockFactory@38656ebd; maxCacheMB=48.0 maxMergeSizeMB=4.0)),segFN=segments_2,generation=2,filenames=[segments_2]
[junit4:junit4]   2> 11922 T1849 C177 P54957 oasc.SolrDeletionPolicy.updateCommits newest commit = 2[segments_2]
[junit4:junit4]   2> 11923 T1849 C177 P54957 oasc.CachingDirectoryFactory.close Releasing directory:/usr/home/hudson/hudson-slave/workspace/Lucene-Solr-Tests-4.x-java7/solr/build/solr-core/test/J0/./org.apache.solr.cloud.SyncSliceTest-1356103013916/jetty1
[junit4:junit4]   2> 11924 T1849 C177 P54957 oass.SolrIndexSearcher.<init> Opening Searcher@64f5a807 realtime
[junit4:junit4]   2> 11924 T1849 C177 P54957 oasu.DirectUpdateHandler2.commit end_commit_flush
[junit4:junit4]   2> 11925 T1849 C177 P54957 /update {waitSearcher=true&openSearcher=false&commit=true&commit_end_point=true&wt=javabin&softCommit=false&version=2} {commit=} 0 17
[junit4:junit4]   2> 11927 T1874 C176 P54963 oash.ReplicationHandler.inform Commits will be reserved for  10000
[junit4:junit4]   2> 11927 T1874 C176 P54963 oash.SnapPuller.<init>  No value set for 'pollInterval'. Timer Task not started.
[junit4:junit4]   2> 11930 T1850 C177 P54957 oash.ReplicationHandler.inform Commits will be reserved for  10000
[junit4:junit4]   2> 11931 T1850 C177 P54957 REQ /replication {command=indexversion&wt=javabin&qt=/replication&version=2} status=0 QTime=3 
[junit4:junit4]   2> 11931 T1874 C176 P54963 oash.SnapPuller.fetchLatestIndex Master's generation: 2
[junit4:junit4]   2> 11932 T1874 C176 P54963 oash.SnapPuller.fetchLatestIndex Slave's generation: 1
[junit4:junit4]   2> 11932 T1874 C176 P54963 oash.SnapPuller.fetchLatestIndex Starting replication process
[junit4:junit4]   2> 11934 T1850 C177 P54957 oasc.CachingDirectoryFactory.close Releasing directory:/usr/home/hudson/hudson-slave/workspace/Lucene-Solr-Tests-4.x-java7/solr/build/solr-core/test/J0/./org.apache.solr.cloud.SyncSliceTest-1356103013916/jetty1
[junit4:junit4]   2> 11935 T1850 C177 P54957 oasc.CachingDirectoryFactory.close Releasing directory:/usr/home/hudson/hudson-slave/workspace/Lucene-Solr-Tests-4.x-java7/solr/build/solr-core/test/J0/./org.apache.solr.cloud.SyncSliceTest-1356103013916/jetty1/index
[junit4:junit4]   2> 11936 T1850 C177 P54957 REQ /replication {command=filelist&generation=2&wt=javabin&qt=/replication&version=2} status=0 QTime=2 
[junit4:junit4]   2> 11936 T1874 C176 P54963 oash.SnapPuller.fetchLatestIndex Number of files in latest index in master: 1
[junit4:junit4]   2> 11938 T1874 C176 P54963 oasc.CachingDirectoryFactory.get return new directory for /usr/home/hudson/hudson-slave/workspace/Lucene-Solr-Tests-4.x-java7/solr/build/solr-core/test/J0/./org.apache.solr.cloud.SyncSliceTest-1356103013916/jetty2/index.20121221081705848 forceNew:false
[junit4:junit4]   2> 11939 T1874 C176 P54963 oasc.CachingDirectoryFactory.close Releasing directory:/usr/home/hudson/hudson-slave/workspace/Lucene-Solr-Tests-4.x-java7/solr/build/solr-core/test/J0/./org.apache.solr.cloud.SyncSliceTest-1356103013916/jetty2
[junit4:junit4]   2> 11939 T1874 C176 P54963 oash.SnapPuller.fetchLatestIndex Starting download to RateLimitedDirectoryWrapper(NRTCachingDirectory(org.apache.lucene.store.NIOFSDirectory@/usr/home/hudson/hudson-slave/workspace/Lucene-Solr-Tests-4.x-java7/solr/build/solr-core/test/J0/org.apache.solr.cloud.SyncSliceTest-1356103013916/jetty2/index.20121221081705848 lockFactory=org.apache.lucene.store.NativeFSLockFactory@785d6675; maxCacheMB=48.0 maxMergeSizeMB=4.0)) fullCopy=true
[junit4:junit4]   2> 11943 T1850 C177 P54957 REQ /replication {file=segments_2&command=filecontent&checksum=true&generation=2&qt=/replication&wt=filestream} status=0 QTime=0 
[junit4:junit4]   2> 11945 T1874 C176 P54963 oasc.CachingDirectoryFactory.close Releasing directory:/usr/home/hudson/hudson-slave/workspace/Lucene-Solr-Tests-4.x-java7/solr/build/solr-core/test/J0/./org.apache.solr.cloud.SyncSliceTest-1356103013916/jetty2/index
[junit4:junit4]   2> 11945 T1874 C176 P54963 oash.SnapPuller.fetchLatestIndex Total time taken for download : 0 secs
[junit4:junit4]   2> 11946 T1874 C176 P54963 oash.SnapPuller.modifyIndexProps New index installed. Updating index properties... index=index.20121221081705848
[junit4:junit4]   2> 11947 T1874 C176 P54963 oasc.CachingDirectoryFactory.close Releasing directory:/usr/home/hudson/hudson-slave/workspace/Lucene-Solr-Tests-4.x-java7/solr/build/solr-core/test/J0/./org.apache.solr.cloud.SyncSliceTest-1356103013916/jetty2
[junit4:junit4]   2> 11948 T1874 C176 P54963 oasc.CachingDirectoryFactory.close Releasing directory:/usr/home/hudson/hudson-slave/workspace/Lucene-Solr-Tests-4.x-java7/solr/build/solr-core/test/J0/./org.apache.solr.cloud.SyncSliceTest-1356103013916/jetty2
[junit4:junit4]   2> 11948 T1874 C176 P54963 oasc.SolrCore.getNewIndexDir New index directory detected: old=./org.apache.solr.cloud.SyncSliceTest-1356103013916/jetty2/index/ new=./org.apache.solr.cloud.SyncSliceTest-1356103013916/jetty2/index.20121221081705848
[junit4:junit4]   2> 11952 T1874 C176 P54963 oasc.SolrDeletionPolicy.onInit SolrDeletionPolicy.onInit: commits:num=1
[junit4:junit4]   2> 		commit{dir=RateLimitedDirectoryWrapper(NRTCachingDirectory(org.apache.lucene.store.NIOFSDirectory@/usr/home/hudson/hudson-slave/workspace/Lucene-Solr-Tests-4.x-java7/solr/build/solr-core/test/J0/org.apache.solr.cloud.SyncSliceTest-1356103013916/jetty2/index.20121221081705848 lockFactory=org.apache.lucene.store.NativeFSLockFactory@785d6675; maxCacheMB=48.0 maxMergeSizeMB=4.0)),segFN=segments_2,generation=2,filenames=[segments_2]
[junit4:junit4]   2> 11952 T1874 C176 P54963 oasc.SolrDeletionPolicy.updateCommits newest commit = 2[segments_2]
[junit4:junit4]   2> 11954 T1874 C176 P54963 oasc.CachingDirectoryFactory.close Releasing directory:/usr/home/hudson/hudson-slave/workspace/Lucene-Solr-Tests-4.x-java7/solr/build/solr-core/test/J0/./org.apache.solr.cloud.SyncSliceTest-1356103013916/jetty2
[junit4:junit4]   2> 11954 T1874 C176 P54963 oasu.DefaultSolrCoreState.newIndexWriter Creating new IndexWriter...
[junit4:junit4]   2> 11954 T1874 C176 P54963 oasu.DefaultSolrCoreState.newIndexWriter Waiting until IndexWriter is unused... core=collection1
[junit4:junit4]   2> 11955 T1874 C176 P54963 oasu.DefaultSolrCoreState.newIndexWriter Rollback old IndexWriter... core=collection1
[junit4:junit4]   2> 11956 T1874 C176 P54963 oasc.CachingDirectoryFactory.close Releasing directory:/usr/home/hudson/hudson-slave/workspace/Lucene-Solr-Tests-4.x-java7/solr/build/solr-core/test/J0/./org.apache.solr.cloud.SyncSliceTest-1356103013916/jetty2/index.20121221081705848
[junit4:junit4]   2> 11956 T1874 C176 P54963 oasc.CachingDirectoryFactory.close Releasing directory:/usr/home/hudson/hudson-slave/workspace/Lucene-Solr-Tests-4.x-java7/solr/build/solr-core/test/J0/./org.apache.solr.cloud.SyncSliceTest-1356103013916/jetty2
[junit4:junit4]   2> 11960 T1874 C176 P54963 oasc.SolrDeletionPolicy.onInit SolrDeletionPolicy.onInit: commits:num=1
[junit4:junit4]   2> 		commit{dir=RateLimitedDirectoryWrapper(NRTCachingDirectory(org.apache.lucene.store.NIOFSDirectory@/usr/home/hudson/hudson-slave/workspace/Lucene-Solr-Tests-4.x-java7/solr/build/solr-core/test/J0/org.apache.solr.cloud.SyncSliceTest-1356103013916/jetty2/index.20121221081705848 lockFactory=org.apache.lucene.store.NativeFSLockFactory@785d6675; maxCacheMB=48.0 maxMergeSizeMB=4.0)),segFN=segments_2,generation=2,filenames=[segments_2]
[junit4:junit4]   2> 11960 T1874 C176 P54963 oasc.SolrDeletionPolicy.updateCommits newest commit = 2[segments_2]
[junit4:junit4]   2> 11961 T1874 C176 P54963 oasu.DefaultSolrCoreState.newIndexWriter New IndexWriter is ready to be used.
[junit4:junit4]   2> 11961 T1874 C176 P54963 oasc.CachingDirectoryFactory.close Releasing directory:/usr/home/hudson/hudson-slave/workspace/Lucene-Solr-Tests-4.x-java7/solr/build/solr-core/test/J0/./org.apache.solr.cloud.SyncSliceTest-1356103013916/jetty2
[junit4:junit4]   2> 11962 T1874 C176 P54963 oass.SolrIndexSearcher.<init> Opening Searcher@54310929 main
[junit4:junit4]   2> 11963 T1873 oasc.SolrCore.registerSearcher [collection1] Registered new searcher Searcher@54310929 main{StandardDirectoryReader(segments_2:1:nrt)}
[junit4:junit4]   2> 11964 T1873 oasc.CachingDirectoryFactory.close Releasing directory:/usr/home/hudson/hudson-slave/workspace/Lucene-Solr-Tests-4.x-java7/solr/build/solr-core/test/J0/./org.apache.solr.cloud.SyncSliceTest-1356103013916/jetty2/index
[junit4:junit4]   2> 11964 T1874 C176 P54963 oasu.DirectUpdateHandler2.commit start commit{flags=0,_version_=0,optimize=false,openSearcher=false,waitSearcher=false,expungeDeletes=false,softCommit=false}
[junit4:junit4]   2> 11968 T1874 C176 P54963 oasc.SolrDeletionPolicy.onCommit SolrDeletionPolicy.onCommit: commits:num=2
[junit4:junit4]   2> 		commit{dir=RateLimitedDirectoryWrapper(NRTCachingDirectory(org.apache.lucene.store.NIOFSDirectory@/usr/home/hudson/hudson-slave/workspace/Lucene-Solr-Tests-4.x-java7/solr/build/solr-core/test/J0/org.apache.solr.cloud.SyncSliceTest-1356103013916/jetty2/index.20121221081705848 lockFactory=org.apache.lucene.store.NativeFSLockFactory@785d6675; maxCacheMB=48.0 maxMergeSizeMB=4.0)),segFN=segments_2,generation=2,filenames=[segments_2]
[junit4:junit4]   2> 		commit{dir=RateLimitedDirectoryWrapper(NRTCachingDirectory(org.apache.lucene.store.NIOFSDirectory@/usr/home/hudson/hudson-slave/workspace/Lucene-Solr-Tests-4.x-java7/solr/build/solr-core/test/J0/org.apache.solr.cloud.SyncSliceTest-1356103013916/jetty2/index.20121221081705848 lockFactory=org.apache.lucene.store.NativeFSLockFactory@785d6675; maxCacheMB=48.0 maxMergeSizeMB=4.0)),segFN=segments_3,generation=3,filenames=[segments_3]
[junit4:junit4]   2> 11968 T1874 C176 P54963 oasc.SolrDeletionPolicy.updateCommits newest commit = 3[segments_3]
[junit4:junit4]   2> 11970 T1874 C176 P54963 oasc.CachingDirectoryFactory.close Releasing directory:/usr/home/hudson/hudson-slave/workspace/Lucene-Solr-Tests-4.x-java7/solr/build/solr-core/test/J0/./org.apache.solr.cloud.SyncSliceTest-1356103013916/jetty2
[junit4:junit4]   2> 11970 T1874 C176 P54963 oasu.DirectUpdateHandler2.commit end_commit_flush
[junit4:junit4]   2> 11970 T1874 C176 P54963 oasc.CachingDirectoryFactory.close Releasing directory:/usr/home/hudson/hudson-slave/workspace/Lucene-Solr-Tests-4.x-java7/solr/build/solr-core/test/J0/./org.apache.solr.cloud.SyncSliceTest-1356103013916/jetty2/index.20121221081705848
[junit4:junit4]   2> 11971 T1874 C176 P54963 oasc.CachingDirectoryFactory.close Releasing directory:/usr/home/hudson/hudson-slave/workspace/Lucene-Solr-Tests-4.x-java7/solr/build/solr-core/test/J0/./org.apache.solr.cloud.SyncSliceTest-1356103013916/jetty2/index
[junit4:junit4]   2> 11971 T1874 C176 P54963 oasc.RecoveryStrategy.replay No replay needed. core=collection1
[junit4:junit4]   2> 11971 T1874 C176 P54963 oasc.RecoveryStrategy.doRecovery Replication Recovery was successful - registering as Active. core=collection1
[junit4:junit4]   2> 11972 T1874 C176 P54963 oasc.ZkController.publish publishing core=collection1 state=active
[junit4:junit4]   2> 11972 T1874 C176 P54963 oasc.ZkController.publish numShards not found on descriptor - reading it from system property
[junit4:junit4]   2> 11973 T1874 C176 P54963 oasc.RecoveryStrategy.doRecovery Finished recovery process. core=collection1
[junit4:junit4]   2> 11976 T1838 oascc.ZkStateReader.updateClusterState Updating cloud state from ZooKeeper... 
[junit4:junit4]   2> 11977 T1838 oasc.Overseer$ClusterStateUpdater.updateState Update state numShards=1 message={
[junit4:junit4]   2> 	  "operation":"state",
[junit4:junit4]   2> 	  "numShards":"1",
[junit4:junit4]   2> 	  "shard":"shard1",
[junit4:junit4]   2> 	  "roles":null,
[junit4:junit4]   2> 	  "state":"active",
[junit4:junit4]   2> 	  "core":"collection1",
[junit4:junit4]   2> 	  "collection":"collection1",
[junit4:junit4]   2> 	  "node_name":"127.0.0.1:54963_jjj",
[junit4:junit4]   2> 	  "base_url":"http://127.0.0.1:54963/jjj"}
[junit4:junit4]   2> 11987 T1837 oascc.ZkStateReader$2.process A cluster state change: WatchedEvent state:SyncConnected type:NodeDataChanged path:/clusterstate.json, has occurred - updating... (live nodes size: 5)
[junit4:junit4]   2> 11987 T1843 oascc.ZkStateReader$2.process A cluster state change: WatchedEvent state:SyncConnected type:NodeDataChanged path:/clusterstate.json, has occurred - updating... (live nodes size: 5)
[junit4:junit4]   2> 11987 T1888 oascc.ZkStateReader$2.process A cluster state change: WatchedEvent state:SyncConnected type:NodeDataChanged path:/clusterstate.json, has occurred - updating... (live nodes size: 5)
[junit4:junit4]   2> 11987 T1871 oascc.ZkStateReader$2.process A cluster state change: WatchedEvent state:SyncConnected type:NodeDataChanged path:/clusterstate.json, has occurred - updating... (live nodes size: 5)
[junit4:junit4]   2> 11987 T1856 oascc.ZkStateReader$2.process A cluster state change: WatchedEvent state:SyncConnected type:NodeDataChanged path:/clusterstate.json, has occurred - updating... (live nodes size: 5)
[junit4:junit4]   2> 12018 T1906 oascc.ZkStateReader$2.process A cluster state change: WatchedEvent state:SyncConnected type:NodeDataChanged path:/clusterstate.json, has occurred - updating... (live nodes size: 5)
[junit4:junit4]   2> 12018 T1907 oass.IndexSchema.readSchema Reading Solr Schema
[junit4:junit4]   2> 12037 T1907 oass.IndexSchema.readSchema Schema name=test
[junit4:junit4]   2> 12674 T1907 oass.OpenExchangeRatesOrgProvider.init Initialized with rates=open-exchange-rates.json, refreshInterval=1440.
[junit4:junit4]   2> 12686 T1907 oass.IndexSchema.readSchema default search field in schema is text
[junit4:junit4]   2> 12691 T1907 oass.IndexSchema.readSchema unique key field: id
[junit4:junit4]   2> 12706 T1907 oass.FileExchangeRateProvider.reload Reloading exchange rates from file currency.xml
[junit4:junit4]   2> 12711 T1907 oass.FileExchangeRateProvider.reload Reloading exchange rates from file currency.xml
[junit4:junit4]   2> 12716 T1907 oass.OpenExchangeRatesOrgProvider.reload Reloading exchange rates from open-exchange-rates.json
[junit4:junit4]   2> 12718 T1907 oass.OpenExchangeRatesOrgProvider.reload Reloading exchange rates from open-exchange-rates.json
[junit4:junit4]   2> 12719 T1907 oasc.SolrCore.<init> [collection1] Opening new SolrCore at /usr/home/hudson/hudson-slave/workspace/Lucene-Solr-Tests-4.x-java7/solr/build/solr-core/test/J0/./org.apache.solr.cloud.SyncSliceTest-jetty4-1356103025320/collection1/, dataDir=./org.apache.solr.cloud.SyncSliceTest-1356103013916/jetty4/
[junit4:junit4]   2> 12720 T1907 oasc.JmxMonitoredMap.<init> JMX monitoring is enabled. Adding Solr mbeans to JMX Server: com.sun.jmx.mbeanserver.JmxMBeanServer@26058825
[junit4:junit4]   2> 12720 T1907 oasc.SolrCore.initDirectoryFactory solr.NRTCachingDirectoryFactory
[junit4:junit4]   2> 12721 T1907 oasc.CachingDirectoryFactory.get return new directory for /usr/home/hudson/hudson-slave/workspace/Lucene-Solr-Tests-4.x-java7/solr/build/solr-core/test/J0/./org.apache.solr.cloud.SyncSliceTest-1356103013916/jetty4 forceNew:false
[junit4:junit4]   2> 12722 T1907 oasc.CachingDirectoryFactory.close Releasing directory:/usr/home/hudson/hudson-slave/workspace/Lucene-Solr-Tests-4.x-java7/solr/build/solr-core/test/J0/./org.apache.solr.cloud.SyncSliceTest-1356103013916/jetty4
[junit4:junit4]   2> 12723 T1907 oasc.SolrCore.getNewIndexDir New index directory detected: old=null new=./org.apache.solr.cloud.SyncSliceTest-1356103013916/jetty4/index/
[junit4:junit4]   2> 12724 T1907 oasc.SolrCore.initIndex WARNING [collection1] Solr index directory './org.apache.solr.cloud.SyncSliceTest-1356103013916/jetty4/index' doesn't exist. Creating new index...
[junit4:junit4]   2> 12724 T1907 oasc.CachingDirectoryFactory.get return new directory for /usr/home/hudson/hudson-slave/workspace/Lucene-Solr-Tests-4.x-java7/solr/build/solr-core/test/J0/./org.apache.solr.cloud.SyncSliceTest-1356103013916/jetty4/index forceNew:false
[junit4:junit4]   2> 12754 T1907 oasc.SolrDeletionPolicy.onCommit SolrDeletionPolicy.onCommit: commits:num=1
[junit4:junit4]   2> 		commit{dir=RateLimitedDirectoryWrapper(NRTCachingDirectory(org.apache.lucene.store.NIOFSDirectory@/usr/home/hudson/hudson-slave/workspace/Lucene-Solr-Tests-4.x-java7/solr/build/solr-core/test/J0/org.apache.solr.cloud.SyncSliceTest-1356103013916/jetty4/index lockFactory=org.apache.lucene.store.NativeFSLockFactory@4b882bdb; maxCacheMB=48.0 maxMergeSizeMB=4.0)),segFN=segments_1,generation=1,filenames=[segments_1]
[junit4:junit4]   2> 12755 T1907 oasc.SolrDeletionPolicy.updateCommits newest commit = 1[segments_1]
[junit4:junit4]   2> 12756 T1907 oasc.CachingDirectoryFactory.close Releasing directory:/usr/home/hudson/hudson-slave/workspace/Lucene-Solr-Tests-4.x-java7/solr/build/solr-core/test/J0/./org.apache.solr.cloud.SyncSliceTest-1356103013916/jetty4/index
[junit4:junit4]   2> 12756 T1907 oasc.SolrCore.initWriters created xml: solr.XMLResponseWriter
[junit4:junit4]   2> 12759 T1907 oasup.UpdateRequestProcessorChain.init inserting DistributedUpdateProcessorFactory into updateRequestProcessorChain "dedupe"
[junit4:junit4]   2> 12759 T1907 oasup.UpdateRequestProcessorChain.init inserting DistributedUpdateProcessorFactory into updateRequestProcessorChain "dedupe-allfields"
[junit4:junit4]   2> 12760 T1907 oasup.UpdateRequestProcessorChain.init inserting DistributedUpdateProcessorFactory into updateRequestProcessorChain "stored_sig"
[junit4:junit4]   2> 12761 T1907 oasup.UpdateRequestProcessorChain.init inserting DistributedUpdateProcessorFactory into updateRequestProcessorChain "uniq-fields"
[junit4:junit4]   2> 12761 T1907 oasup.UpdateRequestProcessorChain.init inserting DistributedUpdateProcessorFactory into updateRequestProcessorChain "distrib-dup-test-chain-implicit"
[junit4:junit4]   2> 12762 T1907 oasc.RequestHandlers.initHandlersFromConfig adding lazy requestHandler: solr.ReplicationHandler
[junit4:junit4]   2> 12762 T1907 oasc.RequestHandlers.initHandlersFromConfig created /replication: solr.ReplicationHandler
[junit4:junit4]   2> 12764 T1907 oasc.RequestHandlers.initHandlersFromConfig created standard: solr.StandardRequestHandler
[junit4:junit4]   2> 12765 T1907 oasc.RequestHandlers.initHandlersFromConfig created /get: solr.RealTimeGetHandler
[junit4:junit4]   2> 12766 T1907 oasc.RequestHandlers.initHandlersFromConfig created dismax: solr.SearchHandler
[junit4:junit4]   2> 12767 T1907 oasc.RequestHandlers.initHandlersFromConfig created mock: org.apache.solr.core.MockQuerySenderListenerReqHandler
[junit4:junit4]   2> 12768 T1907 oasc.RequestHandlers.initHandlersFromConfig created /admin/: org.apache.solr.handler.admin.AdminHandlers
[junit4:junit4]   2> 12769 T1907 oasc.RequestHandlers.initHandlersFromConfig created defaults: solr.StandardRequestHandler
[junit4:junit4]   2> 12769 T1907 oasc.RequestHandlers.initHandlersFromConfig adding lazy requestHandler: solr.StandardRequestHandler
[junit4:junit4]   2> 12770 T1907 oasc.RequestHandlers.initHandlersFromConfig created lazy: solr.StandardRequestHandler
[junit4:junit4]   2> 12771 T1907 oasc.RequestHandlers.initHandlersFromConfig created /update: solr.UpdateRequestHandler
[junit4:junit4]   2> 12772 T1907 oasc.RequestHandlers.initHandlersFromConfig created /terms: org.apache.solr.handler.component.SearchHandler
[junit4:junit4]   2> 12773 T1907 oasc.RequestHandlers.initHandlersFromConfig created spellCheckCompRH: org.apache.solr.handler.component.SearchHandler
[junit4:junit4]   2> 12774 T1907 oasc.RequestHandlers.initHandlersFromConfig created spellCheckCompRH_Direct: org.apache.solr.handler.component.SearchHandler
[junit4:junit4]   2> 12775 T1907 oasc.RequestHandlers.initHandlersFromConfig created spellCheckWithWordbreak: org.apache.solr.handler.component.SearchHandler
[junit4:junit4]   2> 12776 T1907 oasc.RequestHandlers.initHandlersFromConfig created spellCheckWithWordbreak_Direct: org.apache.solr.handler.component.SearchHandler
[junit4:junit4]   2> 12777 T1907 oasc.RequestHandlers.initHandlersFromConfig created spellCheckCompRH1: org.apache.solr.handler.component.SearchHandler
[junit4:junit4]   2> 12779 T1907 oasc.RequestHandlers.initHandlersFromConfig created mltrh: org.apache.solr.handler.component.SearchHandler
[junit4:junit4]   2> 12780 T1907 oasc.RequestHandlers.initHandlersFromConfig created tvrh: org.apache.solr.handler.component.SearchHandler
[junit4:junit4]   2> 12781 T1907 oasc.RequestHandlers.initHandlersFromConfig created /mlt: solr.MoreLikeThisHandler
[junit4:junit4]   2> 12782 T1907 oasc.RequestHandlers.initHandlersFromConfig created /debug/dump: solr.DumpRequestHandler
[junit4:junit4]   2> 12796 T1907 oashl.XMLLoader.init xsltCacheLifetimeSeconds=60
[junit4:junit4]   2> 12801 T1907 oasc.SolrCore.initDeprecatedSupport WARNING solrconfig.xml uses deprecated <admin/gettableFiles>, Please update your config to use the ShowFileRequestHandler.
[junit4:junit4]   2> 12803 T1907 oasc.SolrCore.initDeprecatedSupport WARNING adding ShowFileRequestHandler with hidden files: [SCHEMA.XML, OLD_SYNONYMS.TXT, STOPWORDS.TXT, PROTWORDS.TXT, OPEN-EXCHANGE-RATES.JSON, SYNONYMS.TXT, CURRENCY.XML, MAPPING-ISOLATIN1ACCENT.TXT]
[junit4:junit4]   2> 12806 T1907 oasc.CachingDirectoryFactory.close Releasing directory:/usr/home/hudson/hudson-slave/workspace/Lucene-Solr-Tests-4.x-java7/solr/build/solr-core/test/J0/./org.apache.solr.cloud.SyncSliceTest-1356103013916/jetty4
[junit4:junit4]   2> 12808 T1907 oass.SolrIndexSearcher.<init> Opening Searcher@5f7cef3f main
[junit4:junit4]   2> 12809 T1907 oasu.CommitTracker.<init> Hard AutoCommit: disabled
[junit4:junit4]   2> 12810 T1907 oasu.CommitTracker.<init> Soft AutoCommit: disabled
[junit4:junit4]   2> 12811 T1907 oashc.SpellCheckComponent.inform Initializing spell checkers
[junit4:junit4]   2> 12826 T1907 oass.DirectSolrSpellChecker.init init: {name=direct,classname=DirectSolrSpellChecker,field=lowerfilt,minQueryLength=3}
[junit4:junit4]   2> 12887 T1907 oasc.ZkController.publish publishing core=collection1 state=down
[junit4:junit4]   2> 12887 T1907 oasc.ZkController.publish numShards not found on descriptor - reading it from system property
[junit4:junit4]   2> 12890 T1909 oasc.SolrCore.registerSearcher [collection1] Registered new searcher Searcher@5f7cef3f main{StandardDirectoryReader(segments_1:1)}
[junit4:junit4]   2> 12995 T1838 oascc.ZkStateReader.updateClusterState Updating cloud state from ZooKeeper... 
[junit4:junit4]   2> 12996 T1838 oasc.Overseer$ClusterStateUpdater.updateState Update state numShards=1 message={
[junit4:junit4]   2> 	  "operation":"state",
[junit4:junit4]   2> 	  "numShards":"1",
[junit4:junit4]   2> 	  "shard":null,
[junit4:junit4]   2> 	  "roles":null,
[junit4:junit4]   2> 	  "state":"down",
[junit4:junit4]   2> 	  "core":"collection1",
[junit4:junit4]   2> 	  "collection":"collection1",
[junit4:junit4]   2> 	  "node_name":"127.0.0.1:54980_jjj",
[junit4:junit4]   2> 	  "base_url":"http://127.0.0.1:54980/jjj"}
[junit4:junit4]   2> 12996 T1838 oasc.Overseer$ClusterStateUpdater.updateState Collection already exists with numShards=1
[junit4:junit4]   2> 12996 T1838 oasc.Overseer$ClusterStateUpdater.updateState Assigning new node to shard shard=shard1
[junit4:junit4]   2> 13008 T1888 oascc.ZkStateReader$2.process A cluster state change: WatchedEvent state:SyncConnected type:NodeDataChanged path:/clusterstate.json, has occurred - updating... (live nodes size: 5)
[junit4:junit4]   2> 13008 T1837 oascc.ZkStateReader$2.process A cluster state change: WatchedEvent state:SyncConnected type:NodeDataChanged path:/clusterstate.json, has occurred - updating... (live nodes size: 5)
[junit4:junit4]   2> 13008 T1843 oascc.ZkStateReader$2.process A cluster state change: WatchedEvent state:SyncConnected type:NodeDataChanged path:/clusterstate.json, has occurred - updating... (live nodes size: 5)
[junit4:junit4]   2> 13008 T1856 oascc.ZkStateReader$2.process A cluster state change: WatchedEvent state:SyncConnected type:NodeDataChanged path:/clusterstate.json, has occurred - updating... (live nodes size: 5)
[junit4:junit4]   2> 13008 T1871 oascc.ZkStateReader$2.process A cluster state change: WatchedEvent state:SyncConnected type:NodeDataChanged path:/clusterstate.json, has occurred - updating... (live nodes size: 5)
[junit4:junit4]   2> 13008 T1906 oascc.ZkStateReader$2.process A cluster state change: WatchedEvent state:SyncConnected type:NodeDataChanged path:/clusterstate.json, has occurred - updating... (live nodes size: 5)
[junit4:junit4]   2> 13890 T1907 oasc.CoreContainer.registerCore registering core: collection1
[junit4:junit4]   2> 13890 T1907 oasc.ZkController.register Register replica - core:collection1 address:http://127.0.0.1:54980/jjj collection:collection1 shard:shard1
[junit4:junit4]   2> 13897 T1907 oasc.ZkController.register We are http://127.0.0.1:54980/jjj/collection1/ and leader is http://127.0.0.1:54957/jjj/collection1/
[junit4:junit4]   2> 13897 T1907 oasc.ZkController.register No LogReplay needed for core=collection1 baseURL=http://127.0.0.1:54980/jjj
[junit4:junit4]   2> 13898 T1907 oasc.ZkController.checkRecovery Core needs to recover:collection1
[junit4:junit4]   2> 13898 T1907 oasu.DefaultSolrCoreState.doRecovery Running recovery - first canceling any ongoing recovery
[junit4:junit4]   2> ASYNC  NEW_CORE C179 name=collection1 org.apache.solr.core.SolrCore@722c8e53 url=http://127.0.0.1:54980/jjj/collection1 node=127.0.0.1:54980_jjj C179_STATE=coll:collection1 core:collection1 props:{shard=null, roles=null, state=down, core=collection1, collection=collection1, node_name=127.0.0.1:54980_jjj, base_url=http://127.0.0.1:54980/jjj}
[junit4:junit4]   2> 13899 T1910 C179 P54980 oasc.RecoveryStrategy.run Starting recovery process.  core=collection1 recoveringAfterStartup=true
[junit4:junit4]   2> 13899 T1907 oascc.ZkStateReader.updateClusterState Updating cloud state from ZooKeeper... 
[junit4:junit4]   2> 13900 T1910 C179 P54980 oasc.RecoveryStrategy.doRecovery ###### startupVersions=[]
[junit4:junit4]   2> 13901 T1910 C179 P54980 oasc.ZkController.publish publishing core=collection1 state=recovering
[junit4:junit4]   2> 13901 T1910 C179 P54980 oasc.ZkController.publish numShards not found on descriptor - reading it from system property
[junit4:junit4]   2> 13901 T1815 oass.SolrDispatchFilter.init user.dir=/usr/home/hudson/hudson-slave/workspace/Lucene-Solr-Tests-4.x-java7/solr/build/solr-core/test/J0
[junit4:junit4]   2> 13902 T1910 C179 P54980 oasc.RecoveryStrategy.doRecovery Attempting to PeerSync from http://127.0.0.1:54957/jjj/collection1/ core=collection1 - recoveringAfterStartup=true
[junit4:junit4]   2> 13903 T1910 C179 P54980 oasu.PeerSync.sync PeerSync: core=collection1 url=http://127.0.0.1:54980/jjj START replicas=[http://127.0.0.1:54957/jjj/collection1/] nUpdates=100
[junit4:junit4]   2> 13902 T1815 oass.SolrDispatchFilter.init SolrDispatchFilter.init() done
[junit4:junit4]   2> 13903 T1910 C179 P54980 oasu.PeerSync.sync WARNING no frame of reference to tell of we've missed updates
[junit4:junit4]   2> 13904 T1910 C179 P54980 oasc.RecoveryStrategy.doRecovery PeerSync Recovery was not successful - trying replication. core=collection1
[junit4:junit4]   2> 13903 T1815 oascsi.HttpClientUtil.createClient Creating new http client, config:maxConnections=128&maxConnectionsPerHost=32&followRedirects=false
[junit4:junit4]   2> 13904 T1910 C179 P54980 oasc.RecoveryStrategy.doRecovery Starting Replication Recovery. core=collection1
[junit4:junit4]   2> 13904 T1910 C179 P54980 oascsi.HttpClientUtil.createClient Creating new http client, config:maxConnections=128&maxConnectionsPerHost=32&followRedirects=false
[junit4:junit4]   2> 13906 T1846 C177 P54957 REQ /get {distrib=false&qt=/get&wt=javabin&version=2&getVersions=100} status=0 QTime=0 
[junit4:junit4]   2> 13920 T1815 oascc.ZkStateReader.updateClusterState Updating cloud state from ZooKeeper... 
[junit4:junit4]   2> 13922 T1815 oasc.AbstractFullDistribZkTestBase.waitForThingsToLevelOut Wait for recoveries to finish - wait 15 for each attempt
[junit4:junit4]   2> 13923 T1815 oasc.AbstractDistribZkTestBase.waitForRecoveriesToFinish Wait for recoveries to finish - collection: collection1 failOnTimeout:true timeout (sec):15
[junit4:junit4]   2> 13924 T1815 oascc.ZkStateReader.updateClusterState Updating cloud state from ZooKeeper... 
[junit4:junit4]   2> 14015 T1838 oascc.ZkStateReader.updateClusterState Updating cloud state from ZooKeeper... 
[junit4:junit4]   2> 14016 T1838 oasc.Overseer$ClusterStateUpdater.updateState Update state numShards=1 message={
[junit4:junit4]   2> 	  "operation":"state",
[junit4:junit4]   2> 	  "numShards":"1",
[junit4:junit4]   2> 	  "shard":"shard1",
[junit4:junit4]   2> 	  "roles":null,
[junit4:junit4]   2> 	  "state":"recovering",
[junit4:junit4]   2> 	  "core":"collection1",
[junit4:junit4]   2> 	  "collection":"collection1",
[junit4:junit4]   2> 	  "node_name":"127.0.0.1:54980_jjj",
[junit4:junit4]   2> 	  "base_url":"http://127.0.0.1:54980/jjj"}
[junit4:junit4]   2> 14031 T1837 oascc.ZkStateReader$2.process A cluster state change: WatchedEvent state:SyncConnected type:NodeDataChanged path:/clusterstate.json, has occurred - updating... (live nodes size: 5)
[junit4:junit4]   2> 14031 T1906 oascc.ZkStateReader$2.process A cluster state change: WatchedEvent state:SyncConnected type:NodeDataChanged path:/clusterstate.json, has occurred - updating... (live nodes size: 5)
[junit4:junit4]   2> 14031 T1843 oascc.ZkStateReader$2.process A cluster state change: WatchedEvent state:SyncConnected type:NodeDataChanged path:/clusterstate.json, has occurred - updating... (live nodes size: 5)
[junit4:junit4]   2> 14031 T1871 oascc.ZkStateReader$2.process A cluster state change: WatchedEvent state:SyncConnected type:NodeDataChanged path:/clusterstate.json, has occurred - updating... (live nodes size: 5)
[junit4:junit4]   2> 14031 T1856 oascc.ZkStateReader$2.process A cluster state change: WatchedEvent state:SyncConnected type:NodeDataChanged path:/clusterstate.json, has occurred - updating... (live nodes size: 5)
[junit4:junit4]   2> 14031 T1888 oascc.ZkStateReader$2.process A cluster state change: WatchedEvent state:SyncConnected type:NodeDataChanged path:/clusterstate.json, has occurred - updating... (live nodes size: 5)
[junit4:junit4]   2>  C178_STATE=coll:collection1 core:collection1 props:{shard=shard1, roles=null, state=recovering, core=collection1, collection=collection1, node_name=127.0.0.1:54971_jjj, base_url=http://127.0.0.1:54971/jjj}
[junit4:junit4]   2> 14412 T1891 C178 P54971 oasc.RecoveryStrategy.doRecovery Begin buffering updates. core=collection1
[junit4:junit4]   2> 14412 T1891 C178 P54971 oasu.UpdateLog.bufferUpdates Starting to buffer updates. FSUpdateLog{state=ACTIVE, tlog=null}
[junit4:junit4]   2> 14412 T1891 C178 P54971 oasc.RecoveryStrategy.replicate Attempting to replicate from http://127.0.0.1:54957/jjj/collection1/. core=collection1
[junit4:junit4]   2> 14413 T1891 C178 P54971 oascsi.HttpClientUtil.createClient Creating new http client, config:maxConnections=128&maxConnectionsPerHost=32&followRedirects=false
[junit4:junit4]   2> 14424 T1852 C177 P54957 oasu.DirectUpdateHandler2.commit start commit{flags=0,_version_=0,optimize=false,openSearcher=false,waitSearcher=true,expungeDeletes=false,softCommit=false}
[junit4:junit4]   2> 14429 T1852 C177 P54957 oasc.SolrDeletionPolicy.onCommit SolrDeletionPolicy.onCommit: commits:num=2
[junit4:junit4]   2> 		commit{dir=RateLimitedDirectoryWrapper(NRTCachingDirectory(org.apache.lucene.store.NIOFSDirectory@/usr/home/hudson/hudson-slave/workspace/Lucene-Solr-Tests-4.x-java7/solr/build/solr-core/test/J0/org.apache.solr.cloud.SyncSliceTest-1356103013916/jetty1/index lockFactory=org.apache.lucene.store.NativeFSLockFactory@38656ebd; maxCacheMB=48.0 maxMergeSizeMB=4.0)),segFN=segments_2,generation=2,filenames=[segments_2]
[junit4:junit4]   2> 		commit{dir=RateLimitedDirectoryWrapper(NRTCachingDirectory(org.apache.lucene.store.NIOFSDirectory@/usr/home/hudson/hudson-slave/workspace/Lucene-Solr-Tests-4.x-java7/solr/build/solr-core/test/J0/org.apache.solr.cloud.SyncSliceTest-1356103013916/jetty1/index lockFactory=org.apache.lucene.store.NativeFSLockFactory@38656ebd; maxCacheMB=48.0 maxMergeSizeMB=4.0)),segFN=segments_3,generation=3,filenames=[segments_3]
[junit4:junit4]   2> 14430 T1852 C177 P54957 oasc.SolrDeletionPolicy.updateCommits newest commit = 3[segments_3]
[junit4:junit4]   2> 14431 T1852 C177 P54957 oasc.CachingDirectoryFactory.close Releasing directory:/usr/home/hudson/hudson-slave/workspace/Lucene-Solr-Tests-4.x-java7/solr/build/solr-core/test/J0/./org.apache.solr.cloud.SyncSliceTest-1356103013916/jetty1
[junit4:junit4]   2> 14432 T1852 C177 P54957 oasu.DirectUpdateHandler2.commit end_commit_flush
[junit4:junit4]   2> 14433 T1852 C177 P54957 /update {waitSearcher=true&openSearcher=false&commit=true&commit_end_point=true&wt=javabin&softCommit=false&version=2} {commit=} 0 9
[junit4:junit4]   2> 14434 T1891 C178 P54971 oash.ReplicationHandler.inform Commits will be reserved for  10000
[junit4:junit4]   2> 14435 T1891 C178 P54971 oash.SnapPuller.<init>  No value set for 'pollInterval'. Timer Task not started.
[junit4:junit4]   2> 14437 T1850 C177 P54957 REQ /replication {command=indexversion&wt=javabin&qt=/replication&version=2} status=0 QTime=0 
[junit4:junit4]   2> 14438 T1891 C178 P54971 oash.SnapPuller.fetchLatestIndex Master's generation: 3
[junit4:junit4]   2> 14438 T1891 C178 P54971 oash.SnapPuller.fetchLatestIndex Slave's generation: 1
[junit4:junit4]   2> 14439 T1891 C178 P54971 oash.SnapPuller.fetchLatestIndex Starting replication process
[junit4:junit4]   2> 14441 T1850 C177 P54957 oasc.CachingDirectoryFactory.close Releasing directory:/usr/home/hudson/hudson-slave/workspace/Lucene-Solr-Tests-4.x-java7/solr/build/solr-core/test/J0/./org.apache.solr.cloud.SyncSliceTest-1356103013916/jetty1
[junit4:junit4]   2> 14442 T1850 C177 P54957 oasc.CachingDirectoryFactory.close Releasing directory:/usr/home/hudson/hudson-slave/workspace/Lucene-Solr-Tests-4.x-java7/solr/build/solr-core/test/J0/./org.apache.solr.cloud.SyncSliceTest-1356103013916/jetty1/index
[junit4:junit4]   2> 14443 T1850 C177 P54957 REQ /replication {command=filelist&generation=3&wt=javabin&qt=/replication&version=2} status=0 QTime=2 
[junit4:junit4]   2> 14443 T1891 C178 P54971 oash.SnapPuller.fetchLatestIndex Number of files in latest index in master: 1
[junit4:junit4]   2> 14445 T1891 C178 P54971 oasc.CachingDirectoryFactory.get return new directory for /usr/home/hudson/hudson-slave/workspace/Lucene-Solr-Tests-4.x-java7/solr/build/solr-core/test/J0/./org.apache.solr.cloud.SyncSliceTest-1356103013916/jetty3/index.20121221081708355 forceNew:false
[junit4:junit4]   2> 14445 T1891 C178 P54971 oasc.CachingDirectoryFactory.close Releasing directory:/usr/home/hudson/hudson-slave/workspace/Lucene-Solr-Tests-4.x-java7/solr/build/solr-core/test/J0/./org.apache.solr.cloud.SyncSliceTest-1356103013916/jetty3
[junit4:junit4]   2> 14446 T1891 C178 P54971 oash.SnapPuller.fetchLatestIndex Starting download to RateLimitedDirectoryWrapper(NRTCachingDirectory(org.apache.lucene.store.NIOFSDirectory@/usr/home/hudson/hudson-slave/workspace/Lucene-Solr-Tests-4.x-java7/solr/build/solr-core/test/J0/org.apache.solr.cloud.SyncSliceTest-1356103013916/jetty3/index.20121221081708355 lockFactory=org.apache.lucene.store.NativeFSLockFactory@17731c87; maxCacheMB=48.0 maxMergeSizeMB=4.0)) fullCopy=true
[junit4:junit4]   2> 14450 T1850 C177 P54957 REQ /replication {file=segments_3&command=filecontent&checksum=true&generation=3&qt=/replication&wt=filestream} status=0 QTime=0 
[junit4:junit4]   2> 14452 T1891 C178 P54971 oasc.CachingDirectoryFactory.close Releasing directory:/usr/home/hudson/hudson-slave/workspace/Lucene-Solr-Tests-4.x-java7/solr/build/solr-core/test/J0/./org.apache.solr.cloud.SyncSliceTest-1356103013916/jetty3/index
[junit4:junit4]   2> 14452 T1891 C178 P54971 oash.SnapPuller.fetchLatestIndex Total time taken for download : 0 secs
[junit4:junit4]   2> 14453 T1891 C178 P54971 oash.SnapPuller.modifyIndexProps New index installed. Updating index properties... index=index.20121221081708355
[junit4:junit4]   2> 14454 T1891 C178 P54971 oasc.CachingDirectoryFactory.close Releasing directory:/usr/home/hudson/hudson-slave/workspace/Lucene-Solr-Tests-4.x-java7/solr/build/solr-core/test/J0/./org.apache.solr.cloud.SyncSliceTest-1356103013916/jetty3
[junit4:junit4]   2> 14455 T1891 C178 P54971 oasc.CachingDirectoryFactory.close Releasing directory:/usr/home/hudson/hudson-slave/workspace/Lucene-Solr-Tests-4.x-java7/solr/build/solr-core/test/J0/./org.apache.solr.cloud.SyncSliceTest-1356103013916/jetty3
[junit4:junit4]   2> 14455 T1891 C178 P54971 oasc.SolrCore.getNewIndexDir New index directory detected: old=./org.apache.solr.cloud.SyncSliceTest-1356103013916/jetty3/index/ new=./org.apache.solr.cloud.SyncSliceTest-1356103013916/jetty3/index.20121221081708355
[junit4:junit4]   2> 14459 T1891 C178 P54971 oasc.SolrDeletionPolicy.onInit SolrDeletionPolicy.onInit: commits:num=1
[junit4:junit4]   2> 		commit{dir=RateLimitedDirectoryWrapper(NRTCachingDirectory(org.apache.lucene.store.NIOFSDirectory@/usr/home/hudson/hudson-slave/workspace/Lucene-Solr-Tests-4.x-java7/solr/build/solr-core/test/J0/org.apache.solr.cloud.SyncSliceTest-1356103013916/jetty3/index.20121221081708355 lockFactory=org.apache.lucene.store.NativeFSLockFactory@17731c87; maxCacheMB=48.0 maxMergeSizeMB=4.0)),segFN=segments_3,generation=3,filenames=[segments_3]
[junit4:junit4]   2> 14459 T1891 C178 P54971 oasc.SolrDeletionPolicy.updateCommits newest commit = 3[segments_3]
[junit4:junit4]   2> 14461 T1891 C178 P54971 oasc.CachingDirectoryFactory.close Releasing directory:/usr/home/hudson/hudson-slave/workspace/Lucene-Solr-Tests-4.x-java7/solr/build/solr-core/test/J0/./org.apache.solr.cloud.SyncSliceTest-1356103013916/jetty3
[junit4:junit4]   2> 14461 T1891 C178 P54971 oasu.DefaultSolrCoreState.newIndexWriter Creating new IndexWriter...
[junit4:junit4]   2> 14461 T1891 C178 P54971 oasu.DefaultSolrCoreState.newIndexWriter Waiting until IndexWriter is unused... core=collection1
[junit4:junit4]   2> 14462 T1891 C178 P54971 oasu.DefaultSolrCoreState.newIndexWriter Rollback old IndexWriter... core=collection1
[junit4:junit4]   2> 14463 T1891 C178 P54971 oasc.CachingDirectoryFactory.close Releasing directory:/usr/home/hudson/hudson-slave/workspace/Lucene-Solr-Tests-4.x-java7/solr/build/solr-core/test/J0/./org.apache.solr.cloud.SyncSliceTest-1356103013916/jetty3/index.20121221081708355
[junit4:junit4]   2> 14463 T1891 C178 P54971 oasc.CachingDirectoryFactory.close Releasing directory:/usr/home/hudson/hudson-slave/workspace/Lucene-Solr-Tests-4.x-java7/solr/build/solr-core/test/J0/./org.apache.solr.cloud.SyncSliceTest-1356103013916/jetty3
[junit4:junit4]   2> 14467 T1891 C178 P54971 oasc.SolrDeletionPolicy.onInit SolrDeletionPolicy.onInit: commits:num=1
[junit4:junit4]   2> 		commit{dir=RateLimitedDirectoryWrapper(NRTCachingDirectory(org.apache.lucene.store.NIOFSDirectory@/usr/home/hudson/hudson-slave/workspace/Lucene-Solr-Tests-4.x-java7/solr/build/solr-core/test/J0/org.apache.solr.cloud.SyncSliceTest-1356103013916/jetty3/index.20121221081708355 lockFactory=org.apache.lucene.store.NativeFSLockFactory@17731c87; maxCacheMB=48.0 maxMergeSizeMB=4.0)),segFN=segments_3,generation=3,filenames=[segments_3]
[junit4:junit4]   2> 14467 T1891 C178 P54971 oasc.SolrDeletionPolicy.updateCommits newest commit = 3[segments_3]
[junit4:junit4]   2> 14467 T1891 C178 P54971 oasu.DefaultSolrCoreState.newIndexWriter New IndexWriter is ready to be used.
[junit4:junit4]   2> 14468 T1891 C178 P54971 oasc.CachingDirectoryFactory.close Releasing directory:/usr/home/hudson/hudson-slave/workspace/Lucene-Solr-Tests-4.x-java7/solr/build/solr-core/test/J0/./org.apache.solr.cloud.SyncSliceTest-1356103013916/jetty3
[junit4:junit4]   2> 14469 T1891 C178 P54971 oass.SolrIndexSearcher.<init> Opening Searcher@102e4065 main
[junit4:junit4]   2> 14470 T1890 oasc.SolrCore.registerSearcher [collection1] Registered new searcher Searcher@102e4065 main{StandardDirectoryReader(segments_3:1:nrt)}
[junit4:junit4]   2> 14471 T1890 oasc.CachingDirectoryFactory.close Releasing directory:/usr/home/hudson/hudson-slave/workspace/Lucene-Solr-Tests-4.x-java7/solr/build/solr-core/test/J0/./org.apache.solr.cloud.SyncSliceTest-1356103013916/jetty3/index
[junit4:junit4]   2> 14471 T1891 C178 P54971 oasu.DirectUpdateHandler2.commit start commit{flags=0,_version_=0,optimize=false,openSearcher=false,waitSearcher=false,expungeDeletes=false,softCommit=false}
[junit4:junit4]   2> 14474 T1891 C178 P54971 oasc.SolrDeletionPolicy.onCommit SolrDeletionPolicy.onCommit: commits:num=2
[junit4:junit4]   2> 		commit{dir=RateLimitedDirectoryWrapper(NRTCachingDirectory(org.apache.lucene.store.NIOFSDirectory@/usr/home/hudson/hudson-slave/workspace/Lucene-Solr-Tests-4.x-java7/solr/build/solr-core/test/J0/org.apache.solr.cloud.SyncSliceTest-1356103013916/jetty3/index.20121221081708355 lockFactory=org.apache.lucene.store.NativeFSLockFactory@17731c87; maxCacheMB=48.0 maxMergeSizeMB=4.0)),segFN=segments_3,generation=3,filenames=[segments_3]
[junit4:junit4]   2> 		commit{dir=RateLimitedDirectoryWrapper(NRTCachingDirectory(org.apache.lucene.store.NIOFSDirectory@/usr/home/hudson/hudson-slave/workspace/Lucene-Solr-Tests-4.x-java7/solr/build/solr-core/test/J0/org.apache.solr.cloud.SyncSliceTest-1356103013916/jetty3/index.20121221081708355 lockFactory=org.apache.lucene.store.NativeFSLockFactory@17731c87; maxCacheMB=48.0 maxMergeSizeMB=4.0)),segFN=segments_4,generation=4,filenames=[segments_4]
[junit4:junit4]   2> 14475 T1891 C178 P54971 oasc.SolrDeletionPolicy.updateCommits newest commit = 4[segments_4]
[junit4:junit4]   2> 14476 T1891 C178 P54971 oasc.CachingDirectoryFactory.close Releasing directory:/usr/home/hudson/hudson-slave/workspace/Lucene-Solr-Tests-4.x-java7/solr/build/solr-core/test/J0/./org.apache.solr.cloud.SyncSliceTest-1356103013916/jetty3
[junit4:junit4]   2> 14477 T1891 C178 P54971 oasu.DirectUpdateHandler2.commit end_commit_flush
[junit4:junit4]   2> 14477 T1891 C178 P54971 oasc.CachingDirectoryFactory.close Releasing directory:/usr/home/hudson/hudson-slave/workspace/Lucene-Solr-Tests-4.x-java7/solr/build/solr-core/test/J0/./org.apache.solr.cloud.SyncSliceTest-1356103013916/jetty3/index.20121221081708355
[junit4:junit4]   2> 14477 T1891 C178 P54971 oasc.CachingDirectoryFactory.close Releasing directory:/usr/home/hudson/hudson-slave/workspace/Lucene-Solr-Tests-4.x-java7/solr/build/solr-core/test/J0/./org.apache.solr.cloud.SyncSliceTest-1356103013916/jetty3/index
[junit4:junit4]   2> 14478 T1891 C178 P54971 oasc.RecoveryStrategy.replay No replay needed. core=collection1
[junit4:junit4]   2> 14478 T1891 C178 P54971 oasc.RecoveryStrategy.doRecovery Replication Recovery was successful - registering as Active. core=collection1
[junit4:junit4]   2> 14478 T1891 C178 P54971 oasc.ZkController.publish publishing core=collection1 state=active
[junit4:junit4]   2> 14478 T1891 C178 P54971 oasc.ZkController.publish numShards not found on descriptor - reading it from system property
[junit4:junit4]   2> 14485 T1891 C178 P54971 oasc.RecoveryStrategy.doRecovery Finished recovery process. core=collection1
[junit4:junit4]   2> 14536 T1838 oascc.ZkStateReader.updateClusterState Updating cloud state from ZooKeeper... 
[junit4:junit4]   2> 14537 T1838 oasc.Overseer$ClusterStateUpdater.updateState Update state numShards=1 message={
[junit4:junit4]   2> 	  "operation":"state",
[junit4:junit4]   2> 	  "numShards":"1",
[junit4:junit4]   2> 	  "shard":"shard1",
[junit4:junit4]   2> 	  "roles":null,
[junit4:junit4]   2> 	  "state":"active",
[junit4:junit4]   2> 	  "core":"collection1",
[junit4:junit4]   2> 	  "collection":"collection1",
[junit4:junit4]   2> 	  "node_name":"127.0.0.1:54971_jjj",
[junit4:junit4]   2> 	  "base_url":"http://127.0.0.1:54971/jjj"}
[junit4:junit4]   2> 14550 T1888 oascc.ZkStateReader$2.process A cluster state change: WatchedEvent state:SyncConnected type:NodeDataChanged path:/clusterstate.json, has occurred - updating... (live nodes size: 5)
[junit4:junit4]   2> 14550 T1837 oascc.ZkStateReader$2.process A cluster state change: WatchedEvent state:SyncConnected type:NodeDataChanged path:/clusterstate.json, has occurred - updating... (live nodes size: 5)
[junit4:junit4]   2> 14550 T1906 oascc.ZkStateReader$2.process A cluster state change: WatchedEvent state:SyncConnected type:NodeDataChanged path:/clusterstate.json, has occurred - updating... (live nodes size: 5)
[junit4:junit4]   2> 14550 T1856 oascc.ZkStateReader$2.process A cluster state change: WatchedEvent state:SyncConnected type:NodeDataChanged path:/clusterstate.json, has occurred - updating... (live nodes size: 5)
[junit4:junit4]   2> 14550 T1871 oascc.ZkStateReader$2.process A cluster state change: WatchedEvent state:SyncConnected type:NodeDataChanged path:/clusterstate.json, has occurred - updating... (live nodes size: 5)
[junit4:junit4]   2> 14550 T1843 oascc.ZkStateReader$2.process A cluster state change: WatchedEvent state:SyncConnected type:NodeDataChanged path:/clusterstate.json, has occurred - updating... (live nodes size: 5)
[junit4:junit4]   2> 14926 T1815 oascc.ZkStateReader.updateClusterState Updating cloud state from ZooKeeper... 
[junit4:junit4]   2> 15929 T1815 oascc.ZkStateReader.updateClusterState Updating cloud state from ZooKeeper... 
[junit4:junit4]   2>  C179_STATE=coll:collection1 core:collection1 props:{shard=shard1, roles=null, state=recovering, core=collection1, collection=collection1, node_name=127.0.0.1:54980_jjj, base_url=http://127.0.0.1:54980/jjj}
[junit4:junit4]   2> 16923 T1910 C179 P54980 oasc.RecoveryStrategy.doRecovery Begin buffering updates. core=collection1
[junit4:junit4]   2> 16923 T1910 C179 P54980 oasu.UpdateLog.bufferUpdates Starting to buffer updates. FSUpdateLog{state=ACTIVE, tlog=null}
[junit4:junit4]   2> 16924 T1910 C179 P54980 oasc.RecoveryStrategy.replicate Attempting to replicate from http://127.0.0.1:54957/jjj/collection1/. core=collection1
[junit4:junit4]   2> 16924 T1910 C179 P54980 oascsi.HttpClientUtil.createClient Creating new http client, config:maxConnections=128&maxConnectionsPerHost=32&followRedirects=false
[junit4:junit4]   2> 16932 T1815 oascc.ZkStateReader.updateClusterState Updating cloud state from ZooKeeper... 
[junit4:junit4]   2> 16943 T1847 C177 P54957 oasu.DirectUpdateHandler2.commit start commit{flags=0,_version_=0,optimize=false,openSearcher=false,waitSearcher=true,expungeDeletes=false,softCommit=false}
[junit4:junit4]   2> 16950 T1847 C177 P54957 oasc.SolrDeletionPolicy.onCommit SolrDeletionPolicy.onCommit: commits:num=3
[junit4:junit4]   2> 		commit{dir=RateLimitedDirectoryWrapper(NRTCachingDirectory(org.apache.lucene.store.NIOFSDirectory@/usr/home/hudson/hudson-slave/workspace/Lucene-Solr-Tests-4.x-java7/solr/build/solr-core/test/J0/org.apache.solr.cloud.SyncSliceTest-1356103013916/jetty1/index lockFactory=org.apache.lucene.store.NativeFSLockFactory@38656ebd; maxCacheMB=48.0 maxMergeSizeMB=4.0)),segFN=segments_2,generation=2,filenames=[segments_2]
[junit4:junit4]   2> 		commit{dir=RateLimitedDirectoryWrapper(NRTCachingDirectory(org.apache.lucene.store.NIOFSDirectory@/usr/home/hudson/hudson-slave/workspace/Lucene-Solr-Tests-4.x-java7/solr/build/solr-core/test/J0/org.apache.solr.cloud.SyncSliceTest-1356103013916/jetty1/index lockFactory=org.apache.lucene.store.NativeFSLockFactory@38656ebd; maxCacheMB=48.0 maxMergeSizeMB=4.0)),segFN=segments_3,generation=3,filenames=[segments_3]
[junit4:junit4]   2> 		commit{dir=RateLimitedDirectoryWrapper(NRTCachingDirectory(org.apache.lucene.store.NIOFSDirectory@/usr/home/hudson/hudson-slave/workspace/Lucene-Solr-Tests-4.x-java7/solr/build/solr-core/test/J0/org.apache.solr.cloud.SyncSliceTest-1356103013916/jetty1/index lockFactory=org.apache.lucene.store.NativeFSLockFactory@38656ebd; maxCacheMB=48.0 maxMergeSizeMB=4.0)),segFN=segments_4,generation=4,filenames=[segments_4]
[junit4:junit4]   2> 16952 T1847 C177 P54957 oasc.SolrDeletionPolicy.updateCommits newest commit = 4[segments_4]
[junit4:junit4]   2> 16953 T1847 C177 P54957 oasc.CachingDirectoryFactory.close Releasing directory:/usr/home/hudson/hudson-slave/workspace/Lucene-Solr-Tests-4.x-java7/solr/build/solr-

[...truncated too long message...]

est.testDistribSearch <<<
[junit4:junit4]    > Throwable #1: java.lang.AssertionError: shard1 should have just been set up to be inconsistent - but it's still consistent
[junit4:junit4]    > 	at __randomizedtesting.SeedInfo.seed([6F3182D7790245E9:EED70CCF0E5D25D5]:0)
[junit4:junit4]    > 	at org.junit.Assert.fail(Assert.java:93)
[junit4:junit4]    > 	at org.junit.Assert.assertTrue(Assert.java:43)
[junit4:junit4]    > 	at org.junit.Assert.assertNotNull(Assert.java:526)
[junit4:junit4]    > 	at org.apache.solr.cloud.SyncSliceTest.doTest(SyncSliceTest.java:220)
[junit4:junit4]    > 	at org.apache.solr.BaseDistributedSearchTestCase.testDistribSearch(BaseDistributedSearchTestCase.java:794)
[junit4:junit4]    > 	at sun.reflect.NativeMethodAccessorImpl.invoke0(Native Method)
[junit4:junit4]    > 	at sun.reflect.NativeMethodAccessorImpl.invoke(NativeMethodAccessorImpl.java:57)
[junit4:junit4]    > 	at sun.reflect.DelegatingMethodAccessorImpl.invoke(DelegatingMethodAccessorImpl.java:43)
[junit4:junit4]    > 	at java.lang.reflect.Method.invoke(Method.java:601)
[junit4:junit4]    > 	at com.carrotsearch.randomizedtesting.RandomizedRunner.invoke(RandomizedRunner.java:1559)
[junit4:junit4]    > 	at com.carrotsearch.randomizedtesting.RandomizedRunner.access$600(RandomizedRunner.java:79)
[junit4:junit4]    > 	at com.carrotsearch.randomizedtesting.RandomizedRunner$6.evaluate(RandomizedRunner.java:737)
[junit4:junit4]    > 	at com.carrotsearch.randomizedtesting.RandomizedRunner$7.evaluate(RandomizedRunner.java:773)
[junit4:junit4]    > 	at com.carrotsearch.randomizedtesting.RandomizedRunner$8.evaluate(RandomizedRunner.java:787)
[junit4:junit4]    > 	at com.carrotsearch.randomizedtesting.rules.SystemPropertiesRestoreRule$1.evaluate(SystemPropertiesRestoreRule.java:53)
[junit4:junit4]    > 	at org.apache.lucene.util.TestRuleSetupTeardownChained$1.evaluate(TestRuleSetupTeardownChained.java:50)
[junit4:junit4]    > 	at org.apache.lucene.util.TestRuleFieldCacheSanity$1.evaluate(TestRuleFieldCacheSanity.java:51)
[junit4:junit4]    > 	at org.apache.lucene.util.AbstractBeforeAfterRule$1.evaluate(AbstractBeforeAfterRule.java:46)
[junit4:junit4]    > 	at com.carrotsearch.randomizedtesting.rules.SystemPropertiesInvariantRule$1.evaluate(SystemPropertiesInvariantRule.java:55)
[junit4:junit4]    > 	at org.apache.lucene.util.TestRuleThreadAndTestName$1.evaluate(TestRuleThreadAndTestName.java:49)
[junit4:junit4]    > 	at org.apache.lucene.util.TestRuleIgnoreAfterMaxFailures$1.evaluate(TestRuleIgnoreAfterMaxFailures.java:70)
[junit4:junit4]    > 	at org.apache.lucene.util.TestRuleMarkFailure$1.evaluate(TestRuleMarkFailure.java:48)
[junit4:junit4]    > 	at com.carrotsearch.randomizedtesting.rules.StatementAdapter.evaluate(StatementAdapter.java:36)
[junit4:junit4]    > 	at com.carrotsearch.randomizedtesting.ThreadLeakControl$StatementRunner.run(ThreadLeakControl.java:358)
[junit4:junit4]    > 	at com.carrotsearch.randomizedtesting.ThreadLeakControl.forkTimeoutingTask(ThreadLeakControl.java:782)
[junit4:junit4]    > 	at com.carrotsearch.randomizedtesting.ThreadLeakControl$3.evaluate(ThreadLeakControl.java:442)
[junit4:junit4]    > 	at com.carrotsearch.randomizedtesting.RandomizedRunner.runSingleTest(RandomizedRunner.java:746)
[junit4:junit4]    > 	at com.carrotsearch.randomizedtesting.RandomizedRunner$3.evaluate(RandomizedRunner.java:648)
[junit4:junit4]    > 	at com.carrotsearch.randomizedtesting.RandomizedRunner$4.evaluate(RandomizedRunner.java:682)
[junit4:junit4]    > 	at com.carrotsearch.randomizedtesting.RandomizedRunner$5.evaluate(RandomizedRunner.java:693)
[junit4:junit4]    > 	at com.carrotsearch.randomizedtesting.rules.StatementAdapter.evaluate(StatementAdapter.java:36)
[junit4:junit4]    > 	at com.carrotsearch.randomizedtesting.rules.SystemPropertiesRestoreRule$1.evaluate(SystemPropertiesRestoreRule.java:53)
[junit4:junit4]    > 	at org.apache.lucene.util.AbstractBeforeAfterRule$1.evaluate(AbstractBeforeAfterRule.java:46)
[junit4:junit4]    > 	at org.apache.lucene.util.TestRuleStoreClassName$1.evaluate(TestRuleStoreClassName.java:42)
[junit4:junit4]    > 	at com.carrotsearch.randomizedtesting.rules.SystemPropertiesInvariantRule$1.evaluate(SystemPropertiesInvariantRule.java:55)
[junit4:junit4]    > 	at com.carrotsearch.randomizedtesting.rules.NoShadowingOrOverridesOnMethodsRule$1.evaluate(NoShadowingOrOverridesOnMethodsRule.java:39)
[junit4:junit4]    > 	at com.carrotsearch.randomizedtesting.rules.NoShadowingOrOverridesOnMethodsRule$1.evaluate(NoShadowingOrOverridesOnMethodsRule.java:39)
[junit4:junit4]    > 	at com.carrotsearch.randomizedtesting.rules.StatementAdapter.evaluate(StatementAdapter.java:36)
[junit4:junit4]    > 	at org.apache.lucene.util.TestRuleAssertionsRequired$1.evaluate(TestRuleAssertionsRequired.java:43)
[junit4:junit4]    > 	at org.apache.lucene.util.TestRuleMarkFailure$1.evaluate(TestRuleMarkFailure.java:48)
[junit4:junit4]    > 	at org.apache.lucene.util.TestRuleIgnoreAfterMaxFailures$1.evaluate(TestRuleIgnoreAfterMaxFailures.java:70)
[junit4:junit4]    > 	at org.apache.lucene.util.TestRuleIgnoreTestSuites$1.evaluate(TestRuleIgnoreTestSuites.java:55)
[junit4:junit4]    > 	at com.carrotsearch.randomizedtesting.rules.StatementAdapter.evaluate(StatementAdapter.java:36)
[junit4:junit4]    > 	at com.carrotsearch.randomizedtesting.ThreadLeakControl$StatementRunner.run(ThreadLeakControl.java:358)
[junit4:junit4]    > 	at java.lang.Thread.run(Thread.java:722)
[junit4:junit4]   2> 188307 T1815 oas.SolrTestCaseJ4.deleteCore ###deleteCore
[junit4:junit4]   2> NOTE: test params are: codec=Lucene41: {range_facet_l=PostingsFormat(name=TestBloomFilteredLucene41Postings), text=PostingsFormat(name=Asserting), _version_=PostingsFormat(name=TestBloomFilteredLucene41Postings), rnd_b=MockVariableIntBlock(baseBlockSize=110), intDefault=PostingsFormat(name=TestBloomFilteredLucene41Postings), timestamp=PostingsFormat(name=TestBloomFilteredLucene41Postings), id=MockVariableIntBlock(baseBlockSize=110), a_t=PostingsFormat(name=TestBloomFilteredLucene41Postings), range_facet_sl=PostingsFormat(name=Asserting), range_facet_si=MockFixedIntBlock(blockSize=833), other_tl1=PostingsFormat(name=TestBloomFilteredLucene41Postings), multiDefault=MockFixedIntBlock(blockSize=833), a_si=MockFixedIntBlock(blockSize=833)}, sim=DefaultSimilarity, locale=sk, timezone=Mexico/BajaSur
[junit4:junit4]   2> NOTE: FreeBSD 9.0-RELEASE amd64/Oracle Corporation 1.7.0_09 (64-bit)/cpus=16,threads=2,free=238783904,total=536870912
[junit4:junit4]   2> NOTE: All tests run in this JVM: [FileBasedSpellCheckerTest, NumericFieldsTest, TestSolrJ, TestRandomFaceting, SOLR749Test, DefaultValueUpdateProcessorTest, AutoCommitTest, TermVectorComponentDistributedTest, TestGroupingSearch, CircularListTest, TestIndexSearcher, TestLMJelinekMercerSimilarityFactory, TestDocumentBuilder, CurrencyFieldTest, UpdateRequestProcessorFactoryTest, TestJmxMonitoredMap, SolrRequestParserTest, TestIBSimilarityFactory, TestSystemIdResolver, BasicDistributedZkTest, MinimalSchemaTest, ResourceLoaderTest, TestWordDelimiterFilterFactory, TestPerFieldSimilarity, DistanceFunctionTest, TestReload, BasicDistributedZk2Test, TestFiltering, TestStressRecovery, FieldAnalysisRequestHandlerTest, MBeansHandlerTest, AlternateDirectoryTest, TestRTGBase, LoggingHandlerTest, SimpleFacetsTest, PathHierarchyTokenizerFactoryTest, NoCacheHeaderTest, TestFaceting, SortByFunctionTest, TestAnalyzedSuggestions, SpellCheckCollatorTest, SimplePostToolTest, TestQueryTypes, TestFastWriter, TestPseudoReturnFields, TestSearchPerf, CopyFieldTest, TestLuceneMatchVersion, TestBinaryResponseWriter, PluginInfoTest, ResponseLogComponentTest, RequestHandlersTest, TestStressLucene, UniqFieldsUpdateProcessorFactoryTest, TestRangeQuery, PreAnalyzedFieldTest, ShardRoutingCustomTest, JSONWriterTest, IndexBasedSpellCheckerTest, TestCoreContainer, QueryElevationComponentTest, SampleTest, HighlighterTest, DirectSolrConnectionTest, TestRemoteStreaming, QueryEqualityTest, SpatialFilterTest, DistributedQueryElevationComponentTest, TermsComponentTest, XsltUpdateRequestHandlerTest, TestPHPSerializedResponseWriter, TermVectorComponentTest, JsonLoaderTest, DocumentAnalysisRequestHandlerTest, DirectUpdateHandlerOptimizeTest, TestSolrQueryParser, FastVectorHighlighterTest, SearchHandlerTest, TestOmitPositions, TestQueryUtils, UpdateParamsTest, CSVRequestHandlerTest, ShowFileRequestHandlerTest, NotRequiredUniqueKeyTest, BadIndexSchemaTest, BadComponentTest, HighlighterConfigTest, TestMergePolicyConfig, TestLFUCache, TestQuerySenderNoQuery, TestNumberUtils, TestConfig, SpellPossibilityIteratorTest, TestCodecSupport, TestFastLRUCache, PrimUtilsTest, DateFieldTest, TestBadConfig, TestCharFilters, ClusterStateTest, OverseerCollectionProcessorTest, SyncSliceTest]
[junit4:junit4] Completed on J0 in 188.33s, 1 test, 1 failure <<< FAILURES!

[...truncated 10 lines...]
BUILD FAILED
/usr/home/hudson/hudson-slave/workspace/Lucene-Solr-Tests-4.x-java7/build.xml:353: The following error occurred while executing this line:
/usr/home/hudson/hudson-slave/workspace/Lucene-Solr-Tests-4.x-java7/build.xml:39: The following error occurred while executing this line:
/usr/home/hudson/hudson-slave/workspace/Lucene-Solr-Tests-4.x-java7/solr/build.xml:178: The following error occurred while executing this line:
/usr/home/hudson/hudson-slave/workspace/Lucene-Solr-Tests-4.x-java7/solr/common-build.xml:438: The following error occurred while executing this line:
/usr/home/hudson/hudson-slave/workspace/Lucene-Solr-Tests-4.x-java7/lucene/common-build.xml:1175: The following error occurred while executing this line:
/usr/home/hudson/hudson-slave/workspace/Lucene-Solr-Tests-4.x-java7/lucene/common-build.xml:840: There were test failures: 244 suites, 1010 tests, 1 failure, 21 ignored (3 assumptions)

Total time: 34 minutes 47 seconds
Build step 'Invoke Ant' marked build as failure
Archiving artifacts
Recording test results
Email was triggered for: Failure
Sending email for trigger: Failure



Mime
View raw message