lucene-dev mailing list archives

Site index · List index
Message view « Date » · « Thread »
Top « Date » · « Thread »
From Apache Jenkins Server <jenk...@builds.apache.org>
Subject [JENKINS] Lucene-Solr-Tests-4.x-java7 - Build # 806 - Still Failing
Date Mon, 17 Dec 2012 05:46:04 GMT
Build: https://builds.apache.org/job/Lucene-Solr-Tests-4.x-java7/806/

16 tests failed.
REGRESSION:  org.apache.solr.handler.component.DistributedMLTComponentTest.testDistribSearch

Error Message:
Timeout occured while waiting response from server at: http://127.0.0.1:38710/jzcx

Stack Trace:
org.apache.solr.client.solrj.SolrServerException: Timeout occured while waiting response from server at: http://127.0.0.1:38710/jzcx
	at __randomizedtesting.SeedInfo.seed([AFBEC97EF6771BBA:2E58476681287B86]:0)
	at org.apache.solr.client.solrj.impl.HttpSolrServer.request(HttpSolrServer.java:409)
	at org.apache.solr.client.solrj.impl.HttpSolrServer.request(HttpSolrServer.java:181)
	at org.apache.solr.client.solrj.request.QueryRequest.process(QueryRequest.java:90)
	at org.apache.solr.client.solrj.SolrServer.query(SolrServer.java:301)
	at org.apache.solr.BaseDistributedSearchTestCase.queryServer(BaseDistributedSearchTestCase.java:470)
	at org.apache.solr.BaseDistributedSearchTestCase.query(BaseDistributedSearchTestCase.java:493)
	at org.apache.solr.BaseDistributedSearchTestCase.query(BaseDistributedSearchTestCase.java:475)
	at org.apache.solr.handler.component.DistributedMLTComponentTest.doTest(DistributedMLTComponentTest.java:119)
	at org.apache.solr.BaseDistributedSearchTestCase.testDistribSearch(BaseDistributedSearchTestCase.java:794)
	at sun.reflect.NativeMethodAccessorImpl.invoke0(Native Method)
	at sun.reflect.NativeMethodAccessorImpl.invoke(NativeMethodAccessorImpl.java:57)
	at sun.reflect.DelegatingMethodAccessorImpl.invoke(DelegatingMethodAccessorImpl.java:43)
	at java.lang.reflect.Method.invoke(Method.java:601)
	at com.carrotsearch.randomizedtesting.RandomizedRunner.invoke(RandomizedRunner.java:1559)
	at com.carrotsearch.randomizedtesting.RandomizedRunner.access$600(RandomizedRunner.java:79)
	at com.carrotsearch.randomizedtesting.RandomizedRunner$6.evaluate(RandomizedRunner.java:737)
	at com.carrotsearch.randomizedtesting.RandomizedRunner$7.evaluate(RandomizedRunner.java:773)
	at com.carrotsearch.randomizedtesting.RandomizedRunner$8.evaluate(RandomizedRunner.java:787)
	at com.carrotsearch.randomizedtesting.rules.SystemPropertiesRestoreRule$1.evaluate(SystemPropertiesRestoreRule.java:53)
	at org.apache.lucene.util.TestRuleSetupTeardownChained$1.evaluate(TestRuleSetupTeardownChained.java:50)
	at org.apache.lucene.util.TestRuleFieldCacheSanity$1.evaluate(TestRuleFieldCacheSanity.java:51)
	at org.apache.lucene.util.AbstractBeforeAfterRule$1.evaluate(AbstractBeforeAfterRule.java:46)
	at com.carrotsearch.randomizedtesting.rules.SystemPropertiesInvariantRule$1.evaluate(SystemPropertiesInvariantRule.java:55)
	at org.apache.lucene.util.TestRuleThreadAndTestName$1.evaluate(TestRuleThreadAndTestName.java:49)
	at org.apache.lucene.util.TestRuleIgnoreAfterMaxFailures$1.evaluate(TestRuleIgnoreAfterMaxFailures.java:70)
	at org.apache.lucene.util.TestRuleMarkFailure$1.evaluate(TestRuleMarkFailure.java:48)
	at com.carrotsearch.randomizedtesting.rules.StatementAdapter.evaluate(StatementAdapter.java:36)
	at com.carrotsearch.randomizedtesting.ThreadLeakControl$StatementRunner.run(ThreadLeakControl.java:358)
	at com.carrotsearch.randomizedtesting.ThreadLeakControl.forkTimeoutingTask(ThreadLeakControl.java:782)
	at com.carrotsearch.randomizedtesting.ThreadLeakControl$3.evaluate(ThreadLeakControl.java:442)
	at com.carrotsearch.randomizedtesting.RandomizedRunner.runSingleTest(RandomizedRunner.java:746)
	at com.carrotsearch.randomizedtesting.RandomizedRunner$3.evaluate(RandomizedRunner.java:648)
	at com.carrotsearch.randomizedtesting.RandomizedRunner$4.evaluate(RandomizedRunner.java:682)
	at com.carrotsearch.randomizedtesting.RandomizedRunner$5.evaluate(RandomizedRunner.java:693)
	at com.carrotsearch.randomizedtesting.rules.StatementAdapter.evaluate(StatementAdapter.java:36)
	at com.carrotsearch.randomizedtesting.rules.SystemPropertiesRestoreRule$1.evaluate(SystemPropertiesRestoreRule.java:53)
	at org.apache.lucene.util.AbstractBeforeAfterRule$1.evaluate(AbstractBeforeAfterRule.java:46)
	at org.apache.lucene.util.TestRuleStoreClassName$1.evaluate(TestRuleStoreClassName.java:42)
	at com.carrotsearch.randomizedtesting.rules.SystemPropertiesInvariantRule$1.evaluate(SystemPropertiesInvariantRule.java:55)
	at com.carrotsearch.randomizedtesting.rules.NoShadowingOrOverridesOnMethodsRule$1.evaluate(NoShadowingOrOverridesOnMethodsRule.java:39)
	at com.carrotsearch.randomizedtesting.rules.NoShadowingOrOverridesOnMethodsRule$1.evaluate(NoShadowingOrOverridesOnMethodsRule.java:39)
	at com.carrotsearch.randomizedtesting.rules.StatementAdapter.evaluate(StatementAdapter.java:36)
	at org.apache.lucene.util.TestRuleAssertionsRequired$1.evaluate(TestRuleAssertionsRequired.java:43)
	at org.apache.lucene.util.TestRuleMarkFailure$1.evaluate(TestRuleMarkFailure.java:48)
	at org.apache.lucene.util.TestRuleIgnoreAfterMaxFailures$1.evaluate(TestRuleIgnoreAfterMaxFailures.java:70)
	at org.apache.lucene.util.TestRuleIgnoreTestSuites$1.evaluate(TestRuleIgnoreTestSuites.java:55)
	at com.carrotsearch.randomizedtesting.rules.StatementAdapter.evaluate(StatementAdapter.java:36)
	at com.carrotsearch.randomizedtesting.ThreadLeakControl$StatementRunner.run(ThreadLeakControl.java:358)
	at java.lang.Thread.run(Thread.java:722)
Caused by: java.net.SocketTimeoutException: Read timed out
	at java.net.SocketInputStream.socketRead0(Native Method)
	at java.net.SocketInputStream.read(SocketInputStream.java:150)
	at java.net.SocketInputStream.read(SocketInputStream.java:121)
	at org.apache.http.impl.io.AbstractSessionInputBuffer.fillBuffer(AbstractSessionInputBuffer.java:149)
	at org.apache.http.impl.io.SocketInputBuffer.fillBuffer(SocketInputBuffer.java:111)
	at org.apache.http.impl.io.AbstractSessionInputBuffer.readLine(AbstractSessionInputBuffer.java:264)
	at org.apache.http.impl.conn.DefaultResponseParser.parseHead(DefaultResponseParser.java:98)
	at org.apache.http.impl.io.AbstractMessageParser.parse(AbstractMessageParser.java:252)
	at org.apache.http.impl.AbstractHttpClientConnection.receiveResponseHeader(AbstractHttpClientConnection.java:282)
	at org.apache.http.impl.conn.DefaultClientConnection.receiveResponseHeader(DefaultClientConnection.java:247)
	at org.apache.http.impl.conn.AbstractClientConnAdapter.receiveResponseHeader(AbstractClientConnAdapter.java:216)
	at org.apache.http.protocol.HttpRequestExecutor.doReceiveResponse(HttpRequestExecutor.java:298)
	at org.apache.http.protocol.HttpRequestExecutor.execute(HttpRequestExecutor.java:125)
	at org.apache.http.impl.client.DefaultRequestDirector.tryExecute(DefaultRequestDirector.java:647)
	at org.apache.http.impl.client.DefaultRequestDirector.execute(DefaultRequestDirector.java:464)
	at org.apache.http.impl.client.AbstractHttpClient.execute(AbstractHttpClient.java:820)
	at org.apache.http.impl.client.AbstractHttpClient.execute(AbstractHttpClient.java:754)
	at org.apache.http.impl.client.AbstractHttpClient.execute(AbstractHttpClient.java:732)
	at org.apache.solr.client.solrj.impl.HttpSolrServer.request(HttpSolrServer.java:352)
	... 48 more


FAILED:  org.apache.solr.cloud.BasicDistributedZkTest.testDistribSearch

Error Message:
Test abandoned because suite timeout was reached.

Stack Trace:
java.lang.Exception: Test abandoned because suite timeout was reached.
	at __randomizedtesting.SeedInfo.seed([AFBEC97EF6771BBA]:0)


FAILED:  junit.framework.TestSuite.org.apache.solr.cloud.BasicDistributedZkTest

Error Message:
Suite timeout exceeded (>= 7200000 msec).

Stack Trace:
java.lang.Exception: Suite timeout exceeded (>= 7200000 msec).
	at __randomizedtesting.SeedInfo.seed([AFBEC97EF6771BBA]:0)


FAILED:  junit.framework.TestSuite.org.apache.solr.cloud.BasicDistributedZkTest

Error Message:
Captured an uncaught exception in thread: Thread[id=2562, name=testExecutor-2049-thread-7, state=RUNNABLE, group=TGRP-BasicDistributedZkTest]

Stack Trace:
com.carrotsearch.randomizedtesting.UncaughtExceptionError: Captured an uncaught exception in thread: Thread[id=2562, name=testExecutor-2049-thread-7, state=RUNNABLE, group=TGRP-BasicDistributedZkTest]
Caused by: java.lang.RuntimeException: org.apache.solr.client.solrj.SolrServerException: Timeout occured while waiting response from server at: http://127.0.0.1:62037/g/s
	at __randomizedtesting.SeedInfo.seed([AFBEC97EF6771BBA]:0)
	at org.apache.solr.cloud.BasicDistributedZkTest$2.run(BasicDistributedZkTest.java:722)
	at java.util.concurrent.ThreadPoolExecutor.runWorker(ThreadPoolExecutor.java:1110)
	at java.util.concurrent.ThreadPoolExecutor$Worker.run(ThreadPoolExecutor.java:603)
	at java.lang.Thread.run(Thread.java:722)
Caused by: org.apache.solr.client.solrj.SolrServerException: Timeout occured while waiting response from server at: http://127.0.0.1:62037/g/s
	at org.apache.solr.client.solrj.impl.HttpSolrServer.request(HttpSolrServer.java:409)
	at org.apache.solr.client.solrj.impl.HttpSolrServer.request(HttpSolrServer.java:181)
	at org.apache.solr.cloud.BasicDistributedZkTest$2.run(BasicDistributedZkTest.java:720)
	... 3 more
Caused by: java.net.SocketTimeoutException: Read timed out
	at java.net.SocketInputStream.socketRead0(Native Method)
	at java.net.SocketInputStream.read(SocketInputStream.java:150)
	at java.net.SocketInputStream.read(SocketInputStream.java:121)
	at org.apache.http.impl.io.AbstractSessionInputBuffer.fillBuffer(AbstractSessionInputBuffer.java:149)
	at org.apache.http.impl.io.SocketInputBuffer.fillBuffer(SocketInputBuffer.java:111)
	at org.apache.http.impl.io.AbstractSessionInputBuffer.readLine(AbstractSessionInputBuffer.java:264)
	at org.apache.http.impl.conn.DefaultResponseParser.parseHead(DefaultResponseParser.java:98)
	at org.apache.http.impl.io.AbstractMessageParser.parse(AbstractMessageParser.java:252)
	at org.apache.http.impl.AbstractHttpClientConnection.receiveResponseHeader(AbstractHttpClientConnection.java:282)
	at org.apache.http.impl.conn.DefaultClientConnection.receiveResponseHeader(DefaultClientConnection.java:247)
	at org.apache.http.impl.conn.AbstractClientConnAdapter.receiveResponseHeader(AbstractClientConnAdapter.java:216)
	at org.apache.http.protocol.HttpRequestExecutor.doReceiveResponse(HttpRequestExecutor.java:298)
	at org.apache.http.protocol.HttpRequestExecutor.execute(HttpRequestExecutor.java:125)
	at org.apache.http.impl.client.DefaultRequestDirector.tryExecute(DefaultRequestDirector.java:647)
	at org.apache.http.impl.client.DefaultRequestDirector.execute(DefaultRequestDirector.java:464)
	at org.apache.http.impl.client.AbstractHttpClient.execute(AbstractHttpClient.java:820)
	at org.apache.http.impl.client.AbstractHttpClient.execute(AbstractHttpClient.java:754)
	at org.apache.http.impl.client.AbstractHttpClient.execute(AbstractHttpClient.java:732)
	at org.apache.solr.client.solrj.impl.HttpSolrServer.request(HttpSolrServer.java:352)
	... 5 more


FAILED:  junit.framework.TestSuite.org.apache.solr.cloud.BasicDistributedZkTest

Error Message:
Captured an uncaught exception in thread: Thread[id=2569, name=testExecutor-2049-thread-14, state=RUNNABLE, group=TGRP-BasicDistributedZkTest]

Stack Trace:
com.carrotsearch.randomizedtesting.UncaughtExceptionError: Captured an uncaught exception in thread: Thread[id=2569, name=testExecutor-2049-thread-14, state=RUNNABLE, group=TGRP-BasicDistributedZkTest]
Caused by: java.lang.RuntimeException: org.apache.solr.client.solrj.SolrServerException: Timeout occured while waiting response from server at: http://127.0.0.1:62037/g/s
	at __randomizedtesting.SeedInfo.seed([AFBEC97EF6771BBA]:0)
	at org.apache.solr.cloud.BasicDistributedZkTest$2.run(BasicDistributedZkTest.java:722)
	at java.util.concurrent.ThreadPoolExecutor.runWorker(ThreadPoolExecutor.java:1110)
	at java.util.concurrent.ThreadPoolExecutor$Worker.run(ThreadPoolExecutor.java:603)
	at java.lang.Thread.run(Thread.java:722)
Caused by: org.apache.solr.client.solrj.SolrServerException: Timeout occured while waiting response from server at: http://127.0.0.1:62037/g/s
	at org.apache.solr.client.solrj.impl.HttpSolrServer.request(HttpSolrServer.java:409)
	at org.apache.solr.client.solrj.impl.HttpSolrServer.request(HttpSolrServer.java:181)
	at org.apache.solr.cloud.BasicDistributedZkTest$2.run(BasicDistributedZkTest.java:720)
	... 3 more
Caused by: java.net.SocketTimeoutException: Read timed out
	at java.net.SocketInputStream.socketRead0(Native Method)
	at java.net.SocketInputStream.read(SocketInputStream.java:150)
	at java.net.SocketInputStream.read(SocketInputStream.java:121)
	at org.apache.http.impl.io.AbstractSessionInputBuffer.fillBuffer(AbstractSessionInputBuffer.java:149)
	at org.apache.http.impl.io.SocketInputBuffer.fillBuffer(SocketInputBuffer.java:111)
	at org.apache.http.impl.io.AbstractSessionInputBuffer.readLine(AbstractSessionInputBuffer.java:264)
	at org.apache.http.impl.conn.DefaultResponseParser.parseHead(DefaultResponseParser.java:98)
	at org.apache.http.impl.io.AbstractMessageParser.parse(AbstractMessageParser.java:252)
	at org.apache.http.impl.AbstractHttpClientConnection.receiveResponseHeader(AbstractHttpClientConnection.java:282)
	at org.apache.http.impl.conn.DefaultClientConnection.receiveResponseHeader(DefaultClientConnection.java:247)
	at org.apache.http.impl.conn.AbstractClientConnAdapter.receiveResponseHeader(AbstractClientConnAdapter.java:216)
	at org.apache.http.protocol.HttpRequestExecutor.doReceiveResponse(HttpRequestExecutor.java:298)
	at org.apache.http.protocol.HttpRequestExecutor.execute(HttpRequestExecutor.java:125)
	at org.apache.http.impl.client.DefaultRequestDirector.tryExecute(DefaultRequestDirector.java:647)
	at org.apache.http.impl.client.DefaultRequestDirector.execute(DefaultRequestDirector.java:464)
	at org.apache.http.impl.client.AbstractHttpClient.execute(AbstractHttpClient.java:820)
	at org.apache.http.impl.client.AbstractHttpClient.execute(AbstractHttpClient.java:754)
	at org.apache.http.impl.client.AbstractHttpClient.execute(AbstractHttpClient.java:732)
	at org.apache.solr.client.solrj.impl.HttpSolrServer.request(HttpSolrServer.java:352)
	... 5 more


FAILED:  junit.framework.TestSuite.org.apache.solr.cloud.BasicDistributedZkTest

Error Message:
Captured an uncaught exception in thread: Thread[id=2576, name=testExecutor-2049-thread-21, state=RUNNABLE, group=TGRP-BasicDistributedZkTest]

Stack Trace:
com.carrotsearch.randomizedtesting.UncaughtExceptionError: Captured an uncaught exception in thread: Thread[id=2576, name=testExecutor-2049-thread-21, state=RUNNABLE, group=TGRP-BasicDistributedZkTest]
Caused by: java.lang.RuntimeException: org.apache.solr.client.solrj.SolrServerException: Timeout occured while waiting response from server at: http://127.0.0.1:62037/g/s
	at __randomizedtesting.SeedInfo.seed([AFBEC97EF6771BBA]:0)
	at org.apache.solr.cloud.BasicDistributedZkTest$2.run(BasicDistributedZkTest.java:722)
	at java.util.concurrent.ThreadPoolExecutor.runWorker(ThreadPoolExecutor.java:1110)
	at java.util.concurrent.ThreadPoolExecutor$Worker.run(ThreadPoolExecutor.java:603)
	at java.lang.Thread.run(Thread.java:722)
Caused by: org.apache.solr.client.solrj.SolrServerException: Timeout occured while waiting response from server at: http://127.0.0.1:62037/g/s
	at org.apache.solr.client.solrj.impl.HttpSolrServer.request(HttpSolrServer.java:409)
	at org.apache.solr.client.solrj.impl.HttpSolrServer.request(HttpSolrServer.java:181)
	at org.apache.solr.cloud.BasicDistributedZkTest$2.run(BasicDistributedZkTest.java:720)
	... 3 more
Caused by: java.net.SocketTimeoutException: Read timed out
	at java.net.SocketInputStream.socketRead0(Native Method)
	at java.net.SocketInputStream.read(SocketInputStream.java:150)
	at java.net.SocketInputStream.read(SocketInputStream.java:121)
	at org.apache.http.impl.io.AbstractSessionInputBuffer.fillBuffer(AbstractSessionInputBuffer.java:149)
	at org.apache.http.impl.io.SocketInputBuffer.fillBuffer(SocketInputBuffer.java:111)
	at org.apache.http.impl.io.AbstractSessionInputBuffer.readLine(AbstractSessionInputBuffer.java:264)
	at org.apache.http.impl.conn.DefaultResponseParser.parseHead(DefaultResponseParser.java:98)
	at org.apache.http.impl.io.AbstractMessageParser.parse(AbstractMessageParser.java:252)
	at org.apache.http.impl.AbstractHttpClientConnection.receiveResponseHeader(AbstractHttpClientConnection.java:282)
	at org.apache.http.impl.conn.DefaultClientConnection.receiveResponseHeader(DefaultClientConnection.java:247)
	at org.apache.http.impl.conn.AbstractClientConnAdapter.receiveResponseHeader(AbstractClientConnAdapter.java:216)
	at org.apache.http.protocol.HttpRequestExecutor.doReceiveResponse(HttpRequestExecutor.java:298)
	at org.apache.http.protocol.HttpRequestExecutor.execute(HttpRequestExecutor.java:125)
	at org.apache.http.impl.client.DefaultRequestDirector.tryExecute(DefaultRequestDirector.java:647)
	at org.apache.http.impl.client.DefaultRequestDirector.execute(DefaultRequestDirector.java:464)
	at org.apache.http.impl.client.AbstractHttpClient.execute(AbstractHttpClient.java:820)
	at org.apache.http.impl.client.AbstractHttpClient.execute(AbstractHttpClient.java:754)
	at org.apache.http.impl.client.AbstractHttpClient.execute(AbstractHttpClient.java:732)
	at org.apache.solr.client.solrj.impl.HttpSolrServer.request(HttpSolrServer.java:352)
	... 5 more


FAILED:  junit.framework.TestSuite.org.apache.solr.cloud.BasicDistributedZkTest

Error Message:
Captured an uncaught exception in thread: Thread[id=2573, name=testExecutor-2049-thread-18, state=RUNNABLE, group=TGRP-BasicDistributedZkTest]

Stack Trace:
com.carrotsearch.randomizedtesting.UncaughtExceptionError: Captured an uncaught exception in thread: Thread[id=2573, name=testExecutor-2049-thread-18, state=RUNNABLE, group=TGRP-BasicDistributedZkTest]
Caused by: java.lang.RuntimeException: org.apache.solr.client.solrj.SolrServerException: Timeout occured while waiting response from server at: http://127.0.0.1:62037/g/s
	at __randomizedtesting.SeedInfo.seed([AFBEC97EF6771BBA]:0)
	at org.apache.solr.cloud.BasicDistributedZkTest$2.run(BasicDistributedZkTest.java:722)
	at java.util.concurrent.ThreadPoolExecutor.runWorker(ThreadPoolExecutor.java:1110)
	at java.util.concurrent.ThreadPoolExecutor$Worker.run(ThreadPoolExecutor.java:603)
	at java.lang.Thread.run(Thread.java:722)
Caused by: org.apache.solr.client.solrj.SolrServerException: Timeout occured while waiting response from server at: http://127.0.0.1:62037/g/s
	at org.apache.solr.client.solrj.impl.HttpSolrServer.request(HttpSolrServer.java:409)
	at org.apache.solr.client.solrj.impl.HttpSolrServer.request(HttpSolrServer.java:181)
	at org.apache.solr.cloud.BasicDistributedZkTest$2.run(BasicDistributedZkTest.java:720)
	... 3 more
Caused by: java.net.SocketTimeoutException: Read timed out
	at java.net.SocketInputStream.socketRead0(Native Method)
	at java.net.SocketInputStream.read(SocketInputStream.java:150)
	at java.net.SocketInputStream.read(SocketInputStream.java:121)
	at org.apache.http.impl.io.AbstractSessionInputBuffer.fillBuffer(AbstractSessionInputBuffer.java:149)
	at org.apache.http.impl.io.SocketInputBuffer.fillBuffer(SocketInputBuffer.java:111)
	at org.apache.http.impl.io.AbstractSessionInputBuffer.readLine(AbstractSessionInputBuffer.java:264)
	at org.apache.http.impl.conn.DefaultResponseParser.parseHead(DefaultResponseParser.java:98)
	at org.apache.http.impl.io.AbstractMessageParser.parse(AbstractMessageParser.java:252)
	at org.apache.http.impl.AbstractHttpClientConnection.receiveResponseHeader(AbstractHttpClientConnection.java:282)
	at org.apache.http.impl.conn.DefaultClientConnection.receiveResponseHeader(DefaultClientConnection.java:247)
	at org.apache.http.impl.conn.AbstractClientConnAdapter.receiveResponseHeader(AbstractClientConnAdapter.java:216)
	at org.apache.http.protocol.HttpRequestExecutor.doReceiveResponse(HttpRequestExecutor.java:298)
	at org.apache.http.protocol.HttpRequestExecutor.execute(HttpRequestExecutor.java:125)
	at org.apache.http.impl.client.DefaultRequestDirector.tryExecute(DefaultRequestDirector.java:647)
	at org.apache.http.impl.client.DefaultRequestDirector.execute(DefaultRequestDirector.java:464)
	at org.apache.http.impl.client.AbstractHttpClient.execute(AbstractHttpClient.java:820)
	at org.apache.http.impl.client.AbstractHttpClient.execute(AbstractHttpClient.java:754)
	at org.apache.http.impl.client.AbstractHttpClient.execute(AbstractHttpClient.java:732)
	at org.apache.solr.client.solrj.impl.HttpSolrServer.request(HttpSolrServer.java:352)
	... 5 more


FAILED:  junit.framework.TestSuite.org.apache.solr.cloud.BasicDistributedZkTest

Error Message:
Captured an uncaught exception in thread: Thread[id=2575, name=testExecutor-2049-thread-20, state=RUNNABLE, group=TGRP-BasicDistributedZkTest]

Stack Trace:
com.carrotsearch.randomizedtesting.UncaughtExceptionError: Captured an uncaught exception in thread: Thread[id=2575, name=testExecutor-2049-thread-20, state=RUNNABLE, group=TGRP-BasicDistributedZkTest]
Caused by: java.lang.RuntimeException: org.apache.solr.client.solrj.SolrServerException: Timeout occured while waiting response from server at: http://127.0.0.1:62037/g/s
	at __randomizedtesting.SeedInfo.seed([AFBEC97EF6771BBA]:0)
	at org.apache.solr.cloud.BasicDistributedZkTest$2.run(BasicDistributedZkTest.java:722)
	at java.util.concurrent.ThreadPoolExecutor.runWorker(ThreadPoolExecutor.java:1110)
	at java.util.concurrent.ThreadPoolExecutor$Worker.run(ThreadPoolExecutor.java:603)
	at java.lang.Thread.run(Thread.java:722)
Caused by: org.apache.solr.client.solrj.SolrServerException: Timeout occured while waiting response from server at: http://127.0.0.1:62037/g/s
	at org.apache.solr.client.solrj.impl.HttpSolrServer.request(HttpSolrServer.java:409)
	at org.apache.solr.client.solrj.impl.HttpSolrServer.request(HttpSolrServer.java:181)
	at org.apache.solr.cloud.BasicDistributedZkTest$2.run(BasicDistributedZkTest.java:720)
	... 3 more
Caused by: java.net.SocketTimeoutException: Read timed out
	at java.net.SocketInputStream.socketRead0(Native Method)
	at java.net.SocketInputStream.read(SocketInputStream.java:150)
	at java.net.SocketInputStream.read(SocketInputStream.java:121)
	at org.apache.http.impl.io.AbstractSessionInputBuffer.fillBuffer(AbstractSessionInputBuffer.java:149)
	at org.apache.http.impl.io.SocketInputBuffer.fillBuffer(SocketInputBuffer.java:111)
	at org.apache.http.impl.io.AbstractSessionInputBuffer.readLine(AbstractSessionInputBuffer.java:264)
	at org.apache.http.impl.conn.DefaultResponseParser.parseHead(DefaultResponseParser.java:98)
	at org.apache.http.impl.io.AbstractMessageParser.parse(AbstractMessageParser.java:252)
	at org.apache.http.impl.AbstractHttpClientConnection.receiveResponseHeader(AbstractHttpClientConnection.java:282)
	at org.apache.http.impl.conn.DefaultClientConnection.receiveResponseHeader(DefaultClientConnection.java:247)
	at org.apache.http.impl.conn.AbstractClientConnAdapter.receiveResponseHeader(AbstractClientConnAdapter.java:216)
	at org.apache.http.protocol.HttpRequestExecutor.doReceiveResponse(HttpRequestExecutor.java:298)
	at org.apache.http.protocol.HttpRequestExecutor.execute(HttpRequestExecutor.java:125)
	at org.apache.http.impl.client.DefaultRequestDirector.tryExecute(DefaultRequestDirector.java:647)
	at org.apache.http.impl.client.DefaultRequestDirector.execute(DefaultRequestDirector.java:464)
	at org.apache.http.impl.client.AbstractHttpClient.execute(AbstractHttpClient.java:820)
	at org.apache.http.impl.client.AbstractHttpClient.execute(AbstractHttpClient.java:754)
	at org.apache.http.impl.client.AbstractHttpClient.execute(AbstractHttpClient.java:732)
	at org.apache.solr.client.solrj.impl.HttpSolrServer.request(HttpSolrServer.java:352)
	... 5 more


FAILED:  junit.framework.TestSuite.org.apache.solr.cloud.BasicDistributedZkTest

Error Message:
Captured an uncaught exception in thread: Thread[id=2559, name=testExecutor-2049-thread-4, state=RUNNABLE, group=TGRP-BasicDistributedZkTest]

Stack Trace:
com.carrotsearch.randomizedtesting.UncaughtExceptionError: Captured an uncaught exception in thread: Thread[id=2559, name=testExecutor-2049-thread-4, state=RUNNABLE, group=TGRP-BasicDistributedZkTest]
Caused by: java.lang.RuntimeException: org.apache.solr.client.solrj.SolrServerException: Timeout occured while waiting response from server at: http://127.0.0.1:62037/g/s
	at __randomizedtesting.SeedInfo.seed([AFBEC97EF6771BBA]:0)
	at org.apache.solr.cloud.BasicDistributedZkTest$2.run(BasicDistributedZkTest.java:722)
	at java.util.concurrent.ThreadPoolExecutor.runWorker(ThreadPoolExecutor.java:1110)
	at java.util.concurrent.ThreadPoolExecutor$Worker.run(ThreadPoolExecutor.java:603)
	at java.lang.Thread.run(Thread.java:722)
Caused by: org.apache.solr.client.solrj.SolrServerException: Timeout occured while waiting response from server at: http://127.0.0.1:62037/g/s
	at org.apache.solr.client.solrj.impl.HttpSolrServer.request(HttpSolrServer.java:409)
	at org.apache.solr.client.solrj.impl.HttpSolrServer.request(HttpSolrServer.java:181)
	at org.apache.solr.cloud.BasicDistributedZkTest$2.run(BasicDistributedZkTest.java:720)
	... 3 more
Caused by: java.net.SocketTimeoutException: Read timed out
	at java.net.SocketInputStream.socketRead0(Native Method)
	at java.net.SocketInputStream.read(SocketInputStream.java:150)
	at java.net.SocketInputStream.read(SocketInputStream.java:121)
	at org.apache.http.impl.io.AbstractSessionInputBuffer.fillBuffer(AbstractSessionInputBuffer.java:149)
	at org.apache.http.impl.io.SocketInputBuffer.fillBuffer(SocketInputBuffer.java:111)
	at org.apache.http.impl.io.AbstractSessionInputBuffer.readLine(AbstractSessionInputBuffer.java:264)
	at org.apache.http.impl.conn.DefaultResponseParser.parseHead(DefaultResponseParser.java:98)
	at org.apache.http.impl.io.AbstractMessageParser.parse(AbstractMessageParser.java:252)
	at org.apache.http.impl.AbstractHttpClientConnection.receiveResponseHeader(AbstractHttpClientConnection.java:282)
	at org.apache.http.impl.conn.DefaultClientConnection.receiveResponseHeader(DefaultClientConnection.java:247)
	at org.apache.http.impl.conn.AbstractClientConnAdapter.receiveResponseHeader(AbstractClientConnAdapter.java:216)
	at org.apache.http.protocol.HttpRequestExecutor.doReceiveResponse(HttpRequestExecutor.java:298)
	at org.apache.http.protocol.HttpRequestExecutor.execute(HttpRequestExecutor.java:125)
	at org.apache.http.impl.client.DefaultRequestDirector.tryExecute(DefaultRequestDirector.java:647)
	at org.apache.http.impl.client.DefaultRequestDirector.execute(DefaultRequestDirector.java:464)
	at org.apache.http.impl.client.AbstractHttpClient.execute(AbstractHttpClient.java:820)
	at org.apache.http.impl.client.AbstractHttpClient.execute(AbstractHttpClient.java:754)
	at org.apache.http.impl.client.AbstractHttpClient.execute(AbstractHttpClient.java:732)
	at org.apache.solr.client.solrj.impl.HttpSolrServer.request(HttpSolrServer.java:352)
	... 5 more


FAILED:  junit.framework.TestSuite.org.apache.solr.cloud.BasicDistributedZkTest

Error Message:
Captured an uncaught exception in thread: Thread[id=2558, name=testExecutor-2049-thread-3, state=RUNNABLE, group=TGRP-BasicDistributedZkTest]

Stack Trace:
com.carrotsearch.randomizedtesting.UncaughtExceptionError: Captured an uncaught exception in thread: Thread[id=2558, name=testExecutor-2049-thread-3, state=RUNNABLE, group=TGRP-BasicDistributedZkTest]
Caused by: java.lang.RuntimeException: org.apache.solr.client.solrj.SolrServerException: Timeout occured while waiting response from server at: http://127.0.0.1:62037/g/s
	at __randomizedtesting.SeedInfo.seed([AFBEC97EF6771BBA]:0)
	at org.apache.solr.cloud.BasicDistributedZkTest$2.run(BasicDistributedZkTest.java:722)
	at java.util.concurrent.ThreadPoolExecutor.runWorker(ThreadPoolExecutor.java:1110)
	at java.util.concurrent.ThreadPoolExecutor$Worker.run(ThreadPoolExecutor.java:603)
	at java.lang.Thread.run(Thread.java:722)
Caused by: org.apache.solr.client.solrj.SolrServerException: Timeout occured while waiting response from server at: http://127.0.0.1:62037/g/s
	at org.apache.solr.client.solrj.impl.HttpSolrServer.request(HttpSolrServer.java:409)
	at org.apache.solr.client.solrj.impl.HttpSolrServer.request(HttpSolrServer.java:181)
	at org.apache.solr.cloud.BasicDistributedZkTest$2.run(BasicDistributedZkTest.java:720)
	... 3 more
Caused by: java.net.SocketTimeoutException: Read timed out
	at java.net.SocketInputStream.socketRead0(Native Method)
	at java.net.SocketInputStream.read(SocketInputStream.java:150)
	at java.net.SocketInputStream.read(SocketInputStream.java:121)
	at org.apache.http.impl.io.AbstractSessionInputBuffer.fillBuffer(AbstractSessionInputBuffer.java:149)
	at org.apache.http.impl.io.SocketInputBuffer.fillBuffer(SocketInputBuffer.java:111)
	at org.apache.http.impl.io.AbstractSessionInputBuffer.readLine(AbstractSessionInputBuffer.java:264)
	at org.apache.http.impl.conn.DefaultResponseParser.parseHead(DefaultResponseParser.java:98)
	at org.apache.http.impl.io.AbstractMessageParser.parse(AbstractMessageParser.java:252)
	at org.apache.http.impl.AbstractHttpClientConnection.receiveResponseHeader(AbstractHttpClientConnection.java:282)
	at org.apache.http.impl.conn.DefaultClientConnection.receiveResponseHeader(DefaultClientConnection.java:247)
	at org.apache.http.impl.conn.AbstractClientConnAdapter.receiveResponseHeader(AbstractClientConnAdapter.java:216)
	at org.apache.http.protocol.HttpRequestExecutor.doReceiveResponse(HttpRequestExecutor.java:298)
	at org.apache.http.protocol.HttpRequestExecutor.execute(HttpRequestExecutor.java:125)
	at org.apache.http.impl.client.DefaultRequestDirector.tryExecute(DefaultRequestDirector.java:647)
	at org.apache.http.impl.client.DefaultRequestDirector.execute(DefaultRequestDirector.java:464)
	at org.apache.http.impl.client.AbstractHttpClient.execute(AbstractHttpClient.java:820)
	at org.apache.http.impl.client.AbstractHttpClient.execute(AbstractHttpClient.java:754)
	at org.apache.http.impl.client.AbstractHttpClient.execute(AbstractHttpClient.java:732)
	at org.apache.solr.client.solrj.impl.HttpSolrServer.request(HttpSolrServer.java:352)
	... 5 more


FAILED:  junit.framework.TestSuite.org.apache.solr.cloud.BasicDistributedZkTest

Error Message:
Captured an uncaught exception in thread: Thread[id=2564, name=testExecutor-2049-thread-9, state=RUNNABLE, group=TGRP-BasicDistributedZkTest]

Stack Trace:
com.carrotsearch.randomizedtesting.UncaughtExceptionError: Captured an uncaught exception in thread: Thread[id=2564, name=testExecutor-2049-thread-9, state=RUNNABLE, group=TGRP-BasicDistributedZkTest]
Caused by: java.lang.RuntimeException: org.apache.solr.client.solrj.SolrServerException: Timeout occured while waiting response from server at: http://127.0.0.1:62037/g/s
	at __randomizedtesting.SeedInfo.seed([AFBEC97EF6771BBA]:0)
	at org.apache.solr.cloud.BasicDistributedZkTest$2.run(BasicDistributedZkTest.java:722)
	at java.util.concurrent.ThreadPoolExecutor.runWorker(ThreadPoolExecutor.java:1110)
	at java.util.concurrent.ThreadPoolExecutor$Worker.run(ThreadPoolExecutor.java:603)
	at java.lang.Thread.run(Thread.java:722)
Caused by: org.apache.solr.client.solrj.SolrServerException: Timeout occured while waiting response from server at: http://127.0.0.1:62037/g/s
	at org.apache.solr.client.solrj.impl.HttpSolrServer.request(HttpSolrServer.java:409)
	at org.apache.solr.client.solrj.impl.HttpSolrServer.request(HttpSolrServer.java:181)
	at org.apache.solr.cloud.BasicDistributedZkTest$2.run(BasicDistributedZkTest.java:720)
	... 3 more
Caused by: java.net.SocketTimeoutException: Read timed out
	at java.net.SocketInputStream.socketRead0(Native Method)
	at java.net.SocketInputStream.read(SocketInputStream.java:150)
	at java.net.SocketInputStream.read(SocketInputStream.java:121)
	at org.apache.http.impl.io.AbstractSessionInputBuffer.fillBuffer(AbstractSessionInputBuffer.java:149)
	at org.apache.http.impl.io.SocketInputBuffer.fillBuffer(SocketInputBuffer.java:111)
	at org.apache.http.impl.io.AbstractSessionInputBuffer.readLine(AbstractSessionInputBuffer.java:264)
	at org.apache.http.impl.conn.DefaultResponseParser.parseHead(DefaultResponseParser.java:98)
	at org.apache.http.impl.io.AbstractMessageParser.parse(AbstractMessageParser.java:252)
	at org.apache.http.impl.AbstractHttpClientConnection.receiveResponseHeader(AbstractHttpClientConnection.java:282)
	at org.apache.http.impl.conn.DefaultClientConnection.receiveResponseHeader(DefaultClientConnection.java:247)
	at org.apache.http.impl.conn.AbstractClientConnAdapter.receiveResponseHeader(AbstractClientConnAdapter.java:216)
	at org.apache.http.protocol.HttpRequestExecutor.doReceiveResponse(HttpRequestExecutor.java:298)
	at org.apache.http.protocol.HttpRequestExecutor.execute(HttpRequestExecutor.java:125)
	at org.apache.http.impl.client.DefaultRequestDirector.tryExecute(DefaultRequestDirector.java:647)
	at org.apache.http.impl.client.DefaultRequestDirector.execute(DefaultRequestDirector.java:464)
	at org.apache.http.impl.client.AbstractHttpClient.execute(AbstractHttpClient.java:820)
	at org.apache.http.impl.client.AbstractHttpClient.execute(AbstractHttpClient.java:754)
	at org.apache.http.impl.client.AbstractHttpClient.execute(AbstractHttpClient.java:732)
	at org.apache.solr.client.solrj.impl.HttpSolrServer.request(HttpSolrServer.java:352)
	... 5 more


FAILED:  junit.framework.TestSuite.org.apache.solr.cloud.BasicDistributedZkTest

Error Message:
Captured an uncaught exception in thread: Thread[id=2570, name=testExecutor-2049-thread-15, state=RUNNABLE, group=TGRP-BasicDistributedZkTest]

Stack Trace:
com.carrotsearch.randomizedtesting.UncaughtExceptionError: Captured an uncaught exception in thread: Thread[id=2570, name=testExecutor-2049-thread-15, state=RUNNABLE, group=TGRP-BasicDistributedZkTest]
Caused by: java.lang.RuntimeException: org.apache.solr.client.solrj.SolrServerException: Timeout occured while waiting response from server at: http://127.0.0.1:62037/g/s
	at __randomizedtesting.SeedInfo.seed([AFBEC97EF6771BBA]:0)
	at org.apache.solr.cloud.BasicDistributedZkTest$2.run(BasicDistributedZkTest.java:722)
	at java.util.concurrent.ThreadPoolExecutor.runWorker(ThreadPoolExecutor.java:1110)
	at java.util.concurrent.ThreadPoolExecutor$Worker.run(ThreadPoolExecutor.java:603)
	at java.lang.Thread.run(Thread.java:722)
Caused by: org.apache.solr.client.solrj.SolrServerException: Timeout occured while waiting response from server at: http://127.0.0.1:62037/g/s
	at org.apache.solr.client.solrj.impl.HttpSolrServer.request(HttpSolrServer.java:409)
	at org.apache.solr.client.solrj.impl.HttpSolrServer.request(HttpSolrServer.java:181)
	at org.apache.solr.cloud.BasicDistributedZkTest$2.run(BasicDistributedZkTest.java:720)
	... 3 more
Caused by: java.net.SocketTimeoutException: Read timed out
	at java.net.SocketInputStream.socketRead0(Native Method)
	at java.net.SocketInputStream.read(SocketInputStream.java:150)
	at java.net.SocketInputStream.read(SocketInputStream.java:121)
	at org.apache.http.impl.io.AbstractSessionInputBuffer.fillBuffer(AbstractSessionInputBuffer.java:149)
	at org.apache.http.impl.io.SocketInputBuffer.fillBuffer(SocketInputBuffer.java:111)
	at org.apache.http.impl.io.AbstractSessionInputBuffer.readLine(AbstractSessionInputBuffer.java:264)
	at org.apache.http.impl.conn.DefaultResponseParser.parseHead(DefaultResponseParser.java:98)
	at org.apache.http.impl.io.AbstractMessageParser.parse(AbstractMessageParser.java:252)
	at org.apache.http.impl.AbstractHttpClientConnection.receiveResponseHeader(AbstractHttpClientConnection.java:282)
	at org.apache.http.impl.conn.DefaultClientConnection.receiveResponseHeader(DefaultClientConnection.java:247)
	at org.apache.http.impl.conn.AbstractClientConnAdapter.receiveResponseHeader(AbstractClientConnAdapter.java:216)
	at org.apache.http.protocol.HttpRequestExecutor.doReceiveResponse(HttpRequestExecutor.java:298)
	at org.apache.http.protocol.HttpRequestExecutor.execute(HttpRequestExecutor.java:125)
	at org.apache.http.impl.client.DefaultRequestDirector.tryExecute(DefaultRequestDirector.java:647)
	at org.apache.http.impl.client.DefaultRequestDirector.execute(DefaultRequestDirector.java:464)
	at org.apache.http.impl.client.AbstractHttpClient.execute(AbstractHttpClient.java:820)
	at org.apache.http.impl.client.AbstractHttpClient.execute(AbstractHttpClient.java:754)
	at org.apache.http.impl.client.AbstractHttpClient.execute(AbstractHttpClient.java:732)
	at org.apache.solr.client.solrj.impl.HttpSolrServer.request(HttpSolrServer.java:352)
	... 5 more


FAILED:  junit.framework.TestSuite.org.apache.solr.cloud.BasicDistributedZkTest

Error Message:
Captured an uncaught exception in thread: Thread[id=2678, name=testExecutor-2199-thread-3, state=RUNNABLE, group=TGRP-BasicDistributedZkTest]

Stack Trace:
com.carrotsearch.randomizedtesting.UncaughtExceptionError: Captured an uncaught exception in thread: Thread[id=2678, name=testExecutor-2199-thread-3, state=RUNNABLE, group=TGRP-BasicDistributedZkTest]
Caused by: org.apache.solr.common.SolrException: No such core exists 'multiunload2'
	at __randomizedtesting.SeedInfo.seed([AFBEC97EF6771BBA]:0)
	at org.apache.solr.client.solrj.impl.HttpSolrServer.request(HttpSolrServer.java:401)
	at org.apache.solr.client.solrj.impl.HttpSolrServer.request(HttpSolrServer.java:181)
	at org.apache.solr.cloud.BasicDistributedZkTest$1.run(BasicDistributedZkTest.java:656)
	at java.util.concurrent.ThreadPoolExecutor.runWorker(ThreadPoolExecutor.java:1110)
	at java.util.concurrent.ThreadPoolExecutor$Worker.run(ThreadPoolExecutor.java:603)
	at java.lang.Thread.run(Thread.java:722)


FAILED:  junit.framework.TestSuite.org.apache.solr.cloud.BasicDistributedZkTest

Error Message:
Captured an uncaught exception in thread: Thread[id=2679, name=testExecutor-2199-thread-4, state=RUNNABLE, group=TGRP-BasicDistributedZkTest]

Stack Trace:
com.carrotsearch.randomizedtesting.UncaughtExceptionError: Captured an uncaught exception in thread: Thread[id=2679, name=testExecutor-2199-thread-4, state=RUNNABLE, group=TGRP-BasicDistributedZkTest]
Caused by: org.apache.solr.common.SolrException: No such core exists 'multiunload3'
	at __randomizedtesting.SeedInfo.seed([AFBEC97EF6771BBA]:0)
	at org.apache.solr.client.solrj.impl.HttpSolrServer.request(HttpSolrServer.java:401)
	at org.apache.solr.client.solrj.impl.HttpSolrServer.request(HttpSolrServer.java:181)
	at org.apache.solr.cloud.BasicDistributedZkTest$1.run(BasicDistributedZkTest.java:656)
	at java.util.concurrent.ThreadPoolExecutor.runWorker(ThreadPoolExecutor.java:1110)
	at java.util.concurrent.ThreadPoolExecutor$Worker.run(ThreadPoolExecutor.java:603)
	at java.lang.Thread.run(Thread.java:722)


FAILED:  junit.framework.TestSuite.org.apache.solr.cloud.BasicDistributedZkTest

Error Message:
Captured an uncaught exception in thread: Thread[id=2683, name=testExecutor-2199-thread-8, state=RUNNABLE, group=TGRP-BasicDistributedZkTest]

Stack Trace:
com.carrotsearch.randomizedtesting.UncaughtExceptionError: Captured an uncaught exception in thread: Thread[id=2683, name=testExecutor-2199-thread-8, state=RUNNABLE, group=TGRP-BasicDistributedZkTest]
Caused by: org.apache.solr.common.SolrException: No such core exists 'multiunload8'
	at __randomizedtesting.SeedInfo.seed([AFBEC97EF6771BBA]:0)
	at org.apache.solr.client.solrj.impl.HttpSolrServer.request(HttpSolrServer.java:401)
	at org.apache.solr.client.solrj.impl.HttpSolrServer.request(HttpSolrServer.java:181)
	at org.apache.solr.cloud.BasicDistributedZkTest$1.run(BasicDistributedZkTest.java:656)
	at java.util.concurrent.ThreadPoolExecutor.runWorker(ThreadPoolExecutor.java:1110)
	at java.util.concurrent.ThreadPoolExecutor$Worker.run(ThreadPoolExecutor.java:603)
	at java.lang.Thread.run(Thread.java:722)


FAILED:  junit.framework.TestSuite.org.apache.solr.cloud.BasicDistributedZkTest

Error Message:
Captured an uncaught exception in thread: Thread[id=2682, name=testExecutor-2199-thread-7, state=RUNNABLE, group=TGRP-BasicDistributedZkTest]

Stack Trace:
com.carrotsearch.randomizedtesting.UncaughtExceptionError: Captured an uncaught exception in thread: Thread[id=2682, name=testExecutor-2199-thread-7, state=RUNNABLE, group=TGRP-BasicDistributedZkTest]
Caused by: org.apache.solr.common.SolrException: No such core exists 'multiunload6'
	at __randomizedtesting.SeedInfo.seed([AFBEC97EF6771BBA]:0)
	at org.apache.solr.client.solrj.impl.HttpSolrServer.request(HttpSolrServer.java:401)
	at org.apache.solr.client.solrj.impl.HttpSolrServer.request(HttpSolrServer.java:181)
	at org.apache.solr.cloud.BasicDistributedZkTest$1.run(BasicDistributedZkTest.java:656)
	at java.util.concurrent.ThreadPoolExecutor.runWorker(ThreadPoolExecutor.java:1110)
	at java.util.concurrent.ThreadPoolExecutor$Worker.run(ThreadPoolExecutor.java:603)
	at java.lang.Thread.run(Thread.java:722)




Build Log:
[...truncated 8597 lines...]
[junit4:junit4] Suite: org.apache.solr.handler.component.DistributedMLTComponentTest
[junit4:junit4]   2> 238 T11 oas.BaseDistributedSearchTestCase.initHostContext Setting hostContext system property: /jzcx/
[junit4:junit4]   2> 316 T11 oas.SolrTestCaseJ4.setUp ###Starting testDistribSearch
[junit4:junit4]   2> 968 T11 oejs.Server.doStart jetty-8.1.8.v20121106
[junit4:junit4]   2> 1375 T11 oejs.AbstractConnector.doStart Started SocketConnector@127.0.0.1:63409
[junit4:junit4]   2> 1563 T11 oasc.SolrResourceLoader.locateSolrHome JNDI not configured for solr (NoInitialContextEx)
[junit4:junit4]   2> 1564 T11 oasc.SolrResourceLoader.locateSolrHome using system property solr.solr.home: /usr/home/hudson/hudson-slave/workspace/Lucene-Solr-Tests-4.x-java7/solr/build/solr-core/test-files/solr
[junit4:junit4]   2> 1564 T11 oasc.SolrResourceLoader.<init> new SolrResourceLoader for deduced Solr Home: '/usr/home/hudson/hudson-slave/workspace/Lucene-Solr-Tests-4.x-java7/solr/build/solr-core/test-files/solr/'
[junit4:junit4]   2> 2303 T11 oass.SolrDispatchFilter.init SolrDispatchFilter.init()
[junit4:junit4]   2> 2307 T11 oasc.SolrResourceLoader.locateSolrHome JNDI not configured for solr (NoInitialContextEx)
[junit4:junit4]   2> 2308 T11 oasc.SolrResourceLoader.locateSolrHome using system property solr.solr.home: /usr/home/hudson/hudson-slave/workspace/Lucene-Solr-Tests-4.x-java7/solr/build/solr-core/test-files/solr
[junit4:junit4]   2> 2350 T11 oasc.CoreContainer$Initializer.initialize looking for solr.xml: /usr/home/hudson/hudson-slave/workspace/Lucene-Solr-Tests-4.x-java7/solr/build/solr-core/test-files/solr/solr.xml
[junit4:junit4]   2> 2355 T11 oasc.CoreContainer.<init> New CoreContainer 352120656
[junit4:junit4]   2> 2357 T11 oasc.CoreContainer.load Loading CoreContainer using Solr Home: '/usr/home/hudson/hudson-slave/workspace/Lucene-Solr-Tests-4.x-java7/solr/build/solr-core/test-files/solr/'
[junit4:junit4]   2> 2357 T11 oasc.SolrResourceLoader.<init> new SolrResourceLoader for directory: '/usr/home/hudson/hudson-slave/workspace/Lucene-Solr-Tests-4.x-java7/solr/build/solr-core/test-files/solr/'
[junit4:junit4]   2> 2471 T11 oashc.HttpShardHandlerFactory.getParameter Setting socketTimeout to: 30000
[junit4:junit4]   2> 2471 T11 oashc.HttpShardHandlerFactory.getParameter Setting urlScheme to: http://
[junit4:junit4]   2> 2472 T11 oashc.HttpShardHandlerFactory.getParameter Setting connTimeout to: 15000
[junit4:junit4]   2> 2473 T11 oashc.HttpShardHandlerFactory.getParameter Setting maxConnectionsPerHost to: 20
[junit4:junit4]   2> 2473 T11 oashc.HttpShardHandlerFactory.getParameter Setting corePoolSize to: 0
[junit4:junit4]   2> 2474 T11 oashc.HttpShardHandlerFactory.getParameter Setting maximumPoolSize to: 2147483647
[junit4:junit4]   2> 2475 T11 oashc.HttpShardHandlerFactory.getParameter Setting maxThreadIdleTime to: 5
[junit4:junit4]   2> 2475 T11 oashc.HttpShardHandlerFactory.getParameter Setting sizeOfQueue to: -1
[junit4:junit4]   2> 2476 T11 oashc.HttpShardHandlerFactory.getParameter Setting fairnessPolicy to: false
[junit4:junit4]   2> 2540 T11 oascsi.HttpClientUtil.createClient Creating new http client, config:maxConnectionsPerHost=20&maxConnections=10000&socketTimeout=30000&connTimeout=15000&retry=false
[junit4:junit4]   2> 3127 T11 oasc.CoreContainer.load Registering Log Listener
[junit4:junit4]   2> 3471 T25 oasc.CoreContainer.create Creating SolrCore 'collection1' using instanceDir: /usr/home/hudson/hudson-slave/workspace/Lucene-Solr-Tests-4.x-java7/solr/build/solr-core/test-files/solr/collection1
[junit4:junit4]   2> 3473 T25 oasc.SolrResourceLoader.<init> new SolrResourceLoader for directory: '/usr/home/hudson/hudson-slave/workspace/Lucene-Solr-Tests-4.x-java7/solr/build/solr-core/test-files/solr/collection1/'
[junit4:junit4]   2> 3475 T25 oasc.SolrResourceLoader.replaceClassLoader Adding 'file:/usr/home/hudson/hudson-slave/workspace/Lucene-Solr-Tests-4.x-java7/solr/build/solr-core/test-files/solr/collection1/lib/classes/' to classloader
[junit4:junit4]   2> 3477 T25 oasc.SolrResourceLoader.replaceClassLoader Adding 'file:/usr/home/hudson/hudson-slave/workspace/Lucene-Solr-Tests-4.x-java7/solr/build/solr-core/test-files/solr/collection1/lib/README' to classloader
[junit4:junit4]   2> 3792 T25 oasc.SolrConfig.<init> Using Lucene MatchVersion: LUCENE_41
[junit4:junit4]   2> 4094 T25 oasc.SolrConfig.<init> Loaded SolrConfig: solrconfig.xml
[junit4:junit4]   2> 4126 T25 oass.IndexSchema.readSchema Reading Solr Schema
[junit4:junit4]   2> 4203 T25 oass.IndexSchema.readSchema Schema name=test
[junit4:junit4]   2> 6167 T25 oass.OpenExchangeRatesOrgProvider.init Initialized with rates=open-exchange-rates.json, refreshInterval=1440.
[junit4:junit4]   2> 6210 T25 oass.IndexSchema.readSchema default search field in schema is text
[junit4:junit4]   2> 6216 T25 oass.IndexSchema.readSchema unique key field: id
[junit4:junit4]   2> 6720 T25 oass.FileExchangeRateProvider.reload Reloading exchange rates from file currency.xml
[junit4:junit4]   2> 6742 T25 oass.FileExchangeRateProvider.reload Reloading exchange rates from file currency.xml
[junit4:junit4]   2> 6748 T25 oass.OpenExchangeRatesOrgProvider.reload Reloading exchange rates from open-exchange-rates.json
[junit4:junit4]   2> 6770 T25 oass.OpenExchangeRatesOrgProvider.reload Reloading exchange rates from open-exchange-rates.json
[junit4:junit4]   2> 6875 T25 oasc.SolrCore.<init> [collection1] Opening new SolrCore at /usr/home/hudson/hudson-slave/workspace/Lucene-Solr-Tests-4.x-java7/solr/build/solr-core/test-files/solr/collection1/, dataDir=./org.apache.solr.handler.component.DistributedMLTComponentTest-1355715647251/control/data/
[junit4:junit4]   2> 6880 T25 oasc.JmxMonitoredMap.<init> JMX monitoring is enabled. Adding Solr mbeans to JMX Server: com.sun.jmx.mbeanserver.JmxMBeanServer@74ee486
[junit4:junit4]   2> 7029 T25 oasc.SolrCore.initDirectoryFactory org.apache.solr.core.MockDirectoryFactory
[junit4:junit4]   2> 7204 T25 oasc.CachingDirectoryFactory.get return new directory for /usr/home/hudson/hudson-slave/workspace/Lucene-Solr-Tests-4.x-java7/solr/build/solr-core/test/J0/./org.apache.solr.handler.component.DistributedMLTComponentTest-1355715647251/control/data forceNew:false
[junit4:junit4]   2> 7204 T25 oasc.CachingDirectoryFactory.close Releasing directory:/usr/home/hudson/hudson-slave/workspace/Lucene-Solr-Tests-4.x-java7/solr/build/solr-core/test/J0/./org.apache.solr.handler.component.DistributedMLTComponentTest-1355715647251/control/data
[junit4:junit4]   2> 7205 T25 oasc.SolrCore.getNewIndexDir New index directory detected: old=null new=./org.apache.solr.handler.component.DistributedMLTComponentTest-1355715647251/control/data/index/
[junit4:junit4]   2> 7206 T25 oasc.SolrCore.initIndex WARNING [collection1] Solr index directory './org.apache.solr.handler.component.DistributedMLTComponentTest-1355715647251/control/data/index' doesn't exist. Creating new index...
[junit4:junit4]   2> 7227 T25 oasc.CachingDirectoryFactory.get return new directory for /usr/home/hudson/hudson-slave/workspace/Lucene-Solr-Tests-4.x-java7/solr/build/solr-core/test/J0/./org.apache.solr.handler.component.DistributedMLTComponentTest-1355715647251/control/data/index forceNew:false
[junit4:junit4]   2> 7681 T25 oasc.SolrDeletionPolicy.onCommit SolrDeletionPolicy.onCommit: commits:num=1
[junit4:junit4]   2> 		commit{dir=RateLimitedDirectoryWrapper(MockDirWrapper(org.apache.lucene.store.RAMDirectory@93bf890 lockFactory=org.apache.lucene.store.NativeFSLockFactory@115c9326)),segFN=segments_1,generation=1,filenames=[segments_1]
[junit4:junit4]   2> 7682 T25 oasc.SolrDeletionPolicy.updateCommits newest commit = 1[segments_1]
[junit4:junit4]   2> 7683 T25 oasc.CachingDirectoryFactory.close Releasing directory:/usr/home/hudson/hudson-slave/workspace/Lucene-Solr-Tests-4.x-java7/solr/build/solr-core/test/J0/./org.apache.solr.handler.component.DistributedMLTComponentTest-1355715647251/control/data/index
[junit4:junit4]   2> 7712 T25 oasc.SolrCore.initWriters created xml: solr.XMLResponseWriter
[junit4:junit4]   2> 8968 T25 oasup.UpdateRequestProcessorChain.init inserting DistributedUpdateProcessorFactory into updateRequestProcessorChain "dedupe"
[junit4:junit4]   2> 8969 T25 oasup.UpdateRequestProcessorChain.init inserting DistributedUpdateProcessorFactory into updateRequestProcessorChain "dedupe-allfields"
[junit4:junit4]   2> 8970 T25 oasup.UpdateRequestProcessorChain.init inserting DistributedUpdateProcessorFactory into updateRequestProcessorChain "stored_sig"
[junit4:junit4]   2> 8976 T25 oasup.UpdateRequestProcessorChain.init inserting DistributedUpdateProcessorFactory into updateRequestProcessorChain "uniq-fields"
[junit4:junit4]   2> 9073 T25 oasup.UpdateRequestProcessorChain.init inserting DistributedUpdateProcessorFactory into updateRequestProcessorChain "distrib-dup-test-chain-implicit"
[junit4:junit4]   2> 9085 T25 oasc.RequestHandlers.initHandlersFromConfig adding lazy requestHandler: solr.ReplicationHandler
[junit4:junit4]   2> 9089 T25 oasc.RequestHandlers.initHandlersFromConfig created /replication: solr.ReplicationHandler
[junit4:junit4]   2> 9119 T25 oasc.RequestHandlers.initHandlersFromConfig created standard: solr.StandardRequestHandler
[junit4:junit4]   2> 9137 T25 oasc.RequestHandlers.initHandlersFromConfig created /get: solr.RealTimeGetHandler
[junit4:junit4]   2> 9193 T25 oasc.RequestHandlers.initHandlersFromConfig created dismax: solr.SearchHandler
[junit4:junit4]   2> 9197 T25 oasc.RequestHandlers.initHandlersFromConfig created mock: org.apache.solr.core.MockQuerySenderListenerReqHandler
[junit4:junit4]   2> 9201 T25 oasc.RequestHandlers.initHandlersFromConfig created /admin/: org.apache.solr.handler.admin.AdminHandlers
[junit4:junit4]   2> 9203 T25 oasc.RequestHandlers.initHandlersFromConfig created defaults: solr.StandardRequestHandler
[junit4:junit4]   2> 9204 T25 oasc.RequestHandlers.initHandlersFromConfig adding lazy requestHandler: solr.StandardRequestHandler
[junit4:junit4]   2> 9204 T25 oasc.RequestHandlers.initHandlersFromConfig created lazy: solr.StandardRequestHandler
[junit4:junit4]   2> 9240 T25 oasc.RequestHandlers.initHandlersFromConfig created /update: solr.UpdateRequestHandler
[junit4:junit4]   2> 9242 T25 oasc.RequestHandlers.initHandlersFromConfig created /terms: org.apache.solr.handler.component.SearchHandler
[junit4:junit4]   2> 9244 T25 oasc.RequestHandlers.initHandlersFromConfig created spellCheckCompRH: org.apache.solr.handler.component.SearchHandler
[junit4:junit4]   2> 9247 T25 oasc.RequestHandlers.initHandlersFromConfig created spellCheckCompRH_Direct: org.apache.solr.handler.component.SearchHandler
[junit4:junit4]   2> 9249 T25 oasc.RequestHandlers.initHandlersFromConfig created spellCheckWithWordbreak: org.apache.solr.handler.component.SearchHandler
[junit4:junit4]   2> 9252 T25 oasc.RequestHandlers.initHandlersFromConfig created spellCheckWithWordbreak_Direct: org.apache.solr.handler.component.SearchHandler
[junit4:junit4]   2> 9254 T25 oasc.RequestHandlers.initHandlersFromConfig created spellCheckCompRH1: org.apache.solr.handler.component.SearchHandler
[junit4:junit4]   2> 9256 T25 oasc.RequestHandlers.initHandlersFromConfig created mltrh: org.apache.solr.handler.component.SearchHandler
[junit4:junit4]   2> 9258 T25 oasc.RequestHandlers.initHandlersFromConfig created tvrh: org.apache.solr.handler.component.SearchHandler
[junit4:junit4]   2> 9287 T25 oasc.RequestHandlers.initHandlersFromConfig created /mlt: solr.MoreLikeThisHandler
[junit4:junit4]   2> 9315 T25 oasc.RequestHandlers.initHandlersFromConfig created /debug/dump: solr.DumpRequestHandler
[junit4:junit4]   2> 9489 T25 oashl.XMLLoader.init xsltCacheLifetimeSeconds=60
[junit4:junit4]   2> 9519 T25 oasc.SolrCore.initDeprecatedSupport WARNING solrconfig.xml uses deprecated <admin/gettableFiles>, Please update your config to use the ShowFileRequestHandler.
[junit4:junit4]   2> 9528 T25 oasc.SolrCore.initDeprecatedSupport WARNING adding ShowFileRequestHandler with hidden files: [THROW.ERROR.ON.ADD.UPDATEPROCESSOR.JS, SOLRCONFIG-HIGHLIGHT.XML, SCHEMA-REQUIRED-FIELDS.XML, BAD-SCHEMA-DUP-DYNAMICFIELD.XML, SCHEMA-REPLICATION2.XML, TRIVIAL.UPDATEPROCESSOR1.JS, SCHEMA-MINIMAL.XML, SOLRCONFIG-CACHING.XML, SOLRCONFIG-REPEATER.XML, BAD-SCHEMA-NONTEXT-ANALYZER.XML, SOLRCONFIG-MERGEPOLICY.XML, CURRENCY.XML, SOLRCONFIG-TLOG.XML, SOLRCONFIG-MASTER.XML, BAD-SCHEMA-UNIQUEKEY-MULTIVALUED.XML, SCHEMA11.XML, SOLRCONFIG-BASIC.XML, DA_COMPOUNDDICTIONARY.TXT, MISSLEADING.EXTENSION.UPDATEPROCESSOR.JS.TXT, SCHEMA-COPYFIELD-TEST.XML, SOLRCONFIG-SLAVE.XML, SOLRCONFIG-PROPINJECT-INDEXDEFAULT.XML, ELEVATE.XML, TRIVIAL.UPDATEPROCESSOR0.JS, BAD-SOLRCONFIG-BOGUS-SCRIPTENGINE-NAME.XML, SCHEMA-CHARFILTERS.XML, SCHEMA-IB.XML, SOLRCONFIG-QUERYSENDER.XML, SOLRCONFIG-SNIPPET-PROCESSOR.XML, SCHEMA-REPLICATION1.XML, DA_UTF8.XML, CONDITIONAL.UPDATEPROCESSOR.JS, MISSING.FUNCTIONS.UPDATEPROCESSOR.JS, HYPHENATION.DTD, SOLRCONFIG-ENABLEPLUGIN.XML, STEMDICT.TXT, SCHEMA-PHRASESUGGEST.XML, HUNSPELL-TEST.AFF, SCHEMA-SNIPPET-TYPE.XML, STOPTYPES-1.TXT, STOPWORDSWRONGENCODING.TXT, SCHEMA-NUMERIC.XML, SOLRCONFIG-TRANSFORMERS.XML, SOLRCONFIG-PROPINJECT.XML, BAD-SCHEMA-NOT-INDEXED-BUT-TF.XML, SOLRCONFIG-SIMPLELOCK.XML, WDFTYPES.TXT, STOPTYPES-2.TXT, SCHEMA-REVERSED.XML, BAD-SCHEMA-CURRENCY-FT-MULTIVALUED.XML, SOLRCONFIG-SPELLCHECKCOMPONENT.XML, BAD-SCHEMA-CURRENCY-MULTIVALUED.XML, SOLRCONFIG-PHRASESUGGEST.XML, SCHEMA-DFR.XML, BAD-SCHEMA-NOT-INDEXED-BUT-POS.XML, KEEP-1.TXT, SCHEMA-SPATIAL.XML, OPEN-EXCHANGE-RATES.JSON, STOPWITHBOM.TXT, SCHEMA-BINARYFIELD.XML, SOLRCONFIG-SPELLCHECKER.XML, SOLRCONFIG-UPDATE-PROCESSOR-CHAINS.XML, BAD-SCHEMA-OMIT-TF-BUT-NOT-POS.XML, BAD-SCHEMA-DUP-FIELDTYPE.XML, SCHEMA-XINCLUDE.XML, SOLRCONFIG-MASTER1.XML, SCHEMA-BEHAVIOR.XML, SYNONYMS.TXT, BAD-SCHEMA-CURRENCY-DYNAMIC-MULTIVALUED.XML, SCHEMA.XML, SCHEMA_CODEC.XML, SOLRCONFIG-SOLR-749.XML, SOLRCONFIG-MASTER1-KEEPONEBACKUP.XML, SCHEMA-EFF.XML, STOP-2.TXT, SOLRCONFIG-FUNCTIONQUERY.XML, SCHEMA-LMDIRICHLET.XML, SOLRCONFIG-TERMINDEX.XML, SOLRCONFIG-ELEVATE.XML, SCHEMA-FOLDING.XML, STOPWORDS.TXT, SCHEMA-STOP-KEEP.XML, FUZZYSUGGEST.TXT, BAD-SCHEMA-NOT-INDEXED-BUT-NORMS.XML, SOLRCONFIG-SOLCOREPROPERTIES.XML, STOP-1.TXT, SOLRCONFIG-MASTER2.XML, SCHEMA-SPELLCHECKER.XML, SOLRCONFIG-RESPONSE-LOG-COMPONENT.XML, SOLRCONFIG-LAZYWRITER.XML, SCHEMA-LUCENEMATCHVERSION.XML, BAD-MP-SOLRCONFIG.XML, FRENCHARTICLES.TXT, SCHEMA15.XML, SOLRCONFIG-REQHANDLER.INCL, SCHEMASURROUND.XML, SCHEMA-COLLATEFILTER.XML, SOLRCONFIG-MASTER3.XML, HUNSPELL-TEST.DIC, SOLRCONFIG-XINCLUDE.XML, BAD-SCHEMA-CODEC-GLOBAL-VS-FT-MISMATCH.XML, SOLRCONFIG-SLAVE1.XML, SOLRCONFIG-DELPOLICY1.XML, SCHEMA-SIM.XML, SCHEMA-SNIPPET-FIELD.XML, SCHEMA-COLLATE.XML, STOP-SNOWBALL.TXT, BAD-SCHEMA-SIM-GLOBAL-VS-FT-MISMATCH.XML, PROTWORDS.TXT, SCHEMA-TRIE.XML, SOLRCONFIG_CODEC.XML, BAD-SOLRCONFIG-INVALID-SCRIPTFILE.XML, JASUGGEST.TXT, SCHEMA-TFIDF.XML, SOLRCONFIG-SCRIPT-UPDATEPROCESSOR.XML, SCHEMA-LMJELINEKMERCER.XML, PHRASESUGGEST.TXT, BAD-SOLRCONFIG-MISSING-SCRIPTFILE.XML, SOLRCONFIG-BASIC-LUCENEVERSION31.XML, BAD-SCHEMA-UNIQUEKEY-USES-DEFAULT.XML, OLD_SYNONYMS.TXT, SOLRCONFIG-DELPOLICY2.XML, SOLRCONFIG-NATIVELOCK.XML, XSLT, BAD-SCHEMA-DUP-FIELD.XML, SOLRCONFIG-NOCACHE.XML, SCHEMA-BM25.XML, ADDFIELDS.UPDATEPROCESSOR.JS, SOLRCONFIG-QUERYSENDER-NOQUERY.XML, SOLRCONFIG-ALTDIRECTORY.XML, COMPOUNDDICTIONARY.TXT, SOLRCONFIG-INDEXCONFIG.XML, SOLRCONFIG_PERF.XML, SCHEMA-NOT-REQUIRED-UNIQUE-KEY.XML, BAD-SCHEMA-ANALYZER-CLASS-AND-NESTED.XML, KEEP-2.TXT, BAD-SCHEMA-UNIQUEKEY-IS-COPYFIELD-DEST.XML, SCHEMA12.XML, MAPPING-ISOLATIN1ACCENT.TXT, BAD_SOLRCONFIG.XML, BAD-SCHEMA-EXTERNAL-FILEFIELD.XML]
[junit4:junit4]   2> 9535 T25 oasc.CachingDirectoryFactory.close Releasing directory:/usr/home/hudson/hudson-slave/workspace/Lucene-Solr-Tests-4.x-java7/solr/build/solr-core/test/J0/./org.apache.solr.handler.component.DistributedMLTComponentTest-1355715647251/control/data
[junit4:junit4]   2> 9593 T25 oass.SolrIndexSearcher.<init> Opening Searcher@81be240 main
[junit4:junit4]   2> 9659 T25 oasu.CommitTracker.<init> Hard AutoCommit: disabled
[junit4:junit4]   2> 9659 T25 oasu.CommitTracker.<init> Soft AutoCommit: disabled
[junit4:junit4]   2> 9661 T25 oashc.SpellCheckComponent.inform Initializing spell checkers
[junit4:junit4]   2> 9809 T25 oass.DirectSolrSpellChecker.init init: {name=direct,classname=DirectSolrSpellChecker,field=lowerfilt,minQueryLength=3}
[junit4:junit4]   2> 10214 T26 oasc.SolrCore.registerSearcher [collection1] Registered new searcher Searcher@81be240 main{StandardDirectoryReader(segments_1:1)}
[junit4:junit4]   2> 10235 T25 oasc.CoreContainer.registerCore registering core: collection1
[junit4:junit4]   2> 10240 T11 oass.SolrDispatchFilter.init user.dir=/usr/home/hudson/hudson-slave/workspace/Lucene-Solr-Tests-4.x-java7/solr/build/solr-core/test/J0
[junit4:junit4]   2> 10241 T11 oass.SolrDispatchFilter.init SolrDispatchFilter.init() done
[junit4:junit4]   2> 10296 T11 oascsi.HttpClientUtil.createClient Creating new http client, config:maxConnections=128&maxConnectionsPerHost=32&followRedirects=false
[junit4:junit4]   2> 10320 T11 oejs.Server.doStart jetty-8.1.8.v20121106
[junit4:junit4]   2> 10323 T11 oejs.AbstractConnector.doStart Started SocketConnector@127.0.0.1:47666
[junit4:junit4]   2> 10324 T11 oasc.SolrResourceLoader.locateSolrHome JNDI not configured for solr (NoInitialContextEx)
[junit4:junit4]   2> 10324 T11 oasc.SolrResourceLoader.locateSolrHome using system property solr.solr.home: /usr/home/hudson/hudson-slave/workspace/Lucene-Solr-Tests-4.x-java7/solr/build/solr-core/test-files/solr
[junit4:junit4]   2> 10325 T11 oasc.SolrResourceLoader.<init> new SolrResourceLoader for deduced Solr Home: '/usr/home/hudson/hudson-slave/workspace/Lucene-Solr-Tests-4.x-java7/solr/build/solr-core/test-files/solr/'
[junit4:junit4]   2> 10361 T11 oass.SolrDispatchFilter.init SolrDispatchFilter.init()
[junit4:junit4]   2> 10362 T11 oasc.SolrResourceLoader.locateSolrHome JNDI not configured for solr (NoInitialContextEx)
[junit4:junit4]   2> 10362 T11 oasc.SolrResourceLoader.locateSolrHome using system property solr.solr.home: /usr/home/hudson/hudson-slave/workspace/Lucene-Solr-Tests-4.x-java7/solr/build/solr-core/test-files/solr
[junit4:junit4]   2> 10363 T11 oasc.CoreContainer$Initializer.initialize looking for solr.xml: /usr/home/hudson/hudson-slave/workspace/Lucene-Solr-Tests-4.x-java7/solr/build/solr-core/test-files/solr/solr.xml
[junit4:junit4]   2> 10363 T11 oasc.CoreContainer.<init> New CoreContainer 1180904681
[junit4:junit4]   2> 10364 T11 oasc.CoreContainer.load Loading CoreContainer using Solr Home: '/usr/home/hudson/hudson-slave/workspace/Lucene-Solr-Tests-4.x-java7/solr/build/solr-core/test-files/solr/'
[junit4:junit4]   2> 10365 T11 oasc.SolrResourceLoader.<init> new SolrResourceLoader for directory: '/usr/home/hudson/hudson-slave/workspace/Lucene-Solr-Tests-4.x-java7/solr/build/solr-core/test-files/solr/'
[junit4:junit4]   2> 10393 T11 oashc.HttpShardHandlerFactory.getParameter Setting socketTimeout to: 30000
[junit4:junit4]   2> 10394 T11 oashc.HttpShardHandlerFactory.getParameter Setting urlScheme to: http://
[junit4:junit4]   2> 10394 T11 oashc.HttpShardHandlerFactory.getParameter Setting connTimeout to: 15000
[junit4:junit4]   2> 10395 T11 oashc.HttpShardHandlerFactory.getParameter Setting maxConnectionsPerHost to: 20
[junit4:junit4]   2> 10395 T11 oashc.HttpShardHandlerFactory.getParameter Setting corePoolSize to: 0
[junit4:junit4]   2> 10396 T11 oashc.HttpShardHandlerFactory.getParameter Setting maximumPoolSize to: 2147483647
[junit4:junit4]   2> 10397 T11 oashc.HttpShardHandlerFactory.getParameter Setting maxThreadIdleTime to: 5
[junit4:junit4]   2> 10397 T11 oashc.HttpShardHandlerFactory.getParameter Setting sizeOfQueue to: -1
[junit4:junit4]   2> 10398 T11 oashc.HttpShardHandlerFactory.getParameter Setting fairnessPolicy to: false
[junit4:junit4]   2> 10398 T11 oascsi.HttpClientUtil.createClient Creating new http client, config:maxConnectionsPerHost=20&maxConnections=10000&socketTimeout=30000&connTimeout=15000&retry=false
[junit4:junit4]   2> 10415 T11 oasc.CoreContainer.load Registering Log Listener
[junit4:junit4]   2> 10442 T36 oasc.CoreContainer.create Creating SolrCore 'collection1' using instanceDir: /usr/home/hudson/hudson-slave/workspace/Lucene-Solr-Tests-4.x-java7/solr/build/solr-core/test-files/solr/collection1
[junit4:junit4]   2> 10444 T36 oasc.SolrResourceLoader.<init> new SolrResourceLoader for directory: '/usr/home/hudson/hudson-slave/workspace/Lucene-Solr-Tests-4.x-java7/solr/build/solr-core/test-files/solr/collection1/'
[junit4:junit4]   2> 10445 T36 oasc.SolrResourceLoader.replaceClassLoader Adding 'file:/usr/home/hudson/hudson-slave/workspace/Lucene-Solr-Tests-4.x-java7/solr/build/solr-core/test-files/solr/collection1/lib/classes/' to classloader
[junit4:junit4]   2> 10446 T36 oasc.SolrResourceLoader.replaceClassLoader Adding 'file:/usr/home/hudson/hudson-slave/workspace/Lucene-Solr-Tests-4.x-java7/solr/build/solr-core/test-files/solr/collection1/lib/README' to classloader
[junit4:junit4]   2> 10587 T36 oasc.SolrConfig.<init> Using Lucene MatchVersion: LUCENE_41
[junit4:junit4]   2> 10704 T36 oasc.SolrConfig.<init> Loaded SolrConfig: solrconfig.xml
[junit4:junit4]   2> 10705 T36 oass.IndexSchema.readSchema Reading Solr Schema
[junit4:junit4]   2> 10784 T36 oass.IndexSchema.readSchema Schema name=test
[junit4:junit4]   2> 11467 T36 oass.OpenExchangeRatesOrgProvider.init Initialized with rates=open-exchange-rates.json, refreshInterval=1440.
[junit4:junit4]   2> 11482 T36 oass.IndexSchema.readSchema default search field in schema is text
[junit4:junit4]   2> 11486 T36 oass.IndexSchema.readSchema unique key field: id
[junit4:junit4]   2> 11508 T36 oass.FileExchangeRateProvider.reload Reloading exchange rates from file currency.xml
[junit4:junit4]   2> 11522 T36 oass.FileExchangeRateProvider.reload Reloading exchange rates from file currency.xml
[junit4:junit4]   2> 11527 T36 oass.OpenExchangeRatesOrgProvider.reload Reloading exchange rates from open-exchange-rates.json
[junit4:junit4]   2> 11530 T36 oass.OpenExchangeRatesOrgProvider.reload Reloading exchange rates from open-exchange-rates.json
[junit4:junit4]   2> 11533 T36 oasc.SolrCore.<init> [collection1] Opening new SolrCore at /usr/home/hudson/hudson-slave/workspace/Lucene-Solr-Tests-4.x-java7/solr/build/solr-core/test-files/solr/collection1/, dataDir=./org.apache.solr.handler.component.DistributedMLTComponentTest-1355715647251/shard0/data/
[junit4:junit4]   2> 11533 T36 oasc.JmxMonitoredMap.<init> JMX monitoring is enabled. Adding Solr mbeans to JMX Server: com.sun.jmx.mbeanserver.JmxMBeanServer@74ee486
[junit4:junit4]   2> 11535 T36 oasc.SolrCore.initDirectoryFactory org.apache.solr.core.MockDirectoryFactory
[junit4:junit4]   2> 11536 T36 oasc.CachingDirectoryFactory.get return new directory for /usr/home/hudson/hudson-slave/workspace/Lucene-Solr-Tests-4.x-java7/solr/build/solr-core/test/J0/./org.apache.solr.handler.component.DistributedMLTComponentTest-1355715647251/shard0/data forceNew:false
[junit4:junit4]   2> 11536 T36 oasc.CachingDirectoryFactory.close Releasing directory:/usr/home/hudson/hudson-slave/workspace/Lucene-Solr-Tests-4.x-java7/solr/build/solr-core/test/J0/./org.apache.solr.handler.component.DistributedMLTComponentTest-1355715647251/shard0/data
[junit4:junit4]   2> 11537 T36 oasc.SolrCore.getNewIndexDir New index directory detected: old=null new=./org.apache.solr.handler.component.DistributedMLTComponentTest-1355715647251/shard0/data/index/
[junit4:junit4]   2> 11537 T36 oasc.SolrCore.initIndex WARNING [collection1] Solr index directory './org.apache.solr.handler.component.DistributedMLTComponentTest-1355715647251/shard0/data/index' doesn't exist. Creating new index...
[junit4:junit4]   2> 11538 T36 oasc.CachingDirectoryFactory.get return new directory for /usr/home/hudson/hudson-slave/workspace/Lucene-Solr-Tests-4.x-java7/solr/build/solr-core/test/J0/./org.apache.solr.handler.component.DistributedMLTComponentTest-1355715647251/shard0/data/index forceNew:false
[junit4:junit4]   2> 11542 T36 oasc.SolrDeletionPolicy.onCommit SolrDeletionPolicy.onCommit: commits:num=1
[junit4:junit4]   2> 		commit{dir=RateLimitedDirectoryWrapper(MockDirWrapper(org.apache.lucene.store.RAMDirectory@576f1cad lockFactory=org.apache.lucene.store.NativeFSLockFactory@50376a79)),segFN=segments_1,generation=1,filenames=[segments_1]
[junit4:junit4]   2> 11543 T36 oasc.SolrDeletionPolicy.updateCommits newest commit = 1[segments_1]
[junit4:junit4]   2> 11544 T36 oasc.CachingDirectoryFactory.close Releasing directory:/usr/home/hudson/hudson-slave/workspace/Lucene-Solr-Tests-4.x-java7/solr/build/solr-core/test/J0/./org.apache.solr.handler.component.DistributedMLTComponentTest-1355715647251/shard0/data/index
[junit4:junit4]   2> 11544 T36 oasc.SolrCore.initWriters created xml: solr.XMLResponseWriter
[junit4:junit4]   2> 11547 T36 oasup.UpdateRequestProcessorChain.init inserting DistributedUpdateProcessorFactory into updateRequestProcessorChain "dedupe"
[junit4:junit4]   2> 11548 T36 oasup.UpdateRequestProcessorChain.init inserting DistributedUpdateProcessorFactory into updateRequestProcessorChain "dedupe-allfields"
[junit4:junit4]   2> 11548 T36 oasup.UpdateRequestProcessorChain.init inserting DistributedUpdateProcessorFactory into updateRequestProcessorChain "stored_sig"
[junit4:junit4]   2> 11549 T36 oasup.UpdateRequestProcessorChain.init inserting DistributedUpdateProcessorFactory into updateRequestProcessorChain "uniq-fields"
[junit4:junit4]   2> 11549 T36 oasup.UpdateRequestProcessorChain.init inserting DistributedUpdateProcessorFactory into updateRequestProcessorChain "distrib-dup-test-chain-implicit"
[junit4:junit4]   2> 11550 T36 oasc.RequestHandlers.initHandlersFromConfig adding lazy requestHandler: solr.ReplicationHandler
[junit4:junit4]   2> 11551 T36 oasc.RequestHandlers.initHandlersFromConfig created /replication: solr.ReplicationHandler
[junit4:junit4]   2> 11554 T36 oasc.RequestHandlers.initHandlersFromConfig created standard: solr.StandardRequestHandler
[junit4:junit4]   2> 11556 T36 oasc.RequestHandlers.initHandlersFromConfig created /get: solr.RealTimeGetHandler
[junit4:junit4]   2> 11558 T36 oasc.RequestHandlers.initHandlersFromConfig created dismax: solr.SearchHandler
[junit4:junit4]   2> 11561 T36 oasc.RequestHandlers.initHandlersFromConfig created mock: org.apache.solr.core.MockQuerySenderListenerReqHandler
[junit4:junit4]   2> 11562 T36 oasc.RequestHandlers.initHandlersFromConfig created /admin/: org.apache.solr.handler.admin.AdminHandlers
[junit4:junit4]   2> 11564 T36 oasc.RequestHandlers.initHandlersFromConfig created defaults: solr.StandardRequestHandler
[junit4:junit4]   2> 11565 T36 oasc.RequestHandlers.initHandlersFromConfig adding lazy requestHandler: solr.StandardRequestHandler
[junit4:junit4]   2> 11565 T36 oasc.RequestHandlers.initHandlersFromConfig created lazy: solr.StandardRequestHandler
[junit4:junit4]   2> 11568 T36 oasc.RequestHandlers.initHandlersFromConfig created /update: solr.UpdateRequestHandler
[junit4:junit4]   2> 11570 T36 oasc.RequestHandlers.initHandlersFromConfig created /terms: org.apache.solr.handler.component.SearchHandler
[junit4:junit4]   2> 11573 T36 oasc.RequestHandlers.initHandlersFromConfig created spellCheckCompRH: org.apache.solr.handler.component.SearchHandler
[junit4:junit4]   2> 11575 T36 oasc.RequestHandlers.initHandlersFromConfig created spellCheckCompRH_Direct: org.apache.solr.handler.component.SearchHandler
[junit4:junit4]   2> 11578 T36 oasc.RequestHandlers.initHandlersFromConfig created spellCheckWithWordbreak: org.apache.solr.handler.component.SearchHandler
[junit4:junit4]   2> 11581 T36 oasc.RequestHandlers.initHandlersFromConfig created spellCheckWithWordbreak_Direct: org.apache.solr.handler.component.SearchHandler
[junit4:junit4]   2> 11584 T36 oasc.RequestHandlers.initHandlersFromConfig created spellCheckCompRH1: org.apache.solr.handler.component.SearchHandler
[junit4:junit4]   2> 11586 T36 oasc.RequestHandlers.initHandlersFromConfig created mltrh: org.apache.solr.handler.component.SearchHandler
[junit4:junit4]   2> 11589 T36 oasc.RequestHandlers.initHandlersFromConfig created tvrh: org.apache.solr.handler.component.SearchHandler
[junit4:junit4]   2> 11591 T36 oasc.RequestHandlers.initHandlersFromConfig created /mlt: solr.MoreLikeThisHandler
[junit4:junit4]   2> 11594 T36 oasc.RequestHandlers.initHandlersFromConfig created /debug/dump: solr.DumpRequestHandler
[junit4:junit4]   2> 11605 T36 oashl.XMLLoader.init xsltCacheLifetimeSeconds=60
[junit4:junit4]   2> 11609 T36 oasc.SolrCore.initDeprecatedSupport WARNING solrconfig.xml uses deprecated <admin/gettableFiles>, Please update your config to use the ShowFileRequestHandler.
[junit4:junit4]   2> 11613 T36 oasc.SolrCore.initDeprecatedSupport WARNING adding ShowFileRequestHandler with hidden files: [THROW.ERROR.ON.ADD.UPDATEPROCESSOR.JS, SOLRCONFIG-HIGHLIGHT.XML, SCHEMA-REQUIRED-FIELDS.XML, BAD-SCHEMA-DUP-DYNAMICFIELD.XML, SCHEMA-REPLICATION2.XML, TRIVIAL.UPDATEPROCESSOR1.JS, SCHEMA-MINIMAL.XML, SOLRCONFIG-CACHING.XML, SOLRCONFIG-REPEATER.XML, BAD-SCHEMA-NONTEXT-ANALYZER.XML, SOLRCONFIG-MERGEPOLICY.XML, CURRENCY.XML, SOLRCONFIG-TLOG.XML, SOLRCONFIG-MASTER.XML, BAD-SCHEMA-UNIQUEKEY-MULTIVALUED.XML, SCHEMA11.XML, SOLRCONFIG-BASIC.XML, DA_COMPOUNDDICTIONARY.TXT, MISSLEADING.EXTENSION.UPDATEPROCESSOR.JS.TXT, SCHEMA-COPYFIELD-TEST.XML, SOLRCONFIG-SLAVE.XML, SOLRCONFIG-PROPINJECT-INDEXDEFAULT.XML, ELEVATE.XML, TRIVIAL.UPDATEPROCESSOR0.JS, BAD-SOLRCONFIG-BOGUS-SCRIPTENGINE-NAME.XML, SCHEMA-CHARFILTERS.XML, SCHEMA-IB.XML, SOLRCONFIG-QUERYSENDER.XML, SOLRCONFIG-SNIPPET-PROCESSOR.XML, SCHEMA-REPLICATION1.XML, DA_UTF8.XML, CONDITIONAL.UPDATEPROCESSOR.JS, MISSING.FUNCTIONS.UPDATEPROCESSOR.JS, HYPHENATION.DTD, SOLRCONFIG-ENABLEPLUGIN.XML, STEMDICT.TXT, SCHEMA-PHRASESUGGEST.XML, HUNSPELL-TEST.AFF, SCHEMA-SNIPPET-TYPE.XML, STOPTYPES-1.TXT, STOPWORDSWRONGENCODING.TXT, SCHEMA-NUMERIC.XML, SOLRCONFIG-TRANSFORMERS.XML, SOLRCONFIG-PROPINJECT.XML, BAD-SCHEMA-NOT-INDEXED-BUT-TF.XML, SOLRCONFIG-SIMPLELOCK.XML, WDFTYPES.TXT, STOPTYPES-2.TXT, SCHEMA-REVERSED.XML, BAD-SCHEMA-CURRENCY-FT-MULTIVALUED.XML, SOLRCONFIG-SPELLCHECKCOMPONENT.XML, BAD-SCHEMA-CURRENCY-MULTIVALUED.XML, SOLRCONFIG-PHRASESUGGEST.XML, SCHEMA-DFR.XML, BAD-SCHEMA-NOT-INDEXED-BUT-POS.XML, KEEP-1.TXT, SCHEMA-SPATIAL.XML, OPEN-EXCHANGE-RATES.JSON, STOPWITHBOM.TXT, SCHEMA-BINARYFIELD.XML, SOLRCONFIG-SPELLCHECKER.XML, SOLRCONFIG-UPDATE-PROCESSOR-CHAINS.XML, BAD-SCHEMA-OMIT-TF-BUT-NOT-POS.XML, BAD-SCHEMA-DUP-FIELDTYPE.XML, SCHEMA-XINCLUDE.XML, SOLRCONFIG-MASTER1.XML, SCHEMA-BEHAVIOR.XML, SYNONYMS.TXT, BAD-SCHEMA-CURRENCY-DYNAMIC-MULTIVALUED.XML, SCHEMA.XML, SCHEMA_CODEC.XML, SOLRCONFIG-SOLR-749.XML, SOLRCONFIG-MASTER1-KEEPONEBACKUP.XML, SCHEMA-EFF.XML, STOP-2.TXT, SOLRCONFIG-FUNCTIONQUERY.XML, SCHEMA-LMDIRICHLET.XML, SOLRCONFIG-TERMINDEX.XML, SOLRCONFIG-ELEVATE.XML, SCHEMA-FOLDING.XML, STOPWORDS.TXT, SCHEMA-STOP-KEEP.XML, FUZZYSUGGEST.TXT, BAD-SCHEMA-NOT-INDEXED-BUT-NORMS.XML, SOLRCONFIG-SOLCOREPROPERTIES.XML, STOP-1.TXT, SOLRCONFIG-MASTER2.XML, SCHEMA-SPELLCHECKER.XML, SOLRCONFIG-RESPONSE-LOG-COMPONENT.XML, SOLRCONFIG-LAZYWRITER.XML, SCHEMA-LUCENEMATCHVERSION.XML, BAD-MP-SOLRCONFIG.XML, FRENCHARTICLES.TXT, SCHEMA15.XML, SOLRCONFIG-REQHANDLER.INCL, SCHEMASURROUND.XML, SCHEMA-COLLATEFILTER.XML, SOLRCONFIG-MASTER3.XML, HUNSPELL-TEST.DIC, SOLRCONFIG-XINCLUDE.XML, BAD-SCHEMA-CODEC-GLOBAL-VS-FT-MISMATCH.XML, SOLRCONFIG-SLAVE1.XML, SOLRCONFIG-DELPOLICY1.XML, SCHEMA-SIM.XML, SCHEMA-SNIPPET-FIELD.XML, SCHEMA-COLLATE.XML, STOP-SNOWBALL.TXT, BAD-SCHEMA-SIM-GLOBAL-VS-FT-MISMATCH.XML, PROTWORDS.TXT, SCHEMA-TRIE.XML, SOLRCONFIG_CODEC.XML, BAD-SOLRCONFIG-INVALID-SCRIPTFILE.XML, JASUGGEST.TXT, SCHEMA-TFIDF.XML, SOLRCONFIG-SCRIPT-UPDATEPROCESSOR.XML, SCHEMA-LMJELINEKMERCER.XML, PHRASESUGGEST.TXT, BAD-SOLRCONFIG-MISSING-SCRIPTFILE.XML, SOLRCONFIG-BASIC-LUCENEVERSION31.XML, BAD-SCHEMA-UNIQUEKEY-USES-DEFAULT.XML, OLD_SYNONYMS.TXT, SOLRCONFIG-DELPOLICY2.XML, SOLRCONFIG-NATIVELOCK.XML, XSLT, BAD-SCHEMA-DUP-FIELD.XML, SOLRCONFIG-NOCACHE.XML, SCHEMA-BM25.XML, ADDFIELDS.UPDATEPROCESSOR.JS, SOLRCONFIG-QUERYSENDER-NOQUERY.XML, SOLRCONFIG-ALTDIRECTORY.XML, COMPOUNDDICTIONARY.TXT, SOLRCONFIG-INDEXCONFIG.XML, SOLRCONFIG_PERF.XML, SCHEMA-NOT-REQUIRED-UNIQUE-KEY.XML, BAD-SCHEMA-ANALYZER-CLASS-AND-NESTED.XML, KEEP-2.TXT, BAD-SCHEMA-UNIQUEKEY-IS-COPYFIELD-DEST.XML, SCHEMA12.XML, MAPPING-ISOLATIN1ACCENT.TXT, BAD_SOLRCONFIG.XML, BAD-SCHEMA-EXTERNAL-FILEFIELD.XML]
[junit4:junit4]   2> 11617 T36 oasc.CachingDirectoryFactory.close Releasing directory:/usr/home/hudson/hudson-slave/workspace/Lucene-Solr-Tests-4.x-java7/solr/build/solr-core/test/J0/./org.apache.solr.handler.component.DistributedMLTComponentTest-1355715647251/shard0/data
[junit4:junit4]   2> 11617 T36 oass.SolrIndexSearcher.<init> Opening Searcher@2921b9ea main
[junit4:junit4]   2> 11618 T36 oasu.CommitTracker.<init> Hard AutoCommit: disabled
[junit4:junit4]   2> 11619 T36 oasu.CommitTracker.<init> Soft AutoCommit: disabled
[junit4:junit4]   2> 11620 T36 oashc.SpellCheckComponent.inform Initializing spell checkers
[junit4:junit4]   2> 11643 T36 oass.DirectSolrSpellChecker.init init: {name=direct,classname=DirectSolrSpellChecker,field=lowerfilt,minQueryLength=3}
[junit4:junit4]   2> 11746 T37 oasc.SolrCore.registerSearcher [collection1] Registered new searcher Searcher@2921b9ea main{StandardDirectoryReader(segments_1:1)}
[junit4:junit4]   2> 11770 T36 oasc.CoreContainer.registerCore registering core: collection1
[junit4:junit4]   2> 11771 T11 oass.SolrDispatchFilter.init user.dir=/usr/home/hudson/hudson-slave/workspace/Lucene-Solr-Tests-4.x-java7/solr/build/solr-core/test/J0
[junit4:junit4]   2> 11772 T11 oass.SolrDispatchFilter.init SolrDispatchFilter.init() done
[junit4:junit4]   2> 11773 T11 oascsi.HttpClientUtil.createClient Creating new http client, config:maxConnections=128&maxConnectionsPerHost=32&followRedirects=false
[junit4:junit4]   2> 11796 T11 oejs.Server.doStart jetty-8.1.8.v20121106
[junit4:junit4]   2> 11799 T11 oejs.AbstractConnector.doStart Started SocketConnector@127.0.0.1:38710
[junit4:junit4]   2> 11801 T11 oasc.SolrResourceLoader.locateSolrHome JNDI not configured for solr (NoInitialContextEx)
[junit4:junit4]   2> 11802 T11 oasc.SolrResourceLoader.locateSolrHome using system property solr.solr.home: /usr/home/hudson/hudson-slave/workspace/Lucene-Solr-Tests-4.x-java7/solr/build/solr-core/test-files/solr
[junit4:junit4]   2> 11803 T11 oasc.SolrResourceLoader.<init> new SolrResourceLoader for deduced Solr Home: '/usr/home/hudson/hudson-slave/workspace/Lucene-Solr-Tests-4.x-java7/solr/build/solr-core/test-files/solr/'
[junit4:junit4]   2> 11854 T11 oass.SolrDispatchFilter.init SolrDispatchFilter.init()
[junit4:junit4]   2> 11855 T11 oasc.SolrResourceLoader.locateSolrHome JNDI not configured for solr (NoInitialContextEx)
[junit4:junit4]   2> 11857 T11 oasc.SolrResourceLoader.locateSolrHome using system property solr.solr.home: /usr/home/hudson/hudson-slave/workspace/Lucene-Solr-Tests-4.x-java7/solr/build/solr-core/test-files/solr
[junit4:junit4]   2> 11858 T11 oasc.CoreContainer$Initializer.initialize looking for solr.xml: /usr/home/hudson/hudson-slave/workspace/Lucene-Solr-Tests-4.x-java7/solr/build/solr-core/test-files/solr/solr.xml
[junit4:junit4]   2> 11859 T11 oasc.CoreContainer.<init> New CoreContainer 546765555
[junit4:junit4]   2> 11861 T11 oasc.CoreContainer.load Loading CoreContainer using Solr Home: '/usr/home/hudson/hudson-slave/workspace/Lucene-Solr-Tests-4.x-java7/solr/build/solr-core/test-files/solr/'
[junit4:junit4]   2> 11862 T11 oasc.SolrResourceLoader.<init> new SolrResourceLoader for directory: '/usr/home/hudson/hudson-slave/workspace/Lucene-Solr-Tests-4.x-java7/solr/build/solr-core/test-files/solr/'
[junit4:junit4]   2> 11927 T11 oashc.HttpShardHandlerFactory.getParameter Setting socketTimeout to: 30000
[junit4:junit4]   2> 11929 T11 oashc.HttpShardHandlerFactory.getParameter Setting urlScheme to: http://
[junit4:junit4]   2> 11930 T11 oashc.HttpShardHandlerFactory.getParameter Setting connTimeout to: 15000
[junit4:junit4]   2> 11931 T11 oashc.HttpShardHandlerFactory.getParameter Setting maxConnectionsPerHost to: 20
[junit4:junit4]   2> 11933 T11 oashc.HttpShardHandlerFactory.getParameter Setting corePoolSize to: 0
[junit4:junit4]   2> 11934 T11 oashc.HttpShardHandlerFactory.getParameter Setting maximumPoolSize to: 2147483647
[junit4:junit4]   2> 11935 T11 oashc.HttpShardHandlerFactory.getParameter Setting maxThreadIdleTime to: 5
[junit4:junit4]   2> 11936 T11 oashc.HttpShardHandlerFactory.getParameter Setting sizeOfQueue to: -1
[junit4:junit4]   2> 11937 T11 oashc.HttpShardHandlerFactory.getParameter Setting fairnessPolicy to: false
[junit4:junit4]   2> 11939 T11 oascsi.HttpClientUtil.createClient Creating new http client, config:maxConnectionsPerHost=20&maxConnections=10000&socketTimeout=30000&connTimeout=15000&retry=false
[junit4:junit4]   2> 11978 T11 oasc.CoreContainer.load Registering Log Listener
[junit4:junit4]   2> 12017 T47 oasc.CoreContainer.create Creating SolrCore 'collection1' using instanceDir: /usr/home/hudson/hudson-slave/workspace/Lucene-Solr-Tests-4.x-java7/solr/build/solr-core/test-files/solr/collection1
[junit4:junit4]   2> 12019 T47 oasc.SolrResourceLoader.<init> new SolrResourceLoader for directory: '/usr/home/hudson/hudson-slave/workspace/Lucene-Solr-Tests-4.x-java7/solr/build/solr-core/test-files/solr/collection1/'
[junit4:junit4]   2> 12020 T47 oasc.SolrResourceLoader.replaceClassLoader Adding 'file:/usr/home/hudson/hudson-slave/workspace/Lucene-Solr-Tests-4.x-java7/solr/build/solr-core/test-files/solr/collection1/lib/classes/' to classloader
[junit4:junit4]   2> 12021 T47 oasc.SolrResourceLoader.replaceClassLoader Adding 'file:/usr/home/hudson/hudson-slave/workspace/Lucene-Solr-Tests-4.x-java7/solr/build/solr-core/test-files/solr/collection1/lib/README' to classloader
[junit4:junit4]   2> 12115 T47 oasc.SolrConfig.<init> Using Lucene MatchVersion: LUCENE_41
[junit4:junit4]   2> 12213 T47 oasc.SolrConfig.<init> Loaded SolrConfig: solrconfig.xml
[junit4:junit4]   2> 12214 T47 oass.IndexSchema.readSchema Reading Solr Schema
[junit4:junit4]   2> 12277 T47 oass.IndexSchema.readSchema Schema name=test
[junit4:junit4]   2> 13102 T47 oass.OpenExchangeRatesOrgProvider.init Initialized with rates=open-exchange-rates.json, refreshInterval=1440.
[junit4:junit4]   2> 13116 T47 oass.IndexSchema.readSchema default search field in schema is text
[junit4:junit4]   2> 13120 T47 oass.IndexSchema.readSchema unique key field: id
[junit4:junit4]   2> 13141 T47 oass.FileExchangeRateProvider.reload Reloading exchange rates from file currency.xml
[junit4:junit4]   2> 13146 T47 oass.FileExchangeRateProvider.reload Reloading exchange rates from file currency.xml
[junit4:junit4]   2> 13151 T47 oass.OpenExchangeRatesOrgProvider.reload Reloading exchange rates from open-exchange-rates.json
[junit4:junit4]   2> 13153 T47 oass.OpenExchangeRatesOrgProvider.reload Reloading exchange rates from open-exchange-rates.json
[junit4:junit4]   2> 13156 T47 oasc.SolrCore.<init> [collection1] Opening new SolrCore at /usr/home/hudson/hudson-slave/workspace/Lucene-Solr-Tests-4.x-java7/solr/build/solr-core/test-files/solr/collection1/, dataDir=./org.apache.solr.handler.component.DistributedMLTComponentTest-1355715647251/shard1/data/
[junit4:junit4]   2> 13156 T47 oasc.JmxMonitoredMap.<init> JMX monitoring is enabled. Adding Solr mbeans to JMX Server: com.sun.jmx.mbeanserver.JmxMBeanServer@74ee486
[junit4:junit4]   2> 13157 T47 oasc.SolrCore.initDirectoryFactory org.apache.solr.core.MockDirectoryFactory
[junit4:junit4]   2> 13158 T47 oasc.CachingDirectoryFactory.get return new directory for /usr/home/hudson/hudson-slave/workspace/Lucene-Solr-Tests-4.x-java7/solr/build/solr-core/test/J0/./org.apache.solr.handler.component.DistributedMLTComponentTest-1355715647251/shard1/data forceNew:false
[junit4:junit4]   2> 13158 T47 oasc.CachingDirectoryFactory.close Releasing directory:/usr/home/hudson/hudson-slave/workspace/Lucene-Solr-Tests-4.x-java7/solr/build/solr-core/test/J0/./org.apache.solr.handler.component.DistributedMLTComponentTest-1355715647251/shard1/data
[junit4:junit4]   2> 13159 T47 oasc.SolrCore.getNewIndexDir New index directory detected: old=null new=./org.apache.solr.handler.component.DistributedMLTComponentTest-1355715647251/shard1/data/index/
[junit4:junit4]   2> 13160 T47 oasc.SolrCore.initIndex WARNING [collection1] Solr index directory './org.apache.solr.handler.component.DistributedMLTComponentTest-1355715647251/shard1/data/index' doesn't exist. Creating new index...
[junit4:junit4]   2> 13160 T47 oasc.CachingDirectoryFactory.get return new directory for /usr/home/hudson/hudson-slave/workspace/Lucene-Solr-Tests-4.x-java7/solr/build/solr-core/test/J0/./org.apache.solr.handler.component.DistributedMLTComponentTest-1355715647251/shard1/data/index forceNew:false
[junit4:junit4]   2> 13163 T47 oasc.SolrDeletionPolicy.onCommit SolrDeletionPolicy.onCommit: commits:num=1
[junit4:junit4]   2> 		commit{dir=RateLimitedDirectoryWrapper(MockDirWrapper(org.apache.lucene.store.RAMDirectory@1cf85db2 lockFactory=org.apache.lucene.store.NativeFSLockFactory@1a610dc)),segFN=segments_1,generation=1,filenames=[segments_1]
[junit4:junit4]   2> 13164 T47 oasc.SolrDeletionPolicy.updateCommits newest commit = 1[segments_1]
[junit4:junit4]   2> 13164 T47 oasc.CachingDirectoryFactory.close Releasing directory:/usr/home/hudson/hudson-slave/workspace/Lucene-Solr-Tests-4.x-java7/solr/build/solr-core/test/J0/./org.apache.solr.handler.component.DistributedMLTComponentTest-1355715647251/shard1/data/index
[junit4:junit4]   2> 13165 T47 oasc.SolrCore.initWriters created xml: solr.XMLResponseWriter
[junit4:junit4]   2> 13168 T47 oasup.UpdateRequestProcessorChain.init inserting DistributedUpdateProcessorFactory into updateRequestProcessorChain "dedupe"
[junit4:junit4]   2> 13168 T47 oasup.UpdateRequestProcessorChain.init inserting DistributedUpdateProcessorFactory into updateRequestProcessorChain "dedupe-allfields"
[junit4:junit4]   2> 13169 T47 oasup.UpdateRequestProcessorChain.init inserting DistributedUpdateProcessorFactory into updateRequestProcessorChain "stored_sig"
[junit4:junit4]   2> 13170 T47 oasup.UpdateRequestProcessorChain.init inserting DistributedUpdateProcessorFactory into updateRequestProcessorChain "uniq-fields"
[junit4:junit4]   2> 13171 T47 oasup.UpdateRequestProcessorChain.init inserting DistributedUpdateProcessorFactory into updateRequestProcessorChain "distrib-dup-test-chain-implicit"
[junit4:junit4]   2> 13172 T47 oasc.RequestHandlers.initHandlersFromConfig adding lazy requestHandler: solr.ReplicationHandler
[junit4:junit4]   2> 13172 T47 oasc.RequestHandlers.initHandlersFromConfig created /replication: solr.ReplicationHandler
[junit4:junit4]   2> 13175 T47 oasc.RequestHandlers.initHandlersFromConfig created standard: solr.StandardRequestHandler
[junit4:junit4]   2> 13177 T47 oasc.RequestHandlers.initHandlersFromConfig created /get: solr.RealTimeGetHandler
[junit4:junit4]   2> 13179 T47 oasc.RequestHandlers.initHandlersFromConfig created dismax: solr.SearchHandler
[junit4:junit4]   2> 13181 T47 oasc.RequestHandlers.initHandlersFromConfig created mock: org.apache.solr.core.MockQuerySenderListenerReqHandler
[junit4:junit4]   2> 13182 T47 oasc.RequestHandlers.initHandlersFromConfig created /admin/: org.apache.solr.handler.admin.AdminHandlers
[junit4:junit4]   2> 13184 T47 oasc.RequestHandlers.initHandlersFromConfig created defaults: solr.StandardRequestHandler
[junit4:junit4]   2> 13185 T47 oasc.RequestHandlers.initHandlersFromConfig adding lazy requestHandler: solr.StandardRequestHandler
[junit4:junit4]   2> 13185 T47 oasc.RequestHandlers.initHandlersFromConfig created lazy: solr.StandardRequestHandler
[junit4:junit4]   2> 13187 T47 oasc.RequestHandlers.initHandlersFromConfig created /update: solr.UpdateRequestHandler
[junit4:junit4]   2> 13190 T47 oasc.RequestHandlers.initHandlersFromConfig created /terms: org.apache.solr.handler.component.SearchHandler
[junit4:junit4]   2> 13192 T47 oasc.RequestHandlers.initHandlersFromConfig created spellCheckCompRH: org.apache.solr.handler.component.SearchHandler
[junit4:junit4]   2> 13194 T47 oasc.RequestHandlers.initHandlersFromConfig created spellCheckCompRH_Direct: org.apache.solr.handler.component.SearchHandler
[junit4:junit4]   2> 13196 T47 oasc.RequestHandlers.initHandlersFromConfig created spellCheckWithWordbreak: org.apache.solr.handler.component.SearchHandler
[junit4:junit4]   2> 13199 T47 oasc.RequestHandlers.initHandlersFromConfig created spellCheckWithWordbreak_Direct: org.apache.solr.handler.component.SearchHandler
[junit4:junit4]   2> 13201 T47 oasc.RequestHandlers.initHandlersFromConfig created spellCheckCompRH1: org.apache.solr.handler.component.SearchHandler
[junit4:junit4]   2> 13203 T47 oasc.RequestHandlers.initHandlersFromConfig created mltrh: org.apache.solr.handler.component.SearchHandler
[junit4:junit4]   2> 13205 T47 oasc.RequestHandlers.initHandlersFromConfig created tvrh: org.apache.solr.handler.component.SearchHandler
[junit4:junit4]   2> 13207 T47 oasc.RequestHandlers.initHandlersFromConfig created /mlt: solr.MoreLikeThisHandler
[junit4:junit4]   2> 13209 T47 oasc.RequestHandlers.initHandlersFromConfig created /debug/dump: solr.DumpRequestHandler
[junit4:junit4]   2> 13219 T47 oashl.XMLLoader.init xsltCacheLifetimeSeconds=60
[junit4:junit4]   2> 13225 T47 oasc.SolrCore.initDeprecatedSupport WARNING solrconfig.xml uses deprecated <admin/gettableFiles>, Please update your config to use the ShowFileRequestHandler.
[junit4:junit4]   2> 13228 T47 oasc.SolrCore.initDeprecatedSupport WARNING adding ShowFileRequestHandler with hidden files: [THROW.ERROR.ON.ADD.UPDATEPROCESSOR.JS, SOLRCONFIG-HIGHLIGHT.XML, SCHEMA-REQUIRED-FIELDS.XML, BAD-SCHEMA-DUP-DYNAMICFIELD.XML, SCHEMA-REPLICATION2.XML, TRIVIAL.UPDATEPROCESSOR1.JS, SCHEMA-MINIMAL.XML, SOLRCONFIG-CACHING.XML, SOLRCONFIG-REPEATER.XML, BAD-SCHEMA-NONTEXT-ANALYZER.XML, SOLRCONFIG-MERGEPOLICY.XML, CURRENCY.XML, SOLRCONFIG-TLOG.XML, SOLRCONFIG-MASTER.XML, BAD-SCHEMA-UNIQUEKEY-MULTIVALUED.XML, SCHEMA11.XML, SOLRCONFIG-BASIC.XML, DA_COMPOUNDDICTIONARY.TXT, MISSLEADING.EXTENSION.UPDATEPROCESSOR.JS.TXT, SCHEMA-COPYFIELD-TEST.XML, SOLRCONFIG-SLAVE.XML, SOLRCONFIG-PROPINJECT-INDEXDEFAULT.XML, ELEVATE.XML, TRIVIAL.UPDATEPROCESSOR0.JS, BAD-SOLRCONFIG-BOGUS-SCRIPTENGINE-NAME.XML, SCHEMA-CHARFILTERS.XML, SCHEMA-IB.XML, SOLRCONFIG-QUERYSENDER.XML, SOLRCONFIG-SNIPPET-PROCESSOR.XML, SCHEMA-REPLICATION1.XML, DA_UTF8.XML, CONDITIONAL.UPDATEPROCESSOR.JS, MISSING.FUNCTIONS.UPDATEPROCESSOR.JS, HYPHENATION.DTD, SOLRCONFIG-ENABLEPLUGIN.XML, STEMDICT.TXT, SCHEMA-PHRASESUGGEST.XML, HUNSPELL-TEST.AFF, SCHEMA-SNIPPET-TYPE.XML, STOPTYPES-1.TXT, STOPWORDSWRONGENCODING.TXT, SCHEMA-NUMERIC.XML, SOLRCONFIG-TRANSFORMERS.XML, SOLRCONFIG-PROPINJECT.XML, BAD-SCHEMA-NOT-INDEXED-BUT-TF.XML, SOLRCONFIG-SIMPLELOCK.XML, WDFTYPES.TXT, STOPTYPES-2.TXT, SCHEMA-REVERSED.XML, BAD-SCHEMA-CURRENCY-FT-MULTIVALUED.XML, SOLRCONFIG-SPELLCHECKCOMPONENT.XML, BAD-SCHEMA-CURRENCY-MULTIVALUED.XML, SOLRCONFIG-PHRASESUGGEST.XML, SCHEMA-DFR.XML, BAD-SCHEMA-NOT-INDEXED-BUT-POS.XML, KEEP-1.TXT, SCHEMA-SPATIAL.XML, OPEN-EXCHANGE-RATES.JSON, STOPWITHBOM.TXT, SCHEMA-BINARYFIELD.XML, SOLRCONFIG-SPELLCHECKER.XML, SOLRCONFIG-UPDATE-PROCESSOR-CHAINS.XML, BAD-SCHEMA-OMIT-TF-BUT-NOT-POS.XML, BAD-SCHEMA-DUP-FIELDTYPE.XML, SCHEMA-XINCLUDE.XML, SOLRCONFIG-MASTER1.XML, SCHEMA-BEHAVIOR.XML, SYNONYMS.TXT, BAD-SCHEMA-CURRENCY-DYNAMIC-MULTIVALUED.XML, SCHEMA.XML, SCHEMA_CODEC.XML, SOLRCONFIG-SOLR-749.XML, SOLRCONFIG-MASTER1-KEEPONEBACKUP.XML, SCHEMA-EFF.XML, STOP-2.TXT, SOLRCONFIG-FUNCTIONQUERY.XML, SCHEMA-LMDIRICHLET.XML, SOLRCONFIG-TERMINDEX.XML, SOLRCONFIG-ELEVATE.XML, SCHEMA-FOLDING.XML, STOPWORDS.TXT, SCHEMA-STOP-KEEP.XML, FUZZYSUGGEST.TXT, BAD-SCHEMA-NOT-INDEXED-BUT-NORMS.XML, SOLRCONFIG-SOLCOREPROPERTIES.XML, STOP-1.TXT, SOLRCONFIG-MASTER2.XML, SCHEMA-SPELLCHECKER.XML, SOLRCONFIG-RESPONSE-LOG-COMPONENT.XML, SOLRCONFIG-LAZYWRITER.XML, SCHEMA-LUCENEMATCHVERSION.XML, BAD-MP-SOLRCONFIG.XML, FRENCHARTICLES.TXT, SCHEMA15.XML, SOLRCONFIG-REQHANDLER.INCL, SCHEMASURROUND.XML, SCHEMA-COLLATEFILTER.XML, SOLRCONFIG-MASTER3.XML, HUNSPELL-TEST.DIC, SOLRCONFIG-XINCLUDE.XML, BAD-SCHEMA-CODEC-GLOBAL-VS-FT-MISMATCH.XML, SOLRCONFIG-SLAVE1.XML, SOLRCONFIG-DELPOLICY1.XML, SCHEMA-SIM.XML, SCHEMA-SNIPPET-FIELD.XML, SCHEMA-COLLATE.XML, STOP-SNOWBALL.TXT, BAD-SCHEMA-SIM-GLOBAL-VS-FT-MISMATCH.XML, PROTWORDS.TXT, SCHEMA-TRIE.XML, SOLRCONFIG_CODEC.XML, BAD-SOLRCONFIG-INVALID-SCRIPTFILE.XML, JASUGGEST.TXT, SCHEMA-TFIDF.XML, SOLRCONFIG-SCRIPT-UPDATEPROCESSOR.XML, SCHEMA-LMJELINEKMERCER.XML, PHRASESUGGEST.TXT, BAD-SOLRCONFIG-MISSING-SCRIPTFILE.XML, SOLRCONFIG-BASIC-LUCENEVERSION31.XML, BAD-SCHEMA-UNIQUEKEY-USES-DEFAULT.XML, OLD_SYNONYMS.TXT, SOLRCONFIG-DELPOLICY2.XML, SOLRCONFIG-NATIVELOCK.XML, XSLT, BAD-SCHEMA-DUP-FIELD.XML, SOLRCONFIG-NOCACHE.XML, SCHEMA-BM25.XML, ADDFIELDS.UPDATEPROCESSOR.JS, SOLRCONFIG-QUERYSENDER-NOQUERY.XML, SOLRCONFIG-ALTDIRECTORY.XML, COMPOUNDDICTIONARY.TXT, SOLRCONFIG-INDEXCONFIG.XML, SOLRCONFIG_PERF.XML, SCHEMA-NOT-REQUIRED-UNIQUE-KEY.XML, BAD-SCHEMA-ANALYZER-CLASS-AND-NESTED.XML, KEEP-2.TXT, BAD-SCHEMA-UNIQUEKEY-IS-COPYFIELD-DEST.XML, SCHEMA12.XML, MAPPING-ISOLATIN1ACCENT.TXT, BAD_SOLRCONFIG.XML, BAD-SCHEMA-EXTERNAL-FILEFIELD.XML]
[junit4:junit4]   2> 13231 T47 oasc.CachingDirectoryFactory.close Releasing directory:/usr/home/hudson/hudson-slave/workspace/Lucene-Solr-Tests-4.x-java7/solr/build/solr-core/test/J0/./org.apache.solr.handler.component.DistributedMLTComponentTest-1355715647251/shard1/data
[junit4:junit4]   2> 13232 T47 oass.SolrIndexSearcher.<init> Opening Searcher@38080131 main
[junit4:junit4]   2> 13233 T47 oasu.CommitTracker.<init> Hard AutoCommit: disabled
[junit4:junit4]   2> 13233 T47 oasu.CommitTracker.<init> Soft AutoCommit: disabled
[junit4:junit4]   2> 13234 T47 oashc.SpellCheckComponent.inform Initializing spell checkers
[junit4:junit4]   2> 13289 T47 oass.DirectSolrSpellChecker.init init: {name=direct,classname=DirectSolrSpellChecker,field=lowerfilt,minQueryLength=3}
[junit4:junit4]   2> 13476 T48 oasc.SolrCore.registerSearcher [collection1] Registered new searcher Searcher@38080131 main{StandardDirectoryReader(segments_1:1)}
[junit4:junit4]   2> 13494 T47 oasc.CoreContainer.registerCore registering core: collection1
[junit4:junit4]   2> 13494 T11 oass.SolrDispatchFilter.init user.dir=/usr/home/hudson/hudson-slave/workspace/Lucene-Solr-Tests-4.x-java7/solr/build/solr-core/test/J0
[junit4:junit4]   2> 13495 T11 oass.SolrDispatchFilter.init SolrDispatchFilter.init() done
[junit4:junit4]   2> 13496 T11 oascsi.HttpClientUtil.createClient Creating new http client, config:maxConnections=128&maxConnectionsPerHost=32&followRedirects=false
[junit4:junit4]   2> ASYNC  NEW_CORE C0 name=collection1 org.apache.solr.core.SolrCore@428691e3
[junit4:junit4]   2> 15322 T15 C0 oasu.DirectUpdateHandler2.deleteAll [collection1] REMOVING ALL DOCUMENTS FROM INDEX
[junit4:junit4]   2> 15326 T15 C0 oasc.CachingDirectoryFactory.close Releasing directory:/usr/home/hudson/hudson-slave/workspace/Lucene-Solr-Tests-4.x-java7/solr/build/solr-core/test/J0/./org.apache.solr.handler.component.DistributedMLTComponentTest-1355715647251/control/data
[junit4:junit4]   2> 15334 T15 C0 oasc.SolrDeletionPolicy.onInit SolrDeletionPolicy.onInit: commits:num=1
[junit4:junit4]   2> 		commit{dir=RateLimitedDirectoryWrapper(MockDirWrapper(org.apache.lucene.store.RAMDirectory@93bf890 lockFactory=org.apache.lucene.store.NativeFSLockFactory@115c9326)),segFN=segments_1,generation=1,filenames=[segments_1]
[junit4:junit4]   2> 15335 T15 C0 oasc.SolrDeletionPolicy.updateCommits newest commit = 1[segments_1]
[junit4:junit4]   2> 15341 T15 C0 UPDATE [collection1] webapp=/jzcx path=/update params={wt=javabin&version=2} {deleteByQuery=*:*} 0 616
[junit4:junit4]   2> ASYNC  NEW_CORE C1 name=collection1 org.apache.solr.core.SolrCore@784adbc3
[junit4:junit4]   2> 15530 T29 C1 oasu.DirectUpdateHandler2.deleteAll [collection1] REMOVING ALL DOCUMENTS FROM INDEX
[junit4:junit4]   2> 15531 T29 C1 oasc.CachingDirectoryFactory.close Releasing directory:/usr/home/hudson/hudson-slave/workspace/Lucene-Solr-Tests-4.x-java7/solr/build/solr-core/test/J0/./org.apache.solr.handler.component.DistributedMLTComponentTest-1355715647251/shard0/data
[junit4:junit4]   2> 15535 T29 C1 oasc.SolrDeletionPolicy.onInit SolrDeletionPolicy.onInit: commits:num=1
[junit4:junit4]   2> 		commit{dir=RateLimitedDirectoryWrapper(MockDirWrapper(org.apache.lucene.store.RAMDirectory@576f1cad lockFactory=org.apache.lucene.store.NativeFSLockFactory@50376a79)),segFN=segments_1,generation=1,filenames=[segments_1]
[junit4:junit4]   2> 15535 T29 C1 oasc.SolrDeletionPolicy.updateCommits newest commit = 1[segments_1]
[junit4:junit4]   2> 15536 T29 C1 UPDATE [collection1] webapp=/jzcx path=/update params={wt=javabin&version=2} {deleteByQuery=*:*} 0 6
[junit4:junit4]   2> ASYNC  NEW_CORE C2 name=collection1 org.apache.solr.core.SolrCore@128a9b7f
[junit4:junit4]   2> 15545 T40 C2 oasu.DirectUpdateHandler2.deleteAll [collection1] REMOVING ALL DOCUMENTS FROM INDEX
[junit4:junit4]   2> 15546 T40 C2 oasc.CachingDirectoryFactory.close Releasing directory:/usr/home/hudson/hudson-slave/workspace/Lucene-Solr-Tests-4.x-java7/solr/build/solr-core/test/J0/./org.apache.solr.handler.component.DistributedMLTComponentTest-1355715647251/shard1/data
[junit4:junit4]   2> 15548 T40 C2 oasc.SolrDeletionPolicy.onInit SolrDeletionPolicy.onInit: commits:num=1
[junit4:junit4]   2> 		commit{dir=RateLimitedDirectoryWrapper(MockDirWrapper(org.apache.lucene.store.RAMDirectory@1cf85db2 lockFactory=org.apache.lucene.store.NativeFSLockFactory@1a610dc)),segFN=segments_1,generation=1,filenames=[segments_1]
[junit4:junit4]   2> 15549 T40 C2 oasc.SolrDeletionPolicy.updateCommits newest commit = 1[segments_1]
[junit4:junit4]   2> 15549 T40 C2 UPDATE [collection1] webapp=/jzcx path=/update params={wt=javabin&version=2} {deleteByQuery=*:*} 0 5
[junit4:junit4]   2> 16052 T15 C0 UPDATE [collection1] webapp=/jzcx path=/update params={wt=javabin&version=2} {add=[1]} 0 490
[junit4:junit4]   2> 16060 T40 C2 UPDATE [collection1] webapp=/jzcx path=/update params={wt=javabin&version=2} {add=[1]} 0 4
[junit4:junit4]   2> 16065 T15 C0 UPDATE [collection1] webapp=/jzcx path=/update params={wt=javabin&version=2} {add=[2]} 0 2
[junit4:junit4]   2> 16072 T29 C1 UPDATE [collection1] webapp=/jzcx path=/update params={wt=javabin&version=2} {add=[2]} 0 4
[junit4:junit4]   2> 16077 T15 C0 UPDATE [collection1] webapp=/jzcx path=/update params={wt=javabin&version=2} {add=[3]} 0 2
[junit4:junit4]   2> 16082 T40 C2 UPDATE [collection1] webapp=/jzcx path=/update params={wt=javabin&version=2} {add=[3]} 0 2
[junit4:junit4]   2> 16087 T15 C0 UPDATE [collection1] webapp=/jzcx path=/update params={wt=javabin&version=2} {add=[4]} 0 2
[junit4:junit4]   2> 16092 T29 C1 UPDATE [collection1] webapp=/jzcx path=/update params={wt=javabin&version=2} {add=[4]} 0 2
[junit4:junit4]   2> 16097 T15 C0 UPDATE [collection1] webapp=/jzcx path=/update params={wt=javabin&version=2} {add=[5]} 0 2
[junit4:junit4]   2> 16102 T40 C2 UPDATE [collection1] webapp=/jzcx path=/update params={wt=javabin&version=2} {add=[5]} 0 2
[junit4:junit4]   2> 16109 T15 C0 UPDATE [collection1] webapp=/jzcx path=/update params={wt=javabin&version=2} {add=[6]} 0 3
[junit4:junit4]   2> 16114 T29 C1 UPDATE [collection1] webapp=/jzcx path=/update params={wt=javabin&version=2} {add=[6]} 0 2
[junit4:junit4]   2> 16120 T15 C0 UPDATE [collection1] webapp=/jzcx path=/update params={wt=javabin&version=2} {add=[7]} 0 2
[junit4:junit4]   2> 16126 T40 C2 UPDATE [collection1] webapp=/jzcx path=/update params={wt=javabin&version=2} {add=[7]} 0 2
[junit4:junit4]   2> 16131 T15 C0 UPDATE [collection1] webapp=/jzcx path=/update params={wt=javabin&version=2} {add=[8]} 0 2
[junit4:junit4]   2> 16136 T29 C1 UPDATE [collection1] webapp=/jzcx path=/update params={wt=javabin&version=2} {add=[8]} 0 2
[junit4:junit4]   2> 16142 T15 C0 UPDATE [collection1] webapp=/jzcx path=/update params={wt=javabin&version=2} {add=[9]} 0 3
[junit4:junit4]   2> 16148 T40 C2 UPDATE [collection1] webapp=/jzcx path=/update params={wt=javabin&version=2} {add=[9]} 0 3
[junit4:junit4]   2> 16646 T15 C0 UPDATE [collection1] webapp=/jzcx path=/update params={wt=javabin&version=2} {add=[10]} 0 495
[junit4:junit4]   2> 16653 T40 C2 UPDATE [collection1] webapp=/jzcx path=/update params={wt=javabin&version=2} {add=[10]} 0 2
[junit4:junit4]   2> 16659 T15 C0 UPDATE [collection1] webapp=/jzcx path=/update params={wt=javabin&version=2} {add=[12]} 0 3
[junit4:junit4]   2> 16665 T40 C2 UPDATE [collection1] webapp=/jzcx path=/update params={wt=javabin&version=2} {add=[12]} 0 2
[junit4:junit4]   2> 16671 T15 C0 UPDATE [collection1] webapp=/jzcx path=/update params={wt=javabin&version=2} {add=[13]} 0 3
[junit4:junit4]   2> 16677 T29 C1 UPDATE [collection1] webapp=/jzcx path=/update params={wt=javabin&version=2} {add=[13]} 0 3
[junit4:junit4]   2> 16683 T15 C0 UPDATE [collection1] webapp=/jzcx path=/update params={wt=javabin&version=2} {add=[14]} 0 3
[junit4:junit4]   2> 16688 T40 C2 UPDATE [collection1] webapp=/jzcx path=/update params={wt=javabin&version=2} {add=[14]} 0 2
[junit4:junit4]   2> 16694 T15 C0 UPDATE [collection1] webapp=/jzcx path=/update params={wt=javabin&version=2} {add=[15]} 0 3
[junit4:junit4]   2> 16700 T29 C1 UPDATE [collection1] webapp=/jzcx path=/update params={wt=javabin&version=2} {add=[15]} 0 2
[junit4:junit4]   2> 16706 T15 C0 UPDATE [collection1] webapp=/jzcx path=/update params={wt=javabin&version=2} {add=[16]} 0 3
[junit4:junit4]   2> 16712 T40 C2 UPDATE [collection1] webapp=/jzcx path=/update params={wt=javabin&version=2} {add=[16]} 0 2
[junit4:junit4]   2> 16720 T15 C0 UPDATE [collection1] webapp=/jzcx path=/update params={wt=javabin&version=2} {add=[17]} 0 4
[junit4:junit4]   2> 16728 T29 C1 UPDATE [collection1] webapp=/jzcx path=/update params={wt=javabin&version=2} {add=[17]} 0 2
[junit4:junit4]   2> 16735 T15 C0 UPDATE [collection1] webapp=/jzcx path=/update params={wt=javabin&version=2} {add=[18]} 0 3
[junit4:junit4]   2> 16776 T40 C2 UPDATE [collection1] webapp=/jzcx path=/update params={wt=javabin&version=2} {add=[18]} 0 38
[junit4:junit4]   2> 16783 T15 C0 UPDATE [collection1] webapp=/jzcx path=/update params={wt=javabin&version=2} {add=[19]} 0 2
[junit4:junit4]   2> 16789 T29 C1 UPDATE [collection1] webapp=/jzcx path=/update params={wt=javabin&version=2} {add=[19]} 0 3
[junit4:junit4]   2> 16795 T15 C0 UPDATE [collection1] webapp=/jzcx path=/update params={wt=javabin&version=2} {add=[20]} 0 3
[junit4:junit4]   2> 16801 T29 C1 UPDATE [collection1] webapp=/jzcx path=/update params={wt=javabin&version=2} {add=[20]} 0 3
[junit4:junit4]   2> 16826 T15 C0 UPDATE [collection1] webapp=/jzcx path=/update params={wt=javabin&version=2} {add=[21]} 0 22
[junit4:junit4]   2> 16833 T40 C2 UPDATE [collection1] webapp=/jzcx path=/update params={wt=javabin&version=2} {add=[21]} 0 3
[junit4:junit4]   2> 16839 T15 C0 UPDATE [collection1] webapp=/jzcx path=/update params={wt=javabin&version=2} {add=[22]} 0 3
[junit4:junit4]   2> 16865 T29 C1 UPDATE [collection1] webapp=/jzcx path=/update params={wt=javabin&version=2} {add=[22]} 0 22
[junit4:junit4]   2> 16871 T15 C0 UPDATE [collection1] webapp=/jzcx path=/update params={wt=javabin&version=2} {add=[23]} 0 3
[junit4:junit4]   2> 16876 T40 C2 UPDATE [collection1] webapp=/jzcx path=/update params={wt=javabin&version=2} {add=[23]} 0 2
[junit4:junit4]   2> 16882 T15 C0 UPDATE [collection1] webapp=/jzcx path=/update params={wt=javabin&version=2} {add=[24]} 0 3
[junit4:junit4]   2> 16888 T29 C1 UPDATE [collection1] webapp=/jzcx path=/update params={wt=javabin&version=2} {add=[24]} 0 2
[junit4:junit4]   2> 16894 T15 C0 UPDATE [collection1] webapp=/jzcx path=/update params={wt=javabin&version=2} {add=[25]} 0 2
[junit4:junit4]   2> 16899 T40 C2 UPDATE [collection1] webapp=/jzcx path=/update params={wt=javabin&version=2} {add=[25]} 0 2
[junit4:junit4]   2> 16933 T15 C0 oasu.DirectUpdateHandler2.commit start commit{flags=0,_version_=0,optimize=false,openSearcher=true,waitSearcher=true,expungeDeletes=false,softCommit=false}
[junit4:junit4]   2> 17158 T15 C0 oasc.SolrDeletionPolicy.onCommit SolrDeletionPolicy.onCommit: commits:num=2
[junit4:junit4]   2> 		commit{dir=RateLimitedDirectoryWrapper(MockDirWrapper(org.apache.lucene.store.RAMDirectory@93bf890 lockFactory=org.apache.lucene.store.NativeFSLockFactory@115c9326)),segFN=segments_1,generation=1,filenames=[segments_1]
[junit4:junit4]   2> 		commit{dir=RateLimitedDirectoryWrapper(MockDirWrapper(org.apache.lucene.store.RAMDirectory@93bf890 lockFactory=org.apache.lucene.store.NativeFSLockFactory@115c9326)),segFN=segments_2,generation=2,filenames=[_2.si, _2_Pulsing41_0.doc, _1_TestBloomFilteredLucene41Postings_0.pos, _1_TestBloomFilteredLucene41Postings_0.tim, _0_TestBloomFilteredLucene41Postings_0.tim, _0_TestBloomFilteredLucene41Postings_0.tip, _1_TestBloomFilteredLucene41Postings_0.tip, _0_TestBloomFilteredLucene41Postings_0.pos, _1.fnm, _2_Pulsing41_0.tim, _2_nrm.cfe, _1_Memory_0.ram, _0_Pulsing41_0.tim, _0_Pulsing41_0.tip, _2_Pulsing41_0.tip, _2_TestBloomFilteredLucene41Postings_0.blm, _2_Memory_0.ram, _2_nrm.cfs, _0.si, _2_TestBloomFilteredLucene41Postings_0.doc, _1_nrm.cfs, _0.fnm, _0_TestBloomFilteredLucene41Postings_0.blm, _0_Memory_0.ram, _2.fdt, _1_Pulsing41_0.doc, _0_nrm.cfs, _1_TestBloomFilteredLucene41Postings_0.doc, _2.fdx, _1_Pulsing41_0.pos, _2.fnm, _1_nrm.cfe, _2_Pulsing41_0.pos, _1_TestBloomFilteredLucene41Postings_0.blm, _1.fdx, _0_Pulsing41_0.pos, _0_Pulsing41_0.doc, _1_Pulsing41_0.tip, _1.fdt, _1_Pulsing41_0.tim, _2_TestBloomFilteredLucene41Postings_0.pos, _2_TestBloomFilteredLucene41Postings_0.tip, _1.si, _0_nrm.cfe, segments_2, _0_TestBloomFilteredLucene41Postings_0.doc, _2_TestBloomFilteredLucene41Postings_0.tim, _0.fdx, _0.fdt]
[junit4:junit4]   2> 17159 T15 C0 oasc.SolrDeletionPolicy.updateCommits newest commit = 2[_2.si, _2_Pulsing41_0.doc, _1_TestBloomFilteredLucene41Postings_0.pos, _1_TestBloomFilteredLucene41Postings_0.tim, _0_TestBloomFilteredLucene41Postings_0.tim, _0_TestBloomFilteredLucene41Postings_0.tip, _1_TestBloomFilteredLucene41Postings_0.tip, _0_TestBloomFilteredLucene41Postings_0.pos, _1.fnm, _2_Pulsing41_0.tim, _2_nrm.cfe, _1_Memory_0.ram, _0_Pulsing41_0.tim, _0_Pulsing41_0.tip, _2_Pulsing41_0.tip, _2_TestBloomFilteredLucene41Postings_0.blm, _2_Memory_0.ram, _2_nrm.cfs, _0.si, _2_TestBloomFilteredLucene41Postings_0.doc, _1_nrm.cfs, _0.fnm, _0_TestBloomFilteredLucene41Postings_0.blm, _0_Memory_0.ram, _2.fdt, _1_Pulsing41_0.doc, _0_nrm.cfs, _1_TestBloomFilteredLucene41Postings_0.doc, _2.fdx, _1_Pulsing41_0.pos, _2.fnm, _1_nrm.cfe, _2_Pulsing41_0.pos, _1_TestBloomFilteredLucene41Postings_0.blm, _1.fdx, _0_Pulsing41_0.pos, _0_Pulsing41_0.doc, _1_Pulsing41_0.tip, _1.fdt, _1_Pulsing41_0.tim, _2_TestBloomFilteredLucene41Postings_0.pos, _2_TestBloomFilteredLucene41Postings_0.tip, _1.si, _0_nrm.cfe, segments_2, _0_TestBloomFilteredLucene41Postings_0.doc, _2_TestBloomFilteredLucene41Postings_0.tim, _0.fdx, _0.fdt]
[junit4:junit4]   2> 17160 T15 C0 oasc.CachingDirectoryFactory.close Releasing directory:/usr/home/hudson/hudson-slave/workspace/Lucene-Solr-Tests-4.x-java7/solr/build/solr-core/test/J0/./org.apache.solr.handler.component.DistributedMLTComponentTest-1355715647251/control/data
[junit4:junit4]   2> 17178 T15 C0 oass.SolrIndexSearcher.<init> Opening Searcher@29ff216c main
[junit4:junit4]   2> 17181 T15 C0 oasu.DirectUpdateHandler2.commit end_commit_flush
[junit4:junit4]   2> 17196 T26 oasc.SolrCore.registerSearcher [collection1] Registered new searcher Searcher@29ff216c main{StandardDirectoryReader(segments_2:8 _0(4.1):C10 _1(4.1):C10 _2(4.1):C4)}
[junit4:junit4]   2> 17197 T26 oasc.CachingDirectoryFactory.close Releasing directory:/usr/home/hudson/hudson-slave/workspace/Lucene-Solr-Tests-4.x-java7/solr/build/solr-core/test/J0/./org.apache.solr.handler.component.DistributedMLTComponentTest-1355715647251/control/data/index
[junit4:junit4]   2> 17198 T15 C0 UPDATE [collection1] webapp=/jzcx path=/update params={waitSearcher=true&wt=javabin&commit=true&softCommit=false&version=2} {commit=} 0 268
[junit4:junit4]   2> 17202 T29 C1 oasu.DirectUpdateHandler2.commit start commit{flags=0,_version_=0,optimize=false,openSearcher=true,waitSearcher=true,expungeDeletes=false,softCommit=false}
[junit4:junit4]   2> 17213 T29 C1 oasc.SolrDeletionPolicy.onCommit SolrDeletionPolicy.onCommit: commits:num=2
[junit4:junit4]   2> 		commit{dir=RateLimitedDirectoryWrapper(MockDirWrapper(org.apache.lucene.store.RAMDirectory@576f1cad lockFactory=org.apache.lucene.store.NativeFSLockFactory@50376a79)),segFN=segments_1,generation=1,filenames=[segments_1]
[junit4:junit4]   2> 		commit{dir=RateLimitedDirectoryWrapper(MockDirWrapper(org.apache.lucene.store.RAMDirectory@576f1cad lockFactory=org.apache.lucene.store.NativeFSLockFactory@50376a79)),segFN=segments_2,generation=2,filenames=[_1_TestBloomFilteredLucene41Postings_0.pos, _1_TestBloomFilteredLucene41Postings_0.tim, _0_TestBloomFilteredLucene41Postings_0.tim, _0_TestBloomFilteredLucene41Postings_0.tip, _1_TestBloomFilteredLucene41Postings_0.tip, _0_TestBloomFilteredLucene41Postings_0.pos, _1.fnm, _1_Memory_0.ram, _0_Pulsing41_0.tim, _0_Pulsing41_0.tip, _0.si, _1_nrm.cfs, _0.fnm, _0_TestBloomFilteredLucene41Postings_0.blm, _0_Memory_0.ram, _1_Pulsing41_0.doc, _0_nrm.cfs, _1_TestBloomFilteredLucene41Postings_0.doc, _1_Pulsing41_0.pos, _1_nrm.cfe, _1_TestBloomFilteredLucene41Postings_0.blm, _1.fdx, _0_Pulsing41_0.pos, _0_Pulsing41_0.doc, _1_Pulsing41_0.tip, _1.fdt, _1_Pulsing41_0.tim, _1.si, _0_nrm.cfe, segments_2, _0_TestBloomFilteredLucene41Postings_0.doc, _0.fdx, _0.fdt]
[junit4:junit4]   2> 17214 T29 C1 oasc.SolrDeletionPolicy.updateCommits newest commit = 2[_1_TestBloomFilteredLucene41Postings_0.pos, _1_TestBloomFilteredLucene41Postings_0.tim, _0_TestBloomFilteredLucene41Postings_0.tim, _0_TestBloomFilteredLucene41Postings_0.tip, _1_TestBloomFilteredLucene41Postings_0.tip, _0_TestBloomFilteredLucene41Postings_0.pos, _1.fnm, _1_Memory_0.ram, _0_Pulsing41_0.tim, _0_Pulsing41_0.tip, _0.si, _1_nrm.cfs, _0.fnm, _0_TestBloomFilteredLucene41Postings_0.blm, _0_Memory_0.ram, _1_Pulsing41_0.doc, _0_nrm.cfs, _1_TestBloomFilteredLucene41Postings_0.doc, _1_Pulsing41_0.pos, _1_nrm.cfe, _1_TestBloomFilteredLucene41Postings_0.blm, _1.fdx, _0_Pulsing41_0.pos, _0_Pulsing41_0.doc, _1_Pulsing41_0.tip, _1.fdt, _1_Pulsing41_0.tim, _1.si, _0_nrm.cfe, segments_2, _0_TestBloomFilteredLucene41Postings_0.doc, _0.fdx, _0.fdt]
[junit4:junit4]   2> 17215 T29 C1 oasc.CachingDirectoryFactory.close Releasing directory:/usr/home/hudson/hudson-slave/workspace/Lucene-Solr-Tests-4.x-java7/solr/build/solr-core/test/J0/./org.apache.solr.handler.component.DistributedMLTComponentTest-1355715647251/shard0/data
[junit4:junit4]   2> 17221 T29 C1 oass.SolrIndexSearcher.<init> Opening Searcher@3486f312 main
[junit4:junit4]   2> 17222 T29 C1 oasu.DirectUpdateHandler2.commit end_commit_flush
[junit4:junit4]   2> 17227 T37 oasc.SolrCore.registerSearcher [collection1] Registered new searcher Searcher@3486f312 main{StandardDirectoryReader(segments_2:6 _0(4.1):C10 _1(4.1):C1)}
[junit4:junit4]   2> 17228 T37 oasc.CachingDirectoryFactory.close Releasing directory:/usr/home/hudson/hudson-slave/workspace/Lucene-Solr-Tests-4.x-java7/solr/build/solr-core/test/J0/./org.apache.solr.handler.component.DistributedMLTComponentTest-1355715647251/shard0/data/index
[junit4:junit4]   2> 17229 T29 C1 UPDATE [collection1] webapp=/jzcx path=/update params={waitSearcher=true&wt=javabin&commit=true&softCommit=false&version=2} {commit=} 0 27
[junit4:junit4]   2> 17233 T40 C2 oasu.DirectUpdateHandler2.commit start commit{flags=0,_version_=0,optimize=false,openSearcher=true,waitSearcher=true,expungeDeletes=false,softCommit=false}
[junit4:junit4]   2> 17254 T40 C2 oasc.SolrDeletionPolicy.onCommit SolrDeletionPolicy.onCommit: commits:num=2
[junit4:junit4]   2> 		commit{dir=RateLimitedDirectoryWrapper(MockDirWrapper(org.apache.lucene.store.RAMDirectory@1cf85db2 lockFactory=org.apache.lucene.store.NativeFSLockFactory@1a610dc)),segFN=segments_1,generation=1,filenames=[segments_1]
[junit4:junit4]   2> 		commit{dir=RateLimitedDirectoryWrapper(MockDirWrapper(org.apache.lucene.store.RAMDirectory@1cf85db2 lockFactory=org.apache.lucene.store.NativeFSLockFactory@1a610dc)),segFN=segments_2,generation=2,filenames=[_1_TestBloomFilteredLucene41Postings_0.pos, _1_TestBloomFilteredLucene41Postings_0.tim, _0_TestBloomFilteredLucene41Postings_0.tim, _0_TestBloomFilteredLucene41Postings_0.tip, _1_TestBloomFilteredLucene41Postings_0.tip, _0_TestBloomFilteredLucene41Postings_0.pos, _1.fnm, _1_Memory_0.ram, _0_Pulsing41_0.tim, _0_Pulsing41_0.tip, _0.si, _1_nrm.cfs, _0.fnm, _0_TestBloomFilteredLucene41Postings_0.blm, _0_Memory_0.ram, _1_Pulsing41_0.doc, _0_nrm.cfs, _1_TestBloomFilteredLucene41Postings_0.doc, _1_Pulsing41_0.pos, _1_nrm.cfe, _1_TestBloomFilteredLucene41Postings_0.blm, _1.fdx, _0_Pulsing41_0.pos, _0_Pulsing41_0.doc, _1_Pulsing41_0.tip, _1.fdt, _1_Pulsing41_0.tim, _1.si, _0_nrm.cfe, segments_2, _0_TestBloomFilteredLucene41Postings_0.doc, _0.fdx, _0.fdt]
[junit4:junit4]   2> 17254 T40 C2 oasc.SolrDeletionPolicy.updateCommits newest commit = 2[_1_TestBloomFilteredLucene41Postings_0.pos, _1_TestBloomFilteredLucene41Postings_0.tim, _0_TestBloomFilteredLucene41Postings_0.tim, _0_TestBloomFilteredLucene41Postings_0.tip, _1_TestBloomFilteredLucene41Postings_0.tip, _0_TestBloomFilteredLucene41Postings_0.pos, _1.fnm, _1_Memory_0.ram, _0_Pulsing41_0.tim, _0_Pulsing41_0.tip, _0.si, _1_nrm.cfs, _0.fnm, _0_TestBloomFilteredLucene41Postings_0.blm, _0_Memory_0.ram, _1_Pulsing41_0.doc, _0_nrm.cfs, _1_TestBloomFilteredLucene41Postings_0.doc, _1_Pulsing41_0.pos, _1_nrm.cfe, _1_TestBloomFilteredLucene41Postings_0.blm, _1.fdx, _0_Pulsing41_0.pos, _0_Pulsing41_0.doc, _1_Pulsing41_0.tip, _1.fdt, _1_Pulsing41_0.tim, _1.si, _0_nrm.cfe, segments_2, _0_TestBloomFilteredLucene41Postings_0.doc, _0.fdx, _0.fdt]
[junit4:junit4]   2> 17255 T40 C2 oasc.CachingDirectoryFactory.close Releasing directory:/usr/home/hudson/hudson-slave/workspace/Lucene-Solr-Tests-4.x-java7/solr/build/solr-core/test/J0/./org.apache.solr.handler.component.DistributedMLTComponentTest-1355715647251/shard1/data
[junit4:junit4]   2> 17266 T40 C2 oass.SolrIndexSearcher.<init> Opening Searcher@6cf085a9 main
[junit4:junit4]   2> 17267 T40 C2 oasu.DirectUpdateHandler2.commit end_commit_flush
[junit4:junit4]   2> 17272 T48 oasc.SolrCore.registerSearcher [collection1] Registered new searcher Searcher@6cf085a9 main{StandardDirectoryReader(segments_2:6 _0(4.1):C10 _1(4.1):C3)}
[junit4:junit4]   2> 17273 T48 oasc.CachingDirectoryFactory.close Releasing directory:/usr/home/hudson/hudson-slave/workspace/Lucene-Solr-Tests-4.x-java7/solr/build/solr-core/test/J0/./org.apache.solr.handler.component.DistributedMLTComponentTest-1355715647251/shard1/data/index
[junit4:junit4]   2> 17273 T40 C2 UPDATE [collection1] webapp=/jzcx path=/update params={waitSearcher=true&wt=javabin&commit=true&softCommit=false&version=2} {commit=} 0 40
[junit4:junit4]   2> 17583 T15 C0 REQ [collection1] webapp=/jzcx path=/select params={mlt.fl=lowerfilt&shards.qt=mltrh&q=match_none&mlt=true&distrib=false&qt=mltrh&wt=javabin&version=2} hits=0 status=0 QTime=279 
[junit4:junit4]   2> 17947 T30 C1 REQ [collection1] webapp=/jzcx path=/select params={mlt.fl=lowerfilt&shards.qt=mltrh&mlt=true&distrib=false&wt=javabin&rows=10&version=2&shard.url=127.0.0.1:47666/jzcx|[ff01::213]:33332/jzcx|[ff01::114]:33332/jzcx|[ff01::083]:33332/jzcx&fl=id,score&NOW=1355715664541&start=0&q=match_none&isShard=true&qt=mltrh&fsv=true} hits=0 status=0 QTime=98 
[junit4:junit4]   2> 17947 T41 C2 REQ [collection1] webapp=/jzcx path=/select params={mlt.fl=lowerfilt&shards.qt=mltrh&mlt=true&distrib=false&wt=javabin&rows=10&version=2&shard.url=127.0.0.1:38710/jzcx|[ff01::083]:33332/jzcx|[ff01::114]:33332/jzcx|[ff01::213]:33332/jzcx&fl=id,score&NOW=1355715664541&start=0&q=match_none&isShard=true&qt=mltrh&fsv=true} hits=0 status=0 QTime=71 
[junit4:junit4]   2> 17969 T40 C2 REQ [collection1] webapp=/jzcx path=/select params={mlt.fl=lowerfilt&shards=127.0.0.1:47666/jzcx|[ff01::213]:33332/jzcx|[ff01::114]:33332/jzcx|[ff01::083]:33332/jzcx,127.0.0.1:38710/jzcx|[ff01::083]:33332/jzcx|[ff01::114]:33332/jzcx|[ff01::213]:33332/jzcx&shards.qt=mltrh&q=match_none&mlt=true&qt=mltrh&wt=javabin&version=2} hits=0 status=0 QTime=362 
[junit4:junit4]   2> 18122 T15 C0 REQ [collection1] webapp=/jzcx path=/select params={mlt.fl=lowerfilt&shards.qt=mltrh&q=lowerfilt:sonata&mlt=true&distrib=false&qt=mltrh&wt=javabin&version=2} hits=1 status=0 QTime=147 
[junit4:junit4]   2> 18137 T41 C2 REQ [collection1] webapp=/jzcx path=/select params={mlt.fl=lowerfilt&shards.qt=mltrh&mlt=true&distrib=false&wt=javabin&rows=10&version=2&fl=id,score&shard.url=127.0.0.1:38710/jzcx|[ff01::083]:33332/jzcx|[ff01::213]:33332/jzcx&NOW=1355715665062&start=0&q=lowerfilt:sonata&qt=mltrh&isShard=true&fsv=true} hits=0 status=0 QTime=2 
[junit4:junit4]   2> 18137 T30 C1 REQ [collection1] webapp=/jzcx path=/select params={mlt.fl=lowerfilt&shards.qt=mltrh&mlt=true&distrib=false&wt=javabin&rows=10&version=2&fl=id,score&shard.url=127.0.0.1:47666/jzcx|[ff01::114]:33332/jzcx|[ff01::083]:33332/jzcx|[ff01::213]:33332/jzcx&NOW=1355715665062&start=0&q=lowerfilt:sonata&qt=mltrh&isShard=true&fsv=true} hits=1 status=0 QTime=2 
[junit4:junit4]   2> 18264 T30 C1 REQ [collection1] webapp=/jzcx path=/select params={mlt.fl=lowerfilt&shards.qt=mltrh&ids=8&mlt=true&distrib=false&wt=javabin&version=2&shard.url=127.0.0.1:47666/jzcx|[ff01::114]:33332/jzcx|[ff01::083]:33332/jzcx|[ff01::213]:33332/jzcx&NOW=1355715665062&q=lowerfilt:sonata&qt=mltrh&isShard=true} status=0 QTime=83 
[junit4:junit4]   2> 18267 T40 C2 REQ [collection1] webapp=/jzcx path=/select params={mlt.fl=lowerfilt&shards=127.0.0.1:47666/jzcx|[ff01::114]:33332/jzcx|[ff01::083]:33332/jzcx|[ff01::213]:33332/jzcx,127.0.0.1:38710/jzcx|[ff01::083]:33332/jzcx|[ff01::213]:33332/jzcx&shards.qt=mltrh&q=lowerfilt:sonata&mlt=true&qt=mltrh&wt=javabin&version=2} hits=1 status=0 QTime=139 
[junit4:junit4]   2> 18452 T15 C0 REQ [collection1] webapp=/jzcx path=/select params={fl=id&sort=id+desc&mlt.fl=lowerfilt&shards.qt=mltrh&q=lowerfilt:moon&mlt=true&distrib=false&qt=mltrh&wt=javabin&version=2} hits=2 status=0 QTime=179 
[junit4:junit4]   2> 18477 T42 C2 REQ [collection1] webapp=/jzcx path=/select params={mlt.fl=lowerfilt&sort=id+desc&shards.qt=mltrh&mlt=true&distrib=false&wt=javabin&rows=10&version=2&fl=id&shard.url=[ff01::114]:33332/jzcx|[ff01::083]:33332/jzcx|[ff01::213]:33332/jzcx|127.0.0.1:38710/jzcx&NOW=1355715665395&start=0&q=lowerfilt:moon&isShard=true&qt=mltrh&fsv=true} hits=1 status=0 QTime=4 
[junit4:junit4]   2> 18493 T31 C1 REQ [collection1] webapp=/jzcx path=/select params={mlt.fl=lowerfilt&sort=id+desc&shards.qt=mltrh&mlt=true&distrib=false&wt=javabin&rows=10&version=2&fl=id&shard.url=[ff01::114]:33332/jzcx|[ff01::213]:33332/jzcx|[ff01::083]:33332/jzcx|127.0.0.1:47666/jzcx&NOW=1355715665395&start=0&q=lowerfilt:moon&isShard=true&qt=mltrh&fsv=true} hits=1 status=0 QTime=15 
[junit4:junit4]   2> 18533 T31 C1 REQ [collection1] webapp=/jzcx path=/select params={sort=score+desc&mlt.fl=lowerfilt&shards.qt=mltrh&mlt.dist.id=17&mlt=true&distrib=false&wt=javabin&rows=20&version=2&fl=score,id&shard.url=[ff01::114]:33332/jzcx|[ff01::213]:33332/jzcx|[ff01::083]:33332/jzcx|127.0.0.1:47666/jzcx&NOW=1355715665395&start=0&q=%2B(lowerfilt:the)+-id:17&qt=mltrh&isShard=true} hits=6 status=0 QTime=21 
[junit4:junit4]   2> 18535 T42 C2 REQ [collection1] webapp=/jzcx path=/select params={sort=score+desc&mlt.fl=lowerfilt&shards.qt=mltrh&mlt.dist.id=17&mlt=true&distrib=false&wt=javabin&rows=20&version=2&fl=score,id&shard.url=[ff01::114]:33332/jzcx|[ff01::083]:33332/jzcx|[ff01::213]:33332/jzcx|127.0.0.1:38710/jzcx&NOW=1355715665395&start=0&q=%2B(lowerfilt:the)+-id:17&qt=mltrh&isShard=true} hits=7 status=0 QTime=23 
[junit4:junit4]   2> 18539 T29 C1 oashc.MoreLikeThisComponent.handleResponses MLT Query returned: {responseHeader={status=0,QTime=21},response={numFound=6,start=0,maxScore=0.58267975,docs=[SolrDocument{id=13, score=0.58267975}, SolrDocument{id=15, score=0.58267975}, SolrDocument{id=19, score=0.58267975}, SolrDocument{id=20, score=0.58267975}, SolrDocument{id=22, score=0.58267975}, SolrDocument{id=24, score=0.58267975}]},moreLikeThis={13={numFound=6,start=0,docs=[SolrDocument{id=15}, SolrDocument{id=19}, SolrDocument{id=20}, SolrDocument{id=22}, SolrDocument{id=24}, SolrDocument{id=17}]},15={numFound=6,start=0,docs=[SolrDocument{id=13}, SolrDocument{id=19}, SolrDocument{id=20}, SolrDocument{id=22}, SolrDocument{id=24}, SolrDocument{id=17}]},19={numFound=6,start=0,docs=[SolrDocument{id=13}, SolrDocument{id=15}, SolrDocument{id=20}, SolrDocument{id=22}, SolrDocument{id=24}, SolrDocument{id=17}]},20={numFound=6,start=0,docs=[SolrDocument{id=13}, SolrDocument{id=15}, SolrDocument{id=19}, SolrDocument{id=22}, SolrDocument{id=24}, SolrDocument{id=17}]},22={numFound=6,start=0,docs=[SolrDocument{id=13}, SolrDocument{id=15}, SolrDocument{id=19}, SolrDocument{id=20}, SolrDocument{id=24}, SolrDocument{id=17}]},24={numFound=6,start=0,docs=[SolrDocument{id=13}, SolrDocument{id=15}, SolrDocument{id=19}, SolrDocument{id=20}, SolrDocument{id=22}, SolrDocument{id=17}]}}}
[junit4:junit4]   2> 18541 T29 C1 oashc.MoreLikeThisComponent.handleResponses MLT Query returned: {responseHeader={status=0,QTime=23},response={numFound=7,start=0,maxScore=0.6565079,docs=[SolrDocument{id=14, score=0.6565079}, SolrDocument{id=16, score=0.6565079}, SolrDocument{id=18, score=0.6565079}, SolrDocument{id=21, score=0.6565079}, SolrDocument{id=23, score=0.6565079}, SolrDocument{id=7, score=0.5570654}, SolrDocument{id=9, score=0.5252063}]},moreLikeThis={14={numFound=6,start=0,docs=[SolrDocument{id=16}, SolrDocument{id=18}, SolrDocument{id=21}, SolrDocument{id=23}, SolrDocument{id=7}, SolrDocument{id=9}]},16={numFound=6,start=0,docs=[SolrDocument{id=14}, SolrDocument{id=18}, SolrDocument{id=21}, SolrDocument{id=23}, SolrDocument{id=7}, SolrDocument{id=9}]},18={numFound=6,start=0,docs=[SolrDocument{id=14}, SolrDocument{id=16}, SolrDocument{id=21}, SolrDocument{id=23}, SolrDocument{id=7}, SolrDocument{id=9}]},21={numFound=6,start=0,docs=[SolrDocument{id=14}, SolrDocument{id=16}, SolrDocument{id=18}, SolrDocument{id=23}, SolrDocument{id=7}, SolrDocument{id=9}]},23={numFound=6,start=0,docs=[SolrDocument{id=14}, SolrDocument{id=16}, SolrDocument{id=18}, SolrDocument{id=21}, SolrDocument{id=7}, SolrDocument{id=9}]},7={numFound=0,start=0,docs=[]},9={numFound=6,start=0,docs=[SolrDocument{id=14}, SolrDocument{id=16}, SolrDocument{id=18}, SolrDocument{id=21}, SolrDocument{id=23}, SolrDocument{id=7}]}}}
[junit4:junit4]   2> 18548 T42 C2 REQ [collection1] webapp=/jzcx path=/select params={mlt.fl=lowerfilt&shards.qt=mltrh&ids=7&mlt=true&distrib=false&wt=javabin&version=2&fl=id&shard.url=[ff01::114]:33332/jzcx|[ff01::083]:33332/jzcx|[ff01::213]:33332/jzcx|127.0.0.1:38710/jzcx&NOW=1355715665395&q=lowerfilt:moon&qt=mltrh&isShard=true} status=0 QTime=1 
[junit4:junit4]   2> 18549 T31 C1 REQ [collection1] webapp=/jzcx path=/select params={mlt.fl=lowerfilt&shards.qt=mltrh&ids=17&mlt=true&distrib=false&wt=javabin&version=2&fl=id&shard.url=[ff01::114]:33332/jzcx|[ff01::213]:33332/jzcx|[ff01::083]:33332/jzcx|127.0.0.1:47666/jzcx&NOW=1355715665395&q=lowerfilt:moon&qt=mltrh&isShard=true} status=0 QTime=3 
[junit4:junit4]   2> 18552 T29 C1 oashc.MoreLikeThisComponent.finishStage MLT: results added for key: 17 documents: {numFound=6,start=0,maxScore=0.58267975,docs=[SolrDocument{id=13, score=0.58267975}, SolrDocument{id=15, score=0.58267975}, SolrDocument{id=19, score=0.58267975}, SolrDocument{id=20, score=0.58267975}, SolrDocument{id=22, score=0.58267975}, SolrDocument{id=24, score=0.58267975}]}
[junit4:junit4]   2> 18553 T29 C1 oashc.MoreLikeThisComponent.finishStage MLT: results added for key: 17 documents: {numFound=7,start=0,maxScore=0.6565079,docs=[SolrDocument{id=14, score=0.6565079}, SolrDocument{id=16, score=0.6565079}, SolrDocument{id=18, score=0.6565079}, SolrDocument{id=21, score=0.6565079}, SolrDocument{id=23, score=0.6565079}, SolrDocument{id=7, score=0.5570654}, SolrDocument{id=9, score=0.5252063}]}
[junit4:junit4]   2> 18559 T29 C1 REQ [collection1] webapp=/jzcx path=/select params={fl=id&sort=id+desc&mlt.fl=lowerfilt&shards=[ff01::114]:33332/jzcx|[ff01::213]:33332/jzcx|[ff01::083]:33332/jzcx|127.0.0.1:47666/jzcx,[ff01::114]:33332/jzcx|[ff01::083]:33332/jzcx|[ff01::213]:33332/jzcx|127.0.0.1:38710/jzcx&shards.qt=mltrh&q=lowerfilt:moon&mlt=true&qt=mltrh&wt=javabin&version=2} hits=2 status=0 QTime=98 
[junit4:junit4]   2> 18597 T15 C0 REQ [collection1] webapp=/jzcx path=/select params={fl=id&sort=id+desc&mlt.fl=lowerfilt&shards.qt=mltrh&q=lowerfilt:fox&mlt=true&distrib=false&qt=mltrh&wt=javabin&version=2} hits=13 status=0 QTime=28 
[junit4:junit4]   2> 18625 T41 C2 REQ [collection1] webapp=/jzcx path=/select params={sort=id+desc&mlt.fl=lowerfilt&shards.qt=mltrh&mlt=true&distrib=false&wt=javabin&rows=10&version=2&fl=id&shard.url=127.0.0.1:38710/jzcx|[ff01::213]:33332/jzcx|[ff01::083]:33332/jzcx|[ff01::114]:33332/jzcx&NOW=1355715665543&start=0&q=lowerfilt:fox&qt=mltrh&isShard=true&fsv=true} hits=6 status=0 QTime=9 
[junit4:junit4]   2> 18632 T30 C1 REQ [collection1] webapp=/jzcx path=/select params={sort=id+desc&mlt.fl=lowerfilt&shards.qt=mltrh&mlt=true&distrib=false&wt=javabin&rows=10&version=2&fl=id&shard.url=[ff01::213]:33332/jzcx|[ff01::083]:33332/jzcx|127.0.0.1:47666/jzcx&NOW=1355715665543&start=0&q=lowerfilt:fox&qt=mltrh&isShard=true&fsv=true} hits=7 status=0 QTime=15 
[junit4:junit4]   2> 18675 T41 C2 REQ [collection1] webapp=/jzcx path=/select params={sort=score+desc&mlt.fl=lowerfilt&shards.qt=mltrh&mlt.dist.id=23&mlt=true&distrib=false&wt=javabin&rows=20&version=2&fl=score,id&shard.url=127.0.0.1:38710/jzcx|[ff01::213]:33332/jzcx|[ff01::083]:33332/jzcx|[ff01::114]:33332/jzcx&NOW=1355715665543&start=0&q=%2B(lowerfilt:the)+-id:23&qt=mltrh&isShard=true} hits=6 status=0 QTime=13 
[junit4:junit4]   2> 18685 T30 C1 REQ [collection1] webapp=/jzcx path=/select params={sort=score+desc&mlt.fl=lowerfilt&shards.qt=mltrh&mlt.dist.id=23&mlt=true&distrib=false&wt=javabin&rows=20&version=2&fl=score,id&shard.url=[ff01::213]:33332/jzcx|[ff01::083]:33332/jzcx|127.0.0.1:47666/jzcx&NOW=1355715665543&start=0&q=%2B(lowerfilt:the)+-id:23&qt=mltrh&isShard=true} hits=7 status=0 QTime=23 
[junit4:junit4]   2> 18696 T32 C1 REQ [collection1] webapp=/jzcx path=/select params={mlt.fl=lowerfilt&sort=score+desc&shards.qt=mltrh&mlt.dist.id=21&mlt=true&distrib=false&wt=javabin&rows=20&version=2&fl=score,id&shard.url=[ff01::213]:33332/jzcx|[ff01::083]:33332/jzcx|127.0.0.1:47666/jzcx&NOW=1355715665543&start=0&q=%2B(lowerfilt:the)+-id:21&isShard=true&qt=mltrh} hits=7 status=0 QTime=32 
[junit4:junit4]   2> 18703 T40 C2 oashc.MoreLikeThisComponent.handleResponses MLT Query returned: {responseHeader={status=0,QTime=13},response={numFound=6,start=0,maxScore=0.6565079,docs=[SolrDocument{id=14, score=0.6565079}, SolrDocument{id=16, score=0.6565079}, SolrDocument{id=18, score=0.6565079}, SolrDocument{id=21, score=0.6565079}, SolrDocument{id=7, score=0.5570654}, SolrDocument{id=9, score=0.5252063}]},moreLikeThis={14={numFound=6,start=0,docs=[SolrDocument{id=16}, SolrDocument{id=18}, SolrDocument{id=21}, SolrDocument{id=23}, SolrDocument{id=7}, SolrDocument{id=9}]},16={numFound=6,start=0,docs=[SolrDocument{id=14}, SolrDocument{id=18}, SolrDocument{id=21}, SolrDocument{id=23}, SolrDocument{id=7}, SolrDocument{id=9}]},18={numFound=6,start=0,docs=[SolrDocument{id=14}, SolrDocument{id=16}, SolrDocument{id=21}, SolrDocument{id=23}, SolrDocument{id=7}, SolrDocument{id=9}]},21={numFound=6,start=0,docs=[SolrDocument{id=14}, SolrDocument{id=16}, SolrDocument{id=18}, SolrDocument{id=23}, SolrDocument{id=7}, SolrDocument{id=9}]},7={numFound=0,start=0,docs=[]},9={numFound=6,start=0,docs=[SolrDocument{id=14}, SolrDocument{id=16}, SolrDocument{id=18}, SolrDocument{id=21}, SolrDocument{id=23}, SolrDocument{id=7}]}}}
[junit4:junit4]   2> 18708 T40 C2 oashc.MoreLikeThisComponent.handleResponses MLT Query returned: {responseHeader={status=0,QTime=23},response={numFound=7,start=0,maxScore=0.58267975,docs=[SolrDocument{id=13, score=0.58267975}, SolrDocument{id=15, score=0.58267975}, SolrDocument{id=19, score=0.58267975}, SolrDocument{id=20, score=0.58267975}, SolrDocument{id=22, score=0.58267975}, SolrDocument{id=24, score=0.58267975}, SolrDocument{id=17, score=0.4661438}]},moreLikeThis={13={numFound=6,start=0,docs=[SolrDocument{id=15}, SolrDocument{id=19}, SolrDocument{id=20}, SolrDocument{id=22}, SolrDocument{id=24}, SolrDocument{id=17}]},15={numFound=6,start=0,docs=[SolrDocument{id=13}, SolrDocument{id=19}, SolrDocument{id=20}, SolrDocument{id=22}, SolrDocument{id=24}, SolrDocument{id=17}]},19={numFound=6,start=0,docs=[SolrDocument{id=13}, SolrDocument{id=15}, SolrDocument{id=20}, SolrDocument{id=22}, SolrDocument{id=24}, SolrDocument{id=17}]},20={numFound=6,start=0,docs=[SolrDocument{id=13}, SolrDocument{id=15}, SolrDocument{id=19}, SolrDocument{id=22}, SolrDocument{id=24}, SolrDocument{id=17}]},22={numFound=6,start=0,docs=[SolrDocument{id=13}, SolrDocument{id=15}, SolrDocument{id=19}, SolrDocument{id=20}, SolrDocument{id=24}, SolrDocument{id=17}]},24={numFound=6,start=0,docs=[SolrDocument{id=13}, SolrDocument{id=15}, SolrDocument{id=19}, SolrDocument{id=20}, SolrDocument{id=22}, SolrDocument{id=17}]},17={numFound=6,start=0,docs=[SolrDocument{id=13}, SolrDocument{id=15}, SolrDocument{id=19}, SolrDocument{id=20}, SolrDocument{id=22}, SolrDocument{id=24}]}}}
[junit4:junit4]   2> 18719 T79 C2 REQ [collection1] webapp=/jzcx path=/select params={mlt.fl=lowerfilt&sort=score+desc&shards.qt=mltrh&mlt.dist.id=9&mlt=true&distrib=false&wt=javabin&rows=20&version=2&fl=score,id&shard.url=127.0.0.1:38710/jzcx|[ff01::213]:33332/jzcx|[ff01::083]:33332/jzcx|[ff01::114]:33332/jzcx&NOW=1355715665543&start=0&q=%2B(lowerfilt:the)+-id:9&isShard=true&qt=mltrh} hits=6 status=0 QTime=17 
[junit4:junit4]   2> 18720 T92 C1 REQ [collection1] webapp=/jzcx path=/select params={mlt.fl=lowerfilt&sort=score+desc&shards.qt=mltrh&mlt.dist.id=15&mlt=true&distrib=false&wt=javabin&rows=20&version=2&fl=score,id&shard.url=[ff01::213]:33332/jzcx|[ff01::083]:33332/jzcx|127.0.0.1:47666/jzcx&NOW=1355715665543&start=0&q=%2B(lowerfilt:the)+-id:15&isShard=true&qt=mltrh} hits=6 status=0 QTime=18 
[junit4:junit4]   2> 18725 T85 C1 REQ [collection1] webapp=/jzcx path=/select params={mlt.fl=lowerfilt&sort=score+desc&shards.qt=mltrh&mlt.dist.id=22&mlt=true&distrib=false&wt=javabin&rows=20&version=2&fl=score,id&shard.url=[ff01::213]:33332/jzcx|[ff01::083]:33332/jzcx|127.0.0.1:47666/jzcx&NOW=1355715665543&start=0&q=%2B(lowerfilt:the)+-id:22&isShard=true&qt=mltrh} hits=6 status=0 QTime=40 
[junit4:junit4]   2> 18728 T44 C2 REQ [collection1] webapp=/jzcx path=/select params={mlt.fl=lowerfilt&sort=score+desc&shards.qt=mltrh&mlt.dist.id=18&mlt=true&distrib=false&wt=javabin&rows=20&version=2&fl=score,id&shard.url=127.0.0.1:38710/jzcx|[ff01::213]:33332/jzcx|[ff01::083]:33332/jzcx|[ff01::114]:33332/jzcx&NOW=1355715665543&start=0&q=%2B(lowerfilt:the)+-id:18&isShard=true&qt=mltrh} hits=6 status=0 QTime=53 
[junit4:junit4]   2> 18732 T45 C2 REQ [collection1] webapp=/jzcx path=/select params={mlt.fl=lowerfilt&sort=score+desc&shards.qt=mltrh&mlt.dist.id=16&mlt=true&distrib=false&wt=javabin&rows=20&version=2&fl=score,id&shard.url=127.0.0.1:38710/jzcx|[ff01::213]:33332/jzcx|[ff01::083]:33332/jzcx|[ff01::114]:33332/jzcx&NOW=1355715665543&start=0&q=%2B(lowerfilt:the)+-id:16&isShard=true&qt=mltrh} hits=6 status=0 QTime=58 
[junit4:junit4]   2> 18734 T46 C2 REQ [collection1] webapp=/jzcx path=/select params={mlt.fl=lowerfilt&sort=score+desc&shards.qt=mltrh&mlt.dist.id=14&mlt=true&distrib=false&wt=javabin&rows=20&version=2&fl=score,id&shard.url=127.0.0.1:38710/jzcx|[ff01::213]:33332/jzcx|[ff01::083]:33332/jzcx|[ff01::114]:33332/jzcx&NOW=1355715665543&start=0&q=%2B(lowerfilt:the)+-id:14&isShard=true&qt=mltrh} hits=6 status=0 QTime=39 
[junit4:junit4]   2> 18734 T83 C1 REQ [collection1] webapp=/jzcx path=/select params={mlt.fl=lowerfilt&sort=score+desc&shards.qt=mltrh&mlt.dist.id=9&mlt=true&distrib=false&wt=javabin&rows=20&version=2&fl=score,id&shard.url=[ff01::213]:33332/jzcx|[ff01::083]:33332/jzcx|127.0.0.1:47666/jzcx&NOW=1355715665543&start=0&q=%2B(lowerfilt:the)+-id:9&isShard=true&qt=mltrh} hits=7 status=0 QTime=39 
[junit4:junit4]   2> 18736 T88 C1 REQ [collection1] webapp=/jzcx path=/select params={mlt.fl=lowerfilt&sort=score+desc&shards.qt=mltrh&mlt.dist.id=19&mlt=true&distrib=false&wt=javabin&rows=20&version=2&fl=score,id&shard.url=[ff01::213]:33332/jzcx|[ff01::083]:33332/jzcx|127.0.0.1:47666/jzcx&NOW=1355715665543&start=0&q=%2B(lowerfilt:the)+-id:19&isShard=true&qt=mltrh} hits=6 status=0 QTime=35 
[junit4:junit4]   2> 18737 T89 C2 REQ [collection1] webapp=/jzcx path=/select params={mlt.fl=lowerfilt&sort=score+desc&shards.qt=mltrh&mlt.dist.id=22&mlt=true&distrib=false&wt=javabin&rows=20&version=2&fl=score,id&shard.url=127.0.0.1:38710/jzcx|[ff01::213]:33332/jzcx|[ff01::083]:33332/jzcx|[ff01::114]:33332/jzcx&NOW=1355715665543&start=0&q=%2B(lowerfilt:the)+-id:22&isShard=true&qt=mltrh} hits=7 status=0 QTime=35 
[junit4:junit4]   2> 18738 T86 C2 REQ [collection1] webapp=/jzcx path=/select params={mlt.fl=lowerfilt&sort=score+desc&shards.qt=mltrh&mlt.dist.id=15&mlt=true&distrib=false&wt=javabin&rows=20&version=2&fl=score,id&shard.url=127.0.0.1:38710/jzcx|[ff01::213]:33332/jzcx|[ff01::083]:33332/jzcx|[ff01::114]:33332/jzcx&NOW=1355715665543&start=0&q=%2B(lowerfilt:the)+-id:15&isShard=true&qt=mltrh} hits=7 status=0 QTime=53 
[junit4:junit4]   2> 18737 T35 C1 REQ [collection1] webapp=/jzcx path=/select params={mlt.fl=lowerfilt&sort=score+desc&shards.qt=mltrh&mlt.dist.id=14&mlt=true&distrib=false&wt=javabin&rows=20&version=2&fl=score,id&shard.url=[ff01::213]:33332/jzcx|[ff01::083]:33332/jzcx|127.0.0.1:47666/jzcx&NOW=1355715665543&start=0&q=%2B(lowerfilt:the)+-id:14&isShard=true&qt=mltrh} hits=7 status=0 QTime=34 
[junit4:junit4]   2> 18737 T90 C1 REQ [collection1] webapp=/jzcx path=/select params={mlt.fl=lowerfilt&sort=score+desc&shards.qt=mltrh&mlt.dist.id=17&mlt=true&distrib=false&wt=javabin&rows=20&version=2&fl=score,id&shard.url=[ff01::213]:33332/jzcx|[ff01::083]:33332/jzcx|127.0.0.1:47666/jzcx&NOW=1355715665543&start=0&q=%2B(lowerfilt:the)+-id:17&isShard=true&qt=mltrh} hits=6 status=0 QTime=36 
[junit4:junit4]   2> 18740 T84 C2 REQ [collection1] webapp=/jzcx path=/select params={mlt.fl=lowerfilt&sort=score+desc&shards.qt=mltrh&mlt.dist.id=17&mlt=true&distrib=false&wt=javabin&rows=20&version=2&fl=score,id&shard.url=127.0.0.1:38710/jzcx|[ff01::213]:33332/jzcx|[ff01::083]:33332/jzcx|[ff01::114]:33332/jzcx&NOW=1355715665543&start=0&q=%2B(lowerfilt:the)+-id:17&isShard=true&qt=mltrh} hits=7 status=0 QTime=45 
[junit4:junit4]   2> 18741 T87 C2 REQ [collection1] webapp=/jzcx path=/select params={mlt.fl=lowerfilt&sort=score+desc&shards.qt=mltrh&mlt.dist.id=20&mlt=true&distrib=false&wt=javabin&rows=20&version=2&fl=score,id&shard.url=127.0.0.1:38710/jzcx|[ff01::213]:33332/jzcx|[ff01::083]:33332/jzcx|[ff01::114]:33332/jzcx&NOW=1355715665543&start=0&q=%2B(lowerfilt:the)+-id:20&isShard=true&qt=mltrh} hits=7 status=0 QTime=52 
[junit4:junit4]   2> 18741 T80 C1 REQ [collection1] webapp=/jzcx path=/select params={mlt.fl=lowerfilt&sort=score+desc&shards.qt=mltrh&mlt.dist.id=24&mlt=true&distrib=false&wt=javabin&rows=20&version=2&fl=score,id&shard.url=[ff01::213]:33332/jzcx|[ff01::083]:33332/jzcx|127.0.0.1:47666/jzcx&NOW=1355715665543&start=0&q=%2B(lowerfilt:the)+-id:24&isShard=true&qt=mltrh} hits=6 status=0 QTime=57 
[junit4:junit4]   2> 18742 T91 C2 REQ [collection1] webapp=/jzcx path=/select params={mlt.fl=lowerfilt&sort=score+desc&shards.qt=mltrh&mlt.dist.id=13&mlt=true&distrib=false&wt=javabin&rows=20&version=2&fl=score,id&shard.url=127.0.0.1:38710/jzcx|[ff01::213]:33332/jzcx|[ff01::083]:33332/jzcx|[ff01::114]:33332/jzcx&NOW=1355715665543&start=0&q=%2B(lowerfilt:the)+-id:13&isShard=true&qt=mltrh} hits=7 status=0 QTime=40 
[junit4:junit4]   2> 18743 T81 C2 REQ [collection1] webapp=/jzcx path=/select params={mlt.fl=lowerfilt&sort=score+desc&shards.qt=mltrh&mlt.dist.id=24&mlt=true&distrib=false&wt=javabin&rows=20&version=2&fl=score,id&shard.url=127.0.0.1:38710/jzcx|[ff01::213]:33332/jzcx|[ff01::083]:33332/jzcx|[ff01::114]:33332/jzcx&NOW=1355715665543&start=0&q=%2B(lowerfilt:the)+-id:24&isShard=true&qt=mltrh} hits=7 status=0 QTime=43 
[junit4:junit4]   2> 18743 T40 C2 oashc.MoreLikeThisComponent.handleResponses MLT Query returned: {responseHeader={status=0,QTime=17},response={numFound=6,start=0,maxScore=0.6565079,docs=[SolrDocument{id=14, score=0.6565079}, SolrDocument{id=16, score=0.6565079}, SolrDocument{id=18, score=0.6565079}, SolrDocument{id=21, score=0.6565079}, SolrDocument{id=23, score=0.6565079}, SolrDocument{id=7, score=0.5570654}]},moreLikeThis={14={numFound=6,start=0,docs=[SolrDocument{id=16}, SolrDocument{id=18}, SolrDocument{id=21}, SolrDocument{id=23}, SolrDocument{id=7}, SolrDocument{id=9}]},16={numFound=6,start=0,docs=[SolrDocument{id=14}, SolrDocument{id=18}, SolrDocument{id=21}, SolrDocument{id=23}, SolrDocument{id=7}, SolrDocument{id=9}]},18={numFound=6,start=0,docs=[SolrDocument{id=14}, SolrDocument{id=16}, SolrDocument{id=21}, SolrDocument{id=23}, SolrDocument{id=7}, SolrDocument{id=9}]},21={numFound=6,start=0,docs=[SolrDocument{id=14}, SolrDocument{id=16}, SolrDocument{id=18}, SolrDocument{id=23}, SolrDocument{id=7}, SolrDocument{id=9}]},23={numFound=6,start=0,docs=[SolrDocument{id=14}, SolrDocument{id=16}, SolrDocument{id=18}, SolrDocument{id=21}, SolrDocument{id=7}, SolrDocument{id=9}]},7={numFound=0,start=0,docs=[]}}}
[junit4:junit4]   2> 18746 T40 C2 oashc.MoreLikeThisComponent.handleResponses MLT Query returned: {responseHeader={status=0,QTime=39},response={numFound=7,start=0,maxScore=0.58267975,docs=[SolrDocument{id=13, score=0.58267975}, SolrDocument{id=15, score=0.58267975}, SolrDocument{id=19, score=0.58267975}, SolrDocument{id=20, score=0.58267975}, SolrDocument{id=22, score=0.58267975}, SolrDocument{id=24, score=0.58267975}, SolrDocument{id=17, score=0.4661438}]},moreLikeThis={13={numFound=6,start=0,docs=[SolrDocument{id=15}, SolrDocument{id=19}, SolrDocument{id=20}, SolrDocument{id=22}, SolrDocument{id=24}, SolrDocument{id=17}]},15={numFound=6,start=0,docs=[SolrDocument{id=13}, SolrDocument{id=19}, SolrDocument{id=20}, SolrDocument{id=22}, SolrDocument{id=24}, SolrDocument{id=17}]},19={numFound=6,start=0,docs=[SolrDocument{id=13}, SolrDocument{id=15}, SolrDocument{id=20}, SolrDocument{id=22}, SolrDocument{id=24}, SolrDocument{id=17}]},20={numFound=6,start=0,docs=[SolrDocument{id=13}, SolrDocument{id=15}, SolrDocument{id=19}, SolrDocument{id=22}, SolrDocument{id=24}, SolrDocument{id=17}]},22={numFound=6,start=0,docs=[SolrDocument{id=13}, SolrDocument{id=15}, SolrDocument{id=19}, SolrDocument{id=20}, SolrDocument{id=24}, SolrDocument{id=17}]},24={numFound=6,start=0,docs=[SolrDocument{id=13}, SolrDocument{id=15}, SolrDocument{id=19}, SolrDocument{id=20}, SolrDocument{id=22}, SolrDocument{id=17}]},17={numFound=6,start=0,docs=[SolrDocument{id=13}, SolrDocument{id=15}, SolrDocument{id=19}, SolrDocument{id=20}, SolrDocument{id=22}, SolrDocument{id=24}]}}}
[junit4:junit4]   2> 18748 T40 C2 oashc.MoreLikeThisComponent.handleResponses MLT Query returned: {responseHeader={status=0,QTime=18},response={numFound=6,start=0,maxScore=0.58267975,docs=[SolrDocument{id=13, score=0.58267975}, SolrDocument{id=19, score=0.58267975}, SolrDocument{id=20, score=0.58267975}, SolrDocument{id=22, score=0.58267975}, SolrDocument{id=24, score=0.58267975}, SolrDocument{id=17, score=0.4661438}]},moreLikeThis={13={numFound=6,start=0,docs=[SolrDocument{id=15}, SolrDocument{id=19}, SolrDocument{id=20}, SolrDocument{id=22}, SolrDocument{id=24}, SolrDocument{id=17}]},19={numFound=6,start=0,docs=[SolrDocument{id=13}, SolrDocument{id=15}, SolrDocument{id=20}, SolrDocument{id=22}, SolrDocument{id=24}, SolrDocument{id=17}]},20={numFound=6,start=0,docs=[SolrDocument{id=13}, SolrDocument{id=15}, SolrDocument{id=19}, SolrDocument{id=22}, SolrDocument{id=24}, SolrDocument{id=17}]},22={numFound=6,start=0,docs=[SolrDocument{id=13}, SolrDocument{id=15}, SolrDocument{id=19}, SolrDocument{id=20}, SolrDocument{id=24}, SolrDocument{id=17}]},24={numFound=6,start=0,docs=[SolrDocument{id=13}, SolrDocument{id=15}, SolrDocument{id=19}, SolrDocument{id=20}, SolrDocument{id=22}, SolrDocument{id=17}]},17={numFound=6,start=0,docs=[SolrDocument{id=13}, SolrDocument{id=15}, SolrDocument{id=19}, SolrDocument{id=20}, SolrDocument{id=22}, SolrDocument{id=24}]}}}
[junit4:junit4]   2> 18749 T43 C2 REQ [collection1] webapp=/jzcx path=/select params={mlt.fl=lowerfilt&sort=score+desc&shards.qt=mltrh&mlt.dist.id=21&mlt=true&distrib=false&wt=javabin&rows=20&version=2&fl=score,id&shard.url=127.0.0.1:38710/jzcx|[ff01::213]:33332/jzcx|[ff01::083]:33332/jzcx|[ff01::114]:33332/jzcx&NOW=1355715665543&start=0&q=%2B(lowerfilt:the)+-id:21&isShard=true&qt=mltrh} hits=6 status=0 QTime=81 
[junit4:junit4]   2> 18748 T34 C1 REQ [collection1] webapp=/jzcx path=/select params={mlt.fl=lowerfilt&sort=score+desc&shards.qt=mltrh&mlt.dist.id=16&mlt=true&distrib=false&wt=javabin&rows=20&version=2&fl=score,id&shard.url=[ff01::213]:33332/jzcx|[ff01::083]:33332/jzcx|127.0.0.1:47666/jzcx&NOW=1355715665543&start=0&q=%2B(lowerfilt:the)+-id:16&isShard=true&qt=mltrh} hits=7 status=0 QTime=73 
[junit4:junit4]   2> 18750 T40 C2 oashc.MoreLikeThisComponent.handleResponses MLT Query returned: {responseHeader={status=0,QTime=53},response={numFound=7,start=0,maxScore=0.6565079,docs=[SolrDocument{id=14, score=0.6565079}, SolrDocument{id=16, score=0.6565079}, SolrDocument{id=18, score=0.6565079}, SolrDocument{id=21, score=0.6565079}, SolrDocument{id=23, score=0.6565079}, SolrDocument{id=7, score=0.5570654}, SolrDocument{id=9, score=0.5252063}]},moreLikeThis={14={numFound=6,start=0,docs=[SolrDocument{id=16}, SolrDocument{id=18}, SolrDocument{id=21}, SolrDocument{id=23}, SolrDocument{id=7}, SolrDocument{id=9}]},16={numFound=6,start=0,docs=[SolrDocument{id=14}, SolrDocument{id=18}, SolrDocument{id=21}, SolrDocument{id=23}, SolrDocument{id=7}, SolrDocument{id=9}]},18={numFound=6,start=0,docs=[SolrDocument{id=14}, SolrDocument{id=16}, SolrDocument{id=21}, SolrDocument{id=23}, SolrDocument{id=7}, SolrDocument{id=9}]},21={numFound=6,start=0,docs=[SolrDocument{id=14}, SolrDocument{id=16}, SolrDocument{id=18}, SolrDocument{id=23}, SolrDocument{id=7}, SolrDocument{id=9}]},23={numFound=6,start=0,docs=[SolrDocument{id=14}, SolrDocument{id=16}, SolrDocument{id=18}, SolrDocument{id=21}, SolrDocument{id=7}, SolrDocument{id=9}]},7={numFound=0,start=0,docs=[]},9={numFound=6,start=0,docs=[SolrDocument{id=14}, SolrDocument{id=16}, SolrDocument{id=18}, SolrDocument{id=21}, SolrDocument{id=23}, SolrDocument{id=7}]}}}
[junit4:junit4]   2> 18751 T93 C1 REQ [collection1] webapp=/jzcx path=/select params={mlt.fl=lowerfilt&sort=score+desc&shards.qt=mltrh&mlt.dist.id=20&mlt=true&distrib=false&wt=javabin&rows=20&version=2&fl=score,id&shard.url=[ff01::213]:33332/jzcx|[ff01::083]:33332/jzcx|127.0.0.1:47666/jzcx&NOW=1355715665543&start=0&q=%2B(lowerfilt:the)+-id:20&isShard=true&qt=mltrh} hits=6 status=0 QTime=44 
[junit4:junit4]   2> 18752 T33 C1 REQ [collection1] webapp=/jzcx path=/select params={mlt.fl=lowerfilt&sort=score+desc&shards.qt=mltrh&mlt.dist.id=18&mlt=true&distrib=false&wt=javabin&rows=20&version=2&fl=score,id&shard.url=[ff01::213]:33332/jzcx|[ff01::083]:33332/jzcx|127.0.0.1:47666/jzcx&NOW=1355715665543&start=0&q=%2B(lowerfilt:the)+-id:18&isShard=true&qt=mltrh} hits=7 status=0 QTime=79 
[junit4:junit4]   2> 18752 T40 C2 oashc.MoreLikeThisComponent.handleResponses MLT Query returned: {responseHeader={status=0,QTime=40},response={numFound=6,start=0,maxScore=0.58267975,docs=[SolrDocument{id=13, score=0.58267975}, SolrDocument{id=15, score=0.58267975}, SolrDocument{id=19, score=0.58267975}, SolrDocument{id=20, score=0.58267975}, SolrDocument{id=24, score=0.58267975}, SolrDocument{id=17, score=0.4661438}]},moreLikeThis={13={numFound=6,start=0,docs=[SolrDocument{id=15}, SolrDocument{id=19}, SolrDocument{id=20}, SolrDocument{id=22}, SolrDocument{id=24}, SolrDocument{id=17}]},15={numFound=6,start=0,docs=[SolrDocument{id=13}, SolrDocument{id=19}, SolrDocument{id=20}, SolrDocument{id=22}, SolrDocument{id=24}, SolrDocument{id=17}]},19={numFound=6,start=0,docs=[SolrDocument{id=13}, SolrDocument{id=15}, SolrDocument{id=20}, SolrDocument{id=22}, SolrDocument{id=24}, SolrDocument{id=17}]},20={numFound=6,start=0,docs=[SolrDocument{id=13}, SolrDocument{id=15}, SolrDocument{id=19}, SolrDocument{id=22}, SolrDocument{id=24}, SolrDocument{id=17}]},24={numFound=6,start=0,docs=[SolrDocument{id=13}, SolrDocument{id=15}, SolrDocument{id=19}, SolrDocument{id=20}, SolrDocument{id=22}, SolrDocument{id=17}]},17={numFound=6,start=0,docs=[SolrDocument{id=13}, SolrDocument{id=15}, SolrDocument{id=19}, SolrDocument{id=20}, SolrDocument{id=22}, SolrDocument{id=24}]}}}
[junit4:junit4]   2> 18753 T82 C2 REQ [collection1] webapp=/jzcx path=/select params={mlt.fl=lowerfilt&sort=score+desc&shards.qt=mltrh&mlt.dist.id=19&mlt=true&distrib=false&wt=javabin&rows=20&version=2&fl=score,id&shard.url=127.0.0.1:38710/jzcx|[ff01::213]:33332/jzcx|[ff01::083]:33332/jzcx|[ff01::114]:33332/jzcx&NOW=1355715665543&start=0&q=%2B(lowerfilt:the)+-id:19&isShard=true&qt=mltrh} hits=7 status=0 QTime=49 
[junit4:junit4]   2> 18755 T40 C2 oashc.MoreLikeThisComponent.handleResponses MLT Query returned: {responseHeader={status=0,QTime=35},response={numFound=7,start=0,maxScore=0.6565079,docs=[SolrDocument{id=14, score=0.6565079}, SolrDocument{id=16, score=0.6565079}, SolrDocument{id=18, score=0.6565079}, SolrDocument{id=21, score=0.6565079}, SolrDocument{id=23, score=0.6565079}, SolrDocument{id=7, score=0.5570654}, SolrDocument{id=9, score=0.5252063}]},moreLikeThis={14={numFound=6,start=0,docs=[SolrDocument{id=16}, SolrDocument{id=18}, SolrDocument{id=21}, SolrDocument{id=23}, SolrDocument{id=7}, SolrDocument{id=9}]},16={numFound=6,start=0,docs=[SolrDocument{id=14}, SolrDocument{id=18}, SolrDocument{id=21}, SolrDocument{id=23}, SolrDocument{id=7}, SolrDocument{id=9}]},18={numFound=6,start=0,docs=[SolrDocument{id=14}, SolrDocument{id=16}, SolrDocument{id=21}, SolrDocument{id=23}, SolrDocument{id=7}, SolrDocument{id=9}]},21={numFound=6,start=0,docs=[SolrDocument{id=14}, SolrDocument{id=16}, SolrDocument{id=18}, SolrDocument{id=23}, SolrDocument{id=7}, SolrDocument{id=9}]},23={numFound=6,start=0,docs=[SolrDocument{id=14}, SolrDocument{id=16}, SolrDocument{id=18}, SolrDocument{id=21}, SolrDocument{id=7}, SolrDocument{id=9}]},7={numFound=0,start=0,docs=[]},9={numFound=6,start=0,docs=[SolrDocument{id=14}, SolrDocument{id=16}, SolrDocument{id=18}, SolrDocument{id=21}, SolrDocument{id=23}, SolrDocument{id=7}]}}}
[junit4:junit4]   2> 18757 T40 C2 oashc.MoreLikeThisComponent.handleResponses MLT Query returned: {responseHeader={status=0,QTime=39},response={numFound=6,start=0,maxScore=0.6565079,docs=[SolrDocument{id=16, score=0.6565079}, SolrDocument{id=18, score=0.6565079}, SolrDocument{id=21, score=0.6565079}, SolrDocument{id=23, score=0.6565079}, SolrDocument{id=7, score=0.5570654}, SolrDocument{id=9, score=0.5252063}]},moreLikeThis={16={numFound=6,start=0,docs=[SolrDocument{id=14}, SolrDocument{id=18}, SolrDocument{id=21}, SolrDocument{id=23}, SolrDocument{id=7}, SolrDocument{id=9}]},18={numFound=6,start=0,docs=[SolrDocument{id=14}, SolrDocument{id=16}, SolrDocument{id=21}, SolrDocument{id=23}, SolrDocument{id=7}, SolrDocument{id=9}]},21={numFound=6,start=0,docs=[SolrDocument{id=14}, SolrDocument{id=16}, SolrDocument{id=18}, SolrDocument{id=23}, SolrDocument{id=7}, SolrDocument{id=9}]},23={numFound=6,start=0,docs=[SolrDocument{id=14}, SolrDocument{id=16}, SolrDocument{id=18}, SolrDocument{id=21}, SolrDocument{id=7}, SolrDocument{id=9}]},7={numFound=0,start=0,docs=[]},9={numFound=6,start=0,docs=[SolrDocument{id=14}, SolrDocument{id=16}, SolrDocument{id=18}, SolrDocument{id=21}, SolrDocument{id=23}, SolrDocument{id=7}]}}}
[junit4:junit4]   2> 18759 T40 C2 oashc.MoreLikeThisComponent.handleResponses MLT Query returned: {responseHeader={status=0,QTime=34},response={numFound=7,start=0,maxScore=0.58267975,docs=[SolrDocument{id=13, score=0.58267975}, SolrDocument{id=15, score=0.58267975}, SolrDocument{id=19, score=0.58267975}, SolrDocument{id=20, score=0.58267975}, SolrDocument{id=22, score=0.58267975}, SolrDocument{id=24, score=0.58267975}, SolrDocument{id=17, score=0.4661438}]},moreLikeThis={13={numFound=6,start=0,docs=[SolrDocument{id=15}, SolrDocument{id=19}, SolrDocument{id=20}, SolrDocument{id=22}, SolrDocument{id=24}, SolrDocument{id=17}]},15={numFound=6,start=0,docs=[SolrDocument{id=13}, SolrDocument{id=19}, SolrDocument{id=20}, SolrDocument{id=22}, SolrDocument{id=24}, SolrDocument{id=17}]},19={numFound=6,start=0,docs=[SolrDocument{id=13}, SolrDocument{id=15}, SolrDocument{id=20}, SolrDocument{id=22}, SolrDocument{id=24}, SolrDocument{id=17}]},20={numFound=6,start=0,docs=[SolrDocument{id=13}, SolrDocument{id=15}, SolrDocument{id=19}, SolrDocument{id=22}, SolrDocument{id=24}, SolrDocument{id=17}]},22={numFound=6,start=0,docs=[SolrDocument{id=13}, SolrDocument{id=15}, SolrDocument{id=19}, SolrDocument{id=20}, SolrDocument{id=24}, SolrDocument{id=17}]},24={numFound=6,start=0,docs=[SolrDocument{id=13}, SolrDocument{id=15}, SolrDocument{id=19}, SolrDocument{id=20}, SolrDocument{id=22}, SolrDocument{id=17}]},17={numFound=6,start=0,docs=[SolrDocument{id=13}, SolrDocument{id=15}, SolrDocument{id=19}, SolrDocument{id=20}, SolrDocument{id=22}, SolrDocument{id=24}]}}}
[junit4:junit4]   2> 18761 T40 C2 oashc.MoreLikeThisComponent.handleResponses MLT Query returned: {responseHeader={status=0,QTime=57},response={numFound=6,start=0,maxScore=0.58267975,docs=[SolrDocument{id=13, score=0.58267975}, SolrDocument{id=15, score=0.58267975}, SolrDocument{id=19, score=0.58267975}, SolrDocument{id=20, score=0.58267975}, SolrDocument{id=22, score=0.58267975}, SolrDocument{id=17, score=0.4661438}]},moreLikeThis={13={numFound=6,start=0,docs=[SolrDocument{id=15}, SolrDocument{id=19}, SolrDocument{id=20}, SolrDocument{id=22}, SolrDocument{id=24}, SolrDocument{id=17}]},15={numFound=6,start=0,docs=[SolrDocument{id=13}, SolrDocument{id=19}, SolrDocument{id=20}, SolrDocument{id=22}, SolrDocument{id=24}, SolrDocument{id=17}]},19={numFound=6,start=0,docs=[SolrDocument{id=13}, SolrDocument{id=15}, SolrDocument{id=20}, SolrDocument{id=22}, SolrDocument{id=24}, SolrDocument{id=17}]},20={numFound=6,start=0,docs=[SolrDocument{id=13}, SolrDocument{id=15}, SolrDocument{id=19}, SolrDocument{id=22}, SolrDocument{id=24}, SolrDocument{id=17}]},22={numFound=6,start=0,docs=[SolrDocument{id=13}, SolrDocument{id=15}, SolrDocument{id=19}, SolrDocument{id=20}, SolrDocument{id=24}, SolrDocument{id=17}]},17={numFound=6,start=0,docs=[SolrDocument{id=13}, SolrDocument{id=15}, SolrDocument{id=19}, SolrDocument{id=20}, SolrDocument{id=22}, SolrDocument{id=24}]}}}
[junit4:junit4]   2> 18764 T40 C2 oashc.MoreLikeThisComponent.handleResponses MLT Query returned: {responseHeader={status=0,QTime=43},response={numFound=7,start=0,maxScore=0.6565079,docs=[SolrDocument{id=14, score=0.6565079}, SolrDocument{id=16, score=0.6565079}, SolrDocument{id=18, score=0.6565079}, SolrDocument{id=21, score=0.6565079}, SolrDocument{id=23, score=0.6565079}, SolrDocument{id=7, score=0.5570654}, SolrDocument{id=9, score=0.5252063}]},moreLikeThis={14={numFound=6,start=0,docs=[SolrDocument{id=16}, SolrDocument{id=18}, SolrDocument{id=21}, SolrDocument{id=23}, SolrDocument{id=7}, SolrDocument{id=9}]},16={numFound=6,start=0,docs=[SolrDocument{id=14}, SolrDocument{id=18}, SolrDocument{id=21}, SolrDocument{id=23}, SolrDocument{id=7}, SolrDocument{id=9}]},18={numFound=6,start=0,docs=[SolrDocument{id=14}, SolrDocument{id=16}, SolrDocument{id=21}, SolrDocument{id=23}, SolrDocument{id=7}, SolrDocument{id=9}]},21={numFound=6,start=0,docs=[SolrDocument{id=14}, SolrDocument{id=16}, SolrDocument{id=18}, SolrDocument{id=23}, SolrDocument{id=7}, SolrDocument{id=9}]},23={numFound=6,start=0,docs=[SolrDocument{id=14}, SolrDocument{id=16}, SolrDocument{id=18}, SolrDocument{id=21}, SolrDocument{id=7}, SolrDocument{id=9}]},7={numFound=0,start=0,docs=[]},9={numFound=6,start=0,docs=[SolrDocument{id=14}, SolrDocument{id=16}, SolrDocument{id=18}, SolrDocument{id=21}, SolrDocument{id=23}, SolrDocument{id=7}]}}}
[junit4:junit4]   2> 18766 T40 C2 oashc.MoreLikeThisComponent.handleResponses MLT Query returned: {responseHeader={status=0,QTime=45},response={numFound=7,start=0,maxScore=0.6565079,docs=[SolrDocument{id=14, score=0.6565079}, SolrDocument{id=16, score=0.6565079}, SolrDocument{id=18, score=0.6565079}, SolrDocument{id=21, score=0.6565079}, SolrDocument{id=23, score=0.6565079}, SolrDocument{id=7, score=0.5570654}, SolrDocument{id=9, score=0.5252063}]},moreLikeThis={14={numFound=6,start=0,docs=[SolrDocument{id=16}, SolrDocument{id=18}, SolrDocument{id=21}, SolrDocument{id=23}, SolrDocument{id=7}, SolrDocument{id=9}]},16={numFound=6,start=0,docs=[SolrDocument{id=14}, SolrDocument{id=18}, SolrDocument{id=21}, SolrDocument{id=23}, SolrDocument{id=7}, SolrDocument{id=9}]},18={numFound=6,start=0,docs=[SolrDocument{id=14}, SolrDocument{id=16}, SolrDocument{id=21}, SolrDocument{id=23}, SolrDocument{id=7}, SolrDocument{id=9}]},21={numFound=6,start=0,docs=[SolrDocument{id=14}, SolrDocument{id=16}, SolrDocument{id=18}, SolrDocument{id=23}, SolrDocument{id=7}, SolrDocument{id=9}]},23={numFound=6,start=0,docs=[SolrDocument{id=14}, SolrDocument{id=16}, SolrDocument{id=18}, SolrDocument{id=21}, SolrDocument{id=7}, SolrDocument{id=9}]},7={numFound=0,start=0,docs=[]},9={numFound=6,start=0,docs=[SolrDocument{id=14}, SolrDocument{id=16}, SolrDocument{id=18}, SolrDocument{id=21}, SolrDocument{id=23}, SolrDocument{id=7}]}}}
[junit4:junit4]   2> 18768 T40 C2 oashc.MoreLikeThisComponent.handleResponses MLT Query returned: {responseHeader={status=0,QTime=36},response={numFound=6,start=0,maxScore=0.58267975,docs=[SolrDocument{id=13, score=0.58267975}, SolrDocument{id=15, score=0.58267975}, SolrDocument{id=19, score=0.58267975}, SolrDocument{id=20, score=0.58267975}, SolrDocument{id=22, score=0.58267975}, SolrDocument{id=24, score=0.58267975}]},moreLikeThis={13={numFound=6,start=0,docs=[SolrDocument{id=15}, SolrDocument{id=19}, SolrDocument{id=20}, SolrDocument{id=22}, SolrDocument{id=24}, SolrDocument{id=17}]},15={numFound=6,start=0,docs=[SolrDocument{id=13}, SolrDocument{id=19}, SolrDocument{id=20}, SolrDocument{id=22}, SolrDocument{id=24}, SolrDocument{id=17}]},19={numFound=6,start=0,docs=[SolrDocument{id=13}, SolrDocument{id=15}, SolrDocument{id=20}, SolrDocument{id=22}, SolrDocument{id=24}, SolrDocument{id=17}]},20={numFound=6,start=0,docs=[SolrDocument{id=13}, SolrDocument{id=15}, SolrDocument{id=19}, SolrDocument{id=22}, SolrDocument{id=24}, SolrDocument{id=17}]},22={numFound=6,start=0,docs=[SolrDocument{id=13}, SolrDocument{id=15}, SolrDocument{id=19}, SolrDocument{id=20}, SolrDocument{id=24}, SolrDocument{id=17}]},24={numFound=6,start=0,docs=[SolrDocument{id=13}, SolrDocument{id=15}, SolrDocument{id=19}, SolrDocument{id=20}, SolrDocument{id=22}, SolrDocument{id=17}]}}}
[junit4:junit4]   2> 18770 T40 C2 oashc.MoreLikeThisComponent.handleResponses MLT Query returned: {responseHeader={status=0,QTime=32},response={numFound=7,start=0,maxScore=0.58267975,docs=[SolrDocument{id=13, score=0.58267975}, SolrDocument{id=15, score=0.58267975}, SolrDocument{id=19, score=0.58267975}, SolrDocument{id=20, score=0.58267975}, SolrDocument{id=22, score=0.58267975}, SolrDocument{id=24, score=0.58267975}, SolrDocument{id=17, score=0.4661438}]},moreLikeThis={13={numFound=6,start=0,docs=[SolrDocument{id=15}, SolrDocument{id=19}, SolrDocument{id=20}, SolrDocument{id=22}, SolrDocument{id=24}, SolrDocument{id=17}]},15={numFound=6,start=0,docs=[SolrDocument{id=13}, SolrDocument{id=19}, SolrDocument{id=20}, SolrDocument{id=22}, SolrDocument{id=24}, SolrDocument{id=17}]},19={numFound=6,start=0,docs=[SolrDocument{id=13}, SolrDocument{id=15}, SolrDocument{id=20}, SolrDocument{id=22}, SolrDocument{id=24}, SolrDocument{id=17}]},20={numFound=6,start=0,docs=[SolrDocument{id=13}, SolrDocument{id=15}, SolrDocument{id=19}, SolrDocument{id=22}, SolrDocument{id=24}, SolrDocument{id=17}]},22={numFound=6,start=0,docs=[SolrDocument{id=13}, SolrDocument{id=15}, SolrDocument{id=19}, SolrDocument{id=20}, SolrDocument{id=24}, SolrDocument{id=17}]},24={numFound=6,start=0,docs=[SolrDocument{id=13}, SolrDocument{id=15}, SolrDocument{id=19}, SolrDocument{id=20}, SolrDocument{id=22}, SolrDocument{id=17}]},17={numFound=6,start=0,docs=[SolrDocument{id=13}, SolrDocument{id=15}, SolrDocument{id=19}, SolrDocument{id=20}, SolrDocument{id=22}, SolrDocument{id=24}]}}}
[junit4:junit4]   2> 18772 T40 C2 oashc.MoreLikeThisComponent.handleResponses MLT Query returned: {responseHeader={status=0,QTime=81},response={numFound=6,start=0,maxScore=0.6565079,docs=[SolrDocument{id=14, score=0.6565079}, SolrDocument{id=16, score=0.6565079}, SolrDocument{id=18, score=0.6565079}, SolrDocument{id=23, score=0.6565079}, SolrDocument{id=7, score=0.5570654}, SolrDocument{id=9, score=0.5252063}]},moreLikeThis={14={numFound=6,start=0,docs=[SolrDocument{id=16}, SolrDocument{id=18}, SolrDocument{id=21}, SolrDocument{id=23}, SolrDocument{id=7}, SolrDocument{id=9}]},16={numFound=6,start=0,docs=[SolrDocument{id=14}, SolrDocument{id=18}, SolrDocument{id=21}, SolrDocument{id=23}, SolrDocument{id=7}, SolrDocument{id=9}]},18={numFound=6,start=0,docs=[SolrDocument{id=14}, SolrDocument{id=16}, SolrDocument{id=21}, SolrDocument{id=23}, SolrDocument{id=7}, SolrDocument{id=9}]},23={numFound=6,start=0,docs=[SolrDocument{id=14}, SolrDocument{id=16}, SolrDocument{id=18}, SolrDocument{id=21}, SolrDocument{id=7}, SolrDocument{id=9}]},7={numFound=0,start=0,docs=[]},9={numFound=6,start=0,docs=[SolrDocument{id=14}, SolrDocument{id=16}, SolrDocument{id=18}, SolrDocument{id=21}, SolrDocument{id=23}, SolrDocument{id=7}]}}}
[junit4:junit4]   2> 18774 T40 C2 oashc.MoreLikeThisComponent.handleResponses MLT Query returned: {responseHeader={status=0,QTime=58},response={numFound=6,start=0,maxScore=0.6565079,docs=[SolrDocument{id=14, score=0.6565079}, SolrDocument{id=18, score=0.6565079}, SolrDocument{id=21, score=0.6565079}, SolrDocument{id=23, score=0.6565079}, SolrDocument{id=7, score=0.5570654}, SolrDocument{id=9, score=0.5252063}]},moreLikeThis={14={numFound=6,start=0,docs=[SolrDocument{id=16}, SolrDocument{id=18}, SolrDocument{id=21}, SolrDocument{id=23}, SolrDocument{id=7}, SolrDocument{id=9}]},18={numFound=6,start=0,docs=[SolrDocument{id=14}, SolrDocument{id=16}, SolrDocument{id=21}, SolrDocument{id=23}, SolrDocument{id=7}, SolrDocument{id=9}]},21={numFound=6,start=0,docs=[SolrDocument{id=14}, SolrDocument{id=16}, SolrDocument{id=18}, SolrDocument{id=23}, SolrDocument{id=7}, SolrDocument{id=9}]},23={numFound=6,start=0,docs=[SolrDocument{id=14}, SolrDocument{id=16}, SolrDocument{id=18}, SolrDocument{id=21}, SolrDocument{id=7}, SolrDocument{id=9}]},7={numFound=0,start=0,docs=[]},9={numFound=6,start=0,docs=[SolrDocument{id=14}, SolrDocument{id=16}, SolrDocument{id=18}, SolrDocument{id=21}, SolrDocument{id=23}, SolrDocument{id=7}]}}}
[junit4:junit4]   2> 18776 T40 C2 oashc.MoreLikeThisComponent.handleResponses MLT Query returned: {responseHeader={status=0,QTime=73},response={numFound=7,start=0,maxScore=0.58267975,docs=[SolrDocument{id=13, score=0.58267975}, SolrDocument{id=15, score=0.58267975}, SolrDocument{id=19, score=0.58267975}, SolrDocument{id=20, score=0.58267975}, SolrDocument{id=22, score=0.58267975}, SolrDocument{id=24, score=0.58267975}, SolrDocument{id=17, score=0.4661438}]},moreLikeThis={13={numFound=6,start=0,docs=[SolrDocument{id=15}, SolrDocument{id=19}, SolrDocument{id=20}, SolrDocument{id=22}, SolrDocument{id=24}, SolrDocument{id=17}]},15={numFound=6,start=0,docs=[SolrDocument{id=13}, SolrDocument{id=19}, SolrDocument{id=20}, SolrDocument{id=22}, SolrDocument{id=24}, SolrDocument{id=17}]},19={numFound=6,start=0,docs=[SolrDocument{id=13}, SolrDocument{id=15}, SolrDocument{id=20}, SolrDocument{id=22}, SolrDocument{id=24}, SolrDocument{id=17}]},20={numFound=6,start=0,docs=[SolrDocument{id=13}, SolrDocument{id=15}, SolrDocument{id=19}, SolrDocument{id=22}, SolrDocument{id=24}, SolrDocument{id=17}]},22={numFound=6,start=0,docs=[SolrDocument{id=13}, SolrDocument{id=15}, SolrDocument{id=19}, SolrDocument{id=20}, SolrDocument{id=24}, SolrDocument{id=17}]},24={numFound=6,start=0,docs=[SolrDocument{id=13}, SolrDocument{id=15}, SolrDocument{id=19}, SolrDocument{id=20}, SolrDocument{id=22}, SolrDocument{id=17}]},17={numFound=6,start=0,docs=[SolrDocument{id=13}, SolrDocument{id=15}, SolrDocument{id=19}, SolrDocument{id=20}, SolrDocument{id=22}, SolrDocument{id=24}]}}}
[junit4:junit4]   2> 18778 T40 C2 oashc.MoreLikeThisComponent.handleResponses MLT Query returned: {responseHeader={status=0,QTime=52},response={numFound=7,start=0,maxScore=0.6565079,docs=[SolrDocument{id=14, score=0.6565079}, SolrDocument{id=16, score=0.6565079}, SolrDocument{id=18, score=0.6565079}, SolrDocument{id=21, score=0.6565079}, SolrDocument{id=23, score=0.6565079}, SolrDocument{id=7, score=0.5570654}, SolrDocument{id=9, score=0.5252063}]},moreLikeThis={14={numFound=6,start=0,docs=[SolrDocument{id=16}, SolrDocument{id=18}, SolrDocument{id=21}, SolrDocument{id=23}, SolrDocument{id=7}, SolrDocument{id=9}]},16={numFound=6,start=0,docs=[SolrDocument{id=14}, SolrDocument{id=18}, SolrDocument{id=21}, SolrDocument{id=23}, SolrDocument{id=7}, SolrDocument{id=9}]},18={numFound=6,start=0,docs=[SolrDocument{id=14}, SolrDocument{id=16}, SolrDocument{id=21}, SolrDocument{id=23}, SolrDocument{id=7}, SolrDocument{id=9}]},21={numFound=6,start=0,docs=[SolrDocument{id=14}, SolrDocument{id=16}, SolrDocument{id=18}, SolrDocument{id=23}, SolrDocument{id=7}, SolrDocument{id=9}]},23={numFound=6,start=0,docs=[SolrDocument{id=14}, SolrDocument{id=16}, SolrDocument{id=18}, SolrDocument{id=21}, SolrDocument{id=7}, SolrDocument{id=9}]},7={numFound=0,start=0,docs=[]},9={numFound=6,start=0,docs=[SolrDocument{id=14}, SolrDocument{id=16}, SolrDocument{id=18}, SolrDocument{id=21}, SolrDocument{id=23}, SolrDocument{id=7}]}}}
[junit4:junit4]   2> 18780 T40 C2 oashc.MoreLikeThisComponent.handleResponses MLT Query returned: {responseHeader={status=0,QTime=44},response={numFound=6,start=0,maxScore=0.58267975,docs=[SolrDocument{id=13, score=0.58267975}, SolrDocument{id=15, score=0.58267975}, SolrDocument{id=19, score=0.58267975}, SolrDocument{id=22, score=0.58267975}, SolrDocument{id=24, score=0.58267975}, SolrDocument{id=17, score=0.4661438}]},moreLikeThis={13={numFound=6,start=0,docs=[SolrDocument{id=15}, SolrDocument{id=19}, SolrDocument{id=20}, SolrDocument{id=22}, SolrDocument{id=24}, SolrDocument{id=17}]},15={numFound=6,start=0,docs=[SolrDocument{id=13}, SolrDocument{id=19}, SolrDocument{id=20}, SolrDocument{id=22}, SolrDocument{id=24}, SolrDocument{id=17}]},19={numFound=6,start=0,docs=[SolrDocument{id=13}, SolrDocument{id=15}, SolrDocument{id=20}, SolrDocument{id=22}, SolrDocument{id=24}, SolrDocument{id=17}]},22={numFound=6,start=0,docs=[SolrDocument{id=13}, SolrDocument{id=15}, SolrDocument{id=19}, SolrDocument{id=20}, SolrDocument{id=24}, SolrDocument{id=17}]},24={numFound=6,start=0,docs=[SolrDocument{id=13}, SolrDocument{id=15}, SolrDocument{id=19}, SolrDocument{id=20}, SolrDocument{id=22}, SolrDocument{id=17}]},17={numFound=6,start=0,docs=[SolrDocument{id=13}, SolrDocument{id=15}, SolrDocument{id=19}, SolrDocument{id=20}, SolrDocument{id=22}, SolrDocument{id=24}]}}}
[junit4:junit4]   2> 18782 T40 C2 oashc.MoreLikeThisComponent.handleResponses MLT Query returned: {responseHeader={status=0,QTime=53},response={numFound=6,start=0,maxScore=0.6565079,docs=[SolrDocument{id=14, score=0.6565079}, SolrDocument{id=16, score=0.6565079}, SolrDocument{id=21, score=0.6565079}, SolrDocument{id=23, score=0.6565079}, SolrDocument{id=7, score=0.5570654}, SolrDocument{id=9, score=0.5252063}]},moreLikeThis={14={numFound=6,start=0,docs=[SolrDocument{id=16}, SolrDocument{id=18}, SolrDocument{id=21}, SolrDocument{id=23}, SolrDocument{id=7}, SolrDocument{id=9}]},16={numFound=6,start=0,docs=[SolrDocument{id=14}, SolrDocument{id=18}, SolrDocument{id=21}, SolrDocument{id=23}, SolrDocument{id=7}, SolrDocument{id=9}]},21={numFound=6,start=0,docs=[SolrDocument{id=14}, SolrDocument{id=16}, SolrDocument{id=18}, SolrDocument{id=23}, SolrDocument{id=7}, SolrDocument{id=9}]},23={numFound=6,start=0,docs=[SolrDocument{id=14}, SolrDocument{id=16}, SolrDocument{id=18}, SolrDocument{id=21}, SolrDocument{id=7}, SolrDocument{id=9}]},7={numFound=0,start=0,docs=[]},9={numFound=6,start=0,docs=[SolrDocument{id=14}, SolrDocument{id=16}, SolrDocument{id=18}, SolrDocument{id=21}, SolrDocument{id=23}, SolrDocument{id=7}]}}}
[junit4:junit4]   2> 18784 T40 C2 oashc.MoreLikeThisComponent.handleResponses MLT Query returned: {responseHeader={status=0,QTime=79},response={numFound=7,start=0,maxScore=0.58267975,docs=[SolrDocument{id=13, score=0.58267975}, SolrDocument{id=15, score=0.58267975}, SolrDocument{id=19, score=0.58267975}, SolrDocument{id=20, score=0.58267975}, SolrDocument{id=22, score=0.58267975}, SolrDocument{id=24, score=0.58267975}, SolrDocument{id=17, score=0.4661438}]},moreLikeThis={13={numFound=6,start=0,docs=[SolrDocument{id=15}, SolrDocument{id=19}, SolrDocument{id=20}, SolrDocument{id=22}, SolrDocument{id=24}, SolrDocument{id=17}]},15={numFound=6,start=0,docs=[SolrDocument{id=13}, SolrDocument{id=19}, SolrDocument{id=20}, SolrDocument{id=22}, SolrDocument{id=24}, SolrDocument{id=17}]},19={numFound=6,start=0,docs=[SolrDocument{id=13}, SolrDocument{id=15}, SolrDocument{id=20}, SolrDocument{id=22}, SolrDocument{id=24}, SolrDocument{id=17}]},20={numFound=6,start=0,docs=[SolrDocument{id=13}, SolrDocument{id=15}, SolrDocument{id=19}, SolrDocument{id=22}, SolrDocument{id=24}, SolrDocument{id=17}]},22={numFound=6,start=0,docs=[SolrDocument{id=13}, SolrDocument{id=15}, SolrDocument{id=19}, SolrDocument{id=20}, SolrDocument{id=24}, SolrDocument{id=17}]},24={numFound=6,start=0,docs=[SolrDocument{id=13}, SolrDocument{id=15}, SolrDocument{id=19}, SolrDocument{id=20}, SolrDocument{id=22}, SolrDocument{id=17}]},17={numFound=6,start=0,docs=[SolrDocument{id=13}, SolrDocument{id=15}, SolrDocument{id=19}, SolrDocument{id=20}, SolrDocument{id=22}, SolrDocument{id=24}]}}}
[junit4:junit4]   2> 18786 T40 C2 oashc.MoreLikeThisComponent.handleResponses MLT Query returned: {responseHeader={status=0,QTime=35},response={numFound=6,start=0,maxScore=0.58267975,docs=[SolrDocument{id=13, score=0.58267975}, SolrDocument{id=15, score=0.58267975}, SolrDocument{id=20, score=0.58267975}, SolrDocument{id=22, score=0.58267975}, SolrDocument{id=24, score=0.58267975}, SolrDocument{id=17, score=0.4661438}]},moreLikeThis={13={numFound=6,start=0,docs=[SolrDocument{id=15}, SolrDocument{id=19}, SolrDocument{id=20}, SolrDocument{id=22}, SolrDocument{id=24}, SolrDocument{id=17}]},15={numFound=6,start=0,docs=[SolrDocument{id=13}, SolrDocument{id=19}, SolrDocument{id=20}, SolrDocument{id=22}, SolrDocument{id=24}, SolrDocument{id=17}]},20={numFound=6,start=0,docs=[SolrDocument{id=13}, SolrDocument{id=15}, SolrDocument{id=19}, SolrDocument{id=22}, SolrDocument{id=24}, SolrDocument{id=17}]},22={numFound=6,start=0,docs=[SolrDocument{id=13}, SolrDocument{id=15}, SolrDocument{id=19}, SolrDocument{id=20}, SolrDocument{id=24}, SolrDocument{id=17}]},24={numFound=6,start=0,docs=[SolrDocument{id=13}, SolrDocument{id=15}, SolrDocument{id=19}, SolrDocument{id=20}, SolrDocument{id=22}, SolrDocument{id=17}]},17={numFound=6,start=0,docs=[SolrDocument{id=13}, SolrDocument{id=15}, SolrDocument{id=19}, SolrDocument{id=20}, SolrDocument{id=22}, SolrDocument{id=24}]}}}
[junit4:junit4]   2> 18788 T40 C2 oashc.MoreLikeThisComponent.handleResponses MLT Query returned: {responseHeader={status=0,QTime=49},response={numFound=7,start=0,maxScore=0.6565079,docs=[SolrDocument{id=14, score=0.6565079}, SolrDocument{id=16, score=0.6565079}, SolrDocument{id=18, score=0.6565079}, SolrDocument{id=21, score=0.6565079}, SolrDocument{id=23, score=0.6565079}, SolrDocument{id=7, score=0.5570654}, SolrDocument{id=9, score=0.5252063}]},moreLikeThis={14={numFound=6,start=0,docs=[SolrDocument{id=16}, SolrDocument{id=18}, SolrDocument{id=21}, SolrDocument{id=23}, SolrDocument{id=7}, SolrDocument{id=9}]},16={numFound=6,start=0,docs=[SolrDocument{id=14}, SolrDocument{id=18}, SolrDocument{id=21}, SolrDocument{id=23}, SolrDocument{id=7}, SolrDocument{id=9}]},18={numFound=6,start=0,docs=[SolrDocument{id=14}, SolrDocument{id=16}, SolrDocument{id=21}, SolrDocument{id=23}, SolrDocument{id=7}, SolrDocument{id=9}]},21={numFound=6,start=0,docs=[SolrDocument{id=14}, SolrDocument{id=16}, SolrDocument{id=18}, SolrDocument{id=23}, SolrDocument{id=7}, SolrDocument{id=9}]},23={numFound=6,start=0,docs=[SolrDocument{id=14}, SolrDocument{id=16}, SolrDocument{id=18}, SolrDocument{id=21}, SolrDocument{id=7}, SolrDocument{id=9}]},7={numFound=0,start=0,docs=[]},9={numFound=6,start=0,docs=[SolrDocument{id=14}, SolrDocument{id=16}, SolrDocument{id=18}, SolrDocument{id=21}, SolrDocument{id=23}, SolrDocument{id=7}]}}}
[junit4:junit4]   2> 48612 T11 oasc.CoreContainer.shutdown Shutting down CoreContainer instance=352120656
[junit4:junit4]   2> 48613 T11 oasc.SolrCore.close [collection1]  CLOSING SolrCore org.apache.solr.core.SolrCore@428691e3
[junit4:junit4]   2> 48652 T11 oasu.DirectUpdateHandler2.close closing DirectUpdateHandler2{commits=1,autocommits=0,soft autocommits=0,optimizes=0,rollbacks=0,expungeDeletes=0,docsPending=0,adds=0,deletesById=0,deletesByQuery=0,errors=0,cumulative_adds=24,cumulative_deletesById=0,cumulative_deletesByQuery=1,cumulative_errors=0}
[junit4:junit4]   2> 48654 T11 oasc.SolrCore.decrefSolrCoreState Closing SolrCoreState
[junit4:junit4]   2> 48655 T11 oasu.DefaultSolrCoreState.closeIndexWriter SolrCoreState ref count has reached 0 - closing IndexWriter
[junit4:junit4]   2> 48656 T11 oasu.DefaultSolrCoreState.closeIndexWriter closing IndexWriter with IndexWriterCloser
[junit4:junit4]   2> 48659 T11 C0 oasc.CachingDirectoryFactory.close Releasing directory:/usr/home/hudson/hudson-slave/workspace/Lucene-Solr-Tests-4.x-java7/solr/build/solr-core/test/J0/./org.apache.solr.handler.component.DistributedMLTComponentTest-1355715647251/control/data/index
[junit4:junit4]   2> 48660 T11 oasc.SolrCore.closeSearcher [collection1] Closing main searcher on request.
[junit4:junit4]   2> 48664 T11 oasc.CachingDirectoryFactory.close Releasing directory:/usr/home/hudson/hudson-slave/workspace/Lucene-Solr-Tests-4.x-java7/solr/build/solr-core/test/J0/./org.apache.solr.handler.component.DistributedMLTComponentTest-1355715647251/control/data/index
[junit4:junit4]   2> 48665 T11 oasc.CachingDirectoryFactory.close Closing directory when closing factory:/usr/home/hudson/hudson-slave/workspace/Lucene-Solr-Tests-4.x-java7/solr/build/solr-core/test/J0/./org.apache.solr.handler.component.DistributedMLTComponentTest-1355715647251/control/data/index
[junit4:junit4]   2> 48666 T11 oasc.CachingDirectoryFactory.close Closing directory when closing factory:/usr/home/hudson/hudson-slave/workspace/Lucene-Solr-Tests-4.x-java7/solr/build/solr-core/test/J0/./org.apache.solr.handler.component.DistributedMLTComponentTest-1355715647251/control/data
[junit4:junit4]   2> 48668 T11 oejsh.ContextHandler.doStop stopped o.e.j.s.ServletContextHandler{/jzcx,null}
[junit4:junit4]   2> 48694 T40 C2 oasc.SolrException.log SEVERE org.apache.solr.common.SolrException: org.apache.solr.client.solrj.SolrServerException: No live SolrServers available to handle this request:[http://[ff01::114]:33332/jzcx, http://[ff01::083]:33332/jzcx, http://127.0.0.1:47666/jzcx, http://[ff01::213]:33332/jzcx]
[junit4:junit4]   2> 		at org.apache.solr.handler.component.SearchHandler.handleRequestBody(SearchHandler.java:302)
[junit4:junit4]   2> 		at org.apache.solr.handler.RequestHandlerBase.handleRequest(RequestHandlerBase.java:146)
[junit4:junit4]   2> 		at org.apache.solr.core.SolrCore.execute(SolrCore.java:1819)
[junit4:junit4]   2> 		at org.apache.solr.servlet.SolrDispatchFilter.execute(SolrDispatchFilter.java:458)
[junit4:junit4]   2> 		at org.apache.solr.servlet.SolrDispatchFilter.doFilter(SolrDispatchFilter.java:279)
[junit4:junit4]   2> 		at org.eclipse.jetty.servlet.ServletHandler$CachedChain.doFilter(ServletHandler.java:1307)
[junit4:junit4]   2> 		at org.apache.solr.client.solrj.embedded.JettySolrRunner$DebugFilter.doFilter(JettySolrRunner.java:116)
[junit4:junit4]   2> 		at org.eclipse.jetty.servlet.ServletHandler$CachedChain.doFilter(ServletHandler.java:1307)
[junit4:junit4]   2> 		at org.eclipse.jetty.servlet.ServletHandler.doHandle(ServletHandler.java:453)
[junit4:junit4]   2> 		at org.eclipse.jetty.server.session.SessionHandler.doHandle(SessionHandler.java:229)
[junit4:junit4]   2> 		at org.eclipse.jetty.server.handler.ScopedHandler.handle(ScopedHandler.java:137)
[junit4:junit4]   2> 		at org.eclipse.jetty.server.handler.GzipHandler.handle(GzipHandler.java:275)
[junit4:junit4]   2> 		at org.eclipse.jetty.server.handler.ContextHandler.doHandle(ContextHandler.java:1074)
[junit4:junit4]   2> 		at org.eclipse.jetty.servlet.ServletHandler.doScope(ServletHandler.java:382)
[junit4:junit4]   2> 		at org.eclipse.jetty.server.session.SessionHandler.doScope(SessionHandler.java:193)
[junit4:junit4]   2> 		at org.eclipse.jetty.server.handler.ContextHandler.doScope(ContextHandler.java:1006)
[junit4:junit4]   2> 		at org.eclipse.jetty.server.handler.ScopedHandler.handle(ScopedHandler.java:135)
[junit4:junit4]   2> 		at org.eclipse.jetty.server.handler.HandlerWrapper.handle(HandlerWrapper.java:116)
[junit4:junit4]   2> 		at org.eclipse.jetty.server.Server.handle(Server.java:365)
[junit4:junit4]   2> 		at org.eclipse.jetty.server.AbstractHttpConnection.handleRequest(AbstractHttpConnection.java:485)
[junit4:junit4]   2> 		at org.eclipse.jetty.server.BlockingHttpConnection.handleRequest(BlockingHttpConnection.java:53)
[junit4:junit4]   2> 		at org.eclipse.jetty.server.AbstractHttpConnection.headerComplete(AbstractHttpConnection.java:926)
[junit4:junit4]   2> 		at org.eclipse.jetty.server.AbstractHttpConnection$RequestHandler.headerComplete(AbstractHttpConnection.java:988)
[junit4:junit4]   2> 		at org.eclipse.jetty.http.HttpParser.parseNext(HttpParser.java:635)
[junit4:junit4]   2> 		at org.eclipse.jetty.http.HttpParser.parseAvailable(HttpParser.java:235)
[junit4:junit4]   2> 		at org.eclipse.jetty.server.BlockingHttpConnection.handle(BlockingHttpConnection.java:72)
[junit4:junit4]   2> 		at org.eclipse.jetty.server.bio.SocketConnector$ConnectorEndPoint.run(SocketConnector.java:264)
[junit4:junit4]   2> 		at org.eclipse.jetty.util.thread.QueuedThreadPool.runJob(QueuedThreadPool.java:608)
[junit4:junit4]   2> 		at org.eclipse.jetty.util.thread.QueuedThreadPool$3.run(QueuedThreadPool.java:543)
[junit4:junit4]   2> 		at java.lang.Thread.run(Thread.java:722)
[junit4:junit4]   2> 	Caused by: org.apache.solr.client.solrj.SolrServerException: No live SolrServers available to handle this request:[http://[ff01::114]:33332/jzcx, http://[ff01::083]:33332/jzcx, http://127.0.0.1:47666/jzcx, http://[ff01::213]:33332/jzcx]
[junit4:junit4]   2> 		at org.apache.solr.client.solrj.impl.LBHttpSolrServer.request(LBHttpSolrServer.java:325)
[junit4:junit4]   2> 		at org.apache.solr.handler.component.HttpShardHandler$1.call(HttpShardHandler.java:171)
[junit4:junit4]   2> 		at org.apache.solr.handler.component.HttpShardHandler$1.call(HttpShardHandler.java:135)
[junit4:junit4]   2> 		at java.util.concurrent.FutureTask$Sync.innerRun(FutureTask.java:334)
[junit4:junit4]   2> 		at java.util.concurrent.FutureTask.run(FutureTask.java:166)
[junit4:junit4]   2> 		at java.util.concurrent.Executors$RunnableAdapter.call(Executors.java:471)
[junit4:junit4]   2> 		at java.util.concurrent.FutureTask$Sync.innerRun(FutureTask.java:334)
[junit4:junit4]   2> 		at java.util.concurrent.FutureTask.run(FutureTask.java:166)
[junit4:junit4]   2> 		at java.util.concurrent.ThreadPoolExecutor.runWorker(ThreadPoolExecutor.java:1110)
[junit4:junit4]   2> 		at java.util.concurrent.ThreadPoolExecutor$Worker.run(ThreadPoolExecutor.java:603)
[junit4:junit4]   2> 		... 1 more
[junit4:junit4]   2> 	Caused by: org.apache.solr.client.solrj.SolrServerException: IOException occured when talking to server at: http://[ff01::083]:33332/jzcx
[junit4:junit4]   2> 		at org.apache.solr.client.solrj.impl.HttpSolrServer.request(HttpSolrServer.java:413)
[junit4:junit4]   2> 		at org.apache.solr.client.solrj.impl.HttpSolrServer.request(HttpSolrServer.java:181)
[junit4:junit4]   2> 		at org.apache.solr.client.solrj.impl.LBHttpSolrServer.request(LBHttpSolrServer.java:290)
[junit4:junit4]   2> 		... 10 more
[junit4:junit4]   2> 	Caused by: java.net.SocketException: Protocol family unavailable
[junit4:junit4]   2> 		at java.net.PlainSocketImpl.socketConnect(Native Method)
[junit4:junit4]   2> 		at java.net.AbstractPlainSocketImpl.doConnect(AbstractPlainSocketImpl.java:339)
[junit4:junit4]   2> 		at java.net.AbstractPlainSocketImpl.connectToAddress(AbstractPlainSocketImpl.java:200)
[junit4:junit4]   2> 		at java.net.AbstractPlainSocketImpl.connect(AbstractPlainSocketImpl.java:182)
[junit4:junit4]   2> 		at java.net.SocksSocketImpl.connect(SocksSocketImpl.java:391)
[junit4:junit4]   2> 		at java.net.Socket.connect(Socket.java:579)
[junit4:junit4]   2> 		at org.apache.http.conn.scheme.PlainSocketFactory.connectSocket(PlainSocketFactory.java:123)
[junit4:junit4]   2> 		at org.apache.http.impl.conn.DefaultClientConnectionOperator.openConnection(DefaultClientConnectionOperator.java:148)
[junit4:junit4]   2> 		at org.apache.http.impl.conn.AbstractPoolEntry.open(AbstractPoolEntry.java:150)
[junit4:junit4]   2> 		at org.apache.http.impl.conn.AbstractPooledConnAdapter.open(AbstractPooledConnAdapter.java:121)
[junit4:junit4]   2> 		at org.apache.http.impl.client.DefaultRequestDirector.tryConnect(DefaultRequestDirector.java:575)
[junit4:junit4]   2> 		at org.apache.http.impl.client.DefaultRequestDirector.execute(DefaultRequestDirector.java:425)
[junit4:junit4]   2> 		at org.apache.http.impl.client.AbstractHttpClient.execute(AbstractHttpClient.java:820)
[junit4:junit4]   2> 		at org.apache.http.impl.client.AbstractHttpClient.execute(AbstractHttpClient.java:754)
[junit4:junit4]   2> 		at org.apache.http.impl.client.AbstractHttpClient.execute(AbstractHttpClient.java:732)
[junit4:junit4]   2> 		at org.apache.solr.client.solrj.impl.HttpSolrServer.request(HttpSolrServer.java:352)
[junit4:junit4]   2> 		... 12 more
[junit4:junit4]   2> 	
[junit4:junit4]   2> 48696 T40 C2 REQ [collection1] webapp=/jzcx path=/select params={fl=id&sort=id+desc&mlt.fl=lowerfilt&shards=[ff01::213]:33332/jzcx|[ff01::083]:33332/jzcx|127.0.0.1:47666/jzcx,127.0.0.1:38710/jzcx|[ff01::213]:33332/jzcx|[ff01::083]:33332/jzcx|[ff01::114]:33332/jzcx&shards.qt=mltrh&q=lowerfilt:fox&mlt=true&qt=mltrh&wt=javabin&version=2} hits=13 status=500 QTime=30087 
[junit4:junit4]   2> 48699 T40 C2 oasc.SolrException.log SEVERE null:org.apache.solr.common.SolrException: org.apache.solr.client.solrj.SolrServerException: No live SolrServers available to handle this request:[http://[ff01::114]:33332/jzcx, http://[ff01::083]:33332/jzcx, http://127.0.0.1:47666/jzcx, http://[ff01::213]:33332/jzcx]
[junit4:junit4]   2> 		at org.apache.solr.handler.component.SearchHandler.handleRequestBody(SearchHandler.java:302)
[junit4:junit4]   2> 		at org.apache.solr.handler.RequestHandlerBase.handleRequest(RequestHandlerBase.java:146)
[junit4:junit4]   2> 		at org.apache.solr.core.SolrCore.execute(SolrCore.java:1819)
[junit4:junit4]   2> 		at org.apache.solr.servlet.SolrDispatchFilter.execute(SolrDispatchFilter.java:458)
[junit4:junit4]   2> 		at org.apache.solr.servlet.SolrDispatchFilter.doFilter(SolrDispatchFilter.java:279)
[junit4:junit4]   2> 		at org.eclipse.jetty.servlet.ServletHandler$CachedChain.doFilter(ServletHandler.java:1307)
[junit4:junit4]   2> 		at org.apache.solr.client.solrj.embedded.JettySolrRunner$DebugFilter.doFilter(JettySolrRunner.java:116)
[junit4:junit4]   2> 		at org.eclipse.jetty.servlet.ServletHandler$CachedChain.doFilter(ServletHandler.java:1307)
[junit4:junit4]   2> 		at org.eclipse.jetty.servlet.ServletHandler.doHandle(ServletHandler.java:453)
[junit4:junit4]   2> 		at org.eclipse.jetty.server.session.SessionHandler.doHandle(SessionHandler.java:229)
[junit4:junit4]   2> 		at org.eclipse.jetty.server.handler.ScopedHandler.handle(ScopedHandler.java:137)
[junit4:junit4]   2> 		at org.eclipse.jetty.server.handler.GzipHandler.handle(GzipHandler.java:275)
[junit4:junit4]   2> 		at org.eclipse.jetty.server.handler.ContextHandler.doHandle(ContextHandler.java:1074)
[junit4:junit4]   2> 		at org.eclipse.jetty.servlet.ServletHandler.doScope(ServletHandler.java:382)
[junit4:junit4]   2> 		at org.eclipse.jetty.server.session.SessionHandler.doScope(SessionHandler.java:193)
[junit4:junit4]   2> 		at org.eclipse.jetty.server.handler.ContextHandler.doScope(ContextHandler.java:1006)
[junit4:junit4]   2> 		at org.eclipse.jetty.server.handler.ScopedHandler.handle(ScopedHandler.java:135)
[junit4:junit4]   2> 		at org.eclipse.jetty.server.handler.HandlerWrapper.handle(HandlerWrapper.java:116)
[junit4:junit4]   2> 		at org.eclipse.jetty.server.Server.handle(Server.java:365)
[junit4:junit4]   2> 		at org.eclipse.jetty.server.AbstractHttpConnection.handleRequest(AbstractHttpConnection.java:485)
[junit4:junit4]   2> 		at org.eclipse.jetty.server.BlockingHttpConnection.handleRequest(BlockingHttpConnection.java:53)
[junit4:junit4]   2> 		at org.eclipse.jetty.server.AbstractHttpConnection.headerComplete(AbstractHttpConnection.java:926)
[junit4:junit4]   2> 		at org.eclipse.jetty.server.AbstractHttpConnection$RequestHandler.headerComplete(AbstractHttpConnection.java:988)
[junit4:junit4]   2> 		at org.eclipse.jetty.http.HttpParser.parseNext(HttpParser.java:635)
[junit4:junit4]   2> 		at org.eclipse.jetty.http.HttpParser.parseAvailable(HttpParser.java:235)
[junit4:junit4]   2> 		at org.eclipse.jetty.server.BlockingHttpConnection.handle(BlockingHttpConnection.java:72)
[junit4:junit4]   2> 		at org.eclipse.jetty.server.bio.SocketConnector$ConnectorEndPoint.run(SocketConnector.java:264)
[junit4:junit4]   2> 		at org.eclipse.jetty.util.thread.QueuedThreadPool.runJob(QueuedThreadPool.java:608)
[junit4:junit4]   2> 		at org.eclipse.jetty.util.thread.QueuedThreadPool$3.run(QueuedThreadPool.java:543)
[junit4:junit4]   2> 		at java.lang.Thread.run(Thread.java:722)
[junit4:junit4]   2> 	Caused by: org.apache.solr.client.solrj.SolrServerException: No live SolrServers available to handle this request:[http://[ff01::114]:33332/jzcx, http://[ff01::083]:33332/jzcx, http://127.0.0.1:47666/jzcx, http://[ff01::213]:33332/jzcx]
[junit4:junit4]   2> 		at org.apache.solr.client.solrj.impl.LBHttpSolrServer.request(LBHttpSolrServer.java:325)
[junit4:junit4]   2> 		at org.apache.solr.handler.component.HttpShardHandler$1.call(HttpShardHandler.java:171)
[junit4:junit4]   2> 		at org.apache.solr.handler.component.HttpShardHandler$1.call(HttpShardHandler.java:135)
[junit4:junit4]   2> 		at java.util.concurrent.FutureTask$Sync.innerRun(FutureTask.java:334)
[junit4:junit4]   2> 		at java.util.concurrent.FutureTask.run(FutureTask.java:166)
[junit4:junit4]   2> 		at java.util.concurrent.Executors$RunnableAdapter.call(Executors.java:471)
[junit4:junit4]   2> 		at java.util.concurrent.FutureTask$Sync.innerRun(FutureTask.java:334)
[junit4:junit4]   2> 		at java.util.concurrent.FutureTask.run(FutureTask.java:166)
[junit4:junit4]   2> 		at java.util.concurrent.ThreadPoolExecutor.runWorker(ThreadPoolExecutor.java:1110)
[junit4:junit4]   2> 		at java.util.concurrent.ThreadPoolExecutor$Worker.run(ThreadPoolExecutor.java:603)
[junit4:junit4]   2> 		... 1 more
[junit4:junit4]   2> 	Caused by: org.apache.solr.client.solrj.SolrServerException: IOException occured when talking to server at: http://[ff01::083]:33332/jzcx
[junit4:junit4]   2> 		at org.apache.solr.client.solrj.impl.HttpSolrServer.request(HttpSolrServer.java:413)
[junit4:junit4]   2> 		at org.apache.solr.client.solrj.impl.HttpSolrServer.request(HttpSolrServer.java:181)
[junit4:junit4]   2> 		at org.apache.solr.client.solrj.impl.LBHttpSolrServer.request(LBHttpSolrServer.java:290)
[junit4:junit4]   2> 		... 10 more
[junit4:junit4]   2> 	Caused by: java.net.SocketException: Protocol family unavailable
[junit4:junit4]   2> 		at java.net.PlainSocketImpl.socketConnect(Native Method)
[junit4:junit4]   2> 		at java.net.AbstractPlainSocketImpl.doConnect(AbstractPlainSocketImpl.java:339)
[junit4:junit4]   2> 		at java.net.AbstractPlainSocketImpl.connectToAddress(AbstractPlainSocketImpl.java:200)
[junit4:junit4]   2> 		at java.net.AbstractPlainSocketImpl.connect(AbstractPlainSocketImpl.java:182)
[junit4:junit4]   2> 		at java.net.SocksSocketImpl.connect(SocksSocketImpl.java:391)
[junit4:junit4]   2> 		at java.net.Socket.connect(Socket.java:579)
[junit4:junit4]   2> 		at org.apache.http.conn.scheme.PlainSocketFactory.connectSocket(PlainSocketFactory.java:123)
[junit4:junit4]   2> 		at org.apache.http.impl.conn.DefaultClientConnectionOperator.openConnection(DefaultClientConnectionOperator.java:148)
[junit4:junit4]   2> 		at org.apache.http.impl.conn.AbstractPoolEntry.open(AbstractPoolEntry.java:150)
[junit4:junit4]   2> 		at org.apache.http.impl.conn.AbstractPooledConnAdapter.open(AbstractPooledConnAdapter.java:121)
[junit4:junit4]   2> 		at org.apache.http.impl.client.DefaultRequestDirector.tryConnect(DefaultRequestDirector.java:575)
[junit4:junit4]   2> 		at org.apache.http.impl.client.DefaultRequestDirector.execute(DefaultRequestDirector.java:425)
[junit4:junit4]   2> 		at org.apache.http.impl.client.AbstractHttpClient.execute(AbstractHttpClient.java:820)
[junit4:junit4]   2> 		at org.apache.http.impl.client.AbstractHttpClient.execute(AbstractHttpClient.java:754)
[junit4:junit4]   2> 		at org.apache.http.impl.client.AbstractHttpClient.execute(AbstractHttpClient.java:732)
[junit4:junit4]   2> 		at org.apache.solr.client.solrj.impl.HttpSolrServer.request(HttpSolrServer.java:352)
[junit4:junit4]   2> 		... 12 more
[junit4:junit4]   2> 	
[junit4:junit4]   2> 48735 T11 oasc.CoreContainer.shutdown Shutting down CoreContainer instance=1180904681
[junit4:junit4]   2> 48737 T11 oasc.SolrCore.close [collection1]  CLOSING SolrCore org.apache.solr.core.SolrCore@784adbc3
[junit4:junit4]   2> 48766 T11 oasu.DirectUpdateHandler2.close closing DirectUpdateHandler2{commits=1,autocommits=0,soft autocommits=0,optimizes=0,rollbacks=0,expungeDeletes=0,docsPending=0,adds=0,deletesById=0,deletesByQuery=0,errors=0,cumulative_adds=11,cumulative_deletesById=0,cumulative_deletesByQuery=1,cumulative_errors=0}
[junit4:junit4]   2> 48772 T11 oasc.SolrCore.decrefSolrCoreState Closing SolrCoreState
[junit4:junit4]   2> 48773 T11 oasu.DefaultSolrCoreState.closeIndexWriter SolrCoreState ref count has reached 0 - closing IndexWriter
[junit4:junit4]   2> 48774 T11 oasu.DefaultSolrCoreState.closeIndexWriter closing IndexWriter with IndexWriterCloser
[junit4:junit4]   2> 48778 T11 C1 oasc.CachingDirectoryFactory.close Releasing directory:/usr/home/hudson/hudson-slave/workspace/Lucene-Solr-Tests-4.x-java7/solr/build/solr-core/test/J0/./org.apache.solr.handler.component.DistributedMLTComponentTest-1355715647251/shard0/data/index
[junit4:junit4]   2> 48779 T11 oasc.SolrCore.closeSearcher [collection1] Closing main searcher on request.
[junit4:junit4]   2> 48782 T11 oasc.CachingDirectoryFactory.close Releasing directory:/usr/home/hudson/hudson-slave/workspace/Lucene-Solr-Tests-4.x-java7/solr/build/solr-core/test/J0/./org.apache.solr.handler.component.DistributedMLTComponentTest-1355715647251/shard0/data/index
[junit4:junit4]   2> 48783 T11 oasc.CachingDirectoryFactory.close Closing directory when closing factory:/usr/home/hudson/hudson-slave/workspace/Lucene-Solr-Tests-4.x-java7/solr/build/solr-core/test/J0/./org.apache.solr.handler.component.DistributedMLTComponentTest-1355715647251/shard0/data/index
[junit4:junit4]   2> 48784 T11 oasc.CachingDirectoryFactory.close Closing directory when closing factory:/usr/home/hudson/hudson-slave/workspace/Lucene-Solr-Tests-4.x-java7/solr/build/solr-core/test/J0/./org.apache.solr.handler.component.DistributedMLTComponentTest-1355715647251/shard0/data
[junit4:junit4]   2> 48786 T11 oejsh.ContextHandler.doStop stopped o.e.j.s.ServletContextHandler{/jzcx,null}
[junit4:junit4]   2> 48843 T11 oasc.CoreContainer.shutdown Shutting down CoreContainer instance=546765555
[junit4:junit4]   2> 48847 T11 oasc.SolrCore.close [collection1]  CLOSING SolrCore org.apache.solr.core.SolrCore@128a9b7f
[junit4:junit4]   2> 48894 T11 oasu.DirectUpdateHandler2.close closing DirectUpdateHandler2{commits=1,autocommits=0,soft autocommits=0,optimizes=0,rollbacks=0,expungeDeletes=0,docsPending=0,adds=0,deletesById=0,deletesByQuery=0,errors=0,cumulative_adds=13,cumulative_deletesById=0,cumulative_deletesByQuery=1,cumulative_errors=0}
[junit4:junit4]   2> 48896 T11 oasc.SolrCore.decrefSolrCoreState Closing SolrCoreState
[junit4:junit4]   2> 48897 T11 oasu.DefaultSolrCoreState.closeIndexWriter SolrCoreState ref count has reached 0 - closing IndexWriter
[junit4:junit4]   2> 48898 T11 oasu.DefaultSolrCoreState.closeIndexWriter closing IndexWriter with IndexWriterCloser
[junit4:junit4]   2> 48902 T11 C2 oasc.CachingDirectoryFactory.close Releasing directory:/usr/home/hudson/hudson-slave/workspace/Lucene-Solr-Tests-4.x-java7/solr/build/solr-core/test/J0/./org.apache.solr.handler.component.DistributedMLTComponentTest-1355715647251/shard1/data/index
[junit4:junit4]   2> 48903 T11 oasc.SolrCore.closeSearcher [collection1] Closing main searcher on request.
[junit4:junit4]   2> 48905 T11 oasc.CachingDirectoryFactory.close Releasing directory:/usr/home/hudson/hudson-slave/workspace/Lucene-Solr-Tests-4.x-java7/solr/build/solr-core/test/J0/./org.apache.solr.handler.component.DistributedMLTComponentTest-1355715647251/shard1/data/index
[junit4:junit4]   2> 48907 T11 oasc.CachingDirectoryFactory.close Closing directory when closing factory:/usr/home/hudson/hudson-slave/workspace/Lucene-Solr-Tests-4.x-java7/solr/build/solr-core/test/J0/./org.apache.solr.handler.component.DistributedMLTComponentTest-1355715647251/shard1/data/index
[junit4:junit4]   2> 48908 T11 oasc.CachingDirectoryFactory.close Closing directory when closing factory:/usr/home/hudson/hudson-slave/workspace/Lucene-Solr-Tests-4.x-java7/solr/build/solr-core/test/J0/./org.apache.solr.handler.component.DistributedMLTComponentTest-1355715647251/shard1/data
[junit4:junit4]   2> 48910 T11 oejsh.ContextHandler.doStop stopped o.e.j.s.ServletContextHandler{/jzcx,null}
[junit4:junit4]   2> 49017 T11 oas.SolrTestCaseJ4.tearDown ###Ending testDistribSearch
[junit4:junit4]   2> NOTE: reproduce with: ant test  -Dtestcase=DistributedMLTComponentTest -Dtests.method=testDistribSearch -Dtests.seed=AFBEC97EF6771BBA -Dtests.multiplier=3 -Dtests.slow=true -Dtests.locale=ar_SD -Dtests.timezone=America/Curacao -Dtests.file.encoding=US-ASCII
[junit4:junit4] ERROR   49.0s J0 | DistributedMLTComponentTest.testDistribSearch <<<
[junit4:junit4]    > Throwable #1: org.apache.solr.client.solrj.SolrServerException: Timeout occured while waiting response from server at: http://127.0.0.1:38710/jzcx
[junit4:junit4]    > 	at __randomizedtesting.SeedInfo.seed([AFBEC97EF6771BBA:2E58476681287B86]:0)
[junit4:junit4]    > 	at org.apache.solr.client.solrj.impl.HttpSolrServer.request(HttpSolrServer.java:409)
[junit4:junit4]    > 	at org.apache.solr.client.solrj.impl.HttpSolrServer.request(HttpSolrServer.java:181)
[junit4:junit4]    > 	at org.apache.solr.client.solrj.request.QueryRequest.process(QueryRequest.java:90)
[junit4:junit4]    > 	at org.apache.solr.client.solrj.SolrServer.query(SolrServer.java:301)
[junit4:junit4]    > 	at org.apache.solr.BaseDistributedSearchTestCase.queryServer(BaseDistributedSearchTestCase.java:470)
[junit4:junit4]    > 	at org.apache.solr.BaseDistributedSearchTestCase.query(BaseDistributedSearchTestCase.java:493)
[junit4:junit4]    > 	at org.apache.solr.BaseDistributedSearchTestCase.query(BaseDistributedSearchTestCase.java:475)
[junit4:junit4]    > 	at org.apache.solr.handler.component.DistributedMLTComponentTest.doTest(DistributedMLTComponentTest.java:119)
[junit4:junit4]    > 	at org.apache.solr.BaseDistributedSearchTestCase.testDistribSearch(BaseDistributedSearchTestCase.java:794)
[junit4:junit4]    > 	at sun.reflect.NativeMethodAccessorImpl.invoke0(Native Method)
[junit4:junit4]    > 	at sun.reflect.NativeMethodAccessorImpl.invoke(NativeMethodAccessorImpl.java:57)
[junit4:junit4]    > 	at sun.reflect.DelegatingMethodAccessorImpl.invo

[...truncated too long message...]

ttp.impl.conn.AbstractClientConnAdapter.receiveResponseHeader(AbstractClientConnAdapter.java:216)
[junit4:junit4]    > 	at org.apache.http.protocol.HttpRequestExecutor.doReceiveResponse(HttpRequestExecutor.java:298)
[junit4:junit4]    > 	at org.apache.http.protocol.HttpRequestExecutor.execute(HttpRequestExecutor.java:125)
[junit4:junit4]    > 	at org.apache.http.impl.client.DefaultRequestDirector.tryExecute(DefaultRequestDirector.java:647)
[junit4:junit4]    > 	at org.apache.http.impl.client.DefaultRequestDirector.execute(DefaultRequestDirector.java:464)
[junit4:junit4]    > 	at org.apache.http.impl.client.AbstractHttpClient.execute(AbstractHttpClient.java:820)
[junit4:junit4]    > 	at org.apache.http.impl.client.AbstractHttpClient.execute(AbstractHttpClient.java:754)
[junit4:junit4]    > 	at org.apache.http.impl.client.AbstractHttpClient.execute(AbstractHttpClient.java:732)
[junit4:junit4]    > 	at org.apache.solr.client.solrj.impl.HttpSolrServer.request(HttpSolrServer.java:352)
[junit4:junit4]    > 	... 5 more
[junit4:junit4]    > Throwable #10: com.carrotsearch.randomizedtesting.UncaughtExceptionError: Captured an uncaught exception in thread: Thread[id=2570, name=testExecutor-2049-thread-15, state=RUNNABLE, group=TGRP-BasicDistributedZkTest]
[junit4:junit4]    > Caused by: java.lang.RuntimeException: org.apache.solr.client.solrj.SolrServerException: Timeout occured while waiting response from server at: http://127.0.0.1:62037/g/s
[junit4:junit4]    > 	at __randomizedtesting.SeedInfo.seed([AFBEC97EF6771BBA]:0)
[junit4:junit4]    > 	at org.apache.solr.cloud.BasicDistributedZkTest$2.run(BasicDistributedZkTest.java:722)
[junit4:junit4]    > 	at java.util.concurrent.ThreadPoolExecutor.runWorker(ThreadPoolExecutor.java:1110)
[junit4:junit4]    > 	at java.util.concurrent.ThreadPoolExecutor$Worker.run(ThreadPoolExecutor.java:603)
[junit4:junit4]    > 	at java.lang.Thread.run(Thread.java:722)
[junit4:junit4]    > Caused by: org.apache.solr.client.solrj.SolrServerException: Timeout occured while waiting response from server at: http://127.0.0.1:62037/g/s
[junit4:junit4]    > 	at org.apache.solr.client.solrj.impl.HttpSolrServer.request(HttpSolrServer.java:409)
[junit4:junit4]    > 	at org.apache.solr.client.solrj.impl.HttpSolrServer.request(HttpSolrServer.java:181)
[junit4:junit4]    > 	at org.apache.solr.cloud.BasicDistributedZkTest$2.run(BasicDistributedZkTest.java:720)
[junit4:junit4]    > 	... 3 more
[junit4:junit4]    > Caused by: java.net.SocketTimeoutException: Read timed out
[junit4:junit4]    > 	at java.net.SocketInputStream.socketRead0(Native Method)
[junit4:junit4]    > 	at java.net.SocketInputStream.read(SocketInputStream.java:150)
[junit4:junit4]    > 	at java.net.SocketInputStream.read(SocketInputStream.java:121)
[junit4:junit4]    > 	at org.apache.http.impl.io.AbstractSessionInputBuffer.fillBuffer(AbstractSessionInputBuffer.java:149)
[junit4:junit4]    > 	at org.apache.http.impl.io.SocketInputBuffer.fillBuffer(SocketInputBuffer.java:111)
[junit4:junit4]    > 	at org.apache.http.impl.io.AbstractSessionInputBuffer.readLine(AbstractSessionInputBuffer.java:264)
[junit4:junit4]    > 	at org.apache.http.impl.conn.DefaultResponseParser.parseHead(DefaultResponseParser.java:98)
[junit4:junit4]    > 	at org.apache.http.impl.io.AbstractMessageParser.parse(AbstractMessageParser.java:252)
[junit4:junit4]    > 	at org.apache.http.impl.AbstractHttpClientConnection.receiveResponseHeader(AbstractHttpClientConnection.java:282)
[junit4:junit4]    > 	at org.apache.http.impl.conn.DefaultClientConnection.receiveResponseHeader(DefaultClientConnection.java:247)
[junit4:junit4]    > 	at org.apache.http.impl.conn.AbstractClientConnAdapter.receiveResponseHeader(AbstractClientConnAdapter.java:216)
[junit4:junit4]    > 	at org.apache.http.protocol.HttpRequestExecutor.doReceiveResponse(HttpRequestExecutor.java:298)
[junit4:junit4]    > 	at org.apache.http.protocol.HttpRequestExecutor.execute(HttpRequestExecutor.java:125)
[junit4:junit4]    > 	at org.apache.http.impl.client.DefaultRequestDirector.tryExecute(DefaultRequestDirector.java:647)
[junit4:junit4]    > 	at org.apache.http.impl.client.DefaultRequestDirector.execute(DefaultRequestDirector.java:464)
[junit4:junit4]    > 	at org.apache.http.impl.client.AbstractHttpClient.execute(AbstractHttpClient.java:820)
[junit4:junit4]    > 	at org.apache.http.impl.client.AbstractHttpClient.execute(AbstractHttpClient.java:754)
[junit4:junit4]    > 	at org.apache.http.impl.client.AbstractHttpClient.execute(AbstractHttpClient.java:732)
[junit4:junit4]    > 	at org.apache.solr.client.solrj.impl.HttpSolrServer.request(HttpSolrServer.java:352)
[junit4:junit4]    > 	... 5 more
[junit4:junit4]    > Throwable #11: com.carrotsearch.randomizedtesting.UncaughtExceptionError: Captured an uncaught exception in thread: Thread[id=2678, name=testExecutor-2199-thread-3, state=RUNNABLE, group=TGRP-BasicDistributedZkTest]
[junit4:junit4]    > Caused by: org.apache.solr.common.SolrException: No such core exists 'multiunload2'
[junit4:junit4]    > 	at __randomizedtesting.SeedInfo.seed([AFBEC97EF6771BBA]:0)
[junit4:junit4]    > 	at org.apache.solr.client.solrj.impl.HttpSolrServer.request(HttpSolrServer.java:401)
[junit4:junit4]    > 	at org.apache.solr.client.solrj.impl.HttpSolrServer.request(HttpSolrServer.java:181)
[junit4:junit4]    > 	at org.apache.solr.cloud.BasicDistributedZkTest$1.run(BasicDistributedZkTest.java:656)
[junit4:junit4]    > 	at java.util.concurrent.ThreadPoolExecutor.runWorker(ThreadPoolExecutor.java:1110)
[junit4:junit4]    > 	at java.util.concurrent.ThreadPoolExecutor$Worker.run(ThreadPoolExecutor.java:603)
[junit4:junit4]    > 	at java.lang.Thread.run(Thread.java:722)
[junit4:junit4]    > Throwable #12: com.carrotsearch.randomizedtesting.UncaughtExceptionError: Captured an uncaught exception in thread: Thread[id=2679, name=testExecutor-2199-thread-4, state=RUNNABLE, group=TGRP-BasicDistributedZkTest]
[junit4:junit4]    > Caused by: org.apache.solr.common.SolrException: No such core exists 'multiunload3'
[junit4:junit4]    > 	at __randomizedtesting.SeedInfo.seed([AFBEC97EF6771BBA]:0)
[junit4:junit4]    > 	at org.apache.solr.client.solrj.impl.HttpSolrServer.request(HttpSolrServer.java:401)
[junit4:junit4]    > 	at org.apache.solr.client.solrj.impl.HttpSolrServer.request(HttpSolrServer.java:181)
[junit4:junit4]    > 	at org.apache.solr.cloud.BasicDistributedZkTest$1.run(BasicDistributedZkTest.java:656)
[junit4:junit4]    > 	at java.util.concurrent.ThreadPoolExecutor.runWorker(ThreadPoolExecutor.java:1110)
[junit4:junit4]    > 	at java.util.concurrent.ThreadPoolExecutor$Worker.run(ThreadPoolExecutor.java:603)
[junit4:junit4]    > 	at java.lang.Thread.run(Thread.java:722)
[junit4:junit4]    > Throwable #13: com.carrotsearch.randomizedtesting.UncaughtExceptionError: Captured an uncaught exception in thread: Thread[id=2683, name=testExecutor-2199-thread-8, state=RUNNABLE, group=TGRP-BasicDistributedZkTest]
[junit4:junit4]    > Caused by: org.apache.solr.common.SolrException: No such core exists 'multiunload8'
[junit4:junit4]    > 	at __randomizedtesting.SeedInfo.seed([AFBEC97EF6771BBA]:0)
[junit4:junit4]    > 	at org.apache.solr.client.solrj.impl.HttpSolrServer.request(HttpSolrServer.java:401)
[junit4:junit4]    > 	at org.apache.solr.client.solrj.impl.HttpSolrServer.request(HttpSolrServer.java:181)
[junit4:junit4]    > 	at org.apache.solr.cloud.BasicDistributedZkTest$1.run(BasicDistributedZkTest.java:656)
[junit4:junit4]    > 	at java.util.concurrent.ThreadPoolExecutor.runWorker(ThreadPoolExecutor.java:1110)
[junit4:junit4]    > 	at java.util.concurrent.ThreadPoolExecutor$Worker.run(ThreadPoolExecutor.java:603)
[junit4:junit4]    > 	at java.lang.Thread.run(Thread.java:722)
[junit4:junit4]    > Throwable #14: com.carrotsearch.randomizedtesting.UncaughtExceptionError: Captured an uncaught exception in thread: Thread[id=2682, name=testExecutor-2199-thread-7, state=RUNNABLE, group=TGRP-BasicDistributedZkTest]
[junit4:junit4]    > Caused by: org.apache.solr.common.SolrException: No such core exists 'multiunload6'
[junit4:junit4]    > 	at __randomizedtesting.SeedInfo.seed([AFBEC97EF6771BBA]:0)
[junit4:junit4]    > 	at org.apache.solr.client.solrj.impl.HttpSolrServer.request(HttpSolrServer.java:401)
[junit4:junit4]    > 	at org.apache.solr.client.solrj.impl.HttpSolrServer.request(HttpSolrServer.java:181)
[junit4:junit4]    > 	at org.apache.solr.cloud.BasicDistributedZkTest$1.run(BasicDistributedZkTest.java:656)
[junit4:junit4]    > 	at java.util.concurrent.ThreadPoolExecutor.runWorker(ThreadPoolExecutor.java:1110)
[junit4:junit4]    > 	at java.util.concurrent.ThreadPoolExecutor$Worker.run(ThreadPoolExecutor.java:603)
[junit4:junit4]    > 	at java.lang.Thread.run(Thread.java:722)
[junit4:junit4] Completed on J1 in 7226.21s, 1 test, 15 errors <<< FAILURES!

[...truncated 12 lines...]
BUILD FAILED
/usr/home/hudson/hudson-slave/workspace/Lucene-Solr-Tests-4.x-java7/build.xml:353: The following error occurred while executing this line:
/usr/home/hudson/hudson-slave/workspace/Lucene-Solr-Tests-4.x-java7/build.xml:39: The following error occurred while executing this line:
/usr/home/hudson/hudson-slave/workspace/Lucene-Solr-Tests-4.x-java7/solr/build.xml:178: The following error occurred while executing this line:
/usr/home/hudson/hudson-slave/workspace/Lucene-Solr-Tests-4.x-java7/solr/common-build.xml:438: The following error occurred while executing this line:
/usr/home/hudson/hudson-slave/workspace/Lucene-Solr-Tests-4.x-java7/lucene/common-build.xml:1175: The following error occurred while executing this line:
/usr/home/hudson/hudson-slave/workspace/Lucene-Solr-Tests-4.x-java7/lucene/common-build.xml:840: There were test failures: 242 suites, 1009 tests, 14 suite-level errors, 2 errors, 21 ignored (3 assumptions)

Total time: 152 minutes 49 seconds
Build step 'Invoke Ant' marked build as failure
Archiving artifacts
Recording test results
Email was triggered for: Failure
Sending email for trigger: Failure



Mime
View raw message