lucene-dev mailing list archives

Site index · List index
Message view « Date » · « Thread »
Top « Date » · « Thread »
From Apache Jenkins Server <jenk...@builds.apache.org>
Subject [JENKINS] Lucene-Solr-Tests-trunk-Java6 - Build # 15718 - Failure
Date Sat, 15 Dec 2012 00:07:51 GMT
Build: https://builds.apache.org/job/Lucene-Solr-Tests-trunk-Java6/15718/

1 tests failed.
FAILED:  org.apache.solr.cloud.SyncSliceTest.testDistribSearch

Error Message:
Shard still reported as live in zk - 0 jetty

Stack Trace:
java.lang.AssertionError: Shard still reported as live in zk - 0 jetty
	at __randomizedtesting.SeedInfo.seed([46015C0C189E9B24:C7E7D2146FC1FB18]:0)
	at org.junit.Assert.fail(Assert.java:93)
	at org.apache.solr.cloud.AbstractFullDistribZkTestBase.waitToSeeNotLive(AbstractFullDistribZkTestBase.java:1239)
	at org.apache.solr.cloud.AbstractFullDistribZkTestBase.waitToSeeNotLive(AbstractFullDistribZkTestBase.java:1224)
	at org.apache.solr.cloud.SyncSliceTest.waitToSeeDownInClusterState(SyncSliceTest.java:259)
	at org.apache.solr.cloud.SyncSliceTest.doTest(SyncSliceTest.java:163)
	at org.apache.solr.BaseDistributedSearchTestCase.testDistribSearch(BaseDistributedSearchTestCase.java:793)
	at sun.reflect.NativeMethodAccessorImpl.invoke0(Native Method)
	at sun.reflect.NativeMethodAccessorImpl.invoke(NativeMethodAccessorImpl.java:57)
	at sun.reflect.DelegatingMethodAccessorImpl.invoke(DelegatingMethodAccessorImpl.java:43)
	at java.lang.reflect.Method.invoke(Method.java:616)
	at com.carrotsearch.randomizedtesting.RandomizedRunner.invoke(RandomizedRunner.java:1559)
	at com.carrotsearch.randomizedtesting.RandomizedRunner.access$600(RandomizedRunner.java:79)
	at com.carrotsearch.randomizedtesting.RandomizedRunner$6.evaluate(RandomizedRunner.java:737)
	at com.carrotsearch.randomizedtesting.RandomizedRunner$7.evaluate(RandomizedRunner.java:773)
	at com.carrotsearch.randomizedtesting.RandomizedRunner$8.evaluate(RandomizedRunner.java:787)
	at com.carrotsearch.randomizedtesting.rules.SystemPropertiesRestoreRule$1.evaluate(SystemPropertiesRestoreRule.java:53)
	at org.apache.lucene.util.TestRuleSetupTeardownChained$1.evaluate(TestRuleSetupTeardownChained.java:50)
	at org.apache.lucene.util.TestRuleFieldCacheSanity$1.evaluate(TestRuleFieldCacheSanity.java:51)
	at org.apache.lucene.util.AbstractBeforeAfterRule$1.evaluate(AbstractBeforeAfterRule.java:46)
	at com.carrotsearch.randomizedtesting.rules.SystemPropertiesInvariantRule$1.evaluate(SystemPropertiesInvariantRule.java:55)
	at org.apache.lucene.util.TestRuleThreadAndTestName$1.evaluate(TestRuleThreadAndTestName.java:49)
	at org.apache.lucene.util.TestRuleIgnoreAfterMaxFailures$1.evaluate(TestRuleIgnoreAfterMaxFailures.java:70)
	at org.apache.lucene.util.TestRuleMarkFailure$1.evaluate(TestRuleMarkFailure.java:48)
	at com.carrotsearch.randomizedtesting.rules.StatementAdapter.evaluate(StatementAdapter.java:36)
	at com.carrotsearch.randomizedtesting.ThreadLeakControl$StatementRunner.run(ThreadLeakControl.java:358)
	at com.carrotsearch.randomizedtesting.ThreadLeakControl.forkTimeoutingTask(ThreadLeakControl.java:782)
	at com.carrotsearch.randomizedtesting.ThreadLeakControl$3.evaluate(ThreadLeakControl.java:442)
	at com.carrotsearch.randomizedtesting.RandomizedRunner.runSingleTest(RandomizedRunner.java:746)
	at com.carrotsearch.randomizedtesting.RandomizedRunner$3.evaluate(RandomizedRunner.java:648)
	at com.carrotsearch.randomizedtesting.RandomizedRunner$4.evaluate(RandomizedRunner.java:682)
	at com.carrotsearch.randomizedtesting.RandomizedRunner$5.evaluate(RandomizedRunner.java:693)
	at com.carrotsearch.randomizedtesting.rules.StatementAdapter.evaluate(StatementAdapter.java:36)
	at com.carrotsearch.randomizedtesting.rules.SystemPropertiesRestoreRule$1.evaluate(SystemPropertiesRestoreRule.java:53)
	at org.apache.lucene.util.AbstractBeforeAfterRule$1.evaluate(AbstractBeforeAfterRule.java:46)
	at org.apache.lucene.util.TestRuleStoreClassName$1.evaluate(TestRuleStoreClassName.java:42)
	at com.carrotsearch.randomizedtesting.rules.SystemPropertiesInvariantRule$1.evaluate(SystemPropertiesInvariantRule.java:55)
	at com.carrotsearch.randomizedtesting.rules.NoShadowingOrOverridesOnMethodsRule$1.evaluate(NoShadowingOrOverridesOnMethodsRule.java:39)
	at com.carrotsearch.randomizedtesting.rules.NoShadowingOrOverridesOnMethodsRule$1.evaluate(NoShadowingOrOverridesOnMethodsRule.java:39)
	at com.carrotsearch.randomizedtesting.rules.StatementAdapter.evaluate(StatementAdapter.java:36)
	at org.apache.lucene.util.TestRuleAssertionsRequired$1.evaluate(TestRuleAssertionsRequired.java:43)
	at org.apache.lucene.util.TestRuleMarkFailure$1.evaluate(TestRuleMarkFailure.java:48)
	at org.apache.lucene.util.TestRuleIgnoreAfterMaxFailures$1.evaluate(TestRuleIgnoreAfterMaxFailures.java:70)
	at org.apache.lucene.util.TestRuleIgnoreTestSuites$1.evaluate(TestRuleIgnoreTestSuites.java:55)
	at com.carrotsearch.randomizedtesting.rules.StatementAdapter.evaluate(StatementAdapter.java:36)
	at com.carrotsearch.randomizedtesting.ThreadLeakControl$StatementRunner.run(ThreadLeakControl.java:358)
	at java.lang.Thread.run(Thread.java:679)




Build Log:
[...truncated 8564 lines...]
[junit4:junit4] Suite: org.apache.solr.cloud.SyncSliceTest
[junit4:junit4]   2> 0 T2562 oas.BaseDistributedSearchTestCase.initHostContext Setting hostContext system property: /
[junit4:junit4]   2> 6 T2562 oas.SolrTestCaseJ4.setUp ###Starting testDistribSearch
[junit4:junit4]   2> Creating dataDir: /usr/home/hudson/hudson-slave/workspace/Lucene-Solr-Tests-trunk-Java6/solr/build/solr-core/test/J0/./solrtest-SyncSliceTest-1355529933423
[junit4:junit4]   2> 7 T2562 oasc.ZkTestServer.run STARTING ZK TEST SERVER
[junit4:junit4]   2> 8 T2563 oasc.ZkTestServer$ZKServerMain.runFromConfig Starting server
[junit4:junit4]   2> 11 T2563 oazs.ZooKeeperServer.setTickTime tickTime set to 1000
[junit4:junit4]   2> 12 T2563 oazs.ZooKeeperServer.setMinSessionTimeout minSessionTimeout set to -1
[junit4:junit4]   2> 12 T2563 oazs.ZooKeeperServer.setMaxSessionTimeout maxSessionTimeout set to -1
[junit4:junit4]   2> 12 T2563 oazs.NIOServerCnxnFactory.configure binding to port 0.0.0.0/0.0.0.0:0
[junit4:junit4]   2> 13 T2563 oazsp.FileTxnSnapLog.save Snapshotting: 0x0 to /usr/home/hudson/hudson-slave/workspace/Lucene-Solr-Tests-trunk-Java6/solr/build/solr-core/test/J0/./org.apache.solr.cloud.SyncSliceTest-1355529933422/zookeeper/server1/data/version-2/snapshot.0
[junit4:junit4]   2> 109 T2562 oasc.ZkTestServer.run start zk server on port:63353
[junit4:junit4]   2> 110 T2562 oaz.ZooKeeper.<init> Initiating client connection, connectString=127.0.0.1:63353 sessionTimeout=10000 watcher=org.apache.solr.common.cloud.ConnectionManager@5e04ef09
[junit4:junit4]   2> 111 T2562 oascc.ConnectionManager.waitForConnected Waiting for client to connect to ZooKeeper
[junit4:junit4]   2> 111 T2568 oaz.ClientCnxn$SendThread.logStartConnect Opening socket connection to server localhost/127.0.0.1:63353. Will not attempt to authenticate using SASL (access denied (javax.security.auth.AuthPermission getLoginConfiguration))
[junit4:junit4]   2> 112 T2568 oaz.ClientCnxn$SendThread.primeConnection Socket connection established to localhost/127.0.0.1:63353, initiating session
[junit4:junit4]   2> 112 T2564 oazs.NIOServerCnxnFactory.run Accepted socket connection from /140.211.11.196:63354
[junit4:junit4]   2> 112 T2564 oazs.ZooKeeperServer.processConnectRequest Client attempting to establish new session at /140.211.11.196:63354
[junit4:junit4]   2> 113 T2566 oazsp.FileTxnLog.append Creating new log file: log.1
[junit4:junit4]   2> 116 T2566 oazs.ZooKeeperServer.finishSessionInit Established session 0x13b9be152760000 with negotiated timeout 10000 for client /140.211.11.196:63354
[junit4:junit4]   2> 116 T2568 oaz.ClientCnxn$SendThread.onConnected Session establishment complete on server localhost/127.0.0.1:63353, sessionid = 0x13b9be152760000, negotiated timeout = 10000
[junit4:junit4]   2> 117 T2569 oascc.ConnectionManager.process Watcher org.apache.solr.common.cloud.ConnectionManager@5e04ef09 name:ZooKeeperConnection Watcher:127.0.0.1:63353 got event WatchedEvent state:SyncConnected type:None path:null path:null type:None
[junit4:junit4]   2> 118 T2562 oascc.ConnectionManager.waitForConnected Client is connected to ZooKeeper
[junit4:junit4]   2> 118 T2562 oascc.SolrZkClient.makePath makePath: /solr
[junit4:junit4]   2> 121 T2567 oazs.PrepRequestProcessor.pRequest2Txn Processed session termination for sessionid: 0x13b9be152760000
[junit4:junit4]   2> 129 T2569 oaz.ClientCnxn$EventThread.run EventThread shut down
[junit4:junit4]   2> 130 T2564 oazs.NIOServerCnxn.closeSock Closed socket connection for client /140.211.11.196:63354 which had sessionid 0x13b9be152760000
[junit4:junit4]   2> 129 T2562 oaz.ZooKeeper.close Session: 0x13b9be152760000 closed
[junit4:junit4]   2> 131 T2562 oaz.ZooKeeper.<init> Initiating client connection, connectString=127.0.0.1:63353/solr sessionTimeout=10000 watcher=org.apache.solr.common.cloud.ConnectionManager@270ed23a
[junit4:junit4]   2> 132 T2562 oascc.ConnectionManager.waitForConnected Waiting for client to connect to ZooKeeper
[junit4:junit4]   2> 132 T2570 oaz.ClientCnxn$SendThread.logStartConnect Opening socket connection to server localhost/127.0.0.1:63353. Will not attempt to authenticate using SASL (access denied (javax.security.auth.AuthPermission getLoginConfiguration))
[junit4:junit4]   2> 133 T2570 oaz.ClientCnxn$SendThread.primeConnection Socket connection established to localhost/127.0.0.1:63353, initiating session
[junit4:junit4]   2> 133 T2564 oazs.NIOServerCnxnFactory.run Accepted socket connection from /140.211.11.196:63355
[junit4:junit4]   2> 133 T2564 oazs.ZooKeeperServer.processConnectRequest Client attempting to establish new session at /140.211.11.196:63355
[junit4:junit4]   2> 135 T2566 oazs.ZooKeeperServer.finishSessionInit Established session 0x13b9be152760001 with negotiated timeout 10000 for client /140.211.11.196:63355
[junit4:junit4]   2> 135 T2570 oaz.ClientCnxn$SendThread.onConnected Session establishment complete on server localhost/127.0.0.1:63353, sessionid = 0x13b9be152760001, negotiated timeout = 10000
[junit4:junit4]   2> 135 T2571 oascc.ConnectionManager.process Watcher org.apache.solr.common.cloud.ConnectionManager@270ed23a name:ZooKeeperConnection Watcher:127.0.0.1:63353/solr got event WatchedEvent state:SyncConnected type:None path:null path:null type:None
[junit4:junit4]   2> 135 T2562 oascc.ConnectionManager.waitForConnected Client is connected to ZooKeeper
[junit4:junit4]   2> 136 T2562 oascc.SolrZkClient.makePath makePath: /collections/collection1
[junit4:junit4]   2> 140 T2562 oascc.SolrZkClient.makePath makePath: /collections/collection1/shards
[junit4:junit4]   2> 150 T2562 oascc.SolrZkClient.makePath makePath: /collections/control_collection
[junit4:junit4]   2> 153 T2562 oascc.SolrZkClient.makePath makePath: /collections/control_collection/shards
[junit4:junit4]   2> 155 T2562 oasc.AbstractZkTestCase.putConfig put /usr/home/hudson/hudson-slave/workspace/Lucene-Solr-Tests-trunk-Java6/solr/build/solr-core/test-files/solr/collection1/conf/solrconfig.xml to /configs/conf1/solrconfig.xml
[junit4:junit4]   2> 156 T2562 oascc.SolrZkClient.makePath makePath: /configs/conf1/solrconfig.xml
[junit4:junit4]   2> 167 T2562 oasc.AbstractZkTestCase.putConfig put /usr/home/hudson/hudson-slave/workspace/Lucene-Solr-Tests-trunk-Java6/solr/build/solr-core/test-files/solr/collection1/conf/schema.xml to /configs/conf1/schema.xml
[junit4:junit4]   2> 169 T2562 oascc.SolrZkClient.makePath makePath: /configs/conf1/schema.xml
[junit4:junit4]   2> 273 T2562 oasc.AbstractZkTestCase.putConfig put /usr/home/hudson/hudson-slave/workspace/Lucene-Solr-Tests-trunk-Java6/solr/build/solr-core/test-files/solr/collection1/conf/stopwords.txt to /configs/conf1/stopwords.txt
[junit4:junit4]   2> 274 T2562 oascc.SolrZkClient.makePath makePath: /configs/conf1/stopwords.txt
[junit4:junit4]   2> 277 T2562 oasc.AbstractZkTestCase.putConfig put /usr/home/hudson/hudson-slave/workspace/Lucene-Solr-Tests-trunk-Java6/solr/build/solr-core/test-files/solr/collection1/conf/protwords.txt to /configs/conf1/protwords.txt
[junit4:junit4]   2> 278 T2562 oascc.SolrZkClient.makePath makePath: /configs/conf1/protwords.txt
[junit4:junit4]   2> 287 T2562 oasc.AbstractZkTestCase.putConfig put /usr/home/hudson/hudson-slave/workspace/Lucene-Solr-Tests-trunk-Java6/solr/build/solr-core/test-files/solr/collection1/conf/currency.xml to /configs/conf1/currency.xml
[junit4:junit4]   2> 288 T2562 oascc.SolrZkClient.makePath makePath: /configs/conf1/currency.xml
[junit4:junit4]   2> 291 T2562 oasc.AbstractZkTestCase.putConfig put /usr/home/hudson/hudson-slave/workspace/Lucene-Solr-Tests-trunk-Java6/solr/build/solr-core/test-files/solr/collection1/conf/open-exchange-rates.json to /configs/conf1/open-exchange-rates.json
[junit4:junit4]   2> 292 T2562 oascc.SolrZkClient.makePath makePath: /configs/conf1/open-exchange-rates.json
[junit4:junit4]   2> 295 T2562 oasc.AbstractZkTestCase.putConfig put /usr/home/hudson/hudson-slave/workspace/Lucene-Solr-Tests-trunk-Java6/solr/build/solr-core/test-files/solr/collection1/conf/mapping-ISOLatin1Accent.txt to /configs/conf1/mapping-ISOLatin1Accent.txt
[junit4:junit4]   2> 296 T2562 oascc.SolrZkClient.makePath makePath: /configs/conf1/mapping-ISOLatin1Accent.txt
[junit4:junit4]   2> 299 T2562 oasc.AbstractZkTestCase.putConfig put /usr/home/hudson/hudson-slave/workspace/Lucene-Solr-Tests-trunk-Java6/solr/build/solr-core/test-files/solr/collection1/conf/old_synonyms.txt to /configs/conf1/old_synonyms.txt
[junit4:junit4]   2> 299 T2562 oascc.SolrZkClient.makePath makePath: /configs/conf1/old_synonyms.txt
[junit4:junit4]   2> 302 T2562 oasc.AbstractZkTestCase.putConfig put /usr/home/hudson/hudson-slave/workspace/Lucene-Solr-Tests-trunk-Java6/solr/build/solr-core/test-files/solr/collection1/conf/synonyms.txt to /configs/conf1/synonyms.txt
[junit4:junit4]   2> 303 T2562 oascc.SolrZkClient.makePath makePath: /configs/conf1/synonyms.txt
[junit4:junit4]   2> 306 T2567 oazs.PrepRequestProcessor.pRequest2Txn Processed session termination for sessionid: 0x13b9be152760001
[junit4:junit4]   2> 313 T2571 oaz.ClientCnxn$EventThread.run EventThread shut down
[junit4:junit4]   2> 313 T2564 oazs.NIOServerCnxn.closeSock Closed socket connection for client /140.211.11.196:63355 which had sessionid 0x13b9be152760001
[junit4:junit4]   2> 313 T2562 oaz.ZooKeeper.close Session: 0x13b9be152760001 closed
[junit4:junit4]   2> 476 T2562 oejs.Server.doStart jetty-8.1.8.v20121106
[junit4:junit4]   2> 481 T2562 oejs.AbstractConnector.doStart Started SocketConnector@127.0.0.1:63356
[junit4:junit4]   2> 482 T2562 oasc.SolrResourceLoader.locateSolrHome JNDI not configured for solr (NoInitialContextEx)
[junit4:junit4]   2> 483 T2562 oasc.SolrResourceLoader.locateSolrHome using system property solr.solr.home: /usr/home/hudson/hudson-slave/workspace/Lucene-Solr-Tests-trunk-Java6/solr/build/solr-core/test/J0/./org.apache.solr.cloud.SyncSliceTest-controljetty-1355529933730
[junit4:junit4]   2> 484 T2562 oasc.SolrResourceLoader.<init> new SolrResourceLoader for deduced Solr Home: '/usr/home/hudson/hudson-slave/workspace/Lucene-Solr-Tests-trunk-Java6/solr/build/solr-core/test/J0/./org.apache.solr.cloud.SyncSliceTest-controljetty-1355529933730/'
[junit4:junit4]   2> 522 T2562 oass.SolrDispatchFilter.init SolrDispatchFilter.init()
[junit4:junit4]   2> 523 T2562 oasc.SolrResourceLoader.locateSolrHome JNDI not configured for solr (NoInitialContextEx)
[junit4:junit4]   2> 524 T2562 oasc.SolrResourceLoader.locateSolrHome using system property solr.solr.home: /usr/home/hudson/hudson-slave/workspace/Lucene-Solr-Tests-trunk-Java6/solr/build/solr-core/test/J0/./org.apache.solr.cloud.SyncSliceTest-controljetty-1355529933730
[junit4:junit4]   2> 524 T2562 oasc.CoreContainer$Initializer.initialize looking for solr.xml: /usr/home/hudson/hudson-slave/workspace/Lucene-Solr-Tests-trunk-Java6/solr/build/solr-core/test/J0/./org.apache.solr.cloud.SyncSliceTest-controljetty-1355529933730/solr.xml
[junit4:junit4]   2> 525 T2562 oasc.CoreContainer.<init> New CoreContainer 1914578336
[junit4:junit4]   2> 526 T2562 oasc.CoreContainer.load Loading CoreContainer using Solr Home: '/usr/home/hudson/hudson-slave/workspace/Lucene-Solr-Tests-trunk-Java6/solr/build/solr-core/test/J0/./org.apache.solr.cloud.SyncSliceTest-controljetty-1355529933730/'
[junit4:junit4]   2> 527 T2562 oasc.SolrResourceLoader.<init> new SolrResourceLoader for directory: '/usr/home/hudson/hudson-slave/workspace/Lucene-Solr-Tests-trunk-Java6/solr/build/solr-core/test/J0/./org.apache.solr.cloud.SyncSliceTest-controljetty-1355529933730/'
[junit4:junit4]   2> 557 T2562 oasc.CoreContainer.load Registering Log Listener
[junit4:junit4]   2> 577 T2562 oasc.CoreContainer.initZooKeeper Zookeeper client=127.0.0.1:63353/solr
[junit4:junit4]   2> 578 T2562 oasc.ZkController.checkChrootPath zkHost includes chroot
[junit4:junit4]   2> 578 T2562 oaz.ZooKeeper.<init> Initiating client connection, connectString=127.0.0.1:63353 sessionTimeout=60000 watcher=org.apache.solr.common.cloud.ConnectionManager@45aa6f47
[junit4:junit4]   2> 580 T2562 oascc.ConnectionManager.waitForConnected Waiting for client to connect to ZooKeeper
[junit4:junit4]   2> 580 T2581 oaz.ClientCnxn$SendThread.logStartConnect Opening socket connection to server localhost/127.0.0.1:63353. Will not attempt to authenticate using SASL (access denied (javax.security.auth.AuthPermission getLoginConfiguration))
[junit4:junit4]   2> 581 T2581 oaz.ClientCnxn$SendThread.primeConnection Socket connection established to localhost/127.0.0.1:63353, initiating session
[junit4:junit4]   2> 581 T2564 oazs.NIOServerCnxnFactory.run Accepted socket connection from /140.211.11.196:63357
[junit4:junit4]   2> 582 T2564 oazs.ZooKeeperServer.processConnectRequest Client attempting to establish new session at /140.211.11.196:63357
[junit4:junit4]   2> 589 T2566 oazs.ZooKeeperServer.finishSessionInit Established session 0x13b9be152760002 with negotiated timeout 20000 for client /140.211.11.196:63357
[junit4:junit4]   2> 589 T2581 oaz.ClientCnxn$SendThread.onConnected Session establishment complete on server localhost/127.0.0.1:63353, sessionid = 0x13b9be152760002, negotiated timeout = 20000
[junit4:junit4]   2> 589 T2582 oascc.ConnectionManager.process Watcher org.apache.solr.common.cloud.ConnectionManager@45aa6f47 name:ZooKeeperConnection Watcher:127.0.0.1:63353 got event WatchedEvent state:SyncConnected type:None path:null path:null type:None
[junit4:junit4]   2> 590 T2562 oascc.ConnectionManager.waitForConnected Client is connected to ZooKeeper
[junit4:junit4]   2> 591 T2567 oazs.PrepRequestProcessor.pRequest2Txn Processed session termination for sessionid: 0x13b9be152760002
[junit4:junit4]   2> 596 T2582 oaz.ClientCnxn$EventThread.run EventThread shut down
[junit4:junit4]   2> 596 T2564 oazs.NIOServerCnxn.closeSock Closed socket connection for client /140.211.11.196:63357 which had sessionid 0x13b9be152760002
[junit4:junit4]   2> 596 T2562 oaz.ZooKeeper.close Session: 0x13b9be152760002 closed
[junit4:junit4]   2> 598 T2562 oaz.ZooKeeper.<init> Initiating client connection, connectString=127.0.0.1:63353/solr sessionTimeout=8000 watcher=org.apache.solr.common.cloud.ConnectionManager@299a4c85
[junit4:junit4]   2> 599 T2583 oaz.ClientCnxn$SendThread.logStartConnect Opening socket connection to server localhost/127.0.0.1:63353. Will not attempt to authenticate using SASL (access denied (javax.security.auth.AuthPermission getLoginConfiguration))
[junit4:junit4]   2> 599 T2562 oascc.ConnectionManager.waitForConnected Waiting for client to connect to ZooKeeper
[junit4:junit4]   2> 599 T2583 oaz.ClientCnxn$SendThread.primeConnection Socket connection established to localhost/127.0.0.1:63353, initiating session
[junit4:junit4]   2> 600 T2564 oazs.NIOServerCnxnFactory.run Accepted socket connection from /140.211.11.196:63358
[junit4:junit4]   2> 600 T2564 oazs.ZooKeeperServer.processConnectRequest Client attempting to establish new session at /140.211.11.196:63358
[junit4:junit4]   2> 607 T2566 oazs.ZooKeeperServer.finishSessionInit Established session 0x13b9be152760003 with negotiated timeout 8000 for client /140.211.11.196:63358
[junit4:junit4]   2> 607 T2583 oaz.ClientCnxn$SendThread.onConnected Session establishment complete on server localhost/127.0.0.1:63353, sessionid = 0x13b9be152760003, negotiated timeout = 8000
[junit4:junit4]   2> 608 T2584 oascc.ConnectionManager.process Watcher org.apache.solr.common.cloud.ConnectionManager@299a4c85 name:ZooKeeperConnection Watcher:127.0.0.1:63353/solr got event WatchedEvent state:SyncConnected type:None path:null path:null type:None
[junit4:junit4]   2> 608 T2562 oascc.ConnectionManager.waitForConnected Client is connected to ZooKeeper
[junit4:junit4]   2> 610 T2567 oazs.PrepRequestProcessor.pRequest Got user-level KeeperException when processing sessionid:0x13b9be152760003 type:create cxid:0x2 zxid:0x1a txntype:-1 reqpath:n/a Error Path:/solr/overseer Error:KeeperErrorCode = NodeExists for /solr/overseer
[junit4:junit4]   2> 618 T2562 oascc.SolrZkClient.makePath makePath: /live_nodes
[junit4:junit4]   2> 626 T2562 oasc.ZkController.createEphemeralLiveNode Register node as live in ZooKeeper:/live_nodes/127.0.0.1:63356_
[junit4:junit4]   2> 627 T2567 oazs.PrepRequestProcessor.pRequest Got user-level KeeperException when processing sessionid:0x13b9be152760003 type:delete cxid:0x7 zxid:0x1c txntype:-1 reqpath:n/a Error Path:/solr/live_nodes/127.0.0.1:63356_ Error:KeeperErrorCode = NoNode for /solr/live_nodes/127.0.0.1:63356_
[junit4:junit4]   2> 628 T2562 oascc.SolrZkClient.makePath makePath: /live_nodes/127.0.0.1:63356_
[junit4:junit4]   2> 631 T2562 oashc.HttpShardHandlerFactory.getParameter Setting socketTimeout to: 0
[junit4:junit4]   2> 631 T2562 oashc.HttpShardHandlerFactory.getParameter Setting urlScheme to: http://
[junit4:junit4]   2> 632 T2562 oashc.HttpShardHandlerFactory.getParameter Setting connTimeout to: 0
[junit4:junit4]   2> 633 T2562 oashc.HttpShardHandlerFactory.getParameter Setting maxConnectionsPerHost to: 20
[junit4:junit4]   2> 633 T2562 oashc.HttpShardHandlerFactory.getParameter Setting corePoolSize to: 0
[junit4:junit4]   2> 634 T2562 oashc.HttpShardHandlerFactory.getParameter Setting maximumPoolSize to: 2147483647
[junit4:junit4]   2> 635 T2562 oashc.HttpShardHandlerFactory.getParameter Setting maxThreadIdleTime to: 5
[junit4:junit4]   2> 635 T2562 oashc.HttpShardHandlerFactory.getParameter Setting sizeOfQueue to: -1
[junit4:junit4]   2> 636 T2562 oashc.HttpShardHandlerFactory.getParameter Setting fairnessPolicy to: false
[junit4:junit4]   2> 637 T2562 oascsi.HttpClientUtil.createClient Creating new http client, config:maxConnectionsPerHost=20&maxConnections=10000&socketTimeout=0&connTimeout=0&retry=false
[junit4:junit4]   2> 652 T2562 oascc.SolrZkClient.makePath makePath: /overseer_elect/election
[junit4:junit4]   2> 665 T2567 oazs.PrepRequestProcessor.pRequest Got user-level KeeperException when processing sessionid:0x13b9be152760003 type:delete cxid:0x15 zxid:0x21 txntype:-1 reqpath:n/a Error Path:/solr/overseer_elect/leader Error:KeeperErrorCode = NoNode for /solr/overseer_elect/leader
[junit4:junit4]   2> 666 T2562 oascc.SolrZkClient.makePath makePath: /overseer_elect/leader
[junit4:junit4]   2> 669 T2562 oasc.Overseer.start Overseer (id=88836009717268483-127.0.0.1:63356_-n_0000000000) starting
[junit4:junit4]   2> 670 T2567 oazs.PrepRequestProcessor.pRequest Got user-level KeeperException when processing sessionid:0x13b9be152760003 type:create cxid:0x1a zxid:0x23 txntype:-1 reqpath:n/a Error Path:/solr/overseer Error:KeeperErrorCode = NodeExists for /solr/overseer
[junit4:junit4]   2> 671 T2567 oazs.PrepRequestProcessor.pRequest Got user-level KeeperException when processing sessionid:0x13b9be152760003 type:create cxid:0x1b zxid:0x24 txntype:-1 reqpath:n/a Error Path:/solr/overseer Error:KeeperErrorCode = NodeExists for /solr/overseer
[junit4:junit4]   2> 672 T2567 oazs.PrepRequestProcessor.pRequest Got user-level KeeperException when processing sessionid:0x13b9be152760003 type:create cxid:0x1c zxid:0x25 txntype:-1 reqpath:n/a Error Path:/solr/overseer Error:KeeperErrorCode = NodeExists for /solr/overseer
[junit4:junit4]   2> 682 T2567 oazs.PrepRequestProcessor.pRequest Got user-level KeeperException when processing sessionid:0x13b9be152760003 type:create cxid:0x1d zxid:0x26 txntype:-1 reqpath:n/a Error Path:/solr/overseer Error:KeeperErrorCode = NodeExists for /solr/overseer
[junit4:junit4]   2> 683 T2586 oasc.OverseerCollectionProcessor.run Process current queue of collection messages
[junit4:junit4]   2> 685 T2562 oascc.SolrZkClient.makePath makePath: /clusterstate.json
[junit4:junit4]   2> 688 T2562 oascc.ZkStateReader.createClusterStateWatchersAndUpdate Updating cluster state from ZooKeeper... 
[junit4:junit4]   2> 690 T2585 oasc.Overseer$ClusterStateUpdater.run Starting to work on the main queue
[junit4:junit4]   2> 696 T2587 oasc.CoreContainer.create Creating SolrCore 'collection1' using instanceDir: /usr/home/hudson/hudson-slave/workspace/Lucene-Solr-Tests-trunk-Java6/solr/build/solr-core/test/J0/./org.apache.solr.cloud.SyncSliceTest-controljetty-1355529933730/collection1
[junit4:junit4]   2> 697 T2587 oasc.ZkController.createCollectionZkNode Check for collection zkNode:control_collection
[junit4:junit4]   2> 698 T2587 oasc.ZkController.createCollectionZkNode Collection zkNode exists
[junit4:junit4]   2> 698 T2587 oasc.ZkController.readConfigName Load collection config from:/collections/control_collection
[junit4:junit4]   2> 699 T2587 oasc.SolrResourceLoader.<init> new SolrResourceLoader for directory: '/usr/home/hudson/hudson-slave/workspace/Lucene-Solr-Tests-trunk-Java6/solr/build/solr-core/test/J0/./org.apache.solr.cloud.SyncSliceTest-controljetty-1355529933730/collection1/'
[junit4:junit4]   2> 701 T2587 oasc.SolrResourceLoader.replaceClassLoader Adding 'file:/usr/home/hudson/hudson-slave/workspace/Lucene-Solr-Tests-trunk-Java6/solr/build/solr-core/test/J0/org.apache.solr.cloud.SyncSliceTest-controljetty-1355529933730/collection1/lib/classes/' to classloader
[junit4:junit4]   2> 701 T2587 oasc.SolrResourceLoader.replaceClassLoader Adding 'file:/usr/home/hudson/hudson-slave/workspace/Lucene-Solr-Tests-trunk-Java6/solr/build/solr-core/test/J0/org.apache.solr.cloud.SyncSliceTest-controljetty-1355529933730/collection1/lib/README' to classloader
[junit4:junit4]   2> 757 T2587 oasc.SolrConfig.<init> Using Lucene MatchVersion: LUCENE_50
[junit4:junit4]   2> 835 T2587 oasc.SolrConfig.<init> Loaded SolrConfig: solrconfig.xml
[junit4:junit4]   2> 936 T2587 oass.IndexSchema.readSchema Reading Solr Schema
[junit4:junit4]   2> 942 T2587 oass.IndexSchema.readSchema Schema name=test
[junit4:junit4]   2> 1729 T2587 oass.OpenExchangeRatesOrgProvider.init Initialized with rates=open-exchange-rates.json, refreshInterval=1440.
[junit4:junit4]   2> 1740 T2587 oass.IndexSchema.readSchema default search field in schema is text
[junit4:junit4]   2> 1745 T2587 oass.IndexSchema.readSchema unique key field: id
[junit4:junit4]   2> 1757 T2587 oass.FileExchangeRateProvider.reload Reloading exchange rates from file currency.xml
[junit4:junit4]   2> 1761 T2587 oass.FileExchangeRateProvider.reload Reloading exchange rates from file currency.xml
[junit4:junit4]   2> 1766 T2587 oass.OpenExchangeRatesOrgProvider.reload Reloading exchange rates from open-exchange-rates.json
[junit4:junit4]   2> 1767 T2587 oass.OpenExchangeRatesOrgProvider.reload Reloading exchange rates from open-exchange-rates.json
[junit4:junit4]   2> 1768 T2587 oasc.SolrCore.<init> [collection1] Opening new SolrCore at /usr/home/hudson/hudson-slave/workspace/Lucene-Solr-Tests-trunk-Java6/solr/build/solr-core/test/J0/./org.apache.solr.cloud.SyncSliceTest-controljetty-1355529933730/collection1/, dataDir=./org.apache.solr.cloud.SyncSliceTest-1355529933422/control/data/
[junit4:junit4]   2> 1768 T2587 oasc.JmxMonitoredMap.<init> JMX monitoring is enabled. Adding Solr mbeans to JMX Server: com.sun.jmx.mbeanserver.JmxMBeanServer@418bbf55
[junit4:junit4]   2> 1769 T2587 oasc.SolrCore.initDirectoryFactory solr.StandardDirectoryFactory
[junit4:junit4]   2> 1770 T2587 oasc.CachingDirectoryFactory.get return new directory for /usr/home/hudson/hudson-slave/workspace/Lucene-Solr-Tests-trunk-Java6/solr/build/solr-core/test/J0/./org.apache.solr.cloud.SyncSliceTest-1355529933422/control/data forceNew:false
[junit4:junit4]   2> 1771 T2587 oasc.CachingDirectoryFactory.close Releasing directory:/usr/home/hudson/hudson-slave/workspace/Lucene-Solr-Tests-trunk-Java6/solr/build/solr-core/test/J0/./org.apache.solr.cloud.SyncSliceTest-1355529933422/control/data
[junit4:junit4]   2> 1771 T2587 oasc.SolrCore.getNewIndexDir New index directory detected: old=null new=./org.apache.solr.cloud.SyncSliceTest-1355529933422/control/data/index/
[junit4:junit4]   2> 1772 T2587 oasc.SolrCore.initIndex WARNING [collection1] Solr index directory './org.apache.solr.cloud.SyncSliceTest-1355529933422/control/data/index' doesn't exist. Creating new index...
[junit4:junit4]   2> 1773 T2587 oasc.CachingDirectoryFactory.get return new directory for /usr/home/hudson/hudson-slave/workspace/Lucene-Solr-Tests-trunk-Java6/solr/build/solr-core/test/J0/./org.apache.solr.cloud.SyncSliceTest-1355529933422/control/data/index forceNew:false
[junit4:junit4]   2> 1778 T2587 oasc.SolrDeletionPolicy.onCommit SolrDeletionPolicy.onCommit: commits:num=1
[junit4:junit4]   2> 		commit{dir=RateLimitedDirectoryWrapper(org.apache.lucene.store.NIOFSDirectory@/usr/home/hudson/hudson-slave/workspace/Lucene-Solr-Tests-trunk-Java6/solr/build/solr-core/test/J0/org.apache.solr.cloud.SyncSliceTest-1355529933422/control/data/index lockFactory=org.apache.lucene.store.NativeFSLockFactory@45676ee3),segFN=segments_1,generation=1,filenames=[segments_1]
[junit4:junit4]   2> 1779 T2587 oasc.SolrDeletionPolicy.updateCommits newest commit = 1[segments_1]
[junit4:junit4]   2> 1779 T2587 oasc.CachingDirectoryFactory.close Releasing directory:/usr/home/hudson/hudson-slave/workspace/Lucene-Solr-Tests-trunk-Java6/solr/build/solr-core/test/J0/./org.apache.solr.cloud.SyncSliceTest-1355529933422/control/data/index
[junit4:junit4]   2> 1779 T2587 oasc.SolrCore.initWriters created xml: solr.XMLResponseWriter
[junit4:junit4]   2> 1781 T2587 oasup.UpdateRequestProcessorChain.init inserting DistributedUpdateProcessorFactory into updateRequestProcessorChain "dedupe"
[junit4:junit4]   2> 1782 T2587 oasup.UpdateRequestProcessorChain.init inserting DistributedUpdateProcessorFactory into updateRequestProcessorChain "dedupe-allfields"
[junit4:junit4]   2> 1782 T2587 oasup.UpdateRequestProcessorChain.init inserting DistributedUpdateProcessorFactory into updateRequestProcessorChain "stored_sig"
[junit4:junit4]   2> 1782 T2587 oasup.UpdateRequestProcessorChain.init inserting DistributedUpdateProcessorFactory into updateRequestProcessorChain "uniq-fields"
[junit4:junit4]   2> 1783 T2587 oasup.UpdateRequestProcessorChain.init inserting DistributedUpdateProcessorFactory into updateRequestProcessorChain "distrib-dup-test-chain-implicit"
[junit4:junit4]   2> 1783 T2587 oasc.RequestHandlers.initHandlersFromConfig adding lazy requestHandler: solr.ReplicationHandler
[junit4:junit4]   2> 1784 T2587 oasc.RequestHandlers.initHandlersFromConfig created /replication: solr.ReplicationHandler
[junit4:junit4]   2> 1785 T2587 oasc.RequestHandlers.initHandlersFromConfig created standard: solr.StandardRequestHandler
[junit4:junit4]   2> 1785 T2587 oasc.RequestHandlers.initHandlersFromConfig created /get: solr.RealTimeGetHandler
[junit4:junit4]   2> 1786 T2587 oasc.RequestHandlers.initHandlersFromConfig created dismax: solr.SearchHandler
[junit4:junit4]   2> 1787 T2587 oasc.RequestHandlers.initHandlersFromConfig created mock: org.apache.solr.core.MockQuerySenderListenerReqHandler
[junit4:junit4]   2> 1787 T2587 oasc.RequestHandlers.initHandlersFromConfig created /admin/: org.apache.solr.handler.admin.AdminHandlers
[junit4:junit4]   2> 1788 T2587 oasc.RequestHandlers.initHandlersFromConfig created defaults: solr.StandardRequestHandler
[junit4:junit4]   2> 1788 T2587 oasc.RequestHandlers.initHandlersFromConfig adding lazy requestHandler: solr.StandardRequestHandler
[junit4:junit4]   2> 1789 T2587 oasc.RequestHandlers.initHandlersFromConfig created lazy: solr.StandardRequestHandler
[junit4:junit4]   2> 1790 T2587 oasc.RequestHandlers.initHandlersFromConfig created /update: solr.UpdateRequestHandler
[junit4:junit4]   2> 1790 T2587 oasc.RequestHandlers.initHandlersFromConfig created /terms: org.apache.solr.handler.component.SearchHandler
[junit4:junit4]   2> 1791 T2587 oasc.RequestHandlers.initHandlersFromConfig created spellCheckCompRH: org.apache.solr.handler.component.SearchHandler
[junit4:junit4]   2> 1792 T2587 oasc.RequestHandlers.initHandlersFromConfig created spellCheckCompRH_Direct: org.apache.solr.handler.component.SearchHandler
[junit4:junit4]   2> 1793 T2587 oasc.RequestHandlers.initHandlersFromConfig created spellCheckWithWordbreak: org.apache.solr.handler.component.SearchHandler
[junit4:junit4]   2> 1793 T2587 oasc.RequestHandlers.initHandlersFromConfig created spellCheckWithWordbreak_Direct: org.apache.solr.handler.component.SearchHandler
[junit4:junit4]   2> 1794 T2587 oasc.RequestHandlers.initHandlersFromConfig created spellCheckCompRH1: org.apache.solr.handler.component.SearchHandler
[junit4:junit4]   2> 1795 T2587 oasc.RequestHandlers.initHandlersFromConfig created mltrh: org.apache.solr.handler.component.SearchHandler
[junit4:junit4]   2> 1796 T2587 oasc.RequestHandlers.initHandlersFromConfig created tvrh: org.apache.solr.handler.component.SearchHandler
[junit4:junit4]   2> 1797 T2587 oasc.RequestHandlers.initHandlersFromConfig created /mlt: solr.MoreLikeThisHandler
[junit4:junit4]   2> 1797 T2587 oasc.RequestHandlers.initHandlersFromConfig created /debug/dump: solr.DumpRequestHandler
[junit4:junit4]   2> 1804 T2587 oashl.XMLLoader.init xsltCacheLifetimeSeconds=60
[junit4:junit4]   2> 1808 T2587 oasc.SolrCore.initDeprecatedSupport WARNING solrconfig.xml uses deprecated <admin/gettableFiles>, Please update your config to use the ShowFileRequestHandler.
[junit4:junit4]   2> 1809 T2587 oasc.SolrCore.initDeprecatedSupport WARNING adding ShowFileRequestHandler with hidden files: [SCHEMA.XML, OLD_SYNONYMS.TXT, STOPWORDS.TXT, PROTWORDS.TXT, OPEN-EXCHANGE-RATES.JSON, SYNONYMS.TXT, CURRENCY.XML, MAPPING-ISOLATIN1ACCENT.TXT]
[junit4:junit4]   2> 1812 T2587 oasc.CachingDirectoryFactory.close Releasing directory:/usr/home/hudson/hudson-slave/workspace/Lucene-Solr-Tests-trunk-Java6/solr/build/solr-core/test/J0/./org.apache.solr.cloud.SyncSliceTest-1355529933422/control/data
[junit4:junit4]   2> 1813 T2587 oass.SolrIndexSearcher.<init> Opening Searcher@45fdaaba main
[junit4:junit4]   2> 1815 T2587 oasu.CommitTracker.<init> Hard AutoCommit: disabled
[junit4:junit4]   2> 1815 T2587 oasu.CommitTracker.<init> Soft AutoCommit: disabled
[junit4:junit4]   2> 1815 T2587 oashc.SpellCheckComponent.inform Initializing spell checkers
[junit4:junit4]   2> 1833 T2587 oass.DirectSolrSpellChecker.init init: {name=direct,classname=DirectSolrSpellChecker,field=lowerfilt,minQueryLength=3}
[junit4:junit4]   2> 1880 T2588 oasc.SolrCore.registerSearcher [collection1] Registered new searcher Searcher@45fdaaba main{StandardDirectoryReader(segments_1:1)}
[junit4:junit4]   2> 1883 T2587 oasc.ZkController.publish publishing core=collection1 state=down
[junit4:junit4]   2> 1883 T2587 oasc.ZkController.publish numShards not found on descriptor - reading it from system property
[junit4:junit4]   2> 1883 T2567 oazs.PrepRequestProcessor.pRequest Got user-level KeeperException when processing sessionid:0x13b9be152760003 type:create cxid:0x56 zxid:0x29 txntype:-1 reqpath:n/a Error Path:/solr/overseer/queue Error:KeeperErrorCode = NoNode for /solr/overseer/queue
[junit4:junit4]   2> 2197 T2585 oascc.ZkStateReader.updateClusterState Updating cloud state from ZooKeeper... 
[junit4:junit4]   2> 2198 T2585 oasc.Overseer$ClusterStateUpdater.updateState Update state numShards=1 message={
[junit4:junit4]   2> 	  "operation":"state",
[junit4:junit4]   2> 	  "numShards":"1",
[junit4:junit4]   2> 	  "shard":null,
[junit4:junit4]   2> 	  "roles":null,
[junit4:junit4]   2> 	  "state":"down",
[junit4:junit4]   2> 	  "core":"collection1",
[junit4:junit4]   2> 	  "collection":"control_collection",
[junit4:junit4]   2> 	  "node_name":"127.0.0.1:63356_",
[junit4:junit4]   2> 	  "base_url":"http://127.0.0.1:63356"}
[junit4:junit4]   2> 2198 T2585 oasc.Overseer$ClusterStateUpdater.createCollection Create collection control_collection with numShards 1
[junit4:junit4]   2> 2198 T2585 oasc.Overseer$ClusterStateUpdater.updateState Assigning new node to shard shard=shard1
[junit4:junit4]   2> 2199 T2567 oazs.PrepRequestProcessor.pRequest Got user-level KeeperException when processing sessionid:0x13b9be152760003 type:create cxid:0x5e zxid:0x2c txntype:-1 reqpath:n/a Error Path:/solr/overseer/queue-work Error:KeeperErrorCode = NoNode for /solr/overseer/queue-work
[junit4:junit4]   2> 2217 T2584 oascc.ZkStateReader$2.process A cluster state change: WatchedEvent state:SyncConnected type:NodeDataChanged path:/clusterstate.json, has occurred - updating... (live nodes size: 1)
[junit4:junit4]   2> 2397 T2587 oasc.CoreContainer.registerCore registering core: collection1
[junit4:junit4]   2> 2397 T2587 oasc.ZkController.register Register shard - core:collection1 address:http://127.0.0.1:63356 shardId:shard1
[junit4:junit4]   2> 2398 T2587 oascc.SolrZkClient.makePath makePath: /collections/control_collection/leader_elect/shard1/election
[junit4:junit4]   2> 2429 T2567 oazs.PrepRequestProcessor.pRequest Got user-level KeeperException when processing sessionid:0x13b9be152760003 type:delete cxid:0x78 zxid:0x36 txntype:-1 reqpath:n/a Error Path:/solr/collections/control_collection/leaders Error:KeeperErrorCode = NoNode for /solr/collections/control_collection/leaders
[junit4:junit4]   2> 2436 T2587 oasc.ShardLeaderElectionContext.runLeaderProcess Running the leader process.
[junit4:junit4]   2> 2436 T2567 oazs.PrepRequestProcessor.pRequest Got user-level KeeperException when processing sessionid:0x13b9be152760003 type:create cxid:0x79 zxid:0x37 txntype:-1 reqpath:n/a Error Path:/solr/overseer Error:KeeperErrorCode = NodeExists for /solr/overseer
[junit4:junit4]   2> 2439 T2587 oasc.ShardLeaderElectionContext.waitForReplicasToComeUp Enough replicas found to continue.
[junit4:junit4]   2> 2439 T2587 oasc.ShardLeaderElectionContext.runLeaderProcess I may be the new leader - try and sync
[junit4:junit4]   2> 2440 T2587 oasc.SyncStrategy.sync Sync replicas to http://127.0.0.1:63356/collection1/
[junit4:junit4]   2> 2440 T2587 oasc.SyncStrategy.syncReplicas Sync Success - now sync replicas to me
[junit4:junit4]   2> 2440 T2587 oasc.SyncStrategy.syncToMe http://127.0.0.1:63356/collection1/ has no replicas
[junit4:junit4]   2> 2441 T2587 oasc.ShardLeaderElectionContext.runLeaderProcess I am the new leader: http://127.0.0.1:63356/collection1/
[junit4:junit4]   2> 2441 T2587 oascc.SolrZkClient.makePath makePath: /collections/control_collection/leaders/shard1
[junit4:junit4]   2> 2450 T2567 oazs.PrepRequestProcessor.pRequest Got user-level KeeperException when processing sessionid:0x13b9be152760003 type:create cxid:0x83 zxid:0x3b txntype:-1 reqpath:n/a Error Path:/solr/overseer Error:KeeperErrorCode = NodeExists for /solr/overseer
[junit4:junit4]   2> 2727 T2585 oascc.ZkStateReader.updateClusterState Updating cloud state from ZooKeeper... 
[junit4:junit4]   2> 2745 T2584 oascc.ZkStateReader$2.process A cluster state change: WatchedEvent state:SyncConnected type:NodeDataChanged path:/clusterstate.json, has occurred - updating... (live nodes size: 1)
[junit4:junit4]   2> 2763 T2587 oasc.ZkController.register We are http://127.0.0.1:63356/collection1/ and leader is http://127.0.0.1:63356/collection1/
[junit4:junit4]   2> 2763 T2587 oasc.ZkController.register No LogReplay needed for core=collection1 baseURL=http://127.0.0.1:63356
[junit4:junit4]   2> 2763 T2587 oasc.ZkController.checkRecovery I am the leader, no recovery necessary
[junit4:junit4]   2> 2764 T2587 oasc.ZkController.publish publishing core=collection1 state=active
[junit4:junit4]   2> 2764 T2587 oasc.ZkController.publish numShards not found on descriptor - reading it from system property
[junit4:junit4]   2> 2766 T2587 oascc.ZkStateReader.updateClusterState Updating cloud state from ZooKeeper... 
[junit4:junit4]   2> 2767 T2562 oass.SolrDispatchFilter.init user.dir=/usr/home/hudson/hudson-slave/workspace/Lucene-Solr-Tests-trunk-Java6/solr/build/solr-core/test/J0
[junit4:junit4]   2> 2768 T2562 oass.SolrDispatchFilter.init SolrDispatchFilter.init() done
[junit4:junit4]   2> 2769 T2562 oascsi.HttpClientUtil.createClient Creating new http client, config:maxConnections=128&maxConnectionsPerHost=32&followRedirects=false
[junit4:junit4]   2> 2781 T2562 oascsi.HttpClientUtil.createClient Creating new http client, config:
[junit4:junit4]   2> 2788 T2562 oaz.ZooKeeper.<init> Initiating client connection, connectString=127.0.0.1:63353/solr sessionTimeout=10000 watcher=org.apache.solr.common.cloud.ConnectionManager@54c4b735
[junit4:junit4]   2> 2790 T2562 oascc.ConnectionManager.waitForConnected Waiting for client to connect to ZooKeeper
[junit4:junit4]   2> 2790 T2589 oaz.ClientCnxn$SendThread.logStartConnect Opening socket connection to server localhost/127.0.0.1:63353. Will not attempt to authenticate using SASL (access denied (javax.security.auth.AuthPermission getLoginConfiguration))
[junit4:junit4]   2> 2790 T2589 oaz.ClientCnxn$SendThread.primeConnection Socket connection established to localhost/127.0.0.1:63353, initiating session
[junit4:junit4]   2> 2791 T2564 oazs.NIOServerCnxnFactory.run Accepted socket connection from /140.211.11.196:63370
[junit4:junit4]   2> 2791 T2564 oazs.ZooKeeperServer.processConnectRequest Client attempting to establish new session at /140.211.11.196:63370
[junit4:junit4]   2> 2792 T2566 oazs.ZooKeeperServer.finishSessionInit Established session 0x13b9be152760004 with negotiated timeout 10000 for client /140.211.11.196:63370
[junit4:junit4]   2> 2792 T2589 oaz.ClientCnxn$SendThread.onConnected Session establishment complete on server localhost/127.0.0.1:63353, sessionid = 0x13b9be152760004, negotiated timeout = 10000
[junit4:junit4]   2> 2792 T2590 oascc.ConnectionManager.process Watcher org.apache.solr.common.cloud.ConnectionManager@54c4b735 name:ZooKeeperConnection Watcher:127.0.0.1:63353/solr got event WatchedEvent state:SyncConnected type:None path:null path:null type:None
[junit4:junit4]   2> 2793 T2562 oascc.ConnectionManager.waitForConnected Client is connected to ZooKeeper
[junit4:junit4]   2> 2794 T2562 oascc.ZkStateReader.createClusterStateWatchersAndUpdate Updating cluster state from ZooKeeper... 
[junit4:junit4]   2> 2795 T2562 oasc.ChaosMonkey.monkeyLog monkey: init - expire sessions:true cause connection loss:true
[junit4:junit4]   2> 2950 T2562 oejs.Server.doStart jetty-8.1.8.v20121106
[junit4:junit4]   2> 2954 T2562 oejs.AbstractConnector.doStart Started SocketConnector@127.0.0.1:63371
[junit4:junit4]   2> 2955 T2562 oasc.SolrResourceLoader.locateSolrHome JNDI not configured for solr (NoInitialContextEx)
[junit4:junit4]   2> 2955 T2562 oasc.SolrResourceLoader.locateSolrHome using system property solr.solr.home: /usr/home/hudson/hudson-slave/workspace/Lucene-Solr-Tests-trunk-Java6/solr/build/solr-core/test/J0/./org.apache.solr.cloud.SyncSliceTest-jetty1-1355529936212
[junit4:junit4]   2> 2956 T2562 oasc.SolrResourceLoader.<init> new SolrResourceLoader for deduced Solr Home: '/usr/home/hudson/hudson-slave/workspace/Lucene-Solr-Tests-trunk-Java6/solr/build/solr-core/test/J0/./org.apache.solr.cloud.SyncSliceTest-jetty1-1355529936212/'
[junit4:junit4]   2> 2991 T2562 oass.SolrDispatchFilter.init SolrDispatchFilter.init()
[junit4:junit4]   2> 2992 T2562 oasc.SolrResourceLoader.locateSolrHome JNDI not configured for solr (NoInitialContextEx)
[junit4:junit4]   2> 2993 T2562 oasc.SolrResourceLoader.locateSolrHome using system property solr.solr.home: /usr/home/hudson/hudson-slave/workspace/Lucene-Solr-Tests-trunk-Java6/solr/build/solr-core/test/J0/./org.apache.solr.cloud.SyncSliceTest-jetty1-1355529936212
[junit4:junit4]   2> 2993 T2562 oasc.CoreContainer$Initializer.initialize looking for solr.xml: /usr/home/hudson/hudson-slave/workspace/Lucene-Solr-Tests-trunk-Java6/solr/build/solr-core/test/J0/./org.apache.solr.cloud.SyncSliceTest-jetty1-1355529936212/solr.xml
[junit4:junit4]   2> 2994 T2562 oasc.CoreContainer.<init> New CoreContainer 579284737
[junit4:junit4]   2> 2995 T2562 oasc.CoreContainer.load Loading CoreContainer using Solr Home: '/usr/home/hudson/hudson-slave/workspace/Lucene-Solr-Tests-trunk-Java6/solr/build/solr-core/test/J0/./org.apache.solr.cloud.SyncSliceTest-jetty1-1355529936212/'
[junit4:junit4]   2> 2996 T2562 oasc.SolrResourceLoader.<init> new SolrResourceLoader for directory: '/usr/home/hudson/hudson-slave/workspace/Lucene-Solr-Tests-trunk-Java6/solr/build/solr-core/test/J0/./org.apache.solr.cloud.SyncSliceTest-jetty1-1355529936212/'
[junit4:junit4]   2> 3026 T2562 oasc.CoreContainer.load Registering Log Listener
[junit4:junit4]   2> 3043 T2562 oasc.CoreContainer.initZooKeeper Zookeeper client=127.0.0.1:63353/solr
[junit4:junit4]   2> 3043 T2562 oasc.ZkController.checkChrootPath zkHost includes chroot
[junit4:junit4]   2> 3044 T2562 oaz.ZooKeeper.<init> Initiating client connection, connectString=127.0.0.1:63353 sessionTimeout=60000 watcher=org.apache.solr.common.cloud.ConnectionManager@14a29ba
[junit4:junit4]   2> 3046 T2600 oaz.ClientCnxn$SendThread.logStartConnect Opening socket connection to server localhost/127.0.0.1:63353. Will not attempt to authenticate using SASL (access denied (javax.security.auth.AuthPermission getLoginConfiguration))
[junit4:junit4]   2> 3045 T2562 oascc.ConnectionManager.waitForConnected Waiting for client to connect to ZooKeeper
[junit4:junit4]   2> 3047 T2600 oaz.ClientCnxn$SendThread.primeConnection Socket connection established to localhost/127.0.0.1:63353, initiating session
[junit4:junit4]   2> 3047 T2564 oazs.NIOServerCnxnFactory.run Accepted socket connection from /140.211.11.196:63372
[junit4:junit4]   2> 3047 T2564 oazs.ZooKeeperServer.processConnectRequest Client attempting to establish new session at /140.211.11.196:63372
[junit4:junit4]   2> 3049 T2566 oazs.ZooKeeperServer.finishSessionInit Established session 0x13b9be152760005 with negotiated timeout 20000 for client /140.211.11.196:63372
[junit4:junit4]   2> 3049 T2600 oaz.ClientCnxn$SendThread.onConnected Session establishment complete on server localhost/127.0.0.1:63353, sessionid = 0x13b9be152760005, negotiated timeout = 20000
[junit4:junit4]   2> 3050 T2601 oascc.ConnectionManager.process Watcher org.apache.solr.common.cloud.ConnectionManager@14a29ba name:ZooKeeperConnection Watcher:127.0.0.1:63353 got event WatchedEvent state:SyncConnected type:None path:null path:null type:None
[junit4:junit4]   2> 3050 T2562 oascc.ConnectionManager.waitForConnected Client is connected to ZooKeeper
[junit4:junit4]   2> 3051 T2567 oazs.PrepRequestProcessor.pRequest2Txn Processed session termination for sessionid: 0x13b9be152760005
[junit4:junit4]   2> 3059 T2601 oaz.ClientCnxn$EventThread.run EventThread shut down
[junit4:junit4]   2> 3059 T2564 oazs.NIOServerCnxn.closeSock Closed socket connection for client /140.211.11.196:63372 which had sessionid 0x13b9be152760005
[junit4:junit4]   2> 3059 T2562 oaz.ZooKeeper.close Session: 0x13b9be152760005 closed
[junit4:junit4]   2> 3060 T2562 oaz.ZooKeeper.<init> Initiating client connection, connectString=127.0.0.1:63353/solr sessionTimeout=8000 watcher=org.apache.solr.common.cloud.ConnectionManager@3e520ecd
[junit4:junit4]   2> 3061 T2602 oaz.ClientCnxn$SendThread.logStartConnect Opening socket connection to server localhost/127.0.0.1:63353. Will not attempt to authenticate using SASL (access denied (javax.security.auth.AuthPermission getLoginConfiguration))
[junit4:junit4]   2> 3061 T2562 oascc.ConnectionManager.waitForConnected Waiting for client to connect to ZooKeeper
[junit4:junit4]   2> 3062 T2602 oaz.ClientCnxn$SendThread.primeConnection Socket connection established to localhost/127.0.0.1:63353, initiating session
[junit4:junit4]   2> 3062 T2564 oazs.NIOServerCnxnFactory.run Accepted socket connection from /140.211.11.196:63373
[junit4:junit4]   2> 3062 T2564 oazs.ZooKeeperServer.processConnectRequest Client attempting to establish new session at /140.211.11.196:63373
[junit4:junit4]   2> 3063 T2566 oazs.ZooKeeperServer.finishSessionInit Established session 0x13b9be152760006 with negotiated timeout 8000 for client /140.211.11.196:63373
[junit4:junit4]   2> 3064 T2602 oaz.ClientCnxn$SendThread.onConnected Session establishment complete on server localhost/127.0.0.1:63353, sessionid = 0x13b9be152760006, negotiated timeout = 8000
[junit4:junit4]   2> 3064 T2603 oascc.ConnectionManager.process Watcher org.apache.solr.common.cloud.ConnectionManager@3e520ecd name:ZooKeeperConnection Watcher:127.0.0.1:63353/solr got event WatchedEvent state:SyncConnected type:None path:null path:null type:None
[junit4:junit4]   2> 3064 T2562 oascc.ConnectionManager.waitForConnected Client is connected to ZooKeeper
[junit4:junit4]   2> 3065 T2567 oazs.PrepRequestProcessor.pRequest Got user-level KeeperException when processing sessionid:0x13b9be152760006 type:create cxid:0x1 zxid:0x49 txntype:-1 reqpath:n/a Error Path:/solr/overseer Error:KeeperErrorCode = NodeExists for /solr/overseer
[junit4:junit4]   2> 3067 T2567 oazs.PrepRequestProcessor.pRequest Got user-level KeeperException when processing sessionid:0x13b9be152760006 type:create cxid:0x2 zxid:0x4a txntype:-1 reqpath:n/a Error Path:/solr/overseer Error:KeeperErrorCode = NodeExists for /solr/overseer
[junit4:junit4]   2> 3074 T2562 oasc.ZkController.createEphemeralLiveNode Register node as live in ZooKeeper:/live_nodes/127.0.0.1:63371_
[junit4:junit4]   2> 3075 T2567 oazs.PrepRequestProcessor.pRequest Got user-level KeeperException when processing sessionid:0x13b9be152760006 type:delete cxid:0x4 zxid:0x4b txntype:-1 reqpath:n/a Error Path:/solr/live_nodes/127.0.0.1:63371_ Error:KeeperErrorCode = NoNode for /solr/live_nodes/127.0.0.1:63371_
[junit4:junit4]   2> 3076 T2562 oascc.SolrZkClient.makePath makePath: /live_nodes/127.0.0.1:63371_
[junit4:junit4]   2> 3079 T2590 oascc.ZkStateReader$3.process Updating live nodes... (2)
[junit4:junit4]   2> 3080 T2584 oascc.ZkStateReader$3.process Updating live nodes... (2)
[junit4:junit4]   2> 3080 T2584 oascc.ZkStateReader$2.process A cluster state change: WatchedEvent state:SyncConnected type:NodeChildrenChanged path:/live_nodes, has occurred - updating... (live nodes size: 2)
[junit4:junit4]   2> 3080 T2562 oashc.HttpShardHandlerFactory.getParameter Setting socketTimeout to: 0
[junit4:junit4]   2> 3081 T2562 oashc.HttpShardHandlerFactory.getParameter Setting urlScheme to: http://
[junit4:junit4]   2> 3081 T2562 oashc.HttpShardHandlerFactory.getParameter Setting connTimeout to: 0
[junit4:junit4]   2> 3082 T2562 oashc.HttpShardHandlerFactory.getParameter Setting maxConnectionsPerHost to: 20
[junit4:junit4]   2> 3083 T2562 oashc.HttpShardHandlerFactory.getParameter Setting corePoolSize to: 0
[junit4:junit4]   2> 3083 T2562 oashc.HttpShardHandlerFactory.getParameter Setting maximumPoolSize to: 2147483647
[junit4:junit4]   2> 3084 T2562 oashc.HttpShardHandlerFactory.getParameter Setting maxThreadIdleTime to: 5
[junit4:junit4]   2> 3084 T2562 oashc.HttpShardHandlerFactory.getParameter Setting sizeOfQueue to: -1
[junit4:junit4]   2> 3085 T2562 oashc.HttpShardHandlerFactory.getParameter Setting fairnessPolicy to: false
[junit4:junit4]   2> 3086 T2562 oascsi.HttpClientUtil.createClient Creating new http client, config:maxConnectionsPerHost=20&maxConnections=10000&socketTimeout=0&connTimeout=0&retry=false
[junit4:junit4]   2> 3101 T2562 oascc.ZkStateReader.createClusterStateWatchersAndUpdate Updating cluster state from ZooKeeper... 
[junit4:junit4]   2> 3109 T2604 oasc.CoreContainer.create Creating SolrCore 'collection1' using instanceDir: /usr/home/hudson/hudson-slave/workspace/Lucene-Solr-Tests-trunk-Java6/solr/build/solr-core/test/J0/./org.apache.solr.cloud.SyncSliceTest-jetty1-1355529936212/collection1
[junit4:junit4]   2> 3109 T2604 oasc.ZkController.createCollectionZkNode Check for collection zkNode:collection1
[junit4:junit4]   2> 3110 T2604 oasc.ZkController.createCollectionZkNode Collection zkNode exists
[junit4:junit4]   2> 3110 T2604 oasc.ZkController.readConfigName Load collection config from:/collections/collection1
[junit4:junit4]   2> 3112 T2604 oasc.SolrResourceLoader.<init> new SolrResourceLoader for directory: '/usr/home/hudson/hudson-slave/workspace/Lucene-Solr-Tests-trunk-Java6/solr/build/solr-core/test/J0/./org.apache.solr.cloud.SyncSliceTest-jetty1-1355529936212/collection1/'
[junit4:junit4]   2> 3113 T2604 oasc.SolrResourceLoader.replaceClassLoader Adding 'file:/usr/home/hudson/hudson-slave/workspace/Lucene-Solr-Tests-trunk-Java6/solr/build/solr-core/test/J0/org.apache.solr.cloud.SyncSliceTest-jetty1-1355529936212/collection1/lib/README' to classloader
[junit4:junit4]   2> 3113 T2604 oasc.SolrResourceLoader.replaceClassLoader Adding 'file:/usr/home/hudson/hudson-slave/workspace/Lucene-Solr-Tests-trunk-Java6/solr/build/solr-core/test/J0/org.apache.solr.cloud.SyncSliceTest-jetty1-1355529936212/collection1/lib/classes/' to classloader
[junit4:junit4]   2> 3165 T2604 oasc.SolrConfig.<init> Using Lucene MatchVersion: LUCENE_50
[junit4:junit4]   2> 3235 T2604 oasc.SolrConfig.<init> Loaded SolrConfig: solrconfig.xml
[junit4:junit4]   2> 3256 T2585 oascc.ZkStateReader.updateClusterState Updating cloud state from ZooKeeper... 
[junit4:junit4]   2> 3257 T2585 oasc.Overseer$ClusterStateUpdater.updateState Update state numShards=1 message={
[junit4:junit4]   2> 	  "operation":"state",
[junit4:junit4]   2> 	  "numShards":"1",
[junit4:junit4]   2> 	  "shard":"shard1",
[junit4:junit4]   2> 	  "roles":null,
[junit4:junit4]   2> 	  "state":"active",
[junit4:junit4]   2> 	  "core":"collection1",
[junit4:junit4]   2> 	  "collection":"control_collection",
[junit4:junit4]   2> 	  "node_name":"127.0.0.1:63356_",
[junit4:junit4]   2> 	  "base_url":"http://127.0.0.1:63356"}
[junit4:junit4]   2> 3270 T2584 oascc.ZkStateReader$2.process A cluster state change: WatchedEvent state:SyncConnected type:NodeDataChanged path:/clusterstate.json, has occurred - updating... (live nodes size: 2)
[junit4:junit4]   2> 3270 T2590 oascc.ZkStateReader$2.process A cluster state change: WatchedEvent state:SyncConnected type:NodeDataChanged path:/clusterstate.json, has occurred - updating... (live nodes size: 2)
[junit4:junit4]   2> 3336 T2603 oascc.ZkStateReader$2.process A cluster state change: WatchedEvent state:SyncConnected type:NodeDataChanged path:/clusterstate.json, has occurred - updating... (live nodes size: 2)
[junit4:junit4]   2> 3336 T2604 oass.IndexSchema.readSchema Reading Solr Schema
[junit4:junit4]   2> 3343 T2604 oass.IndexSchema.readSchema Schema name=test
[junit4:junit4]   2> 3976 T2604 oass.OpenExchangeRatesOrgProvider.init Initialized with rates=open-exchange-rates.json, refreshInterval=1440.
[junit4:junit4]   2> 3988 T2604 oass.IndexSchema.readSchema default search field in schema is text
[junit4:junit4]   2> 3992 T2604 oass.IndexSchema.readSchema unique key field: id
[junit4:junit4]   2> 4004 T2604 oass.FileExchangeRateProvider.reload Reloading exchange rates from file currency.xml
[junit4:junit4]   2> 4008 T2604 oass.FileExchangeRateProvider.reload Reloading exchange rates from file currency.xml
[junit4:junit4]   2> 4013 T2604 oass.OpenExchangeRatesOrgProvider.reload Reloading exchange rates from open-exchange-rates.json
[junit4:junit4]   2> 4014 T2604 oass.OpenExchangeRatesOrgProvider.reload Reloading exchange rates from open-exchange-rates.json
[junit4:junit4]   2> 4015 T2604 oasc.SolrCore.<init> [collection1] Opening new SolrCore at /usr/home/hudson/hudson-slave/workspace/Lucene-Solr-Tests-trunk-Java6/solr/build/solr-core/test/J0/./org.apache.solr.cloud.SyncSliceTest-jetty1-1355529936212/collection1/, dataDir=./org.apache.solr.cloud.SyncSliceTest-1355529933422/jetty1/
[junit4:junit4]   2> 4015 T2604 oasc.JmxMonitoredMap.<init> JMX monitoring is enabled. Adding Solr mbeans to JMX Server: com.sun.jmx.mbeanserver.JmxMBeanServer@418bbf55
[junit4:junit4]   2> 4016 T2604 oasc.SolrCore.initDirectoryFactory solr.StandardDirectoryFactory
[junit4:junit4]   2> 4017 T2604 oasc.CachingDirectoryFactory.get return new directory for /usr/home/hudson/hudson-slave/workspace/Lucene-Solr-Tests-trunk-Java6/solr/build/solr-core/test/J0/./org.apache.solr.cloud.SyncSliceTest-1355529933422/jetty1 forceNew:false
[junit4:junit4]   2> 4017 T2604 oasc.CachingDirectoryFactory.close Releasing directory:/usr/home/hudson/hudson-slave/workspace/Lucene-Solr-Tests-trunk-Java6/solr/build/solr-core/test/J0/./org.apache.solr.cloud.SyncSliceTest-1355529933422/jetty1
[junit4:junit4]   2> 4018 T2604 oasc.SolrCore.getNewIndexDir New index directory detected: old=null new=./org.apache.solr.cloud.SyncSliceTest-1355529933422/jetty1/index/
[junit4:junit4]   2> 4018 T2604 oasc.SolrCore.initIndex WARNING [collection1] Solr index directory './org.apache.solr.cloud.SyncSliceTest-1355529933422/jetty1/index' doesn't exist. Creating new index...
[junit4:junit4]   2> 4019 T2604 oasc.CachingDirectoryFactory.get return new directory for /usr/home/hudson/hudson-slave/workspace/Lucene-Solr-Tests-trunk-Java6/solr/build/solr-core/test/J0/./org.apache.solr.cloud.SyncSliceTest-1355529933422/jetty1/index forceNew:false
[junit4:junit4]   2> 4025 T2604 oasc.SolrDeletionPolicy.onCommit SolrDeletionPolicy.onCommit: commits:num=1
[junit4:junit4]   2> 		commit{dir=RateLimitedDirectoryWrapper(org.apache.lucene.store.NIOFSDirectory@/usr/home/hudson/hudson-slave/workspace/Lucene-Solr-Tests-trunk-Java6/solr/build/solr-core/test/J0/org.apache.solr.cloud.SyncSliceTest-1355529933422/jetty1/index lockFactory=org.apache.lucene.store.NativeFSLockFactory@57a2e170),segFN=segments_1,generation=1,filenames=[segments_1]
[junit4:junit4]   2> 4025 T2604 oasc.SolrDeletionPolicy.updateCommits newest commit = 1[segments_1]
[junit4:junit4]   2> 4026 T2604 oasc.CachingDirectoryFactory.close Releasing directory:/usr/home/hudson/hudson-slave/workspace/Lucene-Solr-Tests-trunk-Java6/solr/build/solr-core/test/J0/./org.apache.solr.cloud.SyncSliceTest-1355529933422/jetty1/index
[junit4:junit4]   2> 4026 T2604 oasc.SolrCore.initWriters created xml: solr.XMLResponseWriter
[junit4:junit4]   2> 4028 T2604 oasup.UpdateRequestProcessorChain.init inserting DistributedUpdateProcessorFactory into updateRequestProcessorChain "dedupe"
[junit4:junit4]   2> 4029 T2604 oasup.UpdateRequestProcessorChain.init inserting DistributedUpdateProcessorFactory into updateRequestProcessorChain "dedupe-allfields"
[junit4:junit4]   2> 4029 T2604 oasup.UpdateRequestProcessorChain.init inserting DistributedUpdateProcessorFactory into updateRequestProcessorChain "stored_sig"
[junit4:junit4]   2> 4029 T2604 oasup.UpdateRequestProcessorChain.init inserting DistributedUpdateProcessorFactory into updateRequestProcessorChain "uniq-fields"
[junit4:junit4]   2> 4030 T2604 oasup.UpdateRequestProcessorChain.init inserting DistributedUpdateProcessorFactory into updateRequestProcessorChain "distrib-dup-test-chain-implicit"
[junit4:junit4]   2> 4030 T2604 oasc.RequestHandlers.initHandlersFromConfig adding lazy requestHandler: solr.ReplicationHandler
[junit4:junit4]   2> 4031 T2604 oasc.RequestHandlers.initHandlersFromConfig created /replication: solr.ReplicationHandler
[junit4:junit4]   2> 4032 T2604 oasc.RequestHandlers.initHandlersFromConfig created standard: solr.StandardRequestHandler
[junit4:junit4]   2> 4032 T2604 oasc.RequestHandlers.initHandlersFromConfig created /get: solr.RealTimeGetHandler
[junit4:junit4]   2> 4033 T2604 oasc.RequestHandlers.initHandlersFromConfig created dismax: solr.SearchHandler
[junit4:junit4]   2> 4034 T2604 oasc.RequestHandlers.initHandlersFromConfig created mock: org.apache.solr.core.MockQuerySenderListenerReqHandler
[junit4:junit4]   2> 4035 T2604 oasc.RequestHandlers.initHandlersFromConfig created /admin/: org.apache.solr.handler.admin.AdminHandlers
[junit4:junit4]   2> 4035 T2604 oasc.RequestHandlers.initHandlersFromConfig created defaults: solr.StandardRequestHandler
[junit4:junit4]   2> 4036 T2604 oasc.RequestHandlers.initHandlersFromConfig adding lazy requestHandler: solr.StandardRequestHandler
[junit4:junit4]   2> 4036 T2604 oasc.RequestHandlers.initHandlersFromConfig created lazy: solr.StandardRequestHandler
[junit4:junit4]   2> 4037 T2604 oasc.RequestHandlers.initHandlersFromConfig created /update: solr.UpdateRequestHandler
[junit4:junit4]   2> 4038 T2604 oasc.RequestHandlers.initHandlersFromConfig created /terms: org.apache.solr.handler.component.SearchHandler
[junit4:junit4]   2> 4039 T2604 oasc.RequestHandlers.initHandlersFromConfig created spellCheckCompRH: org.apache.solr.handler.component.SearchHandler
[junit4:junit4]   2> 4039 T2604 oasc.RequestHandlers.initHandlersFromConfig created spellCheckCompRH_Direct: org.apache.solr.handler.component.SearchHandler
[junit4:junit4]   2> 4040 T2604 oasc.RequestHandlers.initHandlersFromConfig created spellCheckWithWordbreak: org.apache.solr.handler.component.SearchHandler
[junit4:junit4]   2> 4041 T2604 oasc.RequestHandlers.initHandlersFromConfig created spellCheckWithWordbreak_Direct: org.apache.solr.handler.component.SearchHandler
[junit4:junit4]   2> 4042 T2604 oasc.RequestHandlers.initHandlersFromConfig created spellCheckCompRH1: org.apache.solr.handler.component.SearchHandler
[junit4:junit4]   2> 4043 T2604 oasc.RequestHandlers.initHandlersFromConfig created mltrh: org.apache.solr.handler.component.SearchHandler
[junit4:junit4]   2> 4044 T2604 oasc.RequestHandlers.initHandlersFromConfig created tvrh: org.apache.solr.handler.component.SearchHandler
[junit4:junit4]   2> 4044 T2604 oasc.RequestHandlers.initHandlersFromConfig created /mlt: solr.MoreLikeThisHandler
[junit4:junit4]   2> 4045 T2604 oasc.RequestHandlers.initHandlersFromConfig created /debug/dump: solr.DumpRequestHandler
[junit4:junit4]   2> 4053 T2604 oashl.XMLLoader.init xsltCacheLifetimeSeconds=60
[junit4:junit4]   2> 4057 T2604 oasc.SolrCore.initDeprecatedSupport WARNING solrconfig.xml uses deprecated <admin/gettableFiles>, Please update your config to use the ShowFileRequestHandler.
[junit4:junit4]   2> 4059 T2604 oasc.SolrCore.initDeprecatedSupport WARNING adding ShowFileRequestHandler with hidden files: [SCHEMA.XML, OLD_SYNONYMS.TXT, STOPWORDS.TXT, PROTWORDS.TXT, OPEN-EXCHANGE-RATES.JSON, SYNONYMS.TXT, CURRENCY.XML, MAPPING-ISOLATIN1ACCENT.TXT]
[junit4:junit4]   2> 4061 T2604 oasc.CachingDirectoryFactory.close Releasing directory:/usr/home/hudson/hudson-slave/workspace/Lucene-Solr-Tests-trunk-Java6/solr/build/solr-core/test/J0/./org.apache.solr.cloud.SyncSliceTest-1355529933422/jetty1
[junit4:junit4]   2> 4063 T2604 oass.SolrIndexSearcher.<init> Opening Searcher@bbd05b6 main
[junit4:junit4]   2> 4064 T2604 oasu.CommitTracker.<init> Hard AutoCommit: disabled
[junit4:junit4]   2> 4064 T2604 oasu.CommitTracker.<init> Soft AutoCommit: disabled
[junit4:junit4]   2> 4065 T2604 oashc.SpellCheckComponent.inform Initializing spell checkers
[junit4:junit4]   2> 4071 T2604 oass.DirectSolrSpellChecker.init init: {name=direct,classname=DirectSolrSpellChecker,field=lowerfilt,minQueryLength=3}
[junit4:junit4]   2> 4123 T2605 oasc.SolrCore.registerSearcher [collection1] Registered new searcher Searcher@bbd05b6 main{StandardDirectoryReader(segments_1:1)}
[junit4:junit4]   2> 4127 T2604 oasc.ZkController.publish publishing core=collection1 state=down
[junit4:junit4]   2> 4127 T2604 oasc.ZkController.publish numShards not found on descriptor - reading it from system property
[junit4:junit4]   2> 4276 T2585 oascc.ZkStateReader.updateClusterState Updating cloud state from ZooKeeper... 
[junit4:junit4]   2> 4277 T2585 oasc.Overseer$ClusterStateUpdater.updateState Update state numShards=1 message={
[junit4:junit4]   2> 	  "operation":"state",
[junit4:junit4]   2> 	  "numShards":"1",
[junit4:junit4]   2> 	  "shard":null,
[junit4:junit4]   2> 	  "roles":null,
[junit4:junit4]   2> 	  "state":"down",
[junit4:junit4]   2> 	  "core":"collection1",
[junit4:junit4]   2> 	  "collection":"collection1",
[junit4:junit4]   2> 	  "node_name":"127.0.0.1:63371_",
[junit4:junit4]   2> 	  "base_url":"http://127.0.0.1:63371"}
[junit4:junit4]   2> 4277 T2585 oasc.Overseer$ClusterStateUpdater.createCollection Create collection collection1 with numShards 1
[junit4:junit4]   2> 4277 T2585 oasc.Overseer$ClusterStateUpdater.updateState Assigning new node to shard shard=shard1
[junit4:junit4]   2> 4289 T2590 oascc.ZkStateReader$2.process A cluster state change: WatchedEvent state:SyncConnected type:NodeDataChanged path:/clusterstate.json, has occurred - updating... (live nodes size: 2)
[junit4:junit4]   2> 4289 T2603 oascc.ZkStateReader$2.process A cluster state change: WatchedEvent state:SyncConnected type:NodeDataChanged path:/clusterstate.json, has occurred - updating... (live nodes size: 2)
[junit4:junit4]   2> 4289 T2584 oascc.ZkStateReader$2.process A cluster state change: WatchedEvent state:SyncConnected type:NodeDataChanged path:/clusterstate.json, has occurred - updating... (live nodes size: 2)
[junit4:junit4]   2> 4630 T2604 oasc.CoreContainer.registerCore registering core: collection1
[junit4:junit4]   2> 4630 T2604 oasc.ZkController.register Register shard - core:collection1 address:http://127.0.0.1:63371 shardId:shard1
[junit4:junit4]   2> 4631 T2604 oascc.SolrZkClient.makePath makePath: /collections/collection1/leader_elect/shard1/election
[junit4:junit4]   2> 4657 T2567 oazs.PrepRequestProcessor.pRequest Got user-level KeeperException when processing sessionid:0x13b9be152760006 type:delete cxid:0x45 zxid:0x5b txntype:-1 reqpath:n/a Error Path:/solr/collections/collection1/leaders Error:KeeperErrorCode = NoNode for /solr/collections/collection1/leaders
[junit4:junit4]   2> 4664 T2604 oasc.ShardLeaderElectionContext.runLeaderProcess Running the leader process.
[junit4:junit4]   2> 4664 T2567 oazs.PrepRequestProcessor.pRequest Got user-level KeeperException when processing sessionid:0x13b9be152760006 type:create cxid:0x46 zxid:0x5c txntype:-1 reqpath:n/a Error Path:/solr/overseer Error:KeeperErrorCode = NodeExists for /solr/overseer
[junit4:junit4]   2> 4672 T2604 oasc.ShardLeaderElectionContext.waitForReplicasToComeUp Enough replicas found to continue.
[junit4:junit4]   2> 4672 T2604 oasc.ShardLeaderElectionContext.runLeaderProcess I may be the new leader - try and sync
[junit4:junit4]   2> 4673 T2604 oasc.SyncStrategy.sync Sync replicas to http://127.0.0.1:63371/collection1/
[junit4:junit4]   2> 4673 T2604 oasc.SyncStrategy.syncReplicas Sync Success - now sync replicas to me
[junit4:junit4]   2> 4673 T2604 oasc.SyncStrategy.syncToMe http://127.0.0.1:63371/collection1/ has no replicas
[junit4:junit4]   2> 4674 T2604 oasc.ShardLeaderElectionContext.runLeaderProcess I am the new leader: http://127.0.0.1:63371/collection1/
[junit4:junit4]   2> 4674 T2604 oascc.SolrZkClient.makePath makePath: /collections/collection1/leaders/shard1
[junit4:junit4]   2> 4678 T2567 oazs.PrepRequestProcessor.pRequest Got user-level KeeperException when processing sessionid:0x13b9be152760006 type:create cxid:0x50 zxid:0x60 txntype:-1 reqpath:n/a Error Path:/solr/overseer Error:KeeperErrorCode = NodeExists for /solr/overseer
[junit4:junit4]   2> 4793 T2585 oascc.ZkStateReader.updateClusterState Updating cloud state from ZooKeeper... 
[junit4:junit4]   2> 4809 T2603 oascc.ZkStateReader$2.process A cluster state change: WatchedEvent state:SyncConnected type:NodeDataChanged path:/clusterstate.json, has occurred - updating... (live nodes size: 2)
[junit4:junit4]   2> 4809 T2590 oascc.ZkStateReader$2.process A cluster state change: WatchedEvent state:SyncConnected type:NodeDataChanged path:/clusterstate.json, has occurred - updating... (live nodes size: 2)
[junit4:junit4]   2> 4809 T2584 oascc.ZkStateReader$2.process A cluster state change: WatchedEvent state:SyncConnected type:NodeDataChanged path:/clusterstate.json, has occurred - updating... (live nodes size: 2)
[junit4:junit4]   2> 4841 T2604 oasc.ZkController.register We are http://127.0.0.1:63371/collection1/ and leader is http://127.0.0.1:63371/collection1/
[junit4:junit4]   2> 4841 T2604 oasc.ZkController.register No LogReplay needed for core=collection1 baseURL=http://127.0.0.1:63371
[junit4:junit4]   2> 4841 T2604 oasc.ZkController.checkRecovery I am the leader, no recovery necessary
[junit4:junit4]   2> 4841 T2604 oasc.ZkController.publish publishing core=collection1 state=active
[junit4:junit4]   2> 4842 T2604 oasc.ZkController.publish numShards not found on descriptor - reading it from system property
[junit4:junit4]   2> 4844 T2604 oascc.ZkStateReader.updateClusterState Updating cloud state from ZooKeeper... 
[junit4:junit4]   2> 4845 T2562 oass.SolrDispatchFilter.init user.dir=/usr/home/hudson/hudson-slave/workspace/Lucene-Solr-Tests-trunk-Java6/solr/build/solr-core/test/J0
[junit4:junit4]   2> 4846 T2562 oass.SolrDispatchFilter.init SolrDispatchFilter.init() done
[junit4:junit4]   2> 4847 T2562 oascsi.HttpClientUtil.createClient Creating new http client, config:maxConnections=128&maxConnectionsPerHost=32&followRedirects=false
[junit4:junit4]   2> 5014 T2562 oejs.Server.doStart jetty-8.1.8.v20121106
[junit4:junit4]   2> 5018 T2562 oejs.AbstractConnector.doStart Started SocketConnector@127.0.0.1:63376
[junit4:junit4]   2> 5019 T2562 oasc.SolrResourceLoader.locateSolrHome JNDI not configured for solr (NoInitialContextEx)
[junit4:junit4]   2> 5020 T2562 oasc.SolrResourceLoader.locateSolrHome using system property solr.solr.home: /usr/home/hudson/hudson-slave/workspace/Lucene-Solr-Tests-trunk-Java6/solr/build/solr-core/test/J0/./org.apache.solr.cloud.SyncSliceTest-jetty2-1355529938276
[junit4:junit4]   2> 5020 T2562 oasc.SolrResourceLoader.<init> new SolrResourceLoader for deduced Solr Home: '/usr/home/hudson/hudson-slave/workspace/Lucene-Solr-Tests-trunk-Java6/solr/build/solr-core/test/J0/./org.apache.solr.cloud.SyncSliceTest-jetty2-1355529938276/'
[junit4:junit4]   2> 5056 T2562 oass.SolrDispatchFilter.init SolrDispatchFilter.init()
[junit4:junit4]   2> 5057 T2562 oasc.SolrResourceLoader.locateSolrHome JNDI not configured for solr (NoInitialContextEx)
[junit4:junit4]   2> 5057 T2562 oasc.SolrResourceLoader.locateSolrHome using system property solr.solr.home: /usr/home/hudson/hudson-slave/workspace/Lucene-Solr-Tests-trunk-Java6/solr/build/solr-core/test/J0/./org.apache.solr.cloud.SyncSliceTest-jetty2-1355529938276
[junit4:junit4]   2> 5058 T2562 oasc.CoreContainer$Initializer.initialize looking for solr.xml: /usr/home/hudson/hudson-slave/workspace/Lucene-Solr-Tests-trunk-Java6/solr/build/solr-core/test/J0/./org.apache.solr.cloud.SyncSliceTest-jetty2-1355529938276/solr.xml
[junit4:junit4]   2> 5059 T2562 oasc.CoreContainer.<init> New CoreContainer 1449087391
[junit4:junit4]   2> 5060 T2562 oasc.CoreContainer.load Loading CoreContainer using Solr Home: '/usr/home/hudson/hudson-slave/workspace/Lucene-Solr-Tests-trunk-Java6/solr/build/solr-core/test/J0/./org.apache.solr.cloud.SyncSliceTest-jetty2-1355529938276/'
[junit4:junit4]   2> 5061 T2562 oasc.SolrResourceLoader.<init> new SolrResourceLoader for directory: '/usr/home/hudson/hudson-slave/workspace/Lucene-Solr-Tests-trunk-Java6/solr/build/solr-core/test/J0/./org.apache.solr.cloud.SyncSliceTest-jetty2-1355529938276/'
[junit4:junit4]   2> 5088 T2562 oasc.CoreContainer.load Registering Log Listener
[junit4:junit4]   2> 5105 T2562 oasc.CoreContainer.initZooKeeper Zookeeper client=127.0.0.1:63353/solr
[junit4:junit4]   2> 5106 T2562 oasc.ZkController.checkChrootPath zkHost includes chroot
[junit4:junit4]   2> 5106 T2562 oaz.ZooKeeper.<init> Initiating client connection, connectString=127.0.0.1:63353 sessionTimeout=60000 watcher=org.apache.solr.common.cloud.ConnectionManager@1e805605
[junit4:junit4]   2> 5108 T2562 oascc.ConnectionManager.waitForConnected Waiting for client to connect to ZooKeeper
[junit4:junit4]   2> 5108 T2615 oaz.ClientCnxn$SendThread.logStartConnect Opening socket connection to server localhost/127.0.0.1:63353. Will not attempt to authenticate using SASL (access denied (javax.security.auth.AuthPermission getLoginConfiguration))
[junit4:junit4]   2> 5109 T2615 oaz.ClientCnxn$SendThread.primeConnection Socket connection established to localhost/127.0.0.1:63353, initiating session
[junit4:junit4]   2> 5109 T2564 oazs.NIOServerCnxnFactory.run Accepted socket connection from /140.211.11.196:63377
[junit4:junit4]   2> 5110 T2564 oazs.ZooKeeperServer.processConnectRequest Client attempting to establish new session at /140.211.11.196:63377
[junit4:junit4]   2> 5114 T2566 oazs.ZooKeeperServer.finishSessionInit Established session 0x13b9be152760007 with negotiated timeout 20000 for client /140.211.11.196:63377
[junit4:junit4]   2> 5114 T2615 oaz.ClientCnxn$SendThread.onConnected Session establishment complete on server localhost/127.0.0.1:63353, sessionid = 0x13b9be152760007, negotiated timeout = 20000
[junit4:junit4]   2> 5115 T2616 oascc.ConnectionManager.process Watcher org.apache.solr.common.cloud.ConnectionManager@1e805605 name:ZooKeeperConnection Watcher:127.0.0.1:63353 got event WatchedEvent state:SyncConnected type:None path:null path:null type:None
[junit4:junit4]   2> 5115 T2562 oascc.ConnectionManager.waitForConnected Client is connected to ZooKeeper
[junit4:junit4]   2> 5116 T2567 oazs.PrepRequestProcessor.pRequest2Txn Processed session termination for sessionid: 0x13b9be152760007
[junit4:junit4]   2> 5128 T2616 oaz.ClientCnxn$EventThread.run EventThread shut down
[junit4:junit4]   2> 5128 T2564 oazs.NIOServerCnxn.closeSock Closed socket connection for client /140.211.11.196:63377 which had sessionid 0x13b9be152760007
[junit4:junit4]   2> 5128 T2562 oaz.ZooKeeper.close Session: 0x13b9be152760007 closed
[junit4:junit4]   2> 5129 T2562 oaz.ZooKeeper.<init> Initiating client connection, connectString=127.0.0.1:63353/solr sessionTimeout=8000 watcher=org.apache.solr.common.cloud.ConnectionManager@34668e51
[junit4:junit4]   2> 5130 T2562 oascc.ConnectionManager.waitForConnected Waiting for client to connect to ZooKeeper
[junit4:junit4]   2> 5131 T2617 oaz.ClientCnxn$SendThread.logStartConnect Opening socket connection to server localhost/127.0.0.1:63353. Will not attempt to authenticate using SASL (access denied (javax.security.auth.AuthPermission getLoginConfiguration))
[junit4:junit4]   2> 5131 T2617 oaz.ClientCnxn$SendThread.primeConnection Socket connection established to localhost/127.0.0.1:63353, initiating session
[junit4:junit4]   2> 5132 T2564 oazs.NIOServerCnxnFactory.run Accepted socket connection from /140.211.11.196:63378
[junit4:junit4]   2> 5132 T2564 oazs.ZooKeeperServer.processConnectRequest Client attempting to establish new session at /140.211.11.196:63378
[junit4:junit4]   2> 5133 T2566 oazs.ZooKeeperServer.finishSessionInit Established session 0x13b9be152760008 with negotiated timeout 8000 for client /140.211.11.196:63378
[junit4:junit4]   2> 5133 T2617 oaz.ClientCnxn$SendThread.onConnected Session establishment complete on server localhost/127.0.0.1:63353, sessionid = 0x13b9be152760008, negotiated timeout = 8000
[junit4:junit4]   2> 5134 T2618 oascc.ConnectionManager.process Watcher org.apache.solr.common.cloud.ConnectionManager@34668e51 name:ZooKeeperConnection Watcher:127.0.0.1:63353/solr got event WatchedEvent state:SyncConnected type:None path:null path:null type:None
[junit4:junit4]   2> 5134 T2562 oascc.ConnectionManager.waitForConnected Client is connected to ZooKeeper
[junit4:junit4]   2> 5135 T2567 oazs.PrepRequestProcessor.pRequest Got user-level KeeperException when processing sessionid:0x13b9be152760008 type:create cxid:0x1 zxid:0x6d txntype:-1 reqpath:n/a Error Path:/solr/overseer Error:KeeperErrorCode = NodeExists for /solr/overseer
[junit4:junit4]   2> 5136 T2567 oazs.PrepRequestProcessor.pRequest Got user-level KeeperException when processing sessionid:0x13b9be152760008 type:create cxid:0x2 zxid:0x6e txntype:-1 reqpath:n/a Error Path:/solr/overseer Error:KeeperErrorCode = NodeExists for /solr/overseer
[junit4:junit4]   2> 5144 T2562 oasc.ZkController.createEphemeralLiveNode Register node as live in ZooKeeper:/live_nodes/127.0.0.1:63376_
[junit4:junit4]   2> 5145 T2567 oazs.PrepRequestProcessor.pRequest Got user-level KeeperException when processing sessionid:0x13b9be152760008 type:delete cxid:0x4 zxid:0x6f txntype:-1 reqpath:n/a Error Path:/solr/live_nodes/127.0.0.1:63376_ Error:KeeperErrorCode = NoNode for /solr/live_nodes/127.0.0.1:63376_
[junit4:junit4]   2> 5146 T2562 oascc.SolrZkClient.makePath makePath: /live_nodes/127.0.0.1:63376_
[junit4:junit4]   2> 5148 T2590 oascc.ZkStateReader$3.process Updating live nodes... (3)
[junit4:junit4]   2> 5149 T2584 oascc.ZkStateReader$3.process Updating live nodes... (3)
[junit4:junit4]   2> 5149 T2603 oascc.ZkStateReader$3.process Updating live nodes... (3)
[junit4:junit4]   2> 5149 T2590 oascc.ZkStateReader$2.process A cluster state change: WatchedEvent state:SyncConnected type:NodeChildrenChanged path:/live_nodes, has occurred - updating... (live nodes size: 3)
[junit4:junit4]   2> 5149 T2584 oascc.ZkStateReader$2.process A cluster state change: WatchedEvent state:SyncConnected type:NodeChildrenChanged path:/live_nodes, has occurred - updating... (live nodes size: 3)
[junit4:junit4]   2> 5149 T2603 oascc.ZkStateReader$2.process A cluster state change: WatchedEvent state:SyncConnected type:NodeChildrenChanged path:/live_nodes, has occurred - updating... (live nodes size: 3)
[junit4:junit4]   2> 5149 T2562 oashc.HttpShardHandlerFactory.getParameter Setting socketTimeout to: 0
[junit4:junit4]   2> 5150 T2562 oashc.HttpShardHandlerFactory.getParameter Setting urlScheme to: http://
[junit4:junit4]   2> 5151 T2562 oashc.HttpShardHandlerFactory.getParameter Setting connTimeout to: 0
[junit4:junit4]   2> 5151 T2562 oashc.HttpShardHandlerFactory.getParameter Setting maxConnectionsPerHost to: 20
[junit4:junit4]   2> 5152 T2562 oashc.HttpShardHandlerFactory.getParameter Setting corePoolSize to: 0
[junit4:junit4]   2> 5153 T2562 oashc.HttpShardHandlerFactory.getParameter Setting maximumPoolSize to: 2147483647
[junit4:junit4]   2> 5153 T2562 oashc.HttpShardHandlerFactory.getParameter Setting maxThreadIdleTime to: 5
[junit4:junit4]   2> 5154 T2562 oashc.HttpShardHandlerFactory.getParameter Setting sizeOfQueue to: -1
[junit4:junit4]   2> 5154 T2562 oashc.HttpShardHandlerFactory.getParameter Setting fairnessPolicy to: false
[junit4:junit4]   2> 5155 T2562 oascsi.HttpClientUtil.createClient Creating new http client, config:maxConnectionsPerHost=20&maxConnections=10000&socketTimeout=0&connTimeout=0&retry=false
[junit4:junit4]   2> 5172 T2562 oascc.ZkStateReader.createClusterStateWatchersAndUpdate Updating cluster state from ZooKeeper... 
[junit4:junit4]   2> 5180 T2619 oasc.CoreContainer.create Creating SolrCore 'collection1' using instanceDir: /usr/home/hudson/hudson-slave/workspace/Lucene-Solr-Tests-trunk-Java6/solr/build/solr-core/test/J0/./org.apache.solr.cloud.SyncSliceTest-jetty2-1355529938276/collection1
[junit4:junit4]   2> 5180 T2619 oasc.ZkController.createCollectionZkNode Check for collection zkNode:collection1
[junit4:junit4]   2> 5181 T2619 oasc.ZkController.createCollectionZkNode Collection zkNode exists
[junit4:junit4]   2> 5181 T2619 oasc.ZkController.readConfigName Load collection config from:/collections/collection1
[junit4:junit4]   2> 5182 T2619 oasc.SolrResourceLoader.<init> new SolrResourceLoader for directory: '/usr/home/hudson/hudson-slave/workspace/Lucene-Solr-Tests-trunk-Java6/solr/build/solr-core/test/J0/./org.apache.solr.cloud.SyncSliceTest-jetty2-1355529938276/collection1/'
[junit4:junit4]   2> 5183 T2619 oasc.SolrResourceLoader.replaceClassLoader Adding 'file:/usr/home/hudson/hudson-slave/workspace/Lucene-Solr-Tests-trunk-Java6/solr/build/solr-core/test/J0/org.apache.solr.cloud.SyncSliceTest-jetty2-1355529938276/collection1/lib/README' to classloader
[junit4:junit4]   2> 5184 T2619 oasc.SolrResourceLoader.replaceClassLoader Adding 'file:/usr/home/hudson/hudson-slave/workspace/Lucene-Solr-Tests-trunk-Java6/solr/build/solr-core/test/J0/org.apache.solr.cloud.SyncSliceTest-jetty2-1355529938276/collection1/lib/classes/' to classloader
[junit4:junit4]   2> 5236 T2619 oasc.SolrConfig.<init> Using Lucene MatchVersion: LUCENE_50
[junit4:junit4]   2> 5305 T2619 oasc.SolrConfig.<init> Loaded SolrConfig: solrconfig.xml
[junit4:junit4]   2> 5322 T2585 oascc.ZkStateReader.updateClusterState Updating cloud state from ZooKeeper... 
[junit4:junit4]   2> 5323 T2585 oasc.Overseer$ClusterStateUpdater.updateState Update state numShards=1 message={
[junit4:junit4]   2> 	  "operation":"state",
[junit4:junit4]   2> 	  "numShards":"1",
[junit4:junit4]   2> 	  "shard":"shard1",
[junit4:junit4]   2> 	  "roles":null,
[junit4:junit4]   2> 	  "state":"active",
[junit4:junit4]   2> 	  "core":"collection1",
[junit4:junit4]   2> 	  "collection":"collection1",
[junit4:junit4]   2> 	  "node_name":"127.0.0.1:63371_",
[junit4:junit4]   2> 	  "base_url":"http://127.0.0.1:63371"}
[junit4:junit4]   2> 5336 T2584 oascc.ZkStateReader$2.process A cluster state change: WatchedEvent state:SyncConnected type:NodeDataChanged path:/clusterstate.json, has occurred - updating... (live nodes size: 3)
[junit4:junit4]   2> 5336 T2590 oascc.ZkStateReader$2.process A cluster state change: WatchedEvent state:SyncConnected type:NodeDataChanged path:/clusterstate.json, has occurred - updating... (live nodes size: 3)
[junit4:junit4]   2> 5336 T2603 oascc.ZkStateReader$2.process A cluster state change: WatchedEvent state:SyncConnected type:NodeDataChanged path:/clusterstate.json, has occurred - updating... (live nodes size: 3)
[junit4:junit4]   2> 5406 T2618 oascc.ZkStateReader$2.process A cluster state change: WatchedEvent state:SyncConnected type:NodeDataChanged path:/clusterstate.json, has occurred - updating... (live nodes size: 3)
[junit4:junit4]   2> 5406 T2619 oass.IndexSchema.readSchema Reading Solr Schema
[junit4:junit4]   2> 5413 T2619 oass.IndexSchema.readSchema Schema name=test
[junit4:junit4]   2> 6042 T2619 oass.OpenExchangeRatesOrgProvider.init Initialized with rates=open-exchange-rates.json, refreshInterval=1440.
[junit4:junit4]   2> 6054 T2619 oass.IndexSchema.readSchema default search field in schema is text
[junit4:junit4]   2> 6058 T2619 oass.IndexSchema.readSchema unique key field: id
[junit4:junit4]   2> 6074 T2619 oass.FileExchangeRateProvider.reload Reloading exchange rates from file currency.xml
[junit4:junit4]   2> 6079 T2619 oass.FileExchangeRateProvider.reload Reloading exchange rates from file currency.xml
[junit4:junit4]   2> 6084 T2619 oass.OpenExchangeRatesOrgProvider.reload Reloading exchange rates from open-exchange-rates.json
[junit4:junit4]   2> 6085 T2619 oass.OpenExchangeRatesOrgProvider.reload Reloading exchange rates from open-exchange-rates.json
[junit4:junit4]   2> 6087 T2619 oasc.SolrCore.<init> [collection1] Opening new SolrCore at /usr/home/hudson/hudson-slave/workspace/Lucene-Solr-Tests-trunk-Java6/solr/build/solr-core/test/J0/./org.apache.solr.cloud.SyncSliceTest-jetty2-1355529938276/collection1/, dataDir=./org.apache.solr.cloud.SyncSliceTest-1355529933422/jetty2/
[junit4:junit4]   2> 6087 T2619 oasc.JmxMonitoredMap.<init> JMX monitoring is enabled. Adding Solr mbeans to JMX Server: com.sun.jmx.mbeanserver.JmxMBeanServer@418bbf55
[junit4:junit4]   2> 6087 T2619 oasc.SolrCore.initDirectoryFactory solr.StandardDirectoryFactory
[junit4:junit4]   2> 6088 T2619 oasc.CachingDirectoryFactory.get return new directory for /usr/home/hudson/hudson-slave/workspace/Lucene-Solr-Tests-trunk-Java6/solr/build/solr-core/test/J0/./org.apache.solr.cloud.SyncSliceTest-1355529933422/jetty2 forceNew:false
[junit4:junit4]   2> 6089 T2619 oasc.CachingDirectoryFactory.close Releasing directory:/usr/home/hudson/hudson-slave/workspace/Lucene-Solr-Tests-trunk-Java6/solr/build/solr-core/test/J0/./org.apache.solr.cloud.SyncSliceTest-1355529933422/jetty2
[junit4:junit4]   2> 6089 T2619 oasc.SolrCore.getNewIndexDir New index directory detected: old=null new=./org.apache.solr.cloud.SyncSliceTest-1355529933422/jetty2/index/
[junit4:junit4]   2> 6090 T2619 oasc.SolrCore.initIndex WARNING [collection1] Solr index directory './org.apache.solr.cloud.SyncSliceTest-1355529933422/jetty2/index' doesn't exist. Creating new index...
[junit4:junit4]   2> 6099 T2619 oasc.CachingDirectoryFactory.get return new directory for /usr/home/hudson/hudson-slave/workspace/Lucene-Solr-Tests-trunk-Java6/solr/build/solr-core/test/J0/./org.apache.solr.cloud.SyncSliceTest-1355529933422/jetty2/index forceNew:false
[junit4:junit4]   2> 6132 T2619 oasc.SolrDeletionPolicy.onCommit SolrDeletionPolicy.onCommit: commits:num=1
[junit4:junit4]   2> 		commit{dir=RateLimitedDirectoryWrapper(org.apache.lucene.store.NIOFSDirectory@/usr/home/hudson/hudson-slave/workspace/Lucene-Solr-Tests-trunk-Java6/solr/build/solr-core/test/J0/org.apache.solr.cloud.SyncSliceTest-1355529933422/jetty2/index lockFactory=org.apache.lucene.store.NativeFSLockFactory@5bf5b245),segFN=segments_1,generation=1,filenames=[segments_1]
[junit4:junit4]   2> 6133 T2619 oasc.SolrDeletionPolicy.updateCommits newest commit = 1[segments_1]
[junit4:junit4]   2> 6133 T2619 oasc.CachingDirectoryFactory.close Releasing directory:/usr/home/hudson/hudson-slave/workspace/Lucene-Solr-Tests-trunk-Java6/solr/build/solr-core/test/J0/./org.apache.solr.cloud.SyncSliceTest-1355529933422/jetty2/index
[junit4:junit4]   2> 6134 T2619 oasc.SolrCore.initWriters created xml: solr.XMLResponseWriter
[junit4:junit4]   2> 6136 T2619 oasup.UpdateRequestProcessorChain.init inserting DistributedUpdateProcessorFactory into updateRequestProcessorChain "dedupe"
[junit4:junit4]   2> 6136 T2619 oasup.UpdateRequestProcessorChain.init inserting DistributedUpdateProcessorFactory into updateRequestProcessorChain "dedupe-allfields"
[junit4:junit4]   2> 6137 T2619 oasup.UpdateRequestProcessorChain.init inserting DistributedUpdateProcessorFactory into updateRequestProcessorChain "stored_sig"
[junit4:junit4]   2> 6137 T2619 oasup.UpdateRequestProcessorChain.init inserting DistributedUpdateProcessorFactory into updateRequestProcessorChain "uniq-fields"
[junit4:junit4]   2> 6138 T2619 oasup.UpdateRequestProcessorChain.init inserting DistributedUpdateProcessorFactory into updateRequestProcessorChain "distrib-dup-test-chain-implicit"
[junit4:junit4]   2> 6138 T2619 oasc.RequestHandlers.initHandlersFromConfig adding lazy requestHandler: solr.ReplicationHandler
[junit4:junit4]   2> 6138 T2619 oasc.RequestHandlers.initHandlersFromConfig created /replication: solr.ReplicationHandler
[junit4:junit4]   2> 6139 T2619 oasc.RequestHandlers.initHandlersFromConfig created standard: solr.StandardRequestHandler
[junit4:junit4]   2> 6140 T2619 oasc.RequestHandlers.initHandlersFromConfig created /get: solr.RealTimeGetHandler
[junit4:junit4]   2> 6141 T2619 oasc.RequestHandlers.initHandlersFromConfig created dismax: solr.SearchHandler
[junit4:junit4]   2> 6142 T2619 oasc.RequestHandlers.initHandlersFromConfig created mock: org.apache.solr.core.MockQuerySenderListenerReqHandler
[junit4:junit4]   2> 6142 T2619 oasc.RequestHandlers.initHandlersFromConfig created /admin/: org.apache.solr.handler.admin.AdminHandlers
[junit4:junit4]   2> 6143 T2619 oasc.RequestHandlers.initHandlersFromConfig created defaults: solr.StandardRequestHandler
[junit4:junit4]   2> 6143 T2619 oasc.RequestHandlers.initHandlersFromConfig adding lazy requestHandler: solr.StandardRequestHandler
[junit4:junit4]   2> 6144 T2619 oasc.RequestHandlers.initHandlersFromConfig created lazy: solr.StandardRequestHandler
[junit4:junit4]   2> 6145 T2619 oasc.RequestHandlers.initHandlersFromConfig created /update: solr.UpdateRequestHandler
[junit4:junit4]   2> 6146 T2619 oasc.RequestHandlers.initHandlersFromConfig created /terms: org.apache.solr.handler.component.SearchHandler
[junit4:junit4]   2> 6146 T2619 oasc.RequestHandlers.initHandlersFromConfig created spellCheckCompRH: org.apache.solr.handler.component.SearchHandler
[junit4:junit4]   2> 6147 T2619 oasc.RequestHandlers.initHandlersFromConfig created spellCheckCompRH_Direct: org.apache.solr.handler.component.SearchHandler
[junit4:junit4]   2> 6148 T2619 oasc.RequestHandlers.initHandlersFromConfig created spellCheckWithWordbreak: org.apache.solr.handler.component.SearchHandler
[junit4:junit4]   2> 6149 T2619 oasc.RequestHandlers.initHandlersFromConfig created spellCheckWithWordbreak_Direct: org.apache.solr.handler.component.SearchHandler
[junit4:junit4]   2> 6150 T2619 oasc.RequestHandlers.initHandlersFromConfig created spellCheckCompRH1: org.apache.solr.handler.component.SearchHandler
[junit4:junit4]   2> 6151 T2619 oasc.RequestHandlers.initHandlersFromConfig created mltrh: org.apache.solr.handler.component.SearchHandler
[junit4:junit4]   2> 6152 T2619 oasc.RequestHandlers.initHandlersFromConfig created tvrh: org.apache.solr.handler.component.SearchHandler
[junit4:junit4]   2> 6152 T2619 oasc.RequestHandlers.initHandlersFromConfig created /mlt: solr.MoreLikeThisHandler
[junit4:junit4]   2> 6153 T2619 oasc.RequestHandlers.initHandlersFromConfig created /debug/dump: solr.DumpRequestHandler
[junit4:junit4]   2> 6161 T2619 oashl.XMLLoader.init xsltCacheLifetimeSeconds=60
[junit4:junit4]   2> 6165 T2619 oasc.SolrCore.initDeprecatedSupport WARNING solrconfig.xml uses deprecated <admin/gettableFiles>, Please update your config to use the ShowFileRequestHandler.
[junit4:junit4]   2> 6167 T2619 oasc.SolrCore.initDeprecatedSupport WARNING adding ShowFileRequestHandler with hidden files: [SCHEMA.XML, OLD_SYNONYMS.TXT, STOPWORDS.TXT, PROTWORDS.TXT, OPEN-EXCHANGE-RATES.JSON, SYNONYMS.TXT, CURRENCY.XML, MAPPING-ISOLATIN1ACCENT.TXT]
[junit4:junit4]   2> 6170 T2619 oasc.CachingDirectoryFactory.close Releasing directory:/usr/home/hudson/hudson-slave/workspace/Lucene-Solr-Tests-trunk-Java6/solr/build/solr-core/test/J0/./org.apache.solr.cloud.SyncSliceTest-1355529933422/jetty2
[junit4:junit4]   2> 6172 T2619 oass.SolrIndexSearcher.<init> Opening Searcher@661f5f2 main
[junit4:junit4]   2> 6173 T2619 oasu.CommitTracker.<init> Hard AutoCommit: disabled
[junit4:junit4]   2> 6173 T2619 oasu.CommitTracker.<init> Soft AutoCommit: disabled
[junit4:junit4]   2> 6174 T2619 oashc.SpellCheckComponent.inform Initializing spell checkers
[junit4:junit4]   2> 6181 T2619 oass.DirectSolrSpellChecker.init init: {name=direct,classname=DirectSolrSpellChecker,field=lowerfilt,minQueryLength=3}
[junit4:junit4]   2> 6237 T2620 oasc.SolrCore.registerSearcher [collection1] Registered new searcher Searcher@661f5f2 main{StandardDirectoryReader(segments_1:1)}
[junit4:junit4]   2> 6240 T2619 oasc.ZkController.publish publishing core=collection1 state=down
[junit4:junit4]   2> 6241 T2619 oasc.ZkController.publish numShards not found on descriptor - reading it from system property
[junit4:junit4]   2> 6342 T2585 oascc.ZkStateReader.updateClusterState Updating cloud state from ZooKeeper... 
[junit4:junit4]   2> 6343 T2585 oasc.Overseer$ClusterStateUpdater.updateState Update state numShards=1 message={
[junit4:junit4]   2> 	  "operation":"state",
[junit4:junit4]   2> 	  "numShards":"1",
[junit4:junit4]   2> 	  "shard":null,
[junit4:junit4]   2> 	  "roles":null,
[junit4:junit4]   2> 	  "state":"down",
[junit4:junit4]   2> 	  "core":"collection1",
[junit4:junit4]   2> 	  "collection":"collection1",
[junit4:junit4]   2> 	  "node_name":"127.0.0.1:63376_",
[junit4:junit4]   2> 	  "base_url":"http://127.0.0.1:63376"}
[junit4:junit4]   2> 6343 T2585 oasc.Overseer$ClusterStateUpdater.updateState Collection already exists with numShards=1
[junit4:junit4]   2> 6343 T2585 oasc.Overseer$ClusterStateUpdater.updateState Assigning new node to shard shard=shard1
[junit4:junit4]   2> 6362 T2603 oascc.ZkStateReader$2.process A cluster state change: WatchedEvent state:SyncConnected type:NodeDataChanged path:/clusterstate.json, has occurred - updating... (live nodes size: 3)
[junit4:junit4]   2> 6362 T2590 oascc.ZkStateReader$2.process A cluster state change: WatchedEvent state:SyncConnected type:NodeDataChanged path:/clusterstate.json, has occurred - updating... (live nodes size: 3)
[junit4:junit4]   2> 6362 T2618 oascc.ZkStateReader$2.process A cluster state change: WatchedEvent state:SyncConnected type:NodeDataChanged path:/clusterstate.json, has occurred - updating... (live nodes size: 3)
[junit4:junit4]   2> 6362 T2584 oascc.ZkStateReader$2.process A cluster state change: WatchedEvent state:SyncConnected type:NodeDataChanged path:/clusterstate.json, has occurred - updating... (live nodes size: 3)
[junit4:junit4]   2> 6744 T2619 oasc.CoreContainer.registerCore registering core: collection1
[junit4:junit4]   2> 6744 T2619 oasc.ZkController.register Register shard - core:collection1 address:http://127.0.0.1:63376 shardId:shard1
[junit4:junit4]   2> 6751 T2619 oasc.ZkController.register We are http://127.0.0.1:63376/collection1/ and leader is http://127.0.0.1:63371/collection1/
[junit4:junit4]   2> 6751 T2619 oasc.ZkController.register No LogReplay needed for core=collection1 baseURL=http://127.0.0.1:63376
[junit4:junit4]   2> 6752 T2619 oasc.ZkController.checkRecovery Core needs to recover:collection1
[junit4:junit4]   2> 6752 T2619 oasu.DefaultSolrCoreState.doRecovery Running recovery - first canceling any ongoing recovery
[junit4:junit4]   2> ASYNC  NEW_CORE C263 name=collection1 org.apache.solr.core.SolrCore@5e93ba49 url=http://127.0.0.1:63376/collection1 node=127.0.0.1:63376_
[junit4:junit4]   2> 6752 T2621 C263 P63376 oasc.RecoveryStrategy.run Starting recovery process.  core=collection1 recoveringAfterStartup=true
[junit4:junit4]   2> 6753 T2619 oascc.ZkStateReader.updateClusterState Updating cloud state from ZooKeeper... 
[junit4:junit4]   2> 6753 T2621 C263 P63376 oasc.RecoveryStrategy.doRecovery ###### startupVersions=[]
[junit4:junit4]   2> 6753 T2621 C263 P63376 oasc.ZkController.publish publishing core=collection1 state=recovering
[junit4:junit4]   2> 6753 T2621 C263 P63376 oasc.ZkController.publish numShards not found on descriptor - reading it from system property
[junit4:junit4]   2> 6754 T2562 oass.SolrDispatchFilter.init user.dir=/usr/home/hudson/hudson-slave/workspace/Lucene-Solr-Tests-trunk-Java6/solr/build/solr-core/test/J0
[junit4:junit4]   2> 6755 T2562 oass.SolrDispatchFilter.init SolrDispatchFilter.init() done
[junit4:junit4]   2> 6755 T2562 oascsi.HttpClientUtil.createClient Creating new http client, config:maxConnections=128&maxConnectionsPerHost=32&followRedirects=false
[junit4:junit4]   2> 6757 T2621 C263 P63376 oasc.RecoveryStrategy.doRecovery Attempting to PeerSync from http://127.0.0.1:63371/collection1/ core=collection1 - recoveringAfterStartup=true
[junit4:junit4]   2> 6758 T2621 C263 P63376 oasu.PeerSync.sync PeerSync: core=collection1 url=http://127.0.0.1:63376 START replicas=[http://127.0.0.1:63371/collection1/] nUpdates=100
[junit4:junit4]   2> 6758 T2621 C263 P63376 oasu.PeerSync.sync WARNING no frame of reference to tell of we've missed updates
[junit4:junit4]   2> 6760 T2621 C263 P63376 oasc.RecoveryStrategy.doRecovery PeerSync Recovery was not successful - trying replication. core=collection1
[junit4:junit4]   2> 6760 T2621 C263 P63376 oasc.RecoveryStrategy.doRecovery Starting Replication Recovery. core=collection1
[junit4:junit4]   2> 6760 T2621 C263 P63376 oascsi.HttpClientUtil.createClient Creating new http client, config:maxConnections=128&maxConnectionsPerHost=32&followRedirects=false
[junit4:junit4]   2> ASYNC  NEW_CORE C264 name=collection1 org.apache.solr.core.SolrCore@2c569477 url=http://127.0.0.1:63371/collection1 node=127.0.0.1:63371_
[junit4:junit4]   2> 6769 T2593 C264 P63371 REQ /get {distrib=false&qt=/get&wt=javabin&version=2&getVersions=100} status=0 QTime=0 
[junit4:junit4]   2> 6867 T2585 oascc.ZkStateReader.updateClusterState Updating cloud state from ZooKeeper... 
[junit4:junit4]   2> 6868 T2585 oasc.Overseer$ClusterStateUpdater.updateState Update state numShards=1 message={
[junit4:junit4]   2> 	  "operation":"state",
[junit4:junit4]   2> 	  "numShards":"1",
[junit4:junit4]   2> 	  "shard":"shard1",
[junit4:junit4]   2> 	  "roles":null,
[junit4:junit4]   2> 	  "state":"recovering",
[junit4:junit4]   2> 	  "core":"collection1",
[junit4:junit4]   2> 	  "collection":"collection1",
[junit4:junit4]   2> 	  "node_name":"127.0.0.1:63376_",
[junit4:junit4]   2> 	  "base_url":"http://127.0.0.1:63376"}
[junit4:junit4]   2> 6888 T2618 oascc.ZkStateReader$2.process A cluster state change: WatchedEvent state:SyncConnected type:NodeDataChanged path:/clusterstate.json, has occurred - updating... (live nodes size: 3)
[junit4:junit4]   2> 6888 T2584 oascc.ZkStateReader$2.process A cluster state change: WatchedEvent state:SyncConnected type:NodeDataChanged path:/clusterstate.json, has occurred - updating... (live nodes size: 3)
[junit4:junit4]   2> 6888 T2603 oascc.ZkStateReader$2.process A cluster state change: WatchedEvent state:SyncConnected type:NodeDataChanged path:/clusterstate.json, has occurred - updating... (live nodes size: 3)
[junit4:junit4]   2> 6888 T2590 oascc.ZkStateReader$2.process A cluster state change: WatchedEvent state:SyncConnected type:NodeDataChanged path:/clusterstate.json, has occurred - updating... (live nodes size: 3)
[junit4:junit4]   2> 6927 T2562 oejs.Server.doStart jetty-8.1.8.v20121106
[junit4:junit4]   2> 6931 T2562 oejs.AbstractConnector.doStart Started SocketConnector@127.0.0.1:63386
[junit4:junit4]   2> 6932 T2562 oasc.SolrResourceLoader.locateSolrHome JNDI not configured for solr (NoInitialContextEx)
[junit4:junit4]   2> 6932 T2562 oasc.SolrResourceLoader.locateSolrHome using system property solr.solr.home: /usr/home/hudson/hudson-slave/workspace/Lucene-Solr-Tests-trunk-Java6/solr/build/solr-core/test/J0/./org.apache.solr.cloud.SyncSliceTest-jetty3-1355529940187
[junit4:junit4]   2> 6933 T2562 oasc.SolrResourceLoader.<init> new SolrResourceLoader for deduced Solr Home: '/usr/home/hudson/hudson-slave/workspace/Lucene-Solr-Tests-trunk-Java6/solr/build/solr-core/test/J0/./org.apache.solr.cloud.SyncSliceTest-jetty3-1355529940187/'
[junit4:junit4]   2> 6968 T2562 oass.SolrDispatchFilter.init SolrDispatchFilter.init()
[junit4:junit4]   2> 6969 T2562 oasc.SolrResourceLoader.locateSolrHome JNDI not configured for solr (NoInitialContextEx)
[junit4:junit4]   2> 6970 T2562 oasc.SolrResourceLoader.locateSolrHome using system property solr.solr.home: /usr/home/hudson/hudson-slave/workspace/Lucene-Solr-Tests-trunk-Java6/solr/build/solr-core/test/J0/./org.apache.solr.cloud.SyncSliceTest-jetty3-1355529940187
[junit4:junit4]   2> 6970 T2562 oasc.CoreContainer$Initializer.initialize looking for solr.xml: /usr/home/hudson/hudson-slave/workspace/Lucene-Solr-Tests-trunk-Java6/solr/build/solr-core/test/J0/./org.apache.solr.cloud.SyncSliceTest-jetty3-1355529940187/solr.xml
[junit4:junit4]   2> 6971 T2562 oasc.CoreContainer.<init> New CoreContainer 1177896657
[junit4:junit4]   2> 6972 T2562 oasc.CoreContainer.load Loading CoreContainer using Solr Home: '/usr/home/hudson/hudson-slave/workspace/Lucene-Solr-Tests-trunk-Java6/solr/build/solr-core/test/J0/./org.apache.solr.cloud.SyncSliceTest-jetty3-1355529940187/'
[junit4:junit4]   2> 6973 T2562 oasc.SolrResourceLoader.<init> new SolrResourceLoader for directory: '/usr/home/hudson/hudson-slave/workspace/Lucene-Solr-Tests-trunk-Java6/solr/build/solr-core/test/J0/./org.apache.solr.cloud.SyncSliceTest-jetty3-1355529940187/'
[junit4:junit4]   2> 6999 T2562 oasc.CoreContainer.load Registering Log Listener
[junit4:junit4]   2> 7019 T2562 oasc.CoreContainer.initZooKeeper Zookeeper client=127.0.0.1:63353/solr
[junit4:junit4]   2> 7019 T2562 oasc.ZkController.checkChrootPath zkHost includes chroot
[junit4:junit4]   2> 7020 T2562 oaz.ZooKeeper.<init> Initiating client connection, connectString=127.0.0.1:63353 sessionTimeout=60000 watcher=org.apache.solr.common.cloud.ConnectionManager@76252f01
[junit4:junit4]   2> 7021 T2562 oascc.ConnectionManager.waitForConnected Waiting for client to connect to ZooKeeper
[junit4:junit4]   2> 7022 T2632 oaz.ClientCnxn$SendThread.logStartConnect Opening socket connection to server localhost/127.0.0.1:63353. Will not attempt to authenticate using SASL (access denied (javax.security.auth.AuthPermission getLoginConfiguration))
[junit4:junit4]   2> 7023 T2632 oaz.ClientCnxn$SendThread.primeConnection Socket connection established to localhost/127.0.0.1:63353, initiating session
[junit4:junit4]   2> 7023 T2564 oazs.NIOServerCnxnFactory.run Accepted socket connection from /140.211.11.196:63387
[junit4:junit4]   2> 7024 T2564 oazs.ZooKeeperServer.processConnectRequest Client attempting to establish new session at /140.211.11.196:63387
[junit4:junit4]   2> 7025 T2566 oazs.ZooKeeperServer.finishSessionInit Established session 0x13b9be152760009 with negotiated timeout 20000 for client /140.211.11.196:63387
[junit4:junit4]   2> 7026 T2632 oaz.ClientCnxn$SendThread.onConnected Session establishment complete on server localhost/127.0.0.1:63353, sessionid = 0x13b9be152760009, negotiated timeout = 20000
[junit4:junit4]   2> 7026 T2633 oascc.ConnectionManager.process Watcher org.apache.solr.common.cloud.ConnectionManager@76252f01 name:ZooKeeperConnection Watcher:127.0.0.1:63353 got event WatchedEvent state:SyncConnected type:None path:null path:null type:None
[junit4:junit4]   2> 7026 T2562 oascc.ConnectionManager.waitForConnected Client is connected to ZooKeeper
[junit4:junit4]   2> 7027 T2567 oazs.PrepRequestProcessor.pRequest2Txn Processed session termination for sessionid: 0x13b9be152760009
[junit4:junit4]   2> 7033 T2633 oaz.ClientCnxn$EventThread.run EventThread shut down
[junit4:junit4]   2> 7033 T2564 oazs.NIOServerCnxn.closeSock Closed socket connection for client /140.211.11.196:63387 which had sessionid 0x13b9be152760009
[junit4:junit4]   2> 7033 T2562 oaz.ZooKeeper.close Session: 0x13b9be152760009 closed
[junit4:junit4]   2> 7035 T2562 oaz.ZooKeeper.<init> Initiating client connection, connectString=127.0.0.1:63353/solr sessionTimeout=8000 watcher=org.apache.solr.common.cloud.ConnectionManager@1ffd1c9d
[junit4:junit4]   2> 7036 T2634 oaz.ClientCnxn$SendThread.logStartConnect Opening socket connection to server localhost/127.0.0.1:63353. Will not attempt to authenticate using SASL (access denied (javax.security.auth.AuthPermission getLoginConfiguration))
[junit4:junit4]   2> 7036 T2562 oascc.ConnectionManager.waitForConnected Waiting for client to connect to ZooKeeper
[junit4:junit4]   2> 7036 T2634 oaz.ClientCnxn$SendThread.primeConnection Socket connection established to localhost/127.0.0.1:63353, initiating session
[junit4:junit4]   2> 7037 T2564 oazs.NIOServerCnxnFactory.run Accepted socket connection from /140.211.11.196:63388
[junit4:junit4]   2> 7037 T2564 oazs.ZooKeeperServer.processConnectRequest Client attempting to establish new session at /140.211.11.196:63388
[junit4:junit4]   2> 7038 T2566 oazs.ZooKeeperServer.finishSessionInit Established session 0x13b9be15276000a with negotiated timeout 8000 for client /140.211.11.196:63388
[junit4:junit4]   2> 7038 T2634 oaz.ClientCnxn$SendThread.onConnected Session establishment complete on server localhost/127.0.0.1:63353, sessionid = 0x13b9be15276000a, negotiated timeout = 8000
[junit4:junit4]   2> 7038 T2635 oascc.ConnectionManager.process Watcher org.apache.solr.common.cloud.ConnectionManager@1ffd1c9d name:ZooKeeperConnection Watcher:127.0.0.1:63353/solr got event WatchedEvent state:SyncConnected type:None path:null path:null type:None
[junit4:junit4]   2> 7039 T2562 oascc.ConnectionManager.waitForConnected Client is connected to ZooKeeper
[junit4:junit4]   2> 7040 T2567 oazs.PrepRequestProcessor.pRequest Got user-level KeeperException when processing sessionid:0x13b9be15276000a type:create cxid:0x1 zxid:0x84 txntype:-1 reqpath:n/a Error Path:/solr/overseer Error:KeeperErrorCode = NodeExists for /solr/overseer
[junit4:junit4]   2> 7045 T2567 oazs.PrepRequestProcessor.pRequest Got user-level KeeperException when processing sessionid:0x13b9be15276000a type:create cxid:0x2 zxid:0x85 txntype:-1 reqpath:n/a Error Path:/solr/overseer Error:KeeperErrorCode = NodeExists for /solr/overseer
[junit4:junit4]   2> 7047 T2562 oasc.ZkController.createEphemeralLiveNode Register node as live in ZooKeeper:/live_nodes/127.0.0.1:63386_
[junit4:junit4]   2> 7048 T2567 oazs.PrepRequestProcessor.pRequest Got user-level KeeperException when processing sessionid:0x13b9be15276000a type:delete cxid:0x4 zxid:0x86 txntype:-1 reqpath:n/a Error Path:/solr/live_nodes/127.0.0.1:63386_ Error:KeeperErrorCode = NoNode for /solr/live_nodes/127.0.0.1:63386_
[junit4:junit4]   2> 7049 T2562 oascc.SolrZkClient.makePath makePath: /live_nodes/127.0.0.1:63386_
[junit4:junit4]   2> 7057 T2618 oascc.ZkStateReader$2.process A cluster state change: WatchedEvent state:SyncConnected type:NodeChildrenChanged path:/live_nodes, has occurred - updating... (live nodes size: 3)
[junit4:junit4]   2> 7057 T2603 oascc.ZkStateReader$3.process Updating live nodes... (4)
[junit4:junit4]   2> 7057 T2590 oascc.ZkStateReader$3.process Updating live nodes... (4)
[junit4:junit4]   2> 7058 T2603 oascc.ZkStateReader$2.process A cluster state change: WatchedEvent state:SyncConnected type:NodeChildrenChanged path:/live_nodes, has occurred - updating... (live nodes size: 4)
[junit4:junit4]   2> 7058 T2590 oascc.ZkStateReader$2.process A cluster state change: WatchedEvent state:SyncConnected type:NodeChildrenChanged path:/live_nodes, has occurred - updating... (live nodes size: 4)
[junit4:junit4]   2> 7058 T2584 oascc.ZkStateReader$3.process Updating live nodes... (4)
[junit4:junit4]   2> 7058 T2584 oascc.ZkStateReader$2.process A cluster state change: WatchedEvent state:SyncConnected type:NodeChildrenChanged path:/live_nodes, has occurred - updating... (live nodes size: 4)
[junit4:junit4]   2> 7058 T2562 oashc.HttpShardHandlerFactory.getParameter Setting socketTimeout to: 0
[junit4:junit4]   2> 7059 T2618 oascc.ZkStateReader$3.process Updating live nodes... (4)
[junit4:junit4]   2> 7059 T2562 oashc.HttpShardHandlerFactory.getParameter Setting urlScheme to: http://
[junit4:junit4]   2> 7060 T2562 oashc.HttpShardHandlerFactory.getParameter Setting connTimeout to: 0
[junit4:junit4]   2> 7060 T2562 oashc.HttpShardHandlerFactory.getParameter Setting maxConnectionsPerHost to: 20
[junit4:junit4]   2> 7061 T2562 oashc.HttpShardHandlerFactory.getParameter Setting corePoolSize to: 0
[junit4:junit4]   2> 7062 T2562 oashc.HttpShardHandlerFactory.getParameter Setting maximumPoolSize to: 2147483647
[junit4:junit4]   2> 7062 T2562 oashc.HttpShardHandlerFactory.getParameter Setting maxThreadIdleTime to: 5
[junit4:junit4]   2> 7063 T2562 oashc.HttpShardHandlerFactory.getParameter Setting sizeOfQueue to: -1
[junit4:junit4]   2> 7064 T2562 oashc.HttpShardHandlerFactory.getParameter Setting fairnessPolicy to: false
[junit4:junit4]   2> 7064 T2562 oascsi.HttpClientUtil.createClient Creating new http client, config:maxConnectionsPerHost=20&maxConnections=10000&socketTimeout=0&connTimeout=0&retry=false
[junit4:junit4]   2> 7088 T2562 oascc.ZkStateReader.createClusterStateWatchersAndUpdate Updating cluster state from ZooKeeper... 
[junit4:junit4]   2> 7100 T2636 oasc.CoreContainer.create Creating SolrCore 'collection1' using instanceDir: /usr/home/hudson/hudson-slave/workspace/Lucene-Solr-Tests-trunk-Java6/solr/build/solr-core/test/J0/./org.apache.solr.cloud.SyncSliceTest-jetty3-1355529940187/collection1
[junit4:junit4]   2> 7100 T2636 oasc.ZkController.createCollectionZkNode Check for collection zkNode:collection1
[junit4:junit4]   2> 7101 T2636 oasc.ZkController.createCollectionZkNode Collection zkNode exists
[junit4:junit4]   2> 7101 T2636 oasc.ZkController.readConfigName Load collection config from:/collections/collection1
[junit4:junit4]   2> 7103 T2636 oasc.SolrResourceLoader.<init> new SolrResourceLoader for directory: '/usr/home/hudson/hudson-slave/workspace/Lucene-Solr-Tests-trunk-Java6/solr/build/solr-core/test/J0/./org.apache.solr.cloud.SyncSliceTest-jetty3-1355529940187/collection1/'
[junit4:junit4]   2> 7104 T2636 oasc.SolrResourceLoader.replaceClassLoader Adding 'file:/usr/home/hudson/hudson-slave/workspace/Lucene-Solr-Tests-trunk-Java6/solr/build/solr-core/test/J0/org.apache.solr.cloud.SyncSliceTest-jetty3-1355529940187/collection1/lib/classes/' to classloader
[junit4:junit4]   2> 7105 T2636 oasc.SolrResourceLoader.replaceClassLoader Adding 'file:/usr/home/hudson/hudson-slave/workspace/Lucene-Solr-Tests-trunk-Java6/solr/build/solr-core/test/J0/org.apache.solr.cloud.SyncSliceTest-jetty3-1355529940187/collection1/lib/README' to classloader
[junit4:junit4]   2> 7157 T2636 oasc.SolrConfig.<init> Using Lucene MatchVersion: LUCENE_50
[junit4:junit4]   2> 7227 T2636 oasc.SolrConfig.<init> Loaded SolrConfig: solrconfig.xml
[junit4:junit4]   2> 7328 T2636 oass.IndexSchema.readSchema Reading Solr Schema
[junit4:junit4]   2> 7334 T2636 oass.IndexSchema.readSchema Schema name=test
[junit4:junit4]   2> 8065 T2636 oass.OpenExchangeRatesOrgProvider.init Initialized with rates=open-exchange-rates.json, refreshInterval=1440.
[junit4:junit4]   2> 8084 T2636 oass.IndexSchema.readSchema default search field in schema is text
[junit4:junit4]   2> 8091 T2636 oass.IndexSchema.readSchema unique key field: id
[junit4:junit4]   2> 8116 T2636 oass.FileExchangeRateProvider.reload Reloading exchange rates from file currency.xml
[junit4:junit4]   2> 8124 T2636 oass.FileExchangeRateProvider.reload Reloading exchange rates from file currency.xml
[junit4:junit4]   2> 8130 T2636 oass.OpenExchangeRatesOrgProvider.reload Reloading exchange rates from open-exchange-rates.json
[junit4:junit4]   2> 8132 T2636 oass.OpenExchangeRatesOrgProvider.reload Reloading exchange rates from open-exchange-rates.json
[junit4:junit4]   2> 8133 T2636 oasc.SolrCore.<init> [collection1] Opening new SolrCore at /usr/home/hudson/hudson-slave/workspace/Lucene-Solr-Tests-trunk-Java6/solr/build/solr-core/test/J0/./org.apache.solr.cloud.SyncSliceTest-jetty3-1355529940187/collection1/, dataDir=./org.apache.solr.cloud.SyncSliceTest-1355529933422/jetty3/
[junit4:junit4]   2> 8134 T2636 oasc.JmxMonitoredMap.<init> JMX monitoring is enabled. Adding Solr mbeans to JMX Server: com.sun.jmx.mbeanserver.JmxMBeanServer@418bbf55
[junit4:junit4]   2> 8134 T2636 oasc.SolrCore.initDirectoryFactory solr.StandardDirectoryFactory
[junit4:junit4]   2> 8135 T2636 oasc.CachingDirectoryFactory.get return new directory for /usr/home/hudson/hudson-slave/workspace/Lucene-Solr-Tests-trunk-Java6/solr/build/solr-core/test/J0/./org.apache.solr.cloud.SyncSliceTest-1355529933422/jetty3 forceNew:false
[junit4:junit4]   2> 8136 T2636 oasc.CachingDirectoryFactory.close Releasing directory:/usr/home/hudson/hudson-slave/workspace/Lucene-Solr-Tests-trunk-Java6/solr/build/solr-core/test/J0/./org.apache.solr.cloud.SyncSliceTest-1355529933422/jetty3
[junit4:junit4]   2> 8137 T2636 oasc.SolrCore.getNewIndexDir New index directory detected: old=null new=./org.apache.solr.cloud.SyncSliceTest-1355529933422/jetty3/index/
[junit4:junit4]   2> 8138 T2636 oasc.SolrCore.initIndex WARNING [collection1] Solr index directory './org.apache.solr.cloud.SyncSliceTest-1355529933422/jetty3/index' doesn't exist. Creating new index...
[junit4:junit4]   2> 8139 T2636 oasc.CachingDirectoryFactory.get return new directory for /usr/home/hudson/hudson-slave/workspace/Lucene-Solr-Tests-trunk-Java6/solr/build/solr-core/test/J0/./org.apache.solr.cloud.SyncSliceTest-1355529933422/jetty3/index forceNew:false
[junit4:junit4]   2> 8146 T2636 oasc.SolrDeletionPolicy.onCommit SolrDeletionPolicy.onCommit: commits:num=1
[junit4:junit4]   2> 		commit{dir=RateLimitedDirectoryWrapper(org.apache.lucene.store.NIOFSDirectory@/usr/home/hudson/hudson-slave/workspace/Lucene-Solr-Tests-trunk-Java6/solr/build/solr-core/test/J0/org.apache.solr.cloud.SyncSliceTest-1355529933422/jetty3/index lockFactory=org.apache.lucene.store.NativeFSLockFactory@72c5c572),segFN=segments_1,generation=1,filenames=[segments_1]
[junit4:junit4]   2> 8146 T2636 oasc.SolrDeletionPolicy.updateCommits newest commit = 1[segments_1]
[junit4:junit4]   2> 8147 T2636 oasc.CachingDirectoryFactory.close Releasing directory:/usr/home/hudson/hudson-slave/workspace/Lucene-Solr-Tests-trunk-Java6/solr/build/solr-core/test/J0/./org.apache.solr.cloud.SyncSliceTest-1355529933422/jetty3/index
[junit4:junit4]   2> 8148 T2636 oasc.SolrCore.initWriters created xml: solr.XMLResponseWriter
[junit4:junit4]   2> 8150 T2636 oasup.UpdateRequestProcessorChain.init inserting DistributedUpdateProcessorFactory into updateRequestProcessorChain "dedupe"
[junit4:junit4]   2> 8151 T2636 oasup.UpdateRequestProcessorChain.init inserting DistributedUpdateProcessorFactory into updateRequestProcessorChain "dedupe-allfields"
[junit4:junit4]   2> 8151 T2636 oasup.UpdateRequestProcessorChain.init inserting DistributedUpdateProcessorFactory into updateRequestProcessorChain "stored_sig"
[junit4:junit4]   2> 8152 T2636 oasup.UpdateRequestProcessorChain.init inserting DistributedUpdateProcessorFactory into updateRequestProcessorChain "uniq-fields"
[junit4:junit4]   2> 8152 T2636 oasup.UpdateRequestProcessorChain.init inserting DistributedUpdateProcessorFactory into updateRequestProcessorChain "distrib-dup-test-chain-implicit"
[junit4:junit4]   2> 8153 T2636 oasc.RequestHandlers.initHandlersFromConfig adding lazy requestHandler: solr.ReplicationHandler
[junit4:junit4]   2> 8153 T2636 oasc.RequestHandlers.initHandlersFromConfig created /replication: solr.ReplicationHandler
[junit4:junit4]   2> 8155 T2636 oasc.RequestHandlers.initHandlersFromConfig created standard: solr.StandardRequestHandler
[junit4:junit4]   2> 8156 T2636 oasc.RequestHandlers.initHandlersFromConfig created /get: solr.RealTimeGetHandler
[junit4:junit4]   2> 8157 T2636 oasc.RequestHandlers.initHandlersFromConfig created dismax: solr.SearchHandler
[junit4:junit4]   2> 8158 T2636 oasc.RequestHandlers.initHandlersFromConfig created mock: org.apache.solr.core.MockQuerySenderListenerReqHandler
[junit4:junit4]   2> 8159 T2636 oasc.RequestHandlers.initHandlersFromConfig created /admin/: org.apache.solr.handler.admin.AdminHandlers
[junit4:junit4]   2> 8160 T2636 oasc.RequestHandlers.initHandlersFromConfig created defaults: solr.StandardRequestHandler
[junit4:junit4]   2> 8160 T2636 oasc.RequestHandlers.initHandlersFromConfig adding lazy requestHandler: solr.StandardRequestHandler
[junit4:junit4]   2> 8161 T2636 oasc.RequestHandlers.initHandlersFromConfig created lazy: solr.StandardRequestHandler
[junit4:junit4]   2> 8162 T2636 oasc.RequestHandlers.initHandlersFromConfig created /update: solr.UpdateRequestHandler
[junit4:junit4]   2> 8163 T2636 oasc.RequestHandlers.initHandlersFromConfig created /terms: org.apache.solr.handler.component.SearchHandler
[junit4:junit4]   2> 8164 T2636 oasc.RequestHandlers.initHandlersFromConfig created spellCheckCompRH: org.apache.solr.handler.component.SearchHandler
[junit4:junit4]   2> 8165 T2636 oasc.RequestHandlers.initHandlersFromConfig created spellCheckCompRH_Direct: org.apache.solr.handler.component.SearchHandler
[junit4:junit4]   2> 8166 T2636 oasc.RequestHandlers.initHandlersFromConfig created spellCheckWithWordbreak: org.apache.solr.handler.component.SearchHandler
[junit4:junit4]   2> 8167 T2636 oasc.RequestHandlers.initHandlersFromConfig created spellCheckWithWordbreak_Direct: org.apache.solr.handler.component.SearchHandler
[junit4:junit4]   2> 8168 T2636 oasc.RequestHandlers.initHandlersFromConfig created spellCheckCompRH1: org.apache.solr.handler.component.SearchHandler
[junit4:junit4]   2> 8170 T2636 oasc.RequestHandlers.initHandlersFromConfig created mltrh: org.apache.solr.handler.component.SearchHandler
[junit4:junit4]   2> 8171 T2636 oasc.RequestHandlers.initHandlersFromConfig created tvrh: org.apache.solr.handler.component.SearchHandler
[junit4:junit4]   2> 8172 T2636 oasc.RequestHandlers.initHandlersFromConfig created /mlt: solr.MoreLikeThisHandler
[junit4:junit4]   2> 8173 T2636 oasc.RequestHandlers.initHandlersFromConfig created /debug/dump: solr.DumpRequestHandler
[junit4:junit4]   2> 8184 T2636 oashl.XMLLoader.init xsltCacheLifetimeSeconds=60
[junit4:junit4]   2> 8191 T2636 oasc.SolrCore.initDeprecatedSupport WARNING solrconfig.xml uses deprecated <admin/gettableFiles>, Please update your config to use the ShowFileRequestHandler.
[junit4:junit4]   2> 8193 T2636 oasc.SolrCore.initDeprecatedSupport WARNING adding ShowFileRequestHandler with hidden files: [SCHEMA.XML, OLD_SYNONYMS.TXT, STOPWORDS.TXT, PROTWORDS.TXT, OPEN-EXCHANGE-RATES.JSON, SYNONYMS.TXT, CURRENCY.XML, MAPPING-ISOLATIN1ACCENT.TXT]
[junit4:junit4]   2> 8196 T2636 oasc.CachingDirectoryFactory.close Releasing directory:/usr/home/hudson/hudson-slave/workspace/Lucene-Solr-Tests-trunk-Java6/solr/build/solr-core/test/J0/./org.apache.solr.cloud.SyncSliceTest-1355529933422/jetty3
[junit4:junit4]   2> 8199 T2636 oass.SolrIndexSearcher.<init> Opening Searcher@7bd804fc main
[junit4:junit4]   2> 8200 T2636 oasu.CommitTracker.<init> Hard AutoCommit: disabled
[junit4:junit4]   2> 8201 T2636 oasu.CommitTracker.<init> Soft AutoCommit: disabled
[junit4:junit4]   2> 8201 T2636 oashc.SpellCheckComponent.inform Initializing spell checkers
[junit4:junit4]   2> 8211 T2636 oass.DirectSolrSpellChecker.init init: {name=direct,classname=DirectSolrSpellChecker,field=lowerfilt,minQueryLength=3}
[junit4:junit4]   2> 8267 T2637 oasc.SolrCore.registerSearcher [collection1] Registered new searcher Searcher@7bd804fc main{StandardDirectoryReader(segments_1:1)}
[junit4:junit4]   2> 8273 T2636 oasc.ZkController.publish publishing core=collection1 state=down
[junit4:junit4]   2> 8274 T2636 oasc.ZkController.publish numShards not found on descriptor - reading it from system property
[junit4:junit4]   2> 8404 T2585 oascc.ZkStateReader.updateClusterState Updating cloud state from ZooKeeper... 
[junit4:junit4]   2> 8405 T2585 oasc.Overseer$ClusterStateUpdater.updateState Update state numShards=1 message={
[junit4:junit4]   2> 	  "operation":"state",
[junit4:junit4]   2> 	  "numShards":"1",
[junit4:junit4]   2> 	  "shard":null,
[junit4:junit4]   2> 	  "roles":null,
[junit4:junit4]   2> 	  "state":"down",
[junit4:junit4]   2> 	  "core":"collection1",
[junit4:junit4]   2> 	  "collection":"collection1",
[junit4:junit4]   2> 	  "node_name":"127.0.0.1:63386_",
[junit4:junit4]   2> 	  "base_url":"http://127.0.0.1:63386"}
[junit4:junit4]   2> 8405 T2585 oasc.Overseer$ClusterStateUpdater.updateState Collection already exists with numShards=1
[junit4:junit4]   2> 8405 T2585 oasc.Overseer$ClusterStateUpdater.updateState Assigning new node to shard shard=shard1
[junit4:junit4]   2> 8410 T2635 oascc.ZkStateReader$2.process A cluster state change: WatchedEvent state:SyncConnected type:NodeDataChanged path:/clusterstate.json, has occurred - updating... (live nodes size: 4)
[junit4:junit4]   2> 8410 T2618 oascc.ZkStateReader$2.process A cluster state change: WatchedEvent state:SyncConnected type:NodeDataChanged path:/clusterstate.json, has occurred - updating... (live nodes size: 4)
[junit4:junit4]   2> 8410 T2590 oascc.ZkStateReader$2.process A cluster state change: WatchedEvent state:SyncConnected type:NodeDataChanged path:/clusterstate.json, has occurred - updating... (live nodes size: 4)
[junit4:junit4]   2> 8410 T2603 oascc.ZkStateReader$2.process A cluster state change: WatchedEvent state:SyncConnected type:NodeDataChanged path:/clusterstate.json, has occurred - updating... (live nodes size: 4)
[junit4:junit4]   2> 8410 T2584 oascc.ZkStateReader$2.process A cluster state change: WatchedEvent state:SyncConnected type:NodeDataChanged path:/clusterstate.json, has occurred - updating... (live nodes size: 4)
[junit4:junit4]   2> 8777 T2636 oasc.CoreContainer.registerCore registering core: collection1
[junit4:junit4]   2> 8777 T2636 oasc.ZkController.register Register shard - core:collection1 address:http://127.0.0.1:63386 shardId:shard1
[junit4:junit4]   2> 8808 T2636 oasc.ZkController.register We are http://127.0.0.1:63386/collection1/ and leader is http://127.0.0.1:63371/collection1/
[junit4:junit4]   2> 8808 T2636 oasc.ZkController.register No LogReplay needed for core=collection1 baseURL=http://127.0.0.1:63386
[junit4:junit4]   2> 8809 T2636 oasc.ZkController.checkRecovery Core needs to recover:collection1
[junit4:junit4]   2> 8809 T2636 oasu.DefaultSolrCoreState.doRecovery Running recovery - first canceling any ongoing recovery
[junit4:junit4]   2> ASYNC  NEW_CORE C265 name=collection1 org.apache.solr.core.SolrCore@478d6f1f url=http://127.0.0.1:63386/collection1 node=127.0.0.1:63386_
[junit4:junit4]   2> 8809 T2638 C265 P63386 oasc.RecoveryStrategy.run Starting recovery process.  core=collection1 recoveringAfterStartup=true
[junit4:junit4]   2> 8810 T2638 C265 P63386 oasc.RecoveryStrategy.doRecovery ###### startupVersions=[]
[junit4:junit4]   2> 8810 T2636 oascc.ZkStateReader.updateClusterState Updating cloud state from ZooKeeper... 
[junit4:junit4]   2> 8810 T2638 C265 P63386 oasc.ZkController.publish publishing core=collection1 state=recovering
[junit4:junit4]   2> 8810 T2638 C265 P63386 oasc.ZkController.publish numShards not found on descriptor - reading it from system property
[junit4:junit4]   2> 8811 T2562 oass.SolrDispatchFilter.init user.dir=/usr/home/hudson/hudson-slave/workspace/Lucene-Solr-Tests-trunk-Java6/solr/build/solr-core/test/J0
[junit4:junit4]   2> 8811 T2562 oass.SolrDispatchFilter.init SolrDispatchFilter.init() done
[junit4:junit4]   2> 8812 T2562 oascsi.HttpClientUtil.createClient Creating new http client, config:maxConnections=128&maxConnectionsPerHost=32&followRedirects=false
[junit4:junit4]   2> 8850 T2638 C265 P63386 oasc.RecoveryStrategy.doRecovery Attempting to PeerSync from http://127.0.0.1:63371/collection1/ core=collection1 - recoveringAfterStartup=true
[junit4:junit4]   2> 8851 T2638 C265 P63386 oasu.PeerSync.sync PeerSync: core=collection1 url=http://127.0.0.1:63386 START replicas=[http://127.0.0.1:63371/collection1/] nUpdates=100
[junit4:junit4]   2> 8851 T2638 C265 P63386 oasu.PeerSync.sync WARNING no frame of reference to tell of we've missed updates
[junit4:junit4]   2> 8852 T2638 C265 P63386 oasc.RecoveryStrategy.doRecovery PeerSync Recovery was not successful - trying replication. core=collection1
[junit4:junit4]   2> 8853 T2638 C265 P63386 oasc.RecoveryStrategy.doRecovery Starting Replication Recovery. core=collection1
[junit4:junit4]   2> 8853 T2638 C265 P63386 oascsi.HttpClientUtil.createClient Creating new http client, config:maxConnections=128&maxConnectionsPerHost=32&followRedirects=false
[junit4:junit4]   2> 8855 T2593 C264 P63371 REQ /get {distrib=false&qt=/get&wt=javabin&version=2&getVersions=100} status=0 QTime=0 
[junit4:junit4]   2> 8924 T2585 oascc.ZkStateReader.updateClusterState Updating cloud state from ZooKeeper... 
[junit4:junit4]   2> 8925 T2585 oasc.Overseer$ClusterStateUpdater.updateState Update state numShards=1 message={
[junit4:junit4]   2> 	  "operation":"state",
[junit4:junit4]   2> 	  "numShards":"1",
[junit4:junit4]   2> 	  "shard":"shard1",
[junit4:junit4]   2> 	  "roles":null,
[junit4:junit4]   2> 	  "state":"recovering",
[junit4:junit4]   2> 	  "core":"collection1",
[junit4:junit4]   2> 	  "collection":"collection1",
[junit4:junit4]   2> 	  "node_name":"127.0.0.1:63386_",
[junit4:junit4]   2> 	  "base_url":"http://127.0.0.1:63386"}
[junit4:junit4]   2> 8935 T2562 oejs.Server.doStart jetty-8.1.8.v20121106
[junit4:junit4]   2> 8938 T2562 oejs.AbstractConnector.doStart Started SocketConnector@127.0.0.1:63407
[junit4:junit4]   2> 8939 T2562 oasc.SolrResourceLoader.locateSolrHome JNDI not configured for solr (NoInitialContextEx)
[junit4:junit4]   2> 8940 T2562 oasc.SolrResourceLoader.locateSolrHome using system property solr.solr.home: /usr/home/hudson/hudson-slave/workspace/Lucene-Solr-Tests-trunk-Java6/solr/build/solr-core/test/J0/./org.apache.solr.cloud.SyncSliceTest-jetty4-1355529942237
[junit4:junit4]   2> 8940 T2562 oasc.SolrResourceLoader.<init> new SolrResourceLoader for deduced Solr Home: '/usr/home/hudson/hudson-slave/workspace/Lucene-Solr-Tests-trunk-Java6/solr/build/solr-core/test/J0/./org.apache.solr.cloud.SyncSliceTest-jetty4-1355529942237/'
[junit4:junit4]   2> 8965 T2562 oass.SolrDispatchFilter.init SolrDispatchFilter.init()
[junit4:junit4]   2> 8966 T2562 oasc.SolrResourceLoader.locateSolrHome JNDI not configured for solr (NoInitialContextEx)
[junit4:junit4]   2> 8967 T2562 oasc.SolrResourceLoader.locateSolrHome using system property solr.solr.home: /usr/home/hudson/hudson-slave/workspace/Lucene-Solr-Tests-trunk-Java6/solr/build/solr-core/test/J0/./org.apache.solr.cloud.SyncSliceTest-jetty4-1355529942237
[junit4:junit4]   2> 8967 T2562 oasc.CoreContainer$Initializer.initialize looking for solr.xml: /usr/home/hudson/hudson-slave/workspace/Lucene-Solr-Tests-trunk-Java6/solr/build/solr-core/test/J0/./org.apache.solr.cloud.SyncSliceTest-jetty4-1355529942237/solr.xml
[junit4:junit4]   2> 8968 T2562 oasc.CoreContainer.<init> New CoreContainer 2014581565
[junit4:junit4]   2> 8968 T2562 oasc.CoreContainer.load Loading CoreContainer using Solr Home: '/usr/home/hudson/hudson-slave/workspace/Lucene-Solr-Tests-trunk-Java6/solr/build/solr-core/test/J0/./org.apache.solr.cloud.SyncSliceTest-jetty4-1355529942237/'
[junit4:junit4]   2> 8969 T2562 oasc.SolrResourceLoader.<init> new SolrResourceLoader for directory: '/usr/home/hudson/hudson-slave/workspace/Lucene-Solr-Tests-trunk-Java6/solr/build/solr-core/test/J0/./org.apache.solr.cloud.SyncSliceTest-jetty4-1355529942237/'
[junit4:junit4]   2> 8969 T2603 oascc.ZkStateReader$2.process A cluster state change: WatchedEvent state:SyncConnected type:NodeDataChanged path:/clusterstate.json, has occurred - updating... (live nodes size: 4)
[junit4:junit4]   2> 8969 T2590 oascc.ZkStateReader$2.process A cluster state change: WatchedEvent state:SyncConnected type:NodeDataChanged path:/clusterstate.json, has occurred - updating... (live nodes size: 4)
[junit4:junit4]   2> 8969 T2584 oascc.ZkStateReader$2.process A cluster state change: WatchedEvent state:SyncConnected type:NodeDataChanged path:/clusterstate.json, has occurred - updating... (live nodes size: 4)
[junit4:junit4]   2> 8969 T2618 oascc.ZkStateReader$2.process A cluster state change: WatchedEvent state:SyncConnected type:NodeDataChanged path:/clusterstate.json, has occurred - updating... (live nodes size: 4)
[junit4:junit4]   2> 8969 T2635 oascc.ZkStateReader$2.process A cluster state change: WatchedEvent state:SyncConnected type:NodeDataChanged path:/clusterstate.json, has occurred - updating... (live nodes size: 4)
[junit4:junit4]   2> 8990 T2562 oasc.CoreContainer.load Registering Log Listener
[junit4:junit4]   2> 9002 T2562 oasc.CoreContainer.initZooKeeper Zookeeper client=127.0.0.1:63353/solr
[junit4:junit4]   2> 9003 T2562 oasc.ZkController.checkChrootPath zkHost includes chroot
[junit4:junit4]   2> 9003 T2562 oaz.ZooKeeper.<init> Initiating client connection, connectString=127.0.0.1:63353 sessionTimeout=60000 watcher=org.apache.solr.common.cloud.ConnectionManager@c0b69b0
[junit4:junit4]   2> 9004 T2562 oascc.ConnectionManager.waitForConnected Waiting for client to connect to ZooKeeper
[junit4:junit4]   2> 9005 T2649 oaz.ClientCnxn$SendThread.logStartConnect Opening socket connection to server localhost/127.0.0.1:63353. Will not attempt to authenticate using SASL (access denied (javax.security.auth.AuthPermission getLoginConfiguration))
[junit4:junit4]   2> 9006 T2649 oaz.ClientCnxn$SendThread.primeConnection Socket connection established to localhost/127.0.0.1:63353, initiating session
[junit4:junit4]   2> 9006 T2564 oazs.NIOServerCnxnFactory.run Accepted socket connection from /140.211.11.196:63408
[junit4:junit4]   2> 9007 T2564 oazs.ZooKeeperServer.processConnectRequest Client attempting to establish new session at /140.211.11.196:63408
[junit4:junit4]   2> 9008 T2566 oazs.ZooKeeperServer.finishSessionInit Established session 0x13b9be15276000b with negotiated timeout 20000 for client /140.211.11.196:63408
[junit4:junit4]   2> 9008 T2649 oaz.ClientCnxn$SendThread.onConnected Session establishment complete on server localhost/127.0.0.1:63353, sessionid = 0x13b9be15276000b, negotiated timeout = 20000
[junit4:junit4]   2> 9008 T2650 oascc.ConnectionManager.process Watcher org.apache.solr.common.cloud.ConnectionManager@c0b69b0 name:ZooKeeperConnection Watcher:127.0.0.1:63353 got event WatchedEvent state:SyncConnected type:None path:null path:null type:None
[junit4:junit4]   2> 9008 T2562 oascc.ConnectionManager.waitForConnected Client is connected to ZooKeeper
[junit4:junit4]   2> 9009 T2567 oazs.PrepRequestProcessor.pRequest2Txn Processed session termination for sessionid: 0x13b9be15276000b
[junit4:junit4]   2> 9011 T2650 oaz.ClientCnxn$EventThread.run EventThread shut down
[junit4:junit4]   2> 9011 T2564 oazs.NIOServerCnxn.closeSock Closed socket connection for client /140.211.11.196:63408 which had sessionid 0x13b9be15276000b
[junit4:junit4]   2> 9011 T2562 oaz.ZooKeeper.close Session: 0x13b9be15276000b closed
[junit4:junit4]   2> 9013 T2562 oaz.ZooKeeper.<init> Initiating client connection, connectString=127.0.0.1:63353/solr sessionTimeout=8000 watcher=org.apache.solr.common.cloud.ConnectionManager@5d179538
[junit4:junit4]   2> 9013 T2562 oascc.ConnectionManager.waitForConnected Waiting for client to connect to ZooKeeper
[junit4:junit4]   2> 9014 T2651 oaz.ClientCnxn$SendThread.logStartConnect Opening socket connection to server localhost/127.0.0.1:63353. Will not attempt to authenticate using SASL (access denied (javax.security.auth.AuthPermission getLoginConfiguration))
[junit4:junit4]   2> 9014 T2651 oaz.ClientCnxn$SendThread.primeConnection Socket connection established to localhost/127.0.0.1:63353, initiating session
[junit4:junit4]   2> 9014 T2564 oazs.NIOServerCnxnFactory.run Accepted socket connection from /140.211.11.196:63409
[junit4:junit4]   2> 9015 T2564 oazs.ZooKeeperServer.processConnectRequest Client attempting to establish new session at /140.211.11.196:63409
[junit4:junit4]   2> 9016 T2566 oazs.ZooKeeperServer.finishSessionInit Established session 0x13b9be15276000c with negotiated timeout 8000 for client /140.211.11.196:63409
[junit4:junit4]   2> 9016 T2651 oaz.ClientCnxn$SendThread.onConnected Session establishment complete on server localhost/127.0.0.1:63353, sessionid = 0x13b9be15276000c, negotiated timeout = 8000
[junit4:junit4]   2> 9017 T2652 oascc.ConnectionManager.process Watcher org.apache.solr.common.cloud.ConnectionManager@5d179538 name:ZooKeeperConnection Watcher:127.0.0.1:63353/solr got event WatchedEvent state:SyncConnected type:None path:null path:null type:None
[junit4:junit4]   2> 9017 T2562 oascc.ConnectionManager.waitForConnected Client is connected to ZooKeeper
[junit4:junit4]   2> 9018 T2567 oazs.PrepRequestProcessor.pRequest Got user-level KeeperException when processing sessionid:0x13b9be15276000c type:create cxid:0x1 zxid:0x97 txntype:-1 reqpath:n/a Error Path:/solr/overseer Error:KeeperErrorCode = NodeExists for /solr/overseer
[junit4:junit4]   2> 9019 T2567 oazs.PrepRequestProcessor.pRequest Got user-level KeeperException when processing sessionid:0x13b9be15276000c type:create cxid:0x2 zxid:0x98 txntype:-1 reqpath:n/a Error Path:/solr/overseer Error:KeeperErrorCode = NodeExists for /solr/overseer
[junit4:junit4]   2> 9028 T2562 oasc.ZkController.createEphemeralLiveNode Register node as live in ZooKeeper:/live_nodes/127.0.0.1:63407_
[junit4:junit4]   2> 9029 T2567 oazs.PrepRequestProcessor.pRequest Got user-level KeeperException when processing sessionid:0x13b9be15276000c type:delete cxid:0x4 zxid:0x99 txntype:-1 reqpath:n/a Error Path:/solr/live_nodes/127.0.0.1:63407_ Error:KeeperErrorCode = NoNode for /solr/live_nodes/127.0.0.1:63407_
[junit4:junit4]   2> 9030 T2562 oascc.SolrZkClient.makePath makePath: /live_nodes/127.0.0.1:63407_
[junit4:junit4]   2> 9035 T2635 oascc.ZkStateReader$2.process A cluster state change: WatchedEvent state:SyncConnected type:NodeChildrenChanged path:/live_nodes, has occurred - updating... (live nodes size: 4)
[junit4:junit4]   2> 9035 T2618 oascc.ZkStateReader$2.process A cluster state change: WatchedEvent state:SyncConnected type:NodeChildrenChanged path:/live_nodes, has occurred - updating... (live nodes size: 4)
[junit4:junit4]   2> 9035 T2603 oascc.ZkStateReader$3.process Updating live nodes... (5)
[junit4:junit4]   2> 9035 T2590 oascc.ZkStateReader$3.process Updating live nodes... (5)
[junit4:junit4]   2> 9035 T2584 oascc.ZkStateReader$3.process Updating live nodes... (5)
[junit4:junit4]   2> 9036 T2603 oascc.ZkStateReader$2.process A cluster state change: WatchedEvent state:SyncConnected type:NodeChildrenChanged path:/live_nodes, has occurred - updating... (live nodes size: 5)
[junit4:junit4]   2> 9036 T2590 oascc.ZkStateReader$2.process A cluster state change: WatchedEvent state:SyncConnected type:NodeChildrenChanged path:/live_nodes, has occurred - updating... (live nodes size: 5)
[junit4:junit4]   2> 9036 T2584 oascc.ZkStateReader$2.process A cluster state change: WatchedEvent state:SyncConnected type:NodeChildrenChanged path:/live_nodes, has occurred - updating... (live nodes size: 5)
[junit4:junit4]   2> 9036 T2635 oascc.ZkStateReader$3.process Updating live nodes... (5)
[junit4:junit4]   2> 9036 T2562 oashc.HttpShardHandlerFactory.getParameter Setting socketTimeout to: 0
[junit4:junit4]   2> 9037 T2618 oascc.ZkStateReader$3.process Updating live nodes... (5)
[junit4:junit4]   2> 9037 T2562 oashc.HttpShardHandlerFactory.getParameter Setting urlScheme to: http://
[junit4:junit4]   2> 9037 T2562 oashc.HttpShardHandlerFactory.getParameter Setting connTimeout to: 0
[junit4:junit4]   2> 9038 T2562 oashc.HttpShardHandlerFactory.getParameter Setting maxConnectionsPerHost to: 20
[junit4:junit4]   2> 9038 T2562 oashc.HttpShardHandlerFactory.getParameter Setting corePoolSize to: 0
[junit4:junit4]   2> 9039 T2562 oashc.HttpShardHandlerFactory.getParameter Setting maximumPoolSize to: 2147483647
[junit4:junit4]   2> 9039 T2562 oashc.HttpShardHandlerFactory.getParameter Setting maxThreadIdleTime to: 5
[junit4:junit4]   2> 9039 T2562 oashc.HttpShardHandlerFactory.getParameter Setting sizeOfQueue to: -1
[junit4:junit4]   2> 9040 T2562 oashc.HttpShardHandlerFactory.getParameter Setting fairnessPolicy to: false
[junit4:junit4]   2> 9040 T2562 oascsi.HttpClientUtil.createClient Creating new http client, config:maxConnectionsPerHost=20&maxConnections=10000&socketTimeout=0&connTimeout=0&retry=false
[junit4:junit4]   2> 9052 T2562 oascc.ZkStateReader.createClusterStateWatchersAndUpdate Updating cluster state from ZooKeeper... 
[junit4:junit4]   2> 9059 T2653 oasc.CoreContainer.create Creating SolrCore 'collection1' using instanceDir: /usr/home/hudson/hudson-slave/workspace/Lucene-Solr-Tests-trunk-Java6/solr/build/solr-core/test/J0/./org.apache.solr.cloud.SyncSliceTest-jetty4-1355529942237/collection1
[junit4:junit4]   2> 9060 T2653 oasc.ZkController.createCollectionZkNode Check for collection zkNode:collection1
[junit4:junit4]   2> 9060 T2653 oasc.ZkController.createCollectionZkNode Collection zkNode exists
[junit4:junit4]   2> 9061 T2653 oasc.ZkController.readConfigName Load collection config from:/collections/collection1
[junit4:junit4]   2> 9062 T2653 oasc.SolrResourceLoader.<init> new SolrResourceLoader for directory: '/usr/home/hudson/hudson-slave/workspace/Lucene-Solr-Tests-trunk-Java6/solr/build/solr-core/test/J0/./org.apache.solr.cloud.SyncSliceTest-jetty4-1355529942237/collection1/'
[junit4:junit4]   2> 9063 T2653 oasc.SolrResourceLoader.replaceClassLoader Adding 'file:/usr/home/hudson/hudson-slave/workspace/Lucene-Solr-Tests-trunk-Java6/solr/build/solr-core/test/J0/org.apache.solr.cloud.SyncSliceTest-jetty4-1355529942237/collection1/lib/README' to classloader
[junit4:junit4]   2> 9064 T2653 oasc.SolrResourceLoader.replaceClassLoader Adding 'file:/usr/home/hudson/hudson-slave/workspace/Lucene-Solr-Tests-trunk-Java6/solr/build/solr-core/test/J0/org.apache.solr.cloud.SyncSliceTest-jetty4-1355529942237/collection1/lib/classes/' to classloader
[junit4:junit4]   2> 9117 T2653 oasc.SolrConfig.<init> Using Lucene MatchVersion: LUCENE_50
[junit4:junit4]   2> 9199 T2653 oasc.SolrConfig.<init> Loaded SolrConfig: solrconfig.xml
[junit4:junit4]   2> 9299 T2653 oass.IndexSchema.readSchema Reading Solr Schema
[junit4:junit4]   2> 9305 T2653 oass.IndexSchema.readSchema Schema name=test
[junit4:junit4]   2>  C263_STATE=coll:collection1 core:collection1 props:{shard=shard1, roles=null, state=recovering, core=collection1, collection=collection1, node_name=127.0.0.1:63376_, base_url=http://127.0.0.1:63376}
[junit4:junit4]   2> 9774 T2621 C263 P63376 oasc.RecoveryStrategy.doRecovery Begin buffering updates. core=collection1
[junit4:junit4]   2> 9774 T2621 C263 P63376 oasu.UpdateLog.bufferUpdates Starting to buffer updates. FSUpdateLog{state=ACTIVE, tlog=null}
[junit4:junit4]   2> 9774 T2621 C263 P63376 oasc.RecoveryStrategy.replicate Attempting to replicate from http://127.0.0.1:63371/collection1/. core=collection1
[junit4:junit4]   2> 9774 T2621 C263 P63376 oascsi.HttpClientUtil.createClient Creating new http client, config:maxConnections=128&maxConnectionsPerHost=32&followRedirects=false
[junit4:junit4]   2> 9781 T2596 C264 P63371 oasu.DirectUpdateHandler2.commit start commit{flags=0,_version_=0,optimize=false,openSearcher=false,waitSearcher=true,expungeDeletes=false,softCommit=false}
[junit4:junit4]   2> 9783 T2596 C264 P63371 oasc.CachingDirectoryFactory.close Releasing directory:/usr/home/hudson/hudson-slave/workspace/Lucene-Solr-Tests-trunk-Java6/solr/build/solr-core/test/J0/./org.apache.solr.cloud.SyncSliceTest-1355529933422/jetty1
[junit4:junit4]   2> 9789 T2596 C264 P63371 oasc.SolrDeletionPolicy.onInit SolrDeletionPolicy.onInit: commits:num=1
[junit4:junit4]   2> 		commit{dir=RateLimitedDirectoryWrapper(org.apache.lucene.store.NIOFSDirectory@/usr/home/hudson/hudson-slave/workspace/Lucene-Solr-Tests-trunk-Java6/solr/build/solr-core/test/J0/org.apache.solr.cloud.SyncSliceTest-1355529933422/jetty1/index lockFactory=org.apache.lucene.store.NativeFSLockFactory@57a2e170),segFN=segments_1,generation=1,filenames=[segments_1]
[junit4:junit4]   2> 9790 T2596 C264 P63371 oasc.SolrDeletionPolicy.updateCommits newest commit = 1[segments_1]
[junit4:junit4]   2> 9806 T2596 C264 P63371 oasc.SolrDeletionPolicy.onCommit SolrDeletionPolicy.onCommit: commits:num=2
[junit4:junit4]   2> 		commit{dir=RateLimitedDirectoryWrapper(org.apache.lucene.store.NIOFSDirectory@/usr/home/hudson/hudson-slave/workspace/Lucene-Solr-Tests-trunk-Java6/solr/build/solr-core/test/J0/org.apache.solr.cloud.SyncSliceTest-1355529933422/jetty1/index lockFactory=org.apache.lucene.store.NativeFSLockFactory@57a2e170),segFN=segments_1,generation=1,filenames=[segments_1]
[junit4:junit4]   2> 		commit{dir=RateLimitedDirectoryWrapper(org.apache.lucene.store.NIOFSDirectory@/usr/home/hudson/hudson-slave/workspace/Lucene-Solr-Tests-trunk-Java6/solr/build/solr-core/test/J0/org.apache.solr.cloud.SyncSliceTest-1355529933422/jetty1/index lockFactory=org.apache.lucene.store.NativeFSLockFactory@57a2e170),segFN=segments_2,generation=2,filenames=[segments_2]
[junit4:junit4]   2> 9806 T2596 C264 P63371 oasc.SolrDeletionPolicy.updateCommits newest commit = 2[segments_2]
[junit4:junit4]   2> 9808 T2596 C264 P63371 oasc.CachingDirectoryFactory.close Releasing directory:/usr/home/hudson/hudson-slave/workspace/Lucene-Solr-Tests-trunk-Java6/solr/build/solr-core/test/J0/./org.apache.solr.cloud.SyncSliceTest-1355529933422/jetty1
[junit4:junit4]   2> 9808 T2596 C264 P63371 oass.SolrIndexSearcher.<init> Opening Searcher@697c99b4 realtime
[junit4:junit4]   2> 9809 T2596 C264 P63371 oasu.DirectUpdateHandler2.commit end_commit_flush
[junit4:junit4]   2> 9809 T2596 C264 P63371 /update {waitSearcher=true&openSearcher=false&commit=true&commit_end_point=true&wt=javabin&softCommit=false&version=2} {commit=} 0 28
[junit4:junit4]   2> 9810 T2621 C263 P63376 oash.ReplicationHandler.inform Commits will be reserved for  10000
[junit4:junit4]   2> 9811 T2621 C263 P63376 oash.SnapPuller.<init>  No value set for 'pollInterval'. Timer Task not started.
[junit4:junit4]   2> 9813 T2597 C264 P63371 oash.ReplicationHandler.inform Commits will be reserved for  10000
[junit4:junit4]   2> 9813 T2597 C264 P63371 REQ /replication {command=indexversion&wt=javabin&qt=/replication&version=2} status=0 QTime=1 
[junit4:junit4]   2> 9814 T2621 C263 P63376 oash.SnapPuller.fetchLatestIndex Master's generation: 2
[junit4:junit4]   2> 9814 T2621 C263 P63376 oash.SnapPuller.fetchLatestIndex Slave's generation: 1
[junit4:junit4]   2> 9814 T2621 C263 P63376 oash.SnapPuller.fetchLatestIndex Starting replication process
[junit4:junit4]   2> 9816 T2597 C264 P63371 oasc.CachingDirectoryFactory.close Releasing directory:/usr/home/hudson/hudson-slave/workspace/Lucene-Solr-Tests-trunk-Java6/solr/build/solr-core/test/J0/./org.apache.solr.cloud.SyncSliceTest-1355529933422/jetty1
[junit4:junit4]   2> 9817 T2597 C264 P63371 oasc.CachingDirectoryFactory.close Releasing directory:/usr/home/hudson/hudson-slave/workspace/Lucene-Solr-Tests-trunk-Java6/solr/build/solr-core/test/J0/./org.apache.solr.cloud.SyncSliceTest-1355529933422/jetty1/index
[junit4:junit4]   2> 9817 T2597 C264 P63371 REQ /replication {command=filelist&generation=2&wt=javabin&qt=/replication&version=2} status=0 QTime=1 
[junit4:junit4]   2> 9818 T2621 C263 P63376 oash.SnapPuller.fetchLatestIndex Number of files in latest index in master: 1
[junit4:junit4]   2> 9819 T2621 C263 P63376 oasc.CachingDirectoryFactory.get return new directory for /usr/home/hudson/hudson-slave/workspace/Lucene-Solr-Tests-trunk-Java6/solr/build/solr-core/test/J0/./org.apache.solr.cloud.SyncSliceTest-1355529933422/jetty2/index.20121214130543234 forceNew:false
[junit4:junit4]   2> 9820 T2621 C263 P63376 oasc.CachingDirectoryFactory.close Releasing directory:/usr/home/hudson/hudson-slave/workspace/Lucene-Solr-Tests-trunk-Java6/solr/build/solr-core/test/J0/./org.apache.solr.cloud.SyncSliceTest-1355529933422/jetty2
[junit4:junit4]   2> 9820 T2621 C263 P63376 oash.SnapPuller.fetchLatestIndex Starting download to RateLimitedDirectoryWrapper(org.apache.lucene.store.NIOFSDirectory@/usr/home/hudson/hudson-slave/workspace/Lucene-Solr-Tests-trunk-Java6/solr/build/solr-core/test/J0/org.apache.solr.cloud.SyncSliceTest-1355529933422/jetty2/index.20121214130543234 lockFactory=org.apache.lucene.store.NativeFSLockFactory@48a84d04) fullCopy=true
[junit4:junit4]   2> 9824 T2597 C264 P63371 REQ /replication {file=segments_2&command=filecontent&checksum=true&generation=2&qt=/replication&wt=filestream} status=0 QTime=0 
[junit4:junit4]   2> 9825 T2621 C263 P63376 oasc.CachingDirectoryFactory.close Releasing directory:/usr/home/hudson/hudson-slave/workspace/Lucene-Solr-Tests-trunk-Java6/solr/build/solr-core/test/J0/./org.apache.solr.cloud.SyncSliceTest-1355529933422/jetty2/index
[junit4:junit4]   2> 9825 T2621 C263 P63376 oash.SnapPuller.fetchLatestIndex Total time taken for download : 0 secs
[junit4:junit4]   2> 9826 T2621 C263 P63376 oash.SnapPuller.modifyIndexProps New index installed. Updating index properties... index=index.20121214130543234
[junit4:junit4]   2> 9827 T2621 C263 P63376 oasc.CachingDirectoryFactory.close Releasing directory:/usr/home/hudson/hudson-slave/workspace/Lucene-Solr-Tests-trunk-Java6/solr/build/solr-core/test/J0/./org.apache.solr.cloud.SyncSliceTest-1355529933422/jetty2
[junit4:junit4]   2> 9827 T2621 C263 P63376 oasc.CachingDirectoryFactory.close Releasing directory:/usr/home/hudson/hudson-slave/workspace/Lucene-Solr-Tests-trunk-Java6/solr/build/solr-core/test/J0/./org.apache.solr.cloud.SyncSliceTest-1355529933422/jetty2
[junit4:junit4]   2> 9828 T2621 C263 P63376 oasc.SolrCore.getNewIndexDir New index directory detected: old=./org.apache.solr.cloud.SyncSliceTest-1355529933422/jetty2/index/ new=./org.apache.solr.cloud.SyncSliceTest-1355529933422/jetty2/index.20121214130543234
[junit4:junit4]   2> 9831 T2621 C263 P63376 oasc.SolrDeletionPolicy.onInit SolrDeletionPolicy.onInit: commits:num=1
[junit4:junit4]   2> 		commit{dir=RateLimitedDirectoryWrapper(org.apache.lucene.store.NIOFSDirectory@/usr/home/hudson/hudson-slave/workspace/Lucene-Solr-Tests-trunk-Java6/solr/build/solr-core/test/J0/org.apache.solr.cloud.SyncSliceTest-1355529933422/jetty2/index.20121214130543234 lockFactory=org.apache.lucene.store.NativeFSLockFactory@48a84d04),segFN=segments_2,generation=2,filenames=[segments_2]
[junit4:junit4]   2> 9831 T2621 C263 P63376 oasc.SolrDeletionPolicy.updateCommits newest commit = 2[segments_2]
[junit4:junit4]   2> 9832 T2621 C263 P63376 oasc.CachingDirectoryFactory.close Releasing directory:/usr/home/hudson/hudson-slave/workspace/Lucene-Solr-Tests-trunk-Java6/solr/build/solr-core/test/J0/./org.apache.solr.cloud.SyncSliceTest-1355529933422/jetty2
[junit4:junit4]   2> 9833 T2621 C263 P63376 oasu.DefaultSolrCoreState.newIndexWriter Creating new IndexWriter...
[junit4:junit4]   2> 9833 T2621 C263 P63376 oasu.DefaultSolrCoreState.newIndexWriter Waiting until IndexWriter is unused... core=collection1
[junit4:junit4]   2> 9833 T2621 C263 P63376 oasu.DefaultSolrCoreState.newIndexWriter Rollback old IndexWriter... core=collection1
[junit4:junit4]   2> 9833 T2621 C263 P63376 oasc.CachingDirectoryFactory.close Releasing directory:/usr/home/hudson/hudson-slave/workspace/Lucene-Solr-Tests-trunk-Java6/solr/build/solr-core/test/J0/./org.apache.solr.cloud.SyncSliceTest-1355529933422/jetty2/index.20121214130543234
[junit4:junit4]   2> 9834 T2621 C263 P63376 oasc.CachingDirectoryFactory.close Releasing directory:/usr/home/hudson/hudson-slave/workspace/Lucene-Solr-Tests-trunk-Java6/solr/build/solr-core/test/J0/./org.apache.solr.cloud.SyncSliceTest-1355529933422/jetty2
[junit4:junit4]   2> 9837 T2621 C263 P63376 oasc.SolrDeletionPolicy.onInit SolrDeletionPolicy.onInit: commits:num=1
[junit4:junit4]   2> 		commit{dir=RateLimitedDirectoryWrapper(org.apache.lucene.store.NIOFSDirectory@/usr/home/hudson/hudson-slave/workspace/Lucene-Solr-Tests-trunk-Java6/solr/build/solr-core/test/J0/org.apache.solr.cloud.SyncSliceTest-1355529933422/jetty2/index.20121214130543234 lockFactory=org.apache.lucene.store.NativeFSLockFactory@48a84d04),segFN=segments_2,generation=2,filenames=[segments_2]
[junit4:junit4]   2> 9838 T2621 C263 P63376 oasc.SolrDeletionPolicy.updateCommits newest commit = 2[segments_2]
[junit4:junit4]   2> 9838 T2621 C263 P63376 oasu.DefaultSolrCoreState.newIndexWriter New IndexWriter is ready to be used.
[junit4:junit4]   2> 9838 T2621 C263 P63376 oasc.CachingDirectoryFactory.close Releasing directory:/usr/home/hudson/hudson-slave/workspace/Lucene-Solr-Tests-trunk-Java6/solr/build/solr-core/test/J0/./org.apache.solr.cloud.SyncSliceTest-1355529933422/jetty2
[junit4:junit4]   2> 9838 T2621 C263 P63376 oass.SolrIndexSearcher.<init> Opening Searcher@4c5fda72 main
[junit4:junit4]   2> 9840 T2620 oasc.SolrCore.registerSearcher [collection1] Registered new searcher Searcher@4c5fda72 main{StandardDirectoryReader(segments_2:1:nrt)}
[junit4:junit4]   2> 9840 T2620 oasc.CachingDirectoryFactory.close Releasing directory:/usr/home/hudson/hudson-slave/workspace/Lucene-Solr-Tests-trunk-Java6/solr/build/solr-core/test/J0/./org.apache.solr.cloud.SyncSliceTest-1355529933422/jetty2/index
[junit4:junit4]   2> 9841 T2621 C263 P63376 oasu.DirectUpdateHandler2.commit start commit{flags=0,_version_=0,optimize=false,openSearcher=false,waitSearcher=false,expungeDeletes=false,softCommit=false}
[junit4:junit4]   2> 9843 T2621 C263 P63376 oasc.SolrDeletionPolicy.onCommit SolrDeletionPolicy.onCommit: commits:num=2
[junit4:junit4]   2> 		commit{dir=RateLimitedDirectoryWrapper(org.apache.lucene.store.NIOFSDirectory@/usr/home/hudson/hudson-slave/workspace/Lucene-Solr-Tests-trunk-Java6/solr/build/solr-core/test/J0/org.apache.solr.cloud.SyncSliceTest-1355529933422/jetty2/index.20121214130543234 lockFactory=org.apache.lucene.store.NativeFSLockFactory@48a84d04),segFN=segments_2,generation=2,filenames=[segments_2]
[junit4:junit4]   2> 		commit{dir=RateLimitedDirectoryWrapper(org.apache.lucene.store.NIOFSDirectory@/usr/home/hudson/hudson-slave/workspace/Lucene-Solr-Tests-trunk-Java6/solr/build/solr-core/test/J0/org.apache.solr.cloud.SyncSliceTest-1355529933422/jetty2/index.20121214130543234 lockFactory=org.apache.lucene.store.NativeFSLockFactory@48a84d04),segFN=segments_3,generation=3,filenames=[segments_3]
[junit4:junit4]   2> 9843 T2621 C263 P63376 oasc.SolrDeletionPolicy.updateCommits newest commit = 3[segments_3]
[junit4:junit4]   2> 9844 T2621 C263 P63376 oasc.CachingDirectoryFactory.close Releasing directory:/usr/home/hudson/hudson-slave/workspace/Lucene-Solr-Tests-trunk-Java6/solr/build/solr-core/test/J0/./org.apache.solr.cloud.SyncSliceTest-1355529933422/jetty2
[junit4:junit4]   2> 9844 T2621 C263 P63376 oasu.DirectUpdateHandler2.commit end_commit_flush
[junit4:junit4]   2> 9844 T2621 C263 P63376 oasc.CachingDirectoryFactory.close Releasing directory:/usr/home/hudson/hudson-slave/workspace/Lucene-Solr-Tests-trunk-Java6/solr/build/solr-core/test/J0/./org.apache.solr.cloud.SyncSliceTest-1355529933422/jetty2/index.20121214130543234
[junit4:junit4]   2> 9844 T2621 C263 P63376 oasc.CachingDirectoryFactory.close Releasing directory:/usr/home/hudson/hudson-slave/workspace/Lucene-Solr-Tests-trunk-Java6/solr/build/solr-core/test/J0/./org.apache.solr.cloud.SyncSliceTest-1355529933422/jetty2/index
[junit4:junit4]   2> 9844 T2621 C263 P63376 oasc.RecoveryStrategy.replay No replay needed. core=collection1
[junit4:junit4]   2> 9845 T2621 C263 P63376 oasc.RecoveryStrategy.doRecovery Replication Recovery was successful - registering as Active. core=collection1
[junit4:junit4]   2> 9845 T2621 C263 P63376 oasc.ZkController.publish publishing core=collection1 state=active
[junit4:junit4]   2> 9845 T2621 C263 P63376 oasc.ZkController.publish numShards not found on descriptor - reading it from system property
[junit4:junit4]   2> 9853 T2621 C263 P63376 oasc.RecoveryStrategy.doRecovery Finished recovery process. core=collection1
[junit4:junit4]   2> 9917 T2653 oass.OpenExchangeRatesOrgProvider.init Initialized with rates=open-exchange-rates.json, refreshInterval=1440.
[junit4:junit4]   2> 9924 T2653 oass.IndexSchema.readSchema default search field in schema is text
[junit4:junit4]   2> 9927 T2653 oass.IndexSchema.readSchema unique key field: id
[junit4:junit4]   2> 9937 T2653 oass.FileExchangeRateProvider.reload Reloading exchange rates from file currency.xml
[junit4:junit4]   2> 9946 T2653 oass.FileExchangeRateProvider.reload Reloading exchange rates from file currency.xml
[junit4:junit4]   2> 9949 T2653 oass.OpenExchangeRatesOrgProvider.reload Reloading exchange rates from open-exchange-rates.json
[junit4:junit4]   2> 9950 T2653 oass.OpenExchangeRatesOrgProvider.reload Reloading exchange rates from open-exchange-rates.json
[junit4:junit4]   2> 9951 T2653 oasc.SolrCore.<init> [collection1] Opening new SolrCore at /usr/home/hudson/hudson-slave/workspace/Lucene-Solr-Tests-trunk-Java6/solr/build/solr-core/test/J0/./org.apache.solr.cloud.SyncSliceTest-jetty4-1355529942237/collection1/, dataDir=./org.apache.solr.cloud.SyncSliceTest-1355529933422/jetty4/
[junit4:junit4]   2> 9951 T2653 oasc.JmxMonitoredMap.<init> JMX monitoring is enabled. Adding Solr mbeans to JMX Server: com.sun.jmx.mbeanserver.JmxMBeanServer@418bbf55
[junit4:junit4]   2> 9952 T2653 oasc.SolrCore.initDirectoryFactory solr.StandardDirectoryFactory
[junit4:junit4]   2> 9953 T2653 oasc.CachingDirectoryFactory.get return new directory for /usr/home/hudson/hudson-slave/workspace/Lucene-Solr-Tests-trunk-Java6/solr/build/solr-core/test/J0/./org.apache.solr.cloud.SyncSliceTest-1355529933422/jetty4 forceNew:false
[junit4:junit4]   2> 9953 T2653 oasc.CachingDirectoryFactory.close Releasing directory:/usr/home/hudson/hudson-slave/workspace/Lucene-Solr-Tests-trunk-Java6/solr/build/solr-core/test/J0/./org.apache.solr.cloud.SyncSliceTest-1355529933422/jetty4
[junit4:junit4]   2> 9953 T2653 oasc.SolrCore.getNewIndexDir New index directory detected: old=null new=./org.apache.solr.cloud.SyncSliceTest-1355529933422/jetty4/index/
[junit4:junit4]   2> 9954 T2653 oasc.SolrCore.initIndex WARNING [collection1] Solr index directory './org.apache.solr.cloud.SyncSliceTest-1355529933422/jetty4/index' doesn't exist. Creating new index...
[junit4:junit4]   2> 9955 T2653 oasc.CachingDirectoryFactory.get return new directory for /usr/home/hudson/hudson-slave/workspace/Lucene-Solr-Tests-trunk-Java6/solr/build/solr-core/test/J0/./org.apache.solr.cloud.SyncSliceTest-1355529933422/jetty4/index forceNew:false
[junit4:junit4]   2> 9959 T2653 oasc.SolrDeletionPolicy.onCommit SolrDeletionPolicy.onCommit: commits:num=1
[junit4:junit4]   2> 		commit{dir=RateLimitedDirectoryWrapper(org.apache.lucene.store.NIOFSDirectory@/usr/home/hudson/hudson-slave/workspace/Lucene-Solr-Tests-trunk-Java6/solr/build/solr-core/test/J0/org.apache.solr.cloud.SyncSliceTest-1355529933422/jetty4/index lockFactory=org.apache.lucene.store.NativeFSLockFactory@e570221),segFN=segments_1,generation=1,filenames=[segments_1]
[junit4:junit4]   2> 9960 T2653 oasc.SolrDeletionPolicy.updateCommits newest commit = 1[segments_1]
[junit4:junit4]   2> 9960 T2653 oasc.CachingDirectoryFactory.close Releasing directory:/usr/home/hudson/hudson-slave/workspace/Lucene-Solr-Tests-trunk-Java6/solr/build/solr-core/test/J0/./org.apache.solr.cloud.SyncSliceTest-1355529933422/jetty4/index
[junit4:junit4]   2> 9960 T2653 oasc.SolrCore.initWriters created xml: solr.XMLResponseWriter
[junit4:junit4]   2> 9961 T2653 oasup.UpdateRequestProcessorChain.init inserting DistributedUpdateProcessorFactory into updateRequestProcessorChain "dedupe"
[junit4:junit4]   2> 9962 T2653 oasup.UpdateRequestProcessorChain.init inserting DistributedUpdateProcessorFactory into updateRequestProcessorChain "dedupe-allfields"
[junit4:junit4]   2> 9962 T2653 oasup.UpdateRequestProcessorChain.init inserting DistributedUpdateProcessorFactory into updateRequestProcessorChain "stored_sig"
[junit4:junit4]   2> 9962 T2653 oasup.UpdateRequestProcessorChain.init inserting DistributedUpdateProcessorFactory into updateRequestProcessorChain "uniq-fields"
[junit4:junit4]   2> 9963 T2653 oasup.UpdateRequestProcessorChain.init inserting DistributedUpdateProcessorFactory into updateRequestProcessorChain "distrib-dup-test-chain-implicit"
[junit4:junit4]   2> 9963 T2653 oasc.RequestHandlers.initHandlersFromConfig adding lazy requestHandler: solr.ReplicationHandler
[junit4:junit4]   2> 9963 T2653 oasc.RequestHandlers.initHandlersFromConfig created /replication: solr.ReplicationHandler
[junit4:junit4]   2> 9964 T2653 oasc.RequestHandlers.initHandlersFromConfig created standard: solr.StandardRequestHandler
[junit4:junit4]   2> 9964 T2653 oasc.RequestHandlers.initHandlersFromConfig created /get: solr.RealTimeGetHandler
[junit4:junit4]   2> 9965 T2653 oasc.RequestHandlers.initHandlersFromConfig created dismax: solr.SearchHandler
[junit4:junit4]   2> 9966 T2653 oasc.RequestHandlers.initHandlersFromConfig created mock: org.apache.solr.core.MockQuerySenderListenerReqHandler
[junit4:junit4]   2> 9966 T2653 oasc.RequestHandlers.initHandlersFromConfig created /admin/: org.apache.solr.handler.admin.AdminHandlers
[junit4:junit4]   2> 9966 T2653 oasc.RequestHandlers.initHandlersFromConfig created defaults: solr.StandardRequestHandler
[junit4:junit4]   2> 9967 T2653 oasc.RequestHandlers.initHandlersFromConfig adding lazy requestHandler: solr.StandardRequestHandler
[junit4:junit4]   2> 9967 T2653 oasc.RequestHandlers.initHandlersFromConfig created lazy: solr.StandardRequestHandler
[junit4:junit4]   2> 9967 T2653 oasc.RequestHandlers.initHandlersFromConfig created /update: solr.UpdateRequestHandler
[junit4:junit4]   2> 9968 T2653 oasc.RequestHandlers.initHandlersFromConfig created /terms: org.apache.solr.handler.component.SearchHandler
[junit4:junit4]   2> 9968 T2653 oasc.RequestHandlers.initHandlersFromConfig created spellCheckCompRH: org.apache.solr.handler.component.SearchHandler
[junit4:junit4]   2> 9969 T2653 oasc.RequestHandlers.initHandlersFromConfig created spellCheckCompRH_Direct: org.apache.solr.handler.component.SearchHandler
[junit4:junit4]   2> 9970 T2653 oasc.RequestHandlers.initHandlersFromConfig created spellCheckWithWordbreak: org.apache.solr.handler.component.SearchHandler
[junit4:junit4]   2> 9970 T2653 oasc.RequestHandlers.initHandlersFromConfig created spellCheckWithWordbreak_Direct: org.apache.solr.handler.component.SearchHandler
[junit4:junit4]   2> 9971 T2653 oasc.RequestHandlers.initHandlersFromConfig created spellCheckCompRH1: org.apache.solr.handler.component.SearchHandler
[junit4:junit4]   2> 9971 T2653 oasc.RequestHandlers.initHandlersFromConfig created mltrh: org.apache.solr.handler.component.SearchHandler
[junit4:junit4]   2> 9972 T2653 oasc.RequestHandlers.initHandlersFromConfig created tvrh: org.apache.solr.handler.component.SearchHandler
[junit4:junit4]   2> 9972 T2653 oasc.RequestHandlers.initHandlersFromConfig created /mlt: solr.MoreLikeThisHandler
[junit4:junit4]   2> 9973 T2653 oasc.RequestHandlers.initHandlersFromConfig created /debug/dump: solr.DumpRequestHandler
[junit4:junit4]   2> 9978 T2653 oashl.XMLLoader.init xsltCacheLifetimeSeconds=60
[junit4:junit4]   2> 9980 T2585 oascc.ZkStateReader.updateClusterState Updating cloud state from ZooKeeper... 
[junit4:junit4]   2> 9981 T2585 oasc.Overseer$ClusterStateUpdater.updateState Update state numShards=1 message={
[junit4:junit4]   2> 	  "operation":"state",
[junit4:junit4]   2> 	  "numShards":"1",
[junit4:junit4]   2> 	  "shard":"shard1",
[junit4:junit4]   2> 	  "roles":null,
[junit4:junit4]   2> 	  "state":"active",
[junit4:junit4]   2> 	  "core":"collection1",
[junit4:junit4]   2> 	  "collection":"collection1",
[junit4:junit4]   2> 	  "node_name":"127.0.0.1:63376_",
[junit4:junit4]   2> 	  "base_url":"http://127.0.0.1:63376"}
[junit4:junit4]   2> 9982 T2653 oasc.SolrCore.initDeprecatedSupport WARNING solrconfig.xml uses deprecated <admin/gettableFiles>, Please update your config to use the ShowFileRequestHandler.
[junit4:junit4]   2> 9990 T2653 oasc.SolrCore.initDeprecatedSupport WARNING adding ShowFileRequestHandler with hidden files: [SCHEMA.XML, OLD_SYNONYMS.TXT, STOPWORDS.TXT, PROTWORDS.TXT, OPEN-EXCHANGE-RATES.JSON, SYNONYMS.TXT, CURRENCY.XML, MAPPING-ISOLATIN1ACCENT.TXT]
[junit4:junit4]   2> 9992 T2603 oascc.ZkStateReader$2.process A cluster state change: WatchedEvent state:SyncConnected type:NodeDataChanged path:/clusterstate.json, has occurred - updating... (live nodes size: 5)
[junit4:junit4]   2> 9992 T2590 oascc.ZkStateReader$2.process A cluster state change: WatchedEvent state:SyncConnected type:NodeDataChanged path:/clusterstate.json, has occurred - updating... (live nodes size: 5)
[junit4:junit4]   2> 9992 T2635 oascc.ZkStateReader$2.process A cluster state change: WatchedEvent state:SyncConnected type:NodeDataChanged path:/clusterstate.json, has occurred - updating... (live nodes size: 5)
[junit4:junit4]   2> 9992 T2584 oascc.ZkStateReader$2.process A cluster state change: WatchedEvent state:SyncConnected type:NodeDataChanged path:/clusterstate.json, has occurred - updating... (live nodes size: 5)
[junit4:junit4]   2> 9992 T2618 oascc.ZkStateReader$2.process A cluster state change: WatchedEvent state:SyncConnected type:NodeDataChanged path:/clusterstate.json, has occurred - updating... (live nodes size: 5)
[junit4:junit4]   2> 9993 T2652 oascc.ZkStateReader$2.process A cluster state change: WatchedEvent state:SyncConnected type:NodeDataChanged path:/clusterstate.json, has occurred - updating... (live nodes size: 5)
[junit4:junit4]   2> 9994 T2653 oasc.CachingDirectoryFactory.close Releasing directory:/usr/home/hudson/hudson-slave/workspace/Lucene-Solr-Tests-trunk-Java6/solr/build/solr-core/test/J0/./org.apache.solr.cloud.SyncSliceTest-1355529933422/jetty4
[junit4:junit4]   2> 9996 T2653 oass.SolrIndexSearcher.<init> Opening Searcher@127d8f53 main
[junit4:junit4]   2> 9997 T2653 oasu.CommitTracker.<init> Hard AutoCommit: disabled
[junit4:junit4]   2> 9997 T2653 oasu.CommitTracker.<init> Soft AutoCommit: disabled
[junit4:junit4]   2> 9998 T2653 oashc.SpellCheckComponent.inform Initializing spell checkers
[junit4:junit4]   2> 10015 T2653 oass.DirectSolrSpellChecker.init init: {name=direct,classname=DirectSolrSpellChecker,field=lowerfilt,minQueryLength=3}
[junit4:junit4]   2> 10073 T2655 oasc.SolrCore.registerSearcher [collection1] Registered new searcher Searcher@127d8f53 main{StandardDirectoryReader(segments_1:1)}
[junit4:junit4]   2> 10073 T2653 oasc.ZkController.publish publishing core=collection1 state=down
[junit4:junit4]   2> 10073 T2653 oasc.ZkController.publish numShards not found on descriptor - reading it from system property
[junit4:junit4]   2> 10496 T2585 oascc.ZkStateReader.updateClusterState Updating cloud state from ZooKeeper... 
[junit4:junit4]   2> 10497 T2585 oasc.Overseer$ClusterStateUpdater.updateState Update state numShards=1 message={
[junit4:junit4]   2> 	  "operation":"state",
[junit4:junit4]   2> 	  "numShards":"1",
[junit4:junit4]   2> 	  "shard":null,
[junit4:junit4]   2> 	  "roles":null,
[junit4:junit4]   2> 	  "state":"down",
[junit4:junit4]   2> 	  "core":"collection1",
[junit4:junit4]   2> 	  "collection":"collection1",
[junit4:junit4]   2> 	  "node_name":"127.0.0.1:63407_",
[junit4:junit4]   2> 	  "base_url":"http://127.0.0.1:63407"}
[junit4:junit4]   2> 10497 T2585 oasc.Overseer$ClusterStateUpdater.updateState Collection already exists with numShards=1
[junit4:junit4]   2> 10497 T2585 oasc.Overseer$ClusterStateUpdater.updateState Assigning new node to shard shard=shard1
[junit4:junit4]   2> 10514 T2635 oascc.ZkStateReader$2.process A cluster state change: WatchedEvent state:SyncConnected type:NodeDataChanged path:/clusterstate.json, has occurred - updating... (live nodes size: 5)
[junit4:junit4]   2> 10514 T2618 oascc.ZkStateReader$2.process A cluster state change: WatchedEvent state:SyncConnected type:NodeDataChanged path:/clusterstate.json, has occurred - updating... (live nodes size: 5)
[junit4:junit4]   2> 10514 T2603 oascc.ZkStateReader$2.process A cluster state change: WatchedEvent state:SyncConnected type:NodeDataChanged path:/clusterstate.json, has occurred - updating... (live nodes size: 5)
[junit4:junit4]   2> 10514 T2652 oascc.ZkStateReader$2.process A cluster state change: WatchedEvent state:SyncConnected type:NodeDataChanged path:/clusterstate.json, has occurred - updating... (live nodes size: 5)
[junit4:junit4]   2> 10514 T2590 oascc.ZkStateReader$2.process A cluster state change: WatchedEvent state:SyncConnected type:NodeDataChanged path:/clusterstate.json, has occurred - updating... (live nodes size: 5)
[junit4:junit4]   2> 10514 T2584 oascc.ZkStateReader$2.process A cluster state change: WatchedEvent state:SyncConnected type:NodeDataChanged path:/clusterstate.json, has occurred - updating... (live nodes size: 5)
[junit4:junit4]   2> 10576 T2653 oasc.CoreContainer.registerCore registering core: collection1
[junit4:junit4]   2> 10576 T2653 oasc.ZkController.register Register shard - core:collection1 address:http://127.0.0.1:63407 shardId:shard1
[junit4:junit4]   2> 10578 T2653 oasc.ZkController.register We are http://127.0.0.1:63407/collection1/ and leader is http://127.0.0.1:63371/collection1/
[junit4:junit4]   2> 10579 T2653 oasc.ZkController.register No LogReplay needed for core=collection1 baseURL=http://127.0.0.1:63407
[junit4:junit4]   2> 10579 T2653 oasc.ZkController.checkRecovery Core needs to recover:collection1
[junit4:junit4]   2> 10579 T2653 oasu.DefaultSolrCoreState.doRecovery Running recovery - first canceling any ongoing recovery
[junit4:junit4]   2> ASYNC  NEW_CORE C266 name=collection1 org.apache.solr.core.SolrCore@6312480c url=http://127.0.0.1:63407/collection1 node=127.0.0.1:63407_
[junit4:junit4]   2> 10580 T2656 C266 P63407 oasc.RecoveryStrategy.run Starting recovery process.  core=collection1 recoveringAfterStartup=true
[junit4:junit4]   2> 10580 T2656 C266 P63407 oasc.RecoveryStrategy.doRecovery ###### startupVersions=[]
[junit4:junit4]   2> 10580 T2653 oascc.ZkStateReader.updateClusterState Updating cloud state from ZooKeeper... 
[junit4:junit4]   2> 10580 T2656 C266 P63407 oasc.ZkController.publish publishing core=collection1 state=recovering
[junit4:junit4]   2> 10581 T2656 C266 P63407 oasc.ZkController.publish numShards not found on descriptor - reading it from system property
[junit4:junit4]   2> 10581 T2562 oass.SolrDispatchFilter.init user.dir=/usr/home/hudson/hudson-slave/workspace/Lucene-Solr-Tests-trunk-Java6/solr/build/solr-core/test/J0
[junit4:junit4]   2> 10582 T2656 C266 P63407 oasc.RecoveryStrategy.doRecovery Attempting to PeerSync from http://127.0.0.1:63371/collection1/ core=collection1 - recoveringAfterStartup=true
[junit4:junit4]   2> 10582 T2562 oass.SolrDispatchFilter.init SolrDispatchFilter.init() done
[junit4:junit4]   2> 10582 T2656 C266 P63407 oasu.PeerSync.sync PeerSync: core=collection1 url=http://127.0.0.1:63407 START replicas=[http://127.0.0.1:63371/collection1/] nUpdates=100
[junit4:junit4]   2> 10582 T2562 oascsi.HttpClientUtil.createClient Creating new http client, config:maxConnections=128&maxConnectionsPerHost=32&followRedirects=false
[junit4:junit4]   2> 10583 T2656 C266 P63407 oasu.PeerSync.sync WARNING no frame of reference to tell of we've missed updates
[junit4:junit4]   2> 10584 T2656 C266 P63407 oasc.RecoveryStrategy.doRecovery PeerSync Recovery was not successful - trying replication. core=collection1
[junit4:junit4]   2> 10584 T2656 C266 P63407 oasc.RecoveryStrategy.doRecovery Starting Replication Recovery. core=collection1
[junit4:junit4]   2> 10584 T2656 C266 P63407 oascsi.HttpClientUtil.createClient Creating new http client, config:maxConnections=128&maxConnectionsPerHost=32&followRedirects=false
[junit4:junit4]   2> 10585 T2593 C264 P63371 REQ /get {distrib=false&qt=/get&wt=javabin&version=2&getVersions=100} status=0 QTime=0 
[junit4:junit4]   2> 10596 T2562 oascc.ZkStateReader.updateClusterState Updating cloud state from ZooKeeper... 
[junit4:junit4]   2> 10597 T2562 oasc.AbstractFullDistribZkTestBase.waitForThingsToLevelOut Wait for recoveries to finish - wait 15 for each attempt
[junit4:junit4]   2> 10597 T2562 oasc.AbstractDistribZkTestBase.waitForRecoveriesToFinish Wait for recoveries to finish - collection: collection1 failOnTimeout:true timeout (sec):15
[junit4:junit4]   2> 10598 T2562 oascc.ZkStateReader.updateClusterState Updating cloud state from ZooKeeper... 
[junit4:junit4]   2> 11018 T2585 oascc.ZkStateReader.updateClusterState Updating cloud state from ZooKeeper... 
[junit4:junit4]   2> 11019 T2585 oasc.Overseer$ClusterStateUpdater.updateState Update state numShards=1 message={
[junit4:junit4]   2> 	  "operation":"state",
[junit4:junit4]   2> 	  "numShards":"1",
[junit4:junit4]   2> 	  "shard":"shard1",
[junit4:junit4]   2> 	  "roles":null,
[junit4:junit4]   2> 	  "state":"recovering",
[junit4:junit4]   2> 	  "core":"collection1",
[junit4:junit4]   2> 	  "collection":"collection1",
[junit4:junit4]   2> 	  "node_name":"127.0.0.1:63407_",
[junit4:junit4]   2> 	  "base_url":"http://127.0.0.1:63407"}
[junit4:junit4]   2> 11037 T2603 oascc.ZkStateReader$2.process A cluster state change: WatchedEvent state:SyncConnected type:NodeDataChanged path:/clusterstate.json, has occurred - updating... (live nodes size: 5)
[junit4:junit4]   2> 11037 T2635 oascc.ZkStateReader$2.process A cluster state change: WatchedEvent state:SyncConnected type:NodeDataChanged path:/clusterstate.json, has occurred - updating... (live nodes size: 5)
[junit4:junit4]   2> 11037 T2652 oascc.ZkStateReader$2.process A cluster state change: WatchedEvent state:SyncConnected type:NodeDataChanged path:/clusterstate.json, has occurred - updating... (live nodes size: 5)
[junit4:junit4]   2> 11037 T2590 oascc.ZkStateReader$2.process A cluster state change: WatchedEvent state:SyncConnected type:NodeDataChanged path:/clusterstate.json, has occurred - updating... (live nodes size: 5)
[junit4:junit4]   2> 11037 T2584 oascc.ZkStateReader$2.process A cluster state change: WatchedEvent state:SyncConnected type:NodeDataChanged path:/clusterstate.json, has occurred - updating... (live nodes size: 5)
[junit4:junit4]   2> 11037 T2618 oascc.ZkStateReader$2.process A cluster state change: WatchedEvent state:SyncConnected type:NodeDataChanged path:/clusterstate.json, has occurred - updating... (live nodes size: 5)
[junit4:junit4]   2> 11600 T2562 oascc.ZkStateReader.updateClusterState Updating cloud state from ZooKeeper... 
[junit4:junit4]   2>  C265_STATE=coll:collection1 core:collection1 props:{shard=shard1, roles=null, state=recovering, core=collection1, collection=collection1, node_name=127.0.0.1:63386_, base_url=http://127.0.0.1:63386}
[junit4:junit4]   2> 11862 T2638 C265 P63386 oasc.RecoveryStrategy.doRecovery Begin buffering updates. core=collection1
[junit4:junit4]   2> 11862 T2638 C265 P63386 oasu.UpdateLog.bufferUpdates Starting to buffer updates. FSUpdateLog{state=ACTIVE, tlog=null}
[junit4:junit4]   2> 11862 T2638 C265 P63386 oasc.RecoveryStrategy.replicate Attempting to replicate from http://127.0.0.1:63371/collection1/. core=collection1
[junit4:junit4]   2> 11862 T2638 C265 P63386 oascsi.HttpClientUtil.createClient Creating new http client, config:maxConnections=128&maxConnectionsPerHost=32&followRedirects=false
[junit4:junit4]   2> 11872 T2599 C264 P63371 oasu.DirectUpdateHandler2.commit start commit{flags=0,_version_=0,optimize=false,openSearcher=false,waitSearcher=true,expungeDeletes=false,softCommit=false}
[junit4:junit4]   2> 11889 T2599 C264 P63371 oasc.SolrDeletionPolicy.onCommit SolrDeletionPolicy.onCommit: commits:num=2
[junit4:junit4]   2> 		commit{dir=RateLimitedDirectoryWrapper(org.apache.lucene.store.NIOFSDirectory@/usr/home/hudson/hudson-slave/workspace/Lucene-Solr-Tests-trunk-Java6/solr/build/solr-core/test/J0/org.apache.solr.cloud.SyncSliceTest-1355529933422/jetty1/index lockFactory=org.apache.lucene.store.NativeFSLockFactory@57a2e170),segFN=segments_2,generation=2,filenames=[segments_2]
[junit4:junit4]   2> 		commit{dir=RateLimitedDirectoryWrapper(org.apache.lucene.store.NIOFSDirectory@/usr/home/hudson/hudson-slave/workspace/Lucene-Solr-Tests-trunk-Java6/solr/build/solr-core/test/J0/org.apache.solr.cloud.SyncSliceTest-1355529933422/jetty1/index lockFactory=org.apache.lucene.store.NativeFSLockFactory@57a2e170),segFN=segments_3,generation=3,filenames=[segments_3]
[junit4:junit4]   2> 11890 T2599 C264 P63371 oasc.SolrDeletionPolicy.updateCommits newest commit = 3[segments_3]
[junit4:junit4]   2> 11890 T2599 C264 P63371 oasc.CachingDirectoryFactory.close Releasing directory:/usr/home/hudson/hudson-slave/workspace/Lucene-Solr-Tests-trunk-Java6/solr/build/solr-core/test/J0/./org.apache.solr.cloud.SyncSliceTest-1355529933422/jetty1
[junit4:junit4]   2> 11891 T2599 C264 P63371 oasu.DirectUpdateHandler2.commit end_commit_flush
[junit4:junit4]   2> 11891 T2599 C264 P63371 /update {waitSearcher=true&openSearcher=false&commit=true&commit_end_point=true&wt=javabin&softCommit=false&version=2} {commit=} 0 19
[junit4:junit4]   2> 11893 T2638 C265 P63386 oash.ReplicationHandler.inform Commits will be reserved for  10000
[junit4:junit4]   2> 11893 T2638 C265 P63386 oash.SnapPuller.<init>  No value set for 'pollInterval'. Timer Task not started.
[junit4:junit4]   2> 11895 T2597 C264 P63371 REQ /replication {command=indexversion&wt=javabin&qt=/replication&version=2} status=0 QTime=0 
[junit4:junit4]   2> 11896 T2638 C265 P63386 oash.SnapPuller.fetchLatestIndex Master's generation: 3
[junit4:junit4]   2> 11896 T2638 C265 P63386 oash.SnapPuller.fetchLatestIndex Slave's generation: 1
[junit4:junit4]   2> 11896 T2638 C265 P63386 oash.SnapPuller.fetchLatestIndex Starting replication process
[junit4:junit4]   2> 11899 T2597 C264 P63371 oasc.CachingDirectoryFactory.close Releasing directory:/usr/home/hudson/hudson-slave/workspace/Lucene-Solr-Tests-trunk-Java6/solr/build/solr-core/test/J0/./org.apache.solr.cloud.SyncSliceTest-1355529933422/jetty1
[junit4:junit4]   2> 11900 T2597 C264 P63371 oasc.CachingDirectoryFactory.close Releasing directory:/usr/home/hudson/hudson-slave/workspace/Lucene-Solr-Tests-trunk-Java6/solr/build/solr-core/test/J0/./org.apache.solr.cloud.SyncSliceTest-1355529933422/jetty1/index
[junit4:junit4]   2> 11900 T2597 C264 P63371 REQ /replication {command=filelist&generation=3&wt=javabin&qt=/replication&version=2} status=0 QTime=1 
[junit4:junit4]   2> 11901 T2638 C265 P63386 oash.SnapPuller.fetchLatestIndex Number of files in latest index in master: 1
[junit4:junit4]   2> 11902 T2638 C265 P63386 oasc.CachingDirectoryFactory.get return new directory for /usr/home/hudson/hudson-slave/workspace/Lucene-Solr-Tests-trunk-Java6/solr/build/solr-core/test/J0/./org.apache.solr.cloud.SyncSliceTest-1355529933422/jetty3/index.20121214130545317 forceNew:false
[junit4:junit4]   2> 11903 T2638 C265 P63386 oasc.CachingDirectoryFactory.close Releasing directory:/usr/home/hudson/hudson-slave/workspace/Lucene-Solr-Tests-trunk-Java6/solr/build/solr-core/test/J0/./org.apache.solr.cloud.SyncSliceTest-1355529933422/jetty3
[junit4:junit4]   2> 11903 T2638 C265 P63386 oash.SnapPuller.fetchLatestIndex Starting download to RateLimitedDirectoryWrapper(org.apache.lucene.store.NIOFSDirectory@/usr/home/hudson/hudson-slave/workspace/Lucene-Solr-Tests-trunk-Java6/solr/build/solr-core/test/J0/org.apache.solr.cloud.SyncSliceTest-1355529933422/jetty3/index.20121214130545317 lockFactory=org.apache.lucene.store.NativeFSLockFactory@3cf5aada) fullCopy=true
[junit4:junit4]   2> 11907 T2597 C264 P63371 REQ /replication {file=segments_3&command=filecontent&checksum=true&generation=3&qt=/replication&wt=filestream} status=0 QTime=0 
[junit4:junit4]   2> 11909 T2638 C265 P63386 oasc.CachingDirectoryFactory.close Releasing directory:/usr/home/hudson/hudson-slave/workspace/Lucene-Solr-Tests-trunk-Java6/solr/build/solr-core/test/J0/./org.apache.solr.cloud.SyncSliceTest-1355529933422/jetty3/index
[junit4:junit4]   2> 11909 T2638 C265 P63386 oash.SnapPuller.fetchLatestIndex Total time taken for download : 0 secs
[junit4:junit4]   2> 11909 T2638 C265 P63386 oash.SnapPuller.modifyIndexProps New index installed. Updating index properties... index=index.20121214130545317
[junit4:junit4]   2> 11911 T2638 C265 P63386 oasc.CachingDirectoryFactory.close Releasing directory:/usr/home/hudson/hudson-slave/workspace/Lucene-Solr-Tests-trunk-Java6/solr/build/solr-core/test/J0/./org.apache.solr.cloud.SyncSliceTest-1355529933422/jetty3
[junit4:junit4]   2> 11911 T2638 C265 P63386 oasc.CachingDirectoryFactory.close Releasing directory:/usr/home/hudson/hudson-slave/workspace/Lucene-Solr-Tests-trunk-Java6/solr/build/solr-core/test/J0/./org.apache.solr.cloud.SyncSliceTest-1355529933422/jetty3
[junit4:junit4]   2> 11911 T2638 C265 P63386 oasc.SolrCore.getNewIndexDir New index directory detected: old=./org.apache.solr.cloud.SyncSliceTest-1355529933422/jetty3/index/ new=./org.apache.solr.cloud.SyncSliceTest-1355529933422/jetty3/index.20121214130545317
[junit4:junit4]   2> 11915 T2638 C265 P63386 oasc.SolrDeletionPolicy.onInit SolrDeletionPolicy.onInit: commits:num=1
[junit4:junit4]   2> 		commit{dir=RateLimitedDirectoryWrapper(org.apache.lucene.store.NIOFSDirectory@/usr/home/hudson/hudson-slave/workspace/Lucene-Solr-Tests-trunk-Java6/solr/build/solr-core/test/J0/org.apache.solr.cloud.SyncSliceTest-1355529933422/jetty3/index.20121214130545317 lockFactory=org.apache.lucene.store.NativeFSLockFactory@3cf5aada),segFN=segments_3,generation=3,filenames=[segments_3]
[junit4:junit4]   2> 11915 T2638 C265 P63386 oasc.SolrDeletionPolicy.updateCommits newest commit = 3[segments_3]
[junit4:junit4]   2> 11916 T2638 C265 P63386 oasc.CachingDirectoryFactory.close Releasing directory:/usr/home/hudson/hudson-slave/workspace/Lucene-Solr-Tests-trunk-Java6/solr/build/solr-core/test/J0/./org.apache.solr.cloud.SyncSliceTest-1355529933422/jetty3
[junit4:junit4]   2> 11916 T2638 C265 P63386 oasu.DefaultSolrCoreState.newIndexWriter Creating new IndexWriter...
[junit4:junit4]   2> 11916 T2638 C265 P63386 oasu.DefaultSolrCoreState.newIndexWriter Waiting until IndexWriter is unused... core=collection1
[junit4:junit4]   2> 11917 T2638 C265 P63386 oasu.DefaultSolrCoreState.newIndexWriter Rollback old IndexWriter... core=collection1
[junit4:junit4]   2> 11917 T2638 C265 P63386 oasc.CachingDirectoryFactory.close Releasing directory:/usr/home/hudson/hudson-slave/workspace/Lucene-Solr-Tests-trunk-Java6/solr/build/solr-core/test/J0/./org.apache.solr.cloud.SyncSliceTest-1355529933422/jetty3/index.20121214130545317
[junit4:junit4]   2> 11918 T2638 C265 P63386 oasc.CachingDirectoryFactory.close Releasing directory:/usr/home/hudson/hudson-slave/workspace/Lucene-Solr-Tests-trunk-Java6/solr/build/solr-core/test/J0/./org.apache.solr.cloud.SyncSliceTest-1355529933422/jetty3
[junit4:junit4]   2> 11921 T2638 C265 P63386 oasc.SolrDeletionPolicy.onInit SolrDeletionPolicy.onInit: commits:num=1
[junit4:junit4]   2> 		commit{dir=RateLimitedDirectoryWrapper(org.apache.lucene.store.NIOFSDirectory@/usr/home/hudson/hudson-slave/workspace/Lucene-Solr-Tests-trunk-Java6/solr/build/solr-core/test/J0/org.apache.solr.cloud.SyncSliceTest-1355529933422/jetty3/index.20121214130545317 lockFactory=org.apache.lucene.store.NativeFSLockFactory@3cf5aada),segFN=segments_3,generation=3,filenames=[segments_3]
[junit4:junit4]   2> 11921 T2638 C265 P63386 oasc.SolrDeletionPolicy.updateCommits newest commit = 3[segments_3]
[junit4:junit4]   2> 11922 T2638 C265 P63386 oasu.DefaultSolrCoreState.newIndexWriter New IndexWriter is ready to be used.
[junit4:junit4]   2> 11922 T2638 C265 P63386 oasc.CachingDirectoryFactory.close Releasing directory:/usr/home/hudson/hudson-slave/workspace/Lucene-Solr-Tests-trunk-Java6/solr/build/solr-core/test/J0/./org.apache.solr.cloud.SyncSliceTest-1355529933422/jetty3
[junit4:junit4]   2> 11922 T2638 C265 P63386 oass.SolrIndexSearcher.<init> Opening Searcher@5067ca5d main
[junit4:junit4]   2> 11924 T2637 oasc.SolrCore.registerSearcher [collection1] Registered new searcher Searcher@5067ca5d main{StandardDirectoryReader(segments_3:1:nrt)}
[junit4:junit4]   2> 11924 T2637 oasc.CachingDirectoryFactory.close Releasing directory:/usr/home/hudson/hudson-slave/workspace/Lucene-Solr-Tests-trunk-Java6/solr/build/solr-core/test/J0/./org.apache.solr.cloud.SyncSliceTest-1355529933422/jetty3/index
[junit4:junit4]   2> 11925 T2638 C265 P63386 oasu.DirectUpdateHandler2.commit start commit{flags=0,_version_=0,optimize=false,openSearcher=false,waitSearcher=false,expungeDeletes=false,softCommit=false}
[junit4:junit4]   2> 11927 T2638 C265 P63386 oasc.SolrDeletionPolicy.onCommit SolrDeletionPolicy.onCommit: commits:num=2
[junit4:junit4]   2> 		commit{dir=RateLimitedDirectoryWrapper(org.apache.lucene.store.NIOFSDirectory@/usr/home/hudson/hudson-slave/workspace/Lucene-Solr-Tests-trunk-Java6/solr/build/solr-core/test/J0/org.apache.solr.cloud.SyncSliceTest-1355529933422/jetty3/index.20121214130545317 lockFactory=org.apache.lucene.store.NativeFSLockFactory@3cf5aada),segFN=segments_3,generation=3,filenames=[segments_3]
[junit4:junit4]   2> 		commit{dir=RateLimitedDirectoryWrapper(org.apache.lucene.store.NIOFSDirectory@/usr/home/hudson/hudson-slave/workspace/Lucene-Solr-Tests-trunk-Java6/solr/build/solr-core/test/J0/org.apache.solr.cloud.SyncSliceTest-1355529933422/jetty3/index.20121214130545317 lockFactory=org.apache.lucene.store.NativeFSLockFactory@3cf5aada),segFN=segments_4,generation=4,filenames=[segments_4]
[junit4:junit4]   2> 11927 T2638 C265 P63386 oasc.SolrDeletionPolicy.updateCommits newest commit = 4[segments_4]
[junit4:junit4]   2> 11928 T2638 C265 P63386 oasc.CachingDirectoryFactory.close Releasing directory:/usr/home/hudson/hudson-slave/workspace/Lucene-Solr-Tests-trunk-Java6/solr/build/solr-core/test/J0/./org.apache.solr.cloud.SyncSliceTest-1355529933422/jetty3
[junit4:junit4]   2> 11929 T2638 C265 P63386 oasu.DirectUpdateHandler2.commit end_commit_flush
[junit4:junit4]   2> 11929 T2638 C265 P63386 oasc.CachingDirectoryFactory.close Releasing directory:/usr/home/hudson/hudson-slave/workspace/Lucene-Solr-Tests-trunk-Java6/solr/build/solr-core/test/J0/./org.apache.solr.cloud.SyncSliceTest-1355529933422/jetty3/index.20121214130545317
[junit4:junit4]   2> 11929 T2638 C265 P63386 oasc.CachingDirectoryFactory.close Releasing directory:/usr/home/hudson/hudson-slave/workspace/Lucene-Solr-Tests-trunk-Java6/solr/build/solr-core/test/J0/./org.apache.solr.cloud.SyncSliceTest-1355529933422/jetty3/index
[junit4:junit4]   2> 11929 T2638 C265 P63386 oasc.RecoveryStrategy.replay No replay needed. core=collection1
[junit4:junit4]   2> 11929 T2638 C265 P63386 oasc.RecoveryStrategy.doRecovery Replication Recovery was successful - registering as Active. core=collection1
[junit4:junit4]   2> 11930 T2638 C265 P63386 oasc.ZkController.publish publishing core=collection1 state=active
[junit4:junit4]   2> 11930 T2638 C265 P63386 oasc.ZkController.publish numShards not found on descriptor - reading it from system property
[junit4:junit4]   2> 11937 T2638 C265 P63386 oasc.RecoveryStrategy.doRecovery Finished recovery process. core=collection1
[junit4:junit4]   2> 12043 T2585 oascc.ZkStateReader.updateClusterState Updating cloud state from ZooKeeper... 
[junit4:junit4]   2> 12044 T2585 oasc.Overseer$ClusterStateUpdater.updateState Update state numShards=1 message={
[junit4:junit4]   2> 	  "operation":"state",
[junit4:junit4]   2> 	  "numShards":"1",
[junit4:junit4]   2> 	  "shard":"shard1",
[junit4:junit4]   2> 	  "roles":null,
[junit4:junit4]   2> 	  "state":"active",
[junit4:junit4]   2> 	  "core":"collection1",
[junit4:junit4]   2> 	  "collection":"collection1",
[junit4:junit4]   2> 	  "node_name":"127.0.0.1:63386_",
[junit4:junit4]   2> 	  "base_url":"http://127.0.0.1:63386"}
[junit4:junit4]   2> 12048 T2618 oascc.ZkStateReader$2.process A cluster state change: WatchedEvent state:SyncConnected type:NodeDataChanged path:/clusterstate.json, has occurred - updating... (live nodes size: 5)
[junit4:junit4]   2> 12048 T2603 oascc.ZkStateReader$2.process A cluster state change: WatchedEvent state:SyncConnected type:NodeDataChanged path:/clusterstate.json, has occurred - updating... (live nodes size: 5)
[junit4:junit4]   2> 12048 T2584 oascc.ZkStateReader$2.process A cluster state change: WatchedEvent state:SyncConnected type:NodeDataChanged path:/clusterstate.json, has occurred - updating... (live nodes size: 5)
[junit4:junit4]   2> 12048 T2590 oascc.ZkStateReader$2.process A cluster state change: WatchedEvent state:SyncConnected type:NodeDataChanged path:/clusterstate.json, has occurred - updating... (live nodes size: 5)
[junit4:junit4]   2> 12048 T2635 oascc.ZkStateReader$2.process A cluster state change: WatchedEvent state:SyncConnected type:NodeDataChanged path:/clusterstate.json, has occurred - updating... (live nodes size: 5)
[junit4:junit4]   2> 12048 T2652 oascc.ZkStateReader$2.process A cluster state change: WatchedEvent state:SyncConnected type:NodeDataChanged path:/clusterstate.json, has occurred - updating... (live nodes size: 5)
[junit4:junit4]   2> 12603 T2562 oascc.ZkStateReader.updateClusterState Updating cloud state from ZooKeeper... 
[junit4:junit4]   2>  C266_STATE=coll:collection1 core:collection1 props:{shard=shard1, roles=null, state=recovering, core=collection1, collection=collection1, node_name=127.0.0.1:63407_, base_url=http://127.0.0.1:63407}
[junit4:junit4]   2> 13599 T2656 C266 P63407 oasc.RecoveryStrategy.doRecovery Begin buffering updates. core=collection1
[junit4:junit4]   2> 13599 T2656 C266 P63407 oasu.UpdateLog.bufferUpdates Starting to buffer updates. FSUpdateLog{state=ACTIVE, tlog=null}
[junit4:junit4]   2> 13599 T2656 C266 P63407 oasc.RecoveryStrategy.replicate Attempting to replicate from http://127.0.0.1:63371/collection1/. core=collection1
[junit4:junit4]   2> 13599 T2656 C266 P63407 oascsi.HttpClientUtil.createClient Creating new http client, config:maxConnections=128&maxConnectionsPerHost=32&followRedirects=false
[junit4:junit4]   2> 13605 T2562 oascc.ZkStateReader.updateClusterState Updating cloud state from ZooKeeper... 
[junit4:junit4]   2> 13613 T2594 C264 P63371 oasu.DirectUpdateHandler2.commit start commit{flags=0,_version_=0,optimize=false,openSearcher=false,waitSearcher=true,expungeDeletes=false,softCommit=false}
[junit4:junit4]   2> 13644 T2594 C264 P63371 oasc.SolrDeletionPolicy.onCommit SolrDeletionPolicy.onCommit: commits:num=3
[junit4:junit4]   2> 		commit{dir=RateLimitedDirectoryWrapper(org.apache.lucene.store.NIOFSDirectory@/usr/home/hudson/hudson-slave/workspace/Lucene-Solr-Tests-trunk-Java6/solr/build/solr-core/test/J0/org.apache.solr.cloud.SyncSliceTest-1355529933422/jetty1/index lockFactory=org.apache.lucene.store.NativeFSLockFactory@57a2e170),segFN=segments_2,generation=2,filenames=[segments_2]
[junit4:junit4]   2> 		commit{dir=RateLimitedDirectoryWrapper(org.apache.lucene.store.NIOFSDirectory@/usr/home/hudson/hudson-slave/workspace/Lucene-Solr-Tests-trunk-Java6/solr/build/solr-core/test/J0/org.apache.solr.cloud.SyncSliceTest-1355529933422/jetty1/index lockFactory=org.apache.lucene.store.NativeFSLockFactory@57a2e170),segFN=segments_3,generation=3,filenames=[segments_3]
[junit4:junit4]   2> 		commit{dir=RateLimitedDirectoryWrapper(org.apache.lucene.store.NIOFSDirectory@/usr/home/hudson/hudson-slave/workspace/Lucene-Solr-Tests-trunk-Java6/solr/build/solr-core/test/J0/org.apache.solr.cloud.SyncSliceTest-1355529933422/jetty1/index lockFactory=org.apache.lucene.store.NativeFSLockFactory@57a2e170),segFN=segments_4,generation=4,filenames=[segments_4]
[junit4:junit4]   2> 13645 T2594 C264 P63371 oasc.SolrDeletionPolicy.updateCommits newest commit = 4[segments_4]
[junit4:junit4]   2> 13646 T2594 C264 P63371 oasc.CachingDirectoryFactory.close Releasing directory:/usr/home/hudson/hudson-slave/workspace/Lucene-Solr-Tests-trunk-Java6/solr/build/solr-core/test/J0/./org.apache.solr.cloud.SyncSliceTest-1355529933422/jetty1
[junit4:junit4]   2> 13647 T2594 C264 P63371 oasu.DirectUpdateHandler2.commit end_commit_flush
[junit4:junit4]   2> 13647 T2594 C264 P63371 /update {waitSearcher=true&openSearcher=false&commit=true&commit_end_point=true&wt=javabin&softCommit=false&version=2} {commit=} 0 34
[junit4:junit4]   2> 13649 T2656 C266 P63407 oash.ReplicationHandler.inform Commits will be reserved for  10000
[junit4:junit4]   2> 13649 T2656 C266 P63407 oash.SnapPuller.<init>  No value set for 'pollInterval'. Timer Task not started.
[junit4:junit4]   2> 13651 T2597 C264 P63371 REQ /replication {command=indexversion&wt=javabin&qt=/replication&version=2} status=0 QTime=0 
[junit4:junit4]   2> 13652 T2656 C266 P63407 oash.SnapPuller.fetchLatestIndex Master's generation: 4
[junit4:junit4]   2> 13652 T2656 C266 P63407 oash.SnapPuller.fetchLatestIndex Slave's generation: 1
[junit4:junit4]   2> 13652 T2656 C266 P63407 oash.SnapPuller.fetchLatestIndex Starting replication process
[junit4:junit4]   2> 13655 T2597 C264 P63371 oasc.CachingDirectoryFactory.close Releasing directory:/usr/home/hudson/hudson-slave/workspace/Lucene-Solr-Tests-trunk-Java6/solr/build/solr-core/test/J0/./org.apache.solr.cloud.SyncSliceTest-1355529933422/jetty1
[junit4:junit4]   2> 13656 T2597 C264 P63371 oasc.CachingDirectoryFactory.close Releasing directory:/usr/home/hudson/hudson-slave/workspace/Lucene-Solr-Tests-trunk-Java6/solr/build/solr-core/test/J0/./org.apache.solr.cloud.SyncSliceTest-1355529933422/jetty1/index
[junit4:junit4]   2> 13657 T2597 C264 P63371 REQ /replication {command=filelist&generation=4&wt=javabin&qt=/replication&version=2} status=0 QTime=2 
[junit4:junit4]   2> 13658 T2656 C266 P63407 oash.SnapPuller.fetchLatestIndex Number of files in latest index in master: 1
[junit4:junit4]   2> 13665 T2656 C266 P63407 oasc.CachingDirectoryFactory.get return new directory for /usr/home/hudson/hudson-slave/workspace/Lucene-Solr-Tests-trunk-Java6/solr/build/solr-core/test/J0/./org.apache.solr.cloud.SyncSliceTest-1355529933422/jetty4/index.20121214130547079 forceNew:false
[junit4:junit4]   2> 13666 T2656 C266 P63407 oasc.CachingDirectoryFactory.close Releasing directory:/usr/home/hudson/hudson-slave/workspace/Lucene-Solr-Tests-trunk-Java6/solr/build/solr-core/test/J0/./org.apache.solr.cloud.SyncSliceTest-1355529933422/jetty4
[junit4:junit4]   2> 13666 T2656 C266 P63407 oash.SnapPuller.fetchLatestIndex Starting download to RateLimitedDirectoryWrapper(org.apache.lucene.store.NIOFSDirectory@/usr/home/hudson/hudson-slave/workspace/Lucene-Solr-Tests-trunk-Java6/solr/build/solr-core/test/J0/org.apache.solr.cloud.SyncSliceTest-1355529933422/jetty4/index.20121214130547079 lockFactory=org.apache.lucene.store.NativeFSLockFactory@f6bafbd) fullCopy=true
[junit4:junit4]   2> 13671 T2597 C264 P63371 REQ /replication {file=segments_4&command=filecontent&checksum=true&generation=4&qt=/replication&wt=filestream} status=0 QTime=0 
[junit4:junit4]   2> 13673 T2656 C266 P63407 oasc.CachingDirectoryFactory.close Releasing directory:/usr/home/hudson/hudson-slave/workspace/Lucene-Solr-Tests-trunk-Java6/solr/build/solr-core/test/J0/./org.apache.solr.cloud.SyncSliceTest-1355529933422/jetty4/index
[junit4:junit4]   2> 13673 T2656 C266 P63407 oash.SnapPuller.fetchLatestIndex Total time taken for download : 0 secs
[junit4:junit4]   2> 13731 T2656 C266 P63407 oash.SnapPuller.modifyIndexProps New index installed. Updating index properties... index=index.20121214130547079
[junit4:junit4]   2> 13733 T2656 C266 P63407 oasc.CachingDirectoryFactory.close Releasing directory:/usr/home/hudson/hudson-slave/workspace/Lucene-Solr-Tests-t

[...truncated too long message...]

he.solr.core.CachingDirectoryFactory.release(CachingDirectoryFactory.java:335)
[junit4:junit4]   2> 		at org.apache.solr.search.SolrIndexSearcher.close(SolrIndexSearcher.java:287)
[junit4:junit4]   2> 		at org.apache.solr.core.SolrCore$8.close(SolrCore.java:1714)
[junit4:junit4]   2> 		at org.apache.solr.util.RefCounted.decref(RefCounted.java:57)
[junit4:junit4]   2> 		at org.apache.solr.core.SolrCore.closeSearcher(SolrCore.java:1785)
[junit4:junit4]   2> 		at org.apache.solr.core.SolrCore.close(SolrCore.java:1008)
[junit4:junit4]   2> 		at org.apache.solr.cloud.ShardLeaderElectionContext.runLeaderProcess(ElectionContext.java:233)
[junit4:junit4]   2> 		at org.apache.solr.cloud.LeaderElector.runIamLeaderProcess(LeaderElector.java:155)
[junit4:junit4]   2> 		at org.apache.solr.cloud.LeaderElector.checkIfIamLeader(LeaderElector.java:99)
[junit4:junit4]   2> 		at org.apache.solr.cloud.LeaderElector.access$000(LeaderElector.java:55)
[junit4:junit4]   2> 		at org.apache.solr.cloud.LeaderElector$1.process(LeaderElector.java:128)
[junit4:junit4]   2> 		at org.apache.zookeeper.ClientCnxn$EventThread.processEvent(ClientCnxn.java:519)
[junit4:junit4]   2> 		at org.apache.zookeeper.ClientCnxn$EventThread.run(ClientCnxn.java:495)
[junit4:junit4]   2> 	
[junit4:junit4]   2> 79454 T2618 oasc.CachingDirectoryFactory.close Closing directory:/usr/home/hudson/hudson-slave/workspace/Lucene-Solr-Tests-trunk-Java6/solr/build/solr-core/test/J0/./org.apache.solr.cloud.SyncSliceTest-1355529933422/jetty2/index.20121214130543234
[junit4:junit4]   2> 79455 T2618 oash.SnapPuller$2.postClose removing old index directory RateLimitedDirectoryWrapper(org.apache.lucene.store.NIOFSDirectory@/usr/home/hudson/hudson-slave/workspace/Lucene-Solr-Tests-trunk-Java6/solr/build/solr-core/test/J0/org.apache.solr.cloud.SyncSliceTest-1355529933422/jetty2/index lockFactory=org.apache.lucene.store.NativeFSLockFactory@5bf5b245)
[junit4:junit4]   2> 79455 T2618 oasc.CachingDirectoryFactory.close Closing directory when closing factory:/usr/home/hudson/hudson-slave/workspace/Lucene-Solr-Tests-trunk-Java6/solr/build/solr-core/test/J0/./org.apache.solr.cloud.SyncSliceTest-1355529933422/jetty2
[junit4:junit4]   2> 79455 T2618 oasc.CachingDirectoryFactory.close Closing directory when closing factory:/usr/home/hudson/hudson-slave/workspace/Lucene-Solr-Tests-trunk-Java6/solr/build/solr-core/test/J0/./org.apache.solr.cloud.SyncSliceTest-1355529933422/jetty2/index
[junit4:junit4]   2> 79456 T2618 oascc.SolrZkClient.makePath makePath: /collections/collection1/leaders/shard1
[junit4:junit4]   2> 79456 T2618 oasc.LeaderElector$1.process WARNING  org.apache.zookeeper.KeeperException$SessionExpiredException: KeeperErrorCode = Session expired for /collections/collection1/leader_elect/shard1/election/88836009717268488-127.0.0.1:63376__collection1-n_0000000001
[junit4:junit4]   2> 	at org.apache.zookeeper.KeeperException.create(KeeperException.java:127)
[junit4:junit4]   2> 	at org.apache.zookeeper.KeeperException.create(KeeperException.java:51)
[junit4:junit4]   2> 	at org.apache.zookeeper.ZooKeeper.delete(ZooKeeper.java:873)
[junit4:junit4]   2> 	at org.apache.solr.common.cloud.SolrZkClient$2.execute(SolrZkClient.java:145)
[junit4:junit4]   2> 	at org.apache.solr.common.cloud.SolrZkClient$2.execute(SolrZkClient.java:142)
[junit4:junit4]   2> 	at org.apache.solr.common.cloud.ZkCmdExecutor.retryOperation(ZkCmdExecutor.java:63)
[junit4:junit4]   2> 	at org.apache.solr.common.cloud.SolrZkClient.delete(SolrZkClient.java:142)
[junit4:junit4]   2> 	at org.apache.solr.cloud.ElectionContext.cancelElection(ElectionContext.java:63)
[junit4:junit4]   2> 	at org.apache.solr.cloud.ShardLeaderElectionContext.runLeaderProcess(ElectionContext.java:243)
[junit4:junit4]   2> 	at org.apache.solr.cloud.LeaderElector.runIamLeaderProcess(LeaderElector.java:155)
[junit4:junit4]   2> 	at org.apache.solr.cloud.LeaderElector.checkIfIamLeader(LeaderElector.java:99)
[junit4:junit4]   2> 	at org.apache.solr.cloud.LeaderElector.access$000(LeaderElector.java:55)
[junit4:junit4]   2> 	at org.apache.solr.cloud.LeaderElector$1.process(LeaderElector.java:128)
[junit4:junit4]   2> 	at org.apache.zookeeper.ClientCnxn$EventThread.processEvent(ClientCnxn.java:519)
[junit4:junit4]   2> 	at org.apache.zookeeper.ClientCnxn$EventThread.run(ClientCnxn.java:495)
[junit4:junit4]   2> 
[junit4:junit4]   2> 79457 T2618 oascc.ZkStateReader$2.process A cluster state change: WatchedEvent state:SyncConnected type:NodeChildrenChanged path:/live_nodes, has occurred - updating... (live nodes size: 5)
[junit4:junit4]   2> 79457 T2618 oascc.ZkStateReader$2.process WARNING ZooKeeper watch triggered, but Solr cannot talk to ZK
[junit4:junit4]   2> 79457 T2618 oascc.ZkStateReader$3.process WARNING ZooKeeper watch triggered, but Solr cannot talk to ZK
[junit4:junit4]   2> 79457 T2618 oasc.LeaderElector$1.process WARNING  org.apache.zookeeper.KeeperException$SessionExpiredException: KeeperErrorCode = Session expired for /overseer_elect/election
[junit4:junit4]   2> 	at org.apache.zookeeper.KeeperException.create(KeeperException.java:127)
[junit4:junit4]   2> 	at org.apache.zookeeper.KeeperException.create(KeeperException.java:51)
[junit4:junit4]   2> 	at org.apache.zookeeper.ZooKeeper.getChildren(ZooKeeper.java:1468)
[junit4:junit4]   2> 	at org.apache.solr.common.cloud.SolrZkClient$6.execute(SolrZkClient.java:228)
[junit4:junit4]   2> 	at org.apache.solr.common.cloud.SolrZkClient$6.execute(SolrZkClient.java:225)
[junit4:junit4]   2> 	at org.apache.solr.common.cloud.ZkCmdExecutor.retryOperation(ZkCmdExecutor.java:63)
[junit4:junit4]   2> 	at org.apache.solr.common.cloud.SolrZkClient.getChildren(SolrZkClient.java:225)
[junit4:junit4]   2> 	at org.apache.solr.cloud.LeaderElector.checkIfIamLeader(LeaderElector.java:83)
[junit4:junit4]   2> 	at org.apache.solr.cloud.LeaderElector.access$000(LeaderElector.java:55)
[junit4:junit4]   2> 	at org.apache.solr.cloud.LeaderElector$1.process(LeaderElector.java:128)
[junit4:junit4]   2> 	at org.apache.zookeeper.ClientCnxn$EventThread.processEvent(ClientCnxn.java:519)
[junit4:junit4]   2> 	at org.apache.zookeeper.ClientCnxn$EventThread.run(ClientCnxn.java:495)
[junit4:junit4]   2> 
[junit4:junit4]   2> 79458 T2618 oascc.ZkStateReader$2.process A cluster state change: WatchedEvent state:SyncConnected type:NodeDataChanged path:/clusterstate.json, has occurred - updating... (live nodes size: 5)
[junit4:junit4]   2> 79458 T2618 oascc.ZkStateReader$2.process WARNING ZooKeeper watch triggered, but Solr cannot talk to ZK
[junit4:junit4]   2> 79458 T2618 oascc.ConnectionManager.process Watcher org.apache.solr.common.cloud.ConnectionManager@34668e51 name:ZooKeeperConnection Watcher:127.0.0.1:63353/solr got event WatchedEvent state:Disconnected type:None path:null path:null type:None
[junit4:junit4]   2> 79458 T2618 oascc.ConnectionManager.process Client->ZooKeeper status change trigger but we are already closed
[junit4:junit4]   2> 79459 T2618 oaz.ClientCnxn$EventThread.run EventThread shut down
[junit4:junit4]   2> NOTE: test params are: codec=SimpleText, sim=DefaultSimilarity, locale=mt, timezone=Pacific/Midway
[junit4:junit4]   2> NOTE: FreeBSD 9.0-RELEASE amd64/Sun Microsystems Inc. 1.6.0_32 (64-bit)/cpus=16,threads=2,free=225771080,total=528351232
[junit4:junit4]   2> NOTE: All tests run in this JVM: [SolrPluginUtilsTest, SpellCheckComponentTest, LeaderElectionIntegrationTest, TestFuzzyAnalyzedSuggestions, TestIndexingPerformance, IndexBasedSpellCheckerTest, DefaultValueUpdateProcessorTest, BasicDistributedZkTest, BinaryUpdateRequestHandlerTest, ShardRoutingTest, DateMathParserTest, AutoCommitTest, ResponseLogComponentTest, DistributedSpellCheckComponentTest, TestSolrJ, TestDefaultSimilarityFactory, TestPHPSerializedResponseWriter, MBeansHandlerTest, MinimalSchemaTest, TestConfig, TestLFUCache, TestRandomFaceting, TestNumberUtils, TestGroupingSearch, UpdateRequestProcessorFactoryTest, SpellCheckCollatorTest, SimpleFacetsTest, TestStressLucene, PluginInfoTest, DateFieldTest, DistanceFunctionTest, SearchHandlerTest, PathHierarchyTokenizerFactoryTest, SolrCmdDistributorTest, DirectSolrConnectionTest, TestLMDirichletSimilarityFactory, TestBadConfig, TestCollationField, CurrencyFieldTest, SampleTest, TestDocumentBuilder, ResourceLoaderTest, MoreLikeThisHandlerTest, ClusterStateUpdateTest, TestCoreContainer, TestLMJelinekMercerSimilarityFactory, UniqFieldsUpdateProcessorFactoryTest, RequestHandlersTest, SuggesterFSTTest, HighlighterConfigTest, DistributedTermsComponentTest, JsonLoaderTest, AlternateDirectoryTest, FieldAnalysisRequestHandlerTest, NoCacheHeaderTest, DirectUpdateHandlerOptimizeTest, SimplePostToolTest, ZkControllerTest, ClusterStateTest, OverseerCollectionProcessorTest, SyncSliceTest]
[junit4:junit4] Completed on J0 in 80.02s, 1 test, 1 failure <<< FAILURES!

[...truncated 33 lines...]
BUILD FAILED
/usr/home/hudson/hudson-slave/workspace/Lucene-Solr-Tests-trunk-Java6/build.xml:353: The following error occurred while executing this line:
/usr/home/hudson/hudson-slave/workspace/Lucene-Solr-Tests-trunk-Java6/build.xml:39: The following error occurred while executing this line:
/usr/home/hudson/hudson-slave/workspace/Lucene-Solr-Tests-trunk-Java6/solr/build.xml:178: The following error occurred while executing this line:
/usr/home/hudson/hudson-slave/workspace/Lucene-Solr-Tests-trunk-Java6/solr/common-build.xml:438: The following error occurred while executing this line:
/usr/home/hudson/hudson-slave/workspace/Lucene-Solr-Tests-trunk-Java6/lucene/common-build.xml:1176: The following error occurred while executing this line:
/usr/home/hudson/hudson-slave/workspace/Lucene-Solr-Tests-trunk-Java6/lucene/common-build.xml:839: There were test failures: 241 suites, 1006 tests, 1 failure, 21 ignored (3 assumptions)

Total time: 31 minutes 48 seconds
Build step 'Invoke Ant' marked build as failure
Archiving artifacts
Recording test results
Email was triggered for: Failure
Sending email for trigger: Failure



Mime
View raw message