lucene-dev mailing list archives

Site index · List index
Message view « Date » · « Thread »
Top « Date » · « Thread »
From Apache Jenkins Server <jenk...@builds.apache.org>
Subject [JENKINS] Lucene-Solr-Tests-trunk-java7 - Build # 3556 - Still Failing
Date Sun, 16 Dec 2012 03:31:21 GMT
Build: https://builds.apache.org/job/Lucene-Solr-Tests-trunk-java7/3556/

2 tests failed.
REGRESSION:  org.apache.solr.cloud.BasicDistributedZk2Test.testDistribSearch

Error Message:
Shard still reported as live in zk - 0 jetty

Stack Trace:
java.lang.AssertionError: Shard still reported as live in zk - 0 jetty
	at __randomizedtesting.SeedInfo.seed([E715D6EDD18D4C72:66F358F5A6D22C4E]:0)
	at org.junit.Assert.fail(Assert.java:93)
	at org.apache.solr.cloud.AbstractFullDistribZkTestBase.waitToSeeNotLive(AbstractFullDistribZkTestBase.java:1239)
	at org.apache.solr.cloud.BasicDistributedZk2Test.brindDownShardIndexSomeDocsAndRecover(BasicDistributedZk2Test.java:217)
	at org.apache.solr.cloud.BasicDistributedZk2Test.doTest(BasicDistributedZk2Test.java:92)
	at org.apache.solr.BaseDistributedSearchTestCase.testDistribSearch(BaseDistributedSearchTestCase.java:793)
	at sun.reflect.NativeMethodAccessorImpl.invoke0(Native Method)
	at sun.reflect.NativeMethodAccessorImpl.invoke(NativeMethodAccessorImpl.java:57)
	at sun.reflect.DelegatingMethodAccessorImpl.invoke(DelegatingMethodAccessorImpl.java:43)
	at java.lang.reflect.Method.invoke(Method.java:601)
	at com.carrotsearch.randomizedtesting.RandomizedRunner.invoke(RandomizedRunner.java:1559)
	at com.carrotsearch.randomizedtesting.RandomizedRunner.access$600(RandomizedRunner.java:79)
	at com.carrotsearch.randomizedtesting.RandomizedRunner$6.evaluate(RandomizedRunner.java:737)
	at com.carrotsearch.randomizedtesting.RandomizedRunner$7.evaluate(RandomizedRunner.java:773)
	at com.carrotsearch.randomizedtesting.RandomizedRunner$8.evaluate(RandomizedRunner.java:787)
	at com.carrotsearch.randomizedtesting.rules.SystemPropertiesRestoreRule$1.evaluate(SystemPropertiesRestoreRule.java:53)
	at org.apache.lucene.util.TestRuleSetupTeardownChained$1.evaluate(TestRuleSetupTeardownChained.java:50)
	at org.apache.lucene.util.TestRuleFieldCacheSanity$1.evaluate(TestRuleFieldCacheSanity.java:51)
	at org.apache.lucene.util.AbstractBeforeAfterRule$1.evaluate(AbstractBeforeAfterRule.java:46)
	at com.carrotsearch.randomizedtesting.rules.SystemPropertiesInvariantRule$1.evaluate(SystemPropertiesInvariantRule.java:55)
	at org.apache.lucene.util.TestRuleThreadAndTestName$1.evaluate(TestRuleThreadAndTestName.java:49)
	at org.apache.lucene.util.TestRuleIgnoreAfterMaxFailures$1.evaluate(TestRuleIgnoreAfterMaxFailures.java:70)
	at org.apache.lucene.util.TestRuleMarkFailure$1.evaluate(TestRuleMarkFailure.java:48)
	at com.carrotsearch.randomizedtesting.rules.StatementAdapter.evaluate(StatementAdapter.java:36)
	at com.carrotsearch.randomizedtesting.ThreadLeakControl$StatementRunner.run(ThreadLeakControl.java:358)
	at com.carrotsearch.randomizedtesting.ThreadLeakControl.forkTimeoutingTask(ThreadLeakControl.java:782)
	at com.carrotsearch.randomizedtesting.ThreadLeakControl$3.evaluate(ThreadLeakControl.java:442)
	at com.carrotsearch.randomizedtesting.RandomizedRunner.runSingleTest(RandomizedRunner.java:746)
	at com.carrotsearch.randomizedtesting.RandomizedRunner$3.evaluate(RandomizedRunner.java:648)
	at com.carrotsearch.randomizedtesting.RandomizedRunner$4.evaluate(RandomizedRunner.java:682)
	at com.carrotsearch.randomizedtesting.RandomizedRunner$5.evaluate(RandomizedRunner.java:693)
	at com.carrotsearch.randomizedtesting.rules.StatementAdapter.evaluate(StatementAdapter.java:36)
	at com.carrotsearch.randomizedtesting.rules.SystemPropertiesRestoreRule$1.evaluate(SystemPropertiesRestoreRule.java:53)
	at org.apache.lucene.util.AbstractBeforeAfterRule$1.evaluate(AbstractBeforeAfterRule.java:46)
	at org.apache.lucene.util.TestRuleStoreClassName$1.evaluate(TestRuleStoreClassName.java:42)
	at com.carrotsearch.randomizedtesting.rules.SystemPropertiesInvariantRule$1.evaluate(SystemPropertiesInvariantRule.java:55)
	at com.carrotsearch.randomizedtesting.rules.NoShadowingOrOverridesOnMethodsRule$1.evaluate(NoShadowingOrOverridesOnMethodsRule.java:39)
	at com.carrotsearch.randomizedtesting.rules.NoShadowingOrOverridesOnMethodsRule$1.evaluate(NoShadowingOrOverridesOnMethodsRule.java:39)
	at com.carrotsearch.randomizedtesting.rules.StatementAdapter.evaluate(StatementAdapter.java:36)
	at org.apache.lucene.util.TestRuleAssertionsRequired$1.evaluate(TestRuleAssertionsRequired.java:43)
	at org.apache.lucene.util.TestRuleMarkFailure$1.evaluate(TestRuleMarkFailure.java:48)
	at org.apache.lucene.util.TestRuleIgnoreAfterMaxFailures$1.evaluate(TestRuleIgnoreAfterMaxFailures.java:70)
	at org.apache.lucene.util.TestRuleIgnoreTestSuites$1.evaluate(TestRuleIgnoreTestSuites.java:55)
	at com.carrotsearch.randomizedtesting.rules.StatementAdapter.evaluate(StatementAdapter.java:36)
	at com.carrotsearch.randomizedtesting.ThreadLeakControl$StatementRunner.run(ThreadLeakControl.java:358)
	at java.lang.Thread.run(Thread.java:722)


FAILED:  junit.framework.TestSuite.org.apache.solr.cloud.RecoveryZkTest

Error Message:
Resource in scope SUITE failed to close. Resource was registered from thread Thread[id=490, name=RecoveryThread, state=RUNNABLE, group=TGRP-RecoveryZkTest], registration stack trace below.

Stack Trace:
com.carrotsearch.randomizedtesting.ResourceDisposalError: Resource in scope SUITE failed to close. Resource was registered from thread Thread[id=490, name=RecoveryThread, state=RUNNABLE, group=TGRP-RecoveryZkTest], registration stack trace below.
	at __randomizedtesting.SeedInfo.seed([E715D6EDD18D4C72]:0)
	at java.lang.Thread.getStackTrace(Thread.java:1567)
	at com.carrotsearch.randomizedtesting.RandomizedContext.closeAtEnd(RandomizedContext.java:150)
	at org.apache.lucene.util.LuceneTestCase.closeAfterSuite(LuceneTestCase.java:516)
	at org.apache.lucene.util.LuceneTestCase.wrapDirectory(LuceneTestCase.java:982)
	at org.apache.lucene.util.LuceneTestCase.newDirectory(LuceneTestCase.java:874)
	at org.apache.lucene.util.LuceneTestCase.newDirectory(LuceneTestCase.java:866)
	at org.apache.solr.core.MockDirectoryFactory.create(MockDirectoryFactory.java:33)
	at org.apache.solr.core.CachingDirectoryFactory.get(CachingDirectoryFactory.java:256)
	at org.apache.solr.core.CachingDirectoryFactory.get(CachingDirectoryFactory.java:212)
	at org.apache.solr.handler.SnapPuller.fetchLatestIndex(SnapPuller.java:376)
	at org.apache.solr.handler.ReplicationHandler.doFetch(ReplicationHandler.java:273)
	at org.apache.solr.cloud.RecoveryStrategy.replicate(RecoveryStrategy.java:153)
	at org.apache.solr.cloud.RecoveryStrategy.doRecovery(RecoveryStrategy.java:408)
	at org.apache.solr.cloud.RecoveryStrategy.run(RecoveryStrategy.java:223)
Caused by: java.lang.AssertionError: Directory not closed: MockDirWrapper(org.apache.lucene.store.NIOFSDirectory@/usr/home/hudson/hudson-slave/workspace/Lucene-Solr-Tests-trunk-java7/solr/build/solr-core/test/J1/index7028370287tmp lockFactory=org.apache.lucene.store.NativeFSLockFactory@1962ff82)
	at org.junit.Assert.fail(Assert.java:93)
	at org.apache.lucene.util.CloseableDirectory.close(CloseableDirectory.java:47)
	at com.carrotsearch.randomizedtesting.RandomizedRunner$2$1.apply(RandomizedRunner.java:602)
	at com.carrotsearch.randomizedtesting.RandomizedRunner$2$1.apply(RandomizedRunner.java:599)
	at com.carrotsearch.randomizedtesting.RandomizedContext.closeResources(RandomizedContext.java:167)
	at com.carrotsearch.randomizedtesting.RandomizedRunner$2.afterAlways(RandomizedRunner.java:615)
	at com.carrotsearch.randomizedtesting.rules.StatementAdapter.evaluate(StatementAdapter.java:43)
	at com.carrotsearch.randomizedtesting.ThreadLeakControl$StatementRunner.run(ThreadLeakControl.java:358)
	at java.lang.Thread.run(Thread.java:722)




Build Log:
[...truncated 8810 lines...]
[junit4:junit4] Suite: org.apache.solr.cloud.BasicDistributedZk2Test
[junit4:junit4]   2> 0 T331 oas.BaseDistributedSearchTestCase.initHostContext Setting hostContext system property: /
[junit4:junit4]   2> 7 T331 oas.SolrTestCaseJ4.setUp ###Starting testDistribSearch
[junit4:junit4]   2> Creating dataDir: /usr/home/hudson/hudson-slave/workspace/Lucene-Solr-Tests-trunk-java7/solr/build/solr-core/test/J0/./solrtest-BasicDistributedZk2Test-1355627541172
[junit4:junit4]   2> 18 T331 oasc.ZkTestServer.run STARTING ZK TEST SERVER
[junit4:junit4]   2> 33 T332 oasc.ZkTestServer$ZKServerMain.runFromConfig Starting server
[junit4:junit4]   2> 156 T332 oaz.Environment.logEnv Server environment:zookeeper.version=3.4.5-1392090, built on 09/30/2012 17:52 GMT
[junit4:junit4]   2> 157 T332 oaz.Environment.logEnv Server environment:host.name=lucene.zones.apache.org
[junit4:junit4]   2> 157 T332 oaz.Environment.logEnv Server environment:java.version=1.7.0_09
[junit4:junit4]   2> 157 T332 oaz.Environment.logEnv Server environment:java.vendor=Oracle Corporation
[junit4:junit4]   2> 157 T332 oaz.Environment.logEnv Server environment:java.home=/usr/local/openjdk7/jre
[junit4:junit4]   2> 158 T332 oaz.Environment.logEnv Server environment:java.class.path=/usr/home/hudson/hudson-slave/workspace/Lucene-Solr-Tests-trunk-java7/solr/build/solr-core/classes/test:/usr/home/hudson/hudson-slave/workspace/Lucene-Solr-Tests-trunk-java7/solr/build/solr-test-framework/classes/java:/usr/home/hudson/hudson-slave/workspace/Lucene-Solr-Tests-trunk-java7/solr/build/solr-core/test-files:/usr/home/hudson/hudson-slave/workspace/Lucene-Solr-Tests-trunk-java7/lucene/build/test-framework/classes/java:/usr/home/hudson/hudson-slave/workspace/Lucene-Solr-Tests-trunk-java7/lucene/build/codecs/classes/java:/usr/home/hudson/hudson-slave/workspace/Lucene-Solr-Tests-trunk-java7/solr/build/solr-solrj/classes/java:/usr/home/hudson/hudson-slave/workspace/Lucene-Solr-Tests-trunk-java7/solr/build/solr-core/classes/java:/usr/home/hudson/hudson-slave/workspace/Lucene-Solr-Tests-trunk-java7/lucene/build/analysis/common/lucene-analyzers-common-5.0-SNAPSHOT.jar:/usr/home/hudson/hudson-slave/workspace/Lucene-Solr-Tests-trunk-java7/lucene/build/analysis/kuromoji/lucene-analyzers-kuromoji-5.0-SNAPSHOT.jar:/usr/home/hudson/hudson-slave/workspace/Lucene-Solr-Tests-trunk-java7/lucene/build/analysis/phonetic/lucene-analyzers-phonetic-5.0-SNAPSHOT.jar:/usr/home/hudson/hudson-slave/workspace/Lucene-Solr-Tests-trunk-java7/lucene/build/highlighter/lucene-highlighter-5.0-SNAPSHOT.jar:/usr/home/hudson/hudson-slave/workspace/Lucene-Solr-Tests-trunk-java7/lucene/build/memory/lucene-memory-5.0-SNAPSHOT.jar:/usr/home/hudson/hudson-slave/workspace/Lucene-Solr-Tests-trunk-java7/lucene/build/misc/lucene-misc-5.0-SNAPSHOT.jar:/usr/home/hudson/hudson-slave/workspace/Lucene-Solr-Tests-trunk-java7/lucene/build/spatial/lucene-spatial-5.0-SNAPSHOT.jar:/usr/home/hudson/hudson-slave/workspace/Lucene-Solr-Tests-trunk-java7/lucene/build/suggest/lucene-suggest-5.0-SNAPSHOT.jar:/usr/home/hudson/hudson-slave/workspace/Lucene-Solr-Tests-trunk-java7/lucene/build/grouping/lucene-grouping-5.0-SNAPSHOT.jar:/usr/home/hudson/hudson-slave/workspace/Lucene-Solr-Tests-trunk-java7/lucene/build/queries/lucene-queries-5.0-SNAPSHOT.jar:/usr/home/hudson/hudson-slave/workspace/Lucene-Solr-Tests-trunk-java7/lucene/build/queryparser/lucene-queryparser-5.0-SNAPSHOT.jar:/usr/home/hudson/hudson-slave/workspace/Lucene-Solr-Tests-trunk-java7/solr/core/lib/cglib-nodep-2.2.jar:/usr/home/hudson/hudson-slave/workspace/Lucene-Solr-Tests-trunk-java7/solr/core/lib/commons-cli-1.2.jar:/usr/home/hudson/hudson-slave/workspace/Lucene-Solr-Tests-trunk-java7/solr/core/lib/commons-codec-1.7.jar:/usr/home/hudson/hudson-slave/workspace/Lucene-Solr-Tests-trunk-java7/solr/core/lib/commons-fileupload-1.2.1.jar:/usr/home/hudson/hudson-slave/workspace/Lucene-Solr-Tests-trunk-java7/solr/core/lib/commons-lang-2.6.jar:/usr/home/hudson/hudson-slave/workspace/Lucene-Solr-Tests-trunk-java7/solr/core/lib/easymock-3.0.jar:/usr/home/hudson/hudson-slave/workspace/Lucene-Solr-Tests-trunk-java7/solr/core/lib/guava-13.0.1.jar:/usr/home/hudson/hudson-slave/workspace/Lucene-Solr-Tests-trunk-java7/solr/core/lib/javax.servlet-api-3.0.1.jar:/usr/home/hudson/hudson-slave/workspace/Lucene-Solr-Tests-trunk-java7/solr/core/lib/metrics-core-2.1.2.jar:/usr/home/hudson/hudson-slave/workspace/Lucene-Solr-Tests-trunk-java7/solr/core/lib/objenesis-1.2.jar:/usr/home/hudson/hudson-slave/workspace/Lucene-Solr-Tests-trunk-java7/solr/core/lib/spatial4j-0.3.jar:/usr/home/hudson/hudson-slave/workspace/Lucene-Solr-Tests-trunk-java7/solr/solrj/lib/commons-io-2.1.jar:/usr/home/hudson/hudson-slave/workspace/Lucene-Solr-Tests-trunk-java7/solr/solrj/lib/httpclient-4.1.3.jar:/usr/home/hudson/hudson-slave/workspace/Lucene-Solr-Tests-trunk-java7/solr/solrj/lib/httpcore-4.1.4.jar:/usr/home/hudson/hudson-slave/workspace/Lucene-Solr-Tests-trunk-java7/solr/solrj/lib/httpmime-4.1.3.jar:/usr/home/hudson/hudson-slave/workspace/Lucene-Solr-Tests-trunk-java7/solr/solrj/lib/jcl-over-slf4j-1.6.4.jar:/usr/home/hudson/hudson-slave/workspace/Lucene-Solr-Tests-trunk-java7/solr/solrj/lib/log4j-over-slf4j-1.6.4.jar:/usr/home/hudson/hudson-slave/workspace/Lucene-Solr-Tests-trunk-java7/solr/solrj/lib/slf4j-api-1.6.4.jar:/usr/home/hudson/hudson-slave/workspace/Lucene-Solr-Tests-trunk-java7/solr/solrj/lib/slf4j-jdk14-1.6.4.jar:/usr/home/hudson/hudson-slave/workspace/Lucene-Solr-Tests-trunk-java7/solr/solrj/lib/wstx-asl-3.2.7.jar:/usr/home/hudson/hudson-slave/workspace/Lucene-Solr-Tests-trunk-java7/solr/solrj/lib/zookeeper-3.4.5.jar:/usr/home/hudson/hudson-slave/workspace/Lucene-Solr-Tests-trunk-java7/solr/example/lib/jetty-continuation-8.1.8.v20121106.jar:/usr/home/hudson/hudson-slave/workspace/Lucene-Solr-Tests-trunk-java7/solr/example/lib/jetty-deploy-8.1.8.v20121106.jar:/usr/home/hudson/hudson-slave/workspace/Lucene-Solr-Tests-trunk-java7/solr/example/lib/jetty-http-8.1.8.v20121106.jar:/usr/home/hudson/hudson-slave/workspace/Lucene-Solr-Tests-trunk-java7/solr/example/lib/jetty-io-8.1.8.v20121106.jar:/usr/home/hudson/hudson-slave/workspace/Lucene-Solr-Tests-trunk-java7/solr/example/lib/jetty-jmx-8.1.8.v20121106.jar:/usr/home/hudson/hudson-slave/workspace/Lucene-Solr-Tests-trunk-java7/solr/example/lib/jetty-security-8.1.8.v20121106.jar:/usr/home/hudson/hudson-slave/workspace/Lucene-Solr-Tests-trunk-java7/solr/example/lib/jetty-server-8.1.8.v20121106.jar:/usr/home/hudson/hudson-slave/workspace/Lucene-Solr-Tests-trunk-java7/solr/example/lib/jetty-servlet-8.1.8.v20121106.jar:/usr/home/hudson/hudson-slave/workspace/Lucene-Solr-Tests-trunk-java7/solr/example/lib/jetty-util-8.1.8.v20121106.jar:/usr/home/hudson/hudson-slave/workspace/Lucene-Solr-Tests-trunk-java7/solr/example/lib/jetty-webapp-8.1.8.v20121106.jar:/usr/home/hudson/hudson-slave/workspace/Lucene-Solr-Tests-trunk-java7/solr/example/lib/jetty-xml-8.1.8.v20121106.jar:/usr/home/hudson/hudson-slave/workspace/Lucene-Solr-Tests-trunk-java7/solr/example/lib/servlet-api-3.0.jar:/usr/home/hudson/hudson-slave/workspace/Lucene-Solr-Tests-trunk-java7/solr/example/example-DIH/solr/db/lib/derby-10.9.1.0.jar:/usr/home/hudson/hudson-slave/workspace/Lucene-Solr-Tests-trunk-java7/solr/example/example-DIH/solr/db/lib/hsqldb-1.8.0.10.jar:/usr/home/hudson/hudson-slave/workspace/Lucene-Solr-Tests-trunk-java7/lucene/build/core/classes/java:/usr/home/hudson/hudson-slave/workspace/Lucene-Solr-Tests-trunk-java7/lucene/test-framework/lib/junit-4.10.jar:/usr/home/hudson/hudson-slave/workspace/Lucene-Solr-Tests-trunk-java7/lucene/test-framework/lib/randomizedtesting-runner-2.0.6.jar:/home/hudson/hudson-slave/tools/Ant/ant-1.8.2/lib/ant-launcher.jar:/home/hudson/.ant/lib/ivy-2.2.0.jar:/home/hudson/hudson-slave/tools/Ant/ant-1.8.2/lib/ant-apache-regexp.jar:/home/hudson/hudson-slave/tools/Ant/ant-1.8.2/lib/ant-junit.jar:/home/hudson/hudson-slave/tools/Ant/ant-1.8.2/lib/ant-apache-bsf.jar:/home/hudson/hudson-slave/tools/Ant/ant-1.8.2/lib/ant-commons-net.jar:/home/hudson/hudson-slave/tools/Ant/ant-1.8.2/lib/ant-antlr.jar:/home/hudson/hudson-slave/tools/Ant/ant-1.8.2/lib/ant-apache-log4j.jar:/home/hudson/hudson-slave/tools/Ant/ant-1.8.2/lib/ant-commons-logging.jar:/home/hudson/hudson-slave/tools/Ant/ant-1.8.2/lib/ant-apache-xalan2.jar:/home/hudson/hudson-slave/tools/Ant/ant-1.8.2/lib/ant-apache-oro.jar:/home/hudson/hudson-slave/tools/Ant/ant-1.8.2/lib/ant-junit4.jar:/home/hudson/hudson-slave/tools/Ant/ant-1.8.2/lib/ant-netrexx.jar:/home/hudson/hudson-slave/tools/Ant/ant-1.8.2/lib/ant-swing.jar:/home/hudson/hudson-slave/tools/Ant/ant-1.8.2/lib/ant-javamail.jar:/home/hudson/hudson-slave/tools/Ant/ant-1.8.2/lib/ant-jsch.jar:/home/hudson/hudson-slave/tools/Ant/ant-1.8.2/lib/ant-jmf.jar:/home/hudson/hudson-slave/tools/Ant/ant-1.8.2/lib/ant.jar:/home/hudson/hudson-slave/tools/Ant/ant-1.8.2/lib/ant-apache-bcel.jar:/home/hudson/hudson-slave/tools/Ant/ant-1.8.2/lib/ant-jai.jar:/home/hudson/hudson-slave/tools/Ant/ant-1.8.2/lib/ant-testutil.jar:/home/hudson/hudson-slave/tools/Ant/ant-1.8.2/lib/ant-apache-resolver.jar:/home/hudson/hudson-slave/tools/Ant/ant-1.8.2/lib/ant-jdepend.jar:/usr/local/openjdk7/lib/tools.jar:/home/hudson/.ivy2/cache/com.carrotsearch.randomizedtesting/junit4-ant/jars/junit4-ant-2.0.6.jar
[junit4:junit4]   2> 159 T332 oaz.Environment.logEnv Server environment:java.library.path=/usr/local/openjdk7/jre/lib/amd64/server:/usr/local/openjdk7/jre/lib/amd64:/usr/local/openjdk7/jre/../lib/amd64:/usr/local/openjdk6/jre/lib/amd64/server:/usr/local/openjdk6/jre/lib/amd64:/usr/local/openjdk6/jre/../lib/amd64:/usr/java/packages/lib/amd64:/lib:/usr/lib:/usr/local/lib
[junit4:junit4]   2> 159 T332 oaz.Environment.logEnv Server environment:java.io.tmpdir=.
[junit4:junit4]   2> 160 T332 oaz.Environment.logEnv Server environment:java.compiler=<NA>
[junit4:junit4]   2> 160 T332 oaz.Environment.logEnv Server environment:os.name=FreeBSD
[junit4:junit4]   2> 160 T332 oaz.Environment.logEnv Server environment:os.arch=amd64
[junit4:junit4]   2> 160 T332 oaz.Environment.logEnv Server environment:os.version=9.0-RELEASE
[junit4:junit4]   2> 161 T332 oaz.Environment.logEnv Server environment:user.name=hudson
[junit4:junit4]   2> 161 T332 oaz.Environment.logEnv Server environment:user.home=/home/hudson
[junit4:junit4]   2> 161 T332 oaz.Environment.logEnv Server environment:user.dir=/usr/home/hudson/hudson-slave/workspace/Lucene-Solr-Tests-trunk-java7/solr/build/solr-core/test/J0
[junit4:junit4]   2> 231 T332 oazs.ZooKeeperServer.setTickTime tickTime set to 1000
[junit4:junit4]   2> 232 T332 oazs.ZooKeeperServer.setMinSessionTimeout minSessionTimeout set to -1
[junit4:junit4]   2> 232 T332 oazs.ZooKeeperServer.setMaxSessionTimeout maxSessionTimeout set to -1
[junit4:junit4]   2> 241 T332 oazs.NIOServerCnxnFactory.configure binding to port 0.0.0.0/0.0.0.0:0
[junit4:junit4]   2> 335 T331 oasc.ZkTestServer.run start zk server on port:15950
[junit4:junit4]   2> 468 T332 oazsp.FileTxnSnapLog.save Snapshotting: 0x0 to /usr/home/hudson/hudson-slave/workspace/Lucene-Solr-Tests-trunk-java7/solr/build/solr-core/test/J0/./org.apache.solr.cloud.BasicDistributedZk2Test-1355627541171/zookeeper/server1/data/version-2/snapshot.0
[junit4:junit4]   2> 535 T331 oaz.Environment.logEnv Client environment:zookeeper.version=3.4.5-1392090, built on 09/30/2012 17:52 GMT
[junit4:junit4]   2> 536 T331 oaz.Environment.logEnv Client environment:host.name=lucene.zones.apache.org
[junit4:junit4]   2> 536 T331 oaz.Environment.logEnv Client environment:java.version=1.7.0_09
[junit4:junit4]   2> 537 T331 oaz.Environment.logEnv Client environment:java.vendor=Oracle Corporation
[junit4:junit4]   2> 537 T331 oaz.Environment.logEnv Client environment:java.home=/usr/local/openjdk7/jre
[junit4:junit4]   2> 538 T331 oaz.Environment.logEnv Client environment:java.class.path=/usr/home/hudson/hudson-slave/workspace/Lucene-Solr-Tests-trunk-java7/solr/build/solr-core/classes/test:/usr/home/hudson/hudson-slave/workspace/Lucene-Solr-Tests-trunk-java7/solr/build/solr-test-framework/classes/java:/usr/home/hudson/hudson-slave/workspace/Lucene-Solr-Tests-trunk-java7/solr/build/solr-core/test-files:/usr/home/hudson/hudson-slave/workspace/Lucene-Solr-Tests-trunk-java7/lucene/build/test-framework/classes/java:/usr/home/hudson/hudson-slave/workspace/Lucene-Solr-Tests-trunk-java7/lucene/build/codecs/classes/java:/usr/home/hudson/hudson-slave/workspace/Lucene-Solr-Tests-trunk-java7/solr/build/solr-solrj/classes/java:/usr/home/hudson/hudson-slave/workspace/Lucene-Solr-Tests-trunk-java7/solr/build/solr-core/classes/java:/usr/home/hudson/hudson-slave/workspace/Lucene-Solr-Tests-trunk-java7/lucene/build/analysis/common/lucene-analyzers-common-5.0-SNAPSHOT.jar:/usr/home/hudson/hudson-slave/workspace/Lucene-Solr-Tests-trunk-java7/lucene/build/analysis/kuromoji/lucene-analyzers-kuromoji-5.0-SNAPSHOT.jar:/usr/home/hudson/hudson-slave/workspace/Lucene-Solr-Tests-trunk-java7/lucene/build/analysis/phonetic/lucene-analyzers-phonetic-5.0-SNAPSHOT.jar:/usr/home/hudson/hudson-slave/workspace/Lucene-Solr-Tests-trunk-java7/lucene/build/highlighter/lucene-highlighter-5.0-SNAPSHOT.jar:/usr/home/hudson/hudson-slave/workspace/Lucene-Solr-Tests-trunk-java7/lucene/build/memory/lucene-memory-5.0-SNAPSHOT.jar:/usr/home/hudson/hudson-slave/workspace/Lucene-Solr-Tests-trunk-java7/lucene/build/misc/lucene-misc-5.0-SNAPSHOT.jar:/usr/home/hudson/hudson-slave/workspace/Lucene-Solr-Tests-trunk-java7/lucene/build/spatial/lucene-spatial-5.0-SNAPSHOT.jar:/usr/home/hudson/hudson-slave/workspace/Lucene-Solr-Tests-trunk-java7/lucene/build/suggest/lucene-suggest-5.0-SNAPSHOT.jar:/usr/home/hudson/hudson-slave/workspace/Lucene-Solr-Tests-trunk-java7/lucene/build/grouping/lucene-grouping-5.0-SNAPSHOT.jar:/usr/home/hudson/hudson-slave/workspace/Lucene-Solr-Tests-trunk-java7/lucene/build/queries/lucene-queries-5.0-SNAPSHOT.jar:/usr/home/hudson/hudson-slave/workspace/Lucene-Solr-Tests-trunk-java7/lucene/build/queryparser/lucene-queryparser-5.0-SNAPSHOT.jar:/usr/home/hudson/hudson-slave/workspace/Lucene-Solr-Tests-trunk-java7/solr/core/lib/cglib-nodep-2.2.jar:/usr/home/hudson/hudson-slave/workspace/Lucene-Solr-Tests-trunk-java7/solr/core/lib/commons-cli-1.2.jar:/usr/home/hudson/hudson-slave/workspace/Lucene-Solr-Tests-trunk-java7/solr/core/lib/commons-codec-1.7.jar:/usr/home/hudson/hudson-slave/workspace/Lucene-Solr-Tests-trunk-java7/solr/core/lib/commons-fileupload-1.2.1.jar:/usr/home/hudson/hudson-slave/workspace/Lucene-Solr-Tests-trunk-java7/solr/core/lib/commons-lang-2.6.jar:/usr/home/hudson/hudson-slave/workspace/Lucene-Solr-Tests-trunk-java7/solr/core/lib/easymock-3.0.jar:/usr/home/hudson/hudson-slave/workspace/Lucene-Solr-Tests-trunk-java7/solr/core/lib/guava-13.0.1.jar:/usr/home/hudson/hudson-slave/workspace/Lucene-Solr-Tests-trunk-java7/solr/core/lib/javax.servlet-api-3.0.1.jar:/usr/home/hudson/hudson-slave/workspace/Lucene-Solr-Tests-trunk-java7/solr/core/lib/metrics-core-2.1.2.jar:/usr/home/hudson/hudson-slave/workspace/Lucene-Solr-Tests-trunk-java7/solr/core/lib/objenesis-1.2.jar:/usr/home/hudson/hudson-slave/workspace/Lucene-Solr-Tests-trunk-java7/solr/core/lib/spatial4j-0.3.jar:/usr/home/hudson/hudson-slave/workspace/Lucene-Solr-Tests-trunk-java7/solr/solrj/lib/commons-io-2.1.jar:/usr/home/hudson/hudson-slave/workspace/Lucene-Solr-Tests-trunk-java7/solr/solrj/lib/httpclient-4.1.3.jar:/usr/home/hudson/hudson-slave/workspace/Lucene-Solr-Tests-trunk-java7/solr/solrj/lib/httpcore-4.1.4.jar:/usr/home/hudson/hudson-slave/workspace/Lucene-Solr-Tests-trunk-java7/solr/solrj/lib/httpmime-4.1.3.jar:/usr/home/hudson/hudson-slave/workspace/Lucene-Solr-Tests-trunk-java7/solr/solrj/lib/jcl-over-slf4j-1.6.4.jar:/usr/home/hudson/hudson-slave/workspace/Lucene-Solr-Tests-trunk-java7/solr/solrj/lib/log4j-over-slf4j-1.6.4.jar:/usr/home/hudson/hudson-slave/workspace/Lucene-Solr-Tests-trunk-java7/solr/solrj/lib/slf4j-api-1.6.4.jar:/usr/home/hudson/hudson-slave/workspace/Lucene-Solr-Tests-trunk-java7/solr/solrj/lib/slf4j-jdk14-1.6.4.jar:/usr/home/hudson/hudson-slave/workspace/Lucene-Solr-Tests-trunk-java7/solr/solrj/lib/wstx-asl-3.2.7.jar:/usr/home/hudson/hudson-slave/workspace/Lucene-Solr-Tests-trunk-java7/solr/solrj/lib/zookeeper-3.4.5.jar:/usr/home/hudson/hudson-slave/workspace/Lucene-Solr-Tests-trunk-java7/solr/example/lib/jetty-continuation-8.1.8.v20121106.jar:/usr/home/hudson/hudson-slave/workspace/Lucene-Solr-Tests-trunk-java7/solr/example/lib/jetty-deploy-8.1.8.v20121106.jar:/usr/home/hudson/hudson-slave/workspace/Lucene-Solr-Tests-trunk-java7/solr/example/lib/jetty-http-8.1.8.v20121106.jar:/usr/home/hudson/hudson-slave/workspace/Lucene-Solr-Tests-trunk-java7/solr/example/lib/jetty-io-8.1.8.v20121106.jar:/usr/home/hudson/hudson-slave/workspace/Lucene-Solr-Tests-trunk-java7/solr/example/lib/jetty-jmx-8.1.8.v20121106.jar:/usr/home/hudson/hudson-slave/workspace/Lucene-Solr-Tests-trunk-java7/solr/example/lib/jetty-security-8.1.8.v20121106.jar:/usr/home/hudson/hudson-slave/workspace/Lucene-Solr-Tests-trunk-java7/solr/example/lib/jetty-server-8.1.8.v20121106.jar:/usr/home/hudson/hudson-slave/workspace/Lucene-Solr-Tests-trunk-java7/solr/example/lib/jetty-servlet-8.1.8.v20121106.jar:/usr/home/hudson/hudson-slave/workspace/Lucene-Solr-Tests-trunk-java7/solr/example/lib/jetty-util-8.1.8.v20121106.jar:/usr/home/hudson/hudson-slave/workspace/Lucene-Solr-Tests-trunk-java7/solr/example/lib/jetty-webapp-8.1.8.v20121106.jar:/usr/home/hudson/hudson-slave/workspace/Lucene-Solr-Tests-trunk-java7/solr/example/lib/jetty-xml-8.1.8.v20121106.jar:/usr/home/hudson/hudson-slave/workspace/Lucene-Solr-Tests-trunk-java7/solr/example/lib/servlet-api-3.0.jar:/usr/home/hudson/hudson-slave/workspace/Lucene-Solr-Tests-trunk-java7/solr/example/example-DIH/solr/db/lib/derby-10.9.1.0.jar:/usr/home/hudson/hudson-slave/workspace/Lucene-Solr-Tests-trunk-java7/solr/example/example-DIH/solr/db/lib/hsqldb-1.8.0.10.jar:/usr/home/hudson/hudson-slave/workspace/Lucene-Solr-Tests-trunk-java7/lucene/build/core/classes/java:/usr/home/hudson/hudson-slave/workspace/Lucene-Solr-Tests-trunk-java7/lucene/test-framework/lib/junit-4.10.jar:/usr/home/hudson/hudson-slave/workspace/Lucene-Solr-Tests-trunk-java7/lucene/test-framework/lib/randomizedtesting-runner-2.0.6.jar:/home/hudson/hudson-slave/tools/Ant/ant-1.8.2/lib/ant-launcher.jar:/home/hudson/.ant/lib/ivy-2.2.0.jar:/home/hudson/hudson-slave/tools/Ant/ant-1.8.2/lib/ant-apache-regexp.jar:/home/hudson/hudson-slave/tools/Ant/ant-1.8.2/lib/ant-junit.jar:/home/hudson/hudson-slave/tools/Ant/ant-1.8.2/lib/ant-apache-bsf.jar:/home/hudson/hudson-slave/tools/Ant/ant-1.8.2/lib/ant-commons-net.jar:/home/hudson/hudson-slave/tools/Ant/ant-1.8.2/lib/ant-antlr.jar:/home/hudson/hudson-slave/tools/Ant/ant-1.8.2/lib/ant-apache-log4j.jar:/home/hudson/hudson-slave/tools/Ant/ant-1.8.2/lib/ant-commons-logging.jar:/home/hudson/hudson-slave/tools/Ant/ant-1.8.2/lib/ant-apache-xalan2.jar:/home/hudson/hudson-slave/tools/Ant/ant-1.8.2/lib/ant-apache-oro.jar:/home/hudson/hudson-slave/tools/Ant/ant-1.8.2/lib/ant-junit4.jar:/home/hudson/hudson-slave/tools/Ant/ant-1.8.2/lib/ant-netrexx.jar:/home/hudson/hudson-slave/tools/Ant/ant-1.8.2/lib/ant-swing.jar:/home/hudson/hudson-slave/tools/Ant/ant-1.8.2/lib/ant-javamail.jar:/home/hudson/hudson-slave/tools/Ant/ant-1.8.2/lib/ant-jsch.jar:/home/hudson/hudson-slave/tools/Ant/ant-1.8.2/lib/ant-jmf.jar:/home/hudson/hudson-slave/tools/Ant/ant-1.8.2/lib/ant.jar:/home/hudson/hudson-slave/tools/Ant/ant-1.8.2/lib/ant-apache-bcel.jar:/home/hudson/hudson-slave/tools/Ant/ant-1.8.2/lib/ant-jai.jar:/home/hudson/hudson-slave/tools/Ant/ant-1.8.2/lib/ant-testutil.jar:/home/hudson/hudson-slave/tools/Ant/ant-1.8.2/lib/ant-apache-resolver.jar:/home/hudson/hudson-slave/tools/Ant/ant-1.8.2/lib/ant-jdepend.jar:/usr/local/openjdk7/lib/tools.jar:/home/hudson/.ivy2/cache/com.carrotsearch.randomizedtesting/junit4-ant/jars/junit4-ant-2.0.6.jar
[junit4:junit4]   2> 540 T331 oaz.Environment.logEnv Client environment:java.library.path=/usr/local/openjdk7/jre/lib/amd64/server:/usr/local/openjdk7/jre/lib/amd64:/usr/local/openjdk7/jre/../lib/amd64:/usr/local/openjdk6/jre/lib/amd64/server:/usr/local/openjdk6/jre/lib/amd64:/usr/local/openjdk6/jre/../lib/amd64:/usr/java/packages/lib/amd64:/lib:/usr/lib:/usr/local/lib
[junit4:junit4]   2> 541 T331 oaz.Environment.logEnv Client environment:java.io.tmpdir=.
[junit4:junit4]   2> 541 T331 oaz.Environment.logEnv Client environment:java.compiler=<NA>
[junit4:junit4]   2> 542 T331 oaz.Environment.logEnv Client environment:os.name=FreeBSD
[junit4:junit4]   2> 542 T331 oaz.Environment.logEnv Client environment:os.arch=amd64
[junit4:junit4]   2> 543 T331 oaz.Environment.logEnv Client environment:os.version=9.0-RELEASE
[junit4:junit4]   2> 543 T331 oaz.Environment.logEnv Client environment:user.name=hudson
[junit4:junit4]   2> 544 T331 oaz.Environment.logEnv Client environment:user.home=/home/hudson
[junit4:junit4]   2> 544 T331 oaz.Environment.logEnv Client environment:user.dir=/usr/home/hudson/hudson-slave/workspace/Lucene-Solr-Tests-trunk-java7/solr/build/solr-core/test/J0
[junit4:junit4]   2> 551 T331 oaz.ZooKeeper.<init> Initiating client connection, connectString=127.0.0.1:15950 sessionTimeout=10000 watcher=org.apache.solr.common.cloud.ConnectionManager@3b60f008
[junit4:junit4]   2> 737 T331 oascc.ConnectionManager.waitForConnected Waiting for client to connect to ZooKeeper
[junit4:junit4]   2> 754 T336 oaz.ClientCnxn$SendThread.logStartConnect Opening socket connection to server localhost/127.0.0.1:15950. Will not attempt to authenticate using SASL (access denied ("javax.security.auth.AuthPermission" "getLoginConfiguration"))
[junit4:junit4]   2> 758 T336 oaz.ClientCnxn$SendThread.primeConnection Socket connection established to localhost/127.0.0.1:15950, initiating session
[junit4:junit4]   2> 759 T333 oazs.NIOServerCnxnFactory.run Accepted socket connection from /140.211.11.196:40256
[junit4:junit4]   2> 798 T333 oazs.NIOServerCnxn.doIO WARNING Exception causing close of session 0x0 due to java.io.IOException: ZooKeeperServer not running
[junit4:junit4]   2> 798 T333 oazs.NIOServerCnxn.closeSock Closed socket connection for client /140.211.11.196:40256 (no session established for client)
[junit4:junit4]   2> 799 T336 oaz.ClientCnxn$SendThread.run Unable to read additional data from server sessionid 0x0, likely server has closed socket, closing socket connection and attempting reconnect
[junit4:junit4]   2> 2439 T336 oaz.ClientCnxn$SendThread.logStartConnect Opening socket connection to server localhost/127.0.0.1:15950. Will not attempt to authenticate using SASL (access denied ("javax.security.auth.AuthPermission" "getLoginConfiguration"))
[junit4:junit4]   2> 2440 T336 oaz.ClientCnxn$SendThread.primeConnection Socket connection established to localhost/127.0.0.1:15950, initiating session
[junit4:junit4]   2> 2440 T333 oazs.NIOServerCnxnFactory.run Accepted socket connection from /140.211.11.196:35342
[junit4:junit4]   2> 2474 T333 oazs.ZooKeeperServer.processConnectRequest Client attempting to establish new session at /140.211.11.196:35342
[junit4:junit4]   2> 2493 T335 oazsp.FileTxnLog.append Creating new log file: log.1
[junit4:junit4]   2> 2581 T335 oazs.ZooKeeperServer.finishSessionInit Established session 0x13ba1b2b4c60000 with negotiated timeout 10000 for client /140.211.11.196:35342
[junit4:junit4]   2> 2581 T336 oaz.ClientCnxn$SendThread.onConnected Session establishment complete on server localhost/127.0.0.1:15950, sessionid = 0x13ba1b2b4c60000, negotiated timeout = 10000
[junit4:junit4]   2> 2586 T337 oascc.ConnectionManager.process Watcher org.apache.solr.common.cloud.ConnectionManager@3b60f008 name:ZooKeeperConnection Watcher:127.0.0.1:15950 got event WatchedEvent state:SyncConnected type:None path:null path:null type:None
[junit4:junit4]   2> 2587 T331 oascc.ConnectionManager.waitForConnected Client is connected to ZooKeeper
[junit4:junit4]   2> 2593 T331 oascc.SolrZkClient.makePath makePath: /solr
[junit4:junit4]   2> 2708 T338 oazs.PrepRequestProcessor.pRequest2Txn Processed session termination for sessionid: 0x13ba1b2b4c60000
[junit4:junit4]   2> 2711 T337 oaz.ClientCnxn$EventThread.run EventThread shut down
[junit4:junit4]   2> 2711 T331 oaz.ZooKeeper.close Session: 0x13ba1b2b4c60000 closed
[junit4:junit4]   2> 2712 T331 oaz.ZooKeeper.<init> Initiating client connection, connectString=127.0.0.1:15950/solr sessionTimeout=10000 watcher=org.apache.solr.common.cloud.ConnectionManager@76e806b8
[junit4:junit4]   2> 2713 T333 oazs.NIOServerCnxn.closeSock Closed socket connection for client /140.211.11.196:35342 which had sessionid 0x13ba1b2b4c60000
[junit4:junit4]   2> 2714 T331 oascc.ConnectionManager.waitForConnected Waiting for client to connect to ZooKeeper
[junit4:junit4]   2> 2714 T339 oaz.ClientCnxn$SendThread.logStartConnect Opening socket connection to server localhost/127.0.0.1:15950. Will not attempt to authenticate using SASL (access denied ("javax.security.auth.AuthPermission" "getLoginConfiguration"))
[junit4:junit4]   2> 2715 T339 oaz.ClientCnxn$SendThread.primeConnection Socket connection established to localhost/127.0.0.1:15950, initiating session
[junit4:junit4]   2> 2715 T333 oazs.NIOServerCnxnFactory.run Accepted socket connection from /140.211.11.196:52257
[junit4:junit4]   2> 2716 T333 oazs.ZooKeeperServer.processConnectRequest Client attempting to establish new session at /140.211.11.196:52257
[junit4:junit4]   2> 2718 T335 oazs.ZooKeeperServer.finishSessionInit Established session 0x13ba1b2b4c60001 with negotiated timeout 10000 for client /140.211.11.196:52257
[junit4:junit4]   2> 2718 T339 oaz.ClientCnxn$SendThread.onConnected Session establishment complete on server localhost/127.0.0.1:15950, sessionid = 0x13ba1b2b4c60001, negotiated timeout = 10000
[junit4:junit4]   2> 2719 T340 oascc.ConnectionManager.process Watcher org.apache.solr.common.cloud.ConnectionManager@76e806b8 name:ZooKeeperConnection Watcher:127.0.0.1:15950/solr got event WatchedEvent state:SyncConnected type:None path:null path:null type:None
[junit4:junit4]   2> 2719 T331 oascc.ConnectionManager.waitForConnected Client is connected to ZooKeeper
[junit4:junit4]   2> 2734 T331 oascc.SolrZkClient.makePath makePath: /collections/collection1
[junit4:junit4]   2> 2743 T331 oascc.SolrZkClient.makePath makePath: /collections/collection1/shards
[junit4:junit4]   2> 2772 T331 oascc.SolrZkClient.makePath makePath: /collections/control_collection
[junit4:junit4]   2> 2778 T331 oascc.SolrZkClient.makePath makePath: /collections/control_collection/shards
[junit4:junit4]   2> 2794 T331 oasc.AbstractZkTestCase.putConfig put /usr/home/hudson/hudson-slave/workspace/Lucene-Solr-Tests-trunk-java7/solr/build/solr-core/test-files/solr/collection1/conf/solrconfig.xml to /configs/conf1/solrconfig.xml
[junit4:junit4]   2> 2797 T331 oascc.SolrZkClient.makePath makePath: /configs/conf1/solrconfig.xml
[junit4:junit4]   2> 2834 T331 oasc.AbstractZkTestCase.putConfig put /usr/home/hudson/hudson-slave/workspace/Lucene-Solr-Tests-trunk-java7/solr/build/solr-core/test-files/solr/collection1/conf/schema.xml to /configs/conf1/schema.xml
[junit4:junit4]   2> 2836 T331 oascc.SolrZkClient.makePath makePath: /configs/conf1/schema.xml
[junit4:junit4]   2> 2956 T331 oasc.AbstractZkTestCase.putConfig put /usr/home/hudson/hudson-slave/workspace/Lucene-Solr-Tests-trunk-java7/solr/build/solr-core/test-files/solr/collection1/conf/stopwords.txt to /configs/conf1/stopwords.txt
[junit4:junit4]   2> 2957 T331 oascc.SolrZkClient.makePath makePath: /configs/conf1/stopwords.txt
[junit4:junit4]   2> 2964 T331 oasc.AbstractZkTestCase.putConfig put /usr/home/hudson/hudson-slave/workspace/Lucene-Solr-Tests-trunk-java7/solr/build/solr-core/test-files/solr/collection1/conf/protwords.txt to /configs/conf1/protwords.txt
[junit4:junit4]   2> 2965 T331 oascc.SolrZkClient.makePath makePath: /configs/conf1/protwords.txt
[junit4:junit4]   2> 2976 T331 oasc.AbstractZkTestCase.putConfig put /usr/home/hudson/hudson-slave/workspace/Lucene-Solr-Tests-trunk-java7/solr/build/solr-core/test-files/solr/collection1/conf/currency.xml to /configs/conf1/currency.xml
[junit4:junit4]   2> 2993 T331 oascc.SolrZkClient.makePath makePath: /configs/conf1/currency.xml
[junit4:junit4]   2> 3005 T331 oasc.AbstractZkTestCase.putConfig put /usr/home/hudson/hudson-slave/workspace/Lucene-Solr-Tests-trunk-java7/solr/build/solr-core/test-files/solr/collection1/conf/open-exchange-rates.json to /configs/conf1/open-exchange-rates.json
[junit4:junit4]   2> 3006 T331 oascc.SolrZkClient.makePath makePath: /configs/conf1/open-exchange-rates.json
[junit4:junit4]   2> 3012 T331 oasc.AbstractZkTestCase.putConfig put /usr/home/hudson/hudson-slave/workspace/Lucene-Solr-Tests-trunk-java7/solr/build/solr-core/test-files/solr/collection1/conf/mapping-ISOLatin1Accent.txt to /configs/conf1/mapping-ISOLatin1Accent.txt
[junit4:junit4]   2> 3013 T331 oascc.SolrZkClient.makePath makePath: /configs/conf1/mapping-ISOLatin1Accent.txt
[junit4:junit4]   2> 3026 T331 oasc.AbstractZkTestCase.putConfig put /usr/home/hudson/hudson-slave/workspace/Lucene-Solr-Tests-trunk-java7/solr/build/solr-core/test-files/solr/collection1/conf/old_synonyms.txt to /configs/conf1/old_synonyms.txt
[junit4:junit4]   2> 3028 T331 oascc.SolrZkClient.makePath makePath: /configs/conf1/old_synonyms.txt
[junit4:junit4]   2> 3034 T331 oasc.AbstractZkTestCase.putConfig put /usr/home/hudson/hudson-slave/workspace/Lucene-Solr-Tests-trunk-java7/solr/build/solr-core/test-files/solr/collection1/conf/synonyms.txt to /configs/conf1/synonyms.txt
[junit4:junit4]   2> 3036 T331 oascc.SolrZkClient.makePath makePath: /configs/conf1/synonyms.txt
[junit4:junit4]   2> 3041 T338 oazs.PrepRequestProcessor.pRequest2Txn Processed session termination for sessionid: 0x13ba1b2b4c60001
[junit4:junit4]   2> 3092 T340 oaz.ClientCnxn$EventThread.run EventThread shut down
[junit4:junit4]   2> 3092 T331 oaz.ZooKeeper.close Session: 0x13ba1b2b4c60001 closed
[junit4:junit4]   2> 3092 T333 oazs.NIOServerCnxn.closeSock Closed socket connection for client /140.211.11.196:52257 which had sessionid 0x13ba1b2b4c60001
[junit4:junit4]   2> 3358 T331 oejs.Server.doStart jetty-8.1.8.v20121106
[junit4:junit4]   2> 3362 T331 oejs.AbstractConnector.doStart Started SocketConnector@127.0.0.1:25223
[junit4:junit4]   2> 3363 T331 oasc.SolrResourceLoader.locateSolrHome JNDI not configured for solr (NoInitialContextEx)
[junit4:junit4]   2> 3363 T331 oasc.SolrResourceLoader.locateSolrHome using system property solr.solr.home: /usr/home/hudson/hudson-slave/workspace/Lucene-Solr-Tests-trunk-java7/solr/build/solr-core/test/J0/./org.apache.solr.cloud.BasicDistributedZk2Test-controljetty-1355627544257
[junit4:junit4]   2> 3364 T331 oasc.SolrResourceLoader.<init> new SolrResourceLoader for deduced Solr Home: '/usr/home/hudson/hudson-slave/workspace/Lucene-Solr-Tests-trunk-java7/solr/build/solr-core/test/J0/./org.apache.solr.cloud.BasicDistributedZk2Test-controljetty-1355627544257/'
[junit4:junit4]   2> 3413 T331 oass.SolrDispatchFilter.init SolrDispatchFilter.init()
[junit4:junit4]   2> 3414 T331 oasc.SolrResourceLoader.locateSolrHome JNDI not configured for solr (NoInitialContextEx)
[junit4:junit4]   2> 3414 T331 oasc.SolrResourceLoader.locateSolrHome using system property solr.solr.home: /usr/home/hudson/hudson-slave/workspace/Lucene-Solr-Tests-trunk-java7/solr/build/solr-core/test/J0/./org.apache.solr.cloud.BasicDistributedZk2Test-controljetty-1355627544257
[junit4:junit4]   2> 3415 T331 oasc.CoreContainer$Initializer.initialize looking for solr.xml: /usr/home/hudson/hudson-slave/workspace/Lucene-Solr-Tests-trunk-java7/solr/build/solr-core/test/J0/./org.apache.solr.cloud.BasicDistributedZk2Test-controljetty-1355627544257/solr.xml
[junit4:junit4]   2> 3415 T331 oasc.CoreContainer.<init> New CoreContainer 1559825035
[junit4:junit4]   2> 3416 T331 oasc.CoreContainer.load Loading CoreContainer using Solr Home: '/usr/home/hudson/hudson-slave/workspace/Lucene-Solr-Tests-trunk-java7/solr/build/solr-core/test/J0/./org.apache.solr.cloud.BasicDistributedZk2Test-controljetty-1355627544257/'
[junit4:junit4]   2> 3416 T331 oasc.SolrResourceLoader.<init> new SolrResourceLoader for directory: '/usr/home/hudson/hudson-slave/workspace/Lucene-Solr-Tests-trunk-java7/solr/build/solr-core/test/J0/./org.apache.solr.cloud.BasicDistributedZk2Test-controljetty-1355627544257/'
[junit4:junit4]   2> 3472 T331 oasc.CoreContainer.load Registering Log Listener
[junit4:junit4]   2> 3491 T331 oasc.CoreContainer.initZooKeeper Zookeeper client=127.0.0.1:15950/solr
[junit4:junit4]   2> 3539 T331 oasc.ZkController.checkChrootPath zkHost includes chroot
[junit4:junit4]   2> 3540 T331 oaz.ZooKeeper.<init> Initiating client connection, connectString=127.0.0.1:15950 sessionTimeout=60000 watcher=org.apache.solr.common.cloud.ConnectionManager@ea66840
[junit4:junit4]   2> 3541 T331 oascc.ConnectionManager.waitForConnected Waiting for client to connect to ZooKeeper
[junit4:junit4]   2> 3541 T350 oaz.ClientCnxn$SendThread.logStartConnect Opening socket connection to server localhost/127.0.0.1:15950. Will not attempt to authenticate using SASL (access denied ("javax.security.auth.AuthPermission" "getLoginConfiguration"))
[junit4:junit4]   2> 3542 T350 oaz.ClientCnxn$SendThread.primeConnection Socket connection established to localhost/127.0.0.1:15950, initiating session
[junit4:junit4]   2> 3543 T333 oazs.NIOServerCnxnFactory.run Accepted socket connection from /140.211.11.196:12178
[junit4:junit4]   2> 3543 T333 oazs.ZooKeeperServer.processConnectRequest Client attempting to establish new session at /140.211.11.196:12178
[junit4:junit4]   2> 3548 T335 oazs.ZooKeeperServer.finishSessionInit Established session 0x13ba1b2b4c60002 with negotiated timeout 20000 for client /140.211.11.196:12178
[junit4:junit4]   2> 3548 T350 oaz.ClientCnxn$SendThread.onConnected Session establishment complete on server localhost/127.0.0.1:15950, sessionid = 0x13ba1b2b4c60002, negotiated timeout = 20000
[junit4:junit4]   2> 3549 T351 oascc.ConnectionManager.process Watcher org.apache.solr.common.cloud.ConnectionManager@ea66840 name:ZooKeeperConnection Watcher:127.0.0.1:15950 got event WatchedEvent state:SyncConnected type:None path:null path:null type:None
[junit4:junit4]   2> 3549 T331 oascc.ConnectionManager.waitForConnected Client is connected to ZooKeeper
[junit4:junit4]   2> 3552 T338 oazs.PrepRequestProcessor.pRequest2Txn Processed session termination for sessionid: 0x13ba1b2b4c60002
[junit4:junit4]   2> 3553 T351 oaz.ClientCnxn$EventThread.run EventThread shut down
[junit4:junit4]   2> 3554 T333 oazs.NIOServerCnxn.closeSock Closed socket connection for client /140.211.11.196:12178 which had sessionid 0x13ba1b2b4c60002
[junit4:junit4]   2> 3553 T331 oaz.ZooKeeper.close Session: 0x13ba1b2b4c60002 closed
[junit4:junit4]   2> 3559 T331 oaz.ZooKeeper.<init> Initiating client connection, connectString=127.0.0.1:15950/solr sessionTimeout=8000 watcher=org.apache.solr.common.cloud.ConnectionManager@138f4128
[junit4:junit4]   2> 3560 T331 oascc.ConnectionManager.waitForConnected Waiting for client to connect to ZooKeeper
[junit4:junit4]   2> 3561 T352 oaz.ClientCnxn$SendThread.logStartConnect Opening socket connection to server localhost/127.0.0.1:15950. Will not attempt to authenticate using SASL (access denied ("javax.security.auth.AuthPermission" "getLoginConfiguration"))
[junit4:junit4]   2> 3562 T352 oaz.ClientCnxn$SendThread.primeConnection Socket connection established to localhost/127.0.0.1:15950, initiating session
[junit4:junit4]   2> 3562 T333 oazs.NIOServerCnxnFactory.run Accepted socket connection from /140.211.11.196:38311
[junit4:junit4]   2> 3563 T333 oazs.ZooKeeperServer.processConnectRequest Client attempting to establish new session at /140.211.11.196:38311
[junit4:junit4]   2> 3564 T335 oazs.ZooKeeperServer.finishSessionInit Established session 0x13ba1b2b4c60003 with negotiated timeout 8000 for client /140.211.11.196:38311
[junit4:junit4]   2> 3565 T352 oaz.ClientCnxn$SendThread.onConnected Session establishment complete on server localhost/127.0.0.1:15950, sessionid = 0x13ba1b2b4c60003, negotiated timeout = 8000
[junit4:junit4]   2> 3565 T353 oascc.ConnectionManager.process Watcher org.apache.solr.common.cloud.ConnectionManager@138f4128 name:ZooKeeperConnection Watcher:127.0.0.1:15950/solr got event WatchedEvent state:SyncConnected type:None path:null path:null type:None
[junit4:junit4]   2> 3566 T331 oascc.ConnectionManager.waitForConnected Client is connected to ZooKeeper
[junit4:junit4]   2> 3593 T338 oazs.PrepRequestProcessor.pRequest Got user-level KeeperException when processing sessionid:0x13ba1b2b4c60003 type:create cxid:0x2 zxid:0x1a txntype:-1 reqpath:n/a Error Path:/solr/overseer Error:KeeperErrorCode = NodeExists for /solr/overseer
[junit4:junit4]   2> 3634 T331 oascc.SolrZkClient.makePath makePath: /live_nodes
[junit4:junit4]   2> 3639 T331 oasc.ZkController.createEphemeralLiveNode Register node as live in ZooKeeper:/live_nodes/127.0.0.1:25223_
[junit4:junit4]   2> 3653 T338 oazs.PrepRequestProcessor.pRequest Got user-level KeeperException when processing sessionid:0x13ba1b2b4c60003 type:delete cxid:0x7 zxid:0x1c txntype:-1 reqpath:n/a Error Path:/solr/live_nodes/127.0.0.1:25223_ Error:KeeperErrorCode = NoNode for /solr/live_nodes/127.0.0.1:25223_
[junit4:junit4]   2> 3655 T331 oascc.SolrZkClient.makePath makePath: /live_nodes/127.0.0.1:25223_
[junit4:junit4]   2> 3660 T331 oashc.HttpShardHandlerFactory.getParameter Setting socketTimeout to: 0
[junit4:junit4]   2> 3661 T331 oashc.HttpShardHandlerFactory.getParameter Setting urlScheme to: http://
[junit4:junit4]   2> 3661 T331 oashc.HttpShardHandlerFactory.getParameter Setting connTimeout to: 0
[junit4:junit4]   2> 3662 T331 oashc.HttpShardHandlerFactory.getParameter Setting maxConnectionsPerHost to: 20
[junit4:junit4]   2> 3662 T331 oashc.HttpShardHandlerFactory.getParameter Setting corePoolSize to: 0
[junit4:junit4]   2> 3663 T331 oashc.HttpShardHandlerFactory.getParameter Setting maximumPoolSize to: 2147483647
[junit4:junit4]   2> 3663 T331 oashc.HttpShardHandlerFactory.getParameter Setting maxThreadIdleTime to: 5
[junit4:junit4]   2> 3664 T331 oashc.HttpShardHandlerFactory.getParameter Setting sizeOfQueue to: -1
[junit4:junit4]   2> 3664 T331 oashc.HttpShardHandlerFactory.getParameter Setting fairnessPolicy to: false
[junit4:junit4]   2> 3665 T331 oascsi.HttpClientUtil.createClient Creating new http client, config:maxConnectionsPerHost=20&maxConnections=10000&socketTimeout=0&connTimeout=0&retry=false
[junit4:junit4]   2> 3688 T331 oascc.SolrZkClient.makePath makePath: /overseer_elect/election
[junit4:junit4]   2> 3742 T338 oazs.PrepRequestProcessor.pRequest Got user-level KeeperException when processing sessionid:0x13ba1b2b4c60003 type:delete cxid:0x15 zxid:0x21 txntype:-1 reqpath:n/a Error Path:/solr/overseer_elect/leader Error:KeeperErrorCode = NoNode for /solr/overseer_elect/leader
[junit4:junit4]   2> 3745 T331 oascc.SolrZkClient.makePath makePath: /overseer_elect/leader
[junit4:junit4]   2> 3751 T331 oasc.Overseer.start Overseer (id=88842406572982275-127.0.0.1:25223_-n_0000000000) starting
[junit4:junit4]   2> 3752 T338 oazs.PrepRequestProcessor.pRequest Got user-level KeeperException when processing sessionid:0x13ba1b2b4c60003 type:create cxid:0x1a zxid:0x23 txntype:-1 reqpath:n/a Error Path:/solr/overseer Error:KeeperErrorCode = NodeExists for /solr/overseer
[junit4:junit4]   2> 3800 T338 oazs.PrepRequestProcessor.pRequest Got user-level KeeperException when processing sessionid:0x13ba1b2b4c60003 type:create cxid:0x1b zxid:0x24 txntype:-1 reqpath:n/a Error Path:/solr/overseer Error:KeeperErrorCode = NodeExists for /solr/overseer
[junit4:junit4]   2> 3804 T338 oazs.PrepRequestProcessor.pRequest Got user-level KeeperException when processing sessionid:0x13ba1b2b4c60003 type:create cxid:0x1c zxid:0x25 txntype:-1 reqpath:n/a Error Path:/solr/overseer Error:KeeperErrorCode = NodeExists for /solr/overseer
[junit4:junit4]   2> 3847 T338 oazs.PrepRequestProcessor.pRequest Got user-level KeeperException when processing sessionid:0x13ba1b2b4c60003 type:create cxid:0x1d zxid:0x26 txntype:-1 reqpath:n/a Error Path:/solr/overseer Error:KeeperErrorCode = NodeExists for /solr/overseer
[junit4:junit4]   2> 3849 T355 oasc.OverseerCollectionProcessor.run Process current queue of collection messages
[junit4:junit4]   2> 3850 T331 oascc.SolrZkClient.makePath makePath: /clusterstate.json
[junit4:junit4]   2> 3854 T331 oascc.ZkStateReader.createClusterStateWatchersAndUpdate Updating cluster state from ZooKeeper... 
[junit4:junit4]   2> 3897 T354 oasc.Overseer$ClusterStateUpdater.run Starting to work on the main queue
[junit4:junit4]   2> 3916 T356 oasc.CoreContainer.create Creating SolrCore 'collection1' using instanceDir: /usr/home/hudson/hudson-slave/workspace/Lucene-Solr-Tests-trunk-java7/solr/build/solr-core/test/J0/./org.apache.solr.cloud.BasicDistributedZk2Test-controljetty-1355627544257/collection1
[junit4:junit4]   2> 3917 T356 oasc.ZkController.createCollectionZkNode Check for collection zkNode:control_collection
[junit4:junit4]   2> 3918 T356 oasc.ZkController.createCollectionZkNode Collection zkNode exists
[junit4:junit4]   2> 3918 T356 oasc.ZkController.readConfigName Load collection config from:/collections/control_collection
[junit4:junit4]   2> 3920 T356 oasc.SolrResourceLoader.<init> new SolrResourceLoader for directory: '/usr/home/hudson/hudson-slave/workspace/Lucene-Solr-Tests-trunk-java7/solr/build/solr-core/test/J0/./org.apache.solr.cloud.BasicDistributedZk2Test-controljetty-1355627544257/collection1/'
[junit4:junit4]   2> 3922 T356 oasc.SolrResourceLoader.replaceClassLoader Adding 'file:/usr/home/hudson/hudson-slave/workspace/Lucene-Solr-Tests-trunk-java7/solr/build/solr-core/test/J0/org.apache.solr.cloud.BasicDistributedZk2Test-controljetty-1355627544257/collection1/lib/README' to classloader
[junit4:junit4]   2> 3923 T356 oasc.SolrResourceLoader.replaceClassLoader Adding 'file:/usr/home/hudson/hudson-slave/workspace/Lucene-Solr-Tests-trunk-java7/solr/build/solr-core/test/J0/org.apache.solr.cloud.BasicDistributedZk2Test-controljetty-1355627544257/collection1/lib/classes/' to classloader
[junit4:junit4]   2> 4017 T356 oasc.SolrConfig.<init> Using Lucene MatchVersion: LUCENE_50
[junit4:junit4]   2> 4130 T356 oasc.SolrConfig.<init> Loaded SolrConfig: solrconfig.xml
[junit4:junit4]   2> 4231 T356 oass.IndexSchema.readSchema Reading Solr Schema
[junit4:junit4]   2> 4243 T356 oass.IndexSchema.readSchema Schema name=test
[junit4:junit4]   2> 5262 T356 oass.OpenExchangeRatesOrgProvider.init Initialized with rates=open-exchange-rates.json, refreshInterval=1440.
[junit4:junit4]   2> 5289 T356 oass.IndexSchema.readSchema default search field in schema is text
[junit4:junit4]   2> 5294 T356 oass.IndexSchema.readSchema unique key field: id
[junit4:junit4]   2> 5320 T356 oass.FileExchangeRateProvider.reload Reloading exchange rates from file currency.xml
[junit4:junit4]   2> 5326 T356 oass.FileExchangeRateProvider.reload Reloading exchange rates from file currency.xml
[junit4:junit4]   2> 5332 T356 oass.OpenExchangeRatesOrgProvider.reload Reloading exchange rates from open-exchange-rates.json
[junit4:junit4]   2> 5335 T356 oass.OpenExchangeRatesOrgProvider.reload Reloading exchange rates from open-exchange-rates.json
[junit4:junit4]   2> 5337 T356 oasc.SolrCore.<init> [collection1] Opening new SolrCore at /usr/home/hudson/hudson-slave/workspace/Lucene-Solr-Tests-trunk-java7/solr/build/solr-core/test/J0/./org.apache.solr.cloud.BasicDistributedZk2Test-controljetty-1355627544257/collection1/, dataDir=./org.apache.solr.cloud.BasicDistributedZk2Test-1355627541171/control/data/
[junit4:junit4]   2> 5338 T356 oasc.JmxMonitoredMap.<init> JMX monitoring is enabled. Adding Solr mbeans to JMX Server: com.sun.jmx.mbeanserver.JmxMBeanServer@22bb1eab
[junit4:junit4]   2> 5339 T356 oasc.SolrCore.initDirectoryFactory solr.NRTCachingDirectoryFactory
[junit4:junit4]   2> 5347 T356 oasc.CachingDirectoryFactory.get return new directory for /usr/home/hudson/hudson-slave/workspace/Lucene-Solr-Tests-trunk-java7/solr/build/solr-core/test/J0/./org.apache.solr.cloud.BasicDistributedZk2Test-1355627541171/control/data forceNew:false
[junit4:junit4]   2> 5348 T356 oasc.CachingDirectoryFactory.close Releasing directory:/usr/home/hudson/hudson-slave/workspace/Lucene-Solr-Tests-trunk-java7/solr/build/solr-core/test/J0/./org.apache.solr.cloud.BasicDistributedZk2Test-1355627541171/control/data
[junit4:junit4]   2> 5348 T356 oasc.SolrCore.getNewIndexDir New index directory detected: old=null new=./org.apache.solr.cloud.BasicDistributedZk2Test-1355627541171/control/data/index/
[junit4:junit4]   2> 5349 T356 oasc.SolrCore.initIndex WARNING [collection1] Solr index directory './org.apache.solr.cloud.BasicDistributedZk2Test-1355627541171/control/data/index' doesn't exist. Creating new index...
[junit4:junit4]   2> 5350 T356 oasc.CachingDirectoryFactory.get return new directory for /usr/home/hudson/hudson-slave/workspace/Lucene-Solr-Tests-trunk-java7/solr/build/solr-core/test/J0/./org.apache.solr.cloud.BasicDistributedZk2Test-1355627541171/control/data/index forceNew:false
[junit4:junit4]   2> 5362 T356 oasc.SolrDeletionPolicy.onCommit SolrDeletionPolicy.onCommit: commits:num=1
[junit4:junit4]   2> 		commit{dir=RateLimitedDirectoryWrapper(NRTCachingDirectory(org.apache.lucene.store.NIOFSDirectory@/usr/home/hudson/hudson-slave/workspace/Lucene-Solr-Tests-trunk-java7/solr/build/solr-core/test/J0/org.apache.solr.cloud.BasicDistributedZk2Test-1355627541171/control/data/index lockFactory=org.apache.lucene.store.NativeFSLockFactory@446487d7; maxCacheMB=48.0 maxMergeSizeMB=4.0)),segFN=segments_1,generation=1,filenames=[segments_1]
[junit4:junit4]   2> 5363 T356 oasc.SolrDeletionPolicy.updateCommits newest commit = 1[segments_1]
[junit4:junit4]   2> 5387 T356 oasc.CachingDirectoryFactory.close Releasing directory:/usr/home/hudson/hudson-slave/workspace/Lucene-Solr-Tests-trunk-java7/solr/build/solr-core/test/J0/./org.apache.solr.cloud.BasicDistributedZk2Test-1355627541171/control/data/index
[junit4:junit4]   2> 5388 T356 oasc.SolrCore.initWriters created xml: solr.XMLResponseWriter
[junit4:junit4]   2> 5390 T356 oasup.UpdateRequestProcessorChain.init inserting DistributedUpdateProcessorFactory into updateRequestProcessorChain "dedupe"
[junit4:junit4]   2> 5390 T356 oasup.UpdateRequestProcessorChain.init inserting DistributedUpdateProcessorFactory into updateRequestProcessorChain "dedupe-allfields"
[junit4:junit4]   2> 5391 T356 oasup.UpdateRequestProcessorChain.init inserting DistributedUpdateProcessorFactory into updateRequestProcessorChain "stored_sig"
[junit4:junit4]   2> 5391 T356 oasup.UpdateRequestProcessorChain.init inserting DistributedUpdateProcessorFactory into updateRequestProcessorChain "uniq-fields"
[junit4:junit4]   2> 5392 T356 oasup.UpdateRequestProcessorChain.init inserting DistributedUpdateProcessorFactory into updateRequestProcessorChain "distrib-dup-test-chain-implicit"
[junit4:junit4]   2> 5393 T356 oasc.RequestHandlers.initHandlersFromConfig adding lazy requestHandler: solr.ReplicationHandler
[junit4:junit4]   2> 5393 T356 oasc.RequestHandlers.initHandlersFromConfig created /replication: solr.ReplicationHandler
[junit4:junit4]   2> 5395 T356 oasc.RequestHandlers.initHandlersFromConfig created standard: solr.StandardRequestHandler
[junit4:junit4]   2> 5396 T356 oasc.RequestHandlers.initHandlersFromConfig created /get: solr.RealTimeGetHandler
[junit4:junit4]   2> 5397 T356 oasc.RequestHandlers.initHandlersFromConfig created dismax: solr.SearchHandler
[junit4:junit4]   2> 5399 T356 oasc.RequestHandlers.initHandlersFromConfig created mock: org.apache.solr.core.MockQuerySenderListenerReqHandler
[junit4:junit4]   2> 5399 T356 oasc.RequestHandlers.initHandlersFromConfig created /admin/: org.apache.solr.handler.admin.AdminHandlers
[junit4:junit4]   2> 5400 T356 oasc.RequestHandlers.initHandlersFromConfig created defaults: solr.StandardRequestHandler
[junit4:junit4]   2> 5401 T356 oasc.RequestHandlers.initHandlersFromConfig adding lazy requestHandler: solr.StandardRequestHandler
[junit4:junit4]   2> 5401 T356 oasc.RequestHandlers.initHandlersFromConfig created lazy: solr.StandardRequestHandler
[junit4:junit4]   2> 5403 T356 oasc.RequestHandlers.initHandlersFromConfig created /update: solr.UpdateRequestHandler
[junit4:junit4]   2> 5404 T356 oasc.RequestHandlers.initHandlersFromConfig created /terms: org.apache.solr.handler.component.SearchHandler
[junit4:junit4]   2> 5405 T356 oasc.RequestHandlers.initHandlersFromConfig created spellCheckCompRH: org.apache.solr.handler.component.SearchHandler
[junit4:junit4]   2> 5408 T356 oasc.RequestHandlers.initHandlersFromConfig created spellCheckCompRH_Direct: org.apache.solr.handler.component.SearchHandler
[junit4:junit4]   2> 5409 T356 oasc.RequestHandlers.initHandlersFromConfig created spellCheckWithWordbreak: org.apache.solr.handler.component.SearchHandler
[junit4:junit4]   2> 5410 T356 oasc.RequestHandlers.initHandlersFromConfig created spellCheckWithWordbreak_Direct: org.apache.solr.handler.component.SearchHandler
[junit4:junit4]   2> 5412 T356 oasc.RequestHandlers.initHandlersFromConfig created spellCheckCompRH1: org.apache.solr.handler.component.SearchHandler
[junit4:junit4]   2> 5413 T356 oasc.RequestHandlers.initHandlersFromConfig created mltrh: org.apache.solr.handler.component.SearchHandler
[junit4:junit4]   2> 5414 T356 oasc.RequestHandlers.initHandlersFromConfig created tvrh: org.apache.solr.handler.component.SearchHandler
[junit4:junit4]   2> 5416 T356 oasc.RequestHandlers.initHandlersFromConfig created /mlt: solr.MoreLikeThisHandler
[junit4:junit4]   2> 5417 T356 oasc.RequestHandlers.initHandlersFromConfig created /debug/dump: solr.DumpRequestHandler
[junit4:junit4]   2> 5432 T356 oashl.XMLLoader.init xsltCacheLifetimeSeconds=60
[junit4:junit4]   2> 5444 T356 oasc.SolrCore.initDeprecatedSupport WARNING solrconfig.xml uses deprecated <admin/gettableFiles>, Please update your config to use the ShowFileRequestHandler.
[junit4:junit4]   2> 5447 T356 oasc.SolrCore.initDeprecatedSupport WARNING adding ShowFileRequestHandler with hidden files: [SCHEMA.XML, OLD_SYNONYMS.TXT, STOPWORDS.TXT, PROTWORDS.TXT, OPEN-EXCHANGE-RATES.JSON, SYNONYMS.TXT, CURRENCY.XML, MAPPING-ISOLATIN1ACCENT.TXT]
[junit4:junit4]   2> 5453 T356 oasc.CachingDirectoryFactory.close Releasing directory:/usr/home/hudson/hudson-slave/workspace/Lucene-Solr-Tests-trunk-java7/solr/build/solr-core/test/J0/./org.apache.solr.cloud.BasicDistributedZk2Test-1355627541171/control/data
[junit4:junit4]   2> 5455 T356 oass.SolrIndexSearcher.<init> Opening Searcher@a354969 main
[junit4:junit4]   2> 5466 T356 oasu.CommitTracker.<init> Hard AutoCommit: disabled
[junit4:junit4]   2> 5466 T356 oasu.CommitTracker.<init> Soft AutoCommit: disabled
[junit4:junit4]   2> 5467 T356 oashc.SpellCheckComponent.inform Initializing spell checkers
[junit4:junit4]   2> 5512 T356 oass.DirectSolrSpellChecker.init init: {name=direct,classname=DirectSolrSpellChecker,field=lowerfilt,minQueryLength=3}
[junit4:junit4]   2> 5863 T357 oasc.SolrCore.registerSearcher [collection1] Registered new searcher Searcher@a354969 main{StandardDirectoryReader(segments_1:1)}
[junit4:junit4]   2> 5869 T356 oasc.ZkController.publish publishing core=collection1 state=down
[junit4:junit4]   2> 5870 T356 oasc.ZkController.publish numShards not found on descriptor - reading it from system property
[junit4:junit4]   2> 5871 T338 oazs.PrepRequestProcessor.pRequest Got user-level KeeperException when processing sessionid:0x13ba1b2b4c60003 type:create cxid:0x59 zxid:0x29 txntype:-1 reqpath:n/a Error Path:/solr/overseer/queue Error:KeeperErrorCode = NoNode for /solr/overseer/queue
[junit4:junit4]   2> 5912 T354 oascc.ZkStateReader.updateClusterState Updating cloud state from ZooKeeper... 
[junit4:junit4]   2> 5914 T354 oasc.Overseer$ClusterStateUpdater.updateState Update state numShards=1 message={
[junit4:junit4]   2> 	  "operation":"state",
[junit4:junit4]   2> 	  "numShards":"1",
[junit4:junit4]   2> 	  "shard":null,
[junit4:junit4]   2> 	  "roles":null,
[junit4:junit4]   2> 	  "state":"down",
[junit4:junit4]   2> 	  "core":"collection1",
[junit4:junit4]   2> 	  "collection":"control_collection",
[junit4:junit4]   2> 	  "node_name":"127.0.0.1:25223_",
[junit4:junit4]   2> 	  "base_url":"http://127.0.0.1:25223"}
[junit4:junit4]   2> 5915 T354 oasc.Overseer$ClusterStateUpdater.createCollection Create collection control_collection with numShards 1
[junit4:junit4]   2> 5951 T354 oasc.Overseer$ClusterStateUpdater.updateState Assigning new node to shard shard=shard1
[junit4:junit4]   2> 5952 T338 oazs.PrepRequestProcessor.pRequest Got user-level KeeperException when processing sessionid:0x13ba1b2b4c60003 type:create cxid:0x61 zxid:0x2c txntype:-1 reqpath:n/a Error Path:/solr/overseer/queue-work Error:KeeperErrorCode = NoNode for /solr/overseer/queue-work
[junit4:junit4]   2> 6158 T353 oascc.ZkStateReader$2.process A cluster state change: WatchedEvent state:SyncConnected type:NodeDataChanged path:/clusterstate.json, has occurred - updating... (live nodes size: 1)
[junit4:junit4]   2> 6398 T356 oasc.CoreContainer.registerCore registering core: collection1
[junit4:junit4]   2> 6399 T356 oasc.ZkController.register Register shard - core:collection1 address:http://127.0.0.1:25223 shardId:shard1
[junit4:junit4]   2> 6409 T356 oascsi.HttpClientUtil.createClient Creating new http client, config:maxConnections=10000&maxConnectionsPerHost=20&connTimeout=30000&socketTimeout=30000&retry=false
[junit4:junit4]   2> 6427 T356 oascc.SolrZkClient.makePath makePath: /collections/control_collection/leader_elect/shard1/election
[junit4:junit4]   2> 6525 T338 oazs.PrepRequestProcessor.pRequest Got user-level KeeperException when processing sessionid:0x13ba1b2b4c60003 type:delete cxid:0x7b zxid:0x36 txntype:-1 reqpath:n/a Error Path:/solr/collections/control_collection/leaders Error:KeeperErrorCode = NoNode for /solr/collections/control_collection/leaders
[junit4:junit4]   2> 6537 T356 oasc.ShardLeaderElectionContext.runLeaderProcess Running the leader process.
[junit4:junit4]   2> 6538 T338 oazs.PrepRequestProcessor.pRequest Got user-level KeeperException when processing sessionid:0x13ba1b2b4c60003 type:create cxid:0x7c zxid:0x37 txntype:-1 reqpath:n/a Error Path:/solr/overseer Error:KeeperErrorCode = NodeExists for /solr/overseer
[junit4:junit4]   2> 6558 T356 oasc.ShardLeaderElectionContext.waitForReplicasToComeUp Enough replicas found to continue.
[junit4:junit4]   2> 6558 T356 oasc.ShardLeaderElectionContext.runLeaderProcess I may be the new leader - try and sync
[junit4:junit4]   2> 6563 T356 oasc.SyncStrategy.sync Sync replicas to http://127.0.0.1:25223/collection1/
[junit4:junit4]   2> 6564 T356 oasc.SyncStrategy.syncReplicas Sync Success - now sync replicas to me
[junit4:junit4]   2> 6565 T356 oasc.SyncStrategy.syncToMe http://127.0.0.1:25223/collection1/ has no replicas
[junit4:junit4]   2> 6565 T356 oasc.ShardLeaderElectionContext.runLeaderProcess I am the new leader: http://127.0.0.1:25223/collection1/
[junit4:junit4]   2> 6565 T356 oascc.SolrZkClient.makePath makePath: /collections/control_collection/leaders/shard1
[junit4:junit4]   2> 6588 T338 oazs.PrepRequestProcessor.pRequest Got user-level KeeperException when processing sessionid:0x13ba1b2b4c60003 type:create cxid:0x86 zxid:0x3b txntype:-1 reqpath:n/a Error Path:/solr/overseer Error:KeeperErrorCode = NodeExists for /solr/overseer
[junit4:junit4]   2> 6667 T354 oascc.ZkStateReader.updateClusterState Updating cloud state from ZooKeeper... 
[junit4:junit4]   2> 6733 T353 oascc.ZkStateReader$2.process A cluster state change: WatchedEvent state:SyncConnected type:NodeDataChanged path:/clusterstate.json, has occurred - updating... (live nodes size: 1)
[junit4:junit4]   2> 6794 T356 oasc.ZkController.register We are http://127.0.0.1:25223/collection1/ and leader is http://127.0.0.1:25223/collection1/
[junit4:junit4]   2> 6801 T356 oasc.ZkController.register No LogReplay needed for core=collection1 baseURL=http://127.0.0.1:25223
[junit4:junit4]   2> 6801 T356 oasc.ZkController.checkRecovery I am the leader, no recovery necessary
[junit4:junit4]   2> 6802 T356 oasc.ZkController.publish publishing core=collection1 state=active
[junit4:junit4]   2> 6802 T356 oasc.ZkController.publish numShards not found on descriptor - reading it from system property
[junit4:junit4]   2> 6806 T356 oascc.ZkStateReader.updateClusterState Updating cloud state from ZooKeeper... 
[junit4:junit4]   2> 6808 T331 oass.SolrDispatchFilter.init user.dir=/usr/home/hudson/hudson-slave/workspace/Lucene-Solr-Tests-trunk-java7/solr/build/solr-core/test/J0
[junit4:junit4]   2> 6808 T331 oass.SolrDispatchFilter.init SolrDispatchFilter.init() done
[junit4:junit4]   2> 6809 T331 oascsi.HttpClientUtil.createClient Creating new http client, config:maxConnections=128&maxConnectionsPerHost=32&followRedirects=false
[junit4:junit4]   2> 6824 T331 oascsi.HttpClientUtil.createClient Creating new http client, config:
[junit4:junit4]   2> 6888 T331 oaz.ZooKeeper.<init> Initiating client connection, connectString=127.0.0.1:15950/solr sessionTimeout=10000 watcher=org.apache.solr.common.cloud.ConnectionManager@5ad4c945
[junit4:junit4]   2> 6890 T331 oascc.ConnectionManager.waitForConnected Waiting for client to connect to ZooKeeper
[junit4:junit4]   2> 6890 T358 oaz.ClientCnxn$SendThread.logStartConnect Opening socket connection to server localhost/127.0.0.1:15950. Will not attempt to authenticate using SASL (access denied ("javax.security.auth.AuthPermission" "getLoginConfiguration"))
[junit4:junit4]   2> 6891 T358 oaz.ClientCnxn$SendThread.primeConnection Socket connection established to localhost/127.0.0.1:15950, initiating session
[junit4:junit4]   2> 6891 T333 oazs.NIOServerCnxnFactory.run Accepted socket connection from /140.211.11.196:16986
[junit4:junit4]   2> 6892 T333 oazs.ZooKeeperServer.processConnectRequest Client attempting to establish new session at /140.211.11.196:16986
[junit4:junit4]   2> 6909 T335 oazs.ZooKeeperServer.finishSessionInit Established session 0x13ba1b2b4c60004 with negotiated timeout 10000 for client /140.211.11.196:16986
[junit4:junit4]   2> 6910 T358 oaz.ClientCnxn$SendThread.onConnected Session establishment complete on server localhost/127.0.0.1:15950, sessionid = 0x13ba1b2b4c60004, negotiated timeout = 10000
[junit4:junit4]   2> 6910 T359 oascc.ConnectionManager.process Watcher org.apache.solr.common.cloud.ConnectionManager@5ad4c945 name:ZooKeeperConnection Watcher:127.0.0.1:15950/solr got event WatchedEvent state:SyncConnected type:None path:null path:null type:None
[junit4:junit4]   2> 6910 T331 oascc.ConnectionManager.waitForConnected Client is connected to ZooKeeper
[junit4:junit4]   2> 6912 T331 oascc.ZkStateReader.createClusterStateWatchersAndUpdate Updating cluster state from ZooKeeper... 
[junit4:junit4]   2> 6917 T331 oasc.ChaosMonkey.monkeyLog monkey: init - expire sessions:true cause connection loss:true
[junit4:junit4]   2> 7180 T331 oejs.Server.doStart jetty-8.1.8.v20121106
[junit4:junit4]   2> 7183 T331 oejs.AbstractConnector.doStart Started SocketConnector@127.0.0.1:59076
[junit4:junit4]   2> 7183 T331 oasc.SolrResourceLoader.locateSolrHome JNDI not configured for solr (NoInitialContextEx)
[junit4:junit4]   2> 7184 T331 oasc.SolrResourceLoader.locateSolrHome using system property solr.solr.home: /usr/home/hudson/hudson-slave/workspace/Lucene-Solr-Tests-trunk-java7/solr/build/solr-core/test/J0/./org.apache.solr.cloud.BasicDistributedZk2Test-jetty1-1355627548081
[junit4:junit4]   2> 7184 T331 oasc.SolrResourceLoader.<init> new SolrResourceLoader for deduced Solr Home: '/usr/home/hudson/hudson-slave/workspace/Lucene-Solr-Tests-trunk-java7/solr/build/solr-core/test/J0/./org.apache.solr.cloud.BasicDistributedZk2Test-jetty1-1355627548081/'
[junit4:junit4]   2> 7214 T331 oass.SolrDispatchFilter.init SolrDispatchFilter.init()
[junit4:junit4]   2> 7215 T331 oasc.SolrResourceLoader.locateSolrHome JNDI not configured for solr (NoInitialContextEx)
[junit4:junit4]   2> 7215 T331 oasc.SolrResourceLoader.locateSolrHome using system property solr.solr.home: /usr/home/hudson/hudson-slave/workspace/Lucene-Solr-Tests-trunk-java7/solr/build/solr-core/test/J0/./org.apache.solr.cloud.BasicDistributedZk2Test-jetty1-1355627548081
[junit4:junit4]   2> 7216 T331 oasc.CoreContainer$Initializer.initialize looking for solr.xml: /usr/home/hudson/hudson-slave/workspace/Lucene-Solr-Tests-trunk-java7/solr/build/solr-core/test/J0/./org.apache.solr.cloud.BasicDistributedZk2Test-jetty1-1355627548081/solr.xml
[junit4:junit4]   2> 7216 T331 oasc.CoreContainer.<init> New CoreContainer 1361998847
[junit4:junit4]   2> 7217 T331 oasc.CoreContainer.load Loading CoreContainer using Solr Home: '/usr/home/hudson/hudson-slave/workspace/Lucene-Solr-Tests-trunk-java7/solr/build/solr-core/test/J0/./org.apache.solr.cloud.BasicDistributedZk2Test-jetty1-1355627548081/'
[junit4:junit4]   2> 7217 T331 oasc.SolrResourceLoader.<init> new SolrResourceLoader for directory: '/usr/home/hudson/hudson-slave/workspace/Lucene-Solr-Tests-trunk-java7/solr/build/solr-core/test/J0/./org.apache.solr.cloud.BasicDistributedZk2Test-jetty1-1355627548081/'
[junit4:junit4]   2> 7244 T331 oasc.CoreContainer.load Registering Log Listener
[junit4:junit4]   2> 7266 T354 oascc.ZkStateReader.updateClusterState Updating cloud state from ZooKeeper... 
[junit4:junit4]   2> 7268 T354 oasc.Overseer$ClusterStateUpdater.updateState Update state numShards=1 message={
[junit4:junit4]   2> 	  "operation":"state",
[junit4:junit4]   2> 	  "numShards":"1",
[junit4:junit4]   2> 	  "shard":"shard1",
[junit4:junit4]   2> 	  "roles":null,
[junit4:junit4]   2> 	  "state":"active",
[junit4:junit4]   2> 	  "core":"collection1",
[junit4:junit4]   2> 	  "collection":"control_collection",
[junit4:junit4]   2> 	  "node_name":"127.0.0.1:25223_",
[junit4:junit4]   2> 	  "base_url":"http://127.0.0.1:25223"}
[junit4:junit4]   2> 7289 T331 oasc.CoreContainer.initZooKeeper Zookeeper client=127.0.0.1:15950/solr
[junit4:junit4]   2> 7290 T331 oasc.ZkController.checkChrootPath zkHost includes chroot
[junit4:junit4]   2> 7290 T331 oaz.ZooKeeper.<init> Initiating client connection, connectString=127.0.0.1:15950 sessionTimeout=60000 watcher=org.apache.solr.common.cloud.ConnectionManager@63baf331
[junit4:junit4]   2> 7291 T331 oascc.ConnectionManager.waitForConnected Waiting for client to connect to ZooKeeper
[junit4:junit4]   2> 7292 T369 oaz.ClientCnxn$SendThread.logStartConnect Opening socket connection to server localhost/127.0.0.1:15950. Will not attempt to authenticate using SASL (access denied ("javax.security.auth.AuthPermission" "getLoginConfiguration"))
[junit4:junit4]   2> 7292 T369 oaz.ClientCnxn$SendThread.primeConnection Socket connection established to localhost/127.0.0.1:15950, initiating session
[junit4:junit4]   2> 7293 T333 oazs.NIOServerCnxnFactory.run Accepted socket connection from /140.211.11.196:36311
[junit4:junit4]   2> 7293 T333 oazs.ZooKeeperServer.processConnectRequest Client attempting to establish new session at /140.211.11.196:36311
[junit4:junit4]   2> 7296 T335 oazs.ZooKeeperServer.finishSessionInit Established session 0x13ba1b2b4c60005 with negotiated timeout 20000 for client /140.211.11.196:36311
[junit4:junit4]   2> 7296 T369 oaz.ClientCnxn$SendThread.onConnected Session establishment complete on server localhost/127.0.0.1:15950, sessionid = 0x13ba1b2b4c60005, negotiated timeout = 20000
[junit4:junit4]   2> 7296 T370 oascc.ConnectionManager.process Watcher org.apache.solr.common.cloud.ConnectionManager@63baf331 name:ZooKeeperConnection Watcher:127.0.0.1:15950 got event WatchedEvent state:SyncConnected type:None path:null path:null type:None
[junit4:junit4]   2> 7297 T331 oascc.ConnectionManager.waitForConnected Client is connected to ZooKeeper
[junit4:junit4]   2> 7299 T353 oascc.ZkStateReader$2.process A cluster state change: WatchedEvent state:SyncConnected type:NodeDataChanged path:/clusterstate.json, has occurred - updating... (live nodes size: 1)
[junit4:junit4]   2> 7299 T359 oascc.ZkStateReader$2.process A cluster state change: WatchedEvent state:SyncConnected type:NodeDataChanged path:/clusterstate.json, has occurred - updating... (live nodes size: 1)
[junit4:junit4]   2> 7299 T338 oazs.PrepRequestProcessor.pRequest2Txn Processed session termination for sessionid: 0x13ba1b2b4c60005
[junit4:junit4]   2> 7320 T370 oaz.ClientCnxn$EventThread.run EventThread shut down
[junit4:junit4]   2> 7320 T333 oazs.NIOServerCnxn.closeSock Closed socket connection for client /140.211.11.196:36311 which had sessionid 0x13ba1b2b4c60005
[junit4:junit4]   2> 7320 T331 oaz.ZooKeeper.close Session: 0x13ba1b2b4c60005 closed
[junit4:junit4]   2> 7321 T331 oaz.ZooKeeper.<init> Initiating client connection, connectString=127.0.0.1:15950/solr sessionTimeout=8000 watcher=org.apache.solr.common.cloud.ConnectionManager@1929b95e
[junit4:junit4]   2> 7322 T331 oascc.ConnectionManager.waitForConnected Waiting for client to connect to ZooKeeper
[junit4:junit4]   2> 7323 T371 oaz.ClientCnxn$SendThread.logStartConnect Opening socket connection to server localhost/127.0.0.1:15950. Will not attempt to authenticate using SASL (access denied ("javax.security.auth.AuthPermission" "getLoginConfiguration"))
[junit4:junit4]   2> 7323 T371 oaz.ClientCnxn$SendThread.primeConnection Socket connection established to localhost/127.0.0.1:15950, initiating session
[junit4:junit4]   2> 7323 T333 oazs.NIOServerCnxnFactory.run Accepted socket connection from /140.211.11.196:16334
[junit4:junit4]   2> 7324 T333 oazs.ZooKeeperServer.processConnectRequest Client attempting to establish new session at /140.211.11.196:16334
[junit4:junit4]   2> 7326 T335 oazs.ZooKeeperServer.finishSessionInit Established session 0x13ba1b2b4c60006 with negotiated timeout 8000 for client /140.211.11.196:16334
[junit4:junit4]   2> 7326 T371 oaz.ClientCnxn$SendThread.onConnected Session establishment complete on server localhost/127.0.0.1:15950, sessionid = 0x13ba1b2b4c60006, negotiated timeout = 8000
[junit4:junit4]   2> 7326 T372 oascc.ConnectionManager.process Watcher org.apache.solr.common.cloud.ConnectionManager@1929b95e name:ZooKeeperConnection Watcher:127.0.0.1:15950/solr got event WatchedEvent state:SyncConnected type:None path:null path:null type:None
[junit4:junit4]   2> 7327 T331 oascc.ConnectionManager.waitForConnected Client is connected to ZooKeeper
[junit4:junit4]   2> 7329 T338 oazs.PrepRequestProcessor.pRequest Got user-level KeeperException when processing sessionid:0x13ba1b2b4c60006 type:create cxid:0x1 zxid:0x4d txntype:-1 reqpath:n/a Error Path:/solr/overseer Error:KeeperErrorCode = NodeExists for /solr/overseer
[junit4:junit4]   2> 7368 T338 oazs.PrepRequestProcessor.pRequest Got user-level KeeperException when processing sessionid:0x13ba1b2b4c60006 type:create cxid:0x2 zxid:0x4e txntype:-1 reqpath:n/a Error Path:/solr/overseer Error:KeeperErrorCode = NodeExists for /solr/overseer
[junit4:junit4]   2> 7373 T331 oasc.ZkController.createEphemeralLiveNode Register node as live in ZooKeeper:/live_nodes/127.0.0.1:59076_
[junit4:junit4]   2> 7374 T338 oazs.PrepRequestProcessor.pRequest Got user-level KeeperException when processing sessionid:0x13ba1b2b4c60006 type:delete cxid:0x4 zxid:0x4f txntype:-1 reqpath:n/a Error Path:/solr/live_nodes/127.0.0.1:59076_ Error:KeeperErrorCode = NoNode for /solr/live_nodes/127.0.0.1:59076_
[junit4:junit4]   2> 7391 T331 oascc.SolrZkClient.makePath makePath: /live_nodes/127.0.0.1:59076_
[junit4:junit4]   2> 7400 T353 oascc.ZkStateReader$3.process Updating live nodes... (2)
[junit4:junit4]   2> 7400 T359 oascc.ZkStateReader$3.process Updating live nodes... (2)
[junit4:junit4]   2> 7400 T359 oascc.ZkStateReader$2.process A cluster state change: WatchedEvent state:SyncConnected type:NodeChildrenChanged path:/live_nodes, has occurred - updating... (live nodes size: 2)
[junit4:junit4]   2> 7400 T353 oascc.ZkStateReader$2.process A cluster state change: WatchedEvent state:SyncConnected type:NodeChildrenChanged path:/live_nodes, has occurred - updating... (live nodes size: 2)
[junit4:junit4]   2> 7401 T331 oashc.HttpShardHandlerFactory.getParameter Setting socketTimeout to: 0
[junit4:junit4]   2> 7402 T331 oashc.HttpShardHandlerFactory.getParameter Setting urlScheme to: http://
[junit4:junit4]   2> 7402 T331 oashc.HttpShardHandlerFactory.getParameter Setting connTimeout to: 0
[junit4:junit4]   2> 7403 T331 oashc.HttpShardHandlerFactory.getParameter Setting maxConnectionsPerHost to: 20
[junit4:junit4]   2> 7403 T331 oashc.HttpShardHandlerFactory.getParameter Setting corePoolSize to: 0
[junit4:junit4]   2> 7404 T331 oashc.HttpShardHandlerFactory.getParameter Setting maximumPoolSize to: 2147483647
[junit4:junit4]   2> 7404 T331 oashc.HttpShardHandlerFactory.getParameter Setting maxThreadIdleTime to: 5
[junit4:junit4]   2> 7404 T331 oashc.HttpShardHandlerFactory.getParameter Setting sizeOfQueue to: -1
[junit4:junit4]   2> 7405 T331 oashc.HttpShardHandlerFactory.getParameter Setting fairnessPolicy to: false
[junit4:junit4]   2> 7405 T331 oascsi.HttpClientUtil.createClient Creating new http client, config:maxConnectionsPerHost=20&maxConnections=10000&socketTimeout=0&connTimeout=0&retry=false
[junit4:junit4]   2> 7437 T331 oascc.ZkStateReader.createClusterStateWatchersAndUpdate Updating cluster state from ZooKeeper... 
[junit4:junit4]   2> 7479 T373 oasc.CoreContainer.create Creating SolrCore 'collection1' using instanceDir: /usr/home/hudson/hudson-slave/workspace/Lucene-Solr-Tests-trunk-java7/solr/build/solr-core/test/J0/./org.apache.solr.cloud.BasicDistributedZk2Test-jetty1-1355627548081/collection1
[junit4:junit4]   2> 7480 T373 oasc.ZkController.createCollectionZkNode Check for collection zkNode:collection1
[junit4:junit4]   2> 7481 T373 oasc.ZkController.createCollectionZkNode Collection zkNode exists
[junit4:junit4]   2> 7481 T373 oasc.ZkController.readConfigName Load collection config from:/collections/collection1
[junit4:junit4]   2> 7483 T373 oasc.SolrResourceLoader.<init> new SolrResourceLoader for directory: '/usr/home/hudson/hudson-slave/workspace/Lucene-Solr-Tests-trunk-java7/solr/build/solr-core/test/J0/./org.apache.solr.cloud.BasicDistributedZk2Test-jetty1-1355627548081/collection1/'
[junit4:junit4]   2> 7485 T373 oasc.SolrResourceLoader.replaceClassLoader Adding 'file:/usr/home/hudson/hudson-slave/workspace/Lucene-Solr-Tests-trunk-java7/solr/build/solr-core/test/J0/org.apache.solr.cloud.BasicDistributedZk2Test-jetty1-1355627548081/collection1/lib/README' to classloader
[junit4:junit4]   2> 7485 T373 oasc.SolrResourceLoader.replaceClassLoader Adding 'file:/usr/home/hudson/hudson-slave/workspace/Lucene-Solr-Tests-trunk-java7/solr/build/solr-core/test/J0/org.apache.solr.cloud.BasicDistributedZk2Test-jetty1-1355627548081/collection1/lib/classes/' to classloader
[junit4:junit4]   2> 7572 T373 oasc.SolrConfig.<init> Using Lucene MatchVersion: LUCENE_50
[junit4:junit4]   2> 7687 T373 oasc.SolrConfig.<init> Loaded SolrConfig: solrconfig.xml
[junit4:junit4]   2> 7788 T373 oass.IndexSchema.readSchema Reading Solr Schema
[junit4:junit4]   2> 7802 T373 oass.IndexSchema.readSchema Schema name=test
[junit4:junit4]   2> 8692 T373 oass.OpenExchangeRatesOrgProvider.init Initialized with rates=open-exchange-rates.json, refreshInterval=1440.
[junit4:junit4]   2> 8705 T373 oass.IndexSchema.readSchema default search field in schema is text
[junit4:junit4]   2> 8710 T373 oass.IndexSchema.readSchema unique key field: id
[junit4:junit4]   2> 8748 T373 oass.FileExchangeRateProvider.reload Reloading exchange rates from file currency.xml
[junit4:junit4]   2> 8754 T373 oass.FileExchangeRateProvider.reload Reloading exchange rates from file currency.xml
[junit4:junit4]   2> 8779 T373 oass.OpenExchangeRatesOrgProvider.reload Reloading exchange rates from open-exchange-rates.json
[junit4:junit4]   2> 8781 T373 oass.OpenExchangeRatesOrgProvider.reload Reloading exchange rates from open-exchange-rates.json
[junit4:junit4]   2> 8783 T373 oasc.SolrCore.<init> [collection1] Opening new SolrCore at /usr/home/hudson/hudson-slave/workspace/Lucene-Solr-Tests-trunk-java7/solr/build/solr-core/test/J0/./org.apache.solr.cloud.BasicDistributedZk2Test-jetty1-1355627548081/collection1/, dataDir=./org.apache.solr.cloud.BasicDistributedZk2Test-1355627541171/jetty1/
[junit4:junit4]   2> 8783 T373 oasc.JmxMonitoredMap.<init> JMX monitoring is enabled. Adding Solr mbeans to JMX Server: com.sun.jmx.mbeanserver.JmxMBeanServer@22bb1eab
[junit4:junit4]   2> 8784 T373 oasc.SolrCore.initDirectoryFactory solr.NRTCachingDirectoryFactory
[junit4:junit4]   2> 8790 T373 oasc.CachingDirectoryFactory.get return new directory for /usr/home/hudson/hudson-slave/workspace/Lucene-Solr-Tests-trunk-java7/solr/build/solr-core/test/J0/./org.apache.solr.cloud.BasicDistributedZk2Test-1355627541171/jetty1 forceNew:false
[junit4:junit4]   2> 8791 T373 oasc.CachingDirectoryFactory.close Releasing directory:/usr/home/hudson/hudson-slave/workspace/Lucene-Solr-Tests-trunk-java7/solr/build/solr-core/test/J0/./org.apache.solr.cloud.BasicDistributedZk2Test-1355627541171/jetty1
[junit4:junit4]   2> 8792 T373 oasc.SolrCore.getNewIndexDir New index directory detected: old=null new=./org.apache.solr.cloud.BasicDistributedZk2Test-1355627541171/jetty1/index/
[junit4:junit4]   2> 8792 T373 oasc.SolrCore.initIndex WARNING [collection1] Solr index directory './org.apache.solr.cloud.BasicDistributedZk2Test-1355627541171/jetty1/index' doesn't exist. Creating new index...
[junit4:junit4]   2> 8793 T373 oasc.CachingDirectoryFactory.get return new directory for /usr/home/hudson/hudson-slave/workspace/Lucene-Solr-Tests-trunk-java7/solr/build/solr-core/test/J0/./org.apache.solr.cloud.BasicDistributedZk2Test-1355627541171/jetty1/index forceNew:false
[junit4:junit4]   2> 8814 T373 oasc.SolrDeletionPolicy.onCommit SolrDeletionPolicy.onCommit: commits:num=1
[junit4:junit4]   2> 		commit{dir=RateLimitedDirectoryWrapper(NRTCachingDirectory(org.apache.lucene.store.NIOFSDirectory@/usr/home/hudson/hudson-slave/workspace/Lucene-Solr-Tests-trunk-java7/solr/build/solr-core/test/J0/org.apache.solr.cloud.BasicDistributedZk2Test-1355627541171/jetty1/index lockFactory=org.apache.lucene.store.NativeFSLockFactory@59f66867; maxCacheMB=48.0 maxMergeSizeMB=4.0)),segFN=segments_1,generation=1,filenames=[segments_1]
[junit4:junit4]   2> 8815 T373 oasc.SolrDeletionPolicy.updateCommits newest commit = 1[segments_1]
[junit4:junit4]   2> 8836 T373 oasc.CachingDirectoryFactory.close Releasing directory:/usr/home/hudson/hudson-slave/workspace/Lucene-Solr-Tests-trunk-java7/solr/build/solr-core/test/J0/./org.apache.solr.cloud.BasicDistributedZk2Test-1355627541171/jetty1/index
[junit4:junit4]   2> 8837 T373 oasc.SolrCore.initWriters created xml: solr.XMLResponseWriter
[junit4:junit4]   2> 8839 T373 oasup.UpdateRequestProcessorChain.init inserting DistributedUpdateProcessorFactory into updateRequestProcessorChain "dedupe"
[junit4:junit4]   2> 8840 T373 oasup.UpdateRequestProcessorChain.init inserting DistributedUpdateProcessorFactory into updateRequestProcessorChain "dedupe-allfields"
[junit4:junit4]   2> 8840 T373 oasup.UpdateRequestProcessorChain.init inserting DistributedUpdateProcessorFactory into updateRequestProcessorChain "stored_sig"
[junit4:junit4]   2> 8841 T373 oasup.UpdateRequestProcessorChain.init inserting DistributedUpdateProcessorFactory into updateRequestProcessorChain "uniq-fields"
[junit4:junit4]   2> 8842 T373 oasup.UpdateRequestProcessorChain.init inserting DistributedUpdateProcessorFactory into updateRequestProcessorChain "distrib-dup-test-chain-implicit"
[junit4:junit4]   2> 8842 T373 oasc.RequestHandlers.initHandlersFromConfig adding lazy requestHandler: solr.ReplicationHandler
[junit4:junit4]   2> 8843 T373 oasc.RequestHandlers.initHandlersFromConfig created /replication: solr.ReplicationHandler
[junit4:junit4]   2> 8844 T373 oasc.RequestHandlers.initHandlersFromConfig created standard: solr.StandardRequestHandler
[junit4:junit4]   2> 8846 T373 oasc.RequestHandlers.initHandlersFromConfig created /get: solr.RealTimeGetHandler
[junit4:junit4]   2> 8847 T373 oasc.RequestHandlers.initHandlersFromConfig created dismax: solr.SearchHandler
[junit4:junit4]   2> 8849 T373 oasc.RequestHandlers.initHandlersFromConfig created mock: org.apache.solr.core.MockQuerySenderListenerReqHandler
[junit4:junit4]   2> 8849 T373 oasc.RequestHandlers.initHandlersFromConfig created /admin/: org.apache.solr.handler.admin.AdminHandlers
[junit4:junit4]   2> 8851 T373 oasc.RequestHandlers.initHandlersFromConfig created defaults: solr.StandardRequestHandler
[junit4:junit4]   2> 8851 T373 oasc.RequestHandlers.initHandlersFromConfig adding lazy requestHandler: solr.StandardRequestHandler
[junit4:junit4]   2> 8852 T373 oasc.RequestHandlers.initHandlersFromConfig created lazy: solr.StandardRequestHandler
[junit4:junit4]   2> 8853 T373 oasc.RequestHandlers.initHandlersFromConfig created /update: solr.UpdateRequestHandler
[junit4:junit4]   2> 8855 T373 oasc.RequestHandlers.initHandlersFromConfig created /terms: org.apache.solr.handler.component.SearchHandler
[junit4:junit4]   2> 8856 T373 oasc.RequestHandlers.initHandlersFromConfig created spellCheckCompRH: org.apache.solr.handler.component.SearchHandler
[junit4:junit4]   2> 8858 T373 oasc.RequestHandlers.initHandlersFromConfig created spellCheckCompRH_Direct: org.apache.solr.handler.component.SearchHandler
[junit4:junit4]   2> 8859 T373 oasc.RequestHandlers.initHandlersFromConfig created spellCheckWithWordbreak: org.apache.solr.handler.component.SearchHandler
[junit4:junit4]   2> 8860 T373 oasc.RequestHandlers.initHandlersFromConfig created spellCheckWithWordbreak_Direct: org.apache.solr.handler.component.SearchHandler
[junit4:junit4]   2> 8862 T373 oasc.RequestHandlers.initHandlersFromConfig created spellCheckCompRH1: org.apache.solr.handler.component.SearchHandler
[junit4:junit4]   2> 8863 T373 oasc.RequestHandlers.initHandlersFromConfig created mltrh: org.apache.solr.handler.component.SearchHandler
[junit4:junit4]   2> 8865 T373 oasc.RequestHandlers.initHandlersFromConfig created tvrh: org.apache.solr.handler.component.SearchHandler
[junit4:junit4]   2> 8866 T373 oasc.RequestHandlers.initHandlersFromConfig created /mlt: solr.MoreLikeThisHandler
[junit4:junit4]   2> 8868 T373 oasc.RequestHandlers.initHandlersFromConfig created /debug/dump: solr.DumpRequestHandler
[junit4:junit4]   2> 8917 T373 oashl.XMLLoader.init xsltCacheLifetimeSeconds=60
[junit4:junit4]   2> 8923 T373 oasc.SolrCore.initDeprecatedSupport WARNING solrconfig.xml uses deprecated <admin/gettableFiles>, Please update your config to use the ShowFileRequestHandler.
[junit4:junit4]   2> 8925 T373 oasc.SolrCore.initDeprecatedSupport WARNING adding ShowFileRequestHandler with hidden files: [SCHEMA.XML, OLD_SYNONYMS.TXT, STOPWORDS.TXT, PROTWORDS.TXT, OPEN-EXCHANGE-RATES.JSON, SYNONYMS.TXT, CURRENCY.XML, MAPPING-ISOLATIN1ACCENT.TXT]
[junit4:junit4]   2> 8929 T373 oasc.CachingDirectoryFactory.close Releasing directory:/usr/home/hudson/hudson-slave/workspace/Lucene-Solr-Tests-trunk-java7/solr/build/solr-core/test/J0/./org.apache.solr.cloud.BasicDistributedZk2Test-1355627541171/jetty1
[junit4:junit4]   2> 8931 T373 oass.SolrIndexSearcher.<init> Opening Searcher@11228738 main
[junit4:junit4]   2> 8932 T373 oasu.CommitTracker.<init> Hard AutoCommit: disabled
[junit4:junit4]   2> 8932 T373 oasu.CommitTracker.<init> Soft AutoCommit: disabled
[junit4:junit4]   2> 8933 T373 oashc.SpellCheckComponent.inform Initializing spell checkers
[junit4:junit4]   2> 8947 T373 oass.DirectSolrSpellChecker.init init: {name=direct,classname=DirectSolrSpellChecker,field=lowerfilt,minQueryLength=3}
[junit4:junit4]   2> 10175 T374 oasc.SolrCore.registerSearcher [collection1] Registered new searcher Searcher@11228738 main{StandardDirectoryReader(segments_1:1)}
[junit4:junit4]   2> 10186 T373 oasc.ZkController.publish publishing core=collection1 state=down
[junit4:junit4]   2> 10187 T373 oasc.ZkController.publish numShards not found on descriptor - reading it from system property
[junit4:junit4]   2> 10348 T354 oascc.ZkStateReader.updateClusterState Updating cloud state from ZooKeeper... 
[junit4:junit4]   2> 10350 T354 oasc.Overseer$ClusterStateUpdater.updateState Update state numShards=2 message={
[junit4:junit4]   2> 	  "operation":"state",
[junit4:junit4]   2> 	  "numShards":"2",
[junit4:junit4]   2> 	  "shard":null,
[junit4:junit4]   2> 	  "roles":null,
[junit4:junit4]   2> 	  "state":"down",
[junit4:junit4]   2> 	  "core":"collection1",
[junit4:junit4]   2> 	  "collection":"collection1",
[junit4:junit4]   2> 	  "node_name":"127.0.0.1:59076_",
[junit4:junit4]   2> 	  "base_url":"http://127.0.0.1:59076"}
[junit4:junit4]   2> 10350 T354 oasc.Overseer$ClusterStateUpdater.createCollection Create collection collection1 with numShards 2
[junit4:junit4]   2> 10351 T354 oasc.Overseer$ClusterStateUpdater.updateState Assigning new node to shard shard=shard1
[junit4:junit4]   2> 10385 T353 oascc.ZkStateReader$2.process A cluster state change: WatchedEvent state:SyncConnected type:NodeDataChanged path:/clusterstate.json, has occurred - updating... (live nodes size: 2)
[junit4:junit4]   2> 10385 T359 oascc.ZkStateReader$2.process A cluster state change: WatchedEvent state:SyncConnected type:NodeDataChanged path:/clusterstate.json, has occurred - updating... (live nodes size: 2)
[junit4:junit4]   2> 10385 T372 oascc.ZkStateReader$2.process A cluster state change: WatchedEvent state:SyncConnected type:NodeDataChanged path:/clusterstate.json, has occurred - updating... (live nodes size: 2)
[junit4:junit4]   2> 10695 T373 oasc.CoreContainer.registerCore registering core: collection1
[junit4:junit4]   2> 10695 T373 oasc.ZkController.register Register shard - core:collection1 address:http://127.0.0.1:59076 shardId:shard1
[junit4:junit4]   2> 10697 T373 oascc.SolrZkClient.makePath makePath: /collections/collection1/leader_elect/shard1/election
[junit4:junit4]   2> 10827 T338 oazs.PrepRequestProcessor.pRequest Got user-level KeeperException when processing sessionid:0x13ba1b2b4c60006 type:delete cxid:0x43 zxid:0x5b txntype:-1 reqpath:n/a Error Path:/solr/collections/collection1/leaders Error:KeeperErrorCode = NoNode for /solr/collections/collection1/leaders
[junit4:junit4]   2> 10867 T373 oasc.ShardLeaderElectionContext.runLeaderProcess Running the leader process.
[junit4:junit4]   2> 10868 T338 oazs.PrepRequestProcessor.pRequest Got user-level KeeperException when processing sessionid:0x13ba1b2b4c60006 type:create cxid:0x44 zxid:0x5c txntype:-1 reqpath:n/a Error Path:/solr/overseer Error:KeeperErrorCode = NodeExists for /solr/overseer
[junit4:junit4]   2> 11030 T373 oasc.ShardLeaderElectionContext.waitForReplicasToComeUp Enough replicas found to continue.
[junit4:junit4]   2> 11030 T373 oasc.ShardLeaderElectionContext.runLeaderProcess I may be the new leader - try and sync
[junit4:junit4]   2> 11031 T373 oasc.SyncStrategy.sync Sync replicas to http://127.0.0.1:59076/collection1/
[junit4:junit4]   2> 11031 T373 oasc.SyncStrategy.syncReplicas Sync Success - now sync replicas to me
[junit4:junit4]   2> 11032 T354 oascc.ZkStateReader.updateClusterState Updating cloud state from ZooKeeper... 
[junit4:junit4]   2> 11032 T373 oasc.SyncStrategy.syncToMe http://127.0.0.1:59076/collection1/ has no replicas
[junit4:junit4]   2> 11032 T373 oasc.ShardLeaderElectionContext.runLeaderProcess I am the new leader: http://127.0.0.1:59076/collection1/
[junit4:junit4]   2> 11033 T373 oascc.SolrZkClient.makePath makePath: /collections/collection1/leaders/shard1
[junit4:junit4]   2> 11216 T372 oascc.ZkStateReader$2.process A cluster state change: WatchedEvent state:SyncConnected type:NodeDataChanged path:/clusterstate.json, has occurred - updating... (live nodes size: 2)
[junit4:junit4]   2> 11216 T359 oascc.ZkStateReader$2.process A cluster state change: WatchedEvent state:SyncConnected type:NodeDataChanged path:/clusterstate.json, has occurred - updating... (live nodes size: 2)
[junit4:junit4]   2> 11216 T353 oascc.ZkStateReader$2.process A cluster state change: WatchedEvent state:SyncConnected type:NodeDataChanged path:/clusterstate.json, has occurred - updating... (live nodes size: 2)
[junit4:junit4]   2> 11217 T338 oazs.PrepRequestProcessor.pRequest Got user-level KeeperException when processing sessionid:0x13ba1b2b4c60006 type:create cxid:0x4e zxid:0x63 txntype:-1 reqpath:n/a Error Path:/solr/overseer Error:KeeperErrorCode = NodeExists for /solr/overseer
[junit4:junit4]   2> 12097 T354 oascc.ZkStateReader.updateClusterState Updating cloud state from ZooKeeper... 
[junit4:junit4]   2> 12140 T353 oascc.ZkStateReader$2.process A cluster state change: WatchedEvent state:SyncConnected type:NodeDataChanged path:/clusterstate.json, has occurred - updating... (live nodes size: 2)
[junit4:junit4]   2> 12140 T372 oascc.ZkStateReader$2.process A cluster state change: WatchedEvent state:SyncConnected type:NodeDataChanged path:/clusterstate.json, has occurred - updating... (live nodes size: 2)
[junit4:junit4]   2> 12140 T359 oascc.ZkStateReader$2.process A cluster state change: WatchedEvent state:SyncConnected type:NodeDataChanged path:/clusterstate.json, has occurred - updating... (live nodes size: 2)
[junit4:junit4]   2> 12154 T373 oasc.ZkController.register We are http://127.0.0.1:59076/collection1/ and leader is http://127.0.0.1:59076/collection1/
[junit4:junit4]   2> 12154 T373 oasc.ZkController.register No LogReplay needed for core=collection1 baseURL=http://127.0.0.1:59076
[junit4:junit4]   2> 12154 T373 oasc.ZkController.checkRecovery I am the leader, no recovery necessary
[junit4:junit4]   2> 12155 T373 oasc.ZkController.publish publishing core=collection1 state=active
[junit4:junit4]   2> 12155 T373 oasc.ZkController.publish numShards not found on descriptor - reading it from system property
[junit4:junit4]   2> 12159 T373 oascc.ZkStateReader.updateClusterState Updating cloud state from ZooKeeper... 
[junit4:junit4]   2> 12160 T331 oass.SolrDispatchFilter.init user.dir=/usr/home/hudson/hudson-slave/workspace/Lucene-Solr-Tests-trunk-java7/solr/build/solr-core/test/J0
[junit4:junit4]   2> 12161 T331 oass.SolrDispatchFilter.init SolrDispatchFilter.init() done
[junit4:junit4]   2> 12162 T331 oascsi.HttpClientUtil.createClient Creating new http client, config:maxConnections=128&maxConnectionsPerHost=32&followRedirects=false
[junit4:junit4]   2> 12513 T331 oejs.Server.doStart jetty-8.1.8.v20121106
[junit4:junit4]   2> 12516 T331 oejs.AbstractConnector.doStart Started SocketConnector@127.0.0.1:45878
[junit4:junit4]   2> 12517 T331 oasc.SolrResourceLoader.locateSolrHome JNDI not configured for solr (NoInitialContextEx)
[junit4:junit4]   2> 12518 T331 oasc.SolrResourceLoader.locateSolrHome using system property solr.solr.home: /usr/home/hudson/hudson-slave/workspace/Lucene-Solr-Tests-trunk-java7/solr/build/solr-core/test/J0/./org.apache.solr.cloud.BasicDistributedZk2Test-jetty2-1355627553347
[junit4:junit4]   2> 12518 T331 oasc.SolrResourceLoader.<init> new SolrResourceLoader for deduced Solr Home: '/usr/home/hudson/hudson-slave/workspace/Lucene-Solr-Tests-trunk-java7/solr/build/solr-core/test/J0/./org.apache.solr.cloud.BasicDistributedZk2Test-jetty2-1355627553347/'
[junit4:junit4]   2> 12569 T331 oass.SolrDispatchFilter.init SolrDispatchFilter.init()
[junit4:junit4]   2> 12570 T331 oasc.SolrResourceLoader.locateSolrHome JNDI not configured for solr (NoInitialContextEx)
[junit4:junit4]   2> 12571 T331 oasc.SolrResourceLoader.locateSolrHome using system property solr.solr.home: /usr/home/hudson/hudson-slave/workspace/Lucene-Solr-Tests-trunk-java7/solr/build/solr-core/test/J0/./org.apache.solr.cloud.BasicDistributedZk2Test-jetty2-1355627553347
[junit4:junit4]   2> 12571 T331 oasc.CoreContainer$Initializer.initialize looking for solr.xml: /usr/home/hudson/hudson-slave/workspace/Lucene-Solr-Tests-trunk-java7/solr/build/solr-core/test/J0/./org.apache.solr.cloud.BasicDistributedZk2Test-jetty2-1355627553347/solr.xml
[junit4:junit4]   2> 12572 T331 oasc.CoreContainer.<init> New CoreContainer 157701657
[junit4:junit4]   2> 12573 T331 oasc.CoreContainer.load Loading CoreContainer using Solr Home: '/usr/home/hudson/hudson-slave/workspace/Lucene-Solr-Tests-trunk-java7/solr/build/solr-core/test/J0/./org.apache.solr.cloud.BasicDistributedZk2Test-jetty2-1355627553347/'
[junit4:junit4]   2> 12573 T331 oasc.SolrResourceLoader.<init> new SolrResourceLoader for directory: '/usr/home/hudson/hudson-slave/workspace/Lucene-Solr-Tests-trunk-java7/solr/build/solr-core/test/J0/./org.apache.solr.cloud.BasicDistributedZk2Test-jetty2-1355627553347/'
[junit4:junit4]   2> 12612 T331 oasc.CoreContainer.load Registering Log Listener
[junit4:junit4]   2> 12641 T331 oasc.CoreContainer.initZooKeeper Zookeeper client=127.0.0.1:15950/solr
[junit4:junit4]   2> 12642 T331 oasc.ZkController.checkChrootPath zkHost includes chroot
[junit4:junit4]   2> 12643 T331 oaz.ZooKeeper.<init> Initiating client connection, connectString=127.0.0.1:15950 sessionTimeout=60000 watcher=org.apache.solr.common.cloud.ConnectionManager@19e0e2f5
[junit4:junit4]   2> 12644 T331 oascc.ConnectionManager.waitForConnected Waiting for client to connect to ZooKeeper
[junit4:junit4]   2> 12645 T384 oaz.ClientCnxn$SendThread.logStartConnect Opening socket connection to server localhost/127.0.0.1:15950. Will not attempt to authenticate using SASL (access denied ("javax.security.auth.AuthPermission" "getLoginConfiguration"))
[junit4:junit4]   2> 12646 T384 oaz.ClientCnxn$SendThread.primeConnection Socket connection established to localhost/127.0.0.1:15950, initiating session
[junit4:junit4]   2> 12647 T333 oazs.NIOServerCnxnFactory.run Accepted socket connection from /140.211.11.196:45788
[junit4:junit4]   2> 12647 T333 oazs.ZooKeeperServer.processConnectRequest Client attempting to establish new session at /140.211.11.196:45788
[junit4:junit4]   2> 12651 T335 oazs.ZooKeeperServer.finishSessionInit Established session 0x13ba1b2b4c60007 with negotiated timeout 20000 for client /140.211.11.196:45788
[junit4:junit4]   2> 12651 T384 oaz.ClientCnxn$SendThread.onConnected Session establishment complete on server localhost/127.0.0.1:15950, sessionid = 0x13ba1b2b4c60007, negotiated timeout = 20000
[junit4:junit4]   2> 12652 T385 oascc.ConnectionManager.process Watcher org.apache.solr.common.cloud.ConnectionManager@19e0e2f5 name:ZooKeeperConnection Watcher:127.0.0.1:15950 got event WatchedEvent state:SyncConnected type:None path:null path:null type:None
[junit4:junit4]   2> 12652 T331 oascc.ConnectionManager.waitForConnected Client is connected to ZooKeeper
[junit4:junit4]   2> 12654 T354 oascc.ZkStateReader.updateClusterState Updating cloud state from ZooKeeper... 
[junit4:junit4]   2> 12655 T338 oazs.PrepRequestProcessor.pRequest2Txn Processed session termination for sessionid: 0x13ba1b2b4c60007
[junit4:junit4]   2> 12655 T354 oasc.Overseer$ClusterStateUpdater.updateState Update state numShards=2 message={
[junit4:junit4]   2> 	  "operation":"state",
[junit4:junit4]   2> 	  "numShards":"2",
[junit4:junit4]   2> 	  "shard":"shard1",
[junit4:junit4]   2> 	  "roles":null,
[junit4:junit4]   2> 	  "state":"active",
[junit4:junit4]   2> 	  "core":"collection1",
[junit4:junit4]   2> 	  "collection":"collection1",
[junit4:junit4]   2> 	  "node_name":"127.0.0.1:59076_",
[junit4:junit4]   2> 	  "base_url":"http://127.0.0.1:59076"}
[junit4:junit4]   2> 12661 T385 oaz.ClientCnxn$EventThread.run EventThread shut down
[junit4:junit4]   2> 12661 T333 oazs.NIOServerCnxn.closeSock Closed socket connection for client /140.211.11.196:45788 which had sessionid 0x13ba1b2b4c60007
[junit4:junit4]   2> 12661 T331 oaz.ZooKeeper.close Session: 0x13ba1b2b4c60007 closed
[junit4:junit4]   2> 12662 T331 oaz.ZooKeeper.<init> Initiating client connection, connectString=127.0.0.1:15950/solr sessionTimeout=8000 watcher=org.apache.solr.common.cloud.ConnectionManager@72f9da6d
[junit4:junit4]   2> 12663 T331 oascc.ConnectionManager.waitForConnected Waiting for client to connect to ZooKeeper
[junit4:junit4]   2> 12664 T386 oaz.ClientCnxn$SendThread.logStartConnect Opening socket connection to server localhost/127.0.0.1:15950. Will not attempt to authenticate using SASL (access denied ("javax.security.auth.AuthPermission" "getLoginConfiguration"))
[junit4:junit4]   2> 12665 T386 oaz.ClientCnxn$SendThread.primeConnection Socket connection established to localhost/127.0.0.1:15950, initiating session
[junit4:junit4]   2> 12665 T333 oazs.NIOServerCnxnFactory.run Accepted socket connection from /140.211.11.196:26778
[junit4:junit4]   2> 12666 T333 oazs.ZooKeeperServer.processConnectRequest Client attempting to establish new session at /140.211.11.196:26778
[junit4:junit4]   2> 12674 T335 oazs.ZooKeeperServer.finishSessionInit Established session 0x13ba1b2b4c60008 with negotiated timeout 8000 for client /140.211.11.196:26778
[junit4:junit4]   2> 12674 T386 oaz.ClientCnxn$SendThread.onConnected Session establishment complete on server localhost/127.0.0.1:15950, sessionid = 0x13ba1b2b4c60008, negotiated timeout = 8000
[junit4:junit4]   2> 12674 T387 oascc.ConnectionManager.process Watcher org.apache.solr.common.cloud.ConnectionManager@72f9da6d name:ZooKeeperConnection Watcher:127.0.0.1:15950/solr got event WatchedEvent state:SyncConnected type:None path:null path:null type:None
[junit4:junit4]   2> 12675 T331 oascc.ConnectionManager.waitForConnected Client is connected to ZooKeeper
[junit4:junit4]   2> 12676 T338 oazs.PrepRequestProcessor.pRequest Got user-level KeeperException when processing sessionid:0x13ba1b2b4c60008 type:create cxid:0x1 zxid:0x70 txntype:-1 reqpath:n/a Error Path:/solr/overseer Error:KeeperErrorCode = NodeExists for /solr/overseer
[junit4:junit4]   2> 12731 T338 oazs.PrepRequestProcessor.pRequest Got user-level KeeperException when processing sessionid:0x13ba1b2b4c60008 type:create cxid:0x2 zxid:0x71 txntype:-1 reqpath:n/a Error Path:/solr/overseer Error:KeeperErrorCode = NodeExists for /solr/overseer
[junit4:junit4]   2> 12810 T359 oascc.ZkStateReader$2.process A cluster state change: WatchedEvent state:SyncConnected type:NodeDataChanged path:/clusterstate.json, has occurred - updating... (live nodes size: 2)
[junit4:junit4]   2> 12810 T372 oascc.ZkStateReader$2.process A cluster state change: WatchedEvent state:SyncConnected type:NodeDataChanged path:/clusterstate.json, has occurred - updating... (live nodes size: 2)
[junit4:junit4]   2> 12811 T353 oascc.ZkStateReader$2.process A cluster state change: WatchedEvent state:SyncConnected type:NodeDataChanged path:/clusterstate.json, has occurred - updating... (live nodes size: 2)
[junit4:junit4]   2> 12811 T331 oasc.ZkController.createEphemeralLiveNode Register node as live in ZooKeeper:/live_nodes/127.0.0.1:45878_
[junit4:junit4]   2> 12813 T338 oazs.PrepRequestProcessor.pRequest Got user-level KeeperException when processing sessionid:0x13ba1b2b4c60008 type:delete cxid:0x4 zxid:0x73 txntype:-1 reqpath:n/a Error Path:/solr/live_nodes/127.0.0.1:45878_ Error:KeeperErrorCode = NoNode for /solr/live_nodes/127.0.0.1:45878_
[junit4:junit4]   2> 12818 T331 oascc.SolrZkClient.makePath makePath: /live_nodes/127.0.0.1:45878_
[junit4:junit4]   2> 12828 T359 oascc.ZkStateReader$3.process Updating live nodes... (3)
[junit4:junit4]   2> 12828 T372 oascc.ZkStateReader$3.process Updating live nodes... (3)
[junit4:junit4]   2> 12828 T359 oascc.ZkStateReader$2.process A cluster state change: WatchedEvent state:SyncConnected type:NodeChildrenChanged path:/live_nodes, has occurred - updating... (live nodes size: 3)
[junit4:junit4]   2> 12828 T372 oascc.ZkStateReader$2.process A cluster state change: WatchedEvent state:SyncConnected type:NodeChildrenChanged path:/live_nodes, has occurred - updating... (live nodes size: 3)
[junit4:junit4]   2> 12829 T353 oascc.ZkStateReader$3.process Updating live nodes... (3)
[junit4:junit4]   2> 12829 T331 oashc.HttpShardHandlerFactory.getParameter Setting socketTimeout to: 0
[junit4:junit4]   2> 12830 T353 oascc.ZkStateReader$2.process A cluster state change: WatchedEvent state:SyncConnected type:NodeChildrenChanged path:/live_nodes, has occurred - updating... (live nodes size: 3)
[junit4:junit4]   2> 12830 T331 oashc.HttpShardHandlerFactory.getParameter Setting urlScheme to: http://
[junit4:junit4]   2> 12831 T331 oashc.HttpShardHandlerFactory.getParameter Setting connTimeout to: 0
[junit4:junit4]   2> 12831 T331 oashc.HttpShardHandlerFactory.getParameter Setting maxConnectionsPerHost to: 20
[junit4:junit4]   2> 12832 T331 oashc.HttpShardHandlerFactory.getParameter Setting corePoolSize to: 0
[junit4:junit4]   2> 12833 T331 oashc.HttpShardHandlerFactory.getParameter Setting maximumPoolSize to: 2147483647
[junit4:junit4]   2> 12833 T331 oashc.HttpShardHandlerFactory.getParameter Setting maxThreadIdleTime to: 5
[junit4:junit4]   2> 12834 T331 oashc.HttpShardHandlerFactory.getParameter Setting sizeOfQueue to: -1
[junit4:junit4]   2> 12834 T331 oashc.HttpShardHandlerFactory.getParameter Setting fairnessPolicy to: false
[junit4:junit4]   2> 12835 T331 oascsi.HttpClientUtil.createClient Creating new http client, config:maxConnectionsPerHost=20&maxConnections=10000&socketTimeout=0&connTimeout=0&retry=false
[junit4:junit4]   2> 12864 T331 oascc.ZkStateReader.createClusterStateWatchersAndUpdate Updating cluster state from ZooKeeper... 
[junit4:junit4]   2> 12875 T388 oasc.CoreContainer.create Creating SolrCore 'collection1' using instanceDir: /usr/home/hudson/hudson-slave/workspace/Lucene-Solr-Tests-trunk-java7/solr/build/solr-core/test/J0/./org.apache.solr.cloud.BasicDistributedZk2Test-jetty2-1355627553347/collection1
[junit4:junit4]   2> 12876 T388 oasc.ZkController.createCollectionZkNode Check for collection zkNode:collection1
[junit4:junit4]   2> 12877 T388 oasc.ZkController.createCollectionZkNode Collection zkNode exists
[junit4:junit4]   2> 12877 T388 oasc.ZkController.readConfigName Load collection config from:/collections/collection1
[junit4:junit4]   2> 12879 T388 oasc.SolrResourceLoader.<init> new SolrResourceLoader for directory: '/usr/home/hudson/hudson-slave/workspace/Lucene-Solr-Tests-trunk-java7/solr/build/solr-core/test/J0/./org.apache.solr.cloud.BasicDistributedZk2Test-jetty2-1355627553347/collection1/'
[junit4:junit4]   2> 12901 T388 oasc.SolrResourceLoader.replaceClassLoader Adding 'file:/usr/home/hudson/hudson-slave/workspace/Lucene-Solr-Tests-trunk-java7/solr/build/solr-core/test/J0/org.apache.solr.cloud.BasicDistributedZk2Test-jetty2-1355627553347/collection1/lib/classes/' to classloader
[junit4:junit4]   2> 12902 T388 oasc.SolrResourceLoader.replaceClassLoader Adding 'file:/usr/home/hudson/hudson-slave/workspace/Lucene-Solr-Tests-trunk-java7/solr/build/solr-core/test/J0/org.apache.solr.cloud.BasicDistributedZk2Test-jetty2-1355627553347/collection1/lib/README' to classloader
[junit4:junit4]   2> 13028 T388 oasc.SolrConfig.<init> Using Lucene MatchVersion: LUCENE_50
[junit4:junit4]   2> 13224 T388 oasc.SolrConfig.<init> Loaded SolrConfig: solrconfig.xml
[junit4:junit4]   2> 13326 T388 oass.IndexSchema.readSchema Reading Solr Schema
[junit4:junit4]   2> 13336 T388 oass.IndexSchema.readSchema Schema name=test
[junit4:junit4]   2> 14385 T388 oass.OpenExchangeRatesOrgProvider.init Initialized with rates=open-exchange-rates.json, refreshInterval=1440.
[junit4:junit4]   2> 14404 T388 oass.IndexSchema.readSchema default search field in schema is text
[junit4:junit4]   2> 14409 T388 oass.IndexSchema.readSchema unique key field: id
[junit4:junit4]   2> 14434 T388 oass.FileExchangeRateProvider.reload Reloading exchange rates from file currency.xml
[junit4:junit4]   2> 14446 T388 oass.FileExchangeRateProvider.reload Reloading exchange rates from file currency.xml
[junit4:junit4]   2> 14453 T388 oass.OpenExchangeRatesOrgProvider.reload Reloading exchange rates from open-exchange-rates.json
[junit4:junit4]   2> 14455 T388 oass.OpenExchangeRatesOrgProvider.reload Reloading exchange rates from open-exchange-rates.json
[junit4:junit4]   2> 14458 T388 oasc.SolrCore.<init> [collection1] Opening new SolrCore at /usr/home/hudson/hudson-slave/workspace/Lucene-Solr-Tests-trunk-java7/solr/build/solr-core/test/J0/./org.apache.solr.cloud.BasicDistributedZk2Test-jetty2-1355627553347/collection1/, dataDir=./org.apache.solr.cloud.BasicDistributedZk2Test-1355627541171/jetty2/
[junit4:junit4]   2> 14458 T388 oasc.JmxMonitoredMap.<init> JMX monitoring is enabled. Adding Solr mbeans to JMX Server: com.sun.jmx.mbeanserver.JmxMBeanServer@22bb1eab
[junit4:junit4]   2> 14459 T388 oasc.SolrCore.initDirectoryFactory solr.NRTCachingDirectoryFactory
[junit4:junit4]   2> 14462 T388 oasc.CachingDirectoryFactory.get return new directory for /usr/home/hudson/hudson-slave/workspace/Lucene-Solr-Tests-trunk-java7/solr/build/solr-core/test/J0/./org.apache.solr.cloud.BasicDistributedZk2Test-1355627541171/jetty2 forceNew:false
[junit4:junit4]   2> 14463 T388 oasc.CachingDirectoryFactory.close Releasing directory:/usr/home/hudson/hudson-slave/workspace/Lucene-Solr-Tests-trunk-java7/solr/build/solr-core/test/J0/./org.apache.solr.cloud.BasicDistributedZk2Test-1355627541171/jetty2
[junit4:junit4]   2> 14463 T388 oasc.SolrCore.getNewIndexDir New index directory detected: old=null new=./org.apache.solr.cloud.BasicDistributedZk2Test-1355627541171/jetty2/index/
[junit4:junit4]   2> 14464 T388 oasc.SolrCore.initIndex WARNING [collection1] Solr index directory './org.apache.solr.cloud.BasicDistributedZk2Test-1355627541171/jetty2/index' doesn't exist. Creating new index...
[junit4:junit4]   2> 14465 T388 oasc.CachingDirectoryFactory.get return new directory for /usr/home/hudson/hudson-slave/workspace/Lucene-Solr-Tests-trunk-java7/solr/build/solr-core/test/J0/./org.apache.solr.cloud.BasicDistributedZk2Test-1355627541171/jetty2/index forceNew:false
[junit4:junit4]   2> 14477 T388 oasc.SolrDeletionPolicy.onCommit SolrDeletionPolicy.onCommit: commits:num=1
[junit4:junit4]   2> 		commit{dir=RateLimitedDirectoryWrapper(NRTCachingDirectory(org.apache.lucene.store.NIOFSDirectory@/usr/home/hudson/hudson-slave/workspace/Lucene-Solr-Tests-trunk-java7/solr/build/solr-core/test/J0/org.apache.solr.cloud.BasicDistributedZk2Test-1355627541171/jetty2/index lockFactory=org.apache.lucene.store.NativeFSLockFactory@6e6bace2; maxCacheMB=48.0 maxMergeSizeMB=4.0)),segFN=segments_1,generation=1,filenames=[segments_1]
[junit4:junit4]   2> 14477 T388 oasc.SolrDeletionPolicy.updateCommits newest commit = 1[segments_1]
[junit4:junit4]   2> 14487 T388 oasc.CachingDirectoryFactory.close Releasing directory:/usr/home/hudson/hudson-slave/workspace/Lucene-Solr-Tests-trunk-java7/solr/build/solr-core/test/J0/./org.apache.solr.cloud.BasicDistributedZk2Test-1355627541171/jetty2/index
[junit4:junit4]   2> 14488 T388 oasc.SolrCore.initWriters created xml: solr.XMLResponseWriter
[junit4:junit4]   2> 14491 T388 oasup.UpdateRequestProcessorChain.init inserting DistributedUpdateProcessorFactory into updateRequestProcessorChain "dedupe"
[junit4:junit4]   2> 14491 T388 oasup.UpdateRequestProcessorChain.init inserting DistributedUpdateProcessorFactory into updateRequestProcessorChain "dedupe-allfields"
[junit4:junit4]   2> 14492 T388 oasup.UpdateRequestProcessorChain.init inserting DistributedUpdateProcessorFactory into updateRequestProcessorChain "stored_sig"
[junit4:junit4]   2> 14492 T388 oasup.UpdateRequestProcessorChain.init inserting DistributedUpdateProcessorFactory into updateRequestProcessorChain "uniq-fields"
[junit4:junit4]   2> 14493 T388 oasup.UpdateRequestProcessorChain.init inserting DistributedUpdateProcessorFactory into updateRequestProcessorChain "distrib-dup-test-chain-implicit"
[junit4:junit4]   2> 14493 T388 oasc.RequestHandlers.initHandlersFromConfig adding lazy requestHandler: solr.ReplicationHandler
[junit4:junit4]   2> 14494 T388 oasc.RequestHandlers.initHandlersFromConfig created /replication: solr.ReplicationHandler
[junit4:junit4]   2> 14496 T388 oasc.RequestHandlers.initHandlersFromConfig created standard: solr.StandardRequestHandler
[junit4:junit4]   2> 14497 T388 oasc.RequestHandlers.initHandlersFromConfig created /get: solr.RealTimeGetHandler
[junit4:junit4]   2> 14499 T388 oasc.RequestHandlers.initHandlersFromConfig created dismax: solr.SearchHandler
[junit4:junit4]   2> 14500 T388 oasc.RequestHandlers.initHandlersFromConfig created mock: org.apache.solr.core.MockQuerySenderListenerReqHandler
[junit4:junit4]   2> 14501 T388 oasc.RequestHandlers.initHandlersFromConfig created /admin/: org.apache.solr.handler.admin.AdminHandlers
[junit4:junit4]   2> 14502 T388 oasc.RequestHandlers.initHandlersFromConfig created defaults: solr.StandardRequestHandler
[junit4:junit4]   2> 14503 T388 oasc.RequestHandlers.initHandlersFromConfig adding lazy requestHandler: solr.StandardRequestHandler
[junit4:junit4]   2> 14503 T388 oasc.RequestHandlers.initHandlersFromConfig created lazy: solr.StandardRequestHandler
[junit4:junit4]   2> 14505 T388 oasc.RequestHandlers.initHandlersFromConfig created /update: solr.UpdateRequestHandler
[junit4:junit4]   2> 14506 T388 oasc.RequestHandlers.initHandlersFromConfig created /terms: org.apache.solr.handler.component.SearchHandler
[junit4:junit4]   2> 14507 T388 oasc.RequestHandlers.initHandlersFromConfig created spellCheckCompRH: org.apache.solr.handler.component.SearchHandler
[junit4:junit4]   2> 14509 T388 oasc.RequestHandlers.initHandlersFromConfig created spellCheckCompRH_Direct: org.apache.solr.handler.component.SearchHandler
[junit4:junit4]   2> 14510 T388 oasc.RequestHandlers.initHandlersFromConfig created spellCheckWithWordbreak: org.apache.solr.handler.component.SearchHandler
[junit4:junit4]   2> 14512 T388 oasc.RequestHandlers.initHandlersFromConfig created spellCheckWithWordbreak_Direct: org.apache.solr.handler.component.SearchHandler
[junit4:junit4]   2> 14513 T388 oasc.RequestHandlers.initHandlersFromConfig created spellCheckCompRH1: org.apache.solr.handler.component.SearchHandler
[junit4:junit4]   2> 14515 T388 oasc.RequestHandlers.initHandlersFromConfig created mltrh: org.apache.solr.handler.component.SearchHandler
[junit4:junit4]   2> 14516 T388 oasc.RequestHandlers.initHandlersFromConfig created tvrh: org.apache.solr.handler.component.SearchHandler
[junit4:junit4]   2> 14518 T388 oasc.RequestHandlers.initHandlersFromConfig created /mlt: solr.MoreLikeThisHandler
[junit4:junit4]   2> 14519 T388 oasc.RequestHandlers.initHandlersFromConfig created /debug/dump: solr.DumpRequestHandler
[junit4:junit4]   2> 14562 T388 oashl.XMLLoader.init xsltCacheLifetimeSeconds=60
[junit4:junit4]   2> 14568 T388 oasc.SolrCore.initDeprecatedSupport WARNING solrconfig.xml uses deprecated <admin/gettableFiles>, Please update your config to use the ShowFileRequestHandler.
[junit4:junit4]   2> 14571 T388 oasc.SolrCore.initDeprecatedSupport WARNING adding ShowFileRequestHandler with hidden files: [SCHEMA.XML, OLD_SYNONYMS.TXT, STOPWORDS.TXT, PROTWORDS.TXT, OPEN-EXCHANGE-RATES.JSON, SYNONYMS.TXT, CURRENCY.XML, MAPPING-ISOLATIN1ACCENT.TXT]
[junit4:junit4]   2> 14575 T388 oasc.CachingDirectoryFactory.close Releasing directory:/usr/home/hudson/hudson-slave/workspace/Lucene-Solr-Tests-trunk-java7/solr/build/solr-core/test/J0/./org.apache.solr.cloud.BasicDistributedZk2Test-1355627541171/jetty2
[junit4:junit4]   2> 14577 T388 oass.SolrIndexSearcher.<init> Opening Searcher@3330c6ae main
[junit4:junit4]   2> 14579 T388 oasu.CommitTracker.<init> Hard AutoCommit: disabled
[junit4:junit4]   2> 14579 T388 oasu.CommitTracker.<init> Soft AutoCommit: disabled
[junit4:junit4]   2> 14580 T388 oashc.SpellCheckComponent.inform Initializing spell checkers
[junit4:junit4]   2> 14626 T388 oass.DirectSolrSpellChecker.init init: {name=direct,classname=DirectSolrSpellChecker,field=lowerfilt,minQueryLength=3}
[junit4:junit4]   2> 14807 T389 oasc.SolrCore.registerSearcher [collection1] Registered new searcher Searcher@3330c6ae main{StandardDirectoryReader(segments_1:1)}
[junit4:junit4]   2> 14815 T388 oasc.ZkController.publish publishing core=collection1 state=down
[junit4:junit4]   2> 14815 T388 oasc.ZkController.publish numShards not found on descriptor - reading it from system property
[junit4:junit4]   2> 14838 T354 oascc.ZkStateReader.updateClusterState Updating cloud state from ZooKeeper... 
[junit4:junit4]   2> 14839 T354 oasc.Overseer$ClusterStateUpdater.updateState Update state numShards=2 message={
[junit4:junit4]   2> 	  "operation":"state",
[junit4:junit4]   2> 	  "numShards":"2",
[junit4:junit4]   2> 	  "shard":null,
[junit4:junit4]   2> 	  "roles":null,
[junit4:junit4]   2> 	  "state":"down",
[junit4:junit4]   2> 	  "core":"collection1",
[junit4:junit4]   2> 	  "collection":"collection1",
[junit4:junit4]   2> 	  "node_name":"127.0.0.1:45878_",
[junit4:junit4]   2> 	  "base_url":"http://127.0.0.1:45878"}
[junit4:junit4]   2> 14840 T354 oasc.Overseer$ClusterStateUpdater.updateState Collection already exists with numShards=2
[junit4:junit4]   2> 14840 T354 oasc.Overseer$ClusterStateUpdater.updateState Assigning new node to shard shard=shard2
[junit4:junit4]   2> 14876 T387 oascc.ZkStateReader$2.process A cluster state change: WatchedEvent state:SyncConnected type:NodeDataChanged path:/clusterstate.json, has occurred - updating... (live nodes size: 3)
[junit4:junit4]   2> 14876 T372 oascc.ZkStateReader$2.process A cluster state change: WatchedEvent state:SyncConnected type:NodeDataChanged path:/clusterstate.json, has occurred - updating... (live nodes size: 3)
[junit4:junit4]   2> 14876 T359 oascc.ZkStateReader$2.process A cluster state change: WatchedEvent state:SyncConnected type:NodeDataChanged path:/clusterstate.json, has occurred - updating... (live nodes size: 3)
[junit4:junit4]   2> 14876 T353 oascc.ZkStateReader$2.process A cluster state change: WatchedEvent state:SyncConnected type:NodeDataChanged path:/clusterstate.json, has occurred - updating... (live nodes size: 3)
[junit4:junit4]   2> 15320 T388 oasc.CoreContainer.registerCore registering core: collection1
[junit4:junit4]   2> 15320 T388 oasc.ZkController.register Register shard - core:collection1 address:http://127.0.0.1:45878 shardId:shard2
[junit4:junit4]   2> 15322 T388 oascc.SolrZkClient.makePath makePath: /collections/collection1/leader_elect/shard2/election
[junit4:junit4]   2> 15342 T338 oazs.PrepRequestProcessor.pRequest Got user-level KeeperException when processing sessionid:0x13ba1b2b4c60008 type:delete cxid:0x42 zxid:0x7f txntype:-1 reqpath:n/a Error Path:/solr/collections/collection1/leaders/shard2 Error:KeeperErrorCode = NoNode for /solr/collections/collection1/leaders/shard2
[junit4:junit4]   2> 15356 T388 oasc.ShardLeaderElectionContext.runLeaderProcess Running the leader process.
[junit4:junit4]   2> 15357 T338 oazs.PrepRequestProcessor.pRequest Got user-level KeeperException when processing sessionid:0x13ba1b2b4c60008 type:create cxid:0x43 zxid:0x80 txntype:-1 reqpath:n/a Error Path:/solr/overseer Error:KeeperErrorCode = NodeExists for /solr/overseer
[junit4:junit4]   2> 15381 T388 oasc.ShardLeaderElectionContext.waitForReplicasToComeUp Enough replicas found to continue.
[junit4:junit4]   2> 15382 T388 oasc.ShardLeaderElectionContext.runLeaderProcess I may be the new leader - try and sync
[junit4:junit4]   2> 15382 T388 oasc.SyncStrategy.sync Sync replicas to http://127.0.0.1:45878/collection1/
[junit4:junit4]   2> 15382 T388 oasc.SyncStrategy.syncReplicas Sync Success - now sync replicas to me
[junit4:junit4]   2> 15383 T388 oasc.SyncStrategy.syncToMe http://127.0.0.1:45878/collection1/ has no replicas
[junit4:junit4]   2> 15383 T388 oasc.ShardLeaderElectionContext.runLeaderProcess I am the new leader: http://127.0.0.1:45878/collection1/
[junit4:junit4]   2> 15383 T388 oascc.SolrZkClient.makePath makePath: /collections/collection1/leaders/shard2
[junit4:junit4]   2> 15390 T338 oazs.PrepRequestProcessor.pRequest Got user-level KeeperException when processing sessionid:0x13ba1b2b4c60008 type:create cxid:0x4c zxid:0x83 txntype:-1 reqpath:n/a Error Path:/solr/overseer Error:KeeperErrorCode = NodeExists for /solr/overseer
[junit4:junit4]   2> 15475 T354 oascc.ZkStateReader.updateClusterState Updating cloud state from ZooKeeper... 
[junit4:junit4]   2> 15532 T387 oascc.ZkStateReader$2.process A cluster state change: WatchedEvent state:SyncConnected type:NodeDataChanged path:/clusterstate.json, has occurred - updating... (live nodes size: 3)
[junit4:junit4]   2> 15533 T372 oascc.ZkStateReader$2.process A cluster state change: WatchedEvent state:SyncConnected type:NodeDataChanged path:/clusterstate.json, has occurred - updating... (live nodes size: 3)
[junit4:junit4]   2> 15533 T359 oascc.ZkStateReader$2.process A cluster state change: WatchedEvent state:SyncConnected type:NodeDataChanged path:/clusterstate.json, has occurred - updating... (live nodes size: 3)
[junit4:junit4]   2> 15533 T353 oascc.ZkStateReader$2.process A cluster state change: WatchedEvent state:SyncConnected type:NodeDataChanged path:/clusterstate.json, has occurred - updating... (live nodes size: 3)
[junit4:junit4]   2> 15558 T388 oasc.ZkController.register We are http://127.0.0.1:45878/collection1/ and leader is http://127.0.0.1:45878/collection1/
[junit4:junit4]   2> 15558 T388 oasc.ZkController.register No LogReplay needed for core=collection1 baseURL=http://127.0.0.1:45878
[junit4:junit4]   2> 15558 T388 oasc.ZkController.checkRecovery I am the leader, no recovery necessary
[junit4:junit4]   2> 15559 T388 oasc.ZkController.publish publishing core=collection1 state=active
[junit4:junit4]   2> 15559 T388 oasc.ZkController.publish numShards not found on descriptor - reading it from system property
[junit4:junit4]   2> 15566 T388 oascc.ZkStateReader.updateClusterState Updating cloud state from ZooKeeper... 
[junit4:junit4]   2> 15580 T331 oass.SolrDispatchFilter.init user.dir=/usr/home/hudson/hudson-slave/workspace/Lucene-Solr-Tests-trunk-java7/solr/build/solr-core/test/J0
[junit4:junit4]   2> 15581 T331 oass.SolrDispatchFilter.init SolrDispatchFilter.init() done
[junit4:junit4]   2> 15582 T331 oascsi.HttpClientUtil.createClient Creating new http client, config:maxConnections=128&maxConnectionsPerHost=32&followRedirects=false
[junit4:junit4]   2> 15978 T331 oejs.Server.doStart jetty-8.1.8.v20121106
[junit4:junit4]   2> 15981 T331 oejs.AbstractConnector.doStart Started SocketConnector@127.0.0.1:10913
[junit4:junit4]   2> 15982 T331 oasc.SolrResourceLoader.locateSolrHome JNDI not configured for solr (NoInitialContextEx)
[junit4:junit4]   2> 15983 T331 oasc.SolrResourceLoader.locateSolrHome using system property solr.solr.home: /usr/home/hudson/hudson-slave/workspace/Lucene-Solr-Tests-trunk-java7/solr/build/solr-core/test/J0/./org.apache.solr.cloud.BasicDistributedZk2Test-jetty3-1355627556764
[junit4:junit4]   2> 15984 T331 oasc.SolrResourceLoader.<init> new SolrResourceLoader for deduced Solr Home: '/usr/home/hudson/hudson-slave/workspace/Lucene-Solr-Tests-trunk-java7/solr/build/solr-core/test/J0/./org.apache.solr.cloud.BasicDistributedZk2Test-jetty3-1355627556764/'
[junit4:junit4]   2> 16038 T331 oass.SolrDispatchFilter.init SolrDispatchFilter.init()
[junit4:junit4]   2> 16039 T331 oasc.SolrResourceLoader.locateSolrHome JNDI not configured for solr (NoInitialContextEx)
[junit4:junit4]   2> 16040 T331 oasc.SolrResourceLoader.locateSolrHome using system property solr.solr.home: /usr/home/hudson/hudson-slave/workspace/Lucene-Solr-Tests-trunk-java7/solr/build/solr-core/test/J0/./org.apache.solr.cloud.BasicDistributedZk2Test-jetty3-1355627556764
[junit4:junit4]   2> 16040 T331 oasc.CoreContainer$Initializer.initialize looking for solr.xml: /usr/home/hudson/hudson-slave/workspace/Lucene-Solr-Tests-trunk-java7/solr/build/solr-core/test/J0/./org.apache.solr.cloud.BasicDistributedZk2Test-jetty3-1355627556764/solr.xml
[junit4:junit4]   2> 16041 T331 oasc.CoreContainer.<init> New CoreContainer 2059572030
[junit4:junit4]   2> 16042 T331 oasc.CoreContainer.load Loading CoreContainer using Solr Home: '/usr/home/hudson/hudson-slave/workspace/Lucene-Solr-Tests-trunk-java7/solr/build/solr-core/test/J0/./org.apache.solr.cloud.BasicDistributedZk2Test-jetty3-1355627556764/'
[junit4:junit4]   2> 16042 T331 oasc.SolrResourceLoader.<init> new SolrResourceLoader for directory: '/usr/home/hudson/hudson-slave/workspace/Lucene-Solr-Tests-trunk-java7/solr/build/solr-core/test/J0/./org.apache.solr.cloud.BasicDistributedZk2Test-jetty3-1355627556764/'
[junit4:junit4]   2> 16084 T354 oascc.ZkStateReader.updateClusterState Updating cloud state from ZooKeeper... 
[junit4:junit4]   2> 16086 T354 oasc.Overseer$ClusterStateUpdater.updateState Update state numShards=2 message={
[junit4:junit4]   2> 	  "operation":"state",
[junit4:junit4]   2> 	  "numShards":"2",
[junit4:junit4]   2> 	  "shard":"shard2",
[junit4:junit4]   2> 	  "roles":null,
[junit4:junit4]   2> 	  "state":"active",
[junit4:junit4]   2> 	  "core":"collection1",
[junit4:junit4]   2> 	  "collection":"collection1",
[junit4:junit4]   2> 	  "node_name":"127.0.0.1:45878_",
[junit4:junit4]   2> 	  "base_url":"http://127.0.0.1:45878"}
[junit4:junit4]   2> 16123 T331 oasc.CoreContainer.load Registering Log Listener
[junit4:junit4]   2> 16132 T353 oascc.ZkStateReader$2.process A cluster state change: WatchedEvent state:SyncConnected type:NodeDataChanged path:/clusterstate.json, has occurred - updating... (live nodes size: 3)
[junit4:junit4]   2> 16132 T387 oascc.ZkStateReader$2.process A cluster state change: WatchedEvent state:SyncConnected type:NodeDataChanged path:/clusterstate.json, has occurred - updating... (live nodes size: 3)
[junit4:junit4]   2> 16132 T359 oascc.ZkStateReader$2.process A cluster state change: WatchedEvent state:SyncConnected type:NodeDataChanged path:/clusterstate.json, has occurred - updating... (live nodes size: 3)
[junit4:junit4]   2> 16132 T372 oascc.ZkStateReader$2.process A cluster state change: WatchedEvent state:SyncConnected type:NodeDataChanged path:/clusterstate.json, has occurred - updating... (live nodes size: 3)
[junit4:junit4]   2> 16142 T331 oasc.CoreContainer.initZooKeeper Zookeeper client=127.0.0.1:15950/solr
[junit4:junit4]   2> 16143 T331 oasc.ZkController.checkChrootPath zkHost includes chroot
[junit4:junit4]   2> 16143 T331 oaz.ZooKeeper.<init> Initiating client connection, connectString=127.0.0.1:15950 sessionTimeout=60000 watcher=org.apache.solr.common.cloud.ConnectionManager@4b3fa5bf
[junit4:junit4]   2> 16145 T331 oascc.ConnectionManager.waitForConnected Waiting for client to connect to ZooKeeper
[junit4:junit4]   2> 16145 T399 oaz.ClientCnxn$SendThread.logStartConnect Opening socket connection to server localhost/127.0.0.1:15950. Will not attempt to authenticate using SASL (access denied ("javax.security.auth.AuthPermission" "getLoginConfiguration"))
[junit4:junit4]   2> 16146 T399 oaz.ClientCnxn$SendThread.primeConnection Socket connection established to localhost/127.0.0.1:15950, initiating session
[junit4:junit4]   2> 16146 T333 oazs.NIOServerCnxnFactory.run Accepted socket connection from /140.211.11.196:61366
[junit4:junit4]   2> 16147 T333 oazs.ZooKeeperServer.processConnectRequest Client attempting to establish new session at /140.211.11.196:61366
[junit4:junit4]   2> 16156 T335 oazs.ZooKeeperServer.finishSessionInit Established session 0x13ba1b2b4c60009 with negotiated timeout 20000 for client /140.211.11.196:61366
[junit4:junit4]   2> 16157 T399 oaz.ClientCnxn$SendThread.onConnected Session establishment complete on server localhost/127.0.0.1:15950, sessionid = 0x13ba1b2b4c60009, negotiated timeout = 20000
[junit4:junit4]   2> 16157 T400 oascc.ConnectionManager.process Watcher org.apache.solr.common.cloud.ConnectionManager@4b3fa5bf name:ZooKeeperConnection Watcher:127.0.0.1:15950 got event WatchedEvent state:SyncConnected type:None path:null path:null type:None
[junit4:junit4]   2> 16157 T331 oascc.ConnectionManager.waitForConnected Client is connected to ZooKeeper
[junit4:junit4]   2> 16160 T338 oazs.PrepRequestProcessor.pRequest2Txn Processed session termination for sessionid: 0x13ba1b2b4c60009
[junit4:junit4]   2> 16162 T400 oaz.ClientCnxn$EventThread.run EventThread shut down
[junit4:junit4]   2> 16162 T333 oazs.NIOServerCnxn.closeSock Closed socket connection for client /140.211.11.196:61366 which had sessionid 0x13ba1b2b4c60009
[junit4:junit4]   2> 16162 T331 oaz.ZooKeeper.close Session: 0x13ba1b2b4c60009 closed
[junit4:junit4]   2> 16163 T331 oaz.ZooKeeper.<init> Initiating client connection, connectString=127.0.0.1:15950/solr sessionTimeout=8000 watcher=org.apache.solr.common.cloud.ConnectionManager@431ee45
[junit4:junit4]   2> 16164 T331 oascc.ConnectionManager.waitForConnected Waiting for client to connect to ZooKeeper
[junit4:junit4]   2> 16164 T401 oaz.ClientCnxn$SendThread.logStartConnect Opening socket connection to server localhost/127.0.0.1:15950. Will not attempt to authenticate using SASL (access denied ("javax.security.auth.AuthPermission" "getLoginConfiguration"))
[junit4:junit4]   2> 16165 T401 oaz.ClientCnxn$SendThread.primeConnection Socket connection established to localhost/127.0.0.1:15950, initiating session
[junit4:junit4]   2> 16165 T333 oazs.NIOServerCnxnFactory.run Accepted socket connection from /140.211.11.196:49907
[junit4:junit4]   2> 16166 T333 oazs.ZooKeeperServer.processConnectRequest Client attempting to establish new session at /140.211.11.196:49907
[junit4:junit4]   2> 16177 T335 oazs.ZooKeeperServer.finishSessionInit Established session 0x13ba1b2b4c6000a with negotiated timeout 8000 for client /140.211.11.196:49907
[junit4:junit4]   2> 16177 T401 oaz.ClientCnxn$SendThread.onConnected Session establishment complete on server localhost/127.0.0.1:15950, sessionid = 0x13ba1b2b4c6000a, negotiated timeout = 8000
[junit4:junit4]   2> 16178 T402 oascc.ConnectionManager.process Watcher org.apache.solr.common.cloud.ConnectionManager@431ee45 name:ZooKeeperConnection Watcher:127.0.0.1:15950/solr got event WatchedEvent state:SyncConnected type:None path:null path:null type:None
[junit4:junit4]   2> 16179 T331 oascc.ConnectionManager.waitForConnected Client is connected to ZooKeeper
[junit4:junit4]   2> 16180 T338 oazs.PrepRequestProcessor.pRequest Got user-level KeeperException when processing sessionid:0x13ba1b2b4c6000a type:create cxid:0x1 zxid:0x94 txntype:-1 reqpath:n/a Error Path:/solr/overseer Error:KeeperErrorCode = NodeExists for /solr/overseer
[junit4:junit4]   2> 16208 T338 oazs.PrepRequestProcessor.pRequest Got user-level KeeperException when processing sessionid:0x13ba1b2b4c6000a type:create cxid:0x2 zxid:0x95 txntype:-1 reqpath:n/a Error Path:/solr/overseer Error:KeeperErrorCode = NodeExists for /solr/overseer
[junit4:junit4]   2> 16235 T331 oasc.ZkController.createEphemeralLiveNode Register node as live in ZooKeeper:/live_nodes/127.0.0.1:10913_
[junit4:junit4]   2> 16236 T338 oazs.PrepRequestProcessor.pRequest Got user-level KeeperException when processing sessionid:0x13ba1b2b4c6000a type:delete cxid:0x4 zxid:0x96 txntype:-1 reqpath:n/a Error Path:/solr/live_nodes/127.0.0.1:10913_ Error:KeeperErrorCode = NoNode for /solr/live_nodes/127.0.0.1:10913_
[junit4:junit4]   2> 16289 T331 oascc.SolrZkClient.makePath makePath: /live_nodes/127.0.0.1:10913_
[junit4:junit4]   2> 16293 T387 oascc.ZkStateReader$2.process A cluster state change: WatchedEvent state:SyncConnected type:NodeChildrenChanged path:/live_nodes, has occurred - updating... (live nodes size: 3)
[junit4:junit4]   2> 16294 T372 oascc.ZkStateReader$3.process Updating live nodes... (4)
[junit4:junit4]   2> 16294 T353 oascc.ZkStateReader$3.process Updating live nodes... (4)
[junit4:junit4]   2> 16295 T372 oascc.ZkStateReader$2.process A cluster state change: WatchedEvent state:SyncConnected type:NodeChildrenChanged path:/live_nodes, has occurred - updating... (live nodes size: 4)
[junit4:junit4]   2> 16295 T359 oascc.ZkStateReader$3.process Updating live nodes... (4)
[junit4:junit4]   2> 16295 T353 oascc.ZkStateReader$2.process A cluster state change: WatchedEvent state:SyncConnected type:NodeChildrenChanged path:/live_nodes, has occurred - updating... (live nodes size: 4)
[junit4:junit4]   2> 16296 T359 oascc.ZkStateReader$2.process A cluster state change: WatchedEvent state:SyncConnected type:NodeChildrenChanged path:/live_nodes, has occurred - updating... (live nodes size: 4)
[junit4:junit4]   2> 16296 T331 oashc.HttpShardHandlerFactory.getParameter Setting socketTimeout to: 0
[junit4:junit4]   2> 16297 T387 oascc.ZkStateReader$3.process Updating live nodes... (4)
[junit4:junit4]   2> 16297 T331 oashc.HttpShardHandlerFactory.getParameter Setting urlScheme to: http://
[junit4:junit4]   2> 16297 T331 oashc.HttpShardHandlerFactory.getParameter Setting connTimeout to: 0
[junit4:junit4]   2> 16298 T331 oashc.HttpShardHandlerFactory.getParameter Setting maxConnectionsPerHost to: 20
[junit4:junit4]   2> 16299 T331 oashc.HttpShardHandlerFactory.getParameter Setting corePoolSize to: 0
[junit4:junit4]   2> 16299 T331 oashc.HttpShardHandlerFactory.getParameter Setting maximumPoolSize to: 2147483647
[junit4:junit4]   2> 16300 T331 oashc.HttpShardHandlerFactory.getParameter Setting maxThreadIdleTime to: 5
[junit4:junit4]   2> 16300 T331 oashc.HttpShardHandlerFactory.getParameter Setting sizeOfQueue to: -1
[junit4:junit4]   2> 16301 T331 oashc.HttpShardHandlerFactory.getParameter Setting fairnessPolicy to: false
[junit4:junit4]   2> 16302 T331 oascsi.HttpClientUtil.createClient Creating new http client, config:maxConnectionsPerHost=20&maxConnections=10000&socketTimeout=0&connTimeout=0&retry=false
[junit4:junit4]   2> 16331 T331 oascc.ZkStateReader.createClusterStateWatchersAndUpdate Updating cluster state from ZooKeeper... 
[junit4:junit4]   2> 16386 T403 oasc.CoreContainer.create Creating SolrCore 'collection1' using instanceDir: /usr/home/hudson/hudson-slave/workspace/Lucene-Solr-Tests-trunk-java7/solr/build/solr-core/test/J0/./org.apache.solr.cloud.BasicDistributedZk2Test-jetty3-1355627556764/collection1
[junit4:junit4]   2> 16386 T403 oasc.ZkController.createCollectionZkNode Check for collection zkNode:collection1
[junit4:junit4]   2> 16388 T403 oasc.ZkController.createCollectionZkNode Collection zkNode exists
[junit4:junit4]   2> 16388 T403 oasc.ZkController.readConfigName Load collection config from:/collections/collection1
[junit4:junit4]   2> 16391 T403 oasc.SolrResourceLoader.<init> new SolrResourceLoader for directory: '/usr/home/hudson/hudson-slave/workspace/Lucene-Solr-Tests-trunk-java7/solr/build/solr-core/test/J0/./org.apache.solr.cloud.BasicDistributedZk2Test-jetty3-1355627556764/collection1/'
[junit4:junit4]   2> 16405 T403 oasc.SolrResourceLoader.replaceClassLoader Adding 'file:/usr/home/hudson/hudson-slave/workspace/Lucene-Solr-Tests-trunk-java7/solr/build/solr-core/test/J0/org.apache.solr.cloud.BasicDistributedZk2Test-jetty3-1355627556764/collection1/lib/README' to classloader
[junit4:junit4]   2> 16406 T403 oasc.SolrResourceLoader.replaceClassLoader Adding 'file:/usr/home/hudson/hudson-slave/workspace/Lucene-Solr-Tests-trunk-java7/solr/build/solr-core/test/J0/org.apache.solr.cloud.BasicDistributedZk2Test-jetty3-1355627556764/collection1/lib/classes/' to classloader
[junit4:junit4]   2> 16519 T403 oasc.SolrConfig.<init> Using Lucene MatchVersion: LUCENE_50
[junit4:junit4]   2> 16687 T403 oasc.SolrConfig.<init> Loaded SolrConfig: solrconfig.xml
[junit4:junit4]   2> 16788 T403 oass.IndexSchema.readSchema Reading Solr Schema
[junit4:junit4]   2> 16810 T403 oass.IndexSchema.readSchema Schema name=test
[junit4:junit4]   2> 18106 T403 oass.OpenExchangeRatesOrgProvider.init Initialized with rates=open-exchange-rates.json, refreshInterval=1440.
[junit4:junit4]   2> 18119 T403 oass.IndexSchema.readSchema default search field in schema is text
[junit4:junit4]   2> 18123 T403 oass.IndexSchema.readSchema unique key field: id
[junit4:junit4]   2> 18148 T403 oass.FileExchangeRateProvider.reload Reloading exchange rates from file currency.xml
[junit4:junit4]   2> 18155 T403 oass.FileExchangeRateProvider.reload Reloading exchange rates from file currency.xml
[junit4:junit4]   2> 18161 T403 oass.OpenExchangeRatesOrgProvider.reload Reloading exchange rates from open-exchange-rates.json
[junit4:junit4]   2> 18163 T403 oass.OpenExchangeRatesOrgProvider.reload Reloading exchange rates from open-exchange-rates.json
[junit4:junit4]   2> 18166 T403 oasc.SolrCore.<init> [collection1] Opening new SolrCore at /usr/home/hudson/hudson-slave/workspace/Lucene-Solr-Tests-trunk-java7/solr/build/solr-core/test/J0/./org.apache.solr.cloud.BasicDistributedZk2Test-jetty3-1355627556764/collection1/, dataDir=./org.apache.solr.cloud.BasicDistributedZk2Test-1355627541171/jetty3/
[junit4:junit4]   2> 18166 T403 oasc.JmxMonitoredMap.<init> JMX monitoring is enabled. Adding Solr mbeans to JMX Server: com.sun.jmx.mbeanserver.JmxMBeanServer@22bb1eab
[junit4:junit4]   2> 18167 T403 oasc.SolrCore.initDirectoryFactory solr.NRTCachingDirectoryFactory
[junit4:junit4]   2> 18201 T403 oasc.CachingDirectoryFactory.get return new directory for /usr/home/hudson/hudson-slave/workspace/Lucene-Solr-Tests-trunk-java7/solr/build/solr-core/test/J0/./org.apache.solr.cloud.BasicDistributedZk2Test-1355627541171/jetty3 forceNew:false
[junit4:junit4]   2> 18202 T403 oasc.CachingDirectoryFactory.close Releasing directory:/usr/home/hudson/hudson-slave/workspace/Lucene-Solr-Tests-trunk-java7/solr/build/solr-core/test/J0/./org.apache.solr.cloud.BasicDistributedZk2Test-1355627541171/jetty3
[junit4:junit4]   2> 18202 T403 oasc.SolrCore.getNewIndexDir New index directory detected: old=null new=./org.apache.solr.cloud.BasicDistributedZk2Test-1355627541171/jetty3/index/
[junit4:junit4]   2> 18203 T403 oasc.SolrCore.initIndex WARNING [collection1] Solr index directory './org.apache.solr.cloud.BasicDistributedZk2Test-1355627541171/jetty3/index' doesn't exist. Creating new index...
[junit4:junit4]   2> 18204 T403 oasc.CachingDirectoryFactory.get return new directory for /usr/home/hudson/hudson-slave/workspace/Lucene-Solr-Tests-trunk-java7/solr/build/solr-core/test/J0/./org.apache.solr.cloud.BasicDistributedZk2Test-1355627541171/jetty3/index forceNew:false
[junit4:junit4]   2> 18329 T403 oasc.SolrDeletionPolicy.onCommit SolrDeletionPolicy.onCommit: commits:num=1
[junit4:junit4]   2> 		commit{dir=RateLimitedDirectoryWrapper(NRTCachingDirectory(org.apache.lucene.store.NIOFSDirectory@/usr/home/hudson/hudson-slave/workspace/Lucene-Solr-Tests-trunk-java7/solr/build/solr-core/test/J0/org.apache.solr.cloud.BasicDistributedZk2Test-1355627541171/jetty3/index lockFactory=org.apache.lucene.store.NativeFSLockFactory@4a99eb16; maxCacheMB=48.0 maxMergeSizeMB=4.0)),segFN=segments_1,generation=1,filenames=[segments_1]
[junit4:junit4]   2> 18329 T403 oasc.SolrDeletionPolicy.updateCommits newest commit = 1[segments_1]
[junit4:junit4]   2> 18339 T403 oasc.CachingDirectoryFactory.close Releasing directory:/usr/home/hudson/hudson-slave/workspace/Lucene-Solr-Tests-trunk-java7/solr/build/solr-core/test/J0/./org.apache.solr.cloud.BasicDistributedZk2Test-1355627541171/jetty3/index
[junit4:junit4]   2> 18340 T403 oasc.SolrCore.initWriters created xml: solr.XMLResponseWriter
[junit4:junit4]   2> 18343 T403 oasup.UpdateRequestProcessorChain.init inserting DistributedUpdateProcessorFactory into updateRequestProcessorChain "dedupe"
[junit4:junit4]   2> 18344 T403 oasup.UpdateRequestProcessorChain.init inserting DistributedUpdateProcessorFactory into updateRequestProcessorChain "dedupe-allfields"
[junit4:junit4]   2> 18344 T403 oasup.UpdateRequestProcessorChain.init inserting DistributedUpdateProcessorFactory into updateRequestProcessorChain "stored_sig"
[junit4:junit4]   2> 18345 T403 oasup.UpdateRequestProcessorChain.init inserting DistributedUpdateProcessorFactory into updateRequestProcessorChain "uniq-fields"
[junit4:junit4]   2> 18346 T403 oasup.UpdateRequestProcessorChain.init inserting DistributedUpdateProcessorFactory into updateRequestProcessorChain "distrib-dup-test-chain-implicit"
[junit4:junit4]   2> 18346 T403 oasc.RequestHandlers.initHandlersFromConfig adding lazy requestHandler: solr.ReplicationHandler
[junit4:junit4]   2> 18347 T403 oasc.RequestHandlers.initHandlersFromConfig created /replication: solr.ReplicationHandler
[junit4:junit4]   2> 18348 T403 oasc.RequestHandlers.initHandlersFromConfig created standard: solr.StandardRequestHandler
[junit4:junit4]   2> 18350 T403 oasc.RequestHandlers.initHandlersFromConfig created /get: solr.RealTimeGetHandler
[junit4:junit4]   2> 18351 T403 oasc.RequestHandlers.initHandlersFromConfig created dismax: solr.SearchHandler
[junit4:junit4]   2> 18353 T403 oasc.RequestHandlers.initHandlersFromConfig created mock: org.apache.solr.core.MockQuerySenderListenerReqHandler
[junit4:junit4]   2> 18354 T403 oasc.RequestHandlers.initHandlersFromConfig created /admin/: org.apache.solr.handler.admin.AdminHandlers
[junit4:junit4]   2> 18355 T403 oasc.RequestHandlers.initHandlersFromConfig created defaults: solr.StandardRequestHandler
[junit4:junit4]   2> 18355 T403 oasc.RequestHandlers.initHandlersFromConfig adding lazy requestHandler: solr.StandardRequestHandler
[junit4:junit4]   2> 18356 T403 oasc.RequestHandlers.initHandlersFromConfig created lazy: solr.StandardRequestHandler
[junit4:junit4]   2> 18357 T403 oasc.RequestHandlers.initHandlersFromConfig created /update: solr.UpdateRequestHandler
[junit4:junit4]   2> 18359 T403 oasc.RequestHandlers.initHandlersFromConfig created /terms: org.apache.solr.handler.component.SearchHandler
[junit4:junit4]   2> 18360 T403 oasc.RequestHandlers.initHandlersFromConfig created spellCheckCompRH: org.apache.solr.handler.component.SearchHandler
[junit4:junit4]   2> 18362 T403 oasc.RequestHandlers.initHandlersFromConfig created spellCheckCompRH_Direct: org.apache.solr.handler.component.SearchHandler
[junit4:junit4]   2> 18363 T403 oasc.RequestHandlers.initHandlersFromConfig created spellCheckWithWordbreak: org.apache.solr.handler.component.SearchHandler
[junit4:junit4]   2> 18365 T403 oasc.RequestHandlers.initHandlersFromConfig created spellCheckWithWordbreak_Direct: org.apache.solr.handler.component.SearchHandler
[junit4:junit4]   2> 18366 T403 oasc.RequestHandlers.initHandlersFromConfig created spellCheckCompRH1: org.apache.solr.handler.component.SearchHandler
[junit4:junit4]   2> 18368 T403 oasc.RequestHandlers.initHandlersFromConfig created mltrh: org.apache.solr.handler.component.SearchHandler
[junit4:junit4]   2> 18369 T403 oasc.RequestHandlers.initHandlersFromConfig created tvrh: org.apache.solr.handler.component.SearchHandler
[junit4:junit4]   2> 18371 T403 oasc.RequestHandlers.initHandlersFromConfig created /mlt: solr.MoreLikeThisHandler
[junit4:junit4]   2> 18372 T403 oasc.RequestHandlers.initHandlersFromConfig created /debug/dump: solr.DumpRequestHandler
[junit4:junit4]   2> 18409 T403 oashl.XMLLoader.init xsltCacheLifetimeSeconds=60
[junit4:junit4]   2> 18415 T403 oasc.SolrCore.initDeprecatedSupport WARNING solrconfig.xml uses deprecated <admin/gettableFiles>, Please update your config to use the ShowFileRequestHandler.
[junit4:junit4]   2> 18418 T403 oasc.SolrCore.initDeprecatedSupport WARNING adding ShowFileRequestHandler with hidden files: [SCHEMA.XML, OLD_SYNONYMS.TXT, STOPWORDS.TXT, PROTWORDS.TXT, OPEN-EXCHANGE-RATES.JSON, SYNONYMS.TXT, CURRENCY.XML, MAPPING-ISOLATIN1ACCENT.TXT]
[junit4:junit4]   2> 18421 T403 oasc.CachingDirectoryFactory.close Releasing directory:/usr/home/hudson/hudson-slave/workspace/Lucene-Solr-Tests-trunk-java7/solr/build/solr-core/test/J0/./org.apache.solr.cloud.BasicDistributedZk2Test-1355627541171/jetty3
[junit4:junit4]   2> 18424 T403 oass.SolrIndexSearcher.<init> Opening Searcher@1e95aeb7 main
[junit4:junit4]   2> 18425 T403 oasu.CommitTracker.<init> Hard AutoCommit: disabled
[junit4:junit4]   2> 18425 T403 oasu.CommitTracker.<init> Soft AutoCommit: disabled
[junit4:junit4]   2> 18426 T403 oashc.SpellCheckComponent.inform Initializing spell checkers
[junit4:junit4]   2> 18481 T403 oass.DirectSolrSpellChecker.init init: {name=direct,classname=DirectSolrSpellChecker,field=lowerfilt,minQueryLength=3}
[junit4:junit4]   2> 18677 T404 oasc.SolrCore.registerSearcher [collection1] Registered new searcher Searcher@1e95aeb7 main{StandardDirectoryReader(segments_1:1)}
[junit4:junit4]   2> 18685 T403 oasc.ZkController.publish publishing core=collection1 state=down
[junit4:junit4]   2> 18685 T403 oasc.ZkController.publish numShards not found on descriptor - reading it from system property
[junit4:junit4]   2> 19187 T354 oascc.ZkStateReader.updateClusterState Updating cloud state from ZooKeeper... 
[junit4:junit4]   2> 19188 T354 oasc.Overseer$ClusterStateUpdater.updateState Update state numShards=2 message={
[junit4:junit4]   2> 	  "operation":"state",
[junit4:junit4]   2> 	  "numShards":"2",
[junit4:junit4]   2> 	  "shard":null,
[junit4:junit4]   2> 	  "roles":null,
[junit4:junit4]   2> 	  "state":"down",
[junit4:junit4]   2> 	  "core":"collection1",
[junit4:junit4]   2> 	  "collection":"collection1",
[junit4:junit4]   2> 	  "node_name":"127.0.0.1:10913_",
[junit4:junit4]   2> 	  "base_url":"http://127.0.0.1:10913"}
[junit4:junit4]   2> 19189 T354 oasc.Overseer$ClusterStateUpdater.updateState Collection already exists with numShards=2
[junit4:junit4]   2> 19189 T354 oasc.Overseer$ClusterStateUpdater.updateState Assigning new node to shard shard=shard1
[junit4:junit4]   2> 19258 T402 oascc.ZkStateReader$2.process A cluster state change: WatchedEvent state:SyncConnected type:NodeDataChanged path:/clusterstate.json, has occurred - updating... (live nodes size: 4)
[junit4:junit4]   2> 19258 T387 oascc.ZkStateReader$2.process A cluster state change: WatchedEvent state:SyncConnected type:NodeDataChanged path:/clusterstate.json, has occurred - updating... (live nodes size: 4)
[junit4:junit4]   2> 19258 T372 oascc.ZkStateReader$2.process A cluster state change: WatchedEvent state:SyncConnected type:NodeDataChanged path:/clusterstate.json, has occurred - updating... (live nodes size: 4)
[junit4:junit4]   2> 19258 T359 oascc.ZkStateReader$2.process A cluster state change: WatchedEvent state:SyncConnected type:NodeDataChanged path:/clusterstate.json, has occurred - updating... (live nodes size: 4)
[junit4:junit4]   2> 19258 T353 oascc.ZkStateReader$2.process A cluster state change: WatchedEvent state:SyncConnected type:NodeDataChanged path:/clusterstate.json, has occurred - updating... (live nodes size: 4)
[junit4:junit4]   2> 19707 T403 oasc.CoreContainer.registerCore registering core: collection1
[junit4:junit4]   2> 19707 T403 oasc.ZkController.register Register shard - core:collection1 address:http://127.0.0.1:10913 shardId:shard1
[junit4:junit4]   2> 19717 T403 oasc.ZkController.register We are http://127.0.0.1:10913/collection1/ and leader is http://127.0.0.1:59076/collection1/
[junit4:junit4]   2> 19718 T403 oasc.ZkController.register No LogReplay needed for core=collection1 baseURL=http://127.0.0.1:10913
[junit4:junit4]   2> 19718 T403 oasc.ZkController.checkRecovery Core needs to recover:collection1
[junit4:junit4]   2> 19718 T403 oasu.DefaultSolrCoreState.doRecovery Running recovery - first canceling any ongoing recovery
[junit4:junit4]   2> ASYNC  NEW_CORE C34 name=collection1 org.apache.solr.core.SolrCore@7ce08f5f url=http://127.0.0.1:10913/collection1 node=127.0.0.1:10913_
[junit4:junit4]   2> 19725 T405 C34 P10913 oasc.RecoveryStrategy.run Starting recovery process.  core=collection1 recoveringAfterStartup=true
[junit4:junit4]   2> 19726 T403 oascc.ZkStateReader.updateClusterState Updating cloud state from ZooKeeper... 
[junit4:junit4]   2> 19727 T405 C34 P10913 oasc.RecoveryStrategy.doRecovery ###### startupVersions=[]
[junit4:junit4]   2> 19727 T405 C34 P10913 oasc.ZkController.publish publishing core=collection1 state=recovering
[junit4:junit4]   2> 19728 T405 C34 P10913 oasc.ZkController.publish numShards not found on descriptor - reading it from system property
[junit4:junit4]   2> 19728 T331 oass.SolrDispatchFilter.init user.dir=/usr/home/hudson/hudson-slave/workspace/Lucene-Solr-Tests-trunk-java7/solr/build/solr-core/test/J0
[junit4:junit4]   2> 19729 T331 oass.SolrDispatchFilter.init SolrDispatchFilter.init() done
[junit4:junit4]   2> 19730 T331 oascsi.HttpClientUtil.createClient Creating new http client, config:maxConnections=128&maxConnectionsPerHost=32&followRedirects=false
[junit4:junit4]   2> 19735 T405 C34 P10913 oasc.RecoveryStrategy.doRecovery Attempting to PeerSync from http://127.0.0.1:59076/collection1/ core=collection1 - recoveringAfterStartup=true
[junit4:junit4]   2> 19773 T405 C34 P10913 oascsi.HttpClientUtil.createClient Creating new http client, config:maxConnectionsPerHost=20&maxConnections=10000&connTimeout=30000&socketTimeout=30000&retry=false
[junit4:junit4]   2> 19798 T354 oascc.ZkStateReader.updateClusterState Updating cloud state from ZooKeeper... 
[junit4:junit4]   2> 19799 T354 oasc.Overseer$ClusterStateUpdater.updateState Update state numShards=2 message={
[junit4:junit4]   2> 	  "operation":"state",
[junit4:junit4]   2> 	  "numShards":"2",
[junit4:junit4]   2> 	  "shard":"shard1",
[junit4:junit4]   2> 	  "roles":null,
[junit4:junit4]   2> 	  "state":"recovering",
[junit4:junit4]   2> 	  "core":"collection1",
[junit4:junit4]   2> 	  "collection":"collection1",
[junit4:junit4]   2> 	  "node_name":"127.0.0.1:10913_",
[junit4:junit4]   2> 	  "base_url":"http://127.0.0.1:10913"}
[junit4:junit4]   2> 19800 T405 C34 P10913 oasu.PeerSync.sync PeerSync: core=collection1 url=http://127.0.0.1:10913 START replicas=[http://127.0.0.1:59076/collection1/] nUpdates=100
[junit4:junit4]   2> 19801 T405 C34 P10913 oasu.PeerSync.sync WARNING no frame of reference to tell of we've missed updates
[junit4:junit4]   2> 19802 T405 C34 P10913 oasc.RecoveryStrategy.doRecovery PeerSync Recovery was not successful - trying replication. core=collection1
[junit4:junit4]   2> 19802 T405 C34 P10913 oasc.RecoveryStrategy.doRecovery Starting Replication Recovery. core=collection1
[junit4:junit4]   2> 19802 T405 C34 P10913 oascsi.HttpClientUtil.createClient Creating new http client, config:maxConnections=128&maxConnectionsPerHost=32&followRedirects=false
[junit4:junit4]   2> ASYNC  NEW_CORE C35 name=collection1 org.apache.solr.core.SolrCore@79957756 url=http://127.0.0.1:59076/collection1 node=127.0.0.1:59076_
[junit4:junit4]   2> 19813 T362 C35 P59076 REQ /get {distrib=false&qt=/get&wt=javabin&version=2&getVersions=100} status=0 QTime=0 
[junit4:junit4]   2> 19838 T387 oascc.ZkStateReader$2.process A cluster state change: WatchedEvent state:SyncConnected type:NodeDataChanged path:/clusterstate.json, has occurred - updating... (live nodes size: 4)
[junit4:junit4]   2> 19839 T372 oascc.ZkStateReader$2.process A cluster state change: WatchedEvent state:SyncConnected type:NodeDataChanged path:/clusterstate.json, has occurred - updating... (live nodes size: 4)
[junit4:junit4]   2> 19839 T402 oascc.ZkStateReader$2.process A cluster state change: WatchedEvent state:SyncConnected type:NodeDataChanged path:/clusterstate.json, has occurred - updating... (live nodes size: 4)
[junit4:junit4]   2> 19839 T353 oascc.ZkStateReader$2.process A cluster state change: WatchedEvent state:SyncConnected type:NodeDataChanged path:/clusterstate.json, has occurred - updating... (live nodes size: 4)
[junit4:junit4]   2> 19839 T359 oascc.ZkStateReader$2.process A cluster state change: WatchedEvent state:SyncConnected type:NodeDataChanged path:/clusterstate.json, has occurred - updating... (live nodes size: 4)
[junit4:junit4]   2> 20137 T331 oejs.Server.doStart jetty-8.1.8.v20121106
[junit4:junit4]   2> 20140 T331 oejs.AbstractConnector.doStart Started SocketConnector@127.0.0.1:22073
[junit4:junit4]   2> 20141 T331 oasc.SolrResourceLoader.locateSolrHome JNDI not configured for solr (NoInitialContextEx)
[junit4:junit4]   2> 20141 T331 oasc.SolrResourceLoader.locateSolrHome using system property solr.solr.home: /usr/home/hudson/hudson-slave/workspace/Lucene-Solr-Tests-trunk-java7/solr/build/solr-core/test/J0/./org.apache.solr.cloud.BasicDistributedZk2Test-jetty4-1355627560933
[junit4:junit4]   2> 20142 T331 oasc.SolrResourceLoader.<init> new SolrResourceLoader for deduced Solr Home: '/usr/home/hudson/hudson-slave/workspace/Lucene-Solr-Tests-trunk-java7/solr/build/solr-core/test/J0/./org.apache.solr.cloud.BasicDistributedZk2Test-jetty4-1355627560933/'
[junit4:junit4]   2> 20218 T331 oass.SolrDispatchFilter.init SolrDispatchFilter.init()
[junit4:junit4]   2> 20219 T331 oasc.SolrResourceLoader.locateSolrHome JNDI not configured for solr (NoInitialContextEx)
[junit4:junit4]   2> 20220 T331 oasc.SolrResourceLoader.locateSolrHome using system property solr.solr.home: /usr/home/hudson/hudson-slave/workspace/Lucene-Solr-Tests-trunk-java7/solr/build/solr-core/test/J0/./org.apache.solr.cloud.BasicDistributedZk2Test-jetty4-1355627560933
[junit4:junit4]   2> 20221 T331 oasc.CoreContainer$Initializer.initialize looking for solr.xml: /usr/home/hudson/hudson-slave/workspace/Lucene-Solr-Tests-trunk-java7/solr/build/solr-core/test/J0/./org.apache.solr.cloud.BasicDistributedZk2Test-jetty4-1355627560933/solr.xml
[junit4:junit4]   2> 20222 T331 oasc.CoreContainer.<init> New CoreContainer 1674543426
[junit4:junit4]   2> 20223 T331 oasc.CoreContainer.load Loading CoreContainer using Solr Home: '/usr/home/hudson/hudson-slave/workspace/Lucene-Solr-Tests-trunk-java7/solr/build/solr-core/test/J0/./org.apache.solr.cloud.BasicDistributedZk2Test-jetty4-1355627560933/'
[junit4:junit4]   2> 20224 T331 oasc.SolrResourceLoader.<init> new SolrResourceLoader for directory: '/usr/home/hudson/hudson-slave/workspace/Lucene-Solr-Tests-trunk-java7/solr/build/solr-core/test/J0/./org.apache.solr.cloud.BasicDistributedZk2Test-jetty4-1355627560933/'
[junit4:junit4]   2> 20364 T331 oasc.CoreContainer.load Registering Log Listener
[junit4:junit4]   2> 20405 T331 oasc.CoreContainer.initZooKeeper Zookeeper client=127.0.0.1:15950/solr
[junit4:junit4]   2> 20406 T331 oasc.ZkController.checkChrootPath zkHost includes chroot
[junit4:junit4]   2> 20407 T331 oaz.ZooKeeper.<init> Initiating client connection, connectString=127.0.0.1:15950 sessionTimeout=60000 watcher=org.apache.solr.common.cloud.ConnectionManager@400aaa66
[junit4:junit4]   2> 20409 T331 oascc.ConnectionManager.waitForConnected Waiting for client to connect to ZooKeeper
[junit4:junit4]   2> 20409 T416 oaz.ClientCnxn$SendThread.logStartConnect Opening socket connection to server localhost/127.0.0.1:15950. Will not attempt to authenticate using SASL (access denied ("javax.security.auth.AuthPermission" "getLoginConfiguration"))
[junit4:junit4]   2> 20411 T416 oaz.ClientCnxn$SendThread.primeConnection Socket connection established to localhost/127.0.0.1:15950, initiating session
[junit4:junit4]   2> 20411 T333 oazs.NIOServerCnxnFactory.run Accepted socket connection from /140.211.11.196:55713
[junit4:junit4]   2> 20412 T333 oazs.ZooKeeperServer.processConnectRequest Client attempting to establish new session at /140.211.11.196:55713
[junit4:junit4]   2> 20415 T335 oazs.ZooKeeperServer.finishSessionInit Established session 0x13ba1b2b4c6000b with negotiated timeout 20000 for client /140.211.11.196:55713
[junit4:junit4]   2> 20415 T416 oaz.ClientCnxn$SendThread.onConnected Session establishment complete on server localhost/127.0.0.1:15950, sessionid = 0x13ba1b2b4c6000b, negotiated timeout = 20000
[junit4:junit4]   2> 20415 T417 oascc.ConnectionManager.process Watcher org.apache.solr.common.cloud.ConnectionManager@400aaa66 name:ZooKeeperConnection Watcher:127.0.0.1:15950 got event WatchedEvent state:SyncConnected type:None path:null path:null type:None
[junit4:junit4]   2> 20416 T331 oascc.ConnectionManager.waitForConnected Client is connected to ZooKeeper
[junit4:junit4]   2> 20418 T338 oazs.PrepRequestProcessor.pRequest2Txn Processed session termination for sessionid: 0x13ba1b2b4c6000b
[junit4:junit4]   2> 20460 T333 oazs.NIOServerCnxn.closeSock Closed socket connection for client /140.211.11.196:55713 which had sessionid 0x13ba1b2b4c6000b
[junit4:junit4]   2> 20460 T417 oaz.ClientCnxn$EventThread.run EventThread shut down
[junit4:junit4]   2> 20460 T331 oaz.ZooKeeper.close Session: 0x13ba1b2b4c6000b closed
[junit4:junit4]   2> 20461 T331 oaz.ZooKeeper.<init> Initiating client connection, connectString=127.0.0.1:15950/solr sessionTimeout=8000 watcher=org.apache.solr.common.cloud.ConnectionManager@3a26243f
[junit4:junit4]   2> 20463 T331 oascc.ConnectionManager.waitForConnected Waiting for client to connect to ZooKeeper
[junit4:junit4]   2> 20468 T418 oaz.ClientCnxn$SendThread.logStartConnect Opening socket connection to server localhost/127.0.0.1:15950. Will not attempt to authenticate using SASL (access denied ("javax.security.auth.AuthPermission" "getLoginConfiguration"))
[junit4:junit4]   2> 20468 T418 oaz.ClientCnxn$SendThread.primeConnection Socket connection established to localhost/127.0.0.1:15950, initiating session
[junit4:junit4]   2> 20468 T333 oazs.NIOServerCnxnFactory.run Accepted socket connection from /140.211.11.196:53917
[junit4:junit4]   2> 20469 T333 oazs.ZooKeeperServer.processConnectRequest Client attempting to establish new session at /140.211.11.196:53917
[junit4:junit4]   2> 20471 T335 oazs.ZooKeeperServer.finishSessionInit Established session 0x13ba1b2b4c6000c with negotiated timeout 8000 for client /140.211.11.196:53917
[junit4:junit4]   2> 20471 T418 oaz.ClientCnxn$SendThread.onConnected Session establishment complete on server localhost/127.0.0.1:15950, sessionid = 0x13ba1b2b4c6000c, negotiated timeout = 8000
[junit4:junit4]   2> 20472 T419 oascc.ConnectionManager.process Watcher org.apache.solr.common.cloud.ConnectionManager@3a26243f name:ZooKeeperConnection Watcher:127.0.0.1:15950/solr got event WatchedEvent state:SyncConnected type:None path:null path:null type:None
[junit4:junit4]   2> 20472 T331 oascc.ConnectionManager.waitForConnected Client is connected to ZooKeeper
[junit4:junit4]   2> 20474 T338 oazs.PrepRequestProcessor.pRequest Got user-level KeeperException when processing sessionid:0x13ba1b2b4c6000c type:create cxid:0x1 zxid:0xa7 txntype:-1 reqpath:n/a Error Path:/solr/overseer Error:KeeperErrorCode = NodeExists for /solr/overseer
[junit4:junit4]   2> 20490 T338 oazs.PrepRequestProcessor.pRequest Got user-level KeeperException when processing sessionid:0x13ba1b2b4c6000c type:create cxid:0x2 zxid:0xa8 txntype:-1 reqpath:n/a Error Path:/solr/overseer Error:KeeperErrorCode = NodeExists for /solr/overseer
[junit4:junit4]   2> 20495 T331 oasc.ZkController.createEphemeralLiveNode Register node as live in ZooKeeper:/live_nodes/127.0.0.1:22073_
[junit4:junit4]   2> 20496 T338 oazs.PrepRequestProcessor.pRequest Got user-level KeeperException when processing sessionid:0x13ba1b2b4c6000c type:delete cxid:0x4 zxid:0xa9 txntype:-1 reqpath:n/a Error Path:/solr/live_nodes/127.0.0.1:22073_ Error:KeeperErrorCode = NoNode for /solr/live_nodes/127.0.0.1:22073_
[junit4:junit4]   2> 20551 T331 oascc.SolrZkClient.makePath makePath: /live_nodes/127.0.0.1:22073_
[junit4:junit4]   2> 20560 T387 oascc.ZkStateReader$2.process A cluster state change: WatchedEvent state:SyncConnected type:NodeChildrenChanged path:/live_nodes, has occurred - updating... (live nodes size: 4)
[junit4:junit4]   2> 20561 T359 oascc.ZkStateReader$3.process Updating live nodes... (5)
[junit4:junit4]   2> 20561 T353 oascc.ZkStateReader$3.process Updating live nodes... (5)
[junit4:junit4]   2> 20562 T402 oascc.ZkStateReader$3.process Updating live nodes... (5)
[junit4:junit4]   2> 20562 T359 oascc.ZkStateReader$2.process A cluster state change: WatchedEvent state:SyncConnected type:NodeChildrenChanged path:/live_nodes, has occurred - updating... (live nodes size: 5)
[junit4:junit4]   2> 20561 T372 oascc.ZkStateReader$3.process Updating live nodes... (5)
[junit4:junit4]   2> 20562 T402 oascc.ZkStateReader$2.process A cluster state change: WatchedEvent state:SyncConnected type:NodeChildrenChanged path:/live_nodes, has occurred - updating... (live nodes size: 5)
[junit4:junit4]   2> 20562 T353 oascc.ZkStateReader$2.process A cluster state change: WatchedEvent state:SyncConnected type:NodeChildrenChanged path:/live_nodes, has occurred - updating... (live nodes size: 5)
[junit4:junit4]   2> 20563 T372 oascc.ZkStateReader$2.process A cluster state change: WatchedEvent state:SyncConnected type:NodeChildrenChanged path:/live_nodes, has occurred - updating... (live nodes size: 5)
[junit4:junit4]   2> 20565 T331 oashc.HttpShardHandlerFactory.getParameter Setting socketTimeout to: 0
[junit4:junit4]   2> 20565 T331 oashc.HttpShardHandlerFactory.getParameter Setting urlScheme to: http://
[junit4:junit4]   2> 20566 T331 oashc.HttpShardHandlerFactory.getParameter Setting connTimeout to: 0
[junit4:junit4]   2> 20567 T331 oashc.HttpShardHandlerFactory.getParameter Setting maxConnectionsPerHost to: 20
[junit4:junit4]   2> 20567 T331 oashc.HttpShardHandlerFactory.getParameter Setting corePoolSize to: 0
[junit4:junit4]   2> 20568 T331 oashc.HttpShardHandlerFactory.getParameter Setting maximumPoolSize to: 2147483647
[junit4:junit4]   2> 20569 T331 oashc.HttpShardHandlerFactory.getParameter Setting maxThreadIdleTime to: 5
[junit4:junit4]   2> 20569 T331 oashc.HttpShardHandlerFactory.getParameter Setting sizeOfQueue to: -1
[junit4:junit4]   2> 20570 T331 oashc.HttpShardHandlerFactory.getParameter Setting fairnessPolicy to: false
[junit4:junit4]   2> 20570 T331 oascsi.HttpClientUtil.createClient Creating new http client, config:maxConnectionsPerHost=20&maxConnections=10000&socketTimeout=0&connTimeout=0&retry=false
[junit4:junit4]   2> 20571 T387 oascc.ZkStateReader$3.process Updating live nodes... (5)
[junit4:junit4]   2> 20600 T331 oascc.ZkStateReader.createClusterStateWatchersAndUpdate Updating cluster state from ZooKeeper... 
[junit4:junit4]   2> 20611 T420 oasc.CoreContainer.create Creating SolrCore 'collection1' using instanceDir: /usr/home/hudson/hudson-slave/workspace/Lucene-Solr-Tests-trunk-java7/solr/build/solr-core/test/J0/./org.apache.solr.cloud.BasicDistributedZk2Test-jetty4-1355627560933/collection1
[junit4:junit4]   2> 20611 T420 oasc.ZkController.createCollectionZkNode Check for collection zkNode:collection1
[junit4:junit4]   2> 20612 T420 oasc.ZkController.createCollectionZkNode Collection zkNode exists
[junit4:junit4]   2> 20613 T420 oasc.ZkController.readConfigName Load collection config from:/collections/collection1
[junit4:junit4]   2> 20615 T420 oasc.SolrResourceLoader.<init> new SolrResourceLoader for directory: '/usr/home/hudson/hudson-slave/workspace/Lucene-Solr-Tests-trunk-java7/solr/build/solr-core/test/J0/./org.apache.solr.cloud.BasicDistributedZk2Test-jetty4-1355627560933/collection1/'
[junit4:junit4]   2> 20616 T420 oasc.SolrResourceLoader.replaceClassLoader Adding 'file:/usr/home/hudson/hudson-slave/workspace/Lucene-Solr-Tests-trunk-java7/solr/build/solr-core/test/J0/org.apache.solr.cloud.BasicDistributedZk2Test-jetty4-1355627560933/collection1/lib/classes/' to classloader
[junit4:junit4]   2> 20617 T420 oasc.SolrResourceLoader.replaceClassLoader Adding 'file:/usr/home/hudson/hudson-slave/workspace/Lucene-Solr-Tests-trunk-java7/solr/build/solr-core/test/J0/org.apache.solr.cloud.BasicDistributedZk2Test-jetty4-1355627560933/collection1/lib/README' to classloader
[junit4:junit4]   2> 20713 T420 oasc.SolrConfig.<init> Using Lucene MatchVersion: LUCENE_50
[junit4:junit4]   2> 20826 T420 oasc.SolrConfig.<init> Loaded SolrConfig: solrconfig.xml
[junit4:junit4]   2> 20927 T420 oass.IndexSchema.readSchema Reading Solr Schema
[junit4:junit4]   2> 20954 T420 oass.IndexSchema.readSchema Schema name=test
[junit4:junit4]   2>  C34_STATE=coll:collection1 core:collection1 props:{shard=shard1, roles=null, state=recovering, core=collection1, collection=collection1, node_name=127.0.0.1:10913_, base_url=http://127.0.0.1:10913}
[junit4:junit4]   2> 21853 T405 C34 P10913 oasc.RecoveryStrategy.doRecovery Begin buffering updates. core=collection1
[junit4:junit4]   2> 21853 T405 C34 P10913 oasu.UpdateLog.bufferUpdates Starting to buffer updates. FSUpdateLog{state=ACTIVE, tlog=null}
[junit4:junit4]   2> 21854 T405 C34 P10913 oasc.RecoveryStrategy.replicate Attempting to replicate from http://127.0.0.1:59076/collection1/. core=collection1
[junit4:junit4]   2> 21854 T405 C34 P10913 oascsi.HttpClientUtil.createClient Creating new http client, config:maxConnections=128&maxConnectionsPerHost=32&followRedirects=false
[junit4:junit4]   2> 21892 T364 C35 P59076 oascsi.HttpClientUtil.createClient Creating new http client, config:maxConnections=500&maxConnectionsPerHost=16
[junit4:junit4]   2> 21915 T364 C35 P59076 oasu.DirectUpdateHandler2.commit start commit{flags=0,_version_=0,optimize=false,openSearcher=false,waitSearcher=true,expungeDeletes=false,softCommit=false}
[junit4:junit4]   2> 21917 T364 C35 P59076 oasc.CachingDirectoryFactory.close Releasing directory:/usr/home/hudson/hudson-slave/workspace/Lucene-Solr-Tests-trunk-java7/solr/build/solr-core/test/J0/./org.apache.solr.cloud.BasicDistributedZk2Test-1355627541171/jetty1
[junit4:junit4]   2> 21938 T364 C35 P59076 oasc.SolrDeletionPolicy.onInit SolrDeletionPolicy.onInit: commits:num=1
[junit4:junit4]   2> 		commit{dir=RateLimitedDirectoryWrapper(NRTCachingDirectory(org.apache.lucene.store.NIOFSDirectory@/usr/home/hudson/hudson-slave/workspace/Lucene-Solr-Tests-trunk-java7/solr/build/solr-core/test/J0/org.apache.solr.cloud.BasicDistributedZk2Test-1355627541171/jetty1/index lockFactory=org.apache.lucene.store.NativeFSLockFactory@59f66867; maxCacheMB=48.0 maxMergeSizeMB=4.0)),segFN=segments_1,generation=1,filenames=[segments_1]
[junit4:junit4]   2> 21939 T364 C35 P59076 oasc.SolrDeletionPolicy.updateCommits newest commit = 1[segments_1]
[junit4:junit4]   2> 21971 T364 C35 P59076 oasc.SolrDeletionPolicy.onCommit SolrDeletionPolicy.onCommit: commits:num=2
[junit4:junit4]   2> 		commit{dir=RateLimitedDirectoryWrapper(NRTCachingDirectory(org.apache.lucene.store.NIOFSDirectory@/usr/home/hudson/hudson-slave/workspace/Lucene-Solr-Tests-trunk-java7/solr/build/solr-core/test/J0/org.apache.solr.cloud.BasicDistributedZk2Test-1355627541171/jetty1/index lockFactory=org.apache.lucene.store.NativeFSLockFactory@59f66867; maxCacheMB=48.0 maxMergeSizeMB=4.0)),segFN=segments_1,generation=1,filenames=[segments_1]
[junit4:junit4]   2> 		commit{dir=RateLimitedDirectoryWrapper(NRTCachingDirectory(org.apache.lucene.store.NIOFSDirectory@/usr/home/hudson/hudson-slave/workspace/Lucene-Solr-Tests-trunk-java7/solr/build/solr-core/test/J0/org.apache.solr.cloud.BasicDistributedZk2Test-1355627541171/jetty1/index lockFactory=org.apache.lucene.store.NativeFSLockFactory@59f66867; maxCacheMB=48.0 maxMergeSizeMB=4.0)),segFN=segments_2,generation=2,filenames=[segments_2]
[junit4:junit4]   2> 21972 T364 C35 P59076 oasc.SolrDeletionPolicy.updateCommits newest commit = 2[segments_2]
[junit4:junit4]   2> 21996 T364 C35 P59076 oasc.CachingDirectoryFactory.close Releasing directory:/usr/home/hudson/hudson-slave/workspace/Lucene-Solr-Tests-trunk-java7/solr/build/solr-core/test/J0/./org.apache.solr.cloud.BasicDistributedZk2Test-1355627541171/jetty1
[junit4:junit4]   2> 21997 T364 C35 P59076 oass.SolrIndexSearcher.<init> Opening Searcher@5f6967fd realtime
[junit4:junit4]   2> 21998 T364 C35 P59076 oasu.DirectUpdateHandler2.commit end_commit_flush
[junit4:junit4]   2> 21998 T364 C35 P59076 /update {waitSearcher=true&openSearcher=false&commit=true&commit_end_point=true&wt=javabin&softCommit=false&version=2} {commit=} 0 127
[junit4:junit4]   2> 22001 T405 C34 P10913 oash.ReplicationHandler.inform Commits will be reserved for  10000
[junit4:junit4]   2> 22001 T405 C34 P10913 oascsi.HttpClientUtil.createClient Creating new http client, config:connTimeout=5000&socketTimeout=20000&allowCompression=false&maxConnections=10000&maxConnectionsPerHost=10000
[junit4:junit4]   2> 22042 T405 C34 P10913 oash.SnapPuller.<init>  No value set for 'pollInterval'. Timer Task not started.
[junit4:junit4]   2> 22046 T365 C35 P59076 oash.ReplicationHandler.inform Commits will be reserved for  10000
[junit4:junit4]   2> 22047 T365 C35 P59076 REQ /replication {command=indexversion&wt=javabin&qt=/replication&version=2} status=0 QTime=3 
[junit4:junit4]   2> 22048 T405 C34 P10913 oash.SnapPuller.fetchLatestIndex Master's generation: 2
[junit4:junit4]   2> 22049 T405 C34 P10913 oash.SnapPuller.fetchLatestIndex Slave's generation: 1
[junit4:junit4]   2> 22049 T405 C34 P10913 oash.SnapPuller.fetchLatestIndex Starting replication process
[junit4:junit4]   2> 22052 T365 C35 P59076 oasc.CachingDirectoryFactory.close Releasing directory:/usr/home/hudson/hudson-slave/workspace/Lucene-Solr-Tests-trunk-java7/solr/build/solr-core/test/J0/./org.apache.solr.cloud.BasicDistributedZk2Test-1355627541171/jetty1
[junit4:junit4]   2> 22053 T365 C35 P59076 oasc.CachingDirectoryFactory.close Releasing directory:/usr/home/hudson/hudson-slave/workspace/Lucene-Solr-Tests-trunk-java7/solr/build/solr-core/test/J0/./org.apache.solr.cloud.BasicDistributedZk2Test-1355627541171/jetty1/index
[junit4:junit4]   2> 22053 T365 C35 P59076 REQ /replication {command=filelist&generation=2&wt=javabin&qt=/replication&version=2} status=0 QTime=2 
[junit4:junit4]   2> 22054 T405 C34 P10913 oash.SnapPuller.fetchLatestIndex Number of files in latest index in master: 1
[junit4:junit4]   2> 22067 T405 C34 P10913 oasc.CachingDirectoryFactory.get return new directory for /usr/home/hudson/hudson-slave/workspace/Lucene-Solr-Tests-trunk-java7/solr/build/solr-core/test/J0/./org.apache.solr.cloud.BasicDistributedZk2Test-1355627541171/jetty3/index.20121216085743219 forceNew:false
[junit4:junit4]   2> 22067 T405 C34 P10913 oasc.CachingDirectoryFactory.close Releasing directory:/usr/home/hudson/hudson-slave/workspace/Lucene-Solr-Tests-trunk-java7/solr/build/solr-core/test/J0/./org.apache.solr.cloud.BasicDistributedZk2Test-1355627541171/jetty3
[junit4:junit4]   2> 22084 T405 C34 P10913 oash.SnapPuller.fetchLatestIndex Starting download to RateLimitedDirectoryWrapper(NRTCachingDirectory(org.apache.lucene.store.NIOFSDirectory@/usr/home/hudson/hudson-slave/workspace/Lucene-Solr-Tests-trunk-java7/solr/build/solr-core/test/J0/org.apache.solr.cloud.BasicDistributedZk2Test-1355627541171/jetty3/index.20121216085743219 lockFactory=org.apache.lucene.store.NativeFSLockFactory@6c18906f; maxCacheMB=48.0 maxMergeSizeMB=4.0)) fullCopy=true
[junit4:junit4]   2> 22108 T365 C35 P59076 REQ /replication {file=segments_2&command=filecontent&checksum=true&generation=2&qt=/replication&wt=filestream} status=0 QTime=13 
[junit4:junit4]   2> 22122 T420 oass.OpenExchangeRatesOrgProvider.init Initialized with rates=open-exchange-rates.json, refreshInterval=1440.
[junit4:junit4]   2> 22124 T405 C34 P10913 oasc.CachingDirectoryFactory.close Releasing directory:/usr/home/hudson/hudson-slave/workspace/Lucene-Solr-Tests-trunk-java7/solr/build/solr-core/test/J0/./org.apache.solr.cloud.BasicDistributedZk2Test-1355627541171/jetty3/index
[junit4:junit4]   2> 22124 T405 C34 P10913 oash.SnapPuller.fetchLatestIndex Total time taken for download : 0 secs
[junit4:junit4]   2> 22127 T405 C34 P10913 oash.SnapPuller.modifyIndexProps New index installed. Updating index properties... index=index.20121216085743219
[junit4:junit4]   2> 22130 T405 C34 P10913 oasc.CachingDirectoryFactory.close Releasing directory:/usr/home/hudson/hudson-slave/workspace/Lucene-Solr-Tests-trunk-java7/solr/build/solr-core/test/J0/./org.apache.solr.cloud.BasicDistributedZk2Test-1355627541171/jetty3
[junit4:junit4]   2> 22131 T405 C34 P10913 oasc.CachingDirectoryFactory.close Releasing directory:/usr/home/hudson/hudson-slave/workspace/Lucene-Solr-Tests-trunk-java7/solr/build/solr-core/test/J0/./org.apache.solr.cloud.BasicDistributedZk2Test-1355627541171/jetty3
[junit4:junit4]   2> 22131 T405 C34 P10913 oasc.SolrCore.getNewIndexDir New index directory detected: old=./org.apache.solr.cloud.BasicDistributedZk2Test-1355627541171/jetty3/index/ new=./org.apache.solr.cloud.BasicDistributedZk2Test-1355627541171/jetty3/index.20121216085743219
[junit4:junit4]   2> 22136 T405 C34 P10913 oasc.SolrDeletionPolicy.onInit SolrDeletionPolicy.onInit: commits:num=1
[junit4:junit4]   2> 		commit{dir=RateLimitedDirectoryWrapper(NRTCachingDirectory(org.apache.lucene.store.NIOFSDirectory@/usr/home/hudson/hudson-slave/workspace/Lucene-Solr-Tests-trunk-java7/solr/build/solr-core/test/J0/org.apache.solr.cloud.BasicDistributedZk2Test-1355627541171/jetty3/index.20121216085743219 lockFactory=org.apache.lucene.store.NativeFSLockFactory@6c18906f; maxCacheMB=48.0 maxMergeSizeMB=4.0)),segFN=segments_2,generation=2,filenames=[segments_2]
[junit4:junit4]   2> 22136 T405 C34 P10913 oasc.SolrDeletionPolicy.updateCommits newest commit = 2[segments_2]
[junit4:junit4]   2> 22138 T405 C34 P10913 oasc.CachingDirectoryFactory.close Releasing directory:/usr/home/hudson/hudson-slave/workspace/Lucene-Solr-Tests-trunk-java7/solr/build/solr-core/test/J0/./org.apache.solr.cloud.BasicDistributedZk2Test-1355627541171/jetty3
[junit4:junit4]   2> 22144 T405 C34 P10913 oasu.DefaultSolrCoreState.newIndexWriter Creating new IndexWriter...
[junit4:junit4]   2> 22145 T405 C34 P10913 oasu.DefaultSolrCoreState.newIndexWriter Waiting until IndexWriter is unused... core=collection1
[junit4:junit4]   2> 22145 T420 oass.IndexSchema.readSchema default search field in schema is text
[junit4:junit4]   2> 22145 T405 C34 P10913 oasu.DefaultSolrCoreState.newIndexWriter Rollback old IndexWriter... core=collection1
[junit4:junit4]   2> 22154 T420 oass.IndexSchema.readSchema unique key field: id
[junit4:junit4]   2> 22156 T405 C34 P10913 oasc.CachingDirectoryFactory.close Releasing directory:/usr/home/hudson/hudson-slave/workspace/Lucene-Solr-Tests-trunk-java7/solr/build/solr-core/test/J0/./org.apache.solr.cloud.BasicDistributedZk2Test-1355627541171/jetty3/index.20121216085743219
[junit4:junit4]   2> 22157 T405 C34 P10913 oasc.CachingDirectoryFactory.close Releasing directory:/usr/home/hudson/hudson-slave/workspace/Lucene-Solr-Tests-trunk-java7/solr/build/solr-core/test/J0/./org.apache.solr.cloud.BasicDistributedZk2Test-1355627541171/jetty3
[junit4:junit4]   2> 22163 T405 C34 P10913 oasc.SolrDeletionPolicy.onInit SolrDeletionPolicy.onInit: commits:num=1
[junit4:junit4]   2> 		commit{dir=RateLimitedDirectoryWrapper(NRTCachingDirectory(org.apache.lucene.store.NIOFSDirectory@/usr/home/hudson/hudson-slave/workspace/Lucene-Solr-Tests-trunk-java7/solr/build/solr-core/test/J0/org.apache.solr.cloud.BasicDistributedZk2Test-1355627541171/jetty3/index.20121216085743219 lockFactory=org.apache.lucene.store.NativeFSLockFactory@6c18906f; maxCacheMB=48.0 maxMergeSizeMB=4.0)),segFN=segments_2,generation=2,filenames=[segments_2]
[junit4:junit4]   2> 22163 T405 C34 P10913 oasc.SolrDeletionPolicy.updateCommits newest commit = 2[segments_2]
[junit4:junit4]   2> 22164 T405 C34 P10913 oasu.DefaultSolrCoreState.newIndexWriter New IndexWriter is ready to be used.
[junit4:junit4]   2> 22165 T405 C34 P10913 oasc.CachingDirectoryFactory.close Releasing directory:/usr/home/hudson/hudson-slave/workspace/Lucene-Solr-Tests-trunk-java7/solr/build/solr-core/test/J0/./org.apache.solr.cloud.BasicDistributedZk2Test-1355627541171/jetty3
[junit4:junit4]   2> 22166 T405 C34 P10913 oass.SolrIndexSearcher.<init> Opening Searcher@30160a24 main
[junit4:junit4]   2> 22168 T404 oasc.SolrCore.registerSearcher [collection1] Registered new searcher Searcher@30160a24 main{StandardDirectoryReader(segments_2:1:nrt)}
[junit4:junit4]   2> 22169 T404 oasc.CachingDirectoryFactory.close Releasing directory:/usr/home/hudson/hudson-slave/workspace/Lucene-Solr-Tests-trunk-java7/solr/build/solr-core/test/J0/./org.apache.solr.cloud.BasicDistributedZk2Test-1355627541171/jetty3/index
[junit4:junit4]   2> 22169 T405 C34 P10913 oasu.DirectUpdateHandler2.commit start commit{flags=0,_version_=0,optimize=false,openSearcher=false,waitSearcher=false,expungeDeletes=false,softCommit=false}
[junit4:junit4]   2> 22184 T420 oass.FileExchangeRateProvider.reload Reloading exchange rates from file currency.xml
[junit4:junit4]   2> 22197 T405 C34 P10913 oasc.SolrDeletionPolicy.onCommit SolrDeletionPolicy.onCommit: commits:num=2
[junit4:junit4]   2> 		commit{dir=RateLimitedDirectoryWrapper(NRTCachingDirectory(org.apache.lucene.store.NIOFSDirectory@/usr/home/hudson/hudson-slave/workspace/Lucene-Solr-Tests-trunk-java7/solr/build/solr-core/test/J0/org.apache.solr.cloud.BasicDistributedZk2Test-1355627541171/jetty3/index.20121216085743219 lockFactory=org.apache.lucene.store.NativeFSLockFactory@6c18906f; maxCacheMB=48.0 maxMergeSizeMB=4.0)),segFN=segments_2,generation=2,filenames=[segments_2]
[junit4:junit4]   2> 		commit{dir=RateLimitedDirectoryWrapper(NRTCachingDirectory(org.apache.lucene.store.NIOFSDirectory@/usr/home/hudson/hudson-slave/workspace/Lucene-Solr-Tests-trunk-java7/solr/build/solr-core/test/J0/org.apache.solr.cloud.BasicDistributedZk2Test-1355627541171/jetty3/index.20121216085743219 lockFactory=org.apache.lucene.store.NativeFSLockFactory@6c18906f; maxCacheMB=48.0 maxMergeSizeMB=4.0)),segFN=segments_3,generation=3,filenames=[segments_3]
[junit4:junit4]   2> 22198 T405 C34 P10913 oasc.SolrDeletionPolicy.updateCommits newest commit = 3[segments_3]
[junit4:junit4]   2> 22206 T405 C34 P10913 oasc.CachingDirectoryFactory.close Releasing directory:/usr/home/hudson/hudson-slave/workspace/Lucene-Solr-Tests-trunk-java7/solr/build/solr-core/test/J0/./org.apache.solr.cloud.BasicDistributedZk2Test-1355627541171/jetty3
[junit4:junit4]   2> 22207 T405 C34 P10913 oasu.DirectUpdateHandler2.commit end_commit_flush
[junit4:junit4]   2> 22207 T405 C34 P10913 oasc.CachingDirectoryFactory.close Releasing directory:/usr/home/hudson/hudson-slave/workspace/Lucene-Solr-Tests-trunk-java7/solr/build/solr-core/test/J0/./org.apache.solr.cloud.BasicDistributedZk2Test-1355627541171/jetty3/index.20121216085743219
[junit4:junit4]   2> 22207 T405 C34 P10913 oasc.CachingDirectoryFactory.close Releasing directory:/usr/home/hudson/hudson-slave/workspace/Lucene-Solr-Tests-trunk-java7/solr/build/solr-core/test/J0/./org.apache.solr.cloud.BasicDistributedZk2Test-1355627541171/jetty3/index
[junit4:junit4]   2> 22208 T405 C34 P10913 oasc.RecoveryStrategy.replay No replay needed. core=collection1
[junit4:junit4]   2> 22208 T405 C34 P10913 oasc.RecoveryStrategy.doRecovery Replication Recovery was successful - registering as Active. core=collection1
[junit4:junit4]   2> 22208 T405 C34 P10913 oasc.ZkController.publish publishing core=collection1 state=active
[junit4:junit4]   2> 22208 T420 oass.FileExchangeRateProvider.reload Reloading exchange rates from file currency.xml
[junit4:junit4]   2> 22209 T405 C34 P10913 oasc.ZkController.publish numShards not found on descriptor - reading it from system property
[junit4:junit4]   2> 22211 T405 C34 P10913 oasc.RecoveryStrategy.doRecovery Finished recovery process. core=collection1
[junit4:junit4]   2> 22226 T420 oass.OpenExchangeRatesOrgProvider.reload Reloading exchange rates from open-exchange-rates.json
[junit4:junit4]   2> 22228 T420 oass.OpenExchangeRatesOrgProvider.reload Reloading exchange rates from open-exchange-rates.json
[junit4:junit4]   2> 22230 T420 oasc.SolrCore.<init> [collection1] Opening new SolrCore at /usr/home/hudson/hudson-slave/workspace/Lucene-Solr-Tests-trunk-java7/solr/build/solr-core/test/J0/./org.apache.solr.cloud.BasicDistributedZk2Test-jetty4-1355627560933/collection1/, dataDir=./org.apache.solr.cloud.BasicDistributedZk2Test-1355627541171/jetty4/
[junit4:junit4]   2> 22230 T420 oasc.JmxMonitoredMap.<init> JMX monitoring is enabled. Adding Solr mbeans to JMX Server: com.sun.jmx.mbeanserver.JmxMBeanServer@22bb1eab
[junit4:junit4]   2> 22231 T420 oasc.SolrCore.initDirectoryFactory solr.NRTCachingDirectoryFactory
[junit4:junit4]   2> 22246 T420 oasc.CachingDirectoryFactory.get return new directory for /usr/home/hudson/hudson-slave/workspace/Lucene-Solr-Tests-trunk-java7/solr/build/solr-core/test/J0/./org.apache.solr.cloud.BasicDistributedZk2Test-1355627541171/jetty4 forceNew:false
[junit4:junit4]   2> 22247 T420 oasc.CachingDirectoryFactory.close Releasing directory:/usr/home/hudson/hudson-slave/workspace/Lucene-Solr-Tests-trunk-java7/solr/build/solr-core/test/J0/./org.apache.solr.cloud.BasicDistributedZk2Test-1355627541171/jetty4
[junit4:junit4]   2> 22248 T420 oasc.SolrCore.getNewIndexDir New index directory detected: old=null new=./org.apache.solr.cloud.BasicDistributedZk2Test-1355627541171/jetty4/index/
[junit4:junit4]   2> 22248 T420 oasc.SolrCore.initIndex WARNING [collection1] Solr index directory './org.apache.solr.cloud.BasicDistributedZk2Test-1355627541171/jetty4/index' doesn't exist. Creating new index...
[junit4:junit4]   2> 22249 T420 oasc.CachingDirectoryFactory.get return new directory for /usr/home/hudson/hudson-slave/workspace/Lucene-Solr-Tests-trunk-java7/solr/build/solr-core/test/J0/./org.apache.solr.cloud.BasicDistributedZk2Test-1355627541171/jetty4/index forceNew:false
[junit4:junit4]   2> 22275 T420 oasc.SolrDeletionPolicy.onCommit SolrDeletionPolicy.onCommit: commits:num=1
[junit4:junit4]   2> 		commit{dir=RateLimitedDirectoryWrapper(NRTCachingDirectory(org.apache.lucene.store.NIOFSDirectory@/usr/home/hudson/hudson-slave/workspace/Lucene-Solr-Tests-trunk-java7/solr/build/solr-core/test/J0/org.apache.solr.cloud.BasicDistributedZk2Test-1355627541171/jetty4/index lockFactory=org.apache.lucene.store.NativeFSLockFactory@36cbb81c; maxCacheMB=48.0 maxMergeSizeMB=4.0)),segFN=segments_1,generation=1,filenames=[segments_1]
[junit4:junit4]   2> 22276 T420 oasc.SolrDeletionPolicy.updateCommits newest commit = 1[segments_1]
[junit4:junit4]   2> 22286 T420 oasc.CachingDirectoryFactory.close Releasing directory:/usr/home/hudson/hudson-slave/workspace/Lucene-Solr-Tests-trunk-java7/solr/build/solr-core/test/J0/./org.apache.solr.cloud.BasicDistributedZk2Test-1355627541171/jetty4/index
[junit4:junit4]   2> 22286 T420 oasc.SolrCore.initWriters created xml: solr.XMLResponseWriter
[junit4:junit4]   2> 22289 T420 oasup.UpdateRequestProcessorChain.init inserting DistributedUpdateProcessorFactory into updateRequestProcessorChain "dedupe"
[junit4:junit4]   2> 22290 T420 oasup.UpdateRequestProcessorChain.init inserting DistributedUpdateProcessorFactory into updateRequestProcessorChain "dedupe-allfields"
[junit4:junit4]   2> 22290 T420 oasup.UpdateRequestProcessorChain.init inserting DistributedUpdateProcessorFactory into updateRequestProcessorChain "stored_sig"
[junit4:junit4]   2> 22291 T420 oasup.UpdateRequestProcessorChain.init inserting DistributedUpdateProcessorFactory into updateRequestProcessorChain "uniq-fields"
[junit4:junit4]   2> 22291 T420 oasup.UpdateRequestProcessorChain.init inserting DistributedUpdateProcessorFactory into updateRequestProcessorChain "distrib-dup-test-chain-implicit"
[junit4:junit4]   2> 22292 T420 oasc.RequestHandlers.initHandlersFromConfig adding lazy requestHandler: solr.ReplicationHandler
[junit4:junit4]   2> 22295 T420 oasc.CachingDirectoryFactory.close Releasing directory:/usr/home/hudson/hudson-slave/workspace/Lucene-Solr-Tests-trunk-java7/solr/build/solr-core/test/J0/./org.apache.solr.cloud.BasicDistributedZk2Test-1355627541171/jetty3
[junit4:junit4]   2> 22297 T420 oasc.CachingDirectoryFactory.close Releasing directory:/usr/home/hudson/hudson-slave/workspace/Lucene-Solr-Tests-trunk-java7/solr/build/solr-core/test/J0/./org.apache.solr.cloud.BasicDistributedZk2Test-1355627541171/jetty3/index.20121216085743219
[junit4:junit4]   2> 22298 T420 oasc.RequestHandlers.initHandlersFromConfig created /replication: solr.ReplicationHandler
[junit4:junit4]   2> 22300 T420 oasc.RequestHandlers.initHandlersFromConfig created standard: solr.StandardRequestHandler
[junit4:junit4]   2> 22301 T420 oasc.RequestHandlers.initHandlersFromConfig created /get: solr.RealTimeGetHandler
[junit4:junit4]   2> 22303 T420 oasc.RequestHandlers.initHandlersFromConfig created dismax: solr.SearchHandler
[junit4:junit4]   2> 22304 T420 oasc.RequestHandlers.initHandlersFromConfig created mock: org.apache.solr.core.MockQuerySenderListenerReqHandler
[junit4:junit4]   2> 22305 T420 oasc.RequestHandlers.initHandlersFromConfig created /admin/: org.apache.solr.handler.admin.AdminHandlers
[junit4:junit4]   2> 22306 T420 oasc.RequestHandlers.initHandlersFromConfig created defaults: solr.StandardRequestHandler
[junit4:junit4]   2> 22306 T420 oasc.RequestHandlers.initHandlersFromConfig adding lazy requestHandler: solr.StandardRequestHandler
[junit4:junit4]   2> 22307 T420 oasc.RequestHandlers.initHandlersFromConfig created lazy: solr.StandardRequestHandler
[junit4:junit4]   2> 22308 T420 oasc.RequestHandlers.initHandlersFromConfig created /update: solr.UpdateRequestHandler
[junit4:junit4]   2> 22310 T420 oasc.RequestHandlers.initHandlersFromConfig created /terms: org.apache.solr.handler.component.SearchHandler
[junit4:junit4]   2> 22311 T420 oasc.RequestHandlers.initHandlersFromConfig created spellCheckCompRH: org.apache.solr.handler.component.SearchHandler
[junit4:junit4]   2> 22313 T420 oasc.RequestHandlers.initHandlersFromConfig created spellCheckCompRH_Direct: org.apache.solr.handler.component.SearchHandler
[junit4:junit4]   2> 22314 T420 oasc.RequestHandlers.initHandlersFromConfig created spellCheckWithWordbreak: org.apache.solr.handler.component.SearchHandler
[junit4:junit4]   2> 22316 T420 oasc.RequestHandlers.initHandlersFromConfig created spellCheckWithWordbreak_Direct: org.apache.solr.handler.component.SearchHandler
[junit4:junit4]   2> 22317 T420 oasc.RequestHandlers.initHandlersFromConfig created spellCheckCompRH1: org.apache.solr.handler.component.SearchHandler
[junit4:junit4]   2> 22318 T420 oasc.RequestHandlers.initHandlersFromConfig created mltrh: org.apache.solr.handler.component.SearchHandler
[junit4:junit4]   2> 22320 T420 oasc.RequestHandlers.initHandlersFromConfig created tvrh: org.apache.solr.handler.component.SearchHandler
[junit4:junit4]   2> 22321 T420 oasc.RequestHandlers.initHandlersFromConfig created /mlt: solr.MoreLikeThisHandler
[junit4:junit4]   2> 22323 T420 oasc.RequestHandlers.initHandlersFromConfig created /debug/dump: solr.DumpRequestHandler
[junit4:junit4]   2> 22336 T420 oashl.XMLLoader.init xsltCacheLifetimeSeconds=60
[junit4:junit4]   2> 22361 T420 oasc.SolrCore.initDeprecatedSupport WARNING solrconfig.xml uses deprecated <admin/gettableFiles>, Please update your config to use the ShowFileRequestHandler.
[junit4:junit4]   2> 22364 T420 oasc.SolrCore.initDeprecatedSupport WARNING adding ShowFileRequestHandler with hidden files: [SCHEMA.XML, OLD_SYNONYMS.TXT, STOPWORDS.TXT, PROTWORDS.TXT, OPEN-EXCHANGE-RATES.JSON, SYNONYMS.TXT, CURRENCY.XML, MAPPING-ISOLATIN1ACCENT.TXT]
[junit4:junit4]   2> 22364 T354 oascc.ZkStateReader.updateClusterState Updating cloud state from ZooKeeper... 
[junit4:junit4]   2> 22365 T354 oasc.Overseer$ClusterStateUpdater.updateState Update state numShards=2 message={
[junit4:junit4]   2> 	  "operation":"state",
[junit4:junit4]   2> 	  "numShards":"2",
[junit4:junit4]   2> 	  "shard":"shard1",
[junit4:junit4]   2> 	  "roles":null,
[junit4:junit4]   2> 	  "state":"active",
[junit4:junit4]   2> 	  "core":"collection1",
[junit4:junit4]   2> 	  "collection":"collection1",
[junit4:junit4]   2> 	  "node_name":"127.0.0.1:10913_",
[junit4:junit4]   2> 	  "base_url":"http://127.0.0.1:10913"}
[junit4:junit4]   2> 22374 T420 oasc.CachingDirectoryFactory.close Releasing directory:/usr/home/hudson/hudson-slave/workspace/Lucene-Solr-Tests-trunk-java7/solr/build/solr-core/test/J0/./org.apache.solr.cloud.BasicDistributedZk2Test-1355627541171/jetty4
[junit4:junit4]   2> 22385 T420 oass.SolrIndexSearcher.<init> Opening Searcher@319e113f main
[junit4:junit4]   2> 22387 T420 oasu.CommitTracker.<init> Hard AutoCommit: disabled
[junit4:junit4]   2> 22387 T420 oasu.CommitTracker.<init> Soft AutoCommit: disabled
[junit4:junit4]   2> 22388 T420 oashc.SpellCheckComponent.inform Initializing spell checkers
[junit4:junit4]   2> 22394 T387 oascc.ZkStateReader$2.process A cluster state change: WatchedEvent state:SyncConnected type:NodeDataChanged path:/clusterstate.json, has occurred - updating... (live nodes size: 5)
[junit4:junit4]   2> 22394 T419 oascc.ZkStateReader$2.process A cluster state change: WatchedEvent state:SyncConnected type:NodeDataChanged path:/clusterstate.json, has occurred - updating... (live nodes size: 5)
[junit4:junit4]   2> 22394 T372 oascc.ZkStateReader$2.process A cluster state change: WatchedEvent state:SyncConnected type:NodeDataChanged path:/clusterstate.json, has occurred - updating... (live nodes size: 5)
[junit4:junit4]   2> 22394 T359 oascc.ZkStateReader$2.process A cluster state change: WatchedEvent state:SyncConnected type:NodeDataChanged path:/clusterstate.json, has occurred - updating... (live nodes size: 5)
[junit4:junit4]   2> 22394 T353 oascc.ZkStateReader$2.process A cluster state change: WatchedEvent state:SyncConnected type:NodeDataChanged path:/clusterstate.json, has occurred - updating... (live nodes size: 5)
[junit4:junit4]   2> 22394 T402 oascc.ZkStateReader$2.process A cluster state change: WatchedEvent state:SyncConnected type:NodeDataChanged path:/clusterstate.json, has occurred - updating... (live nodes size: 5)
[junit4:junit4]   2> 22440 T420 oass.DirectSolrSpellChecker.init init: {name=direct,classname=DirectSolrSpellChecker,field=lowerfilt,minQueryLength=3}
[junit4:junit4]   2> 22778 T422 oasc.SolrCore.registerSearcher [collection1] Registered new searcher Searcher@319e113f main{StandardDirectoryReader(segments_1:1)}
[junit4:junit4]   2> 22786 T420 oasc.ZkController.publish publishing core=collection1 state=down
[junit4:junit4]   2> 22786 T420 oasc.ZkController.publish numShards not found on descriptor - reading it from system property
[junit4:junit4]   2> 22937 T354 oascc.ZkStateReader.updateClusterState Updating cloud state from ZooKeeper... 
[junit4:junit4]   2> 22938 T354 oasc.Overseer$ClusterStateUpdater.updateState Update state numShards=2 message={
[junit4:junit4]   2> 	  "operation":"state",
[junit4:junit4]   2> 	  "numShards":"2",
[junit4:junit4]   2> 	  "shard":null,
[junit4:junit4]   2> 	  "roles":null,
[junit4:junit4]   2> 	  "state":"down",
[junit4:junit4]   2> 	  "core":"collection1",
[junit4:junit4]   2> 	  "col

[...truncated too long message...]

olr.cloud.ShardLeaderElectionContext.runLeaderProcess(ElectionContext.java:160)
[junit4:junit4]   2> 	at org.apache.solr.cloud.LeaderElector.runIamLeaderProcess(LeaderElector.java:156)
[junit4:junit4]   2> 	at org.apache.solr.cloud.LeaderElector.checkIfIamLeader(LeaderElector.java:100)
[junit4:junit4]   2> 	at org.apache.solr.cloud.LeaderElector.access$000(LeaderElector.java:55)
[junit4:junit4]   2> 	at org.apache.solr.cloud.LeaderElector$1.process(LeaderElector.java:129)
[junit4:junit4]   2> 	at org.apache.zookeeper.ClientCnxn$EventThread.processEvent(ClientCnxn.java:519)
[junit4:junit4]   2> 	at org.apache.zookeeper.ClientCnxn$EventThread.run(ClientCnxn.java:495)
[junit4:junit4]   2> 
[junit4:junit4]   2> 40893 T558 oascc.ZkStateReader$2.process A cluster state change: WatchedEvent state:SyncConnected type:NodeChildrenChanged path:/live_nodes, has occurred - updating... (live nodes size: 1)
[junit4:junit4]   2> 40893 T459 oascc.ZkStateReader$2.process A cluster state change: WatchedEvent state:SyncConnected type:NodeChildrenChanged path:/live_nodes, has occurred - updating... (live nodes size: 1)
[junit4:junit4]   2> 40893 T433 oazs.NIOServerCnxn.closeSock Closed socket connection for client /140.211.11.196:24192 which had sessionid 0x13ba1b43805000a
[junit4:junit4]   2> 40894 T558 oascc.ZkStateReader$2.process WARNING ZooKeeper watch triggered, but Solr cannot talk to ZK
[junit4:junit4]   2> 40893 T431 oaz.ZooKeeper.close Session: 0x13ba1b43805000a closed
[junit4:junit4]   2> 40894 T558 oascc.ZkStateReader$3.process WARNING ZooKeeper watch triggered, but Solr cannot talk to ZK
[junit4:junit4]   2> 40894 T558 oaz.ClientCnxn$EventThread.run EventThread shut down
[junit4:junit4]   2> 40895 T431 oejsh.ContextHandler.doStop stopped o.e.j.s.ServletContextHandler{/oxcmh,null}
[junit4:junit4]   2> 40896 T459 oascc.ZkStateReader$3.process Updating live nodes... (0)
[junit4:junit4]   2> 40947 T436 oazs.PrepRequestProcessor.pRequest2Txn Processed session termination for sessionid: 0x13ba1b438050004
[junit4:junit4]   2> 40966 T459 oaz.ClientCnxn$EventThread.run EventThread shut down
[junit4:junit4]   2> 40967 T433 oazs.NIOServerCnxn.closeSock Closed socket connection for client /140.211.11.196:32389 which had sessionid 0x13ba1b438050004
[junit4:junit4]   2> 40967 T431 oaz.ZooKeeper.close Session: 0x13ba1b438050004 closed
[junit4:junit4]   2> 40968 T431 oazs.ZooKeeperServer.shutdown shutting down
[junit4:junit4]   2> 40968 T431 oazs.SessionTrackerImpl.shutdown Shutting down
[junit4:junit4]   2> 40968 T431 oazs.PrepRequestProcessor.shutdown Shutting down
[junit4:junit4]   2> 40969 T436 oazs.PrepRequestProcessor.run PrepRequestProcessor exited loop!
[junit4:junit4]   2> 40969 T431 oazs.SyncRequestProcessor.shutdown Shutting down
[junit4:junit4]   2> 40969 T435 oazs.SyncRequestProcessor.run SyncRequestProcessor exited!
[junit4:junit4]   2> 40969 T431 oazs.FinalRequestProcessor.shutdown shutdown of request processor complete
[junit4:junit4]   2> 40970 T431 oasc.ZkTestServer.send4LetterWord connecting to 127.0.0.1:32549 32549
[junit4:junit4]   2> 41180 T434 oazs.SessionTrackerImpl.run SessionTrackerImpl exited loop!
[junit4:junit4]   2> 41240 T433 oazs.NIOServerCnxnFactory.run NIOServerCnxn factory exited run method
[junit4:junit4]   2> 41241 T431 oazs.ZooKeeperServer.shutdown shutting down
[junit4:junit4]   2> 41241 T431 oazs.SessionTrackerImpl.shutdown Shutting down
[junit4:junit4]   2> 41242 T431 oazs.PrepRequestProcessor.shutdown Shutting down
[junit4:junit4]   2> 41242 T431 oazs.SyncRequestProcessor.shutdown Shutting down
[junit4:junit4]   2> 41243 T431 oazs.FinalRequestProcessor.shutdown shutdown of request processor complete
[junit4:junit4]   2> 41243 T431 oasc.ChaosMonkey.monkeyLog monkey: stop shard! 17003
[junit4:junit4]   2> 41537 T431 oas.SolrTestCaseJ4.tearDown ###Ending testDistribSearch
[junit4:junit4]   1> client port:0.0.0.0/0.0.0.0:0
[junit4:junit4]   2> 41541 T431 oas.SolrTestCaseJ4.deleteCore ###deleteCore
[junit4:junit4]   2> 41936 T430 ccr.ThreadLeakControl.checkThreadLeaks WARNING Will linger awaiting termination of 1 leaked thread(s).
[junit4:junit4]   2> 41946 T472 oascc.ZkStateReader$3.process WARNING ZooKeeper watch triggered, but Solr cannot talk to ZK
[junit4:junit4]   2> 41946 T472 oascc.ZkStateReader$2.process A cluster state change: WatchedEvent state:SyncConnected type:NodeChildrenChanged path:/live_nodes, has occurred - updating... (live nodes size: 2)
[junit4:junit4]   2> 41946 T472 oascc.ZkStateReader$2.process WARNING ZooKeeper watch triggered, but Solr cannot talk to ZK
[junit4:junit4]   2> 41946 T472 oaz.ClientCnxn$EventThread.run EventThread shut down
[junit4:junit4]   2> NOTE: test params are: codec=Lucene40, sim=RandomSimilarityProvider(queryNorm=true,coord=crazy): {}, locale=da_DK, timezone=Asia/Gaza
[junit4:junit4]   2> NOTE: FreeBSD 9.0-RELEASE amd64/Oracle Corporation 1.7.0_09 (64-bit)/cpus=16,threads=1,free=317010576,total=411041792
[junit4:junit4]   2> NOTE: All tests run in this JVM: [SolrInfoMBeanTest, TestOmitPositions, URLClassifyProcessorTest, LukeRequestHandlerTest, TestCharFilters, TestCodecSupport, SuggesterTest, ZkCLITest, SuggesterTSTTest, TestReplicationHandler, PingRequestHandlerTest, TestAtomicUpdateErrorCases, TestHashPartitioner, RAMDirectoryFactoryTest, TestReload, TestPropInjectDefaults, TestQuerySenderListener, TestRecovery, PrimitiveFieldTypeTest, RecoveryZkTest]
[junit4:junit4]   2> NOTE: reproduce with: ant test  -Dtestcase=RecoveryZkTest -Dtests.seed=E715D6EDD18D4C72 -Dtests.multiplier=3 -Dtests.slow=true -Dtests.locale=da_DK -Dtests.timezone=Asia/Gaza -Dtests.file.encoding=ISO-8859-1
[junit4:junit4] ERROR   0.00s J1 | RecoveryZkTest (suite) <<<
[junit4:junit4]    > Throwable #1: com.carrotsearch.randomizedtesting.ResourceDisposalError: Resource in scope SUITE failed to close. Resource was registered from thread Thread[id=490, name=RecoveryThread, state=RUNNABLE, group=TGRP-RecoveryZkTest], registration stack trace below.
[junit4:junit4]    > 	at __randomizedtesting.SeedInfo.seed([E715D6EDD18D4C72]:0)
[junit4:junit4]    > 	at java.lang.Thread.getStackTrace(Thread.java:1567)
[junit4:junit4]    > 	at com.carrotsearch.randomizedtesting.RandomizedContext.closeAtEnd(RandomizedContext.java:150)
[junit4:junit4]    > 	at org.apache.lucene.util.LuceneTestCase.closeAfterSuite(LuceneTestCase.java:516)
[junit4:junit4]    > 	at org.apache.lucene.util.LuceneTestCase.wrapDirectory(LuceneTestCase.java:982)
[junit4:junit4]    > 	at org.apache.lucene.util.LuceneTestCase.newDirectory(LuceneTestCase.java:874)
[junit4:junit4]    > 	at org.apache.lucene.util.LuceneTestCase.newDirectory(LuceneTestCase.java:866)
[junit4:junit4]    > 	at org.apache.solr.core.MockDirectoryFactory.create(MockDirectoryFactory.java:33)
[junit4:junit4]    > 	at org.apache.solr.core.CachingDirectoryFactory.get(CachingDirectoryFactory.java:256)
[junit4:junit4]    > 	at org.apache.solr.core.CachingDirectoryFactory.get(CachingDirectoryFactory.java:212)
[junit4:junit4]    > 	at org.apache.solr.handler.SnapPuller.fetchLatestIndex(SnapPuller.java:376)
[junit4:junit4]    > 	at org.apache.solr.handler.ReplicationHandler.doFetch(ReplicationHandler.java:273)
[junit4:junit4]    > 	at org.apache.solr.cloud.RecoveryStrategy.replicate(RecoveryStrategy.java:153)
[junit4:junit4]    > 	at org.apache.solr.cloud.RecoveryStrategy.doRecovery(RecoveryStrategy.java:408)
[junit4:junit4]    > 	at org.apache.solr.cloud.RecoveryStrategy.run(RecoveryStrategy.java:223)
[junit4:junit4]    > Caused by: java.lang.AssertionError: Directory not closed: MockDirWrapper(org.apache.lucene.store.NIOFSDirectory@/usr/home/hudson/hudson-slave/workspace/Lucene-Solr-Tests-trunk-java7/solr/build/solr-core/test/J1/index7028370287tmp lockFactory=org.apache.lucene.store.NativeFSLockFactory@1962ff82)
[junit4:junit4]    > 	at org.junit.Assert.fail(Assert.java:93)
[junit4:junit4]    > 	at org.apache.lucene.util.CloseableDirectory.close(CloseableDirectory.java:47)
[junit4:junit4]    > 	at com.carrotsearch.randomizedtesting.RandomizedRunner$2$1.apply(RandomizedRunner.java:602)
[junit4:junit4]    > 	at com.carrotsearch.randomizedtesting.RandomizedRunner$2$1.apply(RandomizedRunner.java:599)
[junit4:junit4]    > 	at com.carrotsearch.randomizedtesting.RandomizedContext.closeResources(RandomizedContext.java:167)
[junit4:junit4]    > 	at com.carrotsearch.randomizedtesting.RandomizedRunner$2.afterAlways(RandomizedRunner.java:615)
[junit4:junit4]    > 	at com.carrotsearch.randomizedtesting.rules.StatementAdapter.evaluate(StatementAdapter.java:43)
[junit4:junit4]    > 	at com.carrotsearch.randomizedtesting.ThreadLeakControl$StatementRunner.run(ThreadLeakControl.java:358)
[junit4:junit4]    > 	at java.lang.Thread.run(Thread.java:722)
[junit4:junit4] Completed on J1 in 42.44s, 1 test, 1 error <<< FAILURES!

[...truncated 610 lines...]
BUILD FAILED
/usr/home/hudson/hudson-slave/workspace/Lucene-Solr-Tests-trunk-java7/build.xml:353: The following error occurred while executing this line:
/usr/home/hudson/hudson-slave/workspace/Lucene-Solr-Tests-trunk-java7/build.xml:39: The following error occurred while executing this line:
/usr/home/hudson/hudson-slave/workspace/Lucene-Solr-Tests-trunk-java7/solr/build.xml:178: The following error occurred while executing this line:
/usr/home/hudson/hudson-slave/workspace/Lucene-Solr-Tests-trunk-java7/solr/common-build.xml:438: The following error occurred while executing this line:
/usr/home/hudson/hudson-slave/workspace/Lucene-Solr-Tests-trunk-java7/lucene/common-build.xml:1175: The following error occurred while executing this line:
/usr/home/hudson/hudson-slave/workspace/Lucene-Solr-Tests-trunk-java7/lucene/common-build.xml:840: There were test failures: 241 suites, 1006 tests, 1 suite-level error, 1 failure, 21 ignored (3 assumptions)

Total time: 42 minutes 25 seconds
Build step 'Invoke Ant' marked build as failure
Archiving artifacts
Recording test results
Email was triggered for: Failure
Sending email for trigger: Failure



Mime
View raw message