lucene-dev mailing list archives

Site index · List index
Message view « Date » · « Thread »
Top « Date » · « Thread »
From Apache Jenkins Server <jenk...@builds.apache.org>
Subject [JENKINS] Lucene-Solr-NightlyTests-trunk - Build # 121 - Failure
Date Mon, 17 Dec 2012 01:44:14 GMT
Build: https://builds.apache.org/job/Lucene-Solr-NightlyTests-trunk/121/

3 tests failed.
REGRESSION:  org.apache.solr.cloud.BasicDistributedZk2Test.testDistribSearch

Error Message:
Shard still reported as live in zk - 0 jetty

Stack Trace:
java.lang.AssertionError: Shard still reported as live in zk - 0 jetty
	at __randomizedtesting.SeedInfo.seed([B5623A14A7240D8F:3484B40CD07B6DB3]:0)
	at org.junit.Assert.fail(Assert.java:93)
	at org.apache.solr.cloud.AbstractFullDistribZkTestBase.waitToSeeNotLive(AbstractFullDistribZkTestBase.java:1239)
	at org.apache.solr.cloud.BasicDistributedZk2Test.brindDownShardIndexSomeDocsAndRecover(BasicDistributedZk2Test.java:217)
	at org.apache.solr.cloud.BasicDistributedZk2Test.doTest(BasicDistributedZk2Test.java:92)
	at org.apache.solr.BaseDistributedSearchTestCase.testDistribSearch(BaseDistributedSearchTestCase.java:793)
	at sun.reflect.NativeMethodAccessorImpl.invoke0(Native Method)
	at sun.reflect.NativeMethodAccessorImpl.invoke(NativeMethodAccessorImpl.java:57)
	at sun.reflect.DelegatingMethodAccessorImpl.invoke(DelegatingMethodAccessorImpl.java:43)
	at java.lang.reflect.Method.invoke(Method.java:616)
	at com.carrotsearch.randomizedtesting.RandomizedRunner.invoke(RandomizedRunner.java:1559)
	at com.carrotsearch.randomizedtesting.RandomizedRunner.access$600(RandomizedRunner.java:79)
	at com.carrotsearch.randomizedtesting.RandomizedRunner$6.evaluate(RandomizedRunner.java:737)
	at com.carrotsearch.randomizedtesting.RandomizedRunner$7.evaluate(RandomizedRunner.java:773)
	at com.carrotsearch.randomizedtesting.RandomizedRunner$8.evaluate(RandomizedRunner.java:787)
	at com.carrotsearch.randomizedtesting.rules.SystemPropertiesRestoreRule$1.evaluate(SystemPropertiesRestoreRule.java:53)
	at org.apache.lucene.util.TestRuleSetupTeardownChained$1.evaluate(TestRuleSetupTeardownChained.java:50)
	at org.apache.lucene.util.TestRuleFieldCacheSanity$1.evaluate(TestRuleFieldCacheSanity.java:51)
	at org.apache.lucene.util.AbstractBeforeAfterRule$1.evaluate(AbstractBeforeAfterRule.java:46)
	at com.carrotsearch.randomizedtesting.rules.SystemPropertiesInvariantRule$1.evaluate(SystemPropertiesInvariantRule.java:55)
	at org.apache.lucene.util.TestRuleThreadAndTestName$1.evaluate(TestRuleThreadAndTestName.java:49)
	at org.apache.lucene.util.TestRuleIgnoreAfterMaxFailures$1.evaluate(TestRuleIgnoreAfterMaxFailures.java:70)
	at org.apache.lucene.util.TestRuleMarkFailure$1.evaluate(TestRuleMarkFailure.java:48)
	at com.carrotsearch.randomizedtesting.rules.StatementAdapter.evaluate(StatementAdapter.java:36)
	at com.carrotsearch.randomizedtesting.ThreadLeakControl$StatementRunner.run(ThreadLeakControl.java:358)
	at com.carrotsearch.randomizedtesting.ThreadLeakControl.forkTimeoutingTask(ThreadLeakControl.java:782)
	at com.carrotsearch.randomizedtesting.ThreadLeakControl$3.evaluate(ThreadLeakControl.java:442)
	at com.carrotsearch.randomizedtesting.RandomizedRunner.runSingleTest(RandomizedRunner.java:746)
	at com.carrotsearch.randomizedtesting.RandomizedRunner$3.evaluate(RandomizedRunner.java:648)
	at com.carrotsearch.randomizedtesting.RandomizedRunner$4.evaluate(RandomizedRunner.java:682)
	at com.carrotsearch.randomizedtesting.RandomizedRunner$5.evaluate(RandomizedRunner.java:693)
	at com.carrotsearch.randomizedtesting.rules.StatementAdapter.evaluate(StatementAdapter.java:36)
	at com.carrotsearch.randomizedtesting.rules.SystemPropertiesRestoreRule$1.evaluate(SystemPropertiesRestoreRule.java:53)
	at org.apache.lucene.util.AbstractBeforeAfterRule$1.evaluate(AbstractBeforeAfterRule.java:46)
	at org.apache.lucene.util.TestRuleStoreClassName$1.evaluate(TestRuleStoreClassName.java:42)
	at com.carrotsearch.randomizedtesting.rules.SystemPropertiesInvariantRule$1.evaluate(SystemPropertiesInvariantRule.java:55)
	at com.carrotsearch.randomizedtesting.rules.NoShadowingOrOverridesOnMethodsRule$1.evaluate(NoShadowingOrOverridesOnMethodsRule.java:39)
	at com.carrotsearch.randomizedtesting.rules.NoShadowingOrOverridesOnMethodsRule$1.evaluate(NoShadowingOrOverridesOnMethodsRule.java:39)
	at com.carrotsearch.randomizedtesting.rules.StatementAdapter.evaluate(StatementAdapter.java:36)
	at org.apache.lucene.util.TestRuleAssertionsRequired$1.evaluate(TestRuleAssertionsRequired.java:43)
	at org.apache.lucene.util.TestRuleMarkFailure$1.evaluate(TestRuleMarkFailure.java:48)
	at org.apache.lucene.util.TestRuleIgnoreAfterMaxFailures$1.evaluate(TestRuleIgnoreAfterMaxFailures.java:70)
	at org.apache.lucene.util.TestRuleIgnoreTestSuites$1.evaluate(TestRuleIgnoreTestSuites.java:55)
	at com.carrotsearch.randomizedtesting.rules.StatementAdapter.evaluate(StatementAdapter.java:36)
	at com.carrotsearch.randomizedtesting.ThreadLeakControl$StatementRunner.run(ThreadLeakControl.java:358)
	at java.lang.Thread.run(Thread.java:679)


FAILED:  org.apache.solr.cloud.BasicDistributedZkTest.testDistribSearch

Error Message:
Could not find new collection awholynewcollection_20

Stack Trace:
java.lang.AssertionError: Could not find new collection awholynewcollection_20
	at __randomizedtesting.SeedInfo.seed([B5623A14A7240D8F:3484B40CD07B6DB3]:0)
	at org.junit.Assert.fail(Assert.java:93)
	at org.apache.solr.cloud.BasicDistributedZkTest.checkForCollection(BasicDistributedZkTest.java:1154)
	at org.apache.solr.cloud.BasicDistributedZkTest.testCollectionsAPI(BasicDistributedZkTest.java:789)
	at org.apache.solr.cloud.BasicDistributedZkTest.doTest(BasicDistributedZkTest.java:352)
	at org.apache.solr.BaseDistributedSearchTestCase.testDistribSearch(BaseDistributedSearchTestCase.java:793)
	at sun.reflect.NativeMethodAccessorImpl.invoke0(Native Method)
	at sun.reflect.NativeMethodAccessorImpl.invoke(NativeMethodAccessorImpl.java:57)
	at sun.reflect.DelegatingMethodAccessorImpl.invoke(DelegatingMethodAccessorImpl.java:43)
	at java.lang.reflect.Method.invoke(Method.java:616)
	at com.carrotsearch.randomizedtesting.RandomizedRunner.invoke(RandomizedRunner.java:1559)
	at com.carrotsearch.randomizedtesting.RandomizedRunner.access$600(RandomizedRunner.java:79)
	at com.carrotsearch.randomizedtesting.RandomizedRunner$6.evaluate(RandomizedRunner.java:737)
	at com.carrotsearch.randomizedtesting.RandomizedRunner$7.evaluate(RandomizedRunner.java:773)
	at com.carrotsearch.randomizedtesting.RandomizedRunner$8.evaluate(RandomizedRunner.java:787)
	at com.carrotsearch.randomizedtesting.rules.SystemPropertiesRestoreRule$1.evaluate(SystemPropertiesRestoreRule.java:53)
	at org.apache.lucene.util.TestRuleSetupTeardownChained$1.evaluate(TestRuleSetupTeardownChained.java:50)
	at org.apache.lucene.util.TestRuleFieldCacheSanity$1.evaluate(TestRuleFieldCacheSanity.java:51)
	at org.apache.lucene.util.AbstractBeforeAfterRule$1.evaluate(AbstractBeforeAfterRule.java:46)
	at com.carrotsearch.randomizedtesting.rules.SystemPropertiesInvariantRule$1.evaluate(SystemPropertiesInvariantRule.java:55)
	at org.apache.lucene.util.TestRuleThreadAndTestName$1.evaluate(TestRuleThreadAndTestName.java:49)
	at org.apache.lucene.util.TestRuleIgnoreAfterMaxFailures$1.evaluate(TestRuleIgnoreAfterMaxFailures.java:70)
	at org.apache.lucene.util.TestRuleMarkFailure$1.evaluate(TestRuleMarkFailure.java:48)
	at com.carrotsearch.randomizedtesting.rules.StatementAdapter.evaluate(StatementAdapter.java:36)
	at com.carrotsearch.randomizedtesting.ThreadLeakControl$StatementRunner.run(ThreadLeakControl.java:358)
	at com.carrotsearch.randomizedtesting.ThreadLeakControl.forkTimeoutingTask(ThreadLeakControl.java:782)
	at com.carrotsearch.randomizedtesting.ThreadLeakControl$3.evaluate(ThreadLeakControl.java:442)
	at com.carrotsearch.randomizedtesting.RandomizedRunner.runSingleTest(RandomizedRunner.java:746)
	at com.carrotsearch.randomizedtesting.RandomizedRunner$3.evaluate(RandomizedRunner.java:648)
	at com.carrotsearch.randomizedtesting.RandomizedRunner$4.evaluate(RandomizedRunner.java:682)
	at com.carrotsearch.randomizedtesting.RandomizedRunner$5.evaluate(RandomizedRunner.java:693)
	at com.carrotsearch.randomizedtesting.rules.StatementAdapter.evaluate(StatementAdapter.java:36)
	at com.carrotsearch.randomizedtesting.rules.SystemPropertiesRestoreRule$1.evaluate(SystemPropertiesRestoreRule.java:53)
	at org.apache.lucene.util.AbstractBeforeAfterRule$1.evaluate(AbstractBeforeAfterRule.java:46)
	at org.apache.lucene.util.TestRuleStoreClassName$1.evaluate(TestRuleStoreClassName.java:42)
	at com.carrotsearch.randomizedtesting.rules.SystemPropertiesInvariantRule$1.evaluate(SystemPropertiesInvariantRule.java:55)
	at com.carrotsearch.randomizedtesting.rules.NoShadowingOrOverridesOnMethodsRule$1.evaluate(NoShadowingOrOverridesOnMethodsRule.java:39)
	at com.carrotsearch.randomizedtesting.rules.NoShadowingOrOverridesOnMethodsRule$1.evaluate(NoShadowingOrOverridesOnMethodsRule.java:39)
	at com.carrotsearch.randomizedtesting.rules.StatementAdapter.evaluate(StatementAdapter.java:36)
	at org.apache.lucene.util.TestRuleAssertionsRequired$1.evaluate(TestRuleAssertionsRequired.java:43)
	at org.apache.lucene.util.TestRuleMarkFailure$1.evaluate(TestRuleMarkFailure.java:48)
	at org.apache.lucene.util.TestRuleIgnoreAfterMaxFailures$1.evaluate(TestRuleIgnoreAfterMaxFailures.java:70)
	at org.apache.lucene.util.TestRuleIgnoreTestSuites$1.evaluate(TestRuleIgnoreTestSuites.java:55)
	at com.carrotsearch.randomizedtesting.rules.StatementAdapter.evaluate(StatementAdapter.java:36)
	at com.carrotsearch.randomizedtesting.ThreadLeakControl$StatementRunner.run(ThreadLeakControl.java:358)
	at java.lang.Thread.run(Thread.java:679)


FAILED:  org.apache.solr.cloud.SyncSliceTest.testDistribSearch

Error Message:
Shard still reported as live in zk - 0 jetty

Stack Trace:
java.lang.AssertionError: Shard still reported as live in zk - 0 jetty
	at __randomizedtesting.SeedInfo.seed([B5623A14A7240D8F:3484B40CD07B6DB3]:0)
	at org.junit.Assert.fail(Assert.java:93)
	at org.apache.solr.cloud.AbstractFullDistribZkTestBase.waitToSeeNotLive(AbstractFullDistribZkTestBase.java:1239)
	at org.apache.solr.cloud.AbstractFullDistribZkTestBase.waitToSeeNotLive(AbstractFullDistribZkTestBase.java:1224)
	at org.apache.solr.cloud.SyncSliceTest.waitToSeeDownInClusterState(SyncSliceTest.java:259)
	at org.apache.solr.cloud.SyncSliceTest.doTest(SyncSliceTest.java:223)
	at org.apache.solr.BaseDistributedSearchTestCase.testDistribSearch(BaseDistributedSearchTestCase.java:793)
	at sun.reflect.NativeMethodAccessorImpl.invoke0(Native Method)
	at sun.reflect.NativeMethodAccessorImpl.invoke(NativeMethodAccessorImpl.java:57)
	at sun.reflect.DelegatingMethodAccessorImpl.invoke(DelegatingMethodAccessorImpl.java:43)
	at java.lang.reflect.Method.invoke(Method.java:616)
	at com.carrotsearch.randomizedtesting.RandomizedRunner.invoke(RandomizedRunner.java:1559)
	at com.carrotsearch.randomizedtesting.RandomizedRunner.access$600(RandomizedRunner.java:79)
	at com.carrotsearch.randomizedtesting.RandomizedRunner$6.evaluate(RandomizedRunner.java:737)
	at com.carrotsearch.randomizedtesting.RandomizedRunner$7.evaluate(RandomizedRunner.java:773)
	at com.carrotsearch.randomizedtesting.RandomizedRunner$8.evaluate(RandomizedRunner.java:787)
	at com.carrotsearch.randomizedtesting.rules.SystemPropertiesRestoreRule$1.evaluate(SystemPropertiesRestoreRule.java:53)
	at org.apache.lucene.util.TestRuleSetupTeardownChained$1.evaluate(TestRuleSetupTeardownChained.java:50)
	at org.apache.lucene.util.TestRuleFieldCacheSanity$1.evaluate(TestRuleFieldCacheSanity.java:51)
	at org.apache.lucene.util.AbstractBeforeAfterRule$1.evaluate(AbstractBeforeAfterRule.java:46)
	at com.carrotsearch.randomizedtesting.rules.SystemPropertiesInvariantRule$1.evaluate(SystemPropertiesInvariantRule.java:55)
	at org.apache.lucene.util.TestRuleThreadAndTestName$1.evaluate(TestRuleThreadAndTestName.java:49)
	at org.apache.lucene.util.TestRuleIgnoreAfterMaxFailures$1.evaluate(TestRuleIgnoreAfterMaxFailures.java:70)
	at org.apache.lucene.util.TestRuleMarkFailure$1.evaluate(TestRuleMarkFailure.java:48)
	at com.carrotsearch.randomizedtesting.rules.StatementAdapter.evaluate(StatementAdapter.java:36)
	at com.carrotsearch.randomizedtesting.ThreadLeakControl$StatementRunner.run(ThreadLeakControl.java:358)
	at com.carrotsearch.randomizedtesting.ThreadLeakControl.forkTimeoutingTask(ThreadLeakControl.java:782)
	at com.carrotsearch.randomizedtesting.ThreadLeakControl$3.evaluate(ThreadLeakControl.java:442)
	at com.carrotsearch.randomizedtesting.RandomizedRunner.runSingleTest(RandomizedRunner.java:746)
	at com.carrotsearch.randomizedtesting.RandomizedRunner$3.evaluate(RandomizedRunner.java:648)
	at com.carrotsearch.randomizedtesting.RandomizedRunner$4.evaluate(RandomizedRunner.java:682)
	at com.carrotsearch.randomizedtesting.RandomizedRunner$5.evaluate(RandomizedRunner.java:693)
	at com.carrotsearch.randomizedtesting.rules.StatementAdapter.evaluate(StatementAdapter.java:36)
	at com.carrotsearch.randomizedtesting.rules.SystemPropertiesRestoreRule$1.evaluate(SystemPropertiesRestoreRule.java:53)
	at org.apache.lucene.util.AbstractBeforeAfterRule$1.evaluate(AbstractBeforeAfterRule.java:46)
	at org.apache.lucene.util.TestRuleStoreClassName$1.evaluate(TestRuleStoreClassName.java:42)
	at com.carrotsearch.randomizedtesting.rules.SystemPropertiesInvariantRule$1.evaluate(SystemPropertiesInvariantRule.java:55)
	at com.carrotsearch.randomizedtesting.rules.NoShadowingOrOverridesOnMethodsRule$1.evaluate(NoShadowingOrOverridesOnMethodsRule.java:39)
	at com.carrotsearch.randomizedtesting.rules.NoShadowingOrOverridesOnMethodsRule$1.evaluate(NoShadowingOrOverridesOnMethodsRule.java:39)
	at com.carrotsearch.randomizedtesting.rules.StatementAdapter.evaluate(StatementAdapter.java:36)
	at org.apache.lucene.util.TestRuleAssertionsRequired$1.evaluate(TestRuleAssertionsRequired.java:43)
	at org.apache.lucene.util.TestRuleMarkFailure$1.evaluate(TestRuleMarkFailure.java:48)
	at org.apache.lucene.util.TestRuleIgnoreAfterMaxFailures$1.evaluate(TestRuleIgnoreAfterMaxFailures.java:70)
	at org.apache.lucene.util.TestRuleIgnoreTestSuites$1.evaluate(TestRuleIgnoreTestSuites.java:55)
	at com.carrotsearch.randomizedtesting.rules.StatementAdapter.evaluate(StatementAdapter.java:36)
	at com.carrotsearch.randomizedtesting.ThreadLeakControl$StatementRunner.run(ThreadLeakControl.java:358)
	at java.lang.Thread.run(Thread.java:679)




Build Log:
[...truncated 8250 lines...]
[junit4:junit4] Suite: org.apache.solr.cloud.BasicDistributedZk2Test
[junit4:junit4]   2> 0 T679 oas.BaseDistributedSearchTestCase.initHostContext Setting hostContext system property: /yv/fm
[junit4:junit4]   2> 7 T679 oas.SolrTestCaseJ4.setUp ###Starting testDistribSearch
[junit4:junit4]   2> Creating dataDir: /usr/home/hudson/hudson-slave/workspace/Lucene-Solr-NightlyTests-trunk/solr/build/solr-core/test/J0/./solrtest-BasicDistributedZk2Test-1355707361739
[junit4:junit4]   2> 14 T679 oasc.ZkTestServer.run STARTING ZK TEST SERVER
[junit4:junit4]   2> 19 T680 oasc.ZkTestServer$ZKServerMain.runFromConfig Starting server
[junit4:junit4]   2> 106 T680 oaz.Environment.logEnv Server environment:zookeeper.version=3.4.5-1392090, built on 09/30/2012 17:52 GMT
[junit4:junit4]   2> 106 T680 oaz.Environment.logEnv Server environment:host.name=lucene.zones.apache.org
[junit4:junit4]   2> 106 T680 oaz.Environment.logEnv Server environment:java.version=1.6.0_32
[junit4:junit4]   2> 106 T680 oaz.Environment.logEnv Server environment:java.vendor=Sun Microsystems Inc.
[junit4:junit4]   2> 106 T680 oaz.Environment.logEnv Server environment:java.home=/usr/local/openjdk6/jre
[junit4:junit4]   2> 107 T680 oaz.Environment.logEnv Server environment:java.class.path=/usr/home/hudson/hudson-slave/workspace/Lucene-Solr-NightlyTests-trunk/solr/build/solr-core/classes/test:/usr/home/hudson/hudson-slave/workspace/Lucene-Solr-NightlyTests-trunk/solr/build/solr-test-framework/classes/java:/usr/home/hudson/hudson-slave/workspace/Lucene-Solr-NightlyTests-trunk/solr/build/solr-core/test-files:/usr/home/hudson/hudson-slave/workspace/Lucene-Solr-NightlyTests-trunk/lucene/build/test-framework/classes/java:/usr/home/hudson/hudson-slave/workspace/Lucene-Solr-NightlyTests-trunk/lucene/build/codecs/classes/java:/usr/home/hudson/hudson-slave/workspace/Lucene-Solr-NightlyTests-trunk/solr/build/solr-solrj/classes/java:/usr/home/hudson/hudson-slave/workspace/Lucene-Solr-NightlyTests-trunk/solr/build/solr-core/classes/java:/usr/home/hudson/hudson-slave/workspace/Lucene-Solr-NightlyTests-trunk/lucene/build/analysis/common/lucene-analyzers-common-5.0-SNAPSHOT.jar:/usr/home/hudson/hudson-slave/workspace/Lucene-Solr-NightlyTests-trunk/lucene/build/analysis/kuromoji/lucene-analyzers-kuromoji-5.0-SNAPSHOT.jar:/usr/home/hudson/hudson-slave/workspace/Lucene-Solr-NightlyTests-trunk/lucene/build/analysis/phonetic/lucene-analyzers-phonetic-5.0-SNAPSHOT.jar:/usr/home/hudson/hudson-slave/workspace/Lucene-Solr-NightlyTests-trunk/lucene/build/highlighter/lucene-highlighter-5.0-SNAPSHOT.jar:/usr/home/hudson/hudson-slave/workspace/Lucene-Solr-NightlyTests-trunk/lucene/build/memory/lucene-memory-5.0-SNAPSHOT.jar:/usr/home/hudson/hudson-slave/workspace/Lucene-Solr-NightlyTests-trunk/lucene/build/misc/lucene-misc-5.0-SNAPSHOT.jar:/usr/home/hudson/hudson-slave/workspace/Lucene-Solr-NightlyTests-trunk/lucene/build/spatial/lucene-spatial-5.0-SNAPSHOT.jar:/usr/home/hudson/hudson-slave/workspace/Lucene-Solr-NightlyTests-trunk/lucene/build/suggest/lucene-suggest-5.0-SNAPSHOT.jar:/usr/home/hudson/hudson-slave/workspace/Lucene-Solr-NightlyTests-trunk/lucene/build/grouping/lucene-grouping-5.0-SNAPSHOT.jar:/usr/home/hudson/hudson-slave/workspace/Lucene-Solr-NightlyTests-trunk/lucene/build/queries/lucene-queries-5.0-SNAPSHOT.jar:/usr/home/hudson/hudson-slave/workspace/Lucene-Solr-NightlyTests-trunk/lucene/build/queryparser/lucene-queryparser-5.0-SNAPSHOT.jar:/usr/home/hudson/hudson-slave/workspace/Lucene-Solr-NightlyTests-trunk/solr/core/lib/cglib-nodep-2.2.jar:/usr/home/hudson/hudson-slave/workspace/Lucene-Solr-NightlyTests-trunk/solr/core/lib/commons-cli-1.2.jar:/usr/home/hudson/hudson-slave/workspace/Lucene-Solr-NightlyTests-trunk/solr/core/lib/commons-codec-1.7.jar:/usr/home/hudson/hudson-slave/workspace/Lucene-Solr-NightlyTests-trunk/solr/core/lib/commons-fileupload-1.2.1.jar:/usr/home/hudson/hudson-slave/workspace/Lucene-Solr-NightlyTests-trunk/solr/core/lib/commons-lang-2.6.jar:/usr/home/hudson/hudson-slave/workspace/Lucene-Solr-NightlyTests-trunk/solr/core/lib/easymock-3.0.jar:/usr/home/hudson/hudson-slave/workspace/Lucene-Solr-NightlyTests-trunk/solr/core/lib/guava-13.0.1.jar:/usr/home/hudson/hudson-slave/workspace/Lucene-Solr-NightlyTests-trunk/solr/core/lib/javax.servlet-api-3.0.1.jar:/usr/home/hudson/hudson-slave/workspace/Lucene-Solr-NightlyTests-trunk/solr/core/lib/metrics-core-2.1.2.jar:/usr/home/hudson/hudson-slave/workspace/Lucene-Solr-NightlyTests-trunk/solr/core/lib/objenesis-1.2.jar:/usr/home/hudson/hudson-slave/workspace/Lucene-Solr-NightlyTests-trunk/solr/core/lib/spatial4j-0.3.jar:/usr/home/hudson/hudson-slave/workspace/Lucene-Solr-NightlyTests-trunk/solr/solrj/lib/commons-io-2.1.jar:/usr/home/hudson/hudson-slave/workspace/Lucene-Solr-NightlyTests-trunk/solr/solrj/lib/httpclient-4.1.3.jar:/usr/home/hudson/hudson-slave/workspace/Lucene-Solr-NightlyTests-trunk/solr/solrj/lib/httpcore-4.1.4.jar:/usr/home/hudson/hudson-slave/workspace/Lucene-Solr-NightlyTests-trunk/solr/solrj/lib/httpmime-4.1.3.jar:/usr/home/hudson/hudson-slave/workspace/Lucene-Solr-NightlyTests-trunk/solr/solrj/lib/jcl-over-slf4j-1.6.4.jar:/usr/home/hudson/hudson-slave/workspace/Lucene-Solr-NightlyTests-trunk/solr/solrj/lib/log4j-over-slf4j-1.6.4.jar:/usr/home/hudson/hudson-slave/workspace/Lucene-Solr-NightlyTests-trunk/solr/solrj/lib/slf4j-api-1.6.4.jar:/usr/home/hudson/hudson-slave/workspace/Lucene-Solr-NightlyTests-trunk/solr/solrj/lib/slf4j-jdk14-1.6.4.jar:/usr/home/hudson/hudson-slave/workspace/Lucene-Solr-NightlyTests-trunk/solr/solrj/lib/wstx-asl-3.2.7.jar:/usr/home/hudson/hudson-slave/workspace/Lucene-Solr-NightlyTests-trunk/solr/solrj/lib/zookeeper-3.4.5.jar:/usr/home/hudson/hudson-slave/workspace/Lucene-Solr-NightlyTests-trunk/solr/example/lib/jetty-continuation-8.1.8.v20121106.jar:/usr/home/hudson/hudson-slave/workspace/Lucene-Solr-NightlyTests-trunk/solr/example/lib/jetty-deploy-8.1.8.v20121106.jar:/usr/home/hudson/hudson-slave/workspace/Lucene-Solr-NightlyTests-trunk/solr/example/lib/jetty-http-8.1.8.v20121106.jar:/usr/home/hudson/hudson-slave/workspace/Lucene-Solr-NightlyTests-trunk/solr/example/lib/jetty-io-8.1.8.v20121106.jar:/usr/home/hudson/hudson-slave/workspace/Lucene-Solr-NightlyTests-trunk/solr/example/lib/jetty-jmx-8.1.8.v20121106.jar:/usr/home/hudson/hudson-slave/workspace/Lucene-Solr-NightlyTests-trunk/solr/example/lib/jetty-security-8.1.8.v20121106.jar:/usr/home/hudson/hudson-slave/workspace/Lucene-Solr-NightlyTests-trunk/solr/example/lib/jetty-server-8.1.8.v20121106.jar:/usr/home/hudson/hudson-slave/workspace/Lucene-Solr-NightlyTests-trunk/solr/example/lib/jetty-servlet-8.1.8.v20121106.jar:/usr/home/hudson/hudson-slave/workspace/Lucene-Solr-NightlyTests-trunk/solr/example/lib/jetty-util-8.1.8.v20121106.jar:/usr/home/hudson/hudson-slave/workspace/Lucene-Solr-NightlyTests-trunk/solr/example/lib/jetty-webapp-8.1.8.v20121106.jar:/usr/home/hudson/hudson-slave/workspace/Lucene-Solr-NightlyTests-trunk/solr/example/lib/jetty-xml-8.1.8.v20121106.jar:/usr/home/hudson/hudson-slave/workspace/Lucene-Solr-NightlyTests-trunk/solr/example/lib/servlet-api-3.0.jar:/usr/home/hudson/hudson-slave/workspace/Lucene-Solr-NightlyTests-trunk/solr/example/example-DIH/solr/db/lib/derby-10.9.1.0.jar:/usr/home/hudson/hudson-slave/workspace/Lucene-Solr-NightlyTests-trunk/solr/example/example-DIH/solr/db/lib/hsqldb-1.8.0.10.jar:/usr/home/hudson/hudson-slave/workspace/Lucene-Solr-NightlyTests-trunk/lucene/build/core/classes/java:/usr/home/hudson/hudson-slave/workspace/Lucene-Solr-NightlyTests-trunk/lucene/test-framework/lib/junit-4.10.jar:/usr/home/hudson/hudson-slave/workspace/Lucene-Solr-NightlyTests-trunk/lucene/test-framework/lib/randomizedtesting-runner-2.0.6.jar:/home/hudson/hudson-slave/tools/Ant/ant-1.8.2/lib/ant-launcher.jar:/home/hudson/.ant/lib/ivy-2.2.0.jar:/home/hudson/hudson-slave/tools/Ant/ant-1.8.2/lib/ant-apache-regexp.jar:/home/hudson/hudson-slave/tools/Ant/ant-1.8.2/lib/ant-junit.jar:/home/hudson/hudson-slave/tools/Ant/ant-1.8.2/lib/ant-apache-bsf.jar:/home/hudson/hudson-slave/tools/Ant/ant-1.8.2/lib/ant-commons-net.jar:/home/hudson/hudson-slave/tools/Ant/ant-1.8.2/lib/ant-antlr.jar:/home/hudson/hudson-slave/tools/Ant/ant-1.8.2/lib/ant-apache-log4j.jar:/home/hudson/hudson-slave/tools/Ant/ant-1.8.2/lib/ant-commons-logging.jar:/home/hudson/hudson-slave/tools/Ant/ant-1.8.2/lib/ant-apache-xalan2.jar:/home/hudson/hudson-slave/tools/Ant/ant-1.8.2/lib/ant-apache-oro.jar:/home/hudson/hudson-slave/tools/Ant/ant-1.8.2/lib/ant-junit4.jar:/home/hudson/hudson-slave/tools/Ant/ant-1.8.2/lib/ant-netrexx.jar:/home/hudson/hudson-slave/tools/Ant/ant-1.8.2/lib/ant-swing.jar:/home/hudson/hudson-slave/tools/Ant/ant-1.8.2/lib/ant-javamail.jar:/home/hudson/hudson-slave/tools/Ant/ant-1.8.2/lib/ant-jsch.jar:/home/hudson/hudson-slave/tools/Ant/ant-1.8.2/lib/ant-jmf.jar:/home/hudson/hudson-slave/tools/Ant/ant-1.8.2/lib/ant.jar:/home/hudson/hudson-slave/tools/Ant/ant-1.8.2/lib/ant-apache-bcel.jar:/home/hudson/hudson-slave/tools/Ant/ant-1.8.2/lib/ant-jai.jar:/home/hudson/hudson-slave/tools/Ant/ant-1.8.2/lib/ant-testutil.jar:/home/hudson/hudson-slave/tools/Ant/ant-1.8.2/lib/ant-apache-resolver.jar:/home/hudson/hudson-slave/tools/Ant/ant-1.8.2/lib/ant-jdepend.jar:/usr/local/openjdk6/lib/tools.jar:/home/hudson/.ivy2/cache/com.carrotsearch.randomizedtesting/junit4-ant/jars/junit4-ant-2.0.6.jar
[junit4:junit4]   2> 108 T680 oaz.Environment.logEnv Server environment:java.library.path=/usr/local/openjdk6/jre/lib/amd64/server:/usr/local/openjdk6/jre/lib/amd64:/usr/local/openjdk6/jre/../lib/amd64:/usr/java/packages/lib/amd64:/lib:/usr/lib:/usr/local/lib
[junit4:junit4]   2> 108 T680 oaz.Environment.logEnv Server environment:java.io.tmpdir=.
[junit4:junit4]   2> 108 T680 oaz.Environment.logEnv Server environment:java.compiler=<NA>
[junit4:junit4]   2> 108 T680 oaz.Environment.logEnv Server environment:os.name=FreeBSD
[junit4:junit4]   2> 108 T680 oaz.Environment.logEnv Server environment:os.arch=amd64
[junit4:junit4]   2> 108 T680 oaz.Environment.logEnv Server environment:os.version=9.0-RELEASE
[junit4:junit4]   2> 109 T680 oaz.Environment.logEnv Server environment:user.name=hudson
[junit4:junit4]   2> 109 T680 oaz.Environment.logEnv Server environment:user.home=/home/hudson
[junit4:junit4]   2> 109 T680 oaz.Environment.logEnv Server environment:user.dir=/usr/home/hudson/hudson-slave/workspace/Lucene-Solr-NightlyTests-trunk/solr/build/solr-core/test/J0
[junit4:junit4]   2> 151 T680 oazs.ZooKeeperServer.setTickTime tickTime set to 1000
[junit4:junit4]   2> 152 T680 oazs.ZooKeeperServer.setMinSessionTimeout minSessionTimeout set to -1
[junit4:junit4]   2> 152 T680 oazs.ZooKeeperServer.setMaxSessionTimeout maxSessionTimeout set to -1
[junit4:junit4]   2> 156 T680 oazs.NIOServerCnxnFactory.configure binding to port 0.0.0.0/0.0.0.0:0
[junit4:junit4]   2> 213 T680 oazsp.FileTxnSnapLog.save Snapshotting: 0x0 to /usr/home/hudson/hudson-slave/workspace/Lucene-Solr-NightlyTests-trunk/solr/build/solr-core/test/J0/./org.apache.solr.cloud.BasicDistributedZk2Test-1355707361738/zookeeper/server1/data/version-2/snapshot.0
[junit4:junit4]   2> 220 T679 oasc.ZkTestServer.run start zk server on port:28187
[junit4:junit4]   2> 327 T679 oaz.Environment.logEnv Client environment:zookeeper.version=3.4.5-1392090, built on 09/30/2012 17:52 GMT
[junit4:junit4]   2> 328 T679 oaz.Environment.logEnv Client environment:host.name=lucene.zones.apache.org
[junit4:junit4]   2> 328 T679 oaz.Environment.logEnv Client environment:java.version=1.6.0_32
[junit4:junit4]   2> 329 T679 oaz.Environment.logEnv Client environment:java.vendor=Sun Microsystems Inc.
[junit4:junit4]   2> 329 T679 oaz.Environment.logEnv Client environment:java.home=/usr/local/openjdk6/jre
[junit4:junit4]   2> 329 T679 oaz.Environment.logEnv Client environment:java.class.path=/usr/home/hudson/hudson-slave/workspace/Lucene-Solr-NightlyTests-trunk/solr/build/solr-core/classes/test:/usr/home/hudson/hudson-slave/workspace/Lucene-Solr-NightlyTests-trunk/solr/build/solr-test-framework/classes/java:/usr/home/hudson/hudson-slave/workspace/Lucene-Solr-NightlyTests-trunk/solr/build/solr-core/test-files:/usr/home/hudson/hudson-slave/workspace/Lucene-Solr-NightlyTests-trunk/lucene/build/test-framework/classes/java:/usr/home/hudson/hudson-slave/workspace/Lucene-Solr-NightlyTests-trunk/lucene/build/codecs/classes/java:/usr/home/hudson/hudson-slave/workspace/Lucene-Solr-NightlyTests-trunk/solr/build/solr-solrj/classes/java:/usr/home/hudson/hudson-slave/workspace/Lucene-Solr-NightlyTests-trunk/solr/build/solr-core/classes/java:/usr/home/hudson/hudson-slave/workspace/Lucene-Solr-NightlyTests-trunk/lucene/build/analysis/common/lucene-analyzers-common-5.0-SNAPSHOT.jar:/usr/home/hudson/hudson-slave/workspace/Lucene-Solr-NightlyTests-trunk/lucene/build/analysis/kuromoji/lucene-analyzers-kuromoji-5.0-SNAPSHOT.jar:/usr/home/hudson/hudson-slave/workspace/Lucene-Solr-NightlyTests-trunk/lucene/build/analysis/phonetic/lucene-analyzers-phonetic-5.0-SNAPSHOT.jar:/usr/home/hudson/hudson-slave/workspace/Lucene-Solr-NightlyTests-trunk/lucene/build/highlighter/lucene-highlighter-5.0-SNAPSHOT.jar:/usr/home/hudson/hudson-slave/workspace/Lucene-Solr-NightlyTests-trunk/lucene/build/memory/lucene-memory-5.0-SNAPSHOT.jar:/usr/home/hudson/hudson-slave/workspace/Lucene-Solr-NightlyTests-trunk/lucene/build/misc/lucene-misc-5.0-SNAPSHOT.jar:/usr/home/hudson/hudson-slave/workspace/Lucene-Solr-NightlyTests-trunk/lucene/build/spatial/lucene-spatial-5.0-SNAPSHOT.jar:/usr/home/hudson/hudson-slave/workspace/Lucene-Solr-NightlyTests-trunk/lucene/build/suggest/lucene-suggest-5.0-SNAPSHOT.jar:/usr/home/hudson/hudson-slave/workspace/Lucene-Solr-NightlyTests-trunk/lucene/build/grouping/lucene-grouping-5.0-SNAPSHOT.jar:/usr/home/hudson/hudson-slave/workspace/Lucene-Solr-NightlyTests-trunk/lucene/build/queries/lucene-queries-5.0-SNAPSHOT.jar:/usr/home/hudson/hudson-slave/workspace/Lucene-Solr-NightlyTests-trunk/lucene/build/queryparser/lucene-queryparser-5.0-SNAPSHOT.jar:/usr/home/hudson/hudson-slave/workspace/Lucene-Solr-NightlyTests-trunk/solr/core/lib/cglib-nodep-2.2.jar:/usr/home/hudson/hudson-slave/workspace/Lucene-Solr-NightlyTests-trunk/solr/core/lib/commons-cli-1.2.jar:/usr/home/hudson/hudson-slave/workspace/Lucene-Solr-NightlyTests-trunk/solr/core/lib/commons-codec-1.7.jar:/usr/home/hudson/hudson-slave/workspace/Lucene-Solr-NightlyTests-trunk/solr/core/lib/commons-fileupload-1.2.1.jar:/usr/home/hudson/hudson-slave/workspace/Lucene-Solr-NightlyTests-trunk/solr/core/lib/commons-lang-2.6.jar:/usr/home/hudson/hudson-slave/workspace/Lucene-Solr-NightlyTests-trunk/solr/core/lib/easymock-3.0.jar:/usr/home/hudson/hudson-slave/workspace/Lucene-Solr-NightlyTests-trunk/solr/core/lib/guava-13.0.1.jar:/usr/home/hudson/hudson-slave/workspace/Lucene-Solr-NightlyTests-trunk/solr/core/lib/javax.servlet-api-3.0.1.jar:/usr/home/hudson/hudson-slave/workspace/Lucene-Solr-NightlyTests-trunk/solr/core/lib/metrics-core-2.1.2.jar:/usr/home/hudson/hudson-slave/workspace/Lucene-Solr-NightlyTests-trunk/solr/core/lib/objenesis-1.2.jar:/usr/home/hudson/hudson-slave/workspace/Lucene-Solr-NightlyTests-trunk/solr/core/lib/spatial4j-0.3.jar:/usr/home/hudson/hudson-slave/workspace/Lucene-Solr-NightlyTests-trunk/solr/solrj/lib/commons-io-2.1.jar:/usr/home/hudson/hudson-slave/workspace/Lucene-Solr-NightlyTests-trunk/solr/solrj/lib/httpclient-4.1.3.jar:/usr/home/hudson/hudson-slave/workspace/Lucene-Solr-NightlyTests-trunk/solr/solrj/lib/httpcore-4.1.4.jar:/usr/home/hudson/hudson-slave/workspace/Lucene-Solr-NightlyTests-trunk/solr/solrj/lib/httpmime-4.1.3.jar:/usr/home/hudson/hudson-slave/workspace/Lucene-Solr-NightlyTests-trunk/solr/solrj/lib/jcl-over-slf4j-1.6.4.jar:/usr/home/hudson/hudson-slave/workspace/Lucene-Solr-NightlyTests-trunk/solr/solrj/lib/log4j-over-slf4j-1.6.4.jar:/usr/home/hudson/hudson-slave/workspace/Lucene-Solr-NightlyTests-trunk/solr/solrj/lib/slf4j-api-1.6.4.jar:/usr/home/hudson/hudson-slave/workspace/Lucene-Solr-NightlyTests-trunk/solr/solrj/lib/slf4j-jdk14-1.6.4.jar:/usr/home/hudson/hudson-slave/workspace/Lucene-Solr-NightlyTests-trunk/solr/solrj/lib/wstx-asl-3.2.7.jar:/usr/home/hudson/hudson-slave/workspace/Lucene-Solr-NightlyTests-trunk/solr/solrj/lib/zookeeper-3.4.5.jar:/usr/home/hudson/hudson-slave/workspace/Lucene-Solr-NightlyTests-trunk/solr/example/lib/jetty-continuation-8.1.8.v20121106.jar:/usr/home/hudson/hudson-slave/workspace/Lucene-Solr-NightlyTests-trunk/solr/example/lib/jetty-deploy-8.1.8.v20121106.jar:/usr/home/hudson/hudson-slave/workspace/Lucene-Solr-NightlyTests-trunk/solr/example/lib/jetty-http-8.1.8.v20121106.jar:/usr/home/hudson/hudson-slave/workspace/Lucene-Solr-NightlyTests-trunk/solr/example/lib/jetty-io-8.1.8.v20121106.jar:/usr/home/hudson/hudson-slave/workspace/Lucene-Solr-NightlyTests-trunk/solr/example/lib/jetty-jmx-8.1.8.v20121106.jar:/usr/home/hudson/hudson-slave/workspace/Lucene-Solr-NightlyTests-trunk/solr/example/lib/jetty-security-8.1.8.v20121106.jar:/usr/home/hudson/hudson-slave/workspace/Lucene-Solr-NightlyTests-trunk/solr/example/lib/jetty-server-8.1.8.v20121106.jar:/usr/home/hudson/hudson-slave/workspace/Lucene-Solr-NightlyTests-trunk/solr/example/lib/jetty-servlet-8.1.8.v20121106.jar:/usr/home/hudson/hudson-slave/workspace/Lucene-Solr-NightlyTests-trunk/solr/example/lib/jetty-util-8.1.8.v20121106.jar:/usr/home/hudson/hudson-slave/workspace/Lucene-Solr-NightlyTests-trunk/solr/example/lib/jetty-webapp-8.1.8.v20121106.jar:/usr/home/hudson/hudson-slave/workspace/Lucene-Solr-NightlyTests-trunk/solr/example/lib/jetty-xml-8.1.8.v20121106.jar:/usr/home/hudson/hudson-slave/workspace/Lucene-Solr-NightlyTests-trunk/solr/example/lib/servlet-api-3.0.jar:/usr/home/hudson/hudson-slave/workspace/Lucene-Solr-NightlyTests-trunk/solr/example/example-DIH/solr/db/lib/derby-10.9.1.0.jar:/usr/home/hudson/hudson-slave/workspace/Lucene-Solr-NightlyTests-trunk/solr/example/example-DIH/solr/db/lib/hsqldb-1.8.0.10.jar:/usr/home/hudson/hudson-slave/workspace/Lucene-Solr-NightlyTests-trunk/lucene/build/core/classes/java:/usr/home/hudson/hudson-slave/workspace/Lucene-Solr-NightlyTests-trunk/lucene/test-framework/lib/junit-4.10.jar:/usr/home/hudson/hudson-slave/workspace/Lucene-Solr-NightlyTests-trunk/lucene/test-framework/lib/randomizedtesting-runner-2.0.6.jar:/home/hudson/hudson-slave/tools/Ant/ant-1.8.2/lib/ant-launcher.jar:/home/hudson/.ant/lib/ivy-2.2.0.jar:/home/hudson/hudson-slave/tools/Ant/ant-1.8.2/lib/ant-apache-regexp.jar:/home/hudson/hudson-slave/tools/Ant/ant-1.8.2/lib/ant-junit.jar:/home/hudson/hudson-slave/tools/Ant/ant-1.8.2/lib/ant-apache-bsf.jar:/home/hudson/hudson-slave/tools/Ant/ant-1.8.2/lib/ant-commons-net.jar:/home/hudson/hudson-slave/tools/Ant/ant-1.8.2/lib/ant-antlr.jar:/home/hudson/hudson-slave/tools/Ant/ant-1.8.2/lib/ant-apache-log4j.jar:/home/hudson/hudson-slave/tools/Ant/ant-1.8.2/lib/ant-commons-logging.jar:/home/hudson/hudson-slave/tools/Ant/ant-1.8.2/lib/ant-apache-xalan2.jar:/home/hudson/hudson-slave/tools/Ant/ant-1.8.2/lib/ant-apache-oro.jar:/home/hudson/hudson-slave/tools/Ant/ant-1.8.2/lib/ant-junit4.jar:/home/hudson/hudson-slave/tools/Ant/ant-1.8.2/lib/ant-netrexx.jar:/home/hudson/hudson-slave/tools/Ant/ant-1.8.2/lib/ant-swing.jar:/home/hudson/hudson-slave/tools/Ant/ant-1.8.2/lib/ant-javamail.jar:/home/hudson/hudson-slave/tools/Ant/ant-1.8.2/lib/ant-jsch.jar:/home/hudson/hudson-slave/tools/Ant/ant-1.8.2/lib/ant-jmf.jar:/home/hudson/hudson-slave/tools/Ant/ant-1.8.2/lib/ant.jar:/home/hudson/hudson-slave/tools/Ant/ant-1.8.2/lib/ant-apache-bcel.jar:/home/hudson/hudson-slave/tools/Ant/ant-1.8.2/lib/ant-jai.jar:/home/hudson/hudson-slave/tools/Ant/ant-1.8.2/lib/ant-testutil.jar:/home/hudson/hudson-slave/tools/Ant/ant-1.8.2/lib/ant-apache-resolver.jar:/home/hudson/hudson-slave/tools/Ant/ant-1.8.2/lib/ant-jdepend.jar:/usr/local/openjdk6/lib/tools.jar:/home/hudson/.ivy2/cache/com.carrotsearch.randomizedtesting/junit4-ant/jars/junit4-ant-2.0.6.jar
[junit4:junit4]   2> 330 T679 oaz.Environment.logEnv Client environment:java.library.path=/usr/local/openjdk6/jre/lib/amd64/server:/usr/local/openjdk6/jre/lib/amd64:/usr/local/openjdk6/jre/../lib/amd64:/usr/java/packages/lib/amd64:/lib:/usr/lib:/usr/local/lib
[junit4:junit4]   2> 331 T679 oaz.Environment.logEnv Client environment:java.io.tmpdir=.
[junit4:junit4]   2> 331 T679 oaz.Environment.logEnv Client environment:java.compiler=<NA>
[junit4:junit4]   2> 331 T679 oaz.Environment.logEnv Client environment:os.name=FreeBSD
[junit4:junit4]   2> 332 T679 oaz.Environment.logEnv Client environment:os.arch=amd64
[junit4:junit4]   2> 332 T679 oaz.Environment.logEnv Client environment:os.version=9.0-RELEASE
[junit4:junit4]   2> 332 T679 oaz.Environment.logEnv Client environment:user.name=hudson
[junit4:junit4]   2> 332 T679 oaz.Environment.logEnv Client environment:user.home=/home/hudson
[junit4:junit4]   2> 333 T679 oaz.Environment.logEnv Client environment:user.dir=/usr/home/hudson/hudson-slave/workspace/Lucene-Solr-NightlyTests-trunk/solr/build/solr-core/test/J0
[junit4:junit4]   2> 337 T679 oaz.ZooKeeper.<init> Initiating client connection, connectString=127.0.0.1:28187 sessionTimeout=10000 watcher=org.apache.solr.common.cloud.ConnectionManager@556fcc07
[junit4:junit4]   2> 416 T679 oascc.ConnectionManager.waitForConnected Waiting for client to connect to ZooKeeper
[junit4:junit4]   2> 424 T685 oaz.ClientCnxn$SendThread.logStartConnect Opening socket connection to server localhost/127.0.0.1:28187. Will not attempt to authenticate using SASL (access denied (javax.security.auth.AuthPermission getLoginConfiguration))
[junit4:junit4]   2> 427 T685 oaz.ClientCnxn$SendThread.primeConnection Socket connection established to localhost/127.0.0.1:28187, initiating session
[junit4:junit4]   2> 427 T681 oazs.NIOServerCnxnFactory.run Accepted socket connection from /140.211.11.196:28188
[junit4:junit4]   2> 452 T681 oazs.ZooKeeperServer.processConnectRequest Client attempting to establish new session at /140.211.11.196:28188
[junit4:junit4]   2> 464 T683 oazsp.FileTxnLog.append Creating new log file: log.1
[junit4:junit4]   2> 495 T683 oazs.ZooKeeperServer.finishSessionInit Established session 0x13ba674aac30000 with negotiated timeout 10000 for client /140.211.11.196:28188
[junit4:junit4]   2> 496 T685 oaz.ClientCnxn$SendThread.onConnected Session establishment complete on server localhost/127.0.0.1:28187, sessionid = 0x13ba674aac30000, negotiated timeout = 10000
[junit4:junit4]   2> 501 T686 oascc.ConnectionManager.process Watcher org.apache.solr.common.cloud.ConnectionManager@556fcc07 name:ZooKeeperConnection Watcher:127.0.0.1:28187 got event WatchedEvent state:SyncConnected type:None path:null path:null type:None
[junit4:junit4]   2> 502 T679 oascc.ConnectionManager.waitForConnected Client is connected to ZooKeeper
[junit4:junit4]   2> 505 T679 oascc.SolrZkClient.makePath makePath: /solr
[junit4:junit4]   2> 567 T684 oazs.PrepRequestProcessor.pRequest2Txn Processed session termination for sessionid: 0x13ba674aac30000
[junit4:junit4]   2> 568 T686 oaz.ClientCnxn$EventThread.run EventThread shut down
[junit4:junit4]   2> 568 T679 oaz.ZooKeeper.close Session: 0x13ba674aac30000 closed
[junit4:junit4]   2> 569 T679 oaz.ZooKeeper.<init> Initiating client connection, connectString=127.0.0.1:28187/solr sessionTimeout=10000 watcher=org.apache.solr.common.cloud.ConnectionManager@741ac86c
[junit4:junit4]   2> 569 T681 oazs.NIOServerCnxn.closeSock Closed socket connection for client /140.211.11.196:28188 which had sessionid 0x13ba674aac30000
[junit4:junit4]   2> 570 T679 oascc.ConnectionManager.waitForConnected Waiting for client to connect to ZooKeeper
[junit4:junit4]   2> 570 T687 oaz.ClientCnxn$SendThread.logStartConnect Opening socket connection to server localhost/127.0.0.1:28187. Will not attempt to authenticate using SASL (access denied (javax.security.auth.AuthPermission getLoginConfiguration))
[junit4:junit4]   2> 570 T687 oaz.ClientCnxn$SendThread.primeConnection Socket connection established to localhost/127.0.0.1:28187, initiating session
[junit4:junit4]   2> 571 T681 oazs.NIOServerCnxnFactory.run Accepted socket connection from /140.211.11.196:28189
[junit4:junit4]   2> 571 T681 oazs.ZooKeeperServer.processConnectRequest Client attempting to establish new session at /140.211.11.196:28189
[junit4:junit4]   2> 572 T683 oazs.ZooKeeperServer.finishSessionInit Established session 0x13ba674aac30001 with negotiated timeout 10000 for client /140.211.11.196:28189
[junit4:junit4]   2> 572 T687 oaz.ClientCnxn$SendThread.onConnected Session establishment complete on server localhost/127.0.0.1:28187, sessionid = 0x13ba674aac30001, negotiated timeout = 10000
[junit4:junit4]   2> 573 T688 oascc.ConnectionManager.process Watcher org.apache.solr.common.cloud.ConnectionManager@741ac86c name:ZooKeeperConnection Watcher:127.0.0.1:28187/solr got event WatchedEvent state:SyncConnected type:None path:null path:null type:None
[junit4:junit4]   2> 573 T679 oascc.ConnectionManager.waitForConnected Client is connected to ZooKeeper
[junit4:junit4]   2> 577 T679 oascc.SolrZkClient.makePath makePath: /collections/collection1
[junit4:junit4]   2> 582 T679 oascc.SolrZkClient.makePath makePath: /collections/collection1/shards
[junit4:junit4]   2> 592 T679 oascc.SolrZkClient.makePath makePath: /collections/control_collection
[junit4:junit4]   2> 595 T679 oascc.SolrZkClient.makePath makePath: /collections/control_collection/shards
[junit4:junit4]   2> 600 T679 oasc.AbstractZkTestCase.putConfig put /usr/home/hudson/hudson-slave/workspace/Lucene-Solr-NightlyTests-trunk/solr/build/solr-core/test-files/solr/collection1/conf/solrconfig.xml to /configs/conf1/solrconfig.xml
[junit4:junit4]   2> 601 T679 oascc.SolrZkClient.makePath makePath: /configs/conf1/solrconfig.xml
[junit4:junit4]   2> 615 T679 oasc.AbstractZkTestCase.putConfig put /usr/home/hudson/hudson-slave/workspace/Lucene-Solr-NightlyTests-trunk/solr/build/solr-core/test-files/solr/collection1/conf/schema.xml to /configs/conf1/schema.xml
[junit4:junit4]   2> 616 T679 oascc.SolrZkClient.makePath makePath: /configs/conf1/schema.xml
[junit4:junit4]   2> 621 T679 oasc.AbstractZkTestCase.putConfig put /usr/home/hudson/hudson-slave/workspace/Lucene-Solr-NightlyTests-trunk/solr/build/solr-core/test-files/solr/collection1/conf/stopwords.txt to /configs/conf1/stopwords.txt
[junit4:junit4]   2> 622 T679 oascc.SolrZkClient.makePath makePath: /configs/conf1/stopwords.txt
[junit4:junit4]   2> 626 T679 oasc.AbstractZkTestCase.putConfig put /usr/home/hudson/hudson-slave/workspace/Lucene-Solr-NightlyTests-trunk/solr/build/solr-core/test-files/solr/collection1/conf/protwords.txt to /configs/conf1/protwords.txt
[junit4:junit4]   2> 627 T679 oascc.SolrZkClient.makePath makePath: /configs/conf1/protwords.txt
[junit4:junit4]   2> 631 T679 oasc.AbstractZkTestCase.putConfig put /usr/home/hudson/hudson-slave/workspace/Lucene-Solr-NightlyTests-trunk/solr/build/solr-core/test-files/solr/collection1/conf/currency.xml to /configs/conf1/currency.xml
[junit4:junit4]   2> 631 T679 oascc.SolrZkClient.makePath makePath: /configs/conf1/currency.xml
[junit4:junit4]   2> 635 T679 oasc.AbstractZkTestCase.putConfig put /usr/home/hudson/hudson-slave/workspace/Lucene-Solr-NightlyTests-trunk/solr/build/solr-core/test-files/solr/collection1/conf/open-exchange-rates.json to /configs/conf1/open-exchange-rates.json
[junit4:junit4]   2> 636 T679 oascc.SolrZkClient.makePath makePath: /configs/conf1/open-exchange-rates.json
[junit4:junit4]   2> 640 T679 oasc.AbstractZkTestCase.putConfig put /usr/home/hudson/hudson-slave/workspace/Lucene-Solr-NightlyTests-trunk/solr/build/solr-core/test-files/solr/collection1/conf/mapping-ISOLatin1Accent.txt to /configs/conf1/mapping-ISOLatin1Accent.txt
[junit4:junit4]   2> 641 T679 oascc.SolrZkClient.makePath makePath: /configs/conf1/mapping-ISOLatin1Accent.txt
[junit4:junit4]   2> 647 T679 oasc.AbstractZkTestCase.putConfig put /usr/home/hudson/hudson-slave/workspace/Lucene-Solr-NightlyTests-trunk/solr/build/solr-core/test-files/solr/collection1/conf/old_synonyms.txt to /configs/conf1/old_synonyms.txt
[junit4:junit4]   2> 647 T679 oascc.SolrZkClient.makePath makePath: /configs/conf1/old_synonyms.txt
[junit4:junit4]   2> 652 T679 oasc.AbstractZkTestCase.putConfig put /usr/home/hudson/hudson-slave/workspace/Lucene-Solr-NightlyTests-trunk/solr/build/solr-core/test-files/solr/collection1/conf/synonyms.txt to /configs/conf1/synonyms.txt
[junit4:junit4]   2> 653 T679 oascc.SolrZkClient.makePath makePath: /configs/conf1/synonyms.txt
[junit4:junit4]   2> 658 T684 oazs.PrepRequestProcessor.pRequest2Txn Processed session termination for sessionid: 0x13ba674aac30001
[junit4:junit4]   2> 659 T688 oaz.ClientCnxn$EventThread.run EventThread shut down
[junit4:junit4]   2> 659 T679 oaz.ZooKeeper.close Session: 0x13ba674aac30001 closed
[junit4:junit4]   2> 659 T681 oazs.NIOServerCnxn.closeSock Closed socket connection for client /140.211.11.196:28189 which had sessionid 0x13ba674aac30001
[junit4:junit4]   2> 768 T679 oejs.Server.doStart jetty-8.1.8.v20121106
[junit4:junit4]   2> 771 T679 oejs.AbstractConnector.doStart Started SocketConnector@127.0.0.1:28190
[junit4:junit4]   2> 772 T679 oasc.SolrResourceLoader.locateSolrHome JNDI not configured for solr (NoInitialContextEx)
[junit4:junit4]   2> 772 T679 oasc.SolrResourceLoader.locateSolrHome using system property solr.solr.home: /usr/home/hudson/hudson-slave/workspace/Lucene-Solr-NightlyTests-trunk/solr/build/solr-core/test/J0/./org.apache.solr.cloud.BasicDistributedZk2Test-controljetty-1355707362391
[junit4:junit4]   2> 773 T679 oasc.SolrResourceLoader.<init> new SolrResourceLoader for deduced Solr Home: '/usr/home/hudson/hudson-slave/workspace/Lucene-Solr-NightlyTests-trunk/solr/build/solr-core/test/J0/./org.apache.solr.cloud.BasicDistributedZk2Test-controljetty-1355707362391/'
[junit4:junit4]   2> 798 T679 oass.SolrDispatchFilter.init SolrDispatchFilter.init()
[junit4:junit4]   2> 799 T679 oasc.SolrResourceLoader.locateSolrHome JNDI not configured for solr (NoInitialContextEx)
[junit4:junit4]   2> 799 T679 oasc.SolrResourceLoader.locateSolrHome using system property solr.solr.home: /usr/home/hudson/hudson-slave/workspace/Lucene-Solr-NightlyTests-trunk/solr/build/solr-core/test/J0/./org.apache.solr.cloud.BasicDistributedZk2Test-controljetty-1355707362391
[junit4:junit4]   2> 800 T679 oasc.CoreContainer$Initializer.initialize looking for solr.xml: /usr/home/hudson/hudson-slave/workspace/Lucene-Solr-NightlyTests-trunk/solr/build/solr-core/test/J0/./org.apache.solr.cloud.BasicDistributedZk2Test-controljetty-1355707362391/solr.xml
[junit4:junit4]   2> 801 T679 oasc.CoreContainer.<init> New CoreContainer 329269993
[junit4:junit4]   2> 802 T679 oasc.CoreContainer.load Loading CoreContainer using Solr Home: '/usr/home/hudson/hudson-slave/workspace/Lucene-Solr-NightlyTests-trunk/solr/build/solr-core/test/J0/./org.apache.solr.cloud.BasicDistributedZk2Test-controljetty-1355707362391/'
[junit4:junit4]   2> 803 T679 oasc.SolrResourceLoader.<init> new SolrResourceLoader for directory: '/usr/home/hudson/hudson-slave/workspace/Lucene-Solr-NightlyTests-trunk/solr/build/solr-core/test/J0/./org.apache.solr.cloud.BasicDistributedZk2Test-controljetty-1355707362391/'
[junit4:junit4]   2> 822 T679 oasc.CoreContainer.load Registering Log Listener
[junit4:junit4]   2> 833 T679 oasc.CoreContainer.initZooKeeper Zookeeper client=127.0.0.1:28187/solr
[junit4:junit4]   2> 852 T679 oasc.ZkController.checkChrootPath zkHost includes chroot
[junit4:junit4]   2> 852 T679 oaz.ZooKeeper.<init> Initiating client connection, connectString=127.0.0.1:28187 sessionTimeout=60000 watcher=org.apache.solr.common.cloud.ConnectionManager@39cf0fe4
[junit4:junit4]   2> 853 T679 oascc.ConnectionManager.waitForConnected Waiting for client to connect to ZooKeeper
[junit4:junit4]   2> 853 T698 oaz.ClientCnxn$SendThread.logStartConnect Opening socket connection to server localhost/127.0.0.1:28187. Will not attempt to authenticate using SASL (access denied (javax.security.auth.AuthPermission getLoginConfiguration))
[junit4:junit4]   2> 854 T698 oaz.ClientCnxn$SendThread.primeConnection Socket connection established to localhost/127.0.0.1:28187, initiating session
[junit4:junit4]   2> 854 T681 oazs.NIOServerCnxnFactory.run Accepted socket connection from /140.211.11.196:28191
[junit4:junit4]   2> 855 T681 oazs.ZooKeeperServer.processConnectRequest Client attempting to establish new session at /140.211.11.196:28191
[junit4:junit4]   2> 883 T683 oazs.ZooKeeperServer.finishSessionInit Established session 0x13ba674aac30002 with negotiated timeout 20000 for client /140.211.11.196:28191
[junit4:junit4]   2> 883 T698 oaz.ClientCnxn$SendThread.onConnected Session establishment complete on server localhost/127.0.0.1:28187, sessionid = 0x13ba674aac30002, negotiated timeout = 20000
[junit4:junit4]   2> 883 T699 oascc.ConnectionManager.process Watcher org.apache.solr.common.cloud.ConnectionManager@39cf0fe4 name:ZooKeeperConnection Watcher:127.0.0.1:28187 got event WatchedEvent state:SyncConnected type:None path:null path:null type:None
[junit4:junit4]   2> 883 T679 oascc.ConnectionManager.waitForConnected Client is connected to ZooKeeper
[junit4:junit4]   2> 885 T684 oazs.PrepRequestProcessor.pRequest2Txn Processed session termination for sessionid: 0x13ba674aac30002
[junit4:junit4]   2> 886 T699 oaz.ClientCnxn$EventThread.run EventThread shut down
[junit4:junit4]   2> 886 T681 oazs.NIOServerCnxn.closeSock Closed socket connection for client /140.211.11.196:28191 which had sessionid 0x13ba674aac30002
[junit4:junit4]   2> 886 T679 oaz.ZooKeeper.close Session: 0x13ba674aac30002 closed
[junit4:junit4]   2> 890 T679 oaz.ZooKeeper.<init> Initiating client connection, connectString=127.0.0.1:28187/solr sessionTimeout=8000 watcher=org.apache.solr.common.cloud.ConnectionManager@a383aab
[junit4:junit4]   2> 890 T679 oascc.ConnectionManager.waitForConnected Waiting for client to connect to ZooKeeper
[junit4:junit4]   2> 891 T700 oaz.ClientCnxn$SendThread.logStartConnect Opening socket connection to server localhost/127.0.0.1:28187. Will not attempt to authenticate using SASL (access denied (javax.security.auth.AuthPermission getLoginConfiguration))
[junit4:junit4]   2> 891 T700 oaz.ClientCnxn$SendThread.primeConnection Socket connection established to localhost/127.0.0.1:28187, initiating session
[junit4:junit4]   2> 891 T681 oazs.NIOServerCnxnFactory.run Accepted socket connection from /140.211.11.196:28192
[junit4:junit4]   2> 892 T681 oazs.ZooKeeperServer.processConnectRequest Client attempting to establish new session at /140.211.11.196:28192
[junit4:junit4]   2> 893 T683 oazs.ZooKeeperServer.finishSessionInit Established session 0x13ba674aac30003 with negotiated timeout 8000 for client /140.211.11.196:28192
[junit4:junit4]   2> 893 T700 oaz.ClientCnxn$SendThread.onConnected Session establishment complete on server localhost/127.0.0.1:28187, sessionid = 0x13ba674aac30003, negotiated timeout = 8000
[junit4:junit4]   2> 893 T701 oascc.ConnectionManager.process Watcher org.apache.solr.common.cloud.ConnectionManager@a383aab name:ZooKeeperConnection Watcher:127.0.0.1:28187/solr got event WatchedEvent state:SyncConnected type:None path:null path:null type:None
[junit4:junit4]   2> 894 T679 oascc.ConnectionManager.waitForConnected Client is connected to ZooKeeper
[junit4:junit4]   2> 908 T684 oazs.PrepRequestProcessor.pRequest Got user-level KeeperException when processing sessionid:0x13ba674aac30003 type:create cxid:0x2 zxid:0x1a txntype:-1 reqpath:n/a Error Path:/solr/overseer Error:KeeperErrorCode = NodeExists for /solr/overseer
[junit4:junit4]   2> 915 T679 oascc.SolrZkClient.makePath makePath: /live_nodes
[junit4:junit4]   2> 919 T679 oasc.ZkController.createEphemeralLiveNode Register node as live in ZooKeeper:/live_nodes/127.0.0.1:28190_yv%2Ffm
[junit4:junit4]   2> 923 T684 oazs.PrepRequestProcessor.pRequest Got user-level KeeperException when processing sessionid:0x13ba674aac30003 type:delete cxid:0x7 zxid:0x1c txntype:-1 reqpath:n/a Error Path:/solr/live_nodes/127.0.0.1:28190_yv%2Ffm Error:KeeperErrorCode = NoNode for /solr/live_nodes/127.0.0.1:28190_yv%2Ffm
[junit4:junit4]   2> 924 T679 oascc.SolrZkClient.makePath makePath: /live_nodes/127.0.0.1:28190_yv%2Ffm
[junit4:junit4]   2> 929 T679 oashc.HttpShardHandlerFactory.getParameter Setting socketTimeout to: 0
[junit4:junit4]   2> 929 T679 oashc.HttpShardHandlerFactory.getParameter Setting urlScheme to: http://
[junit4:junit4]   2> 929 T679 oashc.HttpShardHandlerFactory.getParameter Setting connTimeout to: 0
[junit4:junit4]   2> 930 T679 oashc.HttpShardHandlerFactory.getParameter Setting maxConnectionsPerHost to: 20
[junit4:junit4]   2> 930 T679 oashc.HttpShardHandlerFactory.getParameter Setting corePoolSize to: 0
[junit4:junit4]   2> 930 T679 oashc.HttpShardHandlerFactory.getParameter Setting maximumPoolSize to: 2147483647
[junit4:junit4]   2> 931 T679 oashc.HttpShardHandlerFactory.getParameter Setting maxThreadIdleTime to: 5
[junit4:junit4]   2> 931 T679 oashc.HttpShardHandlerFactory.getParameter Setting sizeOfQueue to: -1
[junit4:junit4]   2> 931 T679 oashc.HttpShardHandlerFactory.getParameter Setting fairnessPolicy to: false
[junit4:junit4]   2> 932 T679 oascsi.HttpClientUtil.createClient Creating new http client, config:maxConnectionsPerHost=20&maxConnections=10000&socketTimeout=0&connTimeout=0&retry=false
[junit4:junit4]   2> 943 T679 oascc.SolrZkClient.makePath makePath: /overseer_elect/election
[junit4:junit4]   2> 973 T684 oazs.PrepRequestProcessor.pRequest Got user-level KeeperException when processing sessionid:0x13ba674aac30003 type:delete cxid:0x15 zxid:0x21 txntype:-1 reqpath:n/a Error Path:/solr/overseer_elect/leader Error:KeeperErrorCode = NoNode for /solr/overseer_elect/leader
[junit4:junit4]   2> 975 T679 oascc.SolrZkClient.makePath makePath: /overseer_elect/leader
[junit4:junit4]   2> 979 T679 oasc.Overseer.start Overseer (id=88847637675180035-127.0.0.1:28190_yv%2Ffm-n_0000000000) starting
[junit4:junit4]   2> 980 T684 oazs.PrepRequestProcessor.pRequest Got user-level KeeperException when processing sessionid:0x13ba674aac30003 type:create cxid:0x1a zxid:0x23 txntype:-1 reqpath:n/a Error Path:/solr/overseer Error:KeeperErrorCode = NodeExists for /solr/overseer
[junit4:junit4]   2> 1004 T684 oazs.PrepRequestProcessor.pRequest Got user-level KeeperException when processing sessionid:0x13ba674aac30003 type:create cxid:0x1b zxid:0x24 txntype:-1 reqpath:n/a Error Path:/solr/overseer Error:KeeperErrorCode = NodeExists for /solr/overseer
[junit4:junit4]   2> 1006 T684 oazs.PrepRequestProcessor.pRequest Got user-level KeeperException when processing sessionid:0x13ba674aac30003 type:create cxid:0x1c zxid:0x25 txntype:-1 reqpath:n/a Error Path:/solr/overseer Error:KeeperErrorCode = NodeExists for /solr/overseer
[junit4:junit4]   2> 1012 T684 oazs.PrepRequestProcessor.pRequest Got user-level KeeperException when processing sessionid:0x13ba674aac30003 type:create cxid:0x1d zxid:0x26 txntype:-1 reqpath:n/a Error Path:/solr/overseer Error:KeeperErrorCode = NodeExists for /solr/overseer
[junit4:junit4]   2> 1014 T703 oasc.OverseerCollectionProcessor.run Process current queue of collection messages
[junit4:junit4]   2> 1014 T679 oascc.SolrZkClient.makePath makePath: /clusterstate.json
[junit4:junit4]   2> 1017 T679 oascc.ZkStateReader.createClusterStateWatchersAndUpdate Updating cluster state from ZooKeeper... 
[junit4:junit4]   2> 1038 T702 oasc.Overseer$ClusterStateUpdater.run Starting to work on the main queue
[junit4:junit4]   2> 1050 T704 oasc.CoreContainer.create Creating SolrCore 'collection1' using instanceDir: /usr/home/hudson/hudson-slave/workspace/Lucene-Solr-NightlyTests-trunk/solr/build/solr-core/test/J0/./org.apache.solr.cloud.BasicDistributedZk2Test-controljetty-1355707362391/collection1
[junit4:junit4]   2> 1050 T704 oasc.ZkController.createCollectionZkNode Check for collection zkNode:control_collection
[junit4:junit4]   2> 1051 T704 oasc.ZkController.createCollectionZkNode Collection zkNode exists
[junit4:junit4]   2> 1051 T704 oasc.ZkController.readConfigName Load collection config from:/collections/control_collection
[junit4:junit4]   2> 1053 T704 oasc.SolrResourceLoader.<init> new SolrResourceLoader for directory: '/usr/home/hudson/hudson-slave/workspace/Lucene-Solr-NightlyTests-trunk/solr/build/solr-core/test/J0/./org.apache.solr.cloud.BasicDistributedZk2Test-controljetty-1355707362391/collection1/'
[junit4:junit4]   2> 1054 T704 oasc.SolrResourceLoader.replaceClassLoader Adding 'file:/usr/home/hudson/hudson-slave/workspace/Lucene-Solr-NightlyTests-trunk/solr/build/solr-core/test/J0/org.apache.solr.cloud.BasicDistributedZk2Test-controljetty-1355707362391/collection1/lib/classes/' to classloader
[junit4:junit4]   2> 1054 T704 oasc.SolrResourceLoader.replaceClassLoader Adding 'file:/usr/home/hudson/hudson-slave/workspace/Lucene-Solr-NightlyTests-trunk/solr/build/solr-core/test/J0/org.apache.solr.cloud.BasicDistributedZk2Test-controljetty-1355707362391/collection1/lib/README' to classloader
[junit4:junit4]   2> 1103 T704 oasc.SolrConfig.<init> Using Lucene MatchVersion: LUCENE_50
[junit4:junit4]   2> 1157 T704 oasc.SolrConfig.<init> Loaded SolrConfig: solrconfig.xml
[junit4:junit4]   2> 1159 T704 oass.IndexSchema.readSchema Reading Solr Schema
[junit4:junit4]   2> 1167 T704 oass.IndexSchema.readSchema Schema name=test
[junit4:junit4]   2> 1743 T704 oass.OpenExchangeRatesOrgProvider.init Initialized with rates=open-exchange-rates.json, refreshInterval=1440.
[junit4:junit4]   2> 1751 T704 oass.IndexSchema.readSchema default search field in schema is text
[junit4:junit4]   2> 1754 T704 oass.IndexSchema.readSchema unique key field: id
[junit4:junit4]   2> 1774 T704 oass.FileExchangeRateProvider.reload Reloading exchange rates from file currency.xml
[junit4:junit4]   2> 1779 T704 oass.FileExchangeRateProvider.reload Reloading exchange rates from file currency.xml
[junit4:junit4]   2> 1782 T704 oass.OpenExchangeRatesOrgProvider.reload Reloading exchange rates from open-exchange-rates.json
[junit4:junit4]   2> 1784 T704 oass.OpenExchangeRatesOrgProvider.reload Reloading exchange rates from open-exchange-rates.json
[junit4:junit4]   2> 1786 T704 oasc.SolrCore.<init> [collection1] Opening new SolrCore at /usr/home/hudson/hudson-slave/workspace/Lucene-Solr-NightlyTests-trunk/solr/build/solr-core/test/J0/./org.apache.solr.cloud.BasicDistributedZk2Test-controljetty-1355707362391/collection1/, dataDir=./org.apache.solr.cloud.BasicDistributedZk2Test-1355707361738/control/data/
[junit4:junit4]   2> 1786 T704 oasc.JmxMonitoredMap.<init> JMX monitoring is enabled. Adding Solr mbeans to JMX Server: com.sun.jmx.mbeanserver.JmxMBeanServer@235f4a7f
[junit4:junit4]   2> 1787 T704 oasc.SolrCore.initDirectoryFactory solr.NRTCachingDirectoryFactory
[junit4:junit4]   2> 1809 T704 oasc.CachingDirectoryFactory.get return new directory for /usr/home/hudson/hudson-slave/workspace/Lucene-Solr-NightlyTests-trunk/solr/build/solr-core/test/J0/./org.apache.solr.cloud.BasicDistributedZk2Test-1355707361738/control/data forceNew:false
[junit4:junit4]   2> 1810 T704 oasc.CachingDirectoryFactory.close Releasing directory:/usr/home/hudson/hudson-slave/workspace/Lucene-Solr-NightlyTests-trunk/solr/build/solr-core/test/J0/./org.apache.solr.cloud.BasicDistributedZk2Test-1355707361738/control/data
[junit4:junit4]   2> 1810 T704 oasc.SolrCore.getNewIndexDir New index directory detected: old=null new=./org.apache.solr.cloud.BasicDistributedZk2Test-1355707361738/control/data/index/
[junit4:junit4]   2> 1810 T704 oasc.SolrCore.initIndex WARNING [collection1] Solr index directory './org.apache.solr.cloud.BasicDistributedZk2Test-1355707361738/control/data/index' doesn't exist. Creating new index...
[junit4:junit4]   2> 1812 T704 oasc.CachingDirectoryFactory.get return new directory for /usr/home/hudson/hudson-slave/workspace/Lucene-Solr-NightlyTests-trunk/solr/build/solr-core/test/J0/./org.apache.solr.cloud.BasicDistributedZk2Test-1355707361738/control/data/index forceNew:false
[junit4:junit4]   2> 1823 T704 oasc.SolrDeletionPolicy.onCommit SolrDeletionPolicy.onCommit: commits:num=1
[junit4:junit4]   2> 		commit{dir=RateLimitedDirectoryWrapper(NRTCachingDirectory(org.apache.lucene.store.NIOFSDirectory@/usr/home/hudson/hudson-slave/workspace/Lucene-Solr-NightlyTests-trunk/solr/build/solr-core/test/J0/org.apache.solr.cloud.BasicDistributedZk2Test-1355707361738/control/data/index lockFactory=org.apache.lucene.store.NativeFSLockFactory@276ce961; maxCacheMB=48.0 maxMergeSizeMB=4.0)),segFN=segments_1,generation=1,filenames=[segments_1]
[junit4:junit4]   2> 1823 T704 oasc.SolrDeletionPolicy.updateCommits newest commit = 1[segments_1]
[junit4:junit4]   2> 1824 T704 oasc.CachingDirectoryFactory.close Releasing directory:/usr/home/hudson/hudson-slave/workspace/Lucene-Solr-NightlyTests-trunk/solr/build/solr-core/test/J0/./org.apache.solr.cloud.BasicDistributedZk2Test-1355707361738/control/data/index
[junit4:junit4]   2> 1824 T704 oasc.SolrCore.initWriters created xml: solr.XMLResponseWriter
[junit4:junit4]   2> 1825 T704 oasup.UpdateRequestProcessorChain.init inserting DistributedUpdateProcessorFactory into updateRequestProcessorChain "dedupe"
[junit4:junit4]   2> 1825 T704 oasup.UpdateRequestProcessorChain.init inserting DistributedUpdateProcessorFactory into updateRequestProcessorChain "dedupe-allfields"
[junit4:junit4]   2> 1826 T704 oasup.UpdateRequestProcessorChain.init inserting DistributedUpdateProcessorFactory into updateRequestProcessorChain "stored_sig"
[junit4:junit4]   2> 1826 T704 oasup.UpdateRequestProcessorChain.init inserting DistributedUpdateProcessorFactory into updateRequestProcessorChain "uniq-fields"
[junit4:junit4]   2> 1826 T704 oasup.UpdateRequestProcessorChain.init inserting DistributedUpdateProcessorFactory into updateRequestProcessorChain "distrib-dup-test-chain-implicit"
[junit4:junit4]   2> 1827 T704 oasc.RequestHandlers.initHandlersFromConfig adding lazy requestHandler: solr.ReplicationHandler
[junit4:junit4]   2> 1827 T704 oasc.RequestHandlers.initHandlersFromConfig created /replication: solr.ReplicationHandler
[junit4:junit4]   2> 1827 T704 oasc.RequestHandlers.initHandlersFromConfig created standard: solr.StandardRequestHandler
[junit4:junit4]   2> 1828 T704 oasc.RequestHandlers.initHandlersFromConfig created /get: solr.RealTimeGetHandler
[junit4:junit4]   2> 1829 T704 oasc.RequestHandlers.initHandlersFromConfig created dismax: solr.SearchHandler
[junit4:junit4]   2> 1829 T704 oasc.RequestHandlers.initHandlersFromConfig created mock: org.apache.solr.core.MockQuerySenderListenerReqHandler
[junit4:junit4]   2> 1830 T704 oasc.RequestHandlers.initHandlersFromConfig created /admin/: org.apache.solr.handler.admin.AdminHandlers
[junit4:junit4]   2> 1830 T704 oasc.RequestHandlers.initHandlersFromConfig created defaults: solr.StandardRequestHandler
[junit4:junit4]   2> 1830 T704 oasc.RequestHandlers.initHandlersFromConfig adding lazy requestHandler: solr.StandardRequestHandler
[junit4:junit4]   2> 1831 T704 oasc.RequestHandlers.initHandlersFromConfig created lazy: solr.StandardRequestHandler
[junit4:junit4]   2> 1831 T704 oasc.RequestHandlers.initHandlersFromConfig created /update: solr.UpdateRequestHandler
[junit4:junit4]   2> 1832 T704 oasc.RequestHandlers.initHandlersFromConfig created /terms: org.apache.solr.handler.component.SearchHandler
[junit4:junit4]   2> 1833 T704 oasc.RequestHandlers.initHandlersFromConfig created spellCheckCompRH: org.apache.solr.handler.component.SearchHandler
[junit4:junit4]   2> 1833 T704 oasc.RequestHandlers.initHandlersFromConfig created spellCheckCompRH_Direct: org.apache.solr.handler.component.SearchHandler
[junit4:junit4]   2> 1834 T704 oasc.RequestHandlers.initHandlersFromConfig created spellCheckWithWordbreak: org.apache.solr.handler.component.SearchHandler
[junit4:junit4]   2> 1834 T704 oasc.RequestHandlers.initHandlersFromConfig created spellCheckWithWordbreak_Direct: org.apache.solr.handler.component.SearchHandler
[junit4:junit4]   2> 1835 T704 oasc.RequestHandlers.initHandlersFromConfig created spellCheckCompRH1: org.apache.solr.handler.component.SearchHandler
[junit4:junit4]   2> 1836 T704 oasc.RequestHandlers.initHandlersFromConfig created mltrh: org.apache.solr.handler.component.SearchHandler
[junit4:junit4]   2> 1836 T704 oasc.RequestHandlers.initHandlersFromConfig created tvrh: org.apache.solr.handler.component.SearchHandler
[junit4:junit4]   2> 1837 T704 oasc.RequestHandlers.initHandlersFromConfig created /mlt: solr.MoreLikeThisHandler
[junit4:junit4]   2> 1837 T704 oasc.RequestHandlers.initHandlersFromConfig created /debug/dump: solr.DumpRequestHandler
[junit4:junit4]   2> 1842 T704 oashl.XMLLoader.init xsltCacheLifetimeSeconds=60
[junit4:junit4]   2> 1845 T704 oasc.SolrCore.initDeprecatedSupport WARNING solrconfig.xml uses deprecated <admin/gettableFiles>, Please update your config to use the ShowFileRequestHandler.
[junit4:junit4]   2> 1847 T704 oasc.SolrCore.initDeprecatedSupport WARNING adding ShowFileRequestHandler with hidden files: [SCHEMA.XML, OLD_SYNONYMS.TXT, STOPWORDS.TXT, PROTWORDS.TXT, OPEN-EXCHANGE-RATES.JSON, SYNONYMS.TXT, CURRENCY.XML, MAPPING-ISOLATIN1ACCENT.TXT]
[junit4:junit4]   2> 1849 T704 oasc.CachingDirectoryFactory.close Releasing directory:/usr/home/hudson/hudson-slave/workspace/Lucene-Solr-NightlyTests-trunk/solr/build/solr-core/test/J0/./org.apache.solr.cloud.BasicDistributedZk2Test-1355707361738/control/data
[junit4:junit4]   2> 1850 T704 oass.SolrIndexSearcher.<init> Opening Searcher@655074fb main
[junit4:junit4]   2> 1851 T704 oasu.CommitTracker.<init> Hard AutoCommit: disabled
[junit4:junit4]   2> 1851 T704 oasu.CommitTracker.<init> Soft AutoCommit: disabled
[junit4:junit4]   2> 1852 T704 oashc.SpellCheckComponent.inform Initializing spell checkers
[junit4:junit4]   2> 1870 T704 oass.DirectSolrSpellChecker.init init: {name=direct,classname=DirectSolrSpellChecker,field=lowerfilt,minQueryLength=3}
[junit4:junit4]   2> 1923 T705 oasc.SolrCore.registerSearcher [collection1] Registered new searcher Searcher@655074fb main{StandardDirectoryReader(segments_1:1)}
[junit4:junit4]   2> 1928 T704 oasc.ZkController.publish publishing core=collection1 state=down
[junit4:junit4]   2> 1928 T704 oasc.ZkController.publish numShards not found on descriptor - reading it from system property
[junit4:junit4]   2> 1929 T684 oazs.PrepRequestProcessor.pRequest Got user-level KeeperException when processing sessionid:0x13ba674aac30003 type:create cxid:0x53 zxid:0x29 txntype:-1 reqpath:n/a Error Path:/solr/overseer/queue Error:KeeperErrorCode = NoNode for /solr/overseer/queue
[junit4:junit4]   2> 2046 T702 oascc.ZkStateReader.updateClusterState Updating cloud state from ZooKeeper... 
[junit4:junit4]   2> 2048 T702 oasc.Overseer$ClusterStateUpdater.updateState Update state numShards=1 message={
[junit4:junit4]   2> 	  "operation":"state",
[junit4:junit4]   2> 	  "numShards":"1",
[junit4:junit4]   2> 	  "shard":null,
[junit4:junit4]   2> 	  "roles":null,
[junit4:junit4]   2> 	  "state":"down",
[junit4:junit4]   2> 	  "core":"collection1",
[junit4:junit4]   2> 	  "collection":"control_collection",
[junit4:junit4]   2> 	  "node_name":"127.0.0.1:28190_yv%2Ffm",
[junit4:junit4]   2> 	  "base_url":"http://127.0.0.1:28190/yv/fm"}
[junit4:junit4]   2> 2048 T702 oasc.Overseer$ClusterStateUpdater.createCollection Create collection control_collection with numShards 1
[junit4:junit4]   2> 2083 T702 oasc.Overseer$ClusterStateUpdater.updateState Assigning new node to shard shard=shard1
[junit4:junit4]   2> 2084 T684 oazs.PrepRequestProcessor.pRequest Got user-level KeeperException when processing sessionid:0x13ba674aac30003 type:create cxid:0x5b zxid:0x2c txntype:-1 reqpath:n/a Error Path:/solr/overseer/queue-work Error:KeeperErrorCode = NoNode for /solr/overseer/queue-work
[junit4:junit4]   2> 2118 T701 oascc.ZkStateReader$2.process A cluster state change: WatchedEvent state:SyncConnected type:NodeDataChanged path:/clusterstate.json, has occurred - updating... (live nodes size: 1)
[junit4:junit4]   2> 2447 T704 oasc.CoreContainer.registerCore registering core: collection1
[junit4:junit4]   2> 2447 T704 oasc.ZkController.register Register shard - core:collection1 address:http://127.0.0.1:28190/yv/fm shardId:shard1
[junit4:junit4]   2> 2457 T704 oascsi.HttpClientUtil.createClient Creating new http client, config:maxConnections=10000&maxConnectionsPerHost=20&connTimeout=30000&socketTimeout=30000&retry=false
[junit4:junit4]   2> 2475 T704 oascc.SolrZkClient.makePath makePath: /collections/control_collection/leader_elect/shard1/election
[junit4:junit4]   2> 2505 T684 oazs.PrepRequestProcessor.pRequest Got user-level KeeperException when processing sessionid:0x13ba674aac30003 type:delete cxid:0x75 zxid:0x36 txntype:-1 reqpath:n/a Error Path:/solr/collections/control_collection/leaders Error:KeeperErrorCode = NoNode for /solr/collections/control_collection/leaders
[junit4:junit4]   2> 2506 T704 oasc.ShardLeaderElectionContext.runLeaderProcess Running the leader process.
[junit4:junit4]   2> 2507 T684 oazs.PrepRequestProcessor.pRequest Got user-level KeeperException when processing sessionid:0x13ba674aac30003 type:create cxid:0x76 zxid:0x37 txntype:-1 reqpath:n/a Error Path:/solr/overseer Error:KeeperErrorCode = NodeExists for /solr/overseer
[junit4:junit4]   2> 2516 T704 oasc.ShardLeaderElectionContext.waitForReplicasToComeUp Enough replicas found to continue.
[junit4:junit4]   2> 2516 T704 oasc.ShardLeaderElectionContext.runLeaderProcess I may be the new leader - try and sync
[junit4:junit4]   2> 2516 T704 oasc.SyncStrategy.sync Sync replicas to http://127.0.0.1:28190/yv/fm/collection1/
[junit4:junit4]   2> 2517 T704 oasc.SyncStrategy.syncReplicas Sync Success - now sync replicas to me
[junit4:junit4]   2> 2517 T704 oasc.SyncStrategy.syncToMe http://127.0.0.1:28190/yv/fm/collection1/ has no replicas
[junit4:junit4]   2> 2517 T704 oasc.ShardLeaderElectionContext.runLeaderProcess I am the new leader: http://127.0.0.1:28190/yv/fm/collection1/
[junit4:junit4]   2> 2517 T704 oascc.SolrZkClient.makePath makePath: /collections/control_collection/leaders/shard1
[junit4:junit4]   2> 2523 T684 oazs.PrepRequestProcessor.pRequest Got user-level KeeperException when processing sessionid:0x13ba674aac30003 type:create cxid:0x80 zxid:0x3b txntype:-1 reqpath:n/a Error Path:/solr/overseer Error:KeeperErrorCode = NodeExists for /solr/overseer
[junit4:junit4]   2> 2628 T702 oascc.ZkStateReader.updateClusterState Updating cloud state from ZooKeeper... 
[junit4:junit4]   2> 2652 T701 oascc.ZkStateReader$2.process A cluster state change: WatchedEvent state:SyncConnected type:NodeDataChanged path:/clusterstate.json, has occurred - updating... (live nodes size: 1)
[junit4:junit4]   2> 2687 T704 oasc.ZkController.register We are http://127.0.0.1:28190/yv/fm/collection1/ and leader is http://127.0.0.1:28190/yv/fm/collection1/
[junit4:junit4]   2> 2687 T704 oasc.ZkController.register No LogReplay needed for core=collection1 baseURL=http://127.0.0.1:28190/yv/fm
[junit4:junit4]   2> 2687 T704 oasc.ZkController.checkRecovery I am the leader, no recovery necessary
[junit4:junit4]   2> 2687 T704 oasc.ZkController.publish publishing core=collection1 state=active
[junit4:junit4]   2> 2688 T704 oasc.ZkController.publish numShards not found on descriptor - reading it from system property
[junit4:junit4]   2> 2690 T704 oascc.ZkStateReader.updateClusterState Updating cloud state from ZooKeeper... 
[junit4:junit4]   2> 2691 T679 oass.SolrDispatchFilter.init user.dir=/usr/home/hudson/hudson-slave/workspace/Lucene-Solr-NightlyTests-trunk/solr/build/solr-core/test/J0
[junit4:junit4]   2> 2692 T679 oass.SolrDispatchFilter.init SolrDispatchFilter.init() done
[junit4:junit4]   2> 2693 T679 oascsi.HttpClientUtil.createClient Creating new http client, config:maxConnections=128&maxConnectionsPerHost=32&followRedirects=false
[junit4:junit4]   2> 2705 T679 oascsi.HttpClientUtil.createClient Creating new http client, config:
[junit4:junit4]   2> 2722 T679 oaz.ZooKeeper.<init> Initiating client connection, connectString=127.0.0.1:28187/solr sessionTimeout=10000 watcher=org.apache.solr.common.cloud.ConnectionManager@4ea6776b
[junit4:junit4]   2> 2723 T679 oascc.ConnectionManager.waitForConnected Waiting for client to connect to ZooKeeper
[junit4:junit4]   2> 2723 T706 oaz.ClientCnxn$SendThread.logStartConnect Opening socket connection to server localhost/127.0.0.1:28187. Will not attempt to authenticate using SASL (access denied (javax.security.auth.AuthPermission getLoginConfiguration))
[junit4:junit4]   2> 2723 T706 oaz.ClientCnxn$SendThread.primeConnection Socket connection established to localhost/127.0.0.1:28187, initiating session
[junit4:junit4]   2> 2724 T681 oazs.NIOServerCnxnFactory.run Accepted socket connection from /140.211.11.196:28193
[junit4:junit4]   2> 2724 T681 oazs.ZooKeeperServer.processConnectRequest Client attempting to establish new session at /140.211.11.196:28193
[junit4:junit4]   2> 2725 T683 oazs.ZooKeeperServer.finishSessionInit Established session 0x13ba674aac30004 with negotiated timeout 10000 for client /140.211.11.196:28193
[junit4:junit4]   2> 2726 T706 oaz.ClientCnxn$SendThread.onConnected Session establishment complete on server localhost/127.0.0.1:28187, sessionid = 0x13ba674aac30004, negotiated timeout = 10000
[junit4:junit4]   2> 2726 T707 oascc.ConnectionManager.process Watcher org.apache.solr.common.cloud.ConnectionManager@4ea6776b name:ZooKeeperConnection Watcher:127.0.0.1:28187/solr got event WatchedEvent state:SyncConnected type:None path:null path:null type:None
[junit4:junit4]   2> 2726 T679 oascc.ConnectionManager.waitForConnected Client is connected to ZooKeeper
[junit4:junit4]   2> 2728 T679 oascc.ZkStateReader.createClusterStateWatchersAndUpdate Updating cluster state from ZooKeeper... 
[junit4:junit4]   2> 2732 T679 oasc.ChaosMonkey.monkeyLog monkey: init - expire sessions:true cause connection loss:true
[junit4:junit4]   2> 2888 T679 oejs.Server.doStart jetty-8.1.8.v20121106
[junit4:junit4]   2> 2891 T679 oejs.AbstractConnector.doStart Started SocketConnector@127.0.0.1:28194
[junit4:junit4]   2> 2892 T679 oasc.SolrResourceLoader.locateSolrHome JNDI not configured for solr (NoInitialContextEx)
[junit4:junit4]   2> 2892 T679 oasc.SolrResourceLoader.locateSolrHome using system property solr.solr.home: /usr/home/hudson/hudson-slave/workspace/Lucene-Solr-NightlyTests-trunk/solr/build/solr-core/test/J0/./org.apache.solr.cloud.BasicDistributedZk2Test-jetty1-1355707364464
[junit4:junit4]   2> 2893 T679 oasc.SolrResourceLoader.<init> new SolrResourceLoader for deduced Solr Home: '/usr/home/hudson/hudson-slave/workspace/Lucene-Solr-NightlyTests-trunk/solr/build/solr-core/test/J0/./org.apache.solr.cloud.BasicDistributedZk2Test-jetty1-1355707364464/'
[junit4:junit4]   2> 2927 T679 oass.SolrDispatchFilter.init SolrDispatchFilter.init()
[junit4:junit4]   2> 2928 T679 oasc.SolrResourceLoader.locateSolrHome JNDI not configured for solr (NoInitialContextEx)
[junit4:junit4]   2> 2929 T679 oasc.SolrResourceLoader.locateSolrHome using system property solr.solr.home: /usr/home/hudson/hudson-slave/workspace/Lucene-Solr-NightlyTests-trunk/solr/build/solr-core/test/J0/./org.apache.solr.cloud.BasicDistributedZk2Test-jetty1-1355707364464
[junit4:junit4]   2> 2929 T679 oasc.CoreContainer$Initializer.initialize looking for solr.xml: /usr/home/hudson/hudson-slave/workspace/Lucene-Solr-NightlyTests-trunk/solr/build/solr-core/test/J0/./org.apache.solr.cloud.BasicDistributedZk2Test-jetty1-1355707364464/solr.xml
[junit4:junit4]   2> 2930 T679 oasc.CoreContainer.<init> New CoreContainer 1426004651
[junit4:junit4]   2> 2930 T679 oasc.CoreContainer.load Loading CoreContainer using Solr Home: '/usr/home/hudson/hudson-slave/workspace/Lucene-Solr-NightlyTests-trunk/solr/build/solr-core/test/J0/./org.apache.solr.cloud.BasicDistributedZk2Test-jetty1-1355707364464/'
[junit4:junit4]   2> 2931 T679 oasc.SolrResourceLoader.<init> new SolrResourceLoader for directory: '/usr/home/hudson/hudson-slave/workspace/Lucene-Solr-NightlyTests-trunk/solr/build/solr-core/test/J0/./org.apache.solr.cloud.BasicDistributedZk2Test-jetty1-1355707364464/'
[junit4:junit4]   2> 2957 T679 oasc.CoreContainer.load Registering Log Listener
[junit4:junit4]   2> 2973 T679 oasc.CoreContainer.initZooKeeper Zookeeper client=127.0.0.1:28187/solr
[junit4:junit4]   2> 2974 T679 oasc.ZkController.checkChrootPath zkHost includes chroot
[junit4:junit4]   2> 2975 T679 oaz.ZooKeeper.<init> Initiating client connection, connectString=127.0.0.1:28187 sessionTimeout=60000 watcher=org.apache.solr.common.cloud.ConnectionManager@5652fdf4
[junit4:junit4]   2> 2976 T679 oascc.ConnectionManager.waitForConnected Waiting for client to connect to ZooKeeper
[junit4:junit4]   2> 2976 T717 oaz.ClientCnxn$SendThread.logStartConnect Opening socket connection to server localhost/127.0.0.1:28187. Will not attempt to authenticate using SASL (access denied (javax.security.auth.AuthPermission getLoginConfiguration))
[junit4:junit4]   2> 2977 T717 oaz.ClientCnxn$SendThread.primeConnection Socket connection established to localhost/127.0.0.1:28187, initiating session
[junit4:junit4]   2> 2977 T681 oazs.NIOServerCnxnFactory.run Accepted socket connection from /140.211.11.196:28195
[junit4:junit4]   2> 2978 T681 oazs.ZooKeeperServer.processConnectRequest Client attempting to establish new session at /140.211.11.196:28195
[junit4:junit4]   2> 2980 T683 oazs.ZooKeeperServer.finishSessionInit Established session 0x13ba674aac30005 with negotiated timeout 20000 for client /140.211.11.196:28195
[junit4:junit4]   2> 2980 T717 oaz.ClientCnxn$SendThread.onConnected Session establishment complete on server localhost/127.0.0.1:28187, sessionid = 0x13ba674aac30005, negotiated timeout = 20000
[junit4:junit4]   2> 2981 T718 oascc.ConnectionManager.process Watcher org.apache.solr.common.cloud.ConnectionManager@5652fdf4 name:ZooKeeperConnection Watcher:127.0.0.1:28187 got event WatchedEvent state:SyncConnected type:None path:null path:null type:None
[junit4:junit4]   2> 2981 T679 oascc.ConnectionManager.waitForConnected Client is connected to ZooKeeper
[junit4:junit4]   2> 2983 T684 oazs.PrepRequestProcessor.pRequest2Txn Processed session termination for sessionid: 0x13ba674aac30005
[junit4:junit4]   2> 2994 T718 oaz.ClientCnxn$EventThread.run EventThread shut down
[junit4:junit4]   2> 2994 T681 oazs.NIOServerCnxn.closeSock Closed socket connection for client /140.211.11.196:28195 which had sessionid 0x13ba674aac30005
[junit4:junit4]   2> 2994 T679 oaz.ZooKeeper.close Session: 0x13ba674aac30005 closed
[junit4:junit4]   2> 2995 T679 oaz.ZooKeeper.<init> Initiating client connection, connectString=127.0.0.1:28187/solr sessionTimeout=8000 watcher=org.apache.solr.common.cloud.ConnectionManager@341a160c
[junit4:junit4]   2> 3000 T719 oaz.ClientCnxn$SendThread.logStartConnect Opening socket connection to server localhost/127.0.0.1:28187. Will not attempt to authenticate using SASL (access denied (javax.security.auth.AuthPermission getLoginConfiguration))
[junit4:junit4]   2> 2996 T679 oascc.ConnectionManager.waitForConnected Waiting for client to connect to ZooKeeper
[junit4:junit4]   2> 3001 T719 oaz.ClientCnxn$SendThread.primeConnection Socket connection established to localhost/127.0.0.1:28187, initiating session
[junit4:junit4]   2> 3001 T681 oazs.NIOServerCnxnFactory.run Accepted socket connection from /140.211.11.196:28196
[junit4:junit4]   2> 3002 T681 oazs.ZooKeeperServer.processConnectRequest Client attempting to establish new session at /140.211.11.196:28196
[junit4:junit4]   2> 3003 T683 oazs.ZooKeeperServer.finishSessionInit Established session 0x13ba674aac30006 with negotiated timeout 8000 for client /140.211.11.196:28196
[junit4:junit4]   2> 3003 T719 oaz.ClientCnxn$SendThread.onConnected Session establishment complete on server localhost/127.0.0.1:28187, sessionid = 0x13ba674aac30006, negotiated timeout = 8000
[junit4:junit4]   2> 3003 T720 oascc.ConnectionManager.process Watcher org.apache.solr.common.cloud.ConnectionManager@341a160c name:ZooKeeperConnection Watcher:127.0.0.1:28187/solr got event WatchedEvent state:SyncConnected type:None path:null path:null type:None
[junit4:junit4]   2> 3004 T679 oascc.ConnectionManager.waitForConnected Client is connected to ZooKeeper
[junit4:junit4]   2> 3005 T684 oazs.PrepRequestProcessor.pRequest Got user-level KeeperException when processing sessionid:0x13ba674aac30006 type:create cxid:0x1 zxid:0x49 txntype:-1 reqpath:n/a Error Path:/solr/overseer Error:KeeperErrorCode = NodeExists for /solr/overseer
[junit4:junit4]   2> 3007 T684 oazs.PrepRequestProcessor.pRequest Got user-level KeeperException when processing sessionid:0x13ba674aac30006 type:create cxid:0x2 zxid:0x4a txntype:-1 reqpath:n/a Error Path:/solr/overseer Error:KeeperErrorCode = NodeExists for /solr/overseer
[junit4:junit4]   2> 3015 T679 oasc.ZkController.createEphemeralLiveNode Register node as live in ZooKeeper:/live_nodes/127.0.0.1:28194_yv%2Ffm
[junit4:junit4]   2> 3016 T684 oazs.PrepRequestProcessor.pRequest Got user-level KeeperException when processing sessionid:0x13ba674aac30006 type:delete cxid:0x4 zxid:0x4b txntype:-1 reqpath:n/a Error Path:/solr/live_nodes/127.0.0.1:28194_yv%2Ffm Error:KeeperErrorCode = NoNode for /solr/live_nodes/127.0.0.1:28194_yv%2Ffm
[junit4:junit4]   2> 3017 T679 oascc.SolrZkClient.makePath makePath: /live_nodes/127.0.0.1:28194_yv%2Ffm
[junit4:junit4]   2> 3020 T701 oascc.ZkStateReader$2.process A cluster state change: WatchedEvent state:SyncConnected type:NodeChildrenChanged path:/live_nodes, has occurred - updating... (live nodes size: 1)
[junit4:junit4]   2> 3021 T707 oascc.ZkStateReader$3.process Updating live nodes... (2)
[junit4:junit4]   2> 3022 T679 oashc.HttpShardHandlerFactory.getParameter Setting socketTimeout to: 0
[junit4:junit4]   2> 3022 T679 oashc.HttpShardHandlerFactory.getParameter Setting urlScheme to: http://
[junit4:junit4]   2> 3023 T701 oascc.ZkStateReader$3.process Updating live nodes... (2)
[junit4:junit4]   2> 3023 T679 oashc.HttpShardHandlerFactory.getParameter Setting connTimeout to: 0
[junit4:junit4]   2> 3023 T679 oashc.HttpShardHandlerFactory.getParameter Setting maxConnectionsPerHost to: 20
[junit4:junit4]   2> 3024 T679 oashc.HttpShardHandlerFactory.getParameter Setting corePoolSize to: 0
[junit4:junit4]   2> 3024 T679 oashc.HttpShardHandlerFactory.getParameter Setting maximumPoolSize to: 2147483647
[junit4:junit4]   2> 3025 T679 oashc.HttpShardHandlerFactory.getParameter Setting maxThreadIdleTime to: 5
[junit4:junit4]   2> 3025 T679 oashc.HttpShardHandlerFactory.getParameter Setting sizeOfQueue to: -1
[junit4:junit4]   2> 3026 T679 oashc.HttpShardHandlerFactory.getParameter Setting fairnessPolicy to: false
[junit4:junit4]   2> 3026 T679 oascsi.HttpClientUtil.createClient Creating new http client, config:maxConnectionsPerHost=20&maxConnections=10000&socketTimeout=0&connTimeout=0&retry=false
[junit4:junit4]   2> 3051 T679 oascc.ZkStateReader.createClusterStateWatchersAndUpdate Updating cluster state from ZooKeeper... 
[junit4:junit4]   2> 3060 T721 oasc.CoreContainer.create Creating SolrCore 'collection1' using instanceDir: /usr/home/hudson/hudson-slave/workspace/Lucene-Solr-NightlyTests-trunk/solr/build/solr-core/test/J0/./org.apache.solr.cloud.BasicDistributedZk2Test-jetty1-1355707364464/collection1
[junit4:junit4]   2> 3060 T721 oasc.ZkController.createCollectionZkNode Check for collection zkNode:collection1
[junit4:junit4]   2> 3061 T721 oasc.ZkController.createCollectionZkNode Collection zkNode exists
[junit4:junit4]   2> 3061 T721 oasc.ZkController.readConfigName Load collection config from:/collections/collection1
[junit4:junit4]   2> 3063 T721 oasc.SolrResourceLoader.<init> new SolrResourceLoader for directory: '/usr/home/hudson/hudson-slave/workspace/Lucene-Solr-NightlyTests-trunk/solr/build/solr-core/test/J0/./org.apache.solr.cloud.BasicDistributedZk2Test-jetty1-1355707364464/collection1/'
[junit4:junit4]   2> 3064 T721 oasc.SolrResourceLoader.replaceClassLoader Adding 'file:/usr/home/hudson/hudson-slave/workspace/Lucene-Solr-NightlyTests-trunk/solr/build/solr-core/test/J0/org.apache.solr.cloud.BasicDistributedZk2Test-jetty1-1355707364464/collection1/lib/classes/' to classloader
[junit4:junit4]   2> 3065 T721 oasc.SolrResourceLoader.replaceClassLoader Adding 'file:/usr/home/hudson/hudson-slave/workspace/Lucene-Solr-NightlyTests-trunk/solr/build/solr-core/test/J0/org.apache.solr.cloud.BasicDistributedZk2Test-jetty1-1355707364464/collection1/lib/README' to classloader
[junit4:junit4]   2> 3116 T721 oasc.SolrConfig.<init> Using Lucene MatchVersion: LUCENE_50
[junit4:junit4]   2> 3166 T702 oascc.ZkStateReader.updateClusterState Updating cloud state from ZooKeeper... 
[junit4:junit4]   2> 3168 T702 oasc.Overseer$ClusterStateUpdater.updateState Update state numShards=1 message={
[junit4:junit4]   2> 	  "operation":"state",
[junit4:junit4]   2> 	  "numShards":"1",
[junit4:junit4]   2> 	  "shard":"shard1",
[junit4:junit4]   2> 	  "roles":null,
[junit4:junit4]   2> 	  "state":"active",
[junit4:junit4]   2> 	  "core":"collection1",
[junit4:junit4]   2> 	  "collection":"control_collection",
[junit4:junit4]   2> 	  "node_name":"127.0.0.1:28190_yv%2Ffm",
[junit4:junit4]   2> 	  "base_url":"http://127.0.0.1:28190/yv/fm"}
[junit4:junit4]   2> 3181 T720 oascc.ZkStateReader$2.process A cluster state change: WatchedEvent state:SyncConnected type:NodeDataChanged path:/clusterstate.json, has occurred - updating... (live nodes size: 2)
[junit4:junit4]   2> 3181 T707 oascc.ZkStateReader$2.process A cluster state change: WatchedEvent state:SyncConnected type:NodeDataChanged path:/clusterstate.json, has occurred - updating... (live nodes size: 2)
[junit4:junit4]   2> 3181 T701 oascc.ZkStateReader$2.process A cluster state change: WatchedEvent state:SyncConnected type:NodeDataChanged path:/clusterstate.json, has occurred - updating... (live nodes size: 2)
[junit4:junit4]   2> 3188 T721 oasc.SolrConfig.<init> Loaded SolrConfig: solrconfig.xml
[junit4:junit4]   2> 3190 T721 oass.IndexSchema.readSchema Reading Solr Schema
[junit4:junit4]   2> 3197 T721 oass.IndexSchema.readSchema Schema name=test
[junit4:junit4]   2> 3821 T721 oass.OpenExchangeRatesOrgProvider.init Initialized with rates=open-exchange-rates.json, refreshInterval=1440.
[junit4:junit4]   2> 3833 T721 oass.IndexSchema.readSchema default search field in schema is text
[junit4:junit4]   2> 3838 T721 oass.IndexSchema.readSchema unique key field: id
[junit4:junit4]   2> 3887 T721 oass.FileExchangeRateProvider.reload Reloading exchange rates from file currency.xml
[junit4:junit4]   2> 3892 T721 oass.FileExchangeRateProvider.reload Reloading exchange rates from file currency.xml
[junit4:junit4]   2> 3898 T721 oass.OpenExchangeRatesOrgProvider.reload Reloading exchange rates from open-exchange-rates.json
[junit4:junit4]   2> 3900 T721 oass.OpenExchangeRatesOrgProvider.reload Reloading exchange rates from open-exchange-rates.json
[junit4:junit4]   2> 3902 T721 oasc.SolrCore.<init> [collection1] Opening new SolrCore at /usr/home/hudson/hudson-slave/workspace/Lucene-Solr-NightlyTests-trunk/solr/build/solr-core/test/J0/./org.apache.solr.cloud.BasicDistributedZk2Test-jetty1-1355707364464/collection1/, dataDir=./org.apache.solr.cloud.BasicDistributedZk2Test-1355707361738/jetty1/
[junit4:junit4]   2> 3902 T721 oasc.JmxMonitoredMap.<init> JMX monitoring is enabled. Adding Solr mbeans to JMX Server: com.sun.jmx.mbeanserver.JmxMBeanServer@235f4a7f
[junit4:junit4]   2> 3902 T721 oasc.SolrCore.initDirectoryFactory solr.NRTCachingDirectoryFactory
[junit4:junit4]   2> 3903 T721 oasc.CachingDirectoryFactory.get return new directory for /usr/home/hudson/hudson-slave/workspace/Lucene-Solr-NightlyTests-trunk/solr/build/solr-core/test/J0/./org.apache.solr.cloud.BasicDistributedZk2Test-1355707361738/jetty1 forceNew:false
[junit4:junit4]   2> 3904 T721 oasc.CachingDirectoryFactory.close Releasing directory:/usr/home/hudson/hudson-slave/workspace/Lucene-Solr-NightlyTests-trunk/solr/build/solr-core/test/J0/./org.apache.solr.cloud.BasicDistributedZk2Test-1355707361738/jetty1
[junit4:junit4]   2> 3904 T721 oasc.SolrCore.getNewIndexDir New index directory detected: old=null new=./org.apache.solr.cloud.BasicDistributedZk2Test-1355707361738/jetty1/index/
[junit4:junit4]   2> 3905 T721 oasc.SolrCore.initIndex WARNING [collection1] Solr index directory './org.apache.solr.cloud.BasicDistributedZk2Test-1355707361738/jetty1/index' doesn't exist. Creating new index...
[junit4:junit4]   2> 3906 T721 oasc.CachingDirectoryFactory.get return new directory for /usr/home/hudson/hudson-slave/workspace/Lucene-Solr-NightlyTests-trunk/solr/build/solr-core/test/J0/./org.apache.solr.cloud.BasicDistributedZk2Test-1355707361738/jetty1/index forceNew:false
[junit4:junit4]   2> 3912 T721 oasc.SolrDeletionPolicy.onCommit SolrDeletionPolicy.onCommit: commits:num=1
[junit4:junit4]   2> 		commit{dir=RateLimitedDirectoryWrapper(NRTCachingDirectory(org.apache.lucene.store.NIOFSDirectory@/usr/home/hudson/hudson-slave/workspace/Lucene-Solr-NightlyTests-trunk/solr/build/solr-core/test/J0/org.apache.solr.cloud.BasicDistributedZk2Test-1355707361738/jetty1/index lockFactory=org.apache.lucene.store.NativeFSLockFactory@510c3c34; maxCacheMB=48.0 maxMergeSizeMB=4.0)),segFN=segments_1,generation=1,filenames=[segments_1]
[junit4:junit4]   2> 3912 T721 oasc.SolrDeletionPolicy.updateCommits newest commit = 1[segments_1]
[junit4:junit4]   2> 3913 T721 oasc.CachingDirectoryFactory.close Releasing directory:/usr/home/hudson/hudson-slave/workspace/Lucene-Solr-NightlyTests-trunk/solr/build/solr-core/test/J0/./org.apache.solr.cloud.BasicDistributedZk2Test-1355707361738/jetty1/index
[junit4:junit4]   2> 3913 T721 oasc.SolrCore.initWriters created xml: solr.XMLResponseWriter
[junit4:junit4]   2> 3916 T721 oasup.UpdateRequestProcessorChain.init inserting DistributedUpdateProcessorFactory into updateRequestProcessorChain "dedupe"
[junit4:junit4]   2> 3916 T721 oasup.UpdateRequestProcessorChain.init inserting DistributedUpdateProcessorFactory into updateRequestProcessorChain "dedupe-allfields"
[junit4:junit4]   2> 3916 T721 oasup.UpdateRequestProcessorChain.init inserting DistributedUpdateProcessorFactory into updateRequestProcessorChain "stored_sig"
[junit4:junit4]   2> 3917 T721 oasup.UpdateRequestProcessorChain.init inserting DistributedUpdateProcessorFactory into updateRequestProcessorChain "uniq-fields"
[junit4:junit4]   2> 3917 T721 oasup.UpdateRequestProcessorChain.init inserting DistributedUpdateProcessorFactory into updateRequestProcessorChain "distrib-dup-test-chain-implicit"
[junit4:junit4]   2> 3917 T721 oasc.RequestHandlers.initHandlersFromConfig adding lazy requestHandler: solr.ReplicationHandler
[junit4:junit4]   2> 3918 T721 oasc.RequestHandlers.initHandlersFromConfig created /replication: solr.ReplicationHandler
[junit4:junit4]   2> 3919 T721 oasc.RequestHandlers.initHandlersFromConfig created standard: solr.StandardRequestHandler
[junit4:junit4]   2> 3920 T721 oasc.RequestHandlers.initHandlersFromConfig created /get: solr.RealTimeGetHandler
[junit4:junit4]   2> 3921 T721 oasc.RequestHandlers.initHandlersFromConfig created dismax: solr.SearchHandler
[junit4:junit4]   2> 3922 T721 oasc.RequestHandlers.initHandlersFromConfig created mock: org.apache.solr.core.MockQuerySenderListenerReqHandler
[junit4:junit4]   2> 3922 T721 oasc.RequestHandlers.initHandlersFromConfig created /admin/: org.apache.solr.handler.admin.AdminHandlers
[junit4:junit4]   2> 3923 T721 oasc.RequestHandlers.initHandlersFromConfig created defaults: solr.StandardRequestHandler
[junit4:junit4]   2> 3924 T721 oasc.RequestHandlers.initHandlersFromConfig adding lazy requestHandler: solr.StandardRequestHandler
[junit4:junit4]   2> 3924 T721 oasc.RequestHandlers.initHandlersFromConfig created lazy: solr.StandardRequestHandler
[junit4:junit4]   2> 3925 T721 oasc.RequestHandlers.initHandlersFromConfig created /update: solr.UpdateRequestHandler
[junit4:junit4]   2> 3926 T721 oasc.RequestHandlers.initHandlersFromConfig created /terms: org.apache.solr.handler.component.SearchHandler
[junit4:junit4]   2> 3927 T721 oasc.RequestHandlers.initHandlersFromConfig created spellCheckCompRH: org.apache.solr.handler.component.SearchHandler
[junit4:junit4]   2> 3928 T721 oasc.RequestHandlers.initHandlersFromConfig created spellCheckCompRH_Direct: org.apache.solr.handler.component.SearchHandler
[junit4:junit4]   2> 3929 T721 oasc.RequestHandlers.initHandlersFromConfig created spellCheckWithWordbreak: org.apache.solr.handler.component.SearchHandler
[junit4:junit4]   2> 3930 T721 oasc.RequestHandlers.initHandlersFromConfig created spellCheckWithWordbreak_Direct: org.apache.solr.handler.component.SearchHandler
[junit4:junit4]   2> 3931 T721 oasc.RequestHandlers.initHandlersFromConfig created spellCheckCompRH1: org.apache.solr.handler.component.SearchHandler
[junit4:junit4]   2> 3932 T721 oasc.RequestHandlers.initHandlersFromConfig created mltrh: org.apache.solr.handler.component.SearchHandler
[junit4:junit4]   2> 3933 T721 oasc.RequestHandlers.initHandlersFromConfig created tvrh: org.apache.solr.handler.component.SearchHandler
[junit4:junit4]   2> 3934 T721 oasc.RequestHandlers.initHandlersFromConfig created /mlt: solr.MoreLikeThisHandler
[junit4:junit4]   2> 3935 T721 oasc.RequestHandlers.initHandlersFromConfig created /debug/dump: solr.DumpRequestHandler
[junit4:junit4]   2> 3942 T721 oashl.XMLLoader.init xsltCacheLifetimeSeconds=60
[junit4:junit4]   2> 3947 T721 oasc.SolrCore.initDeprecatedSupport WARNING solrconfig.xml uses deprecated <admin/gettableFiles>, Please update your config to use the ShowFileRequestHandler.
[junit4:junit4]   2> 3949 T721 oasc.SolrCore.initDeprecatedSupport WARNING adding ShowFileRequestHandler with hidden files: [SCHEMA.XML, OLD_SYNONYMS.TXT, STOPWORDS.TXT, PROTWORDS.TXT, OPEN-EXCHANGE-RATES.JSON, SYNONYMS.TXT, CURRENCY.XML, MAPPING-ISOLATIN1ACCENT.TXT]
[junit4:junit4]   2> 3952 T721 oasc.CachingDirectoryFactory.close Releasing directory:/usr/home/hudson/hudson-slave/workspace/Lucene-Solr-NightlyTests-trunk/solr/build/solr-core/test/J0/./org.apache.solr.cloud.BasicDistributedZk2Test-1355707361738/jetty1
[junit4:junit4]   2> 3953 T721 oass.SolrIndexSearcher.<init> Opening Searcher@897521a main
[junit4:junit4]   2> 3954 T721 oasu.CommitTracker.<init> Hard AutoCommit: disabled
[junit4:junit4]   2> 3955 T721 oasu.CommitTracker.<init> Soft AutoCommit: disabled
[junit4:junit4]   2> 3955 T721 oashc.SpellCheckComponent.inform Initializing spell checkers
[junit4:junit4]   2> 3963 T721 oass.DirectSolrSpellChecker.init init: {name=direct,classname=DirectSolrSpellChecker,field=lowerfilt,minQueryLength=3}
[junit4:junit4]   2> 4019 T722 oasc.SolrCore.registerSearcher [collection1] Registered new searcher Searcher@897521a main{StandardDirectoryReader(segments_1:1)}
[junit4:junit4]   2> 4024 T721 oasc.ZkController.publish publishing core=collection1 state=down
[junit4:junit4]   2> 4025 T721 oasc.ZkController.publish numShards not found on descriptor - reading it from system property
[junit4:junit4]   2> 4192 T702 oascc.ZkStateReader.updateClusterState Updating cloud state from ZooKeeper... 
[junit4:junit4]   2> 4193 T702 oasc.Overseer$ClusterStateUpdater.updateState Update state numShards=2 message={
[junit4:junit4]   2> 	  "operation":"state",
[junit4:junit4]   2> 	  "numShards":"2",
[junit4:junit4]   2> 	  "shard":null,
[junit4:junit4]   2> 	  "roles":null,
[junit4:junit4]   2> 	  "state":"down",
[junit4:junit4]   2> 	  "core":"collection1",
[junit4:junit4]   2> 	  "collection":"collection1",
[junit4:junit4]   2> 	  "node_name":"127.0.0.1:28194_yv%2Ffm",
[junit4:junit4]   2> 	  "base_url":"http://127.0.0.1:28194/yv/fm"}
[junit4:junit4]   2> 4194 T702 oasc.Overseer$ClusterStateUpdater.createCollection Create collection collection1 with numShards 2
[junit4:junit4]   2> 4194 T702 oasc.Overseer$ClusterStateUpdater.updateState Assigning new node to shard shard=shard1
[junit4:junit4]   2> 4207 T720 oascc.ZkStateReader$2.process A cluster state change: WatchedEvent state:SyncConnected type:NodeDataChanged path:/clusterstate.json, has occurred - updating... (live nodes size: 2)
[junit4:junit4]   2> 4207 T701 oascc.ZkStateReader$2.process A cluster state change: WatchedEvent state:SyncConnected type:NodeDataChanged path:/clusterstate.json, has occurred - updating... (live nodes size: 2)
[junit4:junit4]   2> 4207 T707 oascc.ZkStateReader$2.process A cluster state change: WatchedEvent state:SyncConnected type:NodeDataChanged path:/clusterstate.json, has occurred - updating... (live nodes size: 2)
[junit4:junit4]   2> 4528 T721 oasc.CoreContainer.registerCore registering core: collection1
[junit4:junit4]   2> 4528 T721 oasc.ZkController.register Register shard - core:collection1 address:http://127.0.0.1:28194/yv/fm shardId:shard1
[junit4:junit4]   2> 4529 T721 oascc.SolrZkClient.makePath makePath: /collections/collection1/leader_elect/shard1/election
[junit4:junit4]   2> 4548 T684 oazs.PrepRequestProcessor.pRequest Got user-level KeeperException when processing sessionid:0x13ba674aac30006 type:delete cxid:0x45 zxid:0x5b txntype:-1 reqpath:n/a Error Path:/solr/collections/collection1/leaders Error:KeeperErrorCode = NoNode for /solr/collections/collection1/leaders
[junit4:junit4]   2> 4549 T721 oasc.ShardLeaderElectionContext.runLeaderProcess Running the leader process.
[junit4:junit4]   2> 4549 T684 oazs.PrepRequestProcessor.pRequest Got user-level KeeperException when processing sessionid:0x13ba674aac30006 type:create cxid:0x46 zxid:0x5c txntype:-1 reqpath:n/a Error Path:/solr/overseer Error:KeeperErrorCode = NodeExists for /solr/overseer
[junit4:junit4]   2> 4559 T721 oasc.ShardLeaderElectionContext.waitForReplicasToComeUp Enough replicas found to continue.
[junit4:junit4]   2> 4559 T721 oasc.ShardLeaderElectionContext.runLeaderProcess I may be the new leader - try and sync
[junit4:junit4]   2> 4559 T721 oasc.SyncStrategy.sync Sync replicas to http://127.0.0.1:28194/yv/fm/collection1/
[junit4:junit4]   2> 4560 T721 oasc.SyncStrategy.syncReplicas Sync Success - now sync replicas to me
[junit4:junit4]   2> 4560 T721 oasc.SyncStrategy.syncToMe http://127.0.0.1:28194/yv/fm/collection1/ has no replicas
[junit4:junit4]   2> 4560 T721 oasc.ShardLeaderElectionContext.runLeaderProcess I am the new leader: http://127.0.0.1:28194/yv/fm/collection1/
[junit4:junit4]   2> 4561 T721 oascc.SolrZkClient.makePath makePath: /collections/collection1/leaders/shard1
[junit4:junit4]   2> 4567 T684 oazs.PrepRequestProcessor.pRequest Got user-level KeeperException when processing sessionid:0x13ba674aac30006 type:create cxid:0x50 zxid:0x60 txntype:-1 reqpath:n/a Error Path:/solr/overseer Error:KeeperErrorCode = NodeExists for /solr/overseer
[junit4:junit4]   2> 4741 T702 oascc.ZkStateReader.updateClusterState Updating cloud state from ZooKeeper... 
[junit4:junit4]   2> 4759 T701 oascc.ZkStateReader$2.process A cluster state change: WatchedEvent state:SyncConnected type:NodeDataChanged path:/clusterstate.json, has occurred - updating... (live nodes size: 2)
[junit4:junit4]   2> 4759 T720 oascc.ZkStateReader$2.process A cluster state change: WatchedEvent state:SyncConnected type:NodeDataChanged path:/clusterstate.json, has occurred - updating... (live nodes size: 2)
[junit4:junit4]   2> 4759 T707 oascc.ZkStateReader$2.process A cluster state change: WatchedEvent state:SyncConnected type:NodeDataChanged path:/clusterstate.json, has occurred - updating... (live nodes size: 2)
[junit4:junit4]   2> 4780 T721 oasc.ZkController.register We are http://127.0.0.1:28194/yv/fm/collection1/ and leader is http://127.0.0.1:28194/yv/fm/collection1/
[junit4:junit4]   2> 4780 T721 oasc.ZkController.register No LogReplay needed for core=collection1 baseURL=http://127.0.0.1:28194/yv/fm
[junit4:junit4]   2> 4780 T721 oasc.ZkController.checkRecovery I am the leader, no recovery necessary
[junit4:junit4]   2> 4780 T721 oasc.ZkController.publish publishing core=collection1 state=active
[junit4:junit4]   2> 4780 T721 oasc.ZkController.publish numShards not found on descriptor - reading it from system property
[junit4:junit4]   2> 4782 T721 oascc.ZkStateReader.updateClusterState Updating cloud state from ZooKeeper... 
[junit4:junit4]   2> 4783 T679 oass.SolrDispatchFilter.init user.dir=/usr/home/hudson/hudson-slave/workspace/Lucene-Solr-NightlyTests-trunk/solr/build/solr-core/test/J0
[junit4:junit4]   2> 4784 T679 oass.SolrDispatchFilter.init SolrDispatchFilter.init() done
[junit4:junit4]   2> 4784 T679 oascsi.HttpClientUtil.createClient Creating new http client, config:maxConnections=128&maxConnectionsPerHost=32&followRedirects=false
[junit4:junit4]   2> 4914 T679 oejs.Server.doStart jetty-8.1.8.v20121106
[junit4:junit4]   2> 4916 T679 oejs.AbstractConnector.doStart Started SocketConnector@127.0.0.1:28197
[junit4:junit4]   2> 4917 T679 oasc.SolrResourceLoader.locateSolrHome JNDI not configured for solr (NoInitialContextEx)
[junit4:junit4]   2> 4917 T679 oasc.SolrResourceLoader.locateSolrHome using system property solr.solr.home: /usr/home/hudson/hudson-slave/workspace/Lucene-Solr-NightlyTests-trunk/solr/build/solr-core/test/J0/./org.apache.solr.cloud.BasicDistributedZk2Test-jetty2-1355707366526
[junit4:junit4]   2> 4918 T679 oasc.SolrResourceLoader.<init> new SolrResourceLoader for deduced Solr Home: '/usr/home/hudson/hudson-slave/workspace/Lucene-Solr-NightlyTests-trunk/solr/build/solr-core/test/J0/./org.apache.solr.cloud.BasicDistributedZk2Test-jetty2-1355707366526/'
[junit4:junit4]   2> 4941 T679 oass.SolrDispatchFilter.init SolrDispatchFilter.init()
[junit4:junit4]   2> 4941 T679 oasc.SolrResourceLoader.locateSolrHome JNDI not configured for solr (NoInitialContextEx)
[junit4:junit4]   2> 4942 T679 oasc.SolrResourceLoader.locateSolrHome using system property solr.solr.home: /usr/home/hudson/hudson-slave/workspace/Lucene-Solr-NightlyTests-trunk/solr/build/solr-core/test/J0/./org.apache.solr.cloud.BasicDistributedZk2Test-jetty2-1355707366526
[junit4:junit4]   2> 4942 T679 oasc.CoreContainer$Initializer.initialize looking for solr.xml: /usr/home/hudson/hudson-slave/workspace/Lucene-Solr-NightlyTests-trunk/solr/build/solr-core/test/J0/./org.apache.solr.cloud.BasicDistributedZk2Test-jetty2-1355707366526/solr.xml
[junit4:junit4]   2> 4942 T679 oasc.CoreContainer.<init> New CoreContainer 375150181
[junit4:junit4]   2> 4943 T679 oasc.CoreContainer.load Loading CoreContainer using Solr Home: '/usr/home/hudson/hudson-slave/workspace/Lucene-Solr-NightlyTests-trunk/solr/build/solr-core/test/J0/./org.apache.solr.cloud.BasicDistributedZk2Test-jetty2-1355707366526/'
[junit4:junit4]   2> 4943 T679 oasc.SolrResourceLoader.<init> new SolrResourceLoader for directory: '/usr/home/hudson/hudson-slave/workspace/Lucene-Solr-NightlyTests-trunk/solr/build/solr-core/test/J0/./org.apache.solr.cloud.BasicDistributedZk2Test-jetty2-1355707366526/'
[junit4:junit4]   2> 4960 T679 oasc.CoreContainer.load Registering Log Listener
[junit4:junit4]   2> 4971 T679 oasc.CoreContainer.initZooKeeper Zookeeper client=127.0.0.1:28187/solr
[junit4:junit4]   2> 4972 T679 oasc.ZkController.checkChrootPath zkHost includes chroot
[junit4:junit4]   2> 4972 T679 oaz.ZooKeeper.<init> Initiating client connection, connectString=127.0.0.1:28187 sessionTimeout=60000 watcher=org.apache.solr.common.cloud.ConnectionManager@3df2e8e
[junit4:junit4]   2> 4973 T679 oascc.ConnectionManager.waitForConnected Waiting for client to connect to ZooKeeper
[junit4:junit4]   2> 4974 T732 oaz.ClientCnxn$SendThread.logStartConnect Opening socket connection to server localhost/127.0.0.1:28187. Will not attempt to authenticate using SASL (access denied (javax.security.auth.AuthPermission getLoginConfiguration))
[junit4:junit4]   2> 4974 T732 oaz.ClientCnxn$SendThread.primeConnection Socket connection established to localhost/127.0.0.1:28187, initiating session
[junit4:junit4]   2> 4975 T681 oazs.NIOServerCnxnFactory.run Accepted socket connection from /140.211.11.196:28198
[junit4:junit4]   2> 4975 T681 oazs.ZooKeeperServer.processConnectRequest Client attempting to establish new session at /140.211.11.196:28198
[junit4:junit4]   2> 4977 T683 oazs.ZooKeeperServer.finishSessionInit Established session 0x13ba674aac30007 with negotiated timeout 20000 for client /140.211.11.196:28198
[junit4:junit4]   2> 4977 T732 oaz.ClientCnxn$SendThread.onConnected Session establishment complete on server localhost/127.0.0.1:28187, sessionid = 0x13ba674aac30007, negotiated timeout = 20000
[junit4:junit4]   2> 4977 T733 oascc.ConnectionManager.process Watcher org.apache.solr.common.cloud.ConnectionManager@3df2e8e name:ZooKeeperConnection Watcher:127.0.0.1:28187 got event WatchedEvent state:SyncConnected type:None path:null path:null type:None
[junit4:junit4]   2> 4977 T679 oascc.ConnectionManager.waitForConnected Client is connected to ZooKeeper
[junit4:junit4]   2> 4979 T684 oazs.PrepRequestProcessor.pRequest2Txn Processed session termination for sessionid: 0x13ba674aac30007
[junit4:junit4]   2> 4992 T681 oazs.NIOServerCnxn.closeSock Closed socket connection for client /140.211.11.196:28198 which had sessionid 0x13ba674aac30007
[junit4:junit4]   2> 4992 T733 oaz.ClientCnxn$EventThread.run EventThread shut down
[junit4:junit4]   2> 4992 T679 oaz.ZooKeeper.close Session: 0x13ba674aac30007 closed
[junit4:junit4]   2> 4993 T679 oaz.ZooKeeper.<init> Initiating client connection, connectString=127.0.0.1:28187/solr sessionTimeout=8000 watcher=org.apache.solr.common.cloud.ConnectionManager@42ce932f
[junit4:junit4]   2> 4993 T679 oascc.ConnectionManager.waitForConnected Waiting for client to connect to ZooKeeper
[junit4:junit4]   2> 4994 T734 oaz.ClientCnxn$SendThread.logStartConnect Opening socket connection to server localhost/127.0.0.1:28187. Will not attempt to authenticate using SASL (access denied (javax.security.auth.AuthPermission getLoginConfiguration))
[junit4:junit4]   2> 4994 T734 oaz.ClientCnxn$SendThread.primeConnection Socket connection established to localhost/127.0.0.1:28187, initiating session
[junit4:junit4]   2> 4994 T681 oazs.NIOServerCnxnFactory.run Accepted socket connection from /140.211.11.196:28199
[junit4:junit4]   2> 4995 T681 oazs.ZooKeeperServer.processConnectRequest Client attempting to establish new session at /140.211.11.196:28199
[junit4:junit4]   2> 4996 T683 oazs.ZooKeeperServer.finishSessionInit Established session 0x13ba674aac30008 with negotiated timeout 8000 for client /140.211.11.196:28199
[junit4:junit4]   2> 4996 T734 oaz.ClientCnxn$SendThread.onConnected Session establishment complete on server localhost/127.0.0.1:28187, sessionid = 0x13ba674aac30008, negotiated timeout = 8000
[junit4:junit4]   2> 4996 T735 oascc.ConnectionManager.process Watcher org.apache.solr.common.cloud.ConnectionManager@42ce932f name:ZooKeeperConnection Watcher:127.0.0.1:28187/solr got event WatchedEvent state:SyncConnected type:None path:null path:null type:None
[junit4:junit4]   2> 4996 T679 oascc.ConnectionManager.waitForConnected Client is connected to ZooKeeper
[junit4:junit4]   2> 4998 T684 oazs.PrepRequestProcessor.pRequest Got user-level KeeperException when processing sessionid:0x13ba674aac30008 type:create cxid:0x1 zxid:0x6d txntype:-1 reqpath:n/a Error Path:/solr/overseer Error:KeeperErrorCode = NodeExists for /solr/overseer
[junit4:junit4]   2> 4999 T684 oazs.PrepRequestProcessor.pRequest Got user-level KeeperException when processing sessionid:0x13ba674aac30008 type:create cxid:0x2 zxid:0x6e txntype:-1 reqpath:n/a Error Path:/solr/overseer Error:KeeperErrorCode = NodeExists for /solr/overseer
[junit4:junit4]   2> 5001 T679 oasc.ZkController.createEphemeralLiveNode Register node as live in ZooKeeper:/live_nodes/127.0.0.1:28197_yv%2Ffm
[junit4:junit4]   2> 5002 T684 oazs.PrepRequestProcessor.pRequest Got user-level KeeperException when processing sessionid:0x13ba674aac30008 type:delete cxid:0x4 zxid:0x6f txntype:-1 reqpath:n/a Error Path:/solr/live_nodes/127.0.0.1:28197_yv%2Ffm Error:KeeperErrorCode = NoNode for /solr/live_nodes/127.0.0.1:28197_yv%2Ffm
[junit4:junit4]   2> 5010 T679 oascc.SolrZkClient.makePath makePath: /live_nodes/127.0.0.1:28197_yv%2Ffm
[junit4:junit4]   2> 5013 T701 oascc.ZkStateReader$2.process A cluster state change: WatchedEvent state:SyncConnected type:NodeChildrenChanged path:/live_nodes, has occurred - updating... (live nodes size: 2)
[junit4:junit4]   2> 5013 T707 oascc.ZkStateReader$3.process Updating live nodes... (3)
[junit4:junit4]   2> 5013 T707 oascc.ZkStateReader$2.process A cluster state change: WatchedEvent state:SyncConnected type:NodeChildrenChanged path:/live_nodes, has occurred - updating... (live nodes size: 3)
[junit4:junit4]   2> 5013 T720 oascc.ZkStateReader$3.process Updating live nodes... (3)
[junit4:junit4]   2> 5014 T720 oascc.ZkStateReader$2.process A cluster state change: WatchedEvent state:SyncConnected type:NodeChildrenChanged path:/live_nodes, has occurred - updating... (live nodes size: 3)
[junit4:junit4]   2> 5014 T679 oashc.HttpShardHandlerFactory.getParameter Setting socketTimeout to: 0
[junit4:junit4]   2> 5015 T679 oashc.HttpShardHandlerFactory.getParameter Setting urlScheme to: http://
[junit4:junit4]   2> 5016 T679 oashc.HttpShardHandlerFactory.getParameter Setting connTimeout to: 0
[junit4:junit4]   2> 5016 T701 oascc.ZkStateReader$3.process Updating live nodes... (3)
[junit4:junit4]   2> 5016 T679 oashc.HttpShardHandlerFactory.getParameter Setting maxConnectionsPerHost to: 20
[junit4:junit4]   2> 5016 T679 oashc.HttpShardHandlerFactory.getParameter Setting corePoolSize to: 0
[junit4:junit4]   2> 5017 T679 oashc.HttpShardHandlerFactory.getParameter Setting maximumPoolSize to: 2147483647
[junit4:junit4]   2> 5017 T679 oashc.HttpShardHandlerFactory.getParameter Setting maxThreadIdleTime to: 5
[junit4:junit4]   2> 5017 T679 oashc.HttpShardHandlerFactory.getParameter Setting sizeOfQueue to: -1
[junit4:junit4]   2> 5018 T679 oashc.HttpShardHandlerFactory.getParameter Setting fairnessPolicy to: false
[junit4:junit4]   2> 5018 T679 oascsi.HttpClientUtil.createClient Creating new http client, config:maxConnectionsPerHost=20&maxConnections=10000&socketTimeout=0&connTimeout=0&retry=false
[junit4:junit4]   2> 5033 T679 oascc.ZkStateReader.createClusterStateWatchersAndUpdate Updating cluster state from ZooKeeper... 
[junit4:junit4]   2> 5040 T736 oasc.CoreContainer.create Creating SolrCore 'collection1' using instanceDir: /usr/home/hudson/hudson-slave/workspace/Lucene-Solr-NightlyTests-trunk/solr/build/solr-core/test/J0/./org.apache.solr.cloud.BasicDistributedZk2Test-jetty2-1355707366526/collection1
[junit4:junit4]   2> 5040 T736 oasc.ZkController.createCollectionZkNode Check for collection zkNode:collection1
[junit4:junit4]   2> 5041 T736 oasc.ZkController.createCollectionZkNode Collection zkNode exists
[junit4:junit4]   2> 5041 T736 oasc.ZkController.readConfigName Load collection config from:/collections/collection1
[junit4:junit4]   2> 5043 T736 oasc.SolrResourceLoader.<init> new SolrResourceLoader for directory: '/usr/home/hudson/hudson-slave/workspace/Lucene-Solr-NightlyTests-trunk/solr/build/solr-core/test/J0/./org.apache.solr.cloud.BasicDistributedZk2Test-jetty2-1355707366526/collection1/'
[junit4:junit4]   2> 5044 T736 oasc.SolrResourceLoader.replaceClassLoader Adding 'file:/usr/home/hudson/hudson-slave/workspace/Lucene-Solr-NightlyTests-trunk/solr/build/solr-core/test/J0/org.apache.solr.cloud.BasicDistributedZk2Test-jetty2-1355707366526/collection1/lib/README' to classloader
[junit4:junit4]   2> 5044 T736 oasc.SolrResourceLoader.replaceClassLoader Adding 'file:/usr/home/hudson/hudson-slave/workspace/Lucene-Solr-NightlyTests-trunk/solr/build/solr-core/test/J0/org.apache.solr.cloud.BasicDistributedZk2Test-jetty2-1355707366526/collection1/lib/classes/' to classloader
[junit4:junit4]   2> 5079 T736 oasc.SolrConfig.<init> Using Lucene MatchVersion: LUCENE_50
[junit4:junit4]   2> 5127 T736 oasc.SolrConfig.<init> Loaded SolrConfig: solrconfig.xml
[junit4:junit4]   2> 5128 T736 oass.IndexSchema.readSchema Reading Solr Schema
[junit4:junit4]   2> 5133 T736 oass.IndexSchema.readSchema Schema name=test
[junit4:junit4]   2> 5290 T702 oascc.ZkStateReader.updateClusterState Updating cloud state from ZooKeeper... 
[junit4:junit4]   2> 5291 T702 oasc.Overseer$ClusterStateUpdater.updateState Update state numShards=2 message={
[junit4:junit4]   2> 	  "operation":"state",
[junit4:junit4]   2> 	  "numShards":"2",
[junit4:junit4]   2> 	  "shard":"shard1",
[junit4:junit4]   2> 	  "roles":null,
[junit4:junit4]   2> 	  "state":"active",
[junit4:junit4]   2> 	  "core":"collection1",
[junit4:junit4]   2> 	  "collection":"collection1",
[junit4:junit4]   2> 	  "node_name":"127.0.0.1:28194_yv%2Ffm",
[junit4:junit4]   2> 	  "base_url":"http://127.0.0.1:28194/yv/fm"}
[junit4:junit4]   2> 5304 T707 oascc.ZkStateReader$2.process A cluster state change: WatchedEvent state:SyncConnected type:NodeDataChanged path:/clusterstate.json, has occurred - updating... (live nodes size: 3)
[junit4:junit4]   2> 5304 T701 oascc.ZkStateReader$2.process A cluster state change: WatchedEvent state:SyncConnected type:NodeDataChanged path:/clusterstate.json, has occurred - updating... (live nodes size: 3)
[junit4:junit4]   2> 5304 T735 oascc.ZkStateReader$2.process A cluster state change: WatchedEvent state:SyncConnected type:NodeDataChanged path:/clusterstate.json, has occurred - updating... (live nodes size: 3)
[junit4:junit4]   2> 5304 T720 oascc.ZkStateReader$2.process A cluster state change: WatchedEvent state:SyncConnected type:NodeDataChanged path:/clusterstate.json, has occurred - updating... (live nodes size: 3)
[junit4:junit4]   2> 5754 T736 oass.OpenExchangeRatesOrgProvider.init Initialized with rates=open-exchange-rates.json, refreshInterval=1440.
[junit4:junit4]   2> 5767 T736 oass.IndexSchema.readSchema default search field in schema is text
[junit4:junit4]   2> 5771 T736 oass.IndexSchema.readSchema unique key field: id
[junit4:junit4]   2> 5794 T736 oass.FileExchangeRateProvider.reload Reloading exchange rates from file currency.xml
[junit4:junit4]   2> 5799 T736 oass.FileExchangeRateProvider.reload Reloading exchange rates from file currency.xml
[junit4:junit4]   2> 5805 T736 oass.OpenExchangeRatesOrgProvider.reload Reloading exchange rates from open-exchange-rates.json
[junit4:junit4]   2> 5806 T736 oass.OpenExchangeRatesOrgProvider.reload Reloading exchange rates from open-exchange-rates.json
[junit4:junit4]   2> 5808 T736 oasc.SolrCore.<init> [collection1] Opening new SolrCore at /usr/home/hudson/hudson-slave/workspace/Lucene-Solr-NightlyTests-trunk/solr/build/solr-core/test/J0/./org.apache.solr.cloud.BasicDistributedZk2Test-jetty2-1355707366526/collection1/, dataDir=./org.apache.solr.cloud.BasicDistributedZk2Test-1355707361738/jetty2/
[junit4:junit4]   2> 5809 T736 oasc.JmxMonitoredMap.<init> JMX monitoring is enabled. Adding Solr mbeans to JMX Server: com.sun.jmx.mbeanserver.JmxMBeanServer@235f4a7f
[junit4:junit4]   2> 5809 T736 oasc.SolrCore.initDirectoryFactory solr.NRTCachingDirectoryFactory
[junit4:junit4]   2> 5810 T736 oasc.CachingDirectoryFactory.get return new directory for /usr/home/hudson/hudson-slave/workspace/Lucene-Solr-NightlyTests-trunk/solr/build/solr-core/test/J0/./org.apache.solr.cloud.BasicDistributedZk2Test-1355707361738/jetty2 forceNew:false
[junit4:junit4]   2> 5811 T736 oasc.CachingDirectoryFactory.close Releasing directory:/usr/home/hudson/hudson-slave/workspace/Lucene-Solr-NightlyTests-trunk/solr/build/solr-core/test/J0/./org.apache.solr.cloud.BasicDistributedZk2Test-1355707361738/jetty2
[junit4:junit4]   2> 5811 T736 oasc.SolrCore.getNewIndexDir New index directory detected: old=null new=./org.apache.solr.cloud.BasicDistributedZk2Test-1355707361738/jetty2/index/
[junit4:junit4]   2> 5812 T736 oasc.SolrCore.initIndex WARNING [collection1] Solr index directory './org.apache.solr.cloud.BasicDistributedZk2Test-1355707361738/jetty2/index' doesn't exist. Creating new index...
[junit4:junit4]   2> 5813 T736 oasc.CachingDirectoryFactory.get return new directory for /usr/home/hudson/hudson-slave/workspace/Lucene-Solr-NightlyTests-trunk/solr/build/solr-core/test/J0/./org.apache.solr.cloud.BasicDistributedZk2Test-1355707361738/jetty2/index forceNew:false
[junit4:junit4]   2> 5822 T736 oasc.SolrDeletionPolicy.onCommit SolrDeletionPolicy.onCommit: commits:num=1
[junit4:junit4]   2> 		commit{dir=RateLimitedDirectoryWrapper(NRTCachingDirectory(org.apache.lucene.store.NIOFSDirectory@/usr/home/hudson/hudson-slave/workspace/Lucene-Solr-NightlyTests-trunk/solr/build/solr-core/test/J0/org.apache.solr.cloud.BasicDistributedZk2Test-1355707361738/jetty2/index lockFactory=org.apache.lucene.store.NativeFSLockFactory@3d15146f; maxCacheMB=48.0 maxMergeSizeMB=4.0)),segFN=segments_1,generation=1,filenames=[segments_1]
[junit4:junit4]   2> 5822 T736 oasc.SolrDeletionPolicy.updateCommits newest commit = 1[segments_1]
[junit4:junit4]   2> 5823 T736 oasc.CachingDirectoryFactory.close Releasing directory:/usr/home/hudson/hudson-slave/workspace/Lucene-Solr-NightlyTests-trunk/solr/build/solr-core/test/J0/./org.apache.solr.cloud.BasicDistributedZk2Test-1355707361738/jetty2/index
[junit4:junit4]   2> 5823 T736 oasc.SolrCore.initWriters created xml: solr.XMLResponseWriter
[junit4:junit4]   2> 5825 T736 oasup.UpdateRequestProcessorChain.init inserting DistributedUpdateProcessorFactory into updateRequestProcessorChain "dedupe"
[junit4:junit4]   2> 5826 T736 oasup.UpdateRequestProcessorChain.init inserting DistributedUpdateProcessorFactory into updateRequestProcessorChain "dedupe-allfields"
[junit4:junit4]   2> 5826 T736 oasup.UpdateRequestProcessorChain.init inserting DistributedUpdateProcessorFactory into updateRequestProcessorChain "stored_sig"
[junit4:junit4]   2> 5826 T736 oasup.UpdateRequestProcessorChain.init inserting DistributedUpdateProcessorFactory into updateRequestProcessorChain "uniq-fields"
[junit4:junit4]   2> 5827 T736 oasup.UpdateRequestProcessorChain.init inserting DistributedUpdateProcessorFactory into updateRequestProcessorChain "distrib-dup-test-chain-implicit"
[junit4:junit4]   2> 5827 T736 oasc.RequestHandlers.initHandlersFromConfig adding lazy requestHandler: solr.ReplicationHandler
[junit4:junit4]   2> 5828 T736 oasc.RequestHandlers.initHandlersFromConfig created /replication: solr.ReplicationHandler
[junit4:junit4]   2> 5829 T736 oasc.RequestHandlers.initHandlersFromConfig created standard: solr.StandardRequestHandler
[junit4:junit4]   2> 5830 T736 oasc.RequestHandlers.initHandlersFromConfig created /get: solr.RealTimeGetHandler
[junit4:junit4]   2> 5831 T736 oasc.RequestHandlers.initHandlersFromConfig created dismax: solr.SearchHandler
[junit4:junit4]   2> 5832 T736 oasc.RequestHandlers.initHandlersFromConfig created mock: org.apache.solr.core.MockQuerySenderListenerReqHandler
[junit4:junit4]   2> 5832 T736 oasc.RequestHandlers.initHandlersFromConfig created /admin/: org.apache.solr.handler.admin.AdminHandlers
[junit4:junit4]   2> 5833 T736 oasc.RequestHandlers.initHandlersFromConfig created defaults: solr.StandardRequestHandler
[junit4:junit4]   2> 5833 T736 oasc.RequestHandlers.initHandlersFromConfig adding lazy requestHandler: solr.StandardRequestHandler
[junit4:junit4]   2> 5834 T736 oasc.RequestHandlers.initHandlersFromConfig created lazy: solr.StandardRequestHandler
[junit4:junit4]   2> 5835 T736 oasc.RequestHandlers.initHandlersFromConfig created /update: solr.UpdateRequestHandler
[junit4:junit4]   2> 5836 T736 oasc.RequestHandlers.initHandlersFromConfig created /terms: org.apache.solr.handler.component.SearchHandler
[junit4:junit4]   2> 5837 T736 oasc.RequestHandlers.initHandlersFromConfig created spellCheckCompRH: org.apache.solr.handler.component.SearchHandler
[junit4:junit4]   2> 5838 T736 oasc.RequestHandlers.initHandlersFromConfig created spellCheckCompRH_Direct: org.apache.solr.handler.component.SearchHandler
[junit4:junit4]   2> 5839 T736 oasc.RequestHandlers.initHandlersFromConfig created spellCheckWithWordbreak: org.apache.solr.handler.component.SearchHandler
[junit4:junit4]   2> 5840 T736 oasc.RequestHandlers.initHandlersFromConfig created spellCheckWithWordbreak_Direct: org.apache.solr.handler.component.SearchHandler
[junit4:junit4]   2> 5841 T736 oasc.RequestHandlers.initHandlersFromConfig created spellCheckCompRH1: org.apache.solr.handler.component.SearchHandler
[junit4:junit4]   2> 5842 T736 oasc.RequestHandlers.initHandlersFromConfig created mltrh: org.apache.solr.handler.component.SearchHandler
[junit4:junit4]   2> 5843 T736 oasc.RequestHandlers.initHandlersFromConfig created tvrh: org.apache.solr.handler.component.SearchHandler
[junit4:junit4]   2> 5844 T736 oasc.RequestHandlers.initHandlersFromConfig created /mlt: solr.MoreLikeThisHandler
[junit4:junit4]   2> 5845 T736 oasc.RequestHandlers.initHandlersFromConfig created /debug/dump: solr.DumpRequestHandler
[junit4:junit4]   2> 5852 T736 oashl.XMLLoader.init xsltCacheLifetimeSeconds=60
[junit4:junit4]   2> 5857 T736 oasc.SolrCore.initDeprecatedSupport WARNING solrconfig.xml uses deprecated <admin/gettableFiles>, Please update your config to use the ShowFileRequestHandler.
[junit4:junit4]   2> 5859 T736 oasc.SolrCore.initDeprecatedSupport WARNING adding ShowFileRequestHandler with hidden files: [SCHEMA.XML, OLD_SYNONYMS.TXT, STOPWORDS.TXT, PROTWORDS.TXT, OPEN-EXCHANGE-RATES.JSON, SYNONYMS.TXT, CURRENCY.XML, MAPPING-ISOLATIN1ACCENT.TXT]
[junit4:junit4]   2> 5862 T736 oasc.CachingDirectoryFactory.close Releasing directory:/usr/home/hudson/hudson-slave/workspace/Lucene-Solr-NightlyTests-trunk/solr/build/solr-core/test/J0/./org.apache.solr.cloud.BasicDistributedZk2Test-1355707361738/jetty2
[junit4:junit4]   2> 5863 T736 oass.SolrIndexSearcher.<init> Opening Searcher@732d486e main
[junit4:junit4]   2> 5864 T736 oasu.CommitTracker.<init> Hard AutoCommit: disabled
[junit4:junit4]   2> 5865 T736 oasu.CommitTracker.<init> Soft AutoCommit: disabled
[junit4:junit4]   2> 5865 T736 oashc.SpellCheckComponent.inform Initializing spell checkers
[junit4:junit4]   2> 5872 T736 oass.DirectSolrSpellChecker.init init: {name=direct,classname=DirectSolrSpellChecker,field=lowerfilt,minQueryLength=3}
[junit4:junit4]   2> 5924 T737 oasc.SolrCore.registerSearcher [collection1] Registered new searcher Searcher@732d486e main{StandardDirectoryReader(segments_1:1)}
[junit4:junit4]   2> 5929 T736 oasc.ZkController.publish publishing core=collection1 state=down
[junit4:junit4]   2> 5929 T736 oasc.ZkController.publish numShards not found on descriptor - reading it from system property
[junit4:junit4]   2> 6322 T702 oascc.ZkStateReader.updateClusterState Updating cloud state from ZooKeeper... 
[junit4:junit4]   2> 6323 T702 oasc.Overseer$ClusterStateUpdater.updateState Update state numShards=2 message={
[junit4:junit4]   2> 	  "operation":"state",
[junit4:junit4]   2> 	  "numShards":"2",
[junit4:junit4]   2> 	  "shard":null,
[junit4:junit4]   2> 	  "roles":null,
[junit4:junit4]   2> 	  "state":"down",
[junit4:junit4]   2> 	  "core":"collection1",
[junit4:junit4]   2> 	  "collection":"collection1",
[junit4:junit4]   2> 	  "node_name":"127.0.0.1:28197_yv%2Ffm",
[junit4:junit4]   2> 	  "base_url":"http://127.0.0.1:28197/yv/fm"}
[junit4:junit4]   2> 6323 T702 oasc.Overseer$ClusterStateUpdater.updateState Collection already exists with numShards=2
[junit4:junit4]   2> 6324 T702 oasc.Overseer$ClusterStateUpdater.updateState Assigning new node to shard shard=shard2
[junit4:junit4]   2> 6337 T720 oascc.ZkStateReader$2.process A cluster state change: WatchedEvent state:SyncConnected type:NodeDataChanged path:/clusterstate.json, has occurred - updating... (live nodes size: 3)
[junit4:junit4]   2> 6337 T701 oascc.ZkStateReader$2.process A cluster state change: WatchedEvent state:SyncConnected type:NodeDataChanged path:/clusterstate.json, has occurred - updating... (live nodes size: 3)
[junit4:junit4]   2> 6337 T707 oascc.ZkStateReader$2.process A cluster state change: WatchedEvent state:SyncConnected type:NodeDataChanged path:/clusterstate.json, has occurred - updating... (live nodes size: 3)
[junit4:junit4]   2> 6337 T735 oascc.ZkStateReader$2.process A cluster state change: WatchedEvent state:SyncConnected type:NodeDataChanged path:/clusterstate.json, has occurred - updating... (live nodes size: 3)
[junit4:junit4]   2> 6432 T736 oasc.CoreContainer.registerCore registering core: collection1
[junit4:junit4]   2> 6432 T736 oasc.ZkController.register Register shard - core:collection1 address:http://127.0.0.1:28197/yv/fm shardId:shard2
[junit4:junit4]   2> 6433 T736 oascc.SolrZkClient.makePath makePath: /collections/collection1/leader_elect/shard2/election
[junit4:junit4]   2> 6450 T684 oazs.PrepRequestProcessor.pRequest Got user-level KeeperException when processing sessionid:0x13ba674aac30008 type:delete cxid:0x44 zxid:0x7e txntype:-1 reqpath:n/a Error Path:/solr/collections/collection1/leaders/shard2 Error:KeeperErrorCode = NoNode for /solr/collections/collection1/leaders/shard2
[junit4:junit4]   2> 6451 T736 oasc.ShardLeaderElectionContext.runLeaderProcess Running the leader process.
[junit4:junit4]   2> 6451 T684 oazs.PrepRequestProcessor.pRequest Got user-level KeeperException when processing sessionid:0x13ba674aac30008 type:create cxid:0x45 zxid:0x7f txntype:-1 reqpath:n/a Error Path:/solr/overseer Error:KeeperErrorCode = NodeExists for /solr/overseer
[junit4:junit4]   2> 6462 T736 oasc.ShardLeaderElectionContext.waitForReplicasToComeUp Enough replicas found to continue.
[junit4:junit4]   2> 6462 T736 oasc.ShardLeaderElectionContext.runLeaderProcess I may be the new leader - try and sync
[junit4:junit4]   2> 6462 T736 oasc.SyncStrategy.sync Sync replicas to http://127.0.0.1:28197/yv/fm/collection1/
[junit4:junit4]   2> 6463 T736 oasc.SyncStrategy.syncReplicas Sync Success - now sync replicas to me
[junit4:junit4]   2> 6463 T736 oasc.SyncStrategy.syncToMe http://127.0.0.1:28197/yv/fm/collection1/ has no replicas
[junit4:junit4]   2> 6463 T736 oasc.ShardLeaderElectionContext.runLeaderProcess I am the new leader: http://127.0.0.1:28197/yv/fm/collection1/
[junit4:junit4]   2> 6463 T736 oascc.SolrZkClient.makePath makePath: /collections/collection1/leaders/shard2
[junit4:junit4]   2> 6479 T684 oazs.PrepRequestProcessor.pRequest Got user-level KeeperException when processing sessionid:0x13ba674aac30008 type:create cxid:0x4e zxid:0x82 txntype:-1 reqpath:n/a Error Path:/solr/overseer Error:KeeperErrorCode = NodeExists for /solr/overseer
[junit4:junit4]   2> 6846 T702 oascc.ZkStateReader.updateClusterState Updating cloud state from ZooKeeper... 
[junit4:junit4]   2> 6868 T720 oascc.ZkStateReader$2.process A cluster state change: WatchedEvent state:SyncConnected type:NodeDataChanged path:/clusterstate.json, has occurred - updating... (live nodes size: 3)
[junit4:junit4]   2> 6868 T707 oascc.ZkStateReader$2.process A cluster state change: WatchedEvent state:SyncConnected type:NodeDataChanged path:/clusterstate.json, has occurred - updating... (live nodes size: 3)
[junit4:junit4]   2> 6868 T701 oascc.ZkStateReader$2.process A cluster state change: WatchedEvent state:SyncConnected type:NodeDataChanged path:/clusterstate.json, has occurred - updating... (live nodes size: 3)
[junit4:junit4]   2> 6868 T735 oascc.ZkStateReader$2.process A cluster state change: WatchedEvent state:SyncConnected type:NodeDataChanged path:/clusterstate.json, has occurred - updating... (live nodes size: 3)
[junit4:junit4]   2> 6884 T736 oasc.ZkController.register We are http://127.0.0.1:28197/yv/fm/collection1/ and leader is http://127.0.0.1:28197/yv/fm/collection1/
[junit4:junit4]   2> 6884 T736 oasc.ZkController.register No LogReplay needed for core=collection1 baseURL=http://127.0.0.1:28197/yv/fm
[junit4:junit4]   2> 6884 T736 oasc.ZkController.checkRecovery I am the leader, no recovery necessary
[junit4:junit4]   2> 6884 T736 oasc.ZkController.publish publishing core=collection1 state=active
[junit4:junit4]   2> 6885 T736 oasc.ZkController.publish numShards not found on descriptor - reading it from system property
[junit4:junit4]   2> 6887 T736 oascc.ZkStateReader.updateClusterState Updating cloud state from ZooKeeper... 
[junit4:junit4]   2> 6888 T679 oass.SolrDispatchFilter.init user.dir=/usr/home/hudson/hudson-slave/workspace/Lucene-Solr-NightlyTests-trunk/solr/build/solr-core/test/J0
[junit4:junit4]   2> 6889 T679 oass.SolrDispatchFilter.init SolrDispatchFilter.init() done
[junit4:junit4]   2> 6889 T679 oascsi.HttpClientUtil.createClient Creating new http client, config:maxConnections=128&maxConnectionsPerHost=32&followRedirects=false
[junit4:junit4]   2> 7062 T679 oejs.Server.doStart jetty-8.1.8.v20121106
[junit4:junit4]   2> 7065 T679 oejs.AbstractConnector.doStart Started SocketConnector@127.0.0.1:28200
[junit4:junit4]   2> 7066 T679 oasc.SolrResourceLoader.locateSolrHome JNDI not configured for solr (NoInitialContextEx)
[junit4:junit4]   2> 7067 T679 oasc.SolrResourceLoader.locateSolrHome using system property solr.solr.home: /usr/home/hudson/hudson-slave/workspace/Lucene-Solr-NightlyTests-trunk/solr/build/solr-core/test/J0/./org.apache.solr.cloud.BasicDistributedZk2Test-jetty3-1355707368635
[junit4:junit4]   2> 7067 T679 oasc.SolrResourceLoader.<init> new SolrResourceLoader for deduced Solr Home: '/usr/home/hudson/hudson-slave/workspace/Lucene-Solr-NightlyTests-trunk/solr/build/solr-core/test/J0/./org.apache.solr.cloud.BasicDistributedZk2Test-jetty3-1355707368635/'
[junit4:junit4]   2> 7102 T679 oass.SolrDispatchFilter.init SolrDispatchFilter.init()
[junit4:junit4]   2> 7103 T679 oasc.SolrResourceLoader.locateSolrHome JNDI not configured for solr (NoInitialContextEx)
[junit4:junit4]   2> 7103 T679 oasc.SolrResourceLoader.locateSolrHome using system property solr.solr.home: /usr/home/hudson/hudson-slave/workspace/Lucene-Solr-NightlyTests-trunk/solr/build/solr-core/test/J0/./org.apache.solr.cloud.BasicDistributedZk2Test-jetty3-1355707368635
[junit4:junit4]   2> 7104 T679 oasc.CoreContainer$Initializer.initialize looking for solr.xml: /usr/home/hudson/hudson-slave/workspace/Lucene-Solr-NightlyTests-trunk/solr/build/solr-core/test/J0/./org.apache.solr.cloud.BasicDistributedZk2Test-jetty3-1355707368635/solr.xml
[junit4:junit4]   2> 7104 T679 oasc.CoreContainer.<init> New CoreContainer 333389967
[junit4:junit4]   2> 7105 T679 oasc.CoreContainer.load Loading CoreContainer using Solr Home: '/usr/home/hudson/hudson-slave/workspace/Lucene-Solr-NightlyTests-trunk/solr/build/solr-core/test/J0/./org.apache.solr.cloud.BasicDistributedZk2Test-jetty3-1355707368635/'
[junit4:junit4]   2> 7105 T679 oasc.SolrResourceLoader.<init> new SolrResourceLoader for directory: '/usr/home/hudson/hudson-slave/workspace/Lucene-Solr-NightlyTests-trunk/solr/build/solr-core/test/J0/./org.apache.solr.cloud.BasicDistributedZk2Test-jetty3-1355707368635/'
[junit4:junit4]   2> 7131 T679 oasc.CoreContainer.load Registering Log Listener
[junit4:junit4]   2> 7147 T679 oasc.CoreContainer.initZooKeeper Zookeeper client=127.0.0.1:28187/solr
[junit4:junit4]   2> 7148 T679 oasc.ZkController.checkChrootPath zkHost includes chroot
[junit4:junit4]   2> 7149 T679 oaz.ZooKeeper.<init> Initiating client connection, connectString=127.0.0.1:28187 sessionTimeout=60000 watcher=org.apache.solr.common.cloud.ConnectionManager@6c9532e1
[junit4:junit4]   2> 7150 T679 oascc.ConnectionManager.waitForConnected Waiting for client to connect to ZooKeeper
[junit4:junit4]   2> 7150 T747 oaz.ClientCnxn$SendThread.logStartConnect Opening socket connection to server localhost/127.0.0.1:28187. Will not attempt to authenticate using SASL (access denied (javax.security.auth.AuthPermission getLoginConfiguration))
[junit4:junit4]   2> 7151 T747 oaz.ClientCnxn$SendThread.primeConnection Socket connection established to localhost/127.0.0.1:28187, initiating session
[junit4:junit4]   2> 7152 T681 oazs.NIOServerCnxnFactory.run Accepted socket connection from /140.211.11.196:28201
[junit4:junit4]   2> 7152 T681 oazs.ZooKeeperServer.processConnectRequest Client attempting to establish new session at /140.211.11.196:28201
[junit4:junit4]   2> 7159 T683 oazs.ZooKeeperServer.finishSessionInit Established session 0x13ba674aac30009 with negotiated timeout 20000 for client /140.211.11.196:28201
[junit4:junit4]   2> 7159 T747 oaz.ClientCnxn$SendThread.onConnected Session establishment complete on server localhost/127.0.0.1:28187, sessionid = 0x13ba674aac30009, negotiated timeout = 20000
[junit4:junit4]   2> 7160 T748 oascc.ConnectionManager.process Watcher org.apache.solr.common.cloud.ConnectionManager@6c9532e1 name:ZooKeeperConnection Watcher:127.0.0.1:28187 got event WatchedEvent state:SyncConnected type:None path:null path:null type:None
[junit4:junit4]   2> 7160 T679 oascc.ConnectionManager.waitForConnected Client is connected to ZooKeeper
[junit4:junit4]   2> 7162 T684 oazs.PrepRequestProcessor.pRequest2Txn Processed session termination for sessionid: 0x13ba674aac30009
[junit4:junit4]   2> 7175 T681 oazs.NIOServerCnxn.closeSock Closed socket connection for client /140.211.11.196:28201 which had sessionid 0x13ba674aac30009
[junit4:junit4]   2> 7175 T748 oaz.ClientCnxn$EventThread.run EventThread shut down
[junit4:junit4]   2> 7175 T679 oaz.ZooKeeper.close Session: 0x13ba674aac30009 closed
[junit4:junit4]   2> 7176 T679 oaz.ZooKeeper.<init> Initiating client connection, connectString=127.0.0.1:28187/solr sessionTimeout=8000 watcher=org.apache.solr.common.cloud.ConnectionManager@5f232751
[junit4:junit4]   2> 7177 T679 oascc.ConnectionManager.waitForConnected Waiting for client to connect to ZooKeeper
[junit4:junit4]   2> 7177 T749 oaz.ClientCnxn$SendThread.logStartConnect Opening socket connection to server localhost/127.0.0.1:28187. Will not attempt to authenticate using SASL (access denied (javax.security.auth.AuthPermission getLoginConfiguration))
[junit4:junit4]   2> 7178 T749 oaz.ClientCnxn$SendThread.primeConnection Socket connection established to localhost/127.0.0.1:28187, initiating session
[junit4:junit4]   2> 7178 T681 oazs.NIOServerCnxnFactory.run Accepted socket connection from /140.211.11.196:28202
[junit4:junit4]   2> 7179 T681 oazs.ZooKeeperServer.processConnectRequest Client attempting to establish new session at /140.211.11.196:28202
[junit4:junit4]   2> 7180 T683 oazs.ZooKeeperServer.finishSessionInit Established session 0x13ba674aac3000a with negotiated timeout 8000 for client /140.211.11.196:28202
[junit4:junit4]   2> 7180 T749 oaz.ClientCnxn$SendThread.onConnected Session establishment complete on server localhost/127.0.0.1:28187, sessionid = 0x13ba674aac3000a, negotiated timeout = 8000
[junit4:junit4]   2> 7180 T750 oascc.ConnectionManager.process Watcher org.apache.solr.common.cloud.ConnectionManager@5f232751 name:ZooKeeperConnection Watcher:127.0.0.1:28187/solr got event WatchedEvent state:SyncConnected type:None path:null path:null type:None
[junit4:junit4]   2> 7181 T679 oascc.ConnectionManager.waitForConnected Client is connected to ZooKeeper
[junit4:junit4]   2> 7182 T684 oazs.PrepRequestProcessor.pRequest Got user-level KeeperException when processing sessionid:0x13ba674aac3000a type:create cxid:0x1 zxid:0x8f txntype:-1 reqpath:n/a Error Path:/solr/overseer Error:KeeperErrorCode = NodeExists for /solr/overseer
[junit4:junit4]   2> 7184 T684 oazs.PrepRequestProcessor.pRequest Got user-level KeeperException when processing sessionid:0x13ba674aac3000a type:create cxid:0x2 zxid:0x90 txntype:-1 reqpath:n/a Error Path:/solr/overseer Error:KeeperErrorCode = NodeExists for /solr/overseer
[junit4:junit4]   2> 7191 T679 oasc.ZkController.createEphemeralLiveNode Register node as live in ZooKeeper:/live_nodes/127.0.0.1:28200_yv%2Ffm
[junit4:junit4]   2> 7192 T684 oazs.PrepRequestProcessor.pRequest Got user-level KeeperException when processing sessionid:0x13ba674aac3000a type:delete cxid:0x4 zxid:0x91 txntype:-1 reqpath:n/a Error Path:/solr/live_nodes/127.0.0.1:28200_yv%2Ffm Error:KeeperErrorCode = NoNode for /solr/live_nodes/127.0.0.1:28200_yv%2Ffm
[junit4:junit4]   2> 7193 T679 oascc.SolrZkClient.makePath makePath: /live_nodes/127.0.0.1:28200_yv%2Ffm
[junit4:junit4]   2> 7197 T701 oascc.ZkStateReader$2.process A cluster state change: WatchedEvent state:SyncConnected type:NodeChildrenChanged path:/live_nodes, has occurred - updating... (live nodes size: 3)
[junit4:junit4]   2> 7197 T720 oascc.ZkStateReader$3.process Updating live nodes... (4)
[junit4:junit4]   2> 7198 T707 oascc.ZkStateReader$3.process Updating live nodes... (4)
[junit4:junit4]   2> 7198 T720 oascc.ZkStateReader$2.process A cluster state change: WatchedEvent state:SyncConnected type:NodeChildrenChanged path:/live_nodes, has occurred - updating... (live nodes size: 4)
[junit4:junit4]   2> 7198 T735 oascc.ZkStateReader$3.process Updating live nodes... (4)
[junit4:junit4]   2> 7198 T707 oascc.ZkStateReader$2.process A cluster state change: WatchedEvent state:SyncConnected type:NodeChildrenChanged path:/live_nodes, has occurred - updating... (live nodes size: 4)
[junit4:junit4]   2> 7198 T735 oascc.ZkStateReader$2.process A cluster state change: WatchedEvent state:SyncConnected type:NodeChildrenChanged path:/live_nodes, has occurred - updating... (live nodes size: 4)
[junit4:junit4]   2> 7199 T679 oashc.HttpShardHandlerFactory.getParameter Setting socketTimeout to: 0
[junit4:junit4]   2> 7199 T679 oashc.HttpShardHandlerFactory.getParameter Setting urlScheme to: http://
[junit4:junit4]   2> 7200 T679 oashc.HttpShardHandlerFactory.getParameter Setting connTimeout to: 0
[junit4:junit4]   2> 7200 T701 oascc.ZkStateReader$3.process Updating live nodes... (4)
[junit4:junit4]   2> 7200 T679 oashc.HttpShardHandlerFactory.getParameter Setting maxConnectionsPerHost to: 20
[junit4:junit4]   2> 7201 T679 oashc.HttpShardHandlerFactory.getParameter Setting corePoolSize to: 0
[junit4:junit4]   2> 7201 T679 oashc.HttpShardHandlerFactory.getParameter Setting maximumPoolSize to: 2147483647
[junit4:junit4]   2> 7202 T679 oashc.HttpShardHandlerFactory.getParameter Setting maxThreadIdleTime to: 5
[junit4:junit4]   2> 7202 T679 oashc.HttpShardHandlerFactory.getParameter Setting sizeOfQueue to: -1
[junit4:junit4]   2> 7203 T679 oashc.HttpShardHandlerFactory.getParameter Setting fairnessPolicy to: false
[junit4:junit4]   2> 7203 T679 oascsi.HttpClientUtil.createClient Creating new http client, config:maxConnectionsPerHost=20&maxConnections=10000&socketTimeout=0&connTimeout=0&retry=false
[junit4:junit4]   2> 7223 T679 oascc.ZkStateReader.createClusterStateWatchersAndUpdate Updating cluster state from ZooKeeper... 
[junit4:junit4]   2> 7232 T751 oasc.CoreContainer.create Creating SolrCore 'collection1' using instanceDir: /usr/home/hudson/hudson-slave/workspace/Lucene-Solr-NightlyTests-trunk/solr/build/solr-core/test/J0/./org.apache.solr.cloud.BasicDistributedZk2Test-jetty3-1355707368635/collection1
[junit4:junit4]   2> 7232 T751 oasc.ZkController.createCollectionZkNode Check for collection zkNode:collection1
[junit4:junit4]   2> 7233 T751 oasc.ZkController.createCollectionZkNode Collection zkNode exists
[junit4:junit4]   2> 7233 T751 oasc.ZkController.readConfigName Load collection config from:/collections/collection1
[junit4:junit4]   2> 7235 T751 oasc.SolrResourceLoader.<init> new SolrResourceLoader for directory: '/usr/home/hudson/hudson-slave/workspace/Lucene-Solr-NightlyTests-trunk/solr/build/solr-core/test/J0/./org.apache.solr.cloud.BasicDistributedZk2Test-jetty3-1355707368635/collection1/'
[junit4:junit4]   2> 7236 T751 oasc.SolrResourceLoader.replaceClassLoader Adding 'file:/usr/home/hudson/hudson-slave/workspace/Lucene-Solr-NightlyTests-trunk/solr/build/solr-core/test/J0/org.apache.solr.cloud.BasicDistributedZk2Test-jetty3-1355707368635/collection1/lib/README' to classloader
[junit4:junit4]   2> 7237 T751 oasc.SolrResourceLoader.replaceClassLoader Adding 'file:/usr/home/hudson/hudson-slave/workspace/Lucene-Solr-NightlyTests-trunk/solr/build/solr-core/test/J0/org.apache.solr.cloud.BasicDistributedZk2Test-jetty3-1355707368635/collection1/lib/classes/' to classloader
[junit4:junit4]   2> 7289 T751 oasc.SolrConfig.<init> Using Lucene MatchVersion: LUCENE_50
[junit4:junit4]   2> 7361 T751 oasc.SolrConfig.<init> Loaded SolrConfig: solrconfig.xml
[junit4:junit4]   2> 7362 T751 oass.IndexSchema.readSchema Reading Solr Schema
[junit4:junit4]   2> 7370 T751 oass.IndexSchema.readSchema Schema name=test
[junit4:junit4]   2> 7384 T702 oascc.ZkStateReader.updateClusterState Updating cloud state from ZooKeeper... 
[junit4:junit4]   2> 7385 T702 oasc.Overseer$ClusterStateUpdater.updateState Update state numShards=2 message={
[junit4:junit4]   2> 	  "operation":"state",
[junit4:junit4]   2> 	  "numShards":"2",
[junit4:junit4]   2> 	  "shard":"shard2",
[junit4:junit4]   2> 	  "roles":null,
[junit4:junit4]   2> 	  "state":"active",
[junit4:junit4]   2> 	  "core":"collection1",
[junit4:junit4]   2> 	  "collection":"collection1",
[junit4:junit4]   2> 	  "node_name":"127.0.0.1:28197_yv%2Ffm",
[junit4:junit4]   2> 	  "base_url":"http://127.0.0.1:28197/yv/fm"}
[junit4:junit4]   2> 7402 T750 oascc.ZkStateReader$2.process A cluster state change: WatchedEvent state:SyncConnected type:NodeDataChanged path:/clusterstate.json, has occurred - updating... (live nodes size: 4)
[junit4:junit4]   2> 7403 T720 oascc.ZkStateReader$2.process A cluster state change: WatchedEvent state:SyncConnected type:NodeDataChanged path:/clusterstate.json, has occurred - updating... (live nodes size: 4)
[junit4:junit4]   2> 7403 T701 oascc.ZkStateReader$2.process A cluster state change: WatchedEvent state:SyncConnected type:NodeDataChanged path:/clusterstate.json, has occurred - updating... (live nodes size: 4)
[junit4:junit4]   2> 7403 T707 oascc.ZkStateReader$2.process A cluster state change: WatchedEvent state:SyncConnected type:NodeDataChanged path:/clusterstate.json, has occurred - updating... (live nodes size: 4)
[junit4:junit4]   2> 7403 T735 oascc.ZkStateReader$2.process A cluster state change: WatchedEvent state:SyncConnected type:NodeDataChanged path:/clusterstate.json, has occurred - updating... (live nodes size: 4)
[junit4:junit4]   2> 7981 T751 oass.OpenExchangeRatesOrgProvider.init Initialized with rates=open-exchange-rates.json, refreshInterval=1440.
[junit4:junit4]   2> 7992 T751 oass.IndexSchema.readSchema default search field in schema is text
[junit4:junit4]   2> 7996 T751 oass.IndexSchema.readSchema unique key field: id
[junit4:junit4]   2> 8017 T751 oass.FileExchangeRateProvider.reload Reloading exchange rates from file currency.xml
[junit4:junit4]   2> 8022 T751 oass.FileExchangeRateProvider.reload Reloading exchange rates from file currency.xml
[junit4:junit4]   2> 8027 T751 oass.OpenExchangeRatesOrgProvider.reload Reloading exchange rates from open-exchange-rates.json
[junit4:junit4]   2> 8029 T751 oass.OpenExchangeRatesOrgProvider.reload Reloading exchange rates from open-exchange-rates.json
[junit4:junit4]   2> 8030 T751 oasc.SolrCore.<init> [collection1] Opening new SolrCore at /usr/home/hudson/hudson-slave/workspace/Lucene-Solr-NightlyTests-trunk/solr/build/solr-core/test/J0/./org.apache.solr.cloud.BasicDistributedZk2Test-jetty3-1355707368635/collection1/, dataDir=./org.apache.solr.cloud.BasicDistributedZk2Test-1355707361738/jetty3/
[junit4:junit4]   2> 8031 T751 oasc.JmxMonitoredMap.<init> JMX monitoring is enabled. Adding Solr mbeans to JMX Server: com.sun.jmx.mbeanserver.JmxMBeanServer@235f4a7f
[junit4:junit4]   2> 8031 T751 oasc.SolrCore.initDirectoryFactory solr.NRTCachingDirectoryFactory
[junit4:junit4]   2> 8032 T751 oasc.CachingDirectoryFactory.get return new directory for /usr/home/hudson/hudson-slave/workspace/Lucene-Solr-NightlyTests-trunk/solr/build/solr-core/test/J0/./org.apache.solr.cloud.BasicDistributedZk2Test-1355707361738/jetty3 forceNew:false
[junit4:junit4]   2> 8033 T751 oasc.CachingDirectoryFactory.close Releasing directory:/usr/home/hudson/hudson-slave/workspace/Lucene-Solr-NightlyTests-trunk/solr/build/solr-core/test/J0/./org.apache.solr.cloud.BasicDistributedZk2Test-1355707361738/jetty3
[junit4:junit4]   2> 8033 T751 oasc.SolrCore.getNewIndexDir New index directory detected: old=null new=./org.apache.solr.cloud.BasicDistributedZk2Test-1355707361738/jetty3/index/
[junit4:junit4]   2> 8034 T751 oasc.SolrCore.initIndex WARNING [collection1] Solr index directory './org.apache.solr.cloud.BasicDistributedZk2Test-1355707361738/jetty3/index' doesn't exist. Creating new index...
[junit4:junit4]   2> 8035 T751 oasc.CachingDirectoryFactory.get return new directory for /usr/home/hudson/hudson-slave/workspace/Lucene-Solr-NightlyTests-trunk/solr/build/solr-core/test/J0/./org.apache.solr.cloud.BasicDistributedZk2Test-1355707361738/jetty3/index forceNew:false
[junit4:junit4]   2> 8066 T751 oasc.SolrDeletionPolicy.onCommit SolrDeletionPolicy.onCommit: commits:num=1
[junit4:junit4]   2> 		commit{dir=RateLimitedDirectoryWrapper(NRTCachingDirectory(org.apache.lucene.store.NIOFSDirectory@/usr/home/hudson/hudson-slave/workspace/Lucene-Solr-NightlyTests-trunk/solr/build/solr-core/test/J0/org.apache.solr.cloud.BasicDistributedZk2Test-1355707361738/jetty3/index lockFactory=org.apache.lucene.store.NativeFSLockFactory@d141149; maxCacheMB=48.0 maxMergeSizeMB=4.0)),segFN=segments_1,generation=1,filenames=[segments_1]
[junit4:junit4]   2> 8066 T751 oasc.SolrDeletionPolicy.updateCommits newest commit = 1[segments_1]
[junit4:junit4]   2> 8067 T751 oasc.CachingDirectoryFactory.close Releasing directory:/usr/home/hudson/hudson-slave/workspace/Lucene-Solr-NightlyTests-trunk/solr/build/solr-core/test/J0/./org.apache.solr.cloud.BasicDistributedZk2Test-1355707361738/jetty3/index
[junit4:junit4]   2> 8068 T751 oasc.SolrCore.initWriters created xml: solr.XMLResponseWriter
[junit4:junit4]   2> 8070 T751 oasup.UpdateRequestProcessorChain.init inserting DistributedUpdateProcessorFactory into updateRequestProcessorChain "dedupe"
[junit4:junit4]   2> 8070 T751 oasup.UpdateRequestProcessorChain.init inserting DistributedUpdateProcessorFactory into updateRequestProcessorChain "dedupe-allfields"
[junit4:junit4]   2> 8070 T751 oasup.UpdateRequestProcessorChain.init inserting DistributedUpdateProcessorFactory into updateRequestProcessorChain "stored_sig"
[junit4:junit4]   2> 8071 T751 oasup.UpdateRequestProcessorChain.init inserting DistributedUpdateProcessorFactory into updateRequestProcessorChain "uniq-fields"
[junit4:junit4]   2> 8071 T751 oasup.UpdateRequestProcessorChain.init inserting DistributedUpdateProcessorFactory into updateRequestProcessorChain "distrib-dup-test-chain-implicit"
[junit4:junit4]   2> 8072 T751 oasc.RequestHandlers.initHandlersFromConfig adding lazy requestHandler: solr.ReplicationHandler
[junit4:junit4]   2> 8072 T751 oasc.RequestHandlers.initHandlersFromConfig created /replication: solr.ReplicationHandler
[junit4:junit4]   2> 8073 T751 oasc.RequestHandlers.initHandlersFromConfig created standard: solr.StandardRequestHandler
[junit4:junit4]   2> 8074 T751 oasc.RequestHandlers.initHandlersFromConfig created /get: solr.RealTimeGetHandler
[junit4:junit4]   2> 8075 T751 oasc.RequestHandlers.initHandlersFromConfig created dismax: solr.SearchHandler
[junit4:junit4]   2> 8076 T751 oasc.RequestHandlers.initHandlersFromConfig created mock: org.apache.solr.core.MockQuerySenderListenerReqHandler
[junit4:junit4]   2> 8077 T751 oasc.RequestHandlers.initHandlersFromConfig created /admin/: org.apache.solr.handler.admin.AdminHandlers
[junit4:junit4]   2> 8078 T751 oasc.RequestHandlers.initHandlersFromConfig created defaults: solr.StandardRequestHandler
[junit4:junit4]   2> 8078 T751 oasc.RequestHandlers.initHandlersFromConfig adding lazy requestHandler: solr.StandardRequestHandler
[junit4:junit4]   2> 8078 T751 oasc.RequestHandlers.initHandlersFromConfig created lazy: solr.StandardRequestHandler
[junit4:junit4]   2> 8079 T751 oasc.RequestHandlers.initHandlersFromConfig created /update: solr.UpdateRequestHandler
[junit4:junit4]   2> 8080 T751 oasc.RequestHandlers.initHandlersFromConfig created /terms: org.apache.solr.handler.component.SearchHandler
[junit4:junit4]   2> 8081 T751 oasc.RequestHandlers.initHandlersFromConfig created spellCheckCompRH: org.apache.solr.handler.component.SearchHandler
[junit4:junit4]   2> 8082 T751 oasc.RequestHandlers.initHandlersFromConfig created spellCheckCompRH_Direct: org.apache.solr.handler.component.SearchHandler
[junit4:junit4]   2> 8083 T751 oasc.RequestHandlers.initHandlersFromConfig created spellCheckWithWordbreak: org.apache.solr.handler.component.SearchHandler
[junit4:junit4]   2> 8084 T751 oasc.RequestHandlers.initHandlersFromConfig created spellCheckWithWordbreak_Direct: org.apache.solr.handler.component.SearchHandler
[junit4:junit4]   2> 8085 T751 oasc.RequestHandlers.initHandlersFromConfig created spellCheckCompRH1: org.apache.solr.handler.component.SearchHandler
[junit4:junit4]   2> 8086 T751 oasc.RequestHandlers.initHandlersFromConfig created mltrh: org.apache.solr.handler.component.SearchHandler
[junit4:junit4]   2> 8087 T751 oasc.RequestHandlers.initHandlersFromConfig created tvrh: org.apache.solr.handler.component.SearchHandler
[junit4:junit4]   2> 8088 T751 oasc.RequestHandlers.initHandlersFromConfig created /mlt: solr.MoreLikeThisHandler
[junit4:junit4]   2> 8089 T751 oasc.RequestHandlers.initHandlersFromConfig created /debug/dump: solr.DumpRequestHandler
[junit4:junit4]   2> 8096 T751 oashl.XMLLoader.init xsltCacheLifetimeSeconds=60
[junit4:junit4]   2> 8101 T751 oasc.SolrCore.initDeprecatedSupport WARNING solrconfig.xml uses deprecated <admin/gettableFiles>, Please update your config to use the ShowFileRequestHandler.
[junit4:junit4]   2> 8103 T751 oasc.SolrCore.initDeprecatedSupport WARNING adding ShowFileRequestHandler with hidden files: [SCHEMA.XML, OLD_SYNONYMS.TXT, STOPWORDS.TXT, PROTWORDS.TXT, OPEN-EXCHANGE-RATES.JSON, SYNONYMS.TXT, CURRENCY.XML, MAPPING-ISOLATIN1ACCENT.TXT]
[junit4:junit4]   2> 8106 T751 oasc.CachingDirectoryFactory.close Releasing directory:/usr/home/hudson/hudson-slave/workspace/Lucene-Solr-NightlyTests-trunk/solr/build/solr-core/test/J0/./org.apache.solr.cloud.BasicDistributedZk2Test-1355707361738/jetty3
[junit4:junit4]   2> 8107 T751 oass.SolrIndexSearcher.<init> Opening Searcher@16de3935 main
[junit4:junit4]   2> 8108 T751 oasu.CommitTracker.<init> Hard AutoCommit: disabled
[junit4:junit4]   2> 8109 T751 oasu.CommitTracker.<init> Soft AutoCommit: disabled
[junit4:junit4]   2> 8109 T751 oashc.SpellCheckComponent.inform Initializing spell checkers
[junit4:junit4]   2> 8116 T751 oass.DirectSolrSpellChecker.init init: {name=direct,classname=DirectSolrSpellChecker,field=lowerfilt,minQueryLength=3}
[junit4:junit4]   2> 8168 T752 oasc.SolrCore.registerSearcher [collection1] Registered new searcher Searcher@16de3935 main{StandardDirectoryReader(segments_1:1)}
[junit4:junit4]   2> 8173 T751 oasc.ZkController.publish publishing core=collection1 state=down
[junit4:junit4]   2> 8174 T751 oasc.ZkController.publish numShards not found on descriptor - reading it from system property
[junit4:junit4]   2> 8414 T702 oascc.ZkStateReader.updateClusterState Updating cloud state from ZooKeeper... 
[junit4:junit4]   2> 8415 T702 oasc.Overseer$ClusterStateUpdater.updateState Update state numShards=2 message={
[junit4:junit4]   2> 	  "operation":"state",
[junit4:junit4]   2> 	  "numShards":"2",
[junit4:junit4]   2> 	  "shard":null,
[junit4:junit4]   2> 	  "roles":null,
[junit4:junit4]   2> 	  "state":"down",
[junit4:junit4]   2> 	  "core":"collection1",
[junit4:junit4]   2> 	  "collection":"collection1",
[junit4:junit4]   2> 	  "node_name":"127.0.0.1:28200_yv%2Ffm",
[junit4:junit4]   2> 	  "base_url":"http://127.0.0.1:28200/yv/fm"}
[junit4:junit4]   2> 8415 T702 oasc.Overseer$ClusterStateUpdater.updateState Collection already exists with numShards=2
[junit4:junit4]   2> 8415 T702 oasc.Overseer$ClusterStateUpdater.updateState Assigning new node to shard shard=shard1
[junit4:junit4]   2> 8428 T750 oascc.ZkStateReader$2.process A cluster state change: WatchedEvent state:SyncConnected type:NodeDataChanged path:/clusterstate.json, has occurred - updating... (live nodes size: 4)
[junit4:junit4]   2> 8429 T735 oascc.ZkStateReader$2.process A cluster state change: WatchedEvent state:SyncConnected type:NodeDataChanged path:/clusterstate.json, has occurred - updating... (live nodes size: 4)
[junit4:junit4]   2> 8428 T701 oascc.ZkStateReader$2.process A cluster state change: WatchedEvent state:SyncConnected type:NodeDataChanged path:/clusterstate.json, has occurred - updating... (live nodes size: 4)
[junit4:junit4]   2> 8429 T707 oascc.ZkStateReader$2.process A cluster state change: WatchedEvent state:SyncConnected type:NodeDataChanged path:/clusterstate.json, has occurred - updating... (live nodes size: 4)
[junit4:junit4]   2> 8428 T720 oascc.ZkStateReader$2.process A cluster state change: WatchedEvent state:SyncConnected type:NodeDataChanged path:/clusterstate.json, has occurred - updating... (live nodes size: 4)
[junit4:junit4]   2> 8677 T751 oasc.CoreContainer.registerCore registering core: collection1
[junit4:junit4]   2> 8677 T751 oasc.ZkController.register Register shard - core:collection1 address:http://127.0.0.1:28200/yv/fm shardId:shard1
[junit4:junit4]   2> 8682 T751 oasc.ZkController.register We are http://127.0.0.1:28200/yv/fm/collection1/ and leader is http://127.0.0.1:28194/yv/fm/collection1/
[junit4:junit4]   2> 8682 T751 oasc.ZkController.register No LogReplay needed for core=collection1 baseURL=http://127.0.0.1:28200/yv/fm
[junit4:junit4]   2> 8682 T751 oasc.ZkController.checkRecovery Core needs to recover:collection1
[junit4:junit4]   2> 8683 T751 oasu.DefaultSolrCoreState.doRecovery Running recovery - first canceling any ongoing recovery
[junit4:junit4]   2> ASYNC  NEW_CORE C35 name=collection1 org.apache.solr.core.SolrCore@3d795ad3 url=http://127.0.0.1:28200/yv/fm/collection1 node=127.0.0.1:28200_yv%2Ffm
[junit4:junit4]   2> 8689 T753 C35 P28200 oasc.RecoveryStrategy.run Starting recovery process.  core=collection1 recoveringAfterStartup=true
[junit4:junit4]   2> 8690 T751 oascc.ZkStateReader.updateClusterState Updating cloud state from ZooKeeper... 
[junit4:junit4]   2> 8690 T753 C35 P28200 oasc.RecoveryStrategy.doRecovery ###### startupVersions=[]
[junit4:junit4]   2> 8691 T753 C35 P28200 oasc.ZkController.publish publishing core=collection1 state=recovering
[junit4:junit4]   2> 8691 T753 C35 P28200 oasc.ZkController.publish numShards not found on descriptor - reading it from system property
[junit4:junit4]   2> 8692 T679 oass.SolrDispatchFilter.init user.dir=/usr/home/hudson/hudson-slave/workspace/Lucene-Solr-NightlyTests-trunk/solr/build/solr-core/test/J0
[junit4:junit4]   2> 8692 T679 oass.SolrDispatchFilter.init SolrDispatchFilter.init() done
[junit4:junit4]   2> 8693 T753 C35 P28200 oasc.RecoveryStrategy.doRecovery Attempting to PeerSync from http://127.0.0.1:28194/yv/fm/collection1/ core=collection1 - recoveringAfterStartup=true
[junit4:junit4]   2> 8693 T679 oascsi.HttpClientUtil.createClient Creating new http client, config:maxConnections=128&maxConnectionsPerHost=32&followRedirects=false
[junit4:junit4]   2> 8702 T753 C35 P28200 oascsi.HttpClientUtil.createClient Creating new http client, config:maxConnectionsPerHost=20&maxConnections=10000&connTimeout=30000&socketTimeout=30000&retry=false
[junit4:junit4]   2> 8724 T753 C35 P28200 oasu.PeerSync.sync PeerSync: core=collection1 url=http://127.0.0.1:28200/yv/fm START replicas=[http://127.0.0.1:28194/yv/fm/collection1/] nUpdates=100
[junit4:junit4]   2> 8725 T753 C35 P28200 oasu.PeerSync.sync WARNING no frame of reference to tell of we've missed updates
[junit4:junit4]   2> 8725 T753 C35 P28200 oasc.RecoveryStrategy.doRecovery PeerSync Recovery was not successful - trying replication. core=collection1
[junit4:junit4]   2> 8726 T753 C35 P28200 oasc.RecoveryStrategy.doRecovery Starting Replication Recovery. core=collection1
[junit4:junit4]   2> 8726 T753 C35 P28200 oascsi.HttpClientUtil.createClient Creating new http client, config:maxConnections=128&maxConnectionsPerHost=32&followRedirects=false
[junit4:junit4]   2> ASYNC  NEW_CORE C36 name=collection1 org.apache.solr.core.SolrCore@75da3d52 url=http://127.0.0.1:28194/yv/fm/collection1 node=127.0.0.1:28194_yv%2Ffm
[junit4:junit4]   2> 8736 T710 C36 P28194 REQ /get {distrib=false&qt=/get&wt=javabin&version=2&getVersions=100} status=0 QTime=0 
[junit4:junit4]   2> 8872 T679 oejs.Server.doStart jetty-8.1.8.v20121106
[junit4:junit4]   2> 8874 T679 oejs.AbstractConnector.doStart Started SocketConnector@127.0.0.1:28205
[junit4:junit4]   2> 8875 T679 oasc.SolrResourceLoader.locateSolrHome JNDI not configured for solr (NoInitialContextEx)
[junit4:junit4]   2> 8876 T679 oasc.SolrResourceLoader.locateSolrHome using system property solr.solr.home: /usr/home/hudson/hudson-slave/workspace/Lucene-Solr-NightlyTests-trunk/solr/build/solr-core/test/J0/./org.apache.solr.cloud.BasicDistributedZk2Test-jetty4-1355707370441
[junit4:junit4]   2> 8876 T679 oasc.SolrResourceLoader.<init> new SolrResourceLoader for deduced Solr Home: '/usr/home/hudson/hudson-slave/workspace/Lucene-Solr-NightlyTests-trunk/solr/build/solr-core/test/J0/./org.apache.solr.cloud.BasicDistributedZk2Test-jetty4-1355707370441/'
[junit4:junit4]   2> 8915 T679 oass.SolrDispatchFilter.init SolrDispatchFilter.init()
[junit4:junit4]   2> 8916 T679 oasc.SolrResourceLoader.locateSolrHome JNDI not configured for solr (NoInitialContextEx)
[junit4:junit4]   2> 8917 T679 oasc.SolrResourceLoader.locateSolrHome using system property solr.solr.home: /usr/home/hudson/hudson-slave/workspace/Lucene-Solr-NightlyTests-trunk/solr/build/solr-core/test/J0/./org.apache.solr.cloud.BasicDistributedZk2Test-jetty4-1355707370441
[junit4:junit4]   2> 8917 T679 oasc.CoreContainer$Initializer.initialize looking for solr.xml: /usr/home/hudson/hudson-slave/workspace/Lucene-Solr-NightlyTests-trunk/solr/build/solr-core/test/J0/./org.apache.solr.cloud.BasicDistributedZk2Test-jetty4-1355707370441/solr.xml
[junit4:junit4]   2> 8918 T679 oasc.CoreContainer.<init> New CoreContainer 188008818
[junit4:junit4]   2> 8918 T679 oasc.CoreContainer.load Loading CoreContainer using Solr Home: '/usr/home/hudson/hudson-slave/workspace/Lucene-Solr-NightlyTests-trunk/solr/build/solr-core/test/J0/./org.apache.solr.cloud.BasicDistributedZk2Test-jetty4-1355707370441/'
[junit4:junit4]   2> 8919 T679 oasc.SolrResourceLoader.<init> new SolrResourceLoader for directory: '/usr/home/hudson/hudson-slave/workspace/Lucene-Solr-NightlyTests-trunk/solr/build/solr-core/test/J0/./org.apache.solr.cloud.BasicDistributedZk2Test-jetty4-1355707370441/'
[junit4:junit4]   2> 8936 T702 oascc.ZkStateReader.updateClusterState Updating cloud state from ZooKeeper... 
[junit4:junit4]   2> 8937 T702 oasc.Overseer$ClusterStateUpdater.updateState Update state numShards=2 message={
[junit4:junit4]   2> 	  "operation":"state",
[junit4:junit4]   2> 	  "numShards":"2",
[junit4:junit4]   2> 	  "shard":"shard1",
[junit4:junit4]   2> 	  "roles":null,
[junit4:junit4]   2> 	  "state":"recovering",
[junit4:junit4]   2> 	  "core":"collection1",
[junit4:junit4]   2> 	  "collection":"collection1",
[junit4:junit4]   2> 	  "node_name":"127.0.0.1:28200_yv%2Ffm",
[junit4:junit4]   2> 	  "base_url":"http://127.0.0.1:28200/yv/fm"}
[junit4:junit4]   2> 8944 T750 oascc.ZkStateReader$2.process A cluster state change: WatchedEvent state:SyncConnected type:NodeDataChanged path:/clusterstate.json, has occurred - updating... (live nodes size: 4)
[junit4:junit4]   2> 8944 T701 oascc.ZkStateReader$2.process A cluster state change: WatchedEvent state:SyncConnected type:NodeDataChanged path:/clusterstate.json, has occurred - updating... (live nodes size: 4)
[junit4:junit4]   2> 8944 T707 oascc.ZkStateReader$2.process A cluster state change: WatchedEvent state:SyncConnected type:NodeDataChanged path:/clusterstate.json, has occurred - updating... (live nodes size: 4)
[junit4:junit4]   2> 8944 T735 oascc.ZkStateReader$2.process A cluster state change: WatchedEvent state:SyncConnected type:NodeDataChanged path:/clusterstate.json, has occurred - updating... (live nodes size: 4)
[junit4:junit4]   2> 8944 T720 oascc.ZkStateReader$2.process A cluster state change: WatchedEvent state:SyncConnected type:NodeDataChanged path:/clusterstate.json, has occurred - updating... (live nodes size: 4)
[junit4:junit4]   2> 8945 T679 oasc.CoreContainer.load Registering Log Listener
[junit4:junit4]   2> 8962 T679 oasc.CoreContainer.initZooKeeper Zookeeper client=127.0.0.1:28187/solr
[junit4:junit4]   2> 8963 T679 oasc.ZkController.checkChrootPath zkHost includes chroot
[junit4:junit4]   2> 8963 T679 oaz.ZooKeeper.<init> Initiating client connection, connectString=127.0.0.1:28187 sessionTimeout=60000 watcher=org.apache.solr.common.cloud.ConnectionManager@91ad2ea
[junit4:junit4]   2> 8964 T679 oascc.ConnectionManager.waitForConnected Waiting for client to connect to ZooKeeper
[junit4:junit4]   2> 8965 T764 oaz.ClientCnxn$SendThread.logStartConnect Opening socket connection to server localhost/127.0.0.1:28187. Will not attempt to authenticate using SASL (access denied (javax.security.auth.AuthPermission getLoginConfiguration))
[junit4:junit4]   2> 8966 T764 oaz.ClientCnxn$SendThread.primeConnection Socket connection established to localhost/127.0.0.1:28187, initiating session
[junit4:junit4]   2> 8966 T681 oazs.NIOServerCnxnFactory.run Accepted socket connection from /140.211.11.196:28206
[junit4:junit4]   2> 8966 T681 oazs.ZooKeeperServer.processConnectRequest Client attempting to establish new session at /140.211.11.196:28206
[junit4:junit4]   2> 8968 T683 oazs.ZooKeeperServer.finishSessionInit Established session 0x13ba674aac3000b with negotiated timeout 20000 for client /140.211.11.196:28206
[junit4:junit4]   2> 8968 T764 oaz.ClientCnxn$SendThread.onConnected Session establishment complete on server localhost/127.0.0.1:28187, sessionid = 0x13ba674aac3000b, negotiated timeout = 20000
[junit4:junit4]   2> 8968 T765 oascc.ConnectionManager.process Watcher org.apache.solr.common.cloud.ConnectionManager@91ad2ea name:ZooKeeperConnection Watcher:127.0.0.1:28187 got event WatchedEvent state:SyncConnected type:None path:null path:null type:None
[junit4:junit4]   2> 8968 T679 oascc.ConnectionManager.waitForConnected Client is connected to ZooKeeper
[junit4:junit4]   2> 8970 T684 oazs.PrepRequestProcessor.pRequest2Txn Processed session termination for sessionid: 0x13ba674aac3000b
[junit4:junit4]   2> 8971 T765 oaz.ClientCnxn$EventThread.run EventThread shut down
[junit4:junit4]   2> 8971 T681 oazs.NIOServerCnxn.closeSock Closed socket connection for client /140.211.11.196:28206 which had sessionid 0x13ba674aac3000b
[junit4:junit4]   2> 8971 T679 oaz.ZooKeeper.close Session: 0x13ba674aac3000b closed
[junit4:junit4]   2> 8972 T679 oaz.ZooKeeper.<init> Initiating client connection, connectString=127.0.0.1:28187/solr sessionTimeout=8000 watcher=org.apache.solr.common.cloud.ConnectionManager@51698ab9
[junit4:junit4]   2> 8973 T679 oascc.ConnectionManager.waitForConnected Waiting for client to connect to ZooKeeper
[junit4:junit4]   2> 8974 T766 oaz.ClientCnxn$SendThread.logStartConnect Opening socket connection to server localhost/127.0.0.1:28187. Will not attempt to authenticate using SASL (access denied (javax.security.auth.AuthPermission getLoginConfiguration))
[junit4:junit4]   2> 8974 T766 oaz.ClientCnxn$SendThread.primeConnection Socket connection established to localhost/127.0.0.1:28187, initiating session
[junit4:junit4]   2> 8975 T681 oazs.NIOServerCnxnFactory.run Accepted socket connection from /140.211.11.196:28207
[junit4:junit4]   2> 8975 T681 oazs.ZooKeeperServer.processConnectRequest Client attempting to establish new session at /140.211.11.196:28207
[junit4:junit4]   2> 8976 T683 oazs.ZooKeeperServer.finishSessionInit Established session 0x13ba674aac3000c with negotiated timeout 8000 for client /140.211.11.196:28207
[junit4:junit4]   2> 8976 T766 oaz.ClientCnxn$SendThread.onConnected Session establishment complete on server localhost/127.0.0.1:28187, sessionid = 0x13ba674aac3000c, negotiated timeout = 8000
[junit4:junit4]   2> 8977 T767 oascc.ConnectionManager.process Watcher org.apache.solr.common.cloud.ConnectionManager@51698ab9 name:ZooKeeperConnection Watcher:127.0.0.1:28187/solr got event WatchedEvent state:SyncConnected type:None path:null path:null type:None
[junit4:junit4]   2> 8977 T679 oascc.ConnectionManager.waitForConnected Client is connected to ZooKeeper
[junit4:junit4]   2> 8978 T684 oazs.PrepRequestProcessor.pRequest Got user-level KeeperException when processing sessionid:0x13ba674aac3000c type:create cxid:0x1 zxid:0xa6 txntype:-1 reqpath:n/a Error Path:/solr/overseer Error:KeeperErrorCode = NodeExists for /solr/overseer
[junit4:junit4]   2> 8980 T684 oazs.PrepRequestProcessor.pRequest Got user-level KeeperException when processing sessionid:0x13ba674aac3000c type:create cxid:0x2 zxid:0xa7 txntype:-1 reqpath:n/a Error Path:/solr/overseer Error:KeeperErrorCode = NodeExists for /solr/overseer
[junit4:junit4]   2> 8988 T679 oasc.ZkController.createEphemeralLiveNode Register node as live in ZooKeeper:/live_nodes/127.0.0.1:28205_yv%2Ffm
[junit4:junit4]   2> 8989 T684 oazs.PrepRequestProcessor.pRequest Got user-level KeeperException when processing sessionid:0x13ba674aac3000c type:delete cxid:0x4 zxid:0xa8 txntype:-1 reqpath:n/a Error Path:/solr/live_nodes/127.0.0.1:28205_yv%2Ffm Error:KeeperErrorCode = NoNode for /solr/live_nodes/127.0.0.1:28205_yv%2Ffm
[junit4:junit4]   2> 8990 T679 oascc.SolrZkClient.makePath makePath: /live_nodes/127.0.0.1:28205_yv%2Ffm
[junit4:junit4]   2> 8993 T750 oascc.ZkStateReader$2.process A cluster state change: WatchedEvent state:SyncConnected type:NodeChildrenChanged path:/live_nodes, has occurred - updating... (live nodes size: 4)
[junit4:junit4]   2> 8994 T701 oascc.ZkStateReader$2.process A cluster state change: WatchedEvent state:SyncConnected type:NodeChildrenChanged path:/live_nodes, has occurred - updating... (live nodes size: 4)
[junit4:junit4]   2> 8994 T707 oascc.ZkStateReader$3.process Updating live nodes... (5)
[junit4:junit4]   2> 8994 T735 oascc.ZkStateReader$3.process Updating live nodes... (5)
[junit4:junit4]   2> 8995 T720 oascc.ZkStateReader$3.process Updating live nodes... (5)
[junit4:junit4]   2> 8995 T735 oascc.ZkStateReader$2.process A cluster state change: WatchedEvent state:SyncConnected type:NodeChildrenChanged path:/live_nodes, has occurred - updating... (live nodes size: 5)
[junit4:junit4]   2> 8995 T720 oascc.ZkStateReader$2.process A cluster state change: WatchedEvent state:SyncConnected type:NodeChildrenChanged path:/live_nodes, has occurred - updating... (live nodes size: 5)
[junit4:junit4]   2> 8995 T707 oascc.ZkStateReader$2.process A cluster state change: WatchedEvent state:SyncConnected type:NodeChildrenChanged path:/live_nodes, has occurred - updating... (live nodes size: 5)
[junit4:junit4]   2> 8996 T679 oashc.HttpShardHandlerFactory.getParameter Setting socketTimeout to: 0
[junit4:junit4]   2> 8997 T679 oashc.HttpShardHandlerFactory.getParameter Setting urlScheme to: http://
[junit4:junit4]   2> 8997 T701 oascc.ZkStateReader$3.process Updating live nodes... (5)
[junit4:junit4]   2> 8997 T679 oashc.HttpShardHandlerFactory.getParameter Setting connTimeout to: 0
[junit4:junit4]   2> 8998 T679 oashc.HttpShardHandlerFactory.getParameter Setting maxConnectionsPerHost to: 20
[junit4:junit4]   2> 8999 T679 oashc.HttpShardHandlerFactory.getParameter Setting corePoolSize to: 0
[junit4:junit4]   2> 9000 T679 oashc.HttpShardHandlerFactory.getParameter Setting maximumPoolSize to: 2147483647
[junit4:junit4]   2> 9000 T679 oashc.HttpShardHandlerFactory.getParameter Setting maxThreadIdleTime to: 5
[junit4:junit4]   2> 9001 T679 oashc.HttpShardHandlerFactory.getParameter Setting sizeOfQueue to: -1
[junit4:junit4]   2> 9002 T679 oashc.HttpShardHandlerFactory.getParameter Setting fairnessPolicy to: false
[junit4:junit4]   2> 9003 T679 oascsi.HttpClientUtil.createClient Creating new http client, config:maxConnectionsPerHost=20&maxConnections=10000&socketTimeout=0&connTimeout=0&retry=false
[junit4:junit4]   2> 9011 T750 oascc.ZkStateReader$3.process Updating live nodes... (5)
[junit4:junit4]   2> 9026 T679 oascc.ZkStateReader.createClusterStateWatchersAndUpdate Updating cluster state from ZooKeeper... 
[junit4:junit4]   2> 9036 T768 oasc.CoreContainer.create Creating SolrCore 'collection1' using instanceDir: /usr/home/hudson/hudson-slave/workspace/Lucene-Solr-NightlyTests-trunk/solr/build/solr-core/test/J0/./org.apache.solr.cloud.BasicDistributedZk2Test-jetty4-1355707370441/collection1
[junit4:junit4]   2> 9036 T768 oasc.ZkController.createCollectionZkNode Check for collection zkNode:collection1
[junit4:junit4]   2> 9037 T768 oasc.ZkController.createCollectionZkNode Collection zkNode exists
[junit4:junit4]   2> 9038 T768 oasc.ZkController.readConfigName Load collection config from:/collections/collection1
[junit4:junit4]   2> 9039 T768 oasc.SolrResourceLoader.<init> new SolrResourceLoader for directory: '/usr/home/hudson/hudson-slave/workspace/Lucene-Solr-NightlyTests-trunk/solr/build/solr-core/test/J0/./org.apache.solr.cloud.BasicDistributedZk2Test-jetty4-1355707370441/collection1/'
[junit4:junit4]   2> 9040 T768 oasc.SolrResourceLoader.replaceClassLoader Adding 'file:/usr/home/hudson/hudson-slave/workspace/Lucene-Solr-NightlyTests-trunk/solr/build/solr-core/test/J0/org.apache.solr.cloud.BasicDistributedZk2Test-jetty4-1355707370441/collection1/lib/classes/' to classloader
[junit4:junit4]   2> 9041 T768 oasc.SolrResourceLoader.replaceClassLoader Adding 'file:/usr/home/hudson/hudson-slave/workspace/Lucene-Solr-NightlyTests-trunk/solr/build/solr-core/test/J0/org.apache.solr.cloud.BasicDistributedZk2Test-jetty4-1355707370441/collection1/lib/README' to classloader
[junit4:junit4]   2> 9095 T768 oasc.SolrConfig.<init> Using Lucene MatchVersion: LUCENE_50
[junit4:junit4]   2> 9170 T768 oasc.SolrConfig.<init> Loaded SolrConfig: solrconfig.xml
[junit4:junit4]   2> 9171 T768 oass.IndexSchema.readSchema Reading Solr Schema
[junit4:junit4]   2> 9179 T768 oass.IndexSchema.readSchema Schema name=test
[junit4:junit4]   2> 9744 T768 oass.OpenExchangeRatesOrgProvider.init Initialized with rates=open-exchange-rates.json, refreshInterval=1440.
[junit4:junit4]   2> 9752 T768 oass.IndexSchema.readSchema default search field in schema is text
[junit4:junit4]   2> 9755 T768 oass.IndexSchema.readSchema unique key field: id
[junit4:junit4]   2> 9772 T768 oass.FileExchangeRateProvider.reload Reloading exchange rates from file currency.xml
[junit4:junit4]   2> 9776 T768 oass.FileExchangeRateProvider.reload Reloading exchange rates from file currency.xml
[junit4:junit4]   2> 9780 T768 oass.OpenExchangeRatesOrgProvider.reload Reloading exchange rates from open-exchange-rates.json
[junit4:junit4]   2> 9781 T768 oass.OpenExchangeRatesOrgProvider.reload Reloading exchange rates from open-exchange-rates.json
[junit4:junit4]   2> 9782 T768 oasc.SolrCore.<init> [collection1] Opening new SolrCore at /usr/home/hudson/hudson-slave/workspace/Lucene-Solr-NightlyTests-trunk/solr/build/solr-core/test/J0/./org.apache.solr.cloud.BasicDistributedZk2Test-jetty4-1355707370441/collection1/, dataDir=./org.apache.solr.cloud.BasicDistributedZk2Test-1355707361738/jetty4/
[junit4:junit4]   2> 9783 T768 oasc.JmxMonitoredMap.<init> JMX monitoring is enabled. Adding Solr mbeans to JMX Server: com.sun.jmx.mbeanserver.JmxMBeanServer@235f4a7f
[junit4:junit4]   2> 9783 T768 oasc.SolrCore.initDirectoryFactory solr.NRTCachingDirectoryFactory
[junit4:junit4]   2> 9784 T768 oasc.CachingDirectoryFactory.get return new directory for /usr/home/hudson/hudson-slave/workspace/Lucene-Solr-NightlyTests-trunk/solr/build/solr-core/test/J0/./org.apache.solr.cloud.BasicDistributedZk2Test-1355707361738/jetty4 forceNew:false
[junit4:junit4]   2> 9784 T768 oasc.CachingDirectoryFactory.close Releasing directory:/usr/home/hudson/hudson-slave/workspace/Lucene-Solr-NightlyTests-trunk/solr/build/solr-core/test/J0/./org.apache.solr.cloud.BasicDistributedZk2Test-1355707361738/jetty4
[junit4:junit4]   2> 9784 T768 oasc.SolrCore.getNewIndexDir New index directory detected: old=null new=./org.apache.solr.cloud.BasicDistributedZk2Test-1355707361738/jetty4/index/
[junit4:junit4]   2> 9785 T768 oasc.SolrCore.initIndex WARNING [collection1] Solr index directory './org.apache.solr.cloud.BasicDistributedZk2Test-1355707361738/jetty4/index' doesn't exist. Creating new index...
[junit4:junit4]   2> 9785 T768 oasc.CachingDirectoryFactory.get return new directory for /usr/home/hudson/hudson-slave/workspace/Lucene-Solr-NightlyTests-trunk/solr/build/solr-core/test/J0/./org.apache.solr.cloud.BasicDistributedZk2Test-1355707361738/jetty4/index forceNew:false
[junit4:junit4]   2> 9820 T768 oasc.SolrDeletionPolicy.onCommit SolrDeletionPolicy.onCommit: commits:num=1
[junit4:junit4]   2> 		commit{dir=RateLimitedDirectoryWrapper(NRTCachingDirectory(org.apache.lucene.store.NIOFSDirectory@/usr/home/hudson/hudson-slave/workspace/Lucene-Solr-NightlyTests-trunk/solr/build/solr-core/test/J0/org.apache.solr.cloud.BasicDistributedZk2Test-1355707361738/jetty4/index lockFactory=org.apache.lucene.store.NativeFSLockFactory@61780f83; maxCacheMB=48.0 maxMergeSizeMB=4.0)),segFN=segments_1,generation=1,filenames=[segments_1]
[junit4:junit4]   2> 9820 T768 oasc.SolrDeletionPolicy.updateCommits newest commit = 1[segments_1]
[junit4:junit4]   2> 9821 T768 oasc.CachingDirectoryFactory.close Releasing directory:/usr/home/hudson/hudson-slave/workspace/Lucene-Solr-NightlyTests-trunk/solr/build/solr-core/test/J0/./org.apache.solr.cloud.BasicDistributedZk2Test-1355707361738/jetty4/index
[junit4:junit4]   2> 9821 T768 oasc.SolrCore.initWriters created xml: solr.XMLResponseWriter
[junit4:junit4]   2> 9823 T768 oasup.UpdateRequestProcessorChain.init inserting DistributedUpdateProcessorFactory into updateRequestProcessorChain "dedupe"
[junit4:junit4]   2> 9823 T768 oasup.UpdateRequestProcessorChain.init inserting DistributedUpdateProcessorFactory into updateRequestProcessorChain "dedupe-allfields"
[junit4:junit4]   2> 9823 T768 oasup.UpdateRequestProcessorChain.init inserting DistributedUpdateProcessorFactory into updateRequestProcessorChain "stored_sig"
[junit4:junit4]   2> 9824 T768 oasup.UpdateRequestProcessorChain.init inserting DistributedUpdateProcessorFactory into updateRequestProcessorChain "uniq-fields"
[junit4:junit4]   2> 9824 T768 oasup.UpdateRequestProcessorChain.init inserting DistributedUpdateProcessorFactory into updateRequestProcessorChain "distrib-dup-test-chain-implicit"
[junit4:junit4]   2> 9824 T768 oasc.RequestHandlers.initHandlersFromConfig adding lazy requestHandler: solr.ReplicationHandler
[junit4:junit4]   2> 9824 T768 oasc.RequestHandlers.initHandlersFromConfig created /replication: solr.ReplicationHandler
[junit4:junit4]   2> 9825 T768 oasc.RequestHandlers.initHandlersFromConfig created standard: solr.StandardRequestHandler
[junit4:junit4]   2> 9826 T768 oasc.RequestHandlers.initHandlersFromConfig created /get: solr.RealTimeGetHandler
[junit4:junit4]   2> 9827 T768 oasc.RequestHandlers.initHandlersFromConfig created dismax: solr.SearchHandler
[junit4:junit4]   2> 9828 T768 oasc.RequestHandlers.initHandlersFromConfig created mock: org.apache.solr.core.MockQuerySenderListenerReqHandler
[junit4:junit4]   2> 9828 T768 oasc.RequestHandlers.initHandlersFromConfig created /admin/: org.apache.solr.handler.admin.AdminHandlers
[junit4:junit4]   2> 9829 T768 oasc.RequestHandlers.initHandlersFromConfig created defaults: solr.StandardRequestHandler
[junit4:junit4]   2> 9829 T768 oasc.RequestHandlers.initHandlersFromConfig adding lazy requestHandler: solr.StandardRequestHandler
[junit4:junit4]   2> 9829 T768 oasc.RequestHandlers.initHandlersFromConfig created lazy: solr.StandardRequestHandler
[junit4:junit4]   2> 9830 T768 oasc.RequestHandlers.initHandlersFromConfig created /update: solr.UpdateRequestHandler
[junit4:junit4]   2> 9831 T768 oasc.RequestHandlers.initHandlersFromConfig created /terms: org.apache.solr.handler.component.SearchHandler
[junit4:junit4]   2> 9831 T768 oasc.RequestHandlers.initHandlersFromConfig created spellCheckCompRH: org.apache.solr.handler.component.SearchHandler
[junit4:junit4]   2> 9832 T768 oasc.RequestHandlers.initHandlersFromConfig created spellCheckCompRH_Direct: org.apache.solr.handler.component.SearchHandler
[junit4:junit4]   2> 9833 T768 oasc.RequestHandlers.initHandlersFromConfig created spellCheckWithWordbreak: org.apache.solr.handler.component.SearchHandler
[junit4:junit4]   2> 9834 T768 oasc.RequestHandlers.initHandlersFromConfig created spellCheckWithWordbreak_Direct: org.apache.solr.handler.component.SearchHandler
[junit4:junit4]   2> 9834 T768 oasc.RequestHandlers.initHandlersFromConfig created spellCheckCompRH1: org.apache.solr.handler.component.SearchHandler
[junit4:junit4]   2> 9835 T768 oasc.RequestHandlers.initHandlersFromConfig created mltrh: org.apache.solr.handler.component.SearchHandler
[junit4:junit4]   2> 9836 T768 oasc.RequestHandlers.initHandlersFromConfig created tvrh: org.apache.solr.handler.component.SearchHandler
[junit4:junit4]   2> 9837 T768 oasc.RequestHandlers.initHandlersFromConfig created /mlt: solr.MoreLikeThisHandler
[junit4:junit4]   2> 9838 T768 oasc.RequestHandlers.initHandlersFromConfig created /debug/dump: solr.DumpRequestHandler
[junit4:junit4]   2> 9843 T768 oashl.XMLLoader.init xsltCacheLifetimeSeconds=60
[junit4:junit4]   2> 9846 T768 oasc.SolrCore.initDeprecatedSupport WARNING solrconfig.xml uses deprecated <admin/gettableFiles>, Please update your config to use the ShowFileRequestHandler.
[junit4:junit4]   2> 9848 T768 oasc.SolrCore.initDeprecatedSupport WARNING adding ShowFileRequestHandler with hidden files: [SCHEMA.XML, OLD_SYNONYMS.TXT, STOPWORDS.TXT, PROTWORDS.TXT, OPEN-EXCHANGE-RATES.JSON, SYNONYMS.TXT, CURRENCY.XML, MAPPING-ISOLATIN1ACCENT.TXT]
[junit4:junit4]   2> 9850 T768 oasc.CachingDirectoryFactory.close Releasing directory:/usr/home/hudson/hudson-slave/workspace/Lucene-Solr-NightlyTests-trunk/solr/build/solr-core/test/J0/./org.apache.solr.cloud.BasicDistributedZk2Test-1355707361738/jetty4
[junit4:junit4]   2> 9851 T768 oass.SolrIndexSearcher.<init> Opening Searcher@5433868e main
[junit4:junit4]   2> 9852 T768 oasu.CommitTracker.<init> Hard AutoCommit: disabled
[junit4:junit4]   2> 9852 T768 oasu.CommitTracker.<init> Soft AutoCommit: disabled
[junit4:junit4]   2> 9852 T768 oashc.SpellCheckComponent.inform Initializing spell checkers
[junit4:junit4]   2> 9858 T768 oass.DirectSolrSpellChecker.init init: {name=direct,classname=DirectSolrSpellChecker,field=lowerfilt,minQueryLength=3}
[junit4:junit4]   2> 9906 T769 oasc.SolrCore.registerSearcher [collection1] Registered new searcher Searcher@5433868e main{StandardDirectoryReader(segments_1:1)}
[junit4:junit4]   2> 9909 T768 oasc.ZkController.publish publishing core=collection1 state=down
[junit4:junit4]   2> 9909 T768 oasc.ZkController.publish numShards not found on descriptor - reading it from system property
[junit4:junit4]   2> 9954 T702 oascc.ZkStateReader.updateClusterState Updating cloud state from ZooKeeper... 
[junit4:junit4]   2> 9954 T702 oasc.Overseer$ClusterStateUpdater.updateState Update state numShards=2 message={
[junit4:junit4]   2> 	  "operation":"state",
[junit4:junit4]   2> 	  "numShards":"2",
[junit4:junit4]   2> 	  "shard":null,
[junit4:junit4]   2> 	  "roles":null,
[junit4:junit4]   2> 	  "state":"down",
[junit4:junit4]   2> 	  "core":"collection1",
[junit4:junit4]   2> 	  "collection":"collection1",
[junit4:junit4]   2> 	  "node_name":"127.0.0.1:28205_yv%2Ffm",
[junit4:junit4]   2> 	  "base_url":"http://127.0.0.1:28205/yv/fm"}
[junit4:junit4]   2> 9955 T702 oasc.Overseer$ClusterStateUpdater.updateState Collection already exists with numShards=2
[junit4:junit4]   2> 9955 T702 oasc.Overseer$ClusterStateUpdater.updateState Assigning new node to shard shard=shard2
[junit4:junit4]   2> 9968 T701 oascc.ZkStateReader$2.process A cluster state change: WatchedEvent state:SyncConnected type:NodeDataChanged path:/clusterstate.json, has occurred - updating... (live nodes size: 5)
[junit4:junit4]   2> 9968 T767 oascc.ZkStateReader$2.process A cluster state change: WatchedEvent state:SyncConnected type:NodeDataChanged path:/clusterstate.json, has occurred - updating... (live nodes size: 5)
[junit4:junit4]   2> 9968 T735 oascc.ZkStateReader$2.process A cluster state change: WatchedEvent state:SyncConnected type:NodeDataChanged path:/clusterstate.json, has occurred - updating... (live nodes size: 5)
[junit4:junit4]   2> 9968 T720 oascc.ZkStateReader$2.process A cluster state change: WatchedEvent state:SyncConnected type:NodeDataChanged path:/clusterstate.json, has occurred - updating... (live nodes size: 5)
[junit4:junit4]   2> 9968 T707 oascc.ZkStateReader$2.process A cluster state change: WatchedEvent state:SyncConnected type:NodeDataChanged path:/clusterstate.json, has occurred - updating... (live nodes size: 5)
[junit4:junit4]   2> 9968 T750 oascc.ZkStateReader$2.process A cluster state change: WatchedEvent state:SyncConnected type:NodeDataChanged path:/clusterstate.json, has occurred - updating... (live nodes size: 5)
[junit4:junit4]   2> 10413 T768 oasc.CoreContainer.registerCore registering core: collection1
[junit4:junit4]   2> 10413 T768 oasc.ZkController.register Register shard - core:collection1 address:http://127.0.0.1:28205/yv/fm shardId:shard2
[junit4:junit4]   2> 10424 T768 oasc.ZkController.register We are http://127.0.0.1:28205/yv/fm/collection1/ and leader is http://127.0.0.1:28197/yv/fm/collection1/
[junit4:junit4]   2> 10424 T768 oasc.ZkController.register No LogReplay needed for core=collection1 baseURL=http://127.0.0.1:28205/yv/fm
[junit4:junit4]   2> 10424 T768 oasc.ZkController.checkRecovery Core needs to recover:collection1
[junit4:junit4]   2> 10424 T768 oasu.DefaultSolrCoreState.doRecovery Running recovery - first canceling any ongoing recovery
[junit4:junit4]   2> ASYNC  NEW_CORE C37 name=collection1 org.apache.solr.core.SolrCore@54e361de url=http://127.0.0.1:28205/yv/fm/collection1 node=127.0.0.1:28205_yv%2Ffm
[junit4:junit4]   2> 10425 T770 C37 P28205 oasc.RecoveryStrategy.run Starting recovery process.  core=collection1 recoveringAfterStartup=true
[junit4:junit4]   2> 10425 T770 C37 P28205 oasc.RecoveryStrategy.doRecovery ###### startupVersions=[]
[junit4:junit4]   2> 10426 T770 C37 P28205 oasc.ZkController.publish publishing core=collection1 state=recovering
[junit4:junit4]   2> 10426 T768 oascc.ZkStateReader.updateClusterState Updating cloud state from ZooKeeper... 
[junit4:junit4]   2> 10426 T770 C37 P28205 oasc.ZkController.publish numShards not found on descriptor - reading it from system property
[junit4:junit4]   2> 10427 T770 C37 P28205 oasc.RecoveryStrategy.doRecovery Attempting to PeerSync from http://127.0.0.1:28197/yv/fm/collection1/ core=collection1 - recoveringAfterStartup=true
[junit4:junit4]   2> 10427 T679 oass.SolrDispatchFilter.init user.dir=/usr/home/hudson/hudson-slave/workspace/Lucene-Solr-NightlyTests-trunk/solr/build/solr-core/test/J0
[junit4:junit4]   2> 10428 T770 C37 P28205 oasu.PeerSync.sync PeerSync: core=collection1 url=http://127.0.0.1:28205/yv/fm START replicas=[http://127.0.0.1:28197/yv/fm/collection1/] nUpdates=100
[junit4:junit4]   2> 10428 T679 oass.SolrDispatchFilter.init SolrDispatchFilter.init() done
[junit4:junit4]   2> 10428 T770 C37 P28205 oasu.PeerSync.sync WARNING no frame of reference to tell of we've missed updates
[junit4:junit4]   2> 10428 T679 oascsi.HttpClientUtil.createClient Creating new http client, config:maxConnections=128&maxConnectionsPerHost=32&followRedirects=false
[junit4:junit4]   2> 10429 T770 C37 P28205 oasc.RecoveryStrategy.doRecovery PeerSync Recovery was not successful - trying replication. core=collection1
[junit4:junit4]   2> 10429 T770 C37 P28205 oasc.RecoveryStrategy.doRecovery Starting Replication Recovery. core=collection1
[junit4:junit4]   2> 10429 T770 C37 P28205 oascsi.HttpClientUtil.createClient Creating new http client, config:maxConnections=128&maxConnectionsPerHost=32&followRedirects=false
[junit4:junit4]   2> ASYNC  NEW_CORE C38 name=collection1 org.apache.solr.core.SolrCore@66606364 url=http://127.0.0.1:28197/yv/fm/collection1 node=127.0.0.1:28197_yv%2Ffm
[junit4:junit4]   2> 10438 T725 C38 P28197 REQ /get {distrib=false&qt=/get&wt=javabin&version=2&getVersions=100} status=0 QTime=1 
[junit4:junit4]   2> 10442 T679 oascc.ZkStateReader.updateClusterState Updating cloud state from ZooKeeper... 
[junit4:junit4]   2> ASYNC  NEW_CORE C39 name=collection1 org.apache.solr.core.SolrCore@173941dd url=http://127.0.0.1:28190/yv/fm/collection1 node=127.0.0.1:28190_yv%2Ffm
[junit4:junit4]   2> 10450 T691 C39 P28190 oasc.CachingDirectoryFactory.close Releasing directory:/usr/home/hudson/hudson-slave/workspace/Lucene-Solr-NightlyTests-trunk/solr/build/solr-core/test/J0/./org.apache.solr.cloud.BasicDistributedZk2Test-1355707361738/control/data
[junit4:junit4]   2> 10453 T691 C39 P28190 oasc.SolrDeletionPolicy.onInit SolrDeletionPolicy.onInit: commits:num=1
[junit4:junit4]   2> 		commit{dir=RateLimitedDirectoryWrapper(NRTCachingDirectory(org.apache.lucene.store.NIOFSDirectory@/usr/home/hudson/hudson-slave/workspace/Lucene-Solr-NightlyTests-trunk/solr/build/solr-core/test/J0/org.apache.solr.cloud.BasicDistributedZk2Test-1355707361738/control/data/index lockFactory=org.apache.lucene.store.NativeFSLockFactory@276ce961; maxCacheMB=48.0 maxMergeSizeMB=4.0)),segFN=segments_1,generation=1,filenames=[segments_1]
[junit4:junit4]   2> 10453 T691 C39 P28190 oasc.SolrDeletionPolicy.updateCommits newest commit = 1[segments_1]
[junit4:junit4]   2> 10457 T691 C39 P28190 /update {wt=javabin&version=2} {add=[1 (1421562213491015680)]} 0 8
[junit4:junit4]   2> 10460 T712 C36 P28194 oasc.CachingDirectoryFactory.close Releasing directory:/usr/home/hudson/hudson-slave/workspace/Lucene-Solr-NightlyTests-trunk/solr/build/solr-core/test/J0/./org.apache.solr.cloud.BasicDistributedZk2Test-1355707361738/jetty1
[junit4:junit4]   2> 10465 T712 C36 P28194 oasc.SolrDeletionPolicy.onInit SolrDeletionPolicy.onInit: commits:num=1
[junit4:junit4]   2> 		commit{dir=RateLimitedDirectoryWrapper(NRTCachingDirectory(org.apache.lucene.store.NIOFSDirectory@/usr/home/hudson/hudson-slave/workspace/Lucene-Solr-NightlyTests-trunk/solr/build/solr-core/test/J0/org.apache.solr.cloud.BasicDistributedZk2Test-1355707361738/jetty1/index lockFactory=org.apache.lucene.store.NativeFSLockFactory@510c3c34; maxCacheMB=48.0 maxMergeSizeMB=4.0)),segFN=segments_1,generation=1,filenames=[segments_1]
[junit4:junit4]   2> 10465 T712 C36 P28194 oasc.SolrDeletionPolicy.updateCommits newest commit = 1[segments_1]
[junit4:junit4]   2> 10475 T702 oascc.ZkStateReader.updateClusterState Updating cloud state from ZooKeeper... 
[junit4:junit4]   2> 10476 T702 oasc.Overseer$ClusterStateUpdater.updateState Update state numShards=2 message={
[junit4:junit4]   2> 	  "operation":"state",
[junit4:junit4]   2> 	  "numShards":"2",
[junit4:junit4]   2> 	  "shard":"shard2",
[junit4:junit4]   2> 	  "roles":null,
[junit4:junit4]   2> 	  "state":"recovering",
[junit4:junit4]   2> 	  "core":"collection1",
[junit4:junit4]   2> 	  "collection":"collection1",
[junit4:junit4]   2> 	  "node_name":"127.0.0.1:28205_yv%2Ffm",
[junit4:junit4]   2> 	  "base_url":"http://127.0.0.1:28205/yv/fm"}
[junit4:junit4]   2>  C35_STATE=coll:collection1 core:collection1 props:{shard=shard1, roles=null, state=recovering, core=collection1, collection=collection1, node_name=127.0.0.1:28200_yv%2Ffm, base_url=http://127.0.0.1:28200/yv/fm}
[junit4:junit4]   2> 10477 T740 C35 P28200 oasc.CachingDirectoryFactory.close Releasing directory:/usr/home/hudson/hudson-slave/workspace/Lucene-Solr-NightlyTests-trunk/solr/build/solr-core/test/J0/./org.apache.solr.cloud.BasicDistributedZk2Test-1355707361738/jetty3
[junit4:junit4]   2> 10480 T740 C35 P28200 oasc.SolrDeletionPolicy.onInit SolrDeletionPolicy.onInit: commits:num=1
[junit4:junit4]   2> 		commit{dir=RateLimitedDirectoryWrapper(NRTCachingDirectory(org.apache.lucene.store.NIOFSDirectory@/usr/home/hudson/hudson-slave/workspace/Lucene-Solr-NightlyTests-trunk/solr/build/solr-core/test/J0/org.apache.solr.cloud.BasicDistributedZk2Test-1355707361738/jetty3/index lockFactory=org.apache.lucene.store.NativeFSLockFactory@d141149; maxCacheMB=48.0 maxMergeSizeMB=4.0)),segFN=segments_1,generation=1,filenames=[segments_1]
[junit4:junit4]   2> 10481 T740 C35 P28200 oasc.SolrDeletionPolicy.updateCommits newest commit = 1[segments_1]
[junit4:junit4]   2> 10484 T740 C35 P28200 REQ /update {distrib.from=http://127.0.0.1:28194/yv/fm/collection1/&update.distrib=FROMLEADER&wt=javabin&version=2} status=0 QTime=8 
[junit4:junit4]   2> 10484 T712 C36 P28194 /update {wt=javabin&version=2} {add=[1 (1421562213502550016)]} 0 25
[junit4:junit4]   2> 10487 T691 C39 P28190 oasu.DirectUpdateHandler2.commit start commit{flags=0,_version_=0,optimize=false,openSearcher=true,waitSearcher=true,expungeDeletes=false,softCommit=false}
[junit4:junit4]   2> 10488 T750 oascc.ZkStateReader$2.process A cluster state change: WatchedEvent state:SyncConnected type:NodeDataChanged path:/clusterstate.json, has occurred - updating... (live nodes size: 5)
[junit4:junit4]   2> 10488 T701 oascc.ZkStateReader$2.process A cluster state change: WatchedEvent state:SyncConnected type:NodeDataChanged path:/clusterstate.json, has occurred - updating... (live nodes size: 5)
[junit4:junit4]   2> 10489 T707 oascc.ZkStateReader$2.process A cluster state change: WatchedEvent state:SyncConnected type:NodeDataChanged path:/clusterstate.json, has occurred - updating... (live nodes size: 5)
[junit4:junit4]   2> 10489 T735 oascc.ZkStateReader$2.process A cluster state change: WatchedEvent state:SyncConnected type:NodeDataChanged path:/clusterstate.json, has occurred - updating... (live nodes size: 5)
[junit4:junit4]   2> 10488 T720 oascc.ZkStateReader$2.process A cluster state change: WatchedEvent state:SyncConnected type:NodeDataChanged path:/clusterstate.json, has occurred - updating... (live nodes size: 5)
[junit4:junit4]   2> 10488 T767 oascc.ZkStateReader$2.process A cluster state change: WatchedEvent state:SyncConnected type:NodeDataChanged path:/clusterstate.json, has occurred - updating... (live nodes size: 5)
[junit4:junit4]   2> 10510 T691 C39 P28190 oasc.SolrDeletionPolicy.onCommit SolrDeletionPolicy.onCommit: commits:num=2
[junit4:junit4]   2> 		commit{dir=RateLimitedDirectoryWrapper(NRTCachingDirectory(org.apache.lucene.store.NIOFSDirectory@/usr/home/hudson/hudson-slave/workspace/Lucene-Solr-NightlyTests-trunk/solr/build/solr-core/test/J0/org.apache.solr.cloud.BasicDistributedZk2Test-1355707361738/control/data/index lockFactory=org.apache.lucene.store.NativeFSLockFactory@276ce961; maxCacheMB=48.0 maxMergeSizeMB=4.0)),segFN=segments_1,generation=1,filenames=[segments_1]
[junit4:junit4]   2> 		commit{dir=RateLimitedDirectoryWrapper(NRTCachingDirectory(org.apache.lucene.store.NIOFSDirectory@/usr/home/hudson/hudson-slave/workspace/Lucene-Solr-NightlyTests-trunk/solr/build/solr-core/test/J0/org.apache.solr.cloud.BasicDistributedZk2Test-1355707361738/control/data/index lockFactory=org.apache.lucene.store.NativeFSLockFactory@276ce961; maxCacheMB=48.0 maxMergeSizeMB=4.0)),segFN=segments_2,generation=2,filenames=[_0_Lucene40_0.tim, _0.fnm, _0_Lucene40_0.frq, _0_nrm.cfe, segments_2, _0.fdx, _0_nrm.cfs, _0.si, _0_Lucene40_0.prx, _0.fdt, _0_Lucene40_0.tip]
[junit4:junit4]   2> 10510 T691 C39 P28190 oasc.SolrDeletionPolicy.updateCommits newest commit = 2[_0_Lucene40_0.tim, _0.fnm, _0_Lucene40_0.frq, _0_nrm.cfe, segments

[...truncated too long message...]

ore.FSDirectory.listAll(FSDirectory.java:241)
[junit4:junit4]   2> 		at org.apache.lucene.store.RateLimitedDirectoryWrapper.listAll(RateLimitedDirectoryWrapper.java:46)
[junit4:junit4]   2> 		at org.apache.solr.core.DirectoryFactory.empty(DirectoryFactory.java:198)
[junit4:junit4]   2> 		at org.apache.solr.handler.SnapPuller$2.preClose(SnapPuller.java:433)
[junit4:junit4]   2> 		at org.apache.solr.core.CachingDirectoryFactory.close(CachingDirectoryFactory.java:170)
[junit4:junit4]   2> 		at org.apache.solr.core.CachingDirectoryFactory.release(CachingDirectoryFactory.java:335)
[junit4:junit4]   2> 		at org.apache.solr.search.SolrIndexSearcher.close(SolrIndexSearcher.java:287)
[junit4:junit4]   2> 		at org.apache.solr.core.SolrCore$8.close(SolrCore.java:1714)
[junit4:junit4]   2> 		at org.apache.solr.util.RefCounted.decref(RefCounted.java:57)
[junit4:junit4]   2> 		at org.apache.solr.core.SolrCore.closeSearcher(SolrCore.java:1785)
[junit4:junit4]   2> 		at org.apache.solr.core.SolrCore.close(SolrCore.java:1008)
[junit4:junit4]   2> 		at org.apache.solr.cloud.ShardLeaderElectionContext.runLeaderProcess(ElectionContext.java:233)
[junit4:junit4]   2> 		at org.apache.solr.cloud.LeaderElector.runIamLeaderProcess(LeaderElector.java:156)
[junit4:junit4]   2> 		at org.apache.solr.cloud.LeaderElector.checkIfIamLeader(LeaderElector.java:100)
[junit4:junit4]   2> 		at org.apache.solr.cloud.LeaderElector.access$000(LeaderElector.java:55)
[junit4:junit4]   2> 		at org.apache.solr.cloud.LeaderElector$1.process(LeaderElector.java:129)
[junit4:junit4]   2> 		at org.apache.zookeeper.ClientCnxn$EventThread.processEvent(ClientCnxn.java:519)
[junit4:junit4]   2> 		at org.apache.zookeeper.ClientCnxn$EventThread.run(ClientCnxn.java:495)
[junit4:junit4]   2> 	
[junit4:junit4]   2> 114184 T3232 oasc.CachingDirectoryFactory.close Closing directory:/usr/home/hudson/hudson-slave/workspace/Lucene-Solr-NightlyTests-trunk/solr/build/solr-core/test/J0/./org.apache.solr.cloud.SyncSliceTest-1355708522384/jetty4/index.20121216184215585
[junit4:junit4]   2> 114184 T3232 oash.SnapPuller$2.postClose removing old index directory RateLimitedDirectoryWrapper(org.apache.lucene.store.NIOFSDirectory@/usr/home/hudson/hudson-slave/workspace/Lucene-Solr-NightlyTests-trunk/solr/build/solr-core/test/J0/org.apache.solr.cloud.SyncSliceTest-1355708522384/jetty4/index lockFactory=org.apache.lucene.store.NativeFSLockFactory@7e923b11)
[junit4:junit4]   2> 114185 T3232 oasc.CachingDirectoryFactory.close Closing directory when closing factory:/usr/home/hudson/hudson-slave/workspace/Lucene-Solr-NightlyTests-trunk/solr/build/solr-core/test/J0/./org.apache.solr.cloud.SyncSliceTest-1355708522384/jetty4
[junit4:junit4]   2> 114185 T3232 oasc.CachingDirectoryFactory.close Closing directory when closing factory:/usr/home/hudson/hudson-slave/workspace/Lucene-Solr-NightlyTests-trunk/solr/build/solr-core/test/J0/./org.apache.solr.cloud.SyncSliceTest-1355708522384/jetty4/index
[junit4:junit4]   2> 114186 T3232 oascc.SolrZkClient.makePath makePath: /collections/collection1/leaders/shard1
[junit4:junit4]   2> 114186 T3232 oasc.LeaderElector$1.process WARNING  org.apache.zookeeper.KeeperException$SessionExpiredException: KeeperErrorCode = Session expired for /collections/collection1/leader_elect/shard1/election/88847713723547660-127.0.0.1:18451_x%2Fnq_collection1-n_0000000003
[junit4:junit4]   2> 	at org.apache.zookeeper.KeeperException.create(KeeperException.java:127)
[junit4:junit4]   2> 	at org.apache.zookeeper.KeeperException.create(KeeperException.java:51)
[junit4:junit4]   2> 	at org.apache.zookeeper.ZooKeeper.delete(ZooKeeper.java:873)
[junit4:junit4]   2> 	at org.apache.solr.common.cloud.SolrZkClient$2.execute(SolrZkClient.java:153)
[junit4:junit4]   2> 	at org.apache.solr.common.cloud.SolrZkClient$2.execute(SolrZkClient.java:150)
[junit4:junit4]   2> 	at org.apache.solr.common.cloud.ZkCmdExecutor.retryOperation(ZkCmdExecutor.java:65)
[junit4:junit4]   2> 	at org.apache.solr.common.cloud.SolrZkClient.delete(SolrZkClient.java:150)
[junit4:junit4]   2> 	at org.apache.solr.cloud.ElectionContext.cancelElection(ElectionContext.java:63)
[junit4:junit4]   2> 	at org.apache.solr.cloud.ShardLeaderElectionContext.runLeaderProcess(ElectionContext.java:243)
[junit4:junit4]   2> 	at org.apache.solr.cloud.LeaderElector.runIamLeaderProcess(LeaderElector.java:156)
[junit4:junit4]   2> 	at org.apache.solr.cloud.LeaderElector.checkIfIamLeader(LeaderElector.java:100)
[junit4:junit4]   2> 	at org.apache.solr.cloud.LeaderElector.access$000(LeaderElector.java:55)
[junit4:junit4]   2> 	at org.apache.solr.cloud.LeaderElector$1.process(LeaderElector.java:129)
[junit4:junit4]   2> 	at org.apache.zookeeper.ClientCnxn$EventThread.processEvent(ClientCnxn.java:519)
[junit4:junit4]   2> 	at org.apache.zookeeper.ClientCnxn$EventThread.run(ClientCnxn.java:495)
[junit4:junit4]   2> 
[junit4:junit4]   2> 114187 T3232 oascc.ZkStateReader$2.process A cluster state change: WatchedEvent state:SyncConnected type:NodeChildrenChanged path:/live_nodes, has occurred - updating... (live nodes size: 8)
[junit4:junit4]   2> 114187 T3232 oascc.ZkStateReader$2.process WARNING ZooKeeper watch triggered, but Solr cannot talk to ZK
[junit4:junit4]   2> 114187 T3232 oascc.ZkStateReader$3.process WARNING ZooKeeper watch triggered, but Solr cannot talk to ZK
[junit4:junit4]   2> 114187 T3232 oascc.ZkStateReader$2.process A cluster state change: WatchedEvent state:SyncConnected type:NodeDataChanged path:/clusterstate.json, has occurred - updating... (live nodes size: 8)
[junit4:junit4]   2> 114188 T3232 oascc.ZkStateReader$2.process WARNING ZooKeeper watch triggered, but Solr cannot talk to ZK
[junit4:junit4]   2> 114188 T3232 oascc.ConnectionManager.process Watcher org.apache.solr.common.cloud.ConnectionManager@5e54fcfb name:ZooKeeperConnection Watcher:127.0.0.1:65363/solr got event WatchedEvent state:Disconnected type:None path:null path:null type:None
[junit4:junit4]   2> 114188 T3232 oascc.ConnectionManager.process Client->ZooKeeper status change trigger but we are already closed
[junit4:junit4]   2> 114188 T3232 oaz.ClientCnxn$EventThread.run EventThread shut down
[junit4:junit4]   2> NOTE: test params are: codec=SimpleText, sim=DefaultSimilarity, locale=fi, timezone=America/Dawson_Creek
[junit4:junit4]   2> NOTE: FreeBSD 9.0-RELEASE amd64/Sun Microsystems Inc. 1.6.0_32 (64-bit)/cpus=16,threads=2,free=218795952,total=506855424
[junit4:junit4]   2> NOTE: All tests run in this JVM: [TestXIncludeConfig, LoggingHandlerTest, RequestHandlersTest, TestIndexingPerformance, CSVRequestHandlerTest, SolrCmdDistributorTest, FastVectorHighlighterTest, TestLuceneMatchVersion, FileBasedSpellCheckerTest, TestFiltering, TestIBSimilarityFactory, UniqFieldsUpdateProcessorFactoryTest, MoreLikeThisHandlerTest, CurrencyFieldTest, TestSolrQueryParser, TestStressRecovery, TestJoin, TestSuggestSpellingConverter, JSONWriterTest, TestPHPSerializedResponseWriter, TestJmxMonitoredMap, IndexBasedSpellCheckerTest, CacheHeaderTest, TestBinaryResponseWriter, DistributedTermsComponentTest, DateFieldTest, ResponseLogComponentTest, TestLMJelinekMercerSimilarityFactory, DistanceFunctionTest, TestStressLucene, CoreAdminHandlerTest, NoCacheHeaderTest, CopyFieldTest, TestWordDelimiterFilterFactory, NumericFieldsTest, TestLFUCache, BasicDistributedZk2Test, TestFastLRUCache, TestQuerySenderNoQuery, SpellPossibilityIteratorTest, BadComponentTest, TestCoreContainer, TestGroupingSearch, NotRequiredUniqueKeyTest, SpellCheckComponentTest, SolrRequestParserTest, DistributedMLTComponentTest, BinaryUpdateRequestHandlerTest, DateMathParserTest, SuggesterFSTTest, TestBadConfig, TestRandomFaceting, TermsComponentTest, PreAnalyzedFieldTest, ClusterStateTest, TestSystemIdResolver, TestFastWriter, QueryElevationComponentTest, BasicDistributedZkTest, SignatureUpdateProcessorFactoryTest, SampleTest, TestIndexSearcher, DirectSolrConnectionTest, QueryEqualityTest, TestCSVLoader, TestCSVResponseWriter, MBeansHandlerTest, TestPseudoReturnFields, DisMaxRequestHandlerTest, XsltUpdateRequestHandlerTest, FieldAnalysisRequestHandlerTest, SuggesterWFSTTest, DirectUpdateHandlerOptimizeTest, TestReversedWildcardFilterFactory, SearchHandlerTest, UpdateParamsTest, TestSearchPerf, SolrCoreCheckLockOnStartupTest, UpdateRequestProcessorFactoryTest, AlternateDirectoryTest, FieldMutatingUpdateProcessorTest, HighlighterConfigTest, SOLR749Test, TestMergePolicyConfig, TestQuerySenderListener, SolrIndexConfigTest, TestNumberUtils, TestConfig, TestPhraseSuggestions, TestPerFieldSimilarity, TestCodecSupport, TimeZoneUtilsTest, PrimUtilsTest, ResourceLoaderTest, TestLRUCache, TestDocumentBuilder, PathHierarchyTokenizerFactoryTest, TestCharFilters, ClusterStateUpdateTest, SyncSliceTest]
[junit4:junit4] Completed on J0 in 114.92s, 1 test, 1 failure <<< FAILURES!

[...truncated 12 lines...]
BUILD FAILED
/usr/home/hudson/hudson-slave/workspace/Lucene-Solr-NightlyTests-trunk/build.xml:353: The following error occurred while executing this line:
/usr/home/hudson/hudson-slave/workspace/Lucene-Solr-NightlyTests-trunk/build.xml:39: The following error occurred while executing this line:
/usr/home/hudson/hudson-slave/workspace/Lucene-Solr-NightlyTests-trunk/solr/build.xml:178: The following error occurred while executing this line:
/usr/home/hudson/hudson-slave/workspace/Lucene-Solr-NightlyTests-trunk/solr/common-build.xml:438: The following error occurred while executing this line:
/usr/home/hudson/hudson-slave/workspace/Lucene-Solr-NightlyTests-trunk/lucene/common-build.xml:1175: The following error occurred while executing this line:
/usr/home/hudson/hudson-slave/workspace/Lucene-Solr-NightlyTests-trunk/lucene/common-build.xml:840: There were test failures: 241 suites, 1006 tests, 3 failures, 21 ignored (3 assumptions)

Total time: 142 minutes 38 seconds
Build step 'Invoke Ant' marked build as failure
Archiving artifacts
Recording test results
Email was triggered for: Failure
Sending email for trigger: Failure



Mime
View raw message