lucene-dev mailing list archives

Site index · List index
Message view « Date » · « Thread »
Top « Date » · « Thread »
From Policeman Jenkins Server <jenk...@sd-datasolutions.de>
Subject [JENKINS] Lucene-Solr-trunk-Linux (32bit/jdk1.8.0-ea-b65) - Build # 3063 - Failure!
Date Tue, 04 Dec 2012 22:47:02 GMT
Build: http://jenkins.sd-datasolutions.de/job/Lucene-Solr-trunk-Linux/3063/
Java: 32bit/jdk1.8.0-ea-b65 -client -XX:+UseParallelGC

4 tests failed.
FAILED:  junit.framework.TestSuite.org.apache.solr.core.TestLazyCores

Error Message:
ERROR: SolrIndexSearcher opens=14 closes=10

Stack Trace:
java.lang.AssertionError: ERROR: SolrIndexSearcher opens=14 closes=10
	at __randomizedtesting.SeedInfo.seed([CF50389D6DA57BF1]:0)
	at org.junit.Assert.fail(Assert.java:93)
	at org.apache.solr.SolrTestCaseJ4.endTrackingSearchers(SolrTestCaseJ4.java:243)
	at org.apache.solr.SolrTestCaseJ4.afterClass(SolrTestCaseJ4.java:97)
	at sun.reflect.GeneratedMethodAccessor24.invoke(Unknown Source)
	at sun.reflect.DelegatingMethodAccessorImpl.invoke(DelegatingMethodAccessorImpl.java:43)
	at java.lang.reflect.Method.invoke(Method.java:474)
	at com.carrotsearch.randomizedtesting.RandomizedRunner.invoke(RandomizedRunner.java:1559)
	at com.carrotsearch.randomizedtesting.RandomizedRunner.access$600(RandomizedRunner.java:79)
	at com.carrotsearch.randomizedtesting.RandomizedRunner$5.evaluate(RandomizedRunner.java:700)
	at com.carrotsearch.randomizedtesting.rules.StatementAdapter.evaluate(StatementAdapter.java:36)
	at com.carrotsearch.randomizedtesting.rules.SystemPropertiesRestoreRule$1.evaluate(SystemPropertiesRestoreRule.java:53)
	at org.apache.lucene.util.AbstractBeforeAfterRule$1.evaluate(AbstractBeforeAfterRule.java:45)
	at org.apache.lucene.util.TestRuleStoreClassName$1.evaluate(TestRuleStoreClassName.java:42)
	at com.carrotsearch.randomizedtesting.rules.SystemPropertiesInvariantRule$1.evaluate(SystemPropertiesInvariantRule.java:55)
	at com.carrotsearch.randomizedtesting.rules.NoShadowingOrOverridesOnMethodsRule$1.evaluate(NoShadowingOrOverridesOnMethodsRule.java:39)
	at com.carrotsearch.randomizedtesting.rules.NoShadowingOrOverridesOnMethodsRule$1.evaluate(NoShadowingOrOverridesOnMethodsRule.java:39)
	at com.carrotsearch.randomizedtesting.rules.StatementAdapter.evaluate(StatementAdapter.java:36)
	at org.apache.lucene.util.TestRuleAssertionsRequired$1.evaluate(TestRuleAssertionsRequired.java:43)
	at org.apache.lucene.util.TestRuleMarkFailure$1.evaluate(TestRuleMarkFailure.java:48)
	at org.apache.lucene.util.TestRuleIgnoreAfterMaxFailures$1.evaluate(TestRuleIgnoreAfterMaxFailures.java:70)
	at org.apache.lucene.util.TestRuleIgnoreTestSuites$1.evaluate(TestRuleIgnoreTestSuites.java:55)
	at com.carrotsearch.randomizedtesting.rules.StatementAdapter.evaluate(StatementAdapter.java:36)
	at com.carrotsearch.randomizedtesting.ThreadLeakControl$StatementRunner.run(ThreadLeakControl.java:358)
	at java.lang.Thread.run(Thread.java:722)


FAILED:  junit.framework.TestSuite.org.apache.solr.core.TestLazyCores

Error Message:
4 threads leaked from SUITE scope at org.apache.solr.core.TestLazyCores:     1) Thread[id=2367, name=searcherExecutor-2375-thread-1, state=WAITING, group=TGRP-TestLazyCores]         at sun.misc.Unsafe.park(Native Method)         at java.util.concurrent.locks.LockSupport.park(LockSupport.java:186)         at java.util.concurrent.locks.AbstractQueuedSynchronizer$ConditionObject.await(AbstractQueuedSynchronizer.java:2038)         at java.util.concurrent.LinkedBlockingQueue.take(LinkedBlockingQueue.java:439)         at java.util.concurrent.ThreadPoolExecutor.getTask(ThreadPoolExecutor.java:1045)         at java.util.concurrent.ThreadPoolExecutor.runWorker(ThreadPoolExecutor.java:1103)         at java.util.concurrent.ThreadPoolExecutor$Worker.run(ThreadPoolExecutor.java:603)         at java.lang.Thread.run(Thread.java:722)    2) Thread[id=2369, name=searcherExecutor-2381-thread-1, state=WAITING, group=TGRP-TestLazyCores]         at sun.misc.Unsafe.park(Native Method)         at java.util.concurrent.locks.LockSupport.park(LockSupport.java:186)         at java.util.concurrent.locks.AbstractQueuedSynchronizer$ConditionObject.await(AbstractQueuedSynchronizer.java:2038)         at java.util.concurrent.LinkedBlockingQueue.take(LinkedBlockingQueue.java:439)         at java.util.concurrent.ThreadPoolExecutor.getTask(ThreadPoolExecutor.java:1045)         at java.util.concurrent.ThreadPoolExecutor.runWorker(ThreadPoolExecutor.java:1103)         at java.util.concurrent.ThreadPoolExecutor$Worker.run(ThreadPoolExecutor.java:603)         at java.lang.Thread.run(Thread.java:722)    3) Thread[id=2366, name=searcherExecutor-2369-thread-1, state=WAITING, group=TGRP-TestLazyCores]         at sun.misc.Unsafe.park(Native Method)         at java.util.concurrent.locks.LockSupport.park(LockSupport.java:186)         at java.util.concurrent.locks.AbstractQueuedSynchronizer$ConditionObject.await(AbstractQueuedSynchronizer.java:2038)         at java.util.concurrent.LinkedBlockingQueue.take(LinkedBlockingQueue.java:439)         at java.util.concurrent.ThreadPoolExecutor.getTask(ThreadPoolExecutor.java:1045)         at java.util.concurrent.ThreadPoolExecutor.runWorker(ThreadPoolExecutor.java:1103)         at java.util.concurrent.ThreadPoolExecutor$Worker.run(ThreadPoolExecutor.java:603)         at java.lang.Thread.run(Thread.java:722)    4) Thread[id=2368, name=searcherExecutor-2378-thread-1, state=WAITING, group=TGRP-TestLazyCores]         at sun.misc.Unsafe.park(Native Method)         at java.util.concurrent.locks.LockSupport.park(LockSupport.java:186)         at java.util.concurrent.locks.AbstractQueuedSynchronizer$ConditionObject.await(AbstractQueuedSynchronizer.java:2038)         at java.util.concurrent.LinkedBlockingQueue.take(LinkedBlockingQueue.java:439)         at java.util.concurrent.ThreadPoolExecutor.getTask(ThreadPoolExecutor.java:1045)         at java.util.concurrent.ThreadPoolExecutor.runWorker(ThreadPoolExecutor.java:1103)         at java.util.concurrent.ThreadPoolExecutor$Worker.run(ThreadPoolExecutor.java:603)         at java.lang.Thread.run(Thread.java:722)

Stack Trace:
com.carrotsearch.randomizedtesting.ThreadLeakError: 4 threads leaked from SUITE scope at org.apache.solr.core.TestLazyCores: 
   1) Thread[id=2367, name=searcherExecutor-2375-thread-1, state=WAITING, group=TGRP-TestLazyCores]
        at sun.misc.Unsafe.park(Native Method)
        at java.util.concurrent.locks.LockSupport.park(LockSupport.java:186)
        at java.util.concurrent.locks.AbstractQueuedSynchronizer$ConditionObject.await(AbstractQueuedSynchronizer.java:2038)
        at java.util.concurrent.LinkedBlockingQueue.take(LinkedBlockingQueue.java:439)
        at java.util.concurrent.ThreadPoolExecutor.getTask(ThreadPoolExecutor.java:1045)
        at java.util.concurrent.ThreadPoolExecutor.runWorker(ThreadPoolExecutor.java:1103)
        at java.util.concurrent.ThreadPoolExecutor$Worker.run(ThreadPoolExecutor.java:603)
        at java.lang.Thread.run(Thread.java:722)
   2) Thread[id=2369, name=searcherExecutor-2381-thread-1, state=WAITING, group=TGRP-TestLazyCores]
        at sun.misc.Unsafe.park(Native Method)
        at java.util.concurrent.locks.LockSupport.park(LockSupport.java:186)
        at java.util.concurrent.locks.AbstractQueuedSynchronizer$ConditionObject.await(AbstractQueuedSynchronizer.java:2038)
        at java.util.concurrent.LinkedBlockingQueue.take(LinkedBlockingQueue.java:439)
        at java.util.concurrent.ThreadPoolExecutor.getTask(ThreadPoolExecutor.java:1045)
        at java.util.concurrent.ThreadPoolExecutor.runWorker(ThreadPoolExecutor.java:1103)
        at java.util.concurrent.ThreadPoolExecutor$Worker.run(ThreadPoolExecutor.java:603)
        at java.lang.Thread.run(Thread.java:722)
   3) Thread[id=2366, name=searcherExecutor-2369-thread-1, state=WAITING, group=TGRP-TestLazyCores]
        at sun.misc.Unsafe.park(Native Method)
        at java.util.concurrent.locks.LockSupport.park(LockSupport.java:186)
        at java.util.concurrent.locks.AbstractQueuedSynchronizer$ConditionObject.await(AbstractQueuedSynchronizer.java:2038)
        at java.util.concurrent.LinkedBlockingQueue.take(LinkedBlockingQueue.java:439)
        at java.util.concurrent.ThreadPoolExecutor.getTask(ThreadPoolExecutor.java:1045)
        at java.util.concurrent.ThreadPoolExecutor.runWorker(ThreadPoolExecutor.java:1103)
        at java.util.concurrent.ThreadPoolExecutor$Worker.run(ThreadPoolExecutor.java:603)
        at java.lang.Thread.run(Thread.java:722)
   4) Thread[id=2368, name=searcherExecutor-2378-thread-1, state=WAITING, group=TGRP-TestLazyCores]
        at sun.misc.Unsafe.park(Native Method)
        at java.util.concurrent.locks.LockSupport.park(LockSupport.java:186)
        at java.util.concurrent.locks.AbstractQueuedSynchronizer$ConditionObject.await(AbstractQueuedSynchronizer.java:2038)
        at java.util.concurrent.LinkedBlockingQueue.take(LinkedBlockingQueue.java:439)
        at java.util.concurrent.ThreadPoolExecutor.getTask(ThreadPoolExecutor.java:1045)
        at java.util.concurrent.ThreadPoolExecutor.runWorker(ThreadPoolExecutor.java:1103)
        at java.util.concurrent.ThreadPoolExecutor$Worker.run(ThreadPoolExecutor.java:603)
        at java.lang.Thread.run(Thread.java:722)
	at __randomizedtesting.SeedInfo.seed([CF50389D6DA57BF1]:0)


FAILED:  junit.framework.TestSuite.org.apache.solr.core.TestLazyCores

Error Message:
There are still zombie threads that couldn't be terminated:    1) Thread[id=2369, name=searcherExecutor-2381-thread-1, state=WAITING, group=TGRP-TestLazyCores]         at sun.misc.Unsafe.park(Native Method)         at java.util.concurrent.locks.LockSupport.park(LockSupport.java:186)         at java.util.concurrent.locks.AbstractQueuedSynchronizer$ConditionObject.await(AbstractQueuedSynchronizer.java:2038)         at java.util.concurrent.LinkedBlockingQueue.take(LinkedBlockingQueue.java:439)         at java.util.concurrent.ThreadPoolExecutor.getTask(ThreadPoolExecutor.java:1045)         at java.util.concurrent.ThreadPoolExecutor.runWorker(ThreadPoolExecutor.java:1103)         at java.util.concurrent.ThreadPoolExecutor$Worker.run(ThreadPoolExecutor.java:603)         at java.lang.Thread.run(Thread.java:722)    2) Thread[id=2367, name=searcherExecutor-2375-thread-1, state=WAITING, group=TGRP-TestLazyCores]         at sun.misc.Unsafe.park(Native Method)         at java.util.concurrent.locks.LockSupport.park(LockSupport.java:186)         at java.util.concurrent.locks.AbstractQueuedSynchronizer$ConditionObject.await(AbstractQueuedSynchronizer.java:2038)         at java.util.concurrent.LinkedBlockingQueue.take(LinkedBlockingQueue.java:439)         at java.util.concurrent.ThreadPoolExecutor.getTask(ThreadPoolExecutor.java:1045)         at java.util.concurrent.ThreadPoolExecutor.runWorker(ThreadPoolExecutor.java:1103)         at java.util.concurrent.ThreadPoolExecutor$Worker.run(ThreadPoolExecutor.java:603)         at java.lang.Thread.run(Thread.java:722)    3) Thread[id=2368, name=searcherExecutor-2378-thread-1, state=WAITING, group=TGRP-TestLazyCores]         at sun.misc.Unsafe.park(Native Method)         at java.util.concurrent.locks.LockSupport.park(LockSupport.java:186)         at java.util.concurrent.locks.AbstractQueuedSynchronizer$ConditionObject.await(AbstractQueuedSynchronizer.java:2038)         at java.util.concurrent.LinkedBlockingQueue.take(LinkedBlockingQueue.java:439)         at java.util.concurrent.ThreadPoolExecutor.getTask(ThreadPoolExecutor.java:1045)         at java.util.concurrent.ThreadPoolExecutor.runWorker(ThreadPoolExecutor.java:1103)         at java.util.concurrent.ThreadPoolExecutor$Worker.run(ThreadPoolExecutor.java:603)         at java.lang.Thread.run(Thread.java:722)    4) Thread[id=2366, name=searcherExecutor-2369-thread-1, state=WAITING, group=TGRP-TestLazyCores]         at sun.misc.Unsafe.park(Native Method)         at java.util.concurrent.locks.LockSupport.park(LockSupport.java:186)         at java.util.concurrent.locks.AbstractQueuedSynchronizer$ConditionObject.await(AbstractQueuedSynchronizer.java:2038)         at java.util.concurrent.LinkedBlockingQueue.take(LinkedBlockingQueue.java:439)         at java.util.concurrent.ThreadPoolExecutor.getTask(ThreadPoolExecutor.java:1045)         at java.util.concurrent.ThreadPoolExecutor.runWorker(ThreadPoolExecutor.java:1103)         at java.util.concurrent.ThreadPoolExecutor$Worker.run(ThreadPoolExecutor.java:603)         at java.lang.Thread.run(Thread.java:722)

Stack Trace:
com.carrotsearch.randomizedtesting.ThreadLeakError: There are still zombie threads that couldn't be terminated:
   1) Thread[id=2369, name=searcherExecutor-2381-thread-1, state=WAITING, group=TGRP-TestLazyCores]
        at sun.misc.Unsafe.park(Native Method)
        at java.util.concurrent.locks.LockSupport.park(LockSupport.java:186)
        at java.util.concurrent.locks.AbstractQueuedSynchronizer$ConditionObject.await(AbstractQueuedSynchronizer.java:2038)
        at java.util.concurrent.LinkedBlockingQueue.take(LinkedBlockingQueue.java:439)
        at java.util.concurrent.ThreadPoolExecutor.getTask(ThreadPoolExecutor.java:1045)
        at java.util.concurrent.ThreadPoolExecutor.runWorker(ThreadPoolExecutor.java:1103)
        at java.util.concurrent.ThreadPoolExecutor$Worker.run(ThreadPoolExecutor.java:603)
        at java.lang.Thread.run(Thread.java:722)
   2) Thread[id=2367, name=searcherExecutor-2375-thread-1, state=WAITING, group=TGRP-TestLazyCores]
        at sun.misc.Unsafe.park(Native Method)
        at java.util.concurrent.locks.LockSupport.park(LockSupport.java:186)
        at java.util.concurrent.locks.AbstractQueuedSynchronizer$ConditionObject.await(AbstractQueuedSynchronizer.java:2038)
        at java.util.concurrent.LinkedBlockingQueue.take(LinkedBlockingQueue.java:439)
        at java.util.concurrent.ThreadPoolExecutor.getTask(ThreadPoolExecutor.java:1045)
        at java.util.concurrent.ThreadPoolExecutor.runWorker(ThreadPoolExecutor.java:1103)
        at java.util.concurrent.ThreadPoolExecutor$Worker.run(ThreadPoolExecutor.java:603)
        at java.lang.Thread.run(Thread.java:722)
   3) Thread[id=2368, name=searcherExecutor-2378-thread-1, state=WAITING, group=TGRP-TestLazyCores]
        at sun.misc.Unsafe.park(Native Method)
        at java.util.concurrent.locks.LockSupport.park(LockSupport.java:186)
        at java.util.concurrent.locks.AbstractQueuedSynchronizer$ConditionObject.await(AbstractQueuedSynchronizer.java:2038)
        at java.util.concurrent.LinkedBlockingQueue.take(LinkedBlockingQueue.java:439)
        at java.util.concurrent.ThreadPoolExecutor.getTask(ThreadPoolExecutor.java:1045)
        at java.util.concurrent.ThreadPoolExecutor.runWorker(ThreadPoolExecutor.java:1103)
        at java.util.concurrent.ThreadPoolExecutor$Worker.run(ThreadPoolExecutor.java:603)
        at java.lang.Thread.run(Thread.java:722)
   4) Thread[id=2366, name=searcherExecutor-2369-thread-1, state=WAITING, group=TGRP-TestLazyCores]
        at sun.misc.Unsafe.park(Native Method)
        at java.util.concurrent.locks.LockSupport.park(LockSupport.java:186)
        at java.util.concurrent.locks.AbstractQueuedSynchronizer$ConditionObject.await(AbstractQueuedSynchronizer.java:2038)
        at java.util.concurrent.LinkedBlockingQueue.take(LinkedBlockingQueue.java:439)
        at java.util.concurrent.ThreadPoolExecutor.getTask(ThreadPoolExecutor.java:1045)
        at java.util.concurrent.ThreadPoolExecutor.runWorker(ThreadPoolExecutor.java:1103)
        at java.util.concurrent.ThreadPoolExecutor$Worker.run(ThreadPoolExecutor.java:603)
        at java.lang.Thread.run(Thread.java:722)
	at __randomizedtesting.SeedInfo.seed([CF50389D6DA57BF1]:0)


REGRESSION:  org.apache.solr.core.TestLazyCores.testCachingLimit

Error Message:
core collectionLazy5 was not found in the list of cores

Stack Trace:
java.lang.AssertionError: core collectionLazy5 was not found in the list of cores
	at __randomizedtesting.SeedInfo.seed([CF50389D6DA57BF1:AA0C97E7DCBAA61F]:0)
	at org.junit.Assert.fail(Assert.java:93)
	at org.junit.Assert.assertTrue(Assert.java:43)
	at org.apache.solr.core.TestLazyCores.checkInCores(TestLazyCores.java:226)
	at org.apache.solr.core.TestLazyCores.testCachingLimit(TestLazyCores.java:180)
	at sun.reflect.NativeMethodAccessorImpl.invoke0(Native Method)
	at sun.reflect.NativeMethodAccessorImpl.invoke(NativeMethodAccessorImpl.java:57)
	at sun.reflect.DelegatingMethodAccessorImpl.invoke(DelegatingMethodAccessorImpl.java:43)
	at java.lang.reflect.Method.invoke(Method.java:474)
	at com.carrotsearch.randomizedtesting.RandomizedRunner.invoke(RandomizedRunner.java:1559)
	at com.carrotsearch.randomizedtesting.RandomizedRunner.access$600(RandomizedRunner.java:79)
	at com.carrotsearch.randomizedtesting.RandomizedRunner$6.evaluate(RandomizedRunner.java:737)
	at com.carrotsearch.randomizedtesting.RandomizedRunner$7.evaluate(RandomizedRunner.java:773)
	at com.carrotsearch.randomizedtesting.RandomizedRunner$8.evaluate(RandomizedRunner.java:787)
	at com.carrotsearch.randomizedtesting.rules.SystemPropertiesRestoreRule$1.evaluate(SystemPropertiesRestoreRule.java:53)
	at org.apache.lucene.util.TestRuleSetupTeardownChained$1.evaluate(TestRuleSetupTeardownChained.java:50)
	at org.apache.lucene.util.TestRuleFieldCacheSanity$1.evaluate(TestRuleFieldCacheSanity.java:51)
	at org.apache.lucene.util.AbstractBeforeAfterRule$1.evaluate(AbstractBeforeAfterRule.java:45)
	at com.carrotsearch.randomizedtesting.rules.SystemPropertiesInvariantRule$1.evaluate(SystemPropertiesInvariantRule.java:55)
	at org.apache.lucene.util.TestRuleThreadAndTestName$1.evaluate(TestRuleThreadAndTestName.java:48)
	at org.apache.lucene.util.TestRuleIgnoreAfterMaxFailures$1.evaluate(TestRuleIgnoreAfterMaxFailures.java:70)
	at org.apache.lucene.util.TestRuleMarkFailure$1.evaluate(TestRuleMarkFailure.java:48)
	at com.carrotsearch.randomizedtesting.rules.StatementAdapter.evaluate(StatementAdapter.java:36)
	at com.carrotsearch.randomizedtesting.ThreadLeakControl$StatementRunner.run(ThreadLeakControl.java:358)
	at com.carrotsearch.randomizedtesting.ThreadLeakControl.forkTimeoutingTask(ThreadLeakControl.java:782)
	at com.carrotsearch.randomizedtesting.ThreadLeakControl$3.evaluate(ThreadLeakControl.java:442)
	at com.carrotsearch.randomizedtesting.RandomizedRunner.runSingleTest(RandomizedRunner.java:746)
	at com.carrotsearch.randomizedtesting.RandomizedRunner$3.evaluate(RandomizedRunner.java:648)
	at com.carrotsearch.randomizedtesting.RandomizedRunner$4.evaluate(RandomizedRunner.java:682)
	at com.carrotsearch.randomizedtesting.RandomizedRunner$5.evaluate(RandomizedRunner.java:693)
	at com.carrotsearch.randomizedtesting.rules.StatementAdapter.evaluate(StatementAdapter.java:36)
	at com.carrotsearch.randomizedtesting.rules.SystemPropertiesRestoreRule$1.evaluate(SystemPropertiesRestoreRule.java:53)
	at org.apache.lucene.util.AbstractBeforeAfterRule$1.evaluate(AbstractBeforeAfterRule.java:45)
	at org.apache.lucene.util.TestRuleStoreClassName$1.evaluate(TestRuleStoreClassName.java:42)
	at com.carrotsearch.randomizedtesting.rules.SystemPropertiesInvariantRule$1.evaluate(SystemPropertiesInvariantRule.java:55)
	at com.carrotsearch.randomizedtesting.rules.NoShadowingOrOverridesOnMethodsRule$1.evaluate(NoShadowingOrOverridesOnMethodsRule.java:39)
	at com.carrotsearch.randomizedtesting.rules.NoShadowingOrOverridesOnMethodsRule$1.evaluate(NoShadowingOrOverridesOnMethodsRule.java:39)
	at com.carrotsearch.randomizedtesting.rules.StatementAdapter.evaluate(StatementAdapter.java:36)
	at org.apache.lucene.util.TestRuleAssertionsRequired$1.evaluate(TestRuleAssertionsRequired.java:43)
	at org.apache.lucene.util.TestRuleMarkFailure$1.evaluate(TestRuleMarkFailure.java:48)
	at org.apache.lucene.util.TestRuleIgnoreAfterMaxFailures$1.evaluate(TestRuleIgnoreAfterMaxFailures.java:70)
	at org.apache.lucene.util.TestRuleIgnoreTestSuites$1.evaluate(TestRuleIgnoreTestSuites.java:55)
	at com.carrotsearch.randomizedtesting.rules.StatementAdapter.evaluate(StatementAdapter.java:36)
	at com.carrotsearch.randomizedtesting.ThreadLeakControl$StatementRunner.run(ThreadLeakControl.java:358)
	at java.lang.Thread.run(Thread.java:722)




Build Log:
[...truncated 9251 lines...]
[junit4:junit4] Suite: org.apache.solr.core.TestLazyCores
[junit4:junit4]   2> 1 T2362 oas.SolrTestCaseJ4.initCore ####initCore
[junit4:junit4]   2> Creating dataDir: /mnt/ssd/jenkins/workspace/Lucene-Solr-trunk-Linux/solr/build/solr-core/test/J0/./solrtest-TestLazyCores-1354661050146
[junit4:junit4]   2> 2 T2362 oasc.SolrResourceLoader.<init> new SolrResourceLoader for directory: '/mnt/ssd/jenkins/workspace/Lucene-Solr-trunk-Linux/solr/build/solr-core/test-files/solr/collection1/'
[junit4:junit4]   2> 2 T2362 oasc.SolrResourceLoader.replaceClassLoader Adding 'file:/mnt/ssd/jenkins/workspace/Lucene-Solr-trunk-Linux/solr/build/solr-core/test-files/solr/collection1/lib/README' to classloader
[junit4:junit4]   2> 3 T2362 oasc.SolrResourceLoader.replaceClassLoader Adding 'file:/mnt/ssd/jenkins/workspace/Lucene-Solr-trunk-Linux/solr/build/solr-core/test-files/solr/collection1/lib/classes/' to classloader
[junit4:junit4]   2> 38 T2362 oasc.SolrConfig.<init> Using Lucene MatchVersion: LUCENE_50
[junit4:junit4]   2> 90 T2362 oasc.SolrConfig.<init> Loaded SolrConfig: solrconfig.xml
[junit4:junit4]   2> 91 T2362 oass.IndexSchema.readSchema Reading Solr Schema
[junit4:junit4]   2> 95 T2362 oass.IndexSchema.readSchema Schema name=test
[junit4:junit4]   2> 466 T2362 oass.OpenExchangeRatesOrgProvider.init Initialized with rates=open-exchange-rates.json, refreshInterval=1440.
[junit4:junit4]   2> 481 T2362 oass.IndexSchema.readSchema default search field in schema is text
[junit4:junit4]   2> 484 T2362 oass.IndexSchema.readSchema unique key field: id
[junit4:junit4]   2> 489 T2362 oass.FileExchangeRateProvider.reload Reloading exchange rates from file currency.xml
[junit4:junit4]   2> 491 T2362 oass.FileExchangeRateProvider.reload Reloading exchange rates from file currency.xml
[junit4:junit4]   2> 494 T2362 oass.OpenExchangeRatesOrgProvider.reload Reloading exchange rates from open-exchange-rates.json
[junit4:junit4]   2> 494 T2362 oass.OpenExchangeRatesOrgProvider.reload Reloading exchange rates from open-exchange-rates.json
[junit4:junit4]   2> 495 T2362 oasc.SolrResourceLoader.locateSolrHome JNDI not configured for solr (NoInitialContextEx)
[junit4:junit4]   2> 495 T2362 oasc.SolrResourceLoader.locateSolrHome using system property solr.solr.home: /mnt/ssd/jenkins/workspace/Lucene-Solr-trunk-Linux/solr/build/solr-core/test-files/solr
[junit4:junit4]   2> 496 T2362 oasc.SolrResourceLoader.<init> new SolrResourceLoader for directory: '/mnt/ssd/jenkins/workspace/Lucene-Solr-trunk-Linux/solr/build/solr-core/test-files/solr/'
[junit4:junit4]   2> 502 T2362 oasc.CoreContainer.<init> New CoreContainer 11876786
[junit4:junit4]   2> 502 T2362 oasc.SolrCore.<init> [collection1] Opening new SolrCore at /mnt/ssd/jenkins/workspace/Lucene-Solr-trunk-Linux/solr/build/solr-core/test-files/solr/collection1/, dataDir=/mnt/ssd/jenkins/workspace/Lucene-Solr-trunk-Linux/solr/build/solr-core/test/J0/./solrtest-TestLazyCores-1354661050146/
[junit4:junit4]   2> 503 T2362 oasc.JmxMonitoredMap.<init> JMX monitoring is enabled. Adding Solr mbeans to JMX Server: com.sun.jmx.mbeanserver.JmxMBeanServer@d4fdf1
[junit4:junit4]   2> 503 T2362 oasc.SolrCore.initDirectoryFactory org.apache.solr.core.MockDirectoryFactory
[junit4:junit4]   2> 504 T2362 oasc.CachingDirectoryFactory.injectLockFactory WARNING No lockType configured for MockDirWrapper(org.apache.lucene.store.RAMDirectory@168830a lockFactory=org.apache.lucene.store.SingleInstanceLockFactory@730d6d) assuming 'simple'
[junit4:junit4]   2> 504 T2362 oasc.CachingDirectoryFactory.get return new directory for /mnt/ssd/jenkins/workspace/Lucene-Solr-trunk-Linux/solr/build/solr-core/test/J0/./solrtest-TestLazyCores-1354661050146 forceNew:false
[junit4:junit4]   2> 505 T2362 oasc.CachingDirectoryFactory.close Releasing directory:/mnt/ssd/jenkins/workspace/Lucene-Solr-trunk-Linux/solr/build/solr-core/test/J0/./solrtest-TestLazyCores-1354661050146
[junit4:junit4]   2> 505 T2362 oasc.SolrCore.getNewIndexDir New index directory detected: old=null new=/mnt/ssd/jenkins/workspace/Lucene-Solr-trunk-Linux/solr/build/solr-core/test/J0/./solrtest-TestLazyCores-1354661050146/index/
[junit4:junit4]   2> 505 T2362 oasc.SolrCore.initIndex WARNING [collection1] Solr index directory '/mnt/ssd/jenkins/workspace/Lucene-Solr-trunk-Linux/solr/build/solr-core/test/J0/./solrtest-TestLazyCores-1354661050146/index' doesn't exist. Creating new index...
[junit4:junit4]   2> 506 T2362 oasc.CachingDirectoryFactory.get return new directory for /mnt/ssd/jenkins/workspace/Lucene-Solr-trunk-Linux/solr/build/solr-core/test/J0/./solrtest-TestLazyCores-1354661050146/index forceNew:false
[junit4:junit4]   2> 507 T2362 oasc.SolrDeletionPolicy.onCommit SolrDeletionPolicy.onCommit: commits:num=1
[junit4:junit4]   2> 		commit{dir=MockDirWrapper(org.apache.lucene.store.RAMDirectory@6d1e44 lockFactory=org.apache.lucene.store.NativeFSLockFactory@d893b6),segFN=segments_1,generation=1,filenames=[segments_1]
[junit4:junit4]   2> 507 T2362 oasc.SolrDeletionPolicy.updateCommits newest commit = 1[segments_1]
[junit4:junit4]   2> 508 T2362 oasc.CachingDirectoryFactory.close Releasing directory:/mnt/ssd/jenkins/workspace/Lucene-Solr-trunk-Linux/solr/build/solr-core/test/J0/./solrtest-TestLazyCores-1354661050146/index
[junit4:junit4]   2> 508 T2362 oasc.SolrCore.initWriters created xml: solr.XMLResponseWriter
[junit4:junit4]   2> 509 T2362 oasup.UpdateRequestProcessorChain.init inserting DistributedUpdateProcessorFactory into updateRequestProcessorChain "dedupe"
[junit4:junit4]   2> 510 T2362 oasup.UpdateRequestProcessorChain.init inserting DistributedUpdateProcessorFactory into updateRequestProcessorChain "dedupe-allfields"
[junit4:junit4]   2> 510 T2362 oasup.UpdateRequestProcessorChain.init inserting DistributedUpdateProcessorFactory into updateRequestProcessorChain "stored_sig"
[junit4:junit4]   2> 511 T2362 oasup.UpdateRequestProcessorChain.init inserting DistributedUpdateProcessorFactory into updateRequestProcessorChain "uniq-fields"
[junit4:junit4]   2> 511 T2362 oasup.UpdateRequestProcessorChain.init inserting DistributedUpdateProcessorFactory into updateRequestProcessorChain "distrib-dup-test-chain-implicit"
[junit4:junit4]   2> 511 T2362 oasc.RequestHandlers.initHandlersFromConfig adding lazy requestHandler: solr.ReplicationHandler
[junit4:junit4]   2> 512 T2362 oasc.RequestHandlers.initHandlersFromConfig created /replication: solr.ReplicationHandler
[junit4:junit4]   2> 513 T2362 oasc.RequestHandlers.initHandlersFromConfig created standard: solr.StandardRequestHandler
[junit4:junit4]   2> 513 T2362 oasc.RequestHandlers.initHandlersFromConfig created /get: solr.RealTimeGetHandler
[junit4:junit4]   2> 514 T2362 oasc.RequestHandlers.initHandlersFromConfig created dismax: solr.SearchHandler
[junit4:junit4]   2> 515 T2362 oasc.RequestHandlers.initHandlersFromConfig created mock: org.apache.solr.core.MockQuerySenderListenerReqHandler
[junit4:junit4]   2> 516 T2362 oasc.RequestHandlers.initHandlersFromConfig created /admin/: org.apache.solr.handler.admin.AdminHandlers
[junit4:junit4]   2> 516 T2362 oasc.RequestHandlers.initHandlersFromConfig created defaults: solr.StandardRequestHandler
[junit4:junit4]   2> 517 T2362 oasc.RequestHandlers.initHandlersFromConfig adding lazy requestHandler: solr.StandardRequestHandler
[junit4:junit4]   2> 517 T2362 oasc.RequestHandlers.initHandlersFromConfig created lazy: solr.StandardRequestHandler
[junit4:junit4]   2> 518 T2362 oasc.RequestHandlers.initHandlersFromConfig created /update: solr.UpdateRequestHandler
[junit4:junit4]   2> 519 T2362 oasc.RequestHandlers.initHandlersFromConfig created /terms: org.apache.solr.handler.component.SearchHandler
[junit4:junit4]   2> 519 T2362 oasc.RequestHandlers.initHandlersFromConfig created spellCheckCompRH: org.apache.solr.handler.component.SearchHandler
[junit4:junit4]   2> 520 T2362 oasc.RequestHandlers.initHandlersFromConfig created spellCheckCompRH_Direct: org.apache.solr.handler.component.SearchHandler
[junit4:junit4]   2> 521 T2362 oasc.RequestHandlers.initHandlersFromConfig created spellCheckWithWordbreak: org.apache.solr.handler.component.SearchHandler
[junit4:junit4]   2> 522 T2362 oasc.RequestHandlers.initHandlersFromConfig created spellCheckWithWordbreak_Direct: org.apache.solr.handler.component.SearchHandler
[junit4:junit4]   2> 522 T2362 oasc.RequestHandlers.initHandlersFromConfig created spellCheckCompRH1: org.apache.solr.handler.component.SearchHandler
[junit4:junit4]   2> 523 T2362 oasc.RequestHandlers.initHandlersFromConfig created tvrh: org.apache.solr.handler.component.SearchHandler
[junit4:junit4]   2> 524 T2362 oasc.RequestHandlers.initHandlersFromConfig created /mlt: solr.MoreLikeThisHandler
[junit4:junit4]   2> 525 T2362 oasc.RequestHandlers.initHandlersFromConfig created /debug/dump: solr.DumpRequestHandler
[junit4:junit4]   2> 527 T2362 oashl.XMLLoader.init xsltCacheLifetimeSeconds=60
[junit4:junit4]   2> 529 T2362 oasc.SolrCore.initDeprecatedSupport WARNING solrconfig.xml uses deprecated <admin/gettableFiles>, Please update your config to use the ShowFileRequestHandler.
[junit4:junit4]   2> 531 T2362 oasc.SolrCore.initDeprecatedSupport WARNING adding ShowFileRequestHandler with hidden files: [BAD-SOLRCONFIG-INVALID-SCRIPTFILE.XML, SOLRCONFIG-UPDATE-PROCESSOR-CHAINS.XML, BAD-SCHEMA-CURRENCY-FT-MULTIVALUED.XML, MISSLEADING.EXTENSION.UPDATEPROCESSOR.JS.TXT, SCHEMA-SNIPPET-FIELD.XML, XSLT, SOLRCONFIG-MASTER2.XML, SOLRCONFIG-DELPOLICY1.XML, BAD-SOLRCONFIG-MISSING-SCRIPTFILE.XML, SOLRCONFIG-MASTER.XML, SCHEMA-STOP-KEEP.XML, BAD-SCHEMA-CURRENCY-MULTIVALUED.XML, BAD-SCHEMA-NOT-INDEXED-BUT-NORMS.XML, SOLRCONFIG-PROPINJECT.XML, SCHEMA-TFIDF.XML, SCHEMA-SPATIAL.XML, FRENCHARTICLES.TXT, FUZZYSUGGEST.TXT, SCHEMA-NUMERIC.XML, SCHEMA-BM25.XML, MISSING.FUNCTIONS.UPDATEPROCESSOR.JS, SOLRCONFIG_PERF.XML, SOLRCONFIG-CACHING.XML, SOLRCONFIG-SOLCOREPROPERTIES.XML, SCHEMA-SNIPPET-TYPE.XML, COMPOUNDDICTIONARY.TXT, SOLRCONFIG-REQHANDLER.INCL, SCHEMA-PHRASESUGGEST.XML, ELEVATE.XML, SOLRCONFIG-ELEVATE.XML, SCHEMA-REVERSED.XML, SOLRCONFIG-HIGHLIGHT.XML, SOLRCONFIG-DELPOLICY2.XML, SOLRCONFIG-INDEXCONFIG.XML, BAD-SCHEMA-NONTEXT-ANALYZER.XML, SOLRCONFIG-NOCACHE.XML, MAPPING-ISOLATIN1ACCENT.TXT, SOLRCONFIG-LAZYWRITER.XML, BAD-SCHEMA-DUP-FIELDTYPE.XML, SCHEMA-REPLICATION1.XML, SCHEMA-COPYFIELD-TEST.XML, BAD-SCHEMA-SIM-GLOBAL-VS-FT-MISMATCH.XML, SCHEMA15.XML, SCHEMA-BEHAVIOR.XML, SOLRCONFIG-SIMPLELOCK.XML, BAD_SOLRCONFIG.XML, BAD-SCHEMA-UNIQUEKEY-USES-DEFAULT.XML, KEEP-2.TXT, BAD-SCHEMA-NOT-INDEXED-BUT-POS.XML, SCHEMASURROUND.XML, SOLRCONFIG-SCRIPT-UPDATEPROCESSOR.XML, SOLRCONFIG-SNIPPET-PROCESSOR.XML, SOLRCONFIG-TRANSFORMERS.XML, SOLRCONFIG-FUNCTIONQUERY.XML, SCHEMA-SPELLCHECKER.XML, BAD-SCHEMA-DUP-DYNAMICFIELD.XML, THROW.ERROR.ON.ADD.UPDATEPROCESSOR.JS, SOLRCONFIG-QUERYSENDER.XML, SCHEMA-TRIE.XML, SCHEMA-LMJELINEKMERCER.XML, SOLRCONFIG-PROPINJECT-INDEXDEFAULT.XML, SCHEMA-CHARFILTERS.XML, SOLRCONFIG-SPELLCHECKCOMPONENT.XML, SOLRCONFIG-ALTDIRECTORY.XML, SCHEMA-FOLDING.XML, SCHEMA-EFF.XML, SOLRCONFIG-XINCLUDE.XML, SCHEMA-NOT-REQUIRED-UNIQUE-KEY.XML, BAD-SCHEMA-UNIQUEKEY-IS-COPYFIELD-DEST.XML, STEMDICT.TXT, STOPTYPES-1.TXT, SOLRCONFIG-QUERYSENDER-NOQUERY.XML, HUNSPELL-TEST.DIC, SCHEMA-REQUIRED-FIELDS.XML, SOLRCONFIG-ENABLEPLUGIN.XML, SCHEMA.XML, STOPWITHBOM.TXT, SCHEMA-LMDIRICHLET.XML, SYNONYMS.TXT, SOLRCONFIG-MERGEPOLICY.XML, CURRENCY.XML, TRIVIAL.UPDATEPROCESSOR1.JS, SOLRCONFIG-SLAVE.XML, SCHEMA12.XML, STOPTYPES-2.TXT, BAD-SCHEMA-ANALYZER-CLASS-AND-NESTED.XML, BAD-MP-SOLRCONFIG.XML, BAD-SCHEMA-CURRENCY-DYNAMIC-MULTIVALUED.XML, SOLRCONFIG-TERMINDEX.XML, BAD-SCHEMA-EXTERNAL-FILEFIELD.XML, SCHEMA-LUCENEMATCHVERSION.XML, SCHEMA-REPLICATION2.XML, TRIVIAL.UPDATEPROCESSOR0.JS, OLD_SYNONYMS.TXT, PROTWORDS.TXT, BAD-SOLRCONFIG-BOGUS-SCRIPTENGINE-NAME.XML, KEEP-1.TXT, SOLRCONFIG-SLAVE1.XML, SCHEMA-IB.XML, STOP-2.TXT, SCHEMA-MINIMAL.XML, BAD-SCHEMA-UNIQUEKEY-MULTIVALUED.XML, OPEN-EXCHANGE-RATES.JSON, DA_COMPOUNDDICTIONARY.TXT, SCHEMA-DFR.XML, SOLRCONFIG-REPEATER.XML, STOP-1.TXT, SOLRCONFIG-MASTER1.XML, HYPHENATION.DTD, SOLRCONFIG-RESPONSE-LOG-COMPONENT.XML, SOLRCONFIG-BASIC.XML, PHRASESUGGEST.TXT, JASUGGEST.TXT, SCHEMA-SIM.XML, SOLRCONFIG_CODEC.XML, DA_UTF8.XML, BAD-SCHEMA-DUP-FIELD.XML, SOLRCONFIG-PHRASESUGGEST.XML, SOLRCONFIG-TLOG.XML, STOPWORDSWRONGENCODING.TXT, SOLRCONFIG-MASTER1-KEEPONEBACKUP.XML, SOLRCONFIG-SPELLCHECKER.XML, SCHEMA-XINCLUDE.XML, BAD-SCHEMA-NOT-INDEXED-BUT-TF.XML, CONDITIONAL.UPDATEPROCESSOR.JS, SOLRCONFIG-MASTER3.XML, WDFTYPES.TXT, STOPWORDS.TXT, SOLRCONFIG-SOLR-749.XML, SCHEMA-COLLATE.XML, BAD-SCHEMA-OMIT-TF-BUT-NOT-POS.XML, SCHEMA_CODEC.XML, HUNSPELL-TEST.AFF, ADDFIELDS.UPDATEPROCESSOR.JS, SCHEMA11.XML, BAD-SCHEMA-CODEC-GLOBAL-VS-FT-MISMATCH.XML, STOP-SNOWBALL.TXT, SCHEMA-BINARYFIELD.XML, SOLRCONFIG-NATIVELOCK.XML]
[junit4:junit4]   2> 533 T2362 oasc.CachingDirectoryFactory.close Releasing directory:/mnt/ssd/jenkins/workspace/Lucene-Solr-trunk-Linux/solr/build/solr-core/test/J0/./solrtest-TestLazyCores-1354661050146
[junit4:junit4]   2> 533 T2362 oass.SolrIndexSearcher.<init> Opening Searcher@9ecdc7 main
[junit4:junit4]   2> 534 T2362 oasu.CommitTracker.<init> Hard AutoCommit: disabled
[junit4:junit4]   2> 534 T2362 oasu.CommitTracker.<init> Soft AutoCommit: disabled
[junit4:junit4]   2> 534 T2362 oashc.SpellCheckComponent.inform Initializing spell checkers
[junit4:junit4]   2> 538 T2362 oass.DirectSolrSpellChecker.init init: {name=direct,classname=DirectSolrSpellChecker,field=lowerfilt,minQueryLength=3}
[junit4:junit4]   2> 556 T2362 oashc.HttpShardHandlerFactory.getParameter Setting socketTimeout to: 0
[junit4:junit4]   2> 556 T2362 oashc.HttpShardHandlerFactory.getParameter Setting urlScheme to: http://
[junit4:junit4]   2> 557 T2362 oashc.HttpShardHandlerFactory.getParameter Setting connTimeout to: 0
[junit4:junit4]   2> 557 T2362 oashc.HttpShardHandlerFactory.getParameter Setting maxConnectionsPerHost to: 20
[junit4:junit4]   2> 558 T2362 oashc.HttpShardHandlerFactory.getParameter Setting corePoolSize to: 0
[junit4:junit4]   2> 558 T2362 oashc.HttpShardHandlerFactory.getParameter Setting maximumPoolSize to: 2147483647
[junit4:junit4]   2> 558 T2362 oashc.HttpShardHandlerFactory.getParameter Setting maxThreadIdleTime to: 5
[junit4:junit4]   2> 559 T2362 oashc.HttpShardHandlerFactory.getParameter Setting sizeOfQueue to: -1
[junit4:junit4]   2> 559 T2362 oashc.HttpShardHandlerFactory.getParameter Setting fairnessPolicy to: false
[junit4:junit4]   2> 560 T2362 oascsi.HttpClientUtil.createClient Creating new http client, config:maxConnectionsPerHost=20&maxConnections=10000&socketTimeout=0&connTimeout=0&retry=false
[junit4:junit4]   2> 567 T2363 oasc.SolrCore.registerSearcher [collection1] Registered new searcher Searcher@9ecdc7 main{StandardDirectoryReader(segments_1:1)}
[junit4:junit4]   2> 571 T2362 oasc.CoreContainer.registerCore registering core: collection1
[junit4:junit4]   2> 574 T2362 oas.SolrTestCaseJ4.initCore ####initCore end
[junit4:junit4]   2> 577 T2362 oas.SolrTestCaseJ4.setUp ###Starting testCachingLimit
[junit4:junit4]   2> 577 T2362 oasc.SolrResourceLoader.locateSolrHome JNDI not configured for solr (NoInitialContextEx)
[junit4:junit4]   2> 578 T2362 oasc.SolrResourceLoader.locateSolrHome using system property solr.solr.home: /mnt/ssd/jenkins/workspace/Lucene-Solr-trunk-Linux/solr/build/solr-core/test-files/solr
[junit4:junit4]   2> 578 T2362 oasc.CoreContainer.<init> New CoreContainer 26538089
[junit4:junit4]   2> 579 T2362 oasc.CoreContainer.load Loading CoreContainer using Solr Home: '/mnt/ssd/jenkins/workspace/Lucene-Solr-trunk-Linux/solr/build/solr-core/test-files/solr/'
[junit4:junit4]   2> 579 T2362 oasc.SolrResourceLoader.<init> new SolrResourceLoader for directory: '/mnt/ssd/jenkins/workspace/Lucene-Solr-trunk-Linux/solr/build/solr-core/test-files/solr/'
[junit4:junit4]   2> 598 T2362 oasc.CoreContainer.load Registering Log Listener
[junit4:junit4]   2> 611 T2364 oasc.CoreContainer.create Creating SolrCore 'collection1' using instanceDir: /mnt/ssd/jenkins/workspace/Lucene-Solr-trunk-Linux/solr/build/solr-core/test-files/solr/collection1
[junit4:junit4]   2> 612 T2364 oasc.SolrResourceLoader.<init> new SolrResourceLoader for directory: '/mnt/ssd/jenkins/workspace/Lucene-Solr-trunk-Linux/solr/build/solr-core/test-files/solr/collection1/'
[junit4:junit4]   2> 612 T2364 oasc.SolrResourceLoader.replaceClassLoader Adding 'file:/mnt/ssd/jenkins/workspace/Lucene-Solr-trunk-Linux/solr/build/solr-core/test-files/solr/collection1/lib/README' to classloader
[junit4:junit4]   2> 613 T2364 oasc.SolrResourceLoader.replaceClassLoader Adding 'file:/mnt/ssd/jenkins/workspace/Lucene-Solr-trunk-Linux/solr/build/solr-core/test-files/solr/collection1/lib/classes/' to classloader
[junit4:junit4]   2> 614 T2365 oasc.CoreContainer.create Creating SolrCore 'collectionLazy5' using instanceDir: /mnt/ssd/jenkins/workspace/Lucene-Solr-trunk-Linux/solr/build/solr-core/test-files/solr/collection1
[junit4:junit4]   2> 615 T2365 oasc.SolrResourceLoader.<init> new SolrResourceLoader for directory: '/mnt/ssd/jenkins/workspace/Lucene-Solr-trunk-Linux/solr/build/solr-core/test-files/solr/collection1/'
[junit4:junit4]   2> 615 T2365 oasc.SolrResourceLoader.replaceClassLoader Adding 'file:/mnt/ssd/jenkins/workspace/Lucene-Solr-trunk-Linux/solr/build/solr-core/test-files/solr/collection1/lib/README' to classloader
[junit4:junit4]   2> 615 T2365 oasc.SolrResourceLoader.replaceClassLoader Adding 'file:/mnt/ssd/jenkins/workspace/Lucene-Solr-trunk-Linux/solr/build/solr-core/test-files/solr/collection1/lib/classes/' to classloader
[junit4:junit4]   2> 649 T2365 oasc.SolrConfig.<init> Using Lucene MatchVersion: LUCENE_50
[junit4:junit4]   2> 649 T2364 oasc.SolrConfig.<init> Using Lucene MatchVersion: LUCENE_50
[junit4:junit4]   2> 693 T2365 oasc.SolrConfig.<init> Loaded SolrConfig: solrconfig.xml
[junit4:junit4]   2> 694 T2365 oass.IndexSchema.readSchema Reading Solr Schema
[junit4:junit4]   2> 696 T2364 oasc.SolrConfig.<init> Loaded SolrConfig: solrconfig.xml
[junit4:junit4]   2> 696 T2364 oass.IndexSchema.readSchema Reading Solr Schema
[junit4:junit4]   2> 698 T2365 oass.IndexSchema.readSchema Schema name=test
[junit4:junit4]   2> 701 T2364 oass.IndexSchema.readSchema Schema name=test
[junit4:junit4]   2> 1112 T2364 oass.OpenExchangeRatesOrgProvider.init Initialized with rates=open-exchange-rates.json, refreshInterval=1440.
[junit4:junit4]   2> 1112 T2365 oass.OpenExchangeRatesOrgProvider.init Initialized with rates=open-exchange-rates.json, refreshInterval=1440.
[junit4:junit4]   2> 1118 T2364 oass.IndexSchema.readSchema default search field in schema is text
[junit4:junit4]   2> 1118 T2365 oass.IndexSchema.readSchema default search field in schema is text
[junit4:junit4]   2> 1120 T2364 oass.IndexSchema.readSchema unique key field: id
[junit4:junit4]   2> 1121 T2365 oass.IndexSchema.readSchema unique key field: id
[junit4:junit4]   2> 1124 T2364 oass.FileExchangeRateProvider.reload Reloading exchange rates from file currency.xml
[junit4:junit4]   2> 1124 T2365 oass.FileExchangeRateProvider.reload Reloading exchange rates from file currency.xml
[junit4:junit4]   2> 1127 T2365 oass.FileExchangeRateProvider.reload Reloading exchange rates from file currency.xml
[junit4:junit4]   2> 1127 T2364 oass.FileExchangeRateProvider.reload Reloading exchange rates from file currency.xml
[junit4:junit4]   2> 1129 T2364 oass.OpenExchangeRatesOrgProvider.reload Reloading exchange rates from open-exchange-rates.json
[junit4:junit4]   2> 1129 T2365 oass.OpenExchangeRatesOrgProvider.reload Reloading exchange rates from open-exchange-rates.json
[junit4:junit4]   2> 1129 T2364 oass.OpenExchangeRatesOrgProvider.reload Reloading exchange rates from open-exchange-rates.json
[junit4:junit4]   2> 1129 T2365 oass.OpenExchangeRatesOrgProvider.reload Reloading exchange rates from open-exchange-rates.json
[junit4:junit4]   2> 1130 T2364 oasc.SolrCore.<init> [collection1] Opening new SolrCore at /mnt/ssd/jenkins/workspace/Lucene-Solr-trunk-Linux/solr/build/solr-core/test-files/solr/collection1/, dataDir=/mnt/ssd/jenkins/workspace/Lucene-Solr-trunk-Linux/solr/build/solr-core/test-files/solr/collection1/data/
[junit4:junit4]   2> 1130 T2365 oasc.SolrCore.<init> [collectionLazy5] Opening new SolrCore at /mnt/ssd/jenkins/workspace/Lucene-Solr-trunk-Linux/solr/build/solr-core/test-files/solr/collection1/, dataDir=/mnt/ssd/jenkins/workspace/Lucene-Solr-trunk-Linux/solr/build/solr-core/test-files/solr/collection1/data/
[junit4:junit4]   2> 1130 T2364 oasc.JmxMonitoredMap.<init> JMX monitoring is enabled. Adding Solr mbeans to JMX Server: com.sun.jmx.mbeanserver.JmxMBeanServer@d4fdf1
[junit4:junit4]   2> 1130 T2365 oasc.JmxMonitoredMap.<init> JMX monitoring is enabled. Adding Solr mbeans to JMX Server: com.sun.jmx.mbeanserver.JmxMBeanServer@d4fdf1
[junit4:junit4]   2> 1130 T2364 oasc.SolrCore.initDirectoryFactory org.apache.solr.core.MockDirectoryFactory
[junit4:junit4]   2> 1130 T2365 oasc.SolrCore.initDirectoryFactory org.apache.solr.core.MockDirectoryFactory
[junit4:junit4]   2> 1131 T2364 oasc.CachingDirectoryFactory.injectLockFactory WARNING No lockType configured for MockDirWrapper(org.apache.lucene.store.RAMDirectory@29ba61 lockFactory=org.apache.lucene.store.SingleInstanceLockFactory@18b43b2) assuming 'simple'
[junit4:junit4]   2> 1131 T2365 oasc.CachingDirectoryFactory.injectLockFactory WARNING No lockType configured for MockDirWrapper(org.apache.lucene.store.RAMDirectory@9706c lockFactory=org.apache.lucene.store.SingleInstanceLockFactory@1b3fefe) assuming 'simple'
[junit4:junit4]   2> 1134 T2364 oasc.CachingDirectoryFactory.get return new directory for /mnt/ssd/jenkins/workspace/Lucene-Solr-trunk-Linux/solr/build/solr-core/test-files/solr/collection1/data forceNew:false
[junit4:junit4]   2> 1134 T2365 oasc.CachingDirectoryFactory.get return new directory for /mnt/ssd/jenkins/workspace/Lucene-Solr-trunk-Linux/solr/build/solr-core/test-files/solr/collection1/data forceNew:false
[junit4:junit4]   2> 1134 T2364 oasc.CachingDirectoryFactory.close Releasing directory:/mnt/ssd/jenkins/workspace/Lucene-Solr-trunk-Linux/solr/build/solr-core/test-files/solr/collection1/data
[junit4:junit4]   2> 1135 T2365 oasc.CachingDirectoryFactory.close Releasing directory:/mnt/ssd/jenkins/workspace/Lucene-Solr-trunk-Linux/solr/build/solr-core/test-files/solr/collection1/data
[junit4:junit4]   2> 1135 T2364 oasc.SolrCore.getNewIndexDir New index directory detected: old=null new=/mnt/ssd/jenkins/workspace/Lucene-Solr-trunk-Linux/solr/build/solr-core/test-files/solr/collection1/data/index/
[junit4:junit4]   2> 1135 T2365 oasc.SolrCore.getNewIndexDir New index directory detected: old=null new=/mnt/ssd/jenkins/workspace/Lucene-Solr-trunk-Linux/solr/build/solr-core/test-files/solr/collection1/data/index/
[junit4:junit4]   2> 1135 T2364 oasc.SolrCore.initIndex WARNING [collection1] Solr index directory '/mnt/ssd/jenkins/workspace/Lucene-Solr-trunk-Linux/solr/build/solr-core/test-files/solr/collection1/data/index' doesn't exist. Creating new index...
[junit4:junit4]   2> 1135 T2365 oasc.SolrCore.initIndex WARNING [collectionLazy5] Solr index directory '/mnt/ssd/jenkins/workspace/Lucene-Solr-trunk-Linux/solr/build/solr-core/test-files/solr/collection1/data/index' doesn't exist. Creating new index...
[junit4:junit4]   2> 1136 T2364 oasc.CachingDirectoryFactory.get return new directory for /mnt/ssd/jenkins/workspace/Lucene-Solr-trunk-Linux/solr/build/solr-core/test-files/solr/collection1/data/index forceNew:false
[junit4:junit4]   2> 1136 T2365 oasc.CachingDirectoryFactory.get return new directory for /mnt/ssd/jenkins/workspace/Lucene-Solr-trunk-Linux/solr/build/solr-core/test-files/solr/collection1/data/index forceNew:false
[junit4:junit4]   2> 1136 T2365 oasc.CachingDirectoryFactory.close Releasing directory:/mnt/ssd/jenkins/workspace/Lucene-Solr-trunk-Linux/solr/build/solr-core/test-files/solr/collection1/data/index
[junit4:junit4]   2> 1137 T2365 oasc.CachingDirectoryFactory.close Closing directory:/mnt/ssd/jenkins/workspace/Lucene-Solr-trunk-Linux/solr/build/solr-core/test-files/solr/collection1/data/index
[junit4:junit4]   2> 1137 T2364 oasc.SolrDeletionPolicy.onCommit SolrDeletionPolicy.onCommit: commits:num=1
[junit4:junit4]   2> 		commit{dir=MockDirWrapper(org.apache.lucene.store.RAMDirectory@b684c8 lockFactory=org.apache.lucene.store.NativeFSLockFactory@1f9901d),segFN=segments_1,generation=1,filenames=[segments_1]
[junit4:junit4]   2> 1137 T2365 oasc.SolrCore.close [collectionLazy5]  CLOSING SolrCore org.apache.solr.core.SolrCore@68facd
[junit4:junit4]   2> 1137 T2364 oasc.SolrDeletionPolicy.updateCommits newest commit = 1[segments_1]
[junit4:junit4]   2> 1137 T2365 oasc.SolrCore.decrefSolrCoreState Closing SolrCoreState
[junit4:junit4]   2> 1137 T2364 oasc.CachingDirectoryFactory.close Releasing directory:/mnt/ssd/jenkins/workspace/Lucene-Solr-trunk-Linux/solr/build/solr-core/test-files/solr/collection1/data/index
[junit4:junit4]   2> 1137 T2365 oasu.DefaultSolrCoreState.closeIndexWriter SolrCoreState ref count has reached 0 - closing IndexWriter
[junit4:junit4]   2> 1138 T2364 oasc.SolrCore.initWriters created xml: solr.XMLResponseWriter
[junit4:junit4]   2> 1138 T2365 oasc.SolrCore.closeSearcher [collectionLazy5] Closing main searcher on request.
[junit4:junit4]   2> 1138 T2365 oasc.CoreContainer.recordAndThrow SEVERE Unable to create core: collectionLazy5 org.apache.solr.common.SolrException: Cannot create directory: /mnt/ssd/jenkins/workspace/Lucene-Solr-trunk-Linux/solr/build/solr-core/test-files/solr/collection1/data/index
[junit4:junit4]   2> 	at org.apache.solr.core.SolrCore.<init>(SolrCore.java:805)
[junit4:junit4]   2> 	at org.apache.solr.core.SolrCore.<init>(SolrCore.java:618)
[junit4:junit4]   2> 	at org.apache.solr.core.CoreContainer.createFromLocal(CoreContainer.java:973)
[junit4:junit4]   2> 	at org.apache.solr.core.CoreContainer.create(CoreContainer.java:1003)
[junit4:junit4]   2> 	at org.apache.solr.core.CoreContainer$3.call(CoreContainer.java:610)
[junit4:junit4]   2> 	at org.apache.solr.core.CoreContainer$3.call(CoreContainer.java:606)
[junit4:junit4]   2> 	at java.util.concurrent.FutureTask.run(FutureTask.java:262)
[junit4:junit4]   2> 	at java.util.concurrent.Executors$RunnableAdapter.call(Executors.java:471)
[junit4:junit4]   2> 	at java.util.concurrent.FutureTask.run(FutureTask.java:262)
[junit4:junit4]   2> 	at java.util.concurrent.ThreadPoolExecutor.runWorker(ThreadPoolExecutor.java:1110)
[junit4:junit4]   2> 	at java.util.concurrent.ThreadPoolExecutor$Worker.run(ThreadPoolExecutor.java:603)
[junit4:junit4]   2> 	at java.lang.Thread.run(Thread.java:722)
[junit4:junit4]   2> Caused by: java.io.IOException: Cannot create directory: /mnt/ssd/jenkins/workspace/Lucene-Solr-trunk-Linux/solr/build/solr-core/test-files/solr/collection1/data/index
[junit4:junit4]   2> 	at org.apache.lucene.store.NativeFSLock.obtain(NativeFSLockFactory.java:172)
[junit4:junit4]   2> 	at org.apache.lucene.store.MockLockFactoryWrapper$MockLock.obtain(MockLockFactoryWrapper.java:72)
[junit4:junit4]   2> 	at org.apache.lucene.store.Lock.obtain(Lock.java:72)
[junit4:junit4]   2> 	at org.apache.lucene.index.IndexWriter.<init>(IndexWriter.java:608)
[junit4:junit4]   2> 	at org.apache.solr.update.SolrIndexWriter.<init>(SolrIndexWriter.java:75)
[junit4:junit4]   2> 	at org.apache.solr.update.SolrIndexWriter.create(SolrIndexWriter.java:62)
[junit4:junit4]   2> 	at org.apache.solr.core.SolrCore.initIndex(SolrCore.java:502)
[junit4:junit4]   2> 	at org.apache.solr.core.SolrCore.<init>(SolrCore.java:729)
[junit4:junit4]   2> 	... 11 more
[junit4:junit4]   2> 
[junit4:junit4]   2> 1139 T2365 oasc.SolrException.log SEVERE null:org.apache.solr.common.SolrException: Unable to create core: collectionLazy5
[junit4:junit4]   2> 		at org.apache.solr.core.CoreContainer.recordAndThrow(CoreContainer.java:1598)
[junit4:junit4]   2> 		at org.apache.solr.core.CoreContainer.create(CoreContainer.java:1009)
[junit4:junit4]   2> 		at org.apache.solr.core.CoreContainer$3.call(CoreContainer.java:610)
[junit4:junit4]   2> 		at org.apache.solr.core.CoreContainer$3.call(CoreContainer.java:606)
[junit4:junit4]   2> 		at java.util.concurrent.FutureTask.run(FutureTask.java:262)
[junit4:junit4]   2> 		at java.util.concurrent.Executors$RunnableAdapter.call(Executors.java:471)
[junit4:junit4]   2> 		at java.util.concurrent.FutureTask.run(FutureTask.java:262)
[junit4:junit4]   2> 		at java.util.concurrent.ThreadPoolExecutor.runWorker(ThreadPoolExecutor.java:1110)
[junit4:junit4]   2> 		at java.util.concurrent.ThreadPoolExecutor$Worker.run(ThreadPoolExecutor.java:603)
[junit4:junit4]   2> 		at java.lang.Thread.run(Thread.java:722)
[junit4:junit4]   2> 	Caused by: org.apache.solr.common.SolrException: Cannot create directory: /mnt/ssd/jenkins/workspace/Lucene-Solr-trunk-Linux/solr/build/solr-core/test-files/solr/collection1/data/index
[junit4:junit4]   2> 		at org.apache.solr.core.SolrCore.<init>(SolrCore.java:805)
[junit4:junit4]   2> 		at org.apache.solr.core.SolrCore.<init>(SolrCore.java:618)
[junit4:junit4]   2> 		at org.apache.solr.core.CoreContainer.createFromLocal(CoreContainer.java:973)
[junit4:junit4]   2> 		at org.apache.solr.core.CoreContainer.create(CoreContainer.java:1003)
[junit4:junit4]   2> 		... 8 more
[junit4:junit4]   2> 	Caused by: java.io.IOException: Cannot create directory: /mnt/ssd/jenkins/workspace/Lucene-Solr-trunk-Linux/solr/build/solr-core/test-files/solr/collection1/data/index
[junit4:junit4]   2> 		at org.apache.lucene.store.NativeFSLock.obtain(NativeFSLockFactory.java:172)
[junit4:junit4]   2> 		at org.apache.lucene.store.MockLockFactoryWrapper$MockLock.obtain(MockLockFactoryWrapper.java:72)
[junit4:junit4]   2> 		at org.apache.lucene.store.Lock.obtain(Lock.java:72)
[junit4:junit4]   2> 		at org.apache.lucene.index.IndexWriter.<init>(IndexWriter.java:608)
[junit4:junit4]   2> 		at org.apache.solr.update.SolrIndexWriter.<init>(SolrIndexWriter.java:75)
[junit4:junit4]   2> 		at org.apache.solr.update.SolrIndexWriter.create(SolrIndexWriter.java:62)
[junit4:junit4]   2> 		at org.apache.solr.core.SolrCore.initIndex(SolrCore.java:502)
[junit4:junit4]   2> 		at org.apache.solr.core.SolrCore.<init>(SolrCore.java:729)
[junit4:junit4]   2> 		... 11 more
[junit4:junit4]   2> 	
[junit4:junit4]   2> 1139 T2364 oasup.UpdateRequestProcessorChain.init inserting DistributedUpdateProcessorFactory into updateRequestProcessorChain "dedupe"
[junit4:junit4]   2> 1139 T2364 oasup.UpdateRequestProcessorChain.init inserting DistributedUpdateProcessorFactory into updateRequestProcessorChain "dedupe-allfields"
[junit4:junit4]   2> 1140 T2364 oasup.UpdateRequestProcessorChain.init inserting DistributedUpdateProcessorFactory into updateRequestProcessorChain "stored_sig"
[junit4:junit4]   2> 1140 T2364 oasup.UpdateRequestProcessorChain.init inserting DistributedUpdateProcessorFactory into updateRequestProcessorChain "uniq-fields"
[junit4:junit4]   2> 1140 T2364 oasup.UpdateRequestProcessorChain.init inserting DistributedUpdateProcessorFactory into updateRequestProcessorChain "distrib-dup-test-chain-implicit"
[junit4:junit4]   2> 1141 T2364 oasc.RequestHandlers.initHandlersFromConfig adding lazy requestHandler: solr.ReplicationHandler
[junit4:junit4]   2> 1141 T2364 oasc.RequestHandlers.initHandlersFromConfig created /replication: solr.ReplicationHandler
[junit4:junit4]   2> 1142 T2364 oasc.RequestHandlers.initHandlersFromConfig created standard: solr.StandardRequestHandler
[junit4:junit4]   2> 1142 T2364 oasc.RequestHandlers.initHandlersFromConfig created /get: solr.RealTimeGetHandler
[junit4:junit4]   2> 1143 T2364 oasc.RequestHandlers.initHandlersFromConfig created dismax: solr.SearchHandler
[junit4:junit4]   2> 1144 T2364 oasc.RequestHandlers.initHandlersFromConfig created mock: org.apache.solr.core.MockQuerySenderListenerReqHandler
[junit4:junit4]   2> 1144 T2364 oasc.RequestHandlers.initHandlersFromConfig created /admin/: org.apache.solr.handler.admin.AdminHandlers
[junit4:junit4]   2> 1145 T2364 oasc.RequestHandlers.initHandlersFromConfig created defaults: solr.StandardRequestHandler
[junit4:junit4]   2> 1145 T2364 oasc.RequestHandlers.initHandlersFromConfig adding lazy requestHandler: solr.StandardRequestHandler
[junit4:junit4]   2> 1145 T2364 oasc.RequestHandlers.initHandlersFromConfig created lazy: solr.StandardRequestHandler
[junit4:junit4]   2> 1146 T2364 oasc.RequestHandlers.initHandlersFromConfig created /update: solr.UpdateRequestHandler
[junit4:junit4]   2> 1147 T2364 oasc.RequestHandlers.initHandlersFromConfig created /terms: org.apache.solr.handler.component.SearchHandler
[junit4:junit4]   2> 1148 T2364 oasc.RequestHandlers.initHandlersFromConfig created spellCheckCompRH: org.apache.solr.handler.component.SearchHandler
[junit4:junit4]   2> 1148 T2364 oasc.RequestHandlers.initHandlersFromConfig created spellCheckCompRH_Direct: org.apache.solr.handler.component.SearchHandler
[junit4:junit4]   2> 1149 T2364 oasc.RequestHandlers.initHandlersFromConfig created spellCheckWithWordbreak: org.apache.solr.handler.component.SearchHandler
[junit4:junit4]   2> 1150 T2364 oasc.RequestHandlers.initHandlersFromConfig created spellCheckWithWordbreak_Direct: org.apache.solr.handler.component.SearchHandler
[junit4:junit4]   2> 1150 T2364 oasc.RequestHandlers.initHandlersFromConfig created spellCheckCompRH1: org.apache.solr.handler.component.SearchHandler
[junit4:junit4]   2> 1151 T2364 oasc.RequestHandlers.initHandlersFromConfig created tvrh: org.apache.solr.handler.component.SearchHandler
[junit4:junit4]   2> 1152 T2364 oasc.RequestHandlers.initHandlersFromConfig created /mlt: solr.MoreLikeThisHandler
[junit4:junit4]   2> 1153 T2364 oasc.RequestHandlers.initHandlersFromConfig created /debug/dump: solr.DumpRequestHandler
[junit4:junit4]   2> 1155 T2364 oashl.XMLLoader.init xsltCacheLifetimeSeconds=60
[junit4:junit4]   2> 1157 T2364 oasc.SolrCore.initDeprecatedSupport WARNING solrconfig.xml uses deprecated <admin/gettableFiles>, Please update your config to use the ShowFileRequestHandler.
[junit4:junit4]   2> 1158 T2364 oasc.SolrCore.initDeprecatedSupport WARNING adding ShowFileRequestHandler with hidden files: [BAD-SOLRCONFIG-INVALID-SCRIPTFILE.XML, SOLRCONFIG-UPDATE-PROCESSOR-CHAINS.XML, BAD-SCHEMA-CURRENCY-FT-MULTIVALUED.XML, MISSLEADING.EXTENSION.UPDATEPROCESSOR.JS.TXT, SCHEMA-SNIPPET-FIELD.XML, XSLT, SOLRCONFIG-MASTER2.XML, SOLRCONFIG-DELPOLICY1.XML, BAD-SOLRCONFIG-MISSING-SCRIPTFILE.XML, SOLRCONFIG-MASTER.XML, SCHEMA-STOP-KEEP.XML, BAD-SCHEMA-CURRENCY-MULTIVALUED.XML, BAD-SCHEMA-NOT-INDEXED-BUT-NORMS.XML, SOLRCONFIG-PROPINJECT.XML, SCHEMA-TFIDF.XML, SCHEMA-SPATIAL.XML, FRENCHARTICLES.TXT, FUZZYSUGGEST.TXT, SCHEMA-NUMERIC.XML, SCHEMA-BM25.XML, MISSING.FUNCTIONS.UPDATEPROCESSOR.JS, SOLRCONFIG_PERF.XML, SOLRCONFIG-CACHING.XML, SOLRCONFIG-SOLCOREPROPERTIES.XML, SCHEMA-SNIPPET-TYPE.XML, COMPOUNDDICTIONARY.TXT, SOLRCONFIG-REQHANDLER.INCL, SCHEMA-PHRASESUGGEST.XML, ELEVATE.XML, SOLRCONFIG-ELEVATE.XML, SCHEMA-REVERSED.XML, SOLRCONFIG-HIGHLIGHT.XML, SOLRCONFIG-DELPOLICY2.XML, SOLRCONFIG-INDEXCONFIG.XML, BAD-SCHEMA-NONTEXT-ANALYZER.XML, SOLRCONFIG-NOCACHE.XML, MAPPING-ISOLATIN1ACCENT.TXT, SOLRCONFIG-LAZYWRITER.XML, BAD-SCHEMA-DUP-FIELDTYPE.XML, SCHEMA-REPLICATION1.XML, SCHEMA-COPYFIELD-TEST.XML, BAD-SCHEMA-SIM-GLOBAL-VS-FT-MISMATCH.XML, SCHEMA15.XML, SCHEMA-BEHAVIOR.XML, SOLRCONFIG-SIMPLELOCK.XML, BAD_SOLRCONFIG.XML, BAD-SCHEMA-UNIQUEKEY-USES-DEFAULT.XML, KEEP-2.TXT, BAD-SCHEMA-NOT-INDEXED-BUT-POS.XML, SCHEMASURROUND.XML, SOLRCONFIG-SCRIPT-UPDATEPROCESSOR.XML, SOLRCONFIG-SNIPPET-PROCESSOR.XML, SOLRCONFIG-TRANSFORMERS.XML, SOLRCONFIG-FUNCTIONQUERY.XML, SCHEMA-SPELLCHECKER.XML, BAD-SCHEMA-DUP-DYNAMICFIELD.XML, THROW.ERROR.ON.ADD.UPDATEPROCESSOR.JS, SOLRCONFIG-QUERYSENDER.XML, SCHEMA-TRIE.XML, SCHEMA-LMJELINEKMERCER.XML, SOLRCONFIG-PROPINJECT-INDEXDEFAULT.XML, SCHEMA-CHARFILTERS.XML, SOLRCONFIG-SPELLCHECKCOMPONENT.XML, SOLRCONFIG-ALTDIRECTORY.XML, SCHEMA-FOLDING.XML, SCHEMA-EFF.XML, SOLRCONFIG-XINCLUDE.XML, SCHEMA-NOT-REQUIRED-UNIQUE-KEY.XML, BAD-SCHEMA-UNIQUEKEY-IS-COPYFIELD-DEST.XML, STEMDICT.TXT, STOPTYPES-1.TXT, SOLRCONFIG-QUERYSENDER-NOQUERY.XML, HUNSPELL-TEST.DIC, SCHEMA-REQUIRED-FIELDS.XML, SOLRCONFIG-ENABLEPLUGIN.XML, SCHEMA.XML, STOPWITHBOM.TXT, SCHEMA-LMDIRICHLET.XML, SYNONYMS.TXT, SOLRCONFIG-MERGEPOLICY.XML, CURRENCY.XML, TRIVIAL.UPDATEPROCESSOR1.JS, SOLRCONFIG-SLAVE.XML, SCHEMA12.XML, STOPTYPES-2.TXT, BAD-SCHEMA-ANALYZER-CLASS-AND-NESTED.XML, BAD-MP-SOLRCONFIG.XML, BAD-SCHEMA-CURRENCY-DYNAMIC-MULTIVALUED.XML, SOLRCONFIG-TERMINDEX.XML, BAD-SCHEMA-EXTERNAL-FILEFIELD.XML, SCHEMA-LUCENEMATCHVERSION.XML, SCHEMA-REPLICATION2.XML, TRIVIAL.UPDATEPROCESSOR0.JS, OLD_SYNONYMS.TXT, PROTWORDS.TXT, BAD-SOLRCONFIG-BOGUS-SCRIPTENGINE-NAME.XML, KEEP-1.TXT, SOLRCONFIG-SLAVE1.XML, SCHEMA-IB.XML, STOP-2.TXT, SCHEMA-MINIMAL.XML, BAD-SCHEMA-UNIQUEKEY-MULTIVALUED.XML, OPEN-EXCHANGE-RATES.JSON, DA_COMPOUNDDICTIONARY.TXT, SCHEMA-DFR.XML, SOLRCONFIG-REPEATER.XML, STOP-1.TXT, SOLRCONFIG-MASTER1.XML, HYPHENATION.DTD, SOLRCONFIG-RESPONSE-LOG-COMPONENT.XML, SOLRCONFIG-BASIC.XML, PHRASESUGGEST.TXT, JASUGGEST.TXT, SCHEMA-SIM.XML, SOLRCONFIG_CODEC.XML, DA_UTF8.XML, BAD-SCHEMA-DUP-FIELD.XML, SOLRCONFIG-PHRASESUGGEST.XML, SOLRCONFIG-TLOG.XML, STOPWORDSWRONGENCODING.TXT, SOLRCONFIG-MASTER1-KEEPONEBACKUP.XML, SOLRCONFIG-SPELLCHECKER.XML, SCHEMA-XINCLUDE.XML, BAD-SCHEMA-NOT-INDEXED-BUT-TF.XML, CONDITIONAL.UPDATEPROCESSOR.JS, SOLRCONFIG-MASTER3.XML, WDFTYPES.TXT, STOPWORDS.TXT, SOLRCONFIG-SOLR-749.XML, SCHEMA-COLLATE.XML, BAD-SCHEMA-OMIT-TF-BUT-NOT-POS.XML, SCHEMA_CODEC.XML, HUNSPELL-TEST.AFF, ADDFIELDS.UPDATEPROCESSOR.JS, SCHEMA11.XML, BAD-SCHEMA-CODEC-GLOBAL-VS-FT-MISMATCH.XML, STOP-SNOWBALL.TXT, SCHEMA-BINARYFIELD.XML, SOLRCONFIG-NATIVELOCK.XML]
[junit4:junit4]   2> 1160 T2364 oasc.CachingDirectoryFactory.close Releasing directory:/mnt/ssd/jenkins/workspace/Lucene-Solr-trunk-Linux/solr/build/solr-core/test-files/solr/collection1/data
[junit4:junit4]   2> 1160 T2364 oass.SolrIndexSearcher.<init> Opening Searcher@cf75c1 main
[junit4:junit4]   2> 1161 T2364 oasu.CommitTracker.<init> Hard AutoCommit: disabled
[junit4:junit4]   2> 1161 T2364 oasu.CommitTracker.<init> Soft AutoCommit: disabled
[junit4:junit4]   2> 1161 T2364 oashc.SpellCheckComponent.inform Initializing spell checkers
[junit4:junit4]   2> 1165 T2364 oass.DirectSolrSpellChecker.init init: {name=direct,classname=DirectSolrSpellChecker,field=lowerfilt,minQueryLength=3}
[junit4:junit4]   2> 1179 T2364 oashc.HttpShardHandlerFactory.getParameter Setting socketTimeout to: 0
[junit4:junit4]   2> 1179 T2364 oashc.HttpShardHandlerFactory.getParameter Setting urlScheme to: http://
[junit4:junit4]   2> 1179 T2364 oashc.HttpShardHandlerFactory.getParameter Setting connTimeout to: 0
[junit4:junit4]   2> 1179 T2364 oashc.HttpShardHandlerFactory.getParameter Setting maxConnectionsPerHost to: 20
[junit4:junit4]   2> 1180 T2364 oashc.HttpShardHandlerFactory.getParameter Setting corePoolSize to: 0
[junit4:junit4]   2> 1180 T2364 oashc.HttpShardHandlerFactory.getParameter Setting maximumPoolSize to: 2147483647
[junit4:junit4]   2> 1180 T2364 oashc.HttpShardHandlerFactory.getParameter Setting maxThreadIdleTime to: 5
[junit4:junit4]   2> 1180 T2364 oashc.HttpShardHandlerFactory.getParameter Setting sizeOfQueue to: -1
[junit4:junit4]   2> 1181 T2364 oashc.HttpShardHandlerFactory.getParameter Setting fairnessPolicy to: false
[junit4:junit4]   2> 1181 T2364 oascsi.HttpClientUtil.createClient Creating new http client, config:maxConnectionsPerHost=20&maxConnections=10000&socketTimeout=0&connTimeout=0&retry=false
[junit4:junit4]   2> 1190 T2366 oasc.SolrCore.registerSearcher [collection1] Registered new searcher Searcher@cf75c1 main{StandardDirectoryReader(segments_1:1)}
[junit4:junit4]   2> 1194 T2364 oasc.CoreContainer.registerCore registering core: collection1
[junit4:junit4]   2> 1195 T2362 oasc.CoreContainer.create Creating SolrCore 'collectionLazy3' using instanceDir: /mnt/ssd/jenkins/workspace/Lucene-Solr-trunk-Linux/solr/build/solr-core/test-files/solr/collection1
[junit4:junit4]   2> 1196 T2362 oasc.SolrResourceLoader.<init> new SolrResourceLoader for directory: '/mnt/ssd/jenkins/workspace/Lucene-Solr-trunk-Linux/solr/build/solr-core/test-files/solr/collection1/'
[junit4:junit4]   2> 1197 T2362 oasc.SolrResourceLoader.replaceClassLoader Adding 'file:/mnt/ssd/jenkins/workspace/Lucene-Solr-trunk-Linux/solr/build/solr-core/test-files/solr/collection1/lib/README' to classloader
[junit4:junit4]   2> 1197 T2362 oasc.SolrResourceLoader.replaceClassLoader Adding 'file:/mnt/ssd/jenkins/workspace/Lucene-Solr-trunk-Linux/solr/build/solr-core/test-files/solr/collection1/lib/classes/' to classloader
[junit4:junit4]   2> 1249 T2362 oasc.SolrConfig.<init> Using Lucene MatchVersion: LUCENE_50
[junit4:junit4]   2> 1318 T2362 oasc.SolrConfig.<init> Loaded SolrConfig: solrconfig.xml
[junit4:junit4]   2> 1319 T2362 oass.IndexSchema.readSchema Reading Solr Schema
[junit4:junit4]   2> 1327 T2362 oass.IndexSchema.readSchema Schema name=test
[junit4:junit4]   2> 1767 T2362 oass.OpenExchangeRatesOrgProvider.init Initialized with rates=open-exchange-rates.json, refreshInterval=1440.
[junit4:junit4]   2> 1773 T2362 oass.IndexSchema.readSchema default search field in schema is text
[junit4:junit4]   2> 1776 T2362 oass.IndexSchema.readSchema unique key field: id
[junit4:junit4]   2> 1781 T2362 oass.FileExchangeRateProvider.reload Reloading exchange rates from file currency.xml
[junit4:junit4]   2> 1783 T2362 oass.FileExchangeRateProvider.reload Reloading exchange rates from file currency.xml
[junit4:junit4]   2> 1786 T2362 oass.OpenExchangeRatesOrgProvider.reload Reloading exchange rates from open-exchange-rates.json
[junit4:junit4]   2> 1786 T2362 oass.OpenExchangeRatesOrgProvider.reload Reloading exchange rates from open-exchange-rates.json
[junit4:junit4]   2> 1787 T2362 oasc.SolrCore.<init> [collectionLazy3] Opening new SolrCore at /mnt/ssd/jenkins/workspace/Lucene-Solr-trunk-Linux/solr/build/solr-core/test-files/solr/collection1/, dataDir=/mnt/ssd/jenkins/workspace/Lucene-Solr-trunk-Linux/solr/build/solr-core/test-files/solr/collection1/data/
[junit4:junit4]   2> 1787 T2362 oasc.JmxMonitoredMap.<init> JMX monitoring is enabled. Adding Solr mbeans to JMX Server: com.sun.jmx.mbeanserver.JmxMBeanServer@d4fdf1
[junit4:junit4]   2> 1788 T2362 oasc.SolrCore.initDirectoryFactory org.apache.solr.core.MockDirectoryFactory
[junit4:junit4]   2> 1789 T2362 oasc.CachingDirectoryFactory.injectLockFactory WARNING No lockType configured for MockDirWrapper(org.apache.lucene.store.RAMDirectory@9b1d36 lockFactory=org.apache.lucene.store.SingleInstanceLockFactory@19ada14) assuming 'simple'
[junit4:junit4]   2> 1789 T2362 oasc.CachingDirectoryFactory.get return new directory for /mnt/ssd/jenkins/workspace/Lucene-Solr-trunk-Linux/solr/build/solr-core/test-files/solr/collection1/data forceNew:false
[junit4:junit4]   2> 1789 T2362 oasc.CachingDirectoryFactory.close Releasing directory:/mnt/ssd/jenkins/workspace/Lucene-Solr-trunk-Linux/solr/build/solr-core/test-files/solr/collection1/data
[junit4:junit4]   2> 1790 T2362 oasc.SolrCore.getNewIndexDir New index directory detected: old=null new=/mnt/ssd/jenkins/workspace/Lucene-Solr-trunk-Linux/solr/build/solr-core/test-files/solr/collection1/data/index/
[junit4:junit4]   2> 1790 T2362 oasc.SolrCore.initIndex WARNING [collectionLazy3] Solr index directory '/mnt/ssd/jenkins/workspace/Lucene-Solr-trunk-Linux/solr/build/solr-core/test-files/solr/collection1/data/index' doesn't exist. Creating new index...
[junit4:junit4]   2> 1791 T2362 oasc.CachingDirectoryFactory.get return new directory for /mnt/ssd/jenkins/workspace/Lucene-Solr-trunk-Linux/solr/build/solr-core/test-files/solr/collection1/data/index forceNew:false
[junit4:junit4]   2> 1792 T2362 oasc.SolrDeletionPolicy.onCommit SolrDeletionPolicy.onCommit: commits:num=1
[junit4:junit4]   2> 		commit{dir=MockDirWrapper(org.apache.lucene.store.RAMDirectory@189df7c lockFactory=org.apache.lucene.store.NativeFSLockFactory@a704ac),segFN=segments_1,generation=1,filenames=[segments_1]
[junit4:junit4]   2> 1792 T2362 oasc.SolrDeletionPolicy.updateCommits newest commit = 1[segments_1]
[junit4:junit4]   2> 1793 T2362 oasc.CachingDirectoryFactory.close Releasing directory:/mnt/ssd/jenkins/workspace/Lucene-Solr-trunk-Linux/solr/build/solr-core/test-files/solr/collection1/data/index
[junit4:junit4]   2> 1793 T2362 oasc.SolrCore.initWriters created xml: solr.XMLResponseWriter
[junit4:junit4]   2> 1794 T2362 oasup.UpdateRequestProcessorChain.init inserting DistributedUpdateProcessorFactory into updateRequestProcessorChain "dedupe"
[junit4:junit4]   2> 1795 T2362 oasup.UpdateRequestProcessorChain.init inserting DistributedUpdateProcessorFactory into updateRequestProcessorChain "dedupe-allfields"
[junit4:junit4]   2> 1795 T2362 oasup.UpdateRequestProcessorChain.init inserting DistributedUpdateProcessorFactory into updateRequestProcessorChain "stored_sig"
[junit4:junit4]   2> 1796 T2362 oasup.UpdateRequestProcessorChain.init inserting DistributedUpdateProcessorFactory into updateRequestProcessorChain "uniq-fields"
[junit4:junit4]   2> 1796 T2362 oasup.UpdateRequestProcessorChain.init inserting DistributedUpdateProcessorFactory into updateRequestProcessorChain "distrib-dup-test-chain-implicit"
[junit4:junit4]   2> 1797 T2362 oasc.RequestHandlers.initHandlersFromConfig adding lazy requestHandler: solr.ReplicationHandler
[junit4:junit4]   2> 1797 T2362 oasc.RequestHandlers.initHandlersFromConfig created /replication: solr.ReplicationHandler
[junit4:junit4]   2> 1798 T2362 oasc.RequestHandlers.initHandlersFromConfig created standard: solr.StandardRequestHandler
[junit4:junit4]   2> 1799 T2362 oasc.RequestHandlers.initHandlersFromConfig created /get: solr.RealTimeGetHandler
[junit4:junit4]   2> 1800 T2362 oasc.RequestHandlers.initHandlersFromConfig created dismax: solr.SearchHandler
[junit4:junit4]   2> 1800 T2362 oasc.RequestHandlers.initHandlersFromConfig created mock: org.apache.solr.core.MockQuerySenderListenerReqHandler
[junit4:junit4]   2> 1801 T2362 oasc.RequestHandlers.initHandlersFromConfig created /admin/: org.apache.solr.handler.admin.AdminHandlers
[junit4:junit4]   2> 1802 T2362 oasc.RequestHandlers.initHandlersFromConfig created defaults: solr.StandardRequestHandler
[junit4:junit4]   2> 1802 T2362 oasc.RequestHandlers.initHandlersFromConfig adding lazy requestHandler: solr.StandardRequestHandler
[junit4:junit4]   2> 1802 T2362 oasc.RequestHandlers.initHandlersFromConfig created lazy: solr.StandardRequestHandler
[junit4:junit4]   2> 1803 T2362 oasc.RequestHandlers.initHandlersFromConfig created /update: solr.UpdateRequestHandler
[junit4:junit4]   2> 1804 T2362 oasc.RequestHandlers.initHandlersFromConfig created /terms: org.apache.solr.handler.component.SearchHandler
[junit4:junit4]   2> 1805 T2362 oasc.RequestHandlers.initHandlersFromConfig created spellCheckCompRH: org.apache.solr.handler.component.SearchHandler
[junit4:junit4]   2> 1805 T2362 oasc.RequestHandlers.initHandlersFromConfig created spellCheckCompRH_Direct: org.apache.solr.handler.component.SearchHandler
[junit4:junit4]   2> 1806 T2362 oasc.RequestHandlers.initHandlersFromConfig created spellCheckWithWordbreak: org.apache.solr.handler.component.SearchHandler
[junit4:junit4]   2> 1807 T2362 oasc.RequestHandlers.initHandlersFromConfig created spellCheckWithWordbreak_Direct: org.apache.solr.handler.component.SearchHandler
[junit4:junit4]   2> 1808 T2362 oasc.RequestHandlers.initHandlersFromConfig created spellCheckCompRH1: org.apache.solr.handler.component.SearchHandler
[junit4:junit4]   2> 1809 T2362 oasc.RequestHandlers.initHandlersFromConfig created tvrh: org.apache.solr.handler.component.SearchHandler
[junit4:junit4]   2> 1809 T2362 oasc.RequestHandlers.initHandlersFromConfig created /mlt: solr.MoreLikeThisHandler
[junit4:junit4]   2> 1810 T2362 oasc.RequestHandlers.initHandlersFromConfig created /debug/dump: solr.DumpRequestHandler
[junit4:junit4]   2> 1813 T2362 oashl.XMLLoader.init xsltCacheLifetimeSeconds=60
[junit4:junit4]   2> 1814 T2362 oasc.SolrCore.initDeprecatedSupport WARNING solrconfig.xml uses deprecated <admin/gettableFiles>, Please update your config to use the ShowFileRequestHandler.
[junit4:junit4]   2> 1816 T2362 oasc.SolrCore.initDeprecatedSupport WARNING adding ShowFileRequestHandler with hidden files: [BAD-SOLRCONFIG-INVALID-SCRIPTFILE.XML, SOLRCONFIG-UPDATE-PROCESSOR-CHAINS.XML, BAD-SCHEMA-CURRENCY-FT-MULTIVALUED.XML, MISSLEADING.EXTENSION.UPDATEPROCESSOR.JS.TXT, SCHEMA-SNIPPET-FIELD.XML, XSLT, SOLRCONFIG-MASTER2.XML, SOLRCONFIG-DELPOLICY1.XML, BAD-SOLRCONFIG-MISSING-SCRIPTFILE.XML, SOLRCONFIG-MASTER.XML, SCHEMA-STOP-KEEP.XML, BAD-SCHEMA-CURRENCY-MULTIVALUED.XML, BAD-SCHEMA-NOT-INDEXED-BUT-NORMS.XML, SOLRCONFIG-PROPINJECT.XML, SCHEMA-TFIDF.XML, SCHEMA-SPATIAL.XML, FRENCHARTICLES.TXT, FUZZYSUGGEST.TXT, SCHEMA-NUMERIC.XML, SCHEMA-BM25.XML, MISSING.FUNCTIONS.UPDATEPROCESSOR.JS, SOLRCONFIG_PERF.XML, SOLRCONFIG-CACHING.XML, SOLRCONFIG-SOLCOREPROPERTIES.XML, SCHEMA-SNIPPET-TYPE.XML, COMPOUNDDICTIONARY.TXT, SOLRCONFIG-REQHANDLER.INCL, SCHEMA-PHRASESUGGEST.XML, ELEVATE.XML, SOLRCONFIG-ELEVATE.XML, SCHEMA-REVERSED.XML, SOLRCONFIG-HIGHLIGHT.XML, SOLRCONFIG-DELPOLICY2.XML, SOLRCONFIG-INDEXCONFIG.XML, BAD-SCHEMA-NONTEXT-ANALYZER.XML, SOLRCONFIG-NOCACHE.XML, MAPPING-ISOLATIN1ACCENT.TXT, SOLRCONFIG-LAZYWRITER.XML, BAD-SCHEMA-DUP-FIELDTYPE.XML, SCHEMA-REPLICATION1.XML, SCHEMA-COPYFIELD-TEST.XML, BAD-SCHEMA-SIM-GLOBAL-VS-FT-MISMATCH.XML, SCHEMA15.XML, SCHEMA-BEHAVIOR.XML, SOLRCONFIG-SIMPLELOCK.XML, BAD_SOLRCONFIG.XML, BAD-SCHEMA-UNIQUEKEY-USES-DEFAULT.XML, KEEP-2.TXT, BAD-SCHEMA-NOT-INDEXED-BUT-POS.XML, SCHEMASURROUND.XML, SOLRCONFIG-SCRIPT-UPDATEPROCESSOR.XML, SOLRCONFIG-SNIPPET-PROCESSOR.XML, SOLRCONFIG-TRANSFORMERS.XML, SOLRCONFIG-FUNCTIONQUERY.XML, SCHEMA-SPELLCHECKER.XML, BAD-SCHEMA-DUP-DYNAMICFIELD.XML, THROW.ERROR.ON.ADD.UPDATEPROCESSOR.JS, SOLRCONFIG-QUERYSENDER.XML, SCHEMA-TRIE.XML, SCHEMA-LMJELINEKMERCER.XML, SOLRCONFIG-PROPINJECT-INDEXDEFAULT.XML, SCHEMA-CHARFILTERS.XML, SOLRCONFIG-SPELLCHECKCOMPONENT.XML, SOLRCONFIG-ALTDIRECTORY.XML, SCHEMA-FOLDING.XML, SCHEMA-EFF.XML, SOLRCONFIG-XINCLUDE.XML, SCHEMA-NOT-REQUIRED-UNIQUE-KEY.XML, BAD-SCHEMA-UNIQUEKEY-IS-COPYFIELD-DEST.XML, STEMDICT.TXT, STOPTYPES-1.TXT, SOLRCONFIG-QUERYSENDER-NOQUERY.XML, HUNSPELL-TEST.DIC, SCHEMA-REQUIRED-FIELDS.XML, SOLRCONFIG-ENABLEPLUGIN.XML, SCHEMA.XML, STOPWITHBOM.TXT, SCHEMA-LMDIRICHLET.XML, SYNONYMS.TXT, SOLRCONFIG-MERGEPOLICY.XML, CURRENCY.XML, TRIVIAL.UPDATEPROCESSOR1.JS, SOLRCONFIG-SLAVE.XML, SCHEMA12.XML, STOPTYPES-2.TXT, BAD-SCHEMA-ANALYZER-CLASS-AND-NESTED.XML, BAD-MP-SOLRCONFIG.XML, BAD-SCHEMA-CURRENCY-DYNAMIC-MULTIVALUED.XML, SOLRCONFIG-TERMINDEX.XML, BAD-SCHEMA-EXTERNAL-FILEFIELD.XML, SCHEMA-LUCENEMATCHVERSION.XML, SCHEMA-REPLICATION2.XML, TRIVIAL.UPDATEPROCESSOR0.JS, OLD_SYNONYMS.TXT, PROTWORDS.TXT, BAD-SOLRCONFIG-BOGUS-SCRIPTENGINE-NAME.XML, KEEP-1.TXT, SOLRCONFIG-SLAVE1.XML, SCHEMA-IB.XML, STOP-2.TXT, SCHEMA-MINIMAL.XML, BAD-SCHEMA-UNIQUEKEY-MULTIVALUED.XML, OPEN-EXCHANGE-RATES.JSON, DA_COMPOUNDDICTIONARY.TXT, SCHEMA-DFR.XML, SOLRCONFIG-REPEATER.XML, STOP-1.TXT, SOLRCONFIG-MASTER1.XML, HYPHENATION.DTD, SOLRCONFIG-RESPONSE-LOG-COMPONENT.XML, SOLRCONFIG-BASIC.XML, PHRASESUGGEST.TXT, JASUGGEST.TXT, SCHEMA-SIM.XML, SOLRCONFIG_CODEC.XML, DA_UTF8.XML, BAD-SCHEMA-DUP-FIELD.XML, SOLRCONFIG-PHRASESUGGEST.XML, SOLRCONFIG-TLOG.XML, STOPWORDSWRONGENCODING.TXT, SOLRCONFIG-MASTER1-KEEPONEBACKUP.XML, SOLRCONFIG-SPELLCHECKER.XML, SCHEMA-XINCLUDE.XML, BAD-SCHEMA-NOT-INDEXED-BUT-TF.XML, CONDITIONAL.UPDATEPROCESSOR.JS, SOLRCONFIG-MASTER3.XML, WDFTYPES.TXT, STOPWORDS.TXT, SOLRCONFIG-SOLR-749.XML, SCHEMA-COLLATE.XML, BAD-SCHEMA-OMIT-TF-BUT-NOT-POS.XML, SCHEMA_CODEC.XML, HUNSPELL-TEST.AFF, ADDFIELDS.UPDATEPROCESSOR.JS, SCHEMA11.XML, BAD-SCHEMA-CODEC-GLOBAL-VS-FT-MISMATCH.XML, STOP-SNOWBALL.TXT, SCHEMA-BINARYFIELD.XML, SOLRCONFIG-NATIVELOCK.XML]
[junit4:junit4]   2> 1818 T2362 oasc.CachingDirectoryFactory.close Releasing directory:/mnt/ssd/jenkins/workspace/Lucene-Solr-trunk-Linux/solr/build/solr-core/test-files/solr/collection1/data
[junit4:junit4]   2> 1818 T2362 oass.SolrIndexSearcher.<init> Opening Searcher@1990515 main
[junit4:junit4]   2> 1819 T2362 oasu.CommitTracker.<init> Hard AutoCommit: disabled
[junit4:junit4]   2> 1819 T2362 oasu.CommitTracker.<init> Soft AutoCommit: disabled
[junit4:junit4]   2> 1820 T2362 oashc.SpellCheckComponent.inform Initializing spell checkers
[junit4:junit4]   2> 1821 T2362 oass.DirectSolrSpellChecker.init init: {name=direct,classname=DirectSolrSpellChecker,field=lowerfilt,minQueryLength=3}
[junit4:junit4]   2> 1832 T2367 oasc.SolrCore.registerSearcher [collectionLazy3] Registered new searcher Searcher@1990515 main{StandardDirectoryReader(segments_1:1)}
[junit4:junit4]   2> 1835 T2362 oasc.CoreContainer.registerCore registering core: collectionLazy3
[junit4:junit4]   2> 1836 T2362 oasc.CoreContainer.create Creating SolrCore 'collectionLazy4' using instanceDir: /mnt/ssd/jenkins/workspace/Lucene-Solr-trunk-Linux/solr/build/solr-core/test-files/solr/collection1
[junit4:junit4]   2> 1836 T2362 oasc.SolrResourceLoader.<init> new SolrResourceLoader for directory: '/mnt/ssd/jenkins/workspace/Lucene-Solr-trunk-Linux/solr/build/solr-core/test-files/solr/collection1/'
[junit4:junit4]   2> 1837 T2362 oasc.SolrResourceLoader.replaceClassLoader Adding 'file:/mnt/ssd/jenkins/workspace/Lucene-Solr-trunk-Linux/solr/build/solr-core/test-files/solr/collection1/lib/README' to classloader
[junit4:junit4]   2> 1837 T2362 oasc.SolrResourceLoader.replaceClassLoader Adding 'file:/mnt/ssd/jenkins/workspace/Lucene-Solr-trunk-Linux/solr/build/solr-core/test-files/solr/collection1/lib/classes/' to classloader
[junit4:junit4]   2> 1868 T2362 oasc.SolrConfig.<init> Using Lucene MatchVersion: LUCENE_50
[junit4:junit4]   2> 1921 T2362 oasc.SolrConfig.<init> Loaded SolrConfig: solrconfig.xml
[junit4:junit4]   2> 1922 T2362 oass.IndexSchema.readSchema Reading Solr Schema
[junit4:junit4]   2> 1926 T2362 oass.IndexSchema.readSchema Schema name=test
[junit4:junit4]   2> 2287 T2362 oass.OpenExchangeRatesOrgProvider.init Initialized with rates=open-exchange-rates.json, refreshInterval=1440.
[junit4:junit4]   2> 2293 T2362 oass.IndexSchema.readSchema default search field in schema is text
[junit4:junit4]   2> 2295 T2362 oass.IndexSchema.readSchema unique key field: id
[junit4:junit4]   2> 2300 T2362 oass.FileExchangeRateProvider.reload Reloading exchange rates from file currency.xml
[junit4:junit4]   2> 2302 T2362 oass.FileExchangeRateProvider.reload Reloading exchange rates from file currency.xml
[junit4:junit4]   2> 2304 T2362 oass.OpenExchangeRatesOrgProvider.reload Reloading exchange rates from open-exchange-rates.json
[junit4:junit4]   2> 2305 T2362 oass.OpenExchangeRatesOrgProvider.reload Reloading exchange rates from open-exchange-rates.json
[junit4:junit4]   2> 2306 T2362 oasc.SolrCore.<init> [collectionLazy4] Opening new SolrCore at /mnt/ssd/jenkins/workspace/Lucene-Solr-trunk-Linux/solr/build/solr-core/test-files/solr/collection1/, dataDir=/mnt/ssd/jenkins/workspace/Lucene-Solr-trunk-Linux/solr/build/solr-core/test-files/solr/collection1/data/
[junit4:junit4]   2> 2306 T2362 oasc.JmxMonitoredMap.<init> JMX monitoring is enabled. Adding Solr mbeans to JMX Server: com.sun.jmx.mbeanserver.JmxMBeanServer@d4fdf1
[junit4:junit4]   2> 2307 T2362 oasc.SolrCore.initDirectoryFactory org.apache.solr.core.MockDirectoryFactory
[junit4:junit4]   2> 2307 T2362 oasc.CachingDirectoryFactory.injectLockFactory WARNING No lockType configured for MockDirWrapper(RateLimitedDirectoryWrapper(org.apache.lucene.store.RAMDirectory@14ab129 lockFactory=org.apache.lucene.store.SingleInstanceLockFactory@b51614)) assuming 'simple'
[junit4:junit4]   2> 2308 T2362 oasc.CachingDirectoryFactory.get return new directory for /mnt/ssd/jenkins/workspace/Lucene-Solr-trunk-Linux/solr/build/solr-core/test-files/solr/collection1/data forceNew:false
[junit4:junit4]   2> 2308 T2362 oasc.CachingDirectoryFactory.close Releasing directory:/mnt/ssd/jenkins/workspace/Lucene-Solr-trunk-Linux/solr/build/solr-core/test-files/solr/collection1/data
[junit4:junit4]   2> 2309 T2362 oasc.SolrCore.getNewIndexDir New index directory detected: old=null new=/mnt/ssd/jenkins/workspace/Lucene-Solr-trunk-Linux/solr/build/solr-core/test-files/solr/collection1/data/index/
[junit4:junit4]   2> 2309 T2362 oasc.SolrCore.initIndex WARNING [collectionLazy4] Solr index directory '/mnt/ssd/jenkins/workspace/Lucene-Solr-trunk-Linux/solr/build/solr-core/test-files/solr/collection1/data/index' doesn't exist. Creating new index...
[junit4:junit4]   2> 2310 T2362 oasc.CachingDirectoryFactory.get return new directory for /mnt/ssd/jenkins/workspace/Lucene-Solr-trunk-Linux/solr/build/solr-core/test-files/solr/collection1/data/index forceNew:false
[junit4:junit4]   2> 2311 T2362 oasc.SolrDeletionPolicy.onCommit SolrDeletionPolicy.onCommit: commits:num=1
[junit4:junit4]   2> 		commit{dir=MockDirWrapper(org.apache.lucene.store.RAMDirectory@fd35af lockFactory=org.apache.lucene.store.NativeFSLockFactory@1d8835f),segFN=segments_1,generation=1,filenames=[segments_1]
[junit4:junit4]   2> 2311 T2362 oasc.SolrDeletionPolicy.updateCommits newest commit = 1[segments_1]
[junit4:junit4]   2> 2311 T2362 oasc.CachingDirectoryFactory.close Releasing directory:/mnt/ssd/jenkins/workspace/Lucene-Solr-trunk-Linux/solr/build/solr-core/test-files/solr/collection1/data/index
[junit4:junit4]   2> 2312 T2362 oasc.SolrCore.initWriters created xml: solr.XMLResponseWriter
[junit4:junit4]   2> 2313 T2362 oasup.UpdateRequestProcessorChain.init inserting DistributedUpdateProcessorFactory into updateRequestProcessorChain "dedupe"
[junit4:junit4]   2> 2314 T2362 oasup.UpdateRequestProcessorChain.init inserting DistributedUpdateProcessorFactory into updateRequestProcessorChain "dedupe-allfields"
[junit4:junit4]   2> 2314 T2362 oasup.UpdateRequestProcessorChain.init inserting DistributedUpdateProcessorFactory into updateRequestProcessorChain "stored_sig"
[junit4:junit4]   2> 2314 T2362 oasup.UpdateRequestProcessorChain.init inserting DistributedUpdateProcessorFactory into updateRequestProcessorChain "uniq-fields"
[junit4:junit4]   2> 2315 T2362 oasup.UpdateRequestProcessorChain.init inserting DistributedUpdateProcessorFactory into updateRequestProcessorChain "distrib-dup-test-chain-implicit"
[junit4:junit4]   2> 2315 T2362 oasc.RequestHandlers.initHandlersFromConfig adding lazy requestHandler: solr.ReplicationHandler
[junit4:junit4]   2> 2316 T2362 oasc.RequestHandlers.initHandlersFromConfig created /replication: solr.ReplicationHandler
[junit4:junit4]   2> 2317 T2362 oasc.RequestHandlers.initHandlersFromConfig created standard: solr.StandardRequestHandler
[junit4:junit4]   2> 2317 T2362 oasc.RequestHandlers.initHandlersFromConfig created /get: solr.RealTimeGetHandler
[junit4:junit4]   2> 2318 T2362 oasc.RequestHandlers.initHandlersFromConfig created dismax: solr.SearchHandler
[junit4:junit4]   2> 2319 T2362 oasc.RequestHandlers.initHandlersFromConfig created mock: org.apache.solr.core.MockQuerySenderListenerReqHandler
[junit4:junit4]   2> 2320 T2362 oasc.RequestHandlers.initHandlersFromConfig created /admin/: org.apache.solr.handler.admin.AdminHandlers
[junit4:junit4]   2> 2320 T2362 oasc.RequestHandlers.initHandlersFromConfig created defaults: solr.StandardRequestHandler
[junit4:junit4]   2> 2321 T2362 oasc.RequestHandlers.initHandlersFromConfig adding lazy requestHandler: solr.StandardRequestHandler
[junit4:junit4]   2> 2321 T2362 oasc.RequestHandlers.initHandlersFromConfig created lazy: solr.StandardRequestHandler
[junit4:junit4]   2> 2322 T2362 oasc.RequestHandlers.initHandlersFromConfig created /update: solr.UpdateRequestHandler
[junit4:junit4]   2> 2323 T2362 oasc.RequestHandlers.initHandlersFromConfig created /terms: org.apache.solr.handler.component.SearchHandler
[junit4:junit4]   2> 2323 T2362 oasc.RequestHandlers.initHandlersFromConfig created spellCheckCompRH: org.apache.solr.handler.component.SearchHandler
[junit4:junit4]   2> 2324 T2362 oasc.RequestHandlers.initHandlersFromConfig created spellCheckCompRH_Direct: org.apache.solr.handler.component.SearchHandler
[junit4:junit4]   2> 2325 T2362 oasc.RequestHandlers.initHandlersFromConfig created spellCheckWithWordbreak: org.apache.solr.handler.component.SearchHandler
[junit4:junit4]   2> 2326 T2362 oasc.RequestHandlers.initHandlersFromConfig created spellCheckWithWordbreak_Direct: org.apache.solr.handler.component.SearchHandler
[junit4:junit4]   2> 2326 T2362 oasc.RequestHandlers.initHandlersFromConfig created spellCheckCompRH1: org.apache.solr.handler.component.SearchHandler
[junit4:junit4]   2> 2327 T2362 oasc.RequestHandlers.initHandlersFromConfig created tvrh: org.apache.solr.handler.component.SearchHandler
[junit4:junit4]   2> 2328 T2362 oasc.RequestHandlers.initHandlersFromConfig created /mlt: solr.MoreLikeThisHandler
[junit4:junit4]   2> 2329 T2362 oasc.RequestHandlers.initHandlersFromConfig created /debug/dump: solr.DumpRequestHandler
[junit4:junit4]   2> 2331 T2362 oashl.XMLLoader.init xsltCacheLifetimeSeconds=60
[junit4:junit4]   2> 2333 T2362 oasc.SolrCore.initDeprecatedSupport WARNING solrconfig.xml uses deprecated <admin/gettableFiles>, Please update your config to use the ShowFileRequestHandler.
[junit4:junit4]   2> 2334 T2362 oasc.SolrCore.initDeprecatedSupport WARNING adding ShowFileRequestHandler with hidden files: [BAD-SOLRCONFIG-INVALID-SCRIPTFILE.XML, SOLRCONFIG-UPDATE-PROCESSOR-CHAINS.XML, BAD-SCHEMA-CURRENCY-FT-MULTIVALUED.XML, MISSLEADING.EXTENSION.UPDATEPROCESSOR.JS.TXT, SCHEMA-SNIPPET-FIELD.XML, XSLT, SOLRCONFIG-MASTER2.XML, SOLRCONFIG-DELPOLICY1.XML, BAD-SOLRCONFIG-MISSING-SCRIPTFILE.XML, SOLRCONFIG-MASTER.XML, SCHEMA-STOP-KEEP.XML, BAD-SCHEMA-CURRENCY-MULTIVALUED.XML, BAD-SCHEMA-NOT-INDEXED-BUT-NORMS.XML, SOLRCONFIG-PROPINJECT.XML, SCHEMA-TFIDF.XML, SCHEMA-SPATIAL.XML, FRENCHARTICLES.TXT, FUZZYSUGGEST.TXT, SCHEMA-NUMERIC.XML, SCHEMA-BM25.XML, MISSING.FUNCTIONS.UPDATEPROCESSOR.JS, SOLRCONFIG_PERF.XML, SOLRCONFIG-CACHING.XML, SOLRCONFIG-SOLCOREPROPERTIES.XML, SCHEMA-SNIPPET-TYPE.XML, COMPOUNDDICTIONARY.TXT, SOLRCONFIG-REQHANDLER.INCL, SCHEMA-PHRASESUGGEST.XML, ELEVATE.XML, SOLRCONFIG-ELEVATE.XML, SCHEMA-REVERSED.XML, SOLRCONFIG-HIGHLIGHT.XML, SOLRCONFIG-DELPOLICY2.XML, SOLRCONFIG-INDEXCONFIG.XML, BAD-SCHEMA-NONTEXT-ANALYZER.XML, SOLRCONFIG-NOCACHE.XML, MAPPING-ISOLATIN1ACCENT.TXT, SOLRCONFIG-LAZYWRITER.XML, BAD-SCHEMA-DUP-FIELDTYPE.XML, SCHEMA-REPLICATION1.XML, SCHEMA-COPYFIELD-TEST.XML, BAD-SCHEMA-SIM-GLOBAL-VS-FT-MISMATCH.XML, SCHEMA15.XML, SCHEMA-BEHAVIOR.XML, SOLRCONFIG-SIMPLELOCK.XML, BAD_SOLRCONFIG.XML, BAD-SCHEMA-UNIQUEKEY-USES-DEFAULT.XML, KEEP-2.TXT, BAD-SCHEMA-NOT-INDEXED-BUT-POS.XML, SCHEMASURROUND.XML, SOLRCONFIG-SCRIPT-UPDATEPROCESSOR.XML, SOLRCONFIG-SNIPPET-PROCESSOR.XML, SOLRCONFIG-TRANSFORMERS.XML, SOLRCONFIG-FUNCTIONQUERY.XML, SCHEMA-SPELLCHECKER.XML, BAD-SCHEMA-DUP-DYNAMICFIELD.XML, THROW.ERROR.ON.ADD.UPDATEPROCESSOR.JS, SOLRCONFIG-QUERYSENDER.XML, SCHEMA-TRIE.XML, SCHEMA-LMJELINEKMERCER.XML, SOLRCONFIG-PROPINJECT-INDEXDEFAULT.XML, SCHEMA-CHARFILTERS.XML, SOLRCONFIG-SPELLCHECKCOMPONENT.XML, SOLRCONFIG-ALTDIRECTORY.XML, SCHEMA-FOLDING.XML, SCHEMA-EFF.XML, SOLRCONFIG-XINCLUDE.XML, SCHEMA-NOT-REQUIRED-UNIQUE-KEY.XML, BAD-SCHEMA-UNIQUEKEY-IS-COPYFIELD-DEST.XML, STEMDICT.TXT, STOPTYPES-1.TXT, SOLRCONFIG-QUERYSENDER-NOQUERY.XML, HUNSPELL-TEST.DIC, SCHEMA-REQUIRED-FIELDS.XML, SOLRCONFIG-ENABLEPLUGIN.XML, SCHEMA.XML, STOPWITHBOM.TXT, SCHEMA-LMDIRICHLET.XML, SYNONYMS.TXT, SOLRCONFIG-MERGEPOLICY.XML, CURRENCY.XML, TRIVIAL.UPDATEPROCESSOR1.JS, SOLRCONFIG-SLAVE.XML, SCHEMA12.XML, STOPTYPES-2.TXT, BAD-SCHEMA-ANALYZER-CLASS-AND-NESTED.XML, BAD-MP-SOLRCONFIG.XML, BAD-SCHEMA-CURRENCY-DYNAMIC-MULTIVALUED.XML, SOLRCONFIG-TERMINDEX.XML, BAD-SCHEMA-EXTERNAL-FILEFIELD.XML, SCHEMA-LUCENEMATCHVERSION.XML, SCHEMA-REPLICATION2.XML, TRIVIAL.UPDATEPROCESSOR0.JS, OLD_SYNONYMS.TXT, PROTWORDS.TXT, BAD-SOLRCONFIG-BOGUS-SCRIPTENGINE-NAME.XML, KEEP-1.TXT, SOLRCONFIG-SLAVE1.XML, SCHEMA-IB.XML, STOP-2.TXT, SCHEMA-MINIMAL.XML, BAD-SCHEMA-UNIQUEKEY-MULTIVALUED.XML, OPEN-EXCHANGE-RATES.JSON, DA_COMPOUNDDICTIONARY.TXT, SCHEMA-DFR.XML, SOLRCONFIG-REPEATER.XML, STOP-1.TXT, SOLRCONFIG-MASTER1.XML, HYPHENATION.DTD, SOLRCONFIG-RESPONSE-LOG-COMPONENT.XML, SOLRCONFIG-BASIC.XML, PHRASESUGGEST.TXT, JASUGGEST.TXT, SCHEMA-SIM.XML, SOLRCONFIG_CODEC.XML, DA_UTF8.XML, BAD-SCHEMA-DUP-FIELD.XML, SOLRCONFIG-PHRASESUGGEST.XML, SOLRCONFIG-TLOG.XML, STOPWORDSWRONGENCODING.TXT, SOLRCONFIG-MASTER1-KEEPONEBACKUP.XML, SOLRCONFIG-SPELLCHECKER.XML, SCHEMA-XINCLUDE.XML, BAD-SCHEMA-NOT-INDEXED-BUT-TF.XML, CONDITIONAL.UPDATEPROCESSOR.JS, SOLRCONFIG-MASTER3.XML, WDFTYPES.TXT, STOPWORDS.TXT, SOLRCONFIG-SOLR-749.XML, SCHEMA-COLLATE.XML, BAD-SCHEMA-OMIT-TF-BUT-NOT-POS.XML, SCHEMA_CODEC.XML, HUNSPELL-TEST.AFF, ADDFIELDS.UPDATEPROCESSOR.JS, SCHEMA11.XML, BAD-SCHEMA-CODEC-GLOBAL-VS-FT-MISMATCH.XML, STOP-SNOWBALL.TXT, SCHEMA-BINARYFIELD.XML, SOLRCONFIG-NATIVELOCK.XML]
[junit4:junit4]   2> 2336 T2362 oasc.CachingDirectoryFactory.close Releasing directory:/mnt/ssd/jenkins/workspace/Lucene-Solr-trunk-Linux/solr/build/solr-core/test-files/solr/collection1/data
[junit4:junit4]   2> 2337 T2362 oass.SolrIndexSearcher.<init> Opening Searcher@3f3a90 main
[junit4:junit4]   2> 2337 T2362 oasu.CommitTracker.<init> Hard AutoCommit: disabled
[junit4:junit4]   2> 2338 T2362 oasu.CommitTracker.<init> Soft AutoCommit: disabled
[junit4:junit4]   2> 2338 T2362 oashc.SpellCheckComponent.inform Initializing spell checkers
[junit4:junit4]   2> 2339 T2362 oass.DirectSolrSpellChecker.init init: {name=direct,classname=DirectSolrSpellChecker,field=lowerfilt,minQueryLength=3}
[junit4:junit4]   2> 2348 T2368 oasc.SolrCore.registerSearcher [collectionLazy4] Registered new searcher Searcher@3f3a90 main{StandardDirectoryReader(segments_1:1)}
[junit4:junit4]   2> 2352 T2362 oasc.CoreContainer.registerCore registering core: collectionLazy4
[junit4:junit4]   2> 2352 T2362 oasc.CoreContainer.create Creating SolrCore 'collectionLazy2' using instanceDir: /mnt/ssd/jenkins/workspace/Lucene-Solr-trunk-Linux/solr/build/solr-core/test-files/solr/collection1
[junit4:junit4]   2> 2353 T2362 oasc.SolrResourceLoader.<init> new SolrResourceLoader for directory: '/mnt/ssd/jenkins/workspace/Lucene-Solr-trunk-Linux/solr/build/solr-core/test-files/solr/collection1/'
[junit4:junit4]   2> 2353 T2362 oasc.SolrResourceLoader.replaceClassLoader Adding 'file:/mnt/ssd/jenkins/workspace/Lucene-Solr-trunk-Linux/solr/build/solr-core/test-files/solr/collection1/lib/README' to classloader
[junit4:junit4]   2> 2354 T2362 oasc.SolrResourceLoader.replaceClassLoader Adding 'file:/mnt/ssd/jenkins/workspace/Lucene-Solr-trunk-Linux/solr/build/solr-core/test-files/solr/collection1/lib/classes/' to classloader
[junit4:junit4]   2> 2387 T2362 oasc.SolrConfig.<init> Using Lucene MatchVersion: LUCENE_50
[junit4:junit4]   2> 2430 T2362 oasc.SolrConfig.<init> Loaded SolrConfig: solrconfig.xml
[junit4:junit4]   2> 2431 T2362 oass.IndexSchema.readSchema Reading Solr Schema
[junit4:junit4]   2> 2435 T2362 oass.IndexSchema.readSchema Schema name=test
[junit4:junit4]   2> 2802 T2362 oass.OpenExchangeRatesOrgProvider.init Initialized with rates=open-exchange-rates.json, refreshInterval=1440.
[junit4:junit4]   2> 2808 T2362 oass.IndexSchema.readSchema default search field in schema is text
[junit4:junit4]   2> 2811 T2362 oass.IndexSchema.readSchema unique key field: id
[junit4:junit4]   2> 2815 T2362 oass.FileExchangeRateProvider.reload Reloading exchange rates from file currency.xml
[junit4:junit4]   2> 2818 T2362 oass.FileExchangeRateProvider.reload Reloading exchange rates from file currency.xml
[junit4:junit4]   2> 2821 T2362 oass.OpenExchangeRatesOrgProvider.reload Reloading exchange rates from open-exchange-rates.json
[junit4:junit4]   2> 2821 T2362 oass.OpenExchangeRatesOrgProvider.reload Reloading exchange rates from open-exchange-rates.json
[junit4:junit4]   2> 2822 T2362 oasc.SolrCore.<init> [collectionLazy2] Opening new SolrCore at /mnt/ssd/jenkins/workspace/Lucene-Solr-trunk-Linux/solr/build/solr-core/test-files/solr/collection1/, dataDir=/mnt/ssd/jenkins/workspace/Lucene-Solr-trunk-Linux/solr/build/solr-core/test-files/solr/collection1/data/
[junit4:junit4]   2> 2822 T2362 oasc.JmxMonitoredMap.<init> JMX monitoring is enabled. Adding Solr mbeans to JMX Server: com.sun.jmx.mbeanserver.JmxMBeanServer@d4fdf1
[junit4:junit4]   2> 2823 T2362 oasc.SolrCore.initDirectoryFactory org.apache.solr.core.MockDirectoryFactory
[junit4:junit4]   2> 2824 T2362 oasc.CachingDirectoryFactory.injectLockFactory WARNING No lockType configured for MockDirWrapper(org.apache.lucene.store.RAMDirectory@10577ab lockFactory=org.apache.lucene.store.SingleInstanceLockFactory@1f3a728) assuming 'simple'
[junit4:junit4]   2> 2824 T2362 oasc.CachingDirectoryFactory.get return new directory for /mnt/ssd/jenkins/workspace/Lucene-Solr-trunk-Linux/solr/build/solr-core/test-files/solr/collection1/data forceNew:false
[junit4:junit4]   2> 2824 T2362 oasc.CachingDirectoryFactory.close Releasing directory:/mnt/ssd/jenkins/workspace/Lucene-Solr-trunk-Linux/solr/build/solr-core/test-files/solr/collection1/data
[junit4:junit4]   2> 2825 T2362 oasc.SolrCore.getNewIndexDir New index directory detected: old=null new=/mnt/ssd/jenkins/workspace/Lucene-Solr-trunk-Linux/solr/build/solr-core/test-files/solr/collection1/data/index/
[junit4:junit4]   2> 2825 T2362 oasc.SolrCore.initIndex WARNING [collectionLazy2] Solr index directory '/mnt/ssd/jenkins/workspace/Lucene-Solr-trunk-Linux/solr/build/solr-core/test-files/solr/collection1/data/index' doesn't exist. Creating new index...
[junit4:junit4]   2> 2826 T2362 oasc.CachingDirectoryFactory.get return new directory for /mnt/ssd/jenkins/workspace/Lucene-Solr-trunk-Linux/solr/build/solr-core/test-files/solr/collection1/data/index forceNew:false
[junit4:junit4]   2> 2827 T2362 oasc.SolrDeletionPolicy.onCommit SolrDeletionPolicy.onCommit: commits:num=1
[junit4:junit4]   2> 		commit{dir=BaseDirectoryWrapper(org.apache.lucene.store.RAMDirectory@1676217 lockFactory=org.apache.lucene.store.NativeFSLockFactory@ccdb59),segFN=segments_1,generation=1,filenames=[segments_1]
[junit4:junit4]   2> 2827 T2362 oasc.SolrDeletionPolicy.updateCommits newest commit = 1[segments_1]
[junit4:junit4]   2> 2828 T2362 oasc.CachingDirectoryFactory.close Releasing directory:/mnt/ssd/jenkins/workspace/Lucene-Solr-trunk-Linux/solr/build/solr-core/test-files/solr/collection1/data/index
[junit4:junit4]   2> 2828 T2362 oasc.SolrCore.initWriters created xml: solr.XMLResponseWriter
[junit4:junit4]   2> 2830 T2362 oasup.UpdateRequestProcessorChain.init inserting DistributedUpdateProcessorFactory into updateRequestProcessorChain "dedupe"
[junit4:junit4]   2> 2830 T2362 oasup.UpdateRequestProcessorChain.init inserting DistributedUpdateProcessorFactory into updateRequestProcessorChain "dedupe-allfields"
[junit4:junit4]   2> 2831 T2362 oasup.UpdateRequestProcessorChain.init inserting DistributedUpdateProcessorFactory into updateRequestProcessorChain "stored_sig"
[junit4:junit4]   2> 2831 T2362 oasup.UpdateRequestProcessorChain.init inserting DistributedUpdateProcessorFactory into updateRequestProcessorChain "uniq-fields"
[junit4:junit4]   2> 2832 T2362 oasup.UpdateRequestProcessorChain.init inserting DistributedUpdateProcessorFactory into updateRequestProcessorChain "distrib-dup-test-chain-implicit"
[junit4:junit4]   2> 2832 T2362 oasc.RequestHandlers.initHandlersFromConfig adding lazy requestHandler: solr.ReplicationHandler
[junit4:junit4]   2> 2832 T2362 oasc.RequestHandlers.initHandlersFromConfig created /replication: solr.ReplicationHandler
[junit4:junit4]   2> 2833 T2362 oasc.RequestHandlers.initHandlersFromConfig created standard: solr.StandardRequestHandler
[junit4:junit4]   2> 2834 T2362 oasc.RequestHandlers.initHandlersFromConfig created /get: solr.RealTimeGetHandler
[junit4:junit4]   2> 2835 T2362 oasc.RequestHandlers.initHandlersFromConfig created dismax: solr.SearchHandler
[junit4:junit4]   2> 2836 T2362 oasc.RequestHandlers.initHandlersFromConfig created mock: org.apache.solr.core.MockQuerySenderListenerReqHandler
[junit4:junit4]   2> 2836 T2362 oasc.RequestHandlers.initHandlersFromConfig created /admin/: org.apache.solr.handler.admin.AdminHandlers
[junit4:junit4]   2> 2837 T2362 oasc.RequestHandlers.initHandlersFromConfig created defaults: solr.StandardRequestHandler
[junit4:junit4]   2> 2838 T2362 oasc.RequestHandlers.initHandlersFromConfig adding lazy requestHandler: solr.StandardRequestHandler
[junit4:junit4]   2> 2838 T2362 oasc.RequestHandlers.initHandlersFromConfig created lazy: solr.StandardRequestHandler
[junit4:junit4]   2> 2839 T2362 oasc.RequestHandlers.initHandlersFromConfig created /update: solr.UpdateRequestHandler
[junit4:junit4]   2> 2840 T2362 oasc.RequestHandlers.initHandlersFromConfig created /terms: org.apache.solr.handler.component.SearchHandler
[junit4:junit4]   2> 2840 T2362 oasc.RequestHandlers.initHandlersFromConfig created spellCheckCompRH: org.apache.solr.handler.component.SearchHandler
[junit4:junit4]   2> 2841 T2362 oasc.RequestHandlers.initHandlersFromConfig created spellCheckCompRH_Direct: org.apache.solr.handler.component.SearchHandler
[junit4:junit4]   2> 2842 T2362 oasc.RequestHandlers.initHandlersFromConfig created spellCheckWithWordbreak: org.apache.solr.handler.component.SearchHandler
[junit4:junit4]   2> 2843 T2362 oasc.RequestHandlers.initHandlersFromConfig created spellCheckWithWordbreak_Direct: org.apache.solr.handler.component.SearchHandler
[junit4:junit4]   2> 2844 T2362 oasc.RequestHandlers.initHandlersFromConfig created spellCheckCompRH1: org.apache.solr.handler.component.SearchHandler
[junit4:junit4]   2> 2845 T2362 oasc.RequestHandlers.initHandlersFromConfig created tvrh: org.apache.solr.handler.component.SearchHandler
[junit4:junit4]   2> 2846 T2362 oasc.RequestHandlers.initHandlersFromConfig created /mlt: solr.MoreLikeThisHandler
[junit4:junit4]   2> 2846 T2362 oasc.RequestHandlers.initHandlersFromConfig created /debug/dump: solr.DumpRequestHandler
[junit4:junit4]   2> 2849 T2362 oashl.XMLLoader.init xsltCacheLifetimeSeconds=60
[junit4:junit4]   2> 2851 T2362 oasc.SolrCore.initDeprecatedSupport WARNING solrconfig.xml uses deprecated <admin/gettableFiles>, Please update your config to use the ShowFileRequestHandler.
[junit4:junit4]   2> 2853 T2362 oasc.SolrCore.initDeprecatedSupport WARNING adding ShowFileRequestHandler with hidden files: [BAD-SOLRCONFIG-INVALID-SCRIPTFILE.XML, SOLRCONFIG-UPDATE-PROCESSOR-CHAINS.XML, BAD-SCHEMA-CURRENCY-FT-MULTIVALUED.XML, MISSLEADING.EXTENSION.UPDATEPROCESSOR.JS.TXT, SCHEMA-SNIPPET-FIELD.XML, XSLT, SOLRCONFIG-MASTER2.XML, SOLRCONFIG-DELPOLICY1.XML, BAD-SOLRCONFIG-MISSING-SCRIPTFILE.XML, SOLRCONFIG-MASTER.XML, SCHEMA-STOP-KEEP.XML, BAD-SCHEMA-CURRENCY-MULTIVALUED.XML, BAD-SCHEMA-NOT-INDEXED-BUT-NORMS.XML, SOLRCONFIG-PROPINJECT.XML, SCHEMA-TFIDF.XML, SCHEMA-SPATIAL.XML, FRENCHARTICLES.TXT, FUZZYSUGGEST.TXT, SCHEMA-NUMERIC.XML, SCHEMA-BM25.XML, MISSING.FUNCTIONS.UPDATEPROCESSOR.JS, SOLRCONFIG_PERF.XML, SOLRCONFIG-CACHING.XML, SOLRCONFIG-SOLCOREPROPERTIES.XML, SCHEMA-SNIPPET-TYPE.XML, COMPOUNDDICTIONARY.TXT, SOLRCONFIG-REQHANDLER.INCL, SCHEMA-PHRASESUGGEST.XML, ELEVATE.XML, SOLRCONFIG-ELEVATE.XML, SCHEMA-REVERSED.XML, SOLRCONFIG-HIGHLIGHT.XML, SOLRCONFIG-DELPOLICY2.XML, SOLRCONFIG-INDEXCONFIG.XML, BAD-SCHEMA-NONTEXT-ANALYZER.XML, SOLRCONFIG-NOCACHE.XML, MAPPING-ISOLATIN1ACCENT.TXT, SOLRCONFIG-LAZYWRITER.XML, BAD-SCHEMA-DUP-FIELDTYPE.XML, SCHEMA-REPLICATION1.XML, SCHEMA-COPYFIELD-TEST.XML, BAD-SCHEMA-SIM-GLOBAL-VS-FT-MISMATCH.XML, SCHEMA15.XML, SCHEMA-BEHAVIOR.XML, SOLRCONFIG-SIMPLELOCK.XML, BAD_SOLRCONFIG.XML, BAD-SCHEMA-UNIQUEKEY-USES-DEFAULT.XML, KEEP-2.TXT, BAD-SCHEMA-NOT-INDEXED-BUT-POS.XML, SCHEMASURROUND.XML, SOLRCONFIG-SCRIPT-UPDATEPROCESSOR.XML, SOLRCONFIG-SNIPPET-PROCESSOR.XML, SOLRCONFIG-TRANSFORMERS.XML, SOLRCONFIG-FUNCTIONQUERY.XML, SCHEMA-SPELLCHECKER.XML, BAD-SCHEMA-DUP-DYNAMICFIELD.XML, THROW.ERROR.ON.ADD.UPDATEPROCESSOR.JS, SOLRCONFIG-QUERYSENDER.XML, SCHEMA-TRIE.XML, SCHEMA-LMJELINEKMERCER.XML, SOLRCONFIG-PROPINJECT-INDEXDEFAULT.XML, SCHEMA-CHARFILTERS.XML, SOLRCONFIG-SPELLCHECKCOMPONENT.XML, SOLRCONFIG-ALTDIRECTORY.XML, SCHEMA-FOLDING.XML, SCHEMA-EFF.XML, SOLRCONFIG-XINCLUDE.XML, SCHEMA-NOT-REQUIRED-UNIQUE-KEY.XML, BAD-SCHEMA-UNIQUEKEY-IS-COPYFIELD-DEST.XML, STEMDICT.TXT, STOPTYPES-1.TXT, SOLRCONFIG-QUERYSENDER-NOQUERY.XML, HUNSPELL-TEST.DIC, SCHEMA-REQUIRED-FIELDS.XML, SOLRCONFIG-ENABLEPLUGIN.XML, SCHEMA.XML, STOPWITHBOM.TXT, SCHEMA-LMDIRICHLET.XML, SYNONYMS.TXT, SOLRCONFIG-MERGEPOLICY.XML, CURRENCY.XML, TRIVIAL.UPDATEPROCESSOR1.JS, SOLRCONFIG-SLAVE.XML, SCHEMA12.XML, STOPTYPES-2.TXT, BAD-SCHEMA-ANALYZER-CLASS-AND-NESTED.XML, BAD-MP-SOLRCONFIG.XML, BAD-SCHEMA-CURRENCY-DYNAMIC-MULTIVALUED.XML, SOLRCONFIG-TERMINDEX.XML, BAD-SCHEMA-EXTERNAL-FILEFIELD.XML, SCHEMA-LUCENEMATCHVERSION.XML, SCHEMA-REPLICATION2.XML, TRIVIAL.UPDATEPROCESSOR0.JS, OLD_SYNONYMS.TXT, PROTWORDS.TXT, BAD-SOLRCONFIG-BOGUS-SCRIPTENGINE-NAME.XML, KEEP-1.TXT, SOLRCONFIG-SLAVE1.XML, SCHEMA-IB.XML, STOP-2.TXT, SCHEMA-MINIMAL.XML, BAD-SCHEMA-UNIQUEKEY-MULTIVALUED.XML, OPEN-EXCHANGE-RATES.JSON, DA_COMPOUNDDICTIONARY.TXT, SCHEMA-DFR.XML, SOLRCONFIG-REPEATER.XML, STOP-1.TXT, SOLRCONFIG-MASTER1.XML, HYPHENATION.DTD, SOLRCONFIG-RESPONSE-LOG-COMPONENT.XML, SOLRCONFIG-BASIC.XML, PHRASESUGGEST.TXT, JASUGGEST.TXT, SCHEMA-SIM.XML, SOLRCONFIG_CODEC.XML, DA_UTF8.XML, BAD-SCHEMA-DUP-FIELD.XML, SOLRCONFIG-PHRASESUGGEST.XML, SOLRCONFIG-TLOG.XML, STOPWORDSWRONGENCODING.TXT, SOLRCONFIG-MASTER1-KEEPONEBACKUP.XML, SOLRCONFIG-SPELLCHECKER.XML, SCHEMA-XINCLUDE.XML, BAD-SCHEMA-NOT-INDEXED-BUT-TF.XML, CONDITIONAL.UPDATEPROCESSOR.JS, SOLRCONFIG-MASTER3.XML, WDFTYPES.TXT, STOPWORDS.TXT, SOLRCONFIG-SOLR-749.XML, SCHEMA-COLLATE.XML, BAD-SCHEMA-OMIT-TF-BUT-NOT-POS.XML, SCHEMA_CODEC.XML, HUNSPELL-TEST.AFF, ADDFIELDS.UPDATEPROCESSOR.JS, SCHEMA11.XML, BAD-SCHEMA-CODEC-GLOBAL-VS-FT-MISMATCH.XML, STOP-SNOWBALL.TXT, SCHEMA-BINARYFIELD.XML, SOLRCONFIG-NATIVELOCK.XML]
[junit4:junit4]   2> 2855 T2362 oasc.CachingDirectoryFactory.close Releasing directory:/mnt/ssd/jenkins/workspace/Lucene-Solr-trunk-Linux/solr/build/solr-core/test-files/solr/collection1/data
[junit4:junit4]   2> 2855 T2362 oass.SolrIndexSearcher.<init> Opening Searcher@651696 main
[junit4:junit4]   2> 2856 T2362 oasu.CommitTracker.<init> Hard AutoCommit: disabled
[junit4:junit4]   2> 2856 T2362 oasu.CommitTracker.<init> Soft AutoCommit: disabled
[junit4:junit4]   2> 2857 T2362 oashc.SpellCheckComponent.inform Initializing spell checkers
[junit4:junit4]   2> 2858 T2362 oass.DirectSolrSpellChecker.init init: {name=direct,classname=DirectSolrSpellChecker,field=lowerfilt,minQueryLength=3}
[junit4:junit4]   2> 2879 T2369 oasc.SolrCore.registerSearcher [collectionLazy2] Registered new searcher Searcher@651696 main{StandardDirectoryReader(segments_1:1)}
[junit4:junit4]   2> 2883 T2362 oasc.CoreContainer.registerCore registering core: collectionLazy2
[junit4:junit4]   2> 2883 T2362 oasc.CoreContainer.shutdown Shutting down CoreContainer instance=26538089
[junit4:junit4]   2> 2884 T2362 oas.SolrTestCaseJ4.tearDown ###Ending testCachingLimit
[junit4:junit4]   2> NOTE: reproduce with: ant test  -Dtestcase=TestLazyCores -Dtests.method=testCachingLimit -Dtests.seed=CF50389D6DA57BF1 -Dtests.multiplier=3 -Dtests.slow=true -Dtests.locale=zh -Dtests.timezone=America/Rosario -Dtests.file.encoding=UTF-8
[junit4:junit4] FAILURE 2.33s J0 | TestLazyCores.testCachingLimit <<<
[junit4:junit4]    > Throwable #1: java.lang.AssertionError: core collectionLazy5 was not found in the list of cores
[junit4:junit4]    > 	at __randomizedtesting.SeedInfo.seed([CF50389D6DA57BF1:AA0C97E7DCBAA61F]:0)
[junit4:junit4]    > 	at org.junit.Assert.fail(Assert.java:93)
[junit4:junit4]    > 	at org.junit.Assert.assertTrue(Assert.java:43)
[junit4:junit4]    > 	at org.apache.solr.core.TestLazyCores.checkInCores(TestLazyCores.java:226)
[junit4:junit4]    > 	at org.apache.solr.core.TestLazyCores.testCachingLimit(TestLazyCores.java:180)
[junit4:junit4]    > 	at sun.reflect.NativeMethodAccessorImpl.invoke0(Native Method)
[junit4:junit4]    > 	at sun.reflect.NativeMethodAccessorImpl.invoke(NativeMethodAccessorImpl.java:57)
[junit4:junit4]    > 	at sun.reflect.DelegatingMethodAccessorImpl.invoke(DelegatingMethodAccessorImpl.java:43)
[junit4:junit4]    > 	at java.lang.reflect.Method.invoke(Method.java:474)
[junit4:junit4]    > 	at com.carrotsearch.randomizedtesting.RandomizedRunner.invoke(RandomizedRunner.java:1559)
[junit4:junit4]    > 	at com.carrotsearch.randomizedtesting.RandomizedRunner.access$600(RandomizedRunner.java:79)
[junit4:junit4]    > 	at com.carrotsearch.randomizedtesting.RandomizedRunner$6.evaluate(RandomizedRunner.java:737)
[junit4:junit4]    > 	at com.carrotsearch.randomizedtesting.RandomizedRunner$7.evaluate(RandomizedRunner.java:773)
[junit4:junit4]    > 	at com.carrotsearch.randomizedtesting.RandomizedRunner$8.evaluate(RandomizedRunner.java:787)
[junit4:junit4]    > 	at com.carrotsearch.randomizedtesting.rules.SystemPropertiesRestoreRule$1.evaluate(SystemPropertiesRestoreRule.java:53)
[junit4:junit4]    > 	at org.apache.lucene.util.TestRuleSetupTeardownChained$1.evaluate(TestRuleSetupTeardownChained.java:50)
[junit4:junit4]    > 	at org.apache.lucene.util.TestRuleFieldCacheSanity$1.evaluate(TestRuleFieldCacheSanity.java:51)
[junit4:junit4]    > 	at org.apache.lucene.util.AbstractBeforeAfterRule$1.evaluate(AbstractBeforeAfterRule.java:45)
[junit4:junit4]    > 	at com.carrotsearch.randomizedtesting.rules.SystemPropertiesInvariantRule$1.evaluate(SystemPropertiesInvariantRule.java:55)
[junit4:junit4]    > 	at org.apache.lucene.util.TestRuleThreadAndTestName$1.evaluate(TestRuleThreadAndTestName.java:48)
[junit4:junit4]    > 	at org.apache.lucene.util.TestRuleIgnoreAfterMaxFailures$1.evaluate(TestRuleIgnoreAfterMaxFailures.java:70)
[junit4:junit4]    > 	at org.apache.lucene.util.TestRuleMarkFailure$1.evaluate(TestRuleMarkFailure.java:48)
[junit4:junit4]    > 	at com.carrotsearch.randomizedtesting.rules.StatementAdapter.evaluate(StatementAdapter.java:36)
[junit4:junit4]    > 	at com.carrotsearch.randomizedtesting.ThreadLeakControl$StatementRunner.run(ThreadLeakControl.java:358)
[junit4:junit4]    > 	at com.carrotsearch.randomizedtesting.ThreadLeakControl.forkTimeoutingTask(ThreadLeakControl.java:782)
[junit4:junit4]    > 	at com.carrotsearch.randomizedtesting.ThreadLeakControl$3.evaluate(ThreadLeakControl.java:442)
[junit4:junit4]    > 	at com.carrotsearch.randomizedtesting.RandomizedRunner.runSingleTest(RandomizedRunner.java:746)
[junit4:junit4]    > 	at com.carrotsearch.randomizedtesting.RandomizedRunner$3.evaluate(RandomizedRunner.java:648)
[junit4:junit4]    > 	at com.carrotsearch.randomizedtesting.RandomizedRunner$4.evaluate(RandomizedRunner.java:682)
[junit4:junit4]    > 	at com.carrotsearch.randomizedtesting.RandomizedRunner$5.evaluate(RandomizedRunner.java:693)
[junit4:junit4]    > 	at com.carrotsearch.randomizedtesting.rules.StatementAdapter.evaluate(StatementAdapter.java:36)
[junit4:junit4]    > 	at com.carrotsearch.randomizedtesting.rules.SystemPropertiesRestoreRule$1.evaluate(SystemPropertiesRestoreRule.java:53)
[junit4:junit4]    > 	at org.apache.lucene.util.AbstractBeforeAfterRule$1.evaluate(AbstractBeforeAfterRule.java:45)
[junit4:junit4]    > 	at org.apache.lucene.util.TestRuleStoreClassName$1.evaluate(TestRuleStoreClassName.java:42)
[junit4:junit4]    > 	at com.carrotsearch.randomizedtesting.rules.SystemPropertiesInvariantRule$1.evaluate(SystemPropertiesInvariantRule.java:55)
[junit4:junit4]    > 	at com.carrotsearch.randomizedtesting.rules.NoShadowingOrOverridesOnMethodsRule$1.evaluate(NoShadowingOrOverridesOnMethodsRule.java:39)
[junit4:junit4]    > 	at com.carrotsearch.randomizedtesting.rules.NoShadowingOrOverridesOnMethodsRule$1.evaluate(NoShadowingOrOverridesOnMethodsRule.java:39)
[junit4:junit4]    > 	at com.carrotsearch.randomizedtesting.rules.StatementAdapter.evaluate(StatementAdapter.java:36)
[junit4:junit4]    > 	at org.apache.lucene.util.TestRuleAssertionsRequired$1.evaluate(TestRuleAssertionsRequired.java:43)
[junit4:junit4]    > 	at org.apache.lucene.util.TestRuleMarkFailure$1.evaluate(TestRuleMarkFailure.java:48)
[junit4:junit4]    > 	at org.apache.lucene.util.TestRuleIgnoreAfterMaxFailures$1.evaluate(TestRuleIgnoreAfterMaxFailures.java:70)
[junit4:junit4]    > 	at org.apache.lucene.util.TestRuleIgnoreTestSuites$1.evaluate(TestRuleIgnoreTestSuites.java:55)
[junit4:junit4]    > 	at com.carrotsearch.randomizedtesting.rules.StatementAdapter.evaluate(StatementAdapter.java:36)
[junit4:junit4]    > 	at com.carrotsearch.randomizedtesting.ThreadLeakControl$StatementRunner.run(ThreadLeakControl.java:358)
[junit4:junit4]    > 	at java.lang.Thread.run(Thread.java:722)
[junit4:junit4]   2> 2905 T2362 oas.SolrTestCaseJ4.setUp ###Starting testLazySearch
[junit4:junit4]   2> 2906 T2362 oasc.SolrResourceLoader.locateSolrHome JNDI not configured for solr (NoInitialContextEx)
[junit4:junit4]   2> 2906 T2362 oasc.SolrResourceLoader.locateSolrHome using system property solr.solr.home: /mnt/ssd/jenkins/workspace/Lucene-Solr-trunk-Linux/solr/build/solr-core/test-files/solr
[junit4:junit4]   2> 2906 T2362 oasc.CoreContainer.<init> New CoreContainer 9498171
[junit4:junit4]   2> 2907 T2362 oasc.CoreContainer.load Loading CoreContainer using Solr Home: '/mnt/ssd/jenkins/workspace/Lucene-Solr-trunk-Linux/solr/build/solr-core/test-files/solr/'
[junit4:junit4]   2> 2907 T2362 oasc.SolrResourceLoader.<init> new SolrResourceLoader for directory: '/mnt/ssd/jenkins/workspace/Lucene-Solr-trunk-Linux/solr/build/solr-core/test-files/solr/'
[junit4:junit4]   2> 2924 T2362 oasc.CoreContainer.load Registering Log Listener
[junit4:junit4]   2> 2937 T2370 oasc.CoreContainer.create Creating SolrCore 'collection1' using instanceDir: /mnt/ssd/jenkins/workspace/Lucene-Solr-trunk-Linux/solr/build/solr-core/test-files/solr/collection1
[junit4:junit4]   2> 2938 T2370 oasc.SolrResourceLoader.<init> new SolrResourceLoader for directory: '/mnt/ssd/jenkins/workspace/Lucene-Solr-trunk-Linux/solr/build/solr-core/test-files/solr/collection1/'
[junit4:junit4]   2> 2939 T2370 oasc.SolrResourceLoader.replaceClassLoader Adding 'file:/mnt/ssd/jenkins/workspace/Lucene-Solr-trunk-Linux/solr/build/solr-core/test-files/solr/collection1/lib/README' to classloader
[junit4:junit4]   2> 2939 T2370 oasc.SolrResourceLoader.replaceClassLoader Adding 'file:/mnt/ssd/jenkins/workspace/Lucene-Solr-trunk-Linux/solr/build/solr-core/test-files/solr/collection1/lib/classes/' to classloader
[junit4:junit4]   2> 2940 T2371 oasc.CoreContainer.create Creating SolrCore 'collectionLazy5' using instanceDir: /mnt/ssd/jenkins/workspace/Lucene-Solr-trunk-Linux/solr/build/solr-core/test-files/solr/collection1
[junit4:junit4]   2> 2940 T2371 oasc.SolrResourceLoader.<init> new SolrResourceLoader for directory: '/mnt/ssd/jenkins/workspace/Lucene-Solr-trunk-Linux/solr/build/solr-core/test-files/solr/collection1/'
[junit4:junit4]   2> 2941 T2371 oasc.SolrResourceLoader.replaceClassLoader Adding 'file:/mnt/ssd/jenkins/workspace/Lucene-Solr-trunk-Linux/solr/build/solr-core/test-files/solr/collection1/lib/README' to classloader
[junit4:junit4]   2> 2941 T2371 oasc.SolrResourceLoader.replaceClassLoader Adding 'file:/mnt/ssd/jenkins/workspace/Lucene-Solr-trunk-Linux/solr/build/solr-core/test-files/solr/collection1/lib/classes/' to classloader
[junit4:junit4]   2> 2971 T2371 oasc.SolrConfig.<init> Using Lucene MatchVersion: LUCENE_50
[junit4:junit4]   2> 2982 T2370 oasc.SolrConfig.<init> Using Lucene MatchVersion: LUCENE_50
[junit4:junit4]   2> 3021 T2371 oasc.SolrConfig.<init> Loaded SolrConfig: solrconfig.xml
[junit4:junit4]   2> 3022 T2371 oass.IndexSchema.readSchema Reading Solr Schema
[junit4:junit4]   2> 3028 T2371 oass.IndexSchema.readSchema Schema name=test
[junit4:junit4]   2> 3060 T2370 oasc.SolrConfig.<init> Loaded SolrConfig: solrconfig.xml
[junit4:junit4]   2> 3061 T2370 oass.IndexSchema.readSchema Reading Solr Schema
[junit4:junit4]   2> 3068 T2370 oass.IndexSchema.readSchema Schema name=test
[junit4:junit4]   2> 3755 T2371 oass.OpenExchangeRatesOrgProvider.init Initialized with rates=open-exchange-rates.json, refreshInterval=1440.
[junit4:junit4]   2> 3764 T2371 oass.IndexSchema.readSchema default search field in schema is text
[junit4:junit4]   2> 3769 T2371 oass.IndexSchema.readSchema unique key field: id
[junit4:junit4]   2> 3775 T2371 oass.FileExchangeRateProvider.reload Reloading exchange rates from file currency.xml
[junit4:junit4]   2> 3779 T2371 oass.FileExchangeRateProvider.reload Reloading exchange rates from file currency.xml
[junit4:junit4]   2> 3782 T2371 oass.OpenExchangeRatesOrgProvider.reload Reloading exchange rates from open-exchange-rates.json
[junit4:junit4]   2> 3783 T2371 oass.OpenExchangeRatesOrgProvider.reload Reloading exchange rates from open-exchange-rates.json
[junit4:junit4]   2> 3784 T2371 oasc.SolrCore.<init> [collectionLazy5] Opening new SolrCore at /mnt/ssd/jenkins/workspace/Lucene-Solr-trunk-Linux/solr/build/solr-core/test-files/solr/collection1/, dataDir=/mnt/ssd/jenkins/workspace/Lucene-Solr-trunk-Linux/solr/build/solr-core/test-files/solr/collection1/data/
[junit4:junit4]   2> 3784 T2371 oasc.JmxMonitoredMap.<init> JMX monitoring is enabled. Adding Solr mbeans to JMX Server: com.sun.jmx.mbeanserver.JmxMBeanServer@d4fdf1
[junit4:junit4]   2> 3785 T2371 oasc.SolrCore.initDirectoryFactory org.apache.solr.core.MockDirectoryFactory
[junit4:junit4]   2> 3785 T2371 oasc.CachingDirectoryFactory.injectLockFactory WARNING No lockType configured for MockDirWrapper(org.apache.lucene.store.RAMDirectory@e730f3 lockFactory=org.apache.lucene.store.SingleInstanceLockFactory@3ec6e9) assuming 'simple'
[junit4:junit4]   2> 3786 T2371 oasc.CachingDirectoryFactory.get return new directory for /mnt/ssd/jenkins/workspace/Lucene-Solr-trunk-Linux/solr/build/solr-core/test-files/solr/collection1/data forceNew:false
[junit4:junit4]   2> 3786 T2371 oasc.CachingDirectoryFactory.close Releasing directory:/mnt/ssd/jenkins/workspace/Lucene-Solr-trunk-Linux/solr/build/solr-core/test-files/solr/collection1/data
[junit4:junit4]   2> 3786 T2371 oasc.SolrCore.getNewIndexDir New index directory detected: old=null new=/mnt/ssd/jenkins/workspace/Lucene-Solr-trunk-Linux/solr/build/solr-core/test-files/solr/collection1/data/index/
[junit4:junit4]   2> 3787 T2371 oasc.SolrCore.initIndex WARNING [collectionLazy5] Solr index directory '/mnt/ssd/jenkins/workspace/Lucene-Solr-trunk-Linux/solr/build/solr-core/test-files/solr/collection1/data/index' doesn't exist. Creating new index...
[junit4:junit4]   2> 3787 T2371 oasc.CachingDirectoryFactory.get return new directory for /mnt/ssd/jenkins/workspace/Lucene-Solr-trunk-Linux/solr/build/solr-core/test-files/solr/collection1/data/index forceNew:false
[junit4:junit4]   2> 3788 T2371 oasc.SolrDeletionPolicy.onCommit SolrDeletionPolicy.onCommit: commits:num=1
[junit4:junit4]   2> 		commit{dir=MockDirWrapper(org.apache.lucene.store.RAMDirectory@1784be5 lockFactory=org.apache.lucene.store.NativeFSLockFactory@1f5a5ff),segFN=segments_1,generation=1,filenames=[segments_1]
[junit4:junit4]   2> 3789 T2371 oasc.SolrDeletionPolicy.updateCommits newest commit = 1[segments_1]
[junit4:junit4]   2> 3789 T2371 oasc.CachingDirectoryFactory.close Releasing directory:/mnt/ssd/jenkins/workspace/Lucene-Solr-trunk-Linux/solr/build/solr-core/test-files/solr/collection1/data/index
[junit4:junit4]   2> 3790 T2371 oasc.SolrCore.initWriters created xml: solr.XMLResponseWriter
[junit4:junit4]   2> 3791 T2371 oasup.UpdateRequestProcessorChain.init inserting DistributedUpdateProcessorFactory into updateRequestProcessorChain "dedupe"
[junit4:junit4]   2> 3792 T2371 oasup.UpdateRequestProcessorChain.init inserting DistributedUpdateProcessorFactory into updateRequestProcessorChain "dedupe-allfields"
[junit4:junit4]   2> 3792 T2371 oasup.UpdateRequestProcessorChain.init inserting DistributedUpdateProcessorFactory into updateRequestProcessorChain "stored_sig"
[junit4:junit4]   2> 3793 T2371 oasup.UpdateRequestProcessorChain.init inserting DistributedUpdateProcessorFactory into updateRequestProcessorChain "uniq-fields"
[junit4:junit4]   2> 3793 T2371 oasup.UpdateRequestProcessorChain.init inserting DistributedUpdateProcessorFactory into updateRequestProcessorChain "distrib-dup-test-chain-implicit"
[junit4:junit4]   2> 3793 T2371 oasc.RequestHandlers.initHandlersFromConfig adding lazy requestHandler: solr.ReplicationHandler
[junit4:junit4]   2> 3794 T2371 oasc.RequestHandlers.initHandlersFromConfig created /replication: solr.ReplicationHandler
[junit4:junit4]   2> 3795 T2371 oasc.RequestHandlers.initHandlersFromConfig created standard: solr.StandardRequestHandler
[junit4:junit4]   2> 3796 T2371 oasc.RequestHandlers.initHandlersFromConfig created /get: solr.RealTimeGetHandler
[junit4:junit4]   2> 3797 T2371 oasc.RequestHandlers.initHandlersFromConfig created dismax: solr.SearchHandler
[junit4:junit4]   2> 3797 T2370 oass.OpenExchangeRatesOrgProvider.init Initialized with rates=open-exchange-rates.json, refreshInterval=1440.
[junit4:junit4]   2> 3798 T2371 oasc.RequestHandlers.initHandlersFromConfig created mock: org.apache.solr.core.MockQuerySenderListenerReqHandler
[junit4:junit4]   2> 3798 T2371 oasc.RequestHandlers.initHandlersFromConfig created /admin/: org.apache.solr.handler.admin.AdminHandlers
[junit4:junit4]   2> 3799 T2371 oasc.RequestHandlers.initHandlersFromConfig created defaults: solr.StandardRequestHandler
[junit4:junit4]   2> 3799 T2371 oasc.RequestHandlers.initHandlersFromConfig adding lazy requestHandler: solr.StandardRequestHandler
[junit4:junit4]   2> 3800 T2371 oasc.RequestHandlers.initHandlersFromConfig created lazy: solr.StandardRequestHandler
[junit4:junit4]   2> 3800 T2371 oasc.RequestHandlers.initHandlersFromConfig created /update: solr.UpdateRequestHandler
[junit4:junit4]   2> 3801 T2371 oasc.RequestHandlers.initHandlersFromConfig created /terms: org.apache.solr.handler.component.SearchHandler
[junit4:junit4]   2> 3802 T2371 oasc.RequestHandlers.initHandlersFromConfig created spellCheckCompRH: org.apache.solr.handler.component.SearchHandler
[junit4:junit4]   2> 3803 T2371 oasc.RequestHandlers.initHandlersFromConfig created spellCheckCompRH_Direct: org.apache.solr.handler.component.SearchHandler
[junit4:junit4]   2> 3804 T2371 oasc.RequestHandlers.initHandlersFromConfig created spellCheckWithWordbreak: org.apache.solr.handler.component.SearchHandler
[junit4:junit4]   2> 3805 T2371 oasc.RequestHandlers.initHandlersFromConfig created spellCheckWithWordbreak_Direct: org.apache.solr.handler.component.SearchHandler
[junit4:junit4]   2> 3806 T2371 oasc.RequestHandlers.initHandlersFromConfig created spellCheckCompRH1: org.apache.solr.handler.component.SearchHandler
[junit4:junit4]   2> 3806 T2370 oass.IndexSchema.readSchema default search field in schema is text
[junit4:junit4]   2> 3807 T2371 oasc.RequestHandlers.initHandlersFromConfig created tvrh: org.apache.solr.handler.component.SearchHandler
[junit4:junit4]   2> 3808 T2371 oasc.RequestHandlers.initHandlersFromConfig created /mlt: solr.MoreLikeThisHandler
[junit4:junit4]   2> 3809 T2371 oasc.RequestHandlers.initHandlersFromConfig created /debug/dump: solr.DumpRequestHandler
[junit4:junit4]   2> 3811 T2370 oass.IndexSchema.readSchema unique key field: id
[junit4:junit4]   2> 3812 T2371 oashl.XMLLoader.init xsltCacheLifetimeSeconds=60
[junit4:junit4]   2> 3814 T2371 oasc.SolrCore.initDeprecatedSupport WARNING solrconfig.xml uses deprecated <admin/gettableFiles>, Please update your config to use the ShowFileRequestHandler.
[junit4:junit4]   2> 3816 T2371 oasc.SolrCore.initDeprecatedSupport WARNING adding ShowFileRequestHandler with hidden files: [BAD-SOLRCONFIG-INVALID-SCRIPTFILE.XML, SOLRCONFIG-UPDATE-PROCESSOR-CHAINS.XML, BAD-SCHEMA-CURRENCY-FT-MULTIVALUED.XML, MISSLEADING.EXTENSION.UPDATEPROCESSOR.JS.TXT, SCHEMA-SNIPPET-FIELD.XML, XSLT, SOLRCONFIG-MASTER2.XML, SOLRCONFIG-DELPOLICY1.XML, BAD-SOLRCONFIG-MISSING-SCRIPTFILE.XML, SOLRCONFIG-MASTER.XML, SCHEMA-STOP-KEEP.XML, BAD-SCHEMA-CURRENCY-MULTIVALUED.XML, BAD-SCHEMA-NOT-INDEXED-BUT-NORMS.XML, SOLRCONFIG-PROPINJECT.XML, SCHEMA-TFIDF.XML, SCHEMA-SPATIAL.XML, FRENCHARTICLES.TXT, FUZZYSUGGEST.TXT, SCHEMA-NUMERIC.XML, SCHEMA-BM25.XML, MISSING.FUNCTIONS.UPDATEPROCESSOR.JS, SOLRCONFIG_PERF.XML, SOLRCONFIG-CACHING.XML, SOLRCONFIG-SOLCOREPROPERTIES.XML, SCHEMA-SNIPPET-TYPE.XML, COMPOUNDDICTIONARY.TXT, SOLRCONFIG-REQHANDLER.INCL, SCHEMA-PHRASESUGGEST.XML, ELEVATE.XML, SOLRCONFIG-ELEVATE.XML, SCHEMA-REVERSED.XML, SOLRCONFIG-HIGHLIGHT.XML, SOLRCONFIG-DELPOLICY2.XML, SOLRCONFIG-INDEXCONFIG.XML, BAD-SCHEMA-NONTEXT-ANALYZER.XML, SOLRCONFIG-NOCACHE.XML, MAPPING-ISOLATIN1ACCENT.TXT, SOLRCONFIG-LAZYWRITER.XML, BAD-SCHEMA-DUP-FIELDTYPE.XML, SCHEMA-REPLICATION1.XML, SCHEMA-COPYFIELD-TEST.XML, BAD-SCHEMA-SIM-GLOBAL-VS-FT-MISMATCH.XML, SCHEMA15.XML, SCHEMA-BEHAVIOR.XML, SOLRCONFIG-SIMPLELOCK.XML, BAD_SOLRCONFIG.XML, BAD-SCHEMA-UNIQUEKEY-USES-DEFAULT.XML, KEEP-2.TXT, BAD-SCHEMA-NOT-INDEXED-BUT-POS.XML, SCHEMASURROUND.XML, SOLRCONFIG-SCRIPT-UPDATEPROCESSOR.XML, SOLRCONFIG-SNIPPET-PROCESSOR.XML, SOLRCONFIG-TRANSFORMERS.XML, SOLRCONFIG-FUNCTIONQUERY.XML, SCHEMA-SPELLCHECKER.XML, BAD-SCHEMA-DUP-DYNAMICFIELD.XML, THROW.ERROR.ON.ADD.UPDATEPROCESSOR.JS, SOLRCONFIG-QUERYSENDER.XML, SCHEMA-TRIE.XML, SCHEMA-LMJELINEKMERCER.XML, SOLRCONFIG-PROPINJECT-INDEXDEFAULT.XML, SCHEMA-CHARFILTERS.XML, SOLRCONFIG-SPELLCHECKCOMPONENT.XML, SOLRCONFIG-ALTDIRECTORY.XML, SCHEMA-FOLDING.XML, SCHEMA-EFF.XML, SOLRCONFIG-XINCLUDE.XML, SCHEMA-NOT-REQUIRED-UNIQUE-KEY.XML, BAD-SCHEMA-UNIQUEKEY-IS-COPYFIELD-DEST.XML, STEMDICT.TXT, STOPTYPES-1.TXT, SOLRCONFIG-QUERYSENDER-NOQUERY.XML, HUNSPELL-TEST.DIC, SCHEMA-REQUIRED-FIELDS.XML, SOLRCONFIG-ENABLEPLUGIN.XML, SCHEMA.XML, STOPWITHBOM.TXT, SCHEMA-LMDIRICHLET.XML, SYNONYMS.TXT, SOLRCONFIG-MERGEPOLICY.XML, CURRENCY.XML, TRIVIAL.UPDATEPROCESSOR1.JS, SOLRCONFIG-SLAVE.XML, SCHEMA12.XML, STOPTYPES-2.TXT, BAD-SCHEMA-ANALYZER-CLASS-AND-NESTED.XML, BAD-MP-SOLRCONFIG.XML, BAD-SCHEMA-CURRENCY-DYNAMIC-MULTIVALUED.XML, SOLRCONFIG-TERMINDEX.XML, BAD-SCHEMA-EXTERNAL-FILEFIELD.XML, SCHEMA-LUCENEMATCHVERSION.XML, SCHEMA-REPLICATION2.XML, TRIVIAL.UPDATEPROCESSOR0.JS, OLD_SYNONYMS.TXT, PROTWORDS.TXT, BAD-SOLRCONFIG-BOGUS-SCRIPTENGINE-NAME.XML, KEEP-1.TXT, SOLRCONFIG-SLAVE1.XML, SCHEMA-IB.XML, STOP-2.TXT, SCHEMA-MINIMAL.XML, BAD-SCHEMA-UNIQUEKEY-MULTIVALUED.XML, OPEN-EXCHANGE-RATES.JSON, DA_COMPOUNDDICTIONARY.TXT, SCHEMA-DFR.XML, SOLRCONFIG-REPEATER.XML, STOP-1.TXT, SOLRCONFIG-MASTER1.XML, HYPHENATION.DTD, SOLRCONFIG-RESPONSE-LOG-COMPONENT.XML, SOLRCONFIG-BASIC.XML, PHRASESUGGEST.TXT, JASUGGEST.TXT, SCHEMA-SIM.XML, SOLRCONFIG_CODEC.XML, DA_UTF8.XML, BAD-SCHEMA-DUP-FIELD.XML, SOLRCONFIG-PHRASESUGGEST.XML, SOLRCONFIG-TLOG.XML, STOPWORDSWRONGENCODING.TXT, SOLRCONFIG-MASTER1-KEEPONEBACKUP.XML, SOLRCONFIG-SPELLCHECKER.XML, SCHEMA-XINCLUDE.XML, BAD-SCHEMA-NOT-INDEXED-BUT-TF.XML, CONDITIONAL.UPDATEPROCESSOR.JS, SOLRCONFIG-MASTER3.XML, WDFTYPES.TXT, STOPWORDS.TXT, SOLRCONFIG-SOLR-749.XML, SCHEMA-COLLATE.XML, BAD-SCHEMA-OMIT-TF-BUT-NOT-POS.XML, SCHEMA_CODEC.XML, HUNSPELL-TEST.AFF, ADDFIELDS.UPDATEPROCESSOR.JS, SCHEMA11.XML, BAD-SCHEMA-CODEC-GLOBAL-VS-FT-MISMATCH.XML, STOP-SNOWBALL.TXT, SCHEMA-BINARYFIELD.XML, SOLRCONFIG-NATIVELOCK.XML]
[junit4:junit4]   2> 3817 T2370 oass.FileExchangeRateProvider.reload Reloading exchange rates from file currency.xml
[junit4:junit4]   2> 3819 T2371 oasc.CachingDirectoryFactory.close Releasing directory:/mnt/ssd/jenkins/workspace/Lucene-Solr-trunk-Linux/solr/build/solr-core/test-files/solr/collection1/data
[junit4:junit4]   2> 3820 T2371 oass.SolrIndexSearcher.<init> Opening Searcher@16c1ec main
[junit4:junit4]   2> 3820 T2371 oasu.CommitTracker.<init> Hard AutoCommit: disabled
[junit4:junit4]   2> 3821 T2371 oasu.CommitTracker.<init> Soft AutoCommit: disabled
[junit4:junit4]   2> 3821 T2371 oashc.SpellCheckComponent.inform Initializing spell checkers
[junit4:junit4]   2> 3822 T2371 oass.DirectSolrSpellChecker.init init: {name=direct,classname=DirectSolrSpellChecker,field=lowerfilt,minQueryLength=3}
[junit4:junit4]   2> 3823 T2370 oass.FileExchangeRateProvider.reload Reloading exchange rates from file currency.xml
[junit4:junit4]   2> 3827 T2370 oass.OpenExchangeRatesOrgProvider.reload Reloading exchange rates from open-exchange-rates.json
[junit4:junit4]   2> 3828 T2370 oass.OpenExchangeRatesOrgProvider.reload Reloading exchange rates from open-exchange-rates.json
[junit4:junit4]   2> 3828 T2371 oashc.HttpShardHandlerFactory.getParameter Setting socketTimeout to: 0
[junit4:junit4]   2> 3828 T2371 oashc.HttpShardHandlerFactory.getParameter Setting urlScheme to: http://
[junit4:junit4]   2> 3828 T2370 oasc.SolrCore.<init> [collection1] Opening new SolrCore at /mnt/ssd/jenkins/workspace/Lucene-Solr-trunk-Linux/solr/build/solr-core/test-files/solr/collection1/, dataDir=/mnt/ssd/jenkins/workspace/Lucene-Solr-trunk-Linux/solr/build/solr-core/test-files/solr/collection1/data/
[junit4:junit4]   2> 3828 T2371 oashc.HttpShardHandlerFactory.getParameter Setting connTimeout to: 0
[junit4:junit4]   2> 3829 T2370 oasc.JmxMonitoredMap.<init> JMX monitoring is enabled. Adding Solr mbeans to JMX Server: com.sun.jmx.mbeanserver.JmxMBeanServer@d4fdf1
[junit4:junit4]   2> 3829 T2371 oashc.HttpShardHandlerFactory.getParameter Setting maxConnectionsPerHost to: 20
[junit4:junit4]   2> 3829 T2371 oashc.HttpShardHandlerFactory.getParameter Setting corePoolSize to: 0
[junit4:junit4]   2> 3829 T2370 oasc.SolrCore.initDirectoryFactory org.apache.solr.core.MockDirectoryFactory
[junit4:junit4]   2> 3829 T2371 oashc.HttpShardHandlerFactory.getParameter Setting maximumPoolSize to: 2147483647
[junit4:junit4]   2> 3830 T2371 oashc.HttpShardHandlerFactory.getParameter Setting maxThreadIdleTime to: 5
[junit4:junit4]   2> 3830 T2370 oasc.CachingDirectoryFactory.injectLockFactory WARNING No lockType configured for MockDirWrapper(org.apache.lucene.store.RAMDirectory@118bb84 lockFactory=org.apache.lucene.store.SingleInstanceLockFactory@bef04a) assuming 'simple'
[junit4:junit4]   2> 3830 T2371 oashc.HttpShardHandlerFactory.getParameter Setting sizeOfQueue to: -1
[junit4:junit4]   2> 3831 T2370 oasc.CachingDirectoryFactory.get return new directory for /mnt/ssd/jenkins/workspace/Lucene-Solr-trunk-Linux/solr/build/solr-core/test-files/solr/collection1/data forceNew:false
[junit4:junit4]   2> 3831 T2371 oashc.HttpShardHandlerFactory.getParameter Setting fairnessPolicy to: false
[junit4:junit4]   2> 3831 T2370 oasc.CachingDirectoryFactory.close Releasing directory:/mnt/ssd/jenkins/workspace/Lucene-Solr-trunk-Linux/solr/build/solr-core/test-files/solr/collection1/data
[junit4:junit4]   2> 3831 T2371 oascsi.HttpClientUtil.createClient Creating new http client, config:maxConnectionsPerHost=20&maxConnections=10000&socketTimeout=0&connTimeout=0&retry=false
[junit4:junit4]   2> 3831 T2370 oasc.SolrCore.getNewIndexDir New index directory detected: old=null new=/mnt/ssd/jenkins/workspace/Lucene-Solr-trunk-Linux/solr/build/solr-core/test-files/solr/collection1/data/index/
[junit4:junit4]   2> 3832 T2370 oasc.SolrCore.initIndex WARNING [collection1] Solr index directory '/mnt/ssd/jenkins/workspace/Lucene-Solr-trunk-Linux/solr/build/solr-core/test-files/solr/collection1/data/index' doesn't exist. Creating new index...
[junit4:junit4]   2> 3832 T2370 oasc.CachingDirectoryFactory.get return new directory for /mnt/ssd/jenkins/workspace/Lucene-Solr-trunk-Linux/solr/build/solr-core/test-files/solr/collection1/data/index forceNew:false
[junit4:junit4]   2> 3834 T2370 oasc.SolrDeletionPolicy.onCommit SolrDeletionPolicy.onCommit: commits:num=1
[junit4:junit4]   2> 		commit{dir=MockDirWrapper(org.apache.lucene.store.RAMDirectory@106ca81 lockFactory=org.apache.lucene.store.NativeFSLockFactory@c4b9eb),segFN=segments_1,generation=1,filenames=[segments_1]
[junit4:junit4]   2> 3834 T2370 oasc.SolrDeletionPolicy.updateCommits newest commit = 1[segments_1]
[junit4:junit4]   2> 3834 T2370 oasc.CachingDirectoryFactory.close Releasing directory:/mnt/ssd/jenkins/workspace/Lucene-Solr-trunk-Linux/solr/build/solr-core/test-files/solr/collection1/data/index
[junit4:junit4]   2> 3835 T2370 oasc.SolrCore.initWriters created xml: solr.XMLResponseWriter
[junit4:junit4]   2> 3837 T2370 oasup.UpdateRequestProcessorChain.init inserting DistributedUpdateProcessorFactory into updateRequestProcessorChain "dedupe"
[junit4:junit4]   2> 3837 T2370 oasup.UpdateRequestProcessorChain.init inserting DistributedUpdateProcessorFactory into updateRequestProcessorChain "dedupe-allfields"
[junit4:junit4]   2> 3837 T2370 oasup.UpdateRequestProcessorChain.init inserting DistributedUpdateProcessorFactory into updateRequestProcessorChain "stored_sig"
[junit4:junit4]   2> 3838 T2370 oasup.UpdateRequestProcessorChain.init inserting DistributedUpdateProcessorFactory into updateRequestProcessorChain "uniq-fields"
[junit4:junit4]   2> 3838 T2370 oasup.UpdateRequestProcessorChain.init inserting DistributedUpdateProcessorFactory into updateRequestProcessorChain "distrib-dup-test-chain-implicit"
[junit4:junit4]   2> 3839 T2370 oasc.RequestHandlers.initHandlersFromConfig adding lazy requestHandler: solr.ReplicationHandler
[junit4:junit4]   2> 3839 T2370 oasc.RequestHandlers.initHandlersFromConfig created /replication: solr.ReplicationHandler
[junit4:junit4]   2> 3840 T2370 oasc.RequestHandlers.initHandlersFromConfig created standard: solr.StandardRequestHandler
[junit4:junit4]   2> 3841 T2370 oasc.RequestHandlers.initHandlersFromConfig created /get: solr.RealTimeGetHandler
[junit4:junit4]   2> 3842 T2372 oasc.SolrCore.registerSearcher [collectionLazy5] Registered new searcher Searcher@16c1ec main{StandardDirectoryReader(segments_1:1)}
[junit4:junit4]   2> 3842 T2370 oasc.RequestHandlers.initHandlersFromConfig created dismax: solr.SearchHandler
[junit4:junit4]   2> 3844 T2370 oasc.RequestHandlers.initHandlersFromConfig created mock: org.apache.solr.core.MockQuerySenderListenerReqHandler
[junit4:junit4]   2> 3844 T2370 oasc.RequestHandlers.initHandlersFromConfig created /admin/: org.apache.solr.handler.admin.AdminHandlers
[junit4:junit4]   2> 3845 T2370 oasc.RequestHandlers.initHandlersFromConfig created defaults: solr.StandardRequestHandler
[junit4:junit4]   2> 3845 T2370 oasc.RequestHandlers.initHandlersFromConfig adding lazy requestHandler: solr.StandardRequestHandler
[junit4:junit4]   2> 3846 T2370 oasc.RequestHandlers.initHandlersFromConfig created lazy: solr.StandardRequestHandler
[junit4:junit4]   2> 3847 T2370 oasc.RequestHandlers.initHandlersFromConfig created /update: solr.UpdateRequestHandler
[junit4:junit4]   2> 3847 T2371 oasc.CoreContainer.registerCore registering core: collectionLazy5
[junit4:junit4]   2> 3848 T2370 oasc.RequestHandlers.initHandlersFromConfig created /terms: org.apache.solr.handler.component.SearchHandler
[junit4:junit4]   2> 3848 T2370 oasc.RequestHandlers.initHandlersFromConfig created spellCheckCompRH: org.apache.solr.handler.component.SearchHandler
[junit4:junit4]   2> 3849 T2370 oasc.RequestHandlers.initHandlersFromConfig created spellCheckCompRH_Direct: org.apache.solr.handler.component.SearchHandler
[junit4:junit4]   2> 3850 T2370 oasc.RequestHandlers.initHandlersFromConfig created spellCheckWithWordbreak: org.apache.solr.handler.component.SearchHandler
[junit4:junit4]   2> 3850 T2370 oasc.RequestHandlers.initHandlersFromConfig created spellCheckWithWordbreak_Direct: org.apache.solr.handler.component.SearchHandler
[junit4:junit4]   2> 3851 T2370 oasc.RequestHandlers.initHandlersFromConfig created spellCheckCompRH1: org.apache.solr.handler.component.SearchHandler
[junit4:junit4]   2> 3852 T2370 oasc.RequestHandlers.initHandlersFromConfig created tvrh: org.apache.solr.handler.component.SearchHandler
[junit4:junit4]   2> 3852 T2370 oasc.RequestHandlers.initHandlersFromConfig created /mlt: solr.MoreLikeThisHandler
[junit4:junit4]   2> 3853 T2370 oasc.RequestHandlers.initHandlersFromConfig created /debug/dump: solr.DumpRequestHandler
[junit4:junit4]   2> 3855 T2370 oashl.XMLLoader.init xsltCacheLifetimeSeconds=60
[junit4:junit4]   2> 3857 T2370 oasc.SolrCore.initDeprecatedSupport WARNING solrconfig.xml uses deprecated <admin/gettableFiles>, Please update your config to use the ShowFileRequestHandler.
[junit4:junit4]   2> 3858 T2370 oasc.SolrCore.initDeprecatedSupport WARNING adding ShowFileRequestHandler with hidden files: [BAD-SOLRCONFIG-INVALID-SCRIPTFILE.XML, SOLRCONFIG-UPDATE-PROCESSOR-CHAINS.XML, BAD-SCHEMA-CURRENCY-FT-MULTIVALUED.XML, MISSLEADING.EXTENSION.UPDATEPROCESSOR.JS.TXT, SCHEMA-SNIPPET-FIELD.XML, XSLT, SOLRCONFIG-MASTER2.XML, SOLRCONFIG-DELPOLICY1.XML, BAD-SOLRCONFIG-MISSING-SCRIPTFILE.XML, SOLRCONFIG-MASTER.XML, SCHEMA-STOP-KEEP.XML, BAD-SCHEMA-CURRENCY-MULTIVALUED.XML, BAD-SCHEMA-NOT-INDEXED-BUT-NORMS.XML, SOLRCONFIG-PROPINJECT.XML, SCHEMA-TFIDF.XML, SCHEMA-SPATIAL.XML, FRENCHARTICLES.TXT, FUZZYSUGGEST.TXT, SCHEMA-NUMERIC.XML, SCHEMA-BM25.XML, MISSING.FUNCTIONS.UPDATEPROCESSOR.JS, SOLRCONFIG_PERF.XML, SOLRCONFIG-CACHING.XML, SOLRCONFIG-SOLCOREPROPERTIES.XML, SCHEMA-SNIPPET-TYPE.XML, COMPOUNDDICTIONARY.TXT, SOLRCONFIG-REQHANDLER.INCL, SCHEMA-PHRASESUGGEST.XML, ELEVATE.XML, SOLRCONFIG-ELEVATE.XML, SCHEMA-REVERSED.XML, SOLRCONFIG-HIGHLIGHT.XML, SOLRCONFIG-DELPOLICY2.XML, SOLRCONFIG-INDEXCONFIG.XML, BAD-SCHEMA-NONTEXT-ANALYZER.XML, SOLRCONFIG-NOCACHE.XML, MAPPING-ISOLATIN1ACCENT.TXT, SOLRCONFIG-LAZYWRITER.XML, BAD-SCHEMA-DUP-FIELDTYPE.XML, SCHEMA-REPLICATION1.XML, SCHEMA-COPYFIELD-TEST.XML, BAD-SCHEMA-SIM-GLOBAL-VS-FT-MISMATCH.XML, SCHEMA15.XML, SCHEMA-BEHAVIOR.XML, SOLRCONFIG-SIMPLELOCK.XML, BAD_SOLRCONFIG.XML, BAD-SCHEMA-UNIQUEKEY-USES-DEFAULT.XML, KEEP-2.TXT, BAD-SCHEMA-NOT-INDEXED-BUT-POS.XML, SCHEMASURROUND.XML, SOLRCONFIG-SCRIPT-UPDATEPROCESSOR.XML, SOLRCONFIG-SNIPPET-PROCESSOR.XML, SOLRCONFIG-TRANSFORMERS.XML, SOLRCONFIG-FUNCTIONQUERY.XML, SCHEMA-SPELLCHECKER.XML, BAD-SCHEMA-DUP-DYNAMICFIELD.XML, THROW.ERROR.ON.ADD.UPDATEPROCESSOR.JS, SOLRCONFIG-QUERYSENDER.XML, SCHEMA-TRIE.XML, SCHEMA-LMJELINEKMERCER.XML, SOLRCONFIG-PROPINJECT-INDEXDEFAULT.XML, SCHEMA-CHARFILTERS.XML, SOLRCONFIG-SPELLCHECKCOMPONENT.XML, SOLRCONFIG-ALTDIRECTORY.XML, SCHEMA-FOLDING.XML, SCHEMA-EFF.XML, SOLRCONFIG-XINCLUDE.XML, SCHEMA-NOT-REQUIRED-UNIQUE-KEY.XML, BAD-SCHEMA-UNIQUEKEY-IS-COPYFIELD-DEST.XML, STEMDICT.TXT, STOPTYPES-1.TXT, SOLRCONFIG-QUERYSENDER-NOQUERY.XML, HUNSPELL-TEST.DIC, SCHEMA-REQUIRED-FIELDS.XML, SOLRCONFIG-ENABLEPLUGIN.XML, SCHEMA.XML, STOPWITHBOM.TXT, SCHEMA-LMDIRICHLET.XML, SYNONYMS.TXT, SOLRCONFIG-MERGEPOLICY.XML, CURRENCY.XML, TRIVIAL.UPDATEPROCESSOR1.JS, SOLRCONFIG-SLAVE.XML, SCHEMA12.XML, STOPTYPES-2.TXT, BAD-SCHEMA-ANALYZER-CLASS-AND-NESTED.XML, BAD-MP-SOLRCONFIG.XML, BAD-SCHEMA-CURRENCY-DYNAMIC-MULTIVALUED.XML, SOLRCONFIG-TERMINDEX.XML, BAD-SCHEMA-EXTERNAL-FILEFIELD.XML, SCHEMA-LUCENEMATCHVERSION.XML, SCHEMA-REPLICATION2.XML, TRIVIAL.UPDATEPROCESSOR0.JS, OLD_SYNONYMS.TXT, PROTWORDS.TXT, BAD-SOLRCONFIG-BOGUS-SCRIPTENGINE-NAME.XML, KEEP-1.TXT, SOLRCONFIG-SLAVE1.XML, SCHEMA-IB.XML, STOP-2.TXT, SCHEMA-MINIMAL.XML, BAD-SCHEMA-UNIQUEKEY-MULTIVALUED.XML, OPEN-EXCHANGE-RATES.JSON, DA_COMPOUNDDICTIONARY.TXT, SCHEMA-DFR.XML, SOLRCONFIG-REPEATER.XML, STOP-1.TXT, SOLRCONFIG-MASTER1.XML, HYPHENATION.DTD, SOLRCONFIG-RESPONSE-LOG-COMPONENT.XML, SOLRCONFIG-BASIC.XML, PHRASESUGGEST.TXT, JASUGGEST.TXT, SCHEMA-SIM.XML, SOLRCONFIG_CODEC.XML, DA_UTF8.XML, BAD-SCHEMA-DUP-FIELD.XML, SOLRCONFIG-PHRASESUGGEST.XML, SOLRCONFIG-TLOG.XML, STOPWORDSWRONGENCODING.TXT, SOLRCONFIG-MASTER1-KEEPONEBACKUP.XML, SOLRCONFIG-SPELLCHECKER.XML, SCHEMA-XINCLUDE.XML, BAD-SCHEMA-NOT-INDEXED-BUT-TF.XML, CONDITIONAL.UPDATEPROCESSOR.JS, SOLRCONFIG-MASTER3.XML, WDFTYPES.TXT, STOPWORDS.TXT, SOLRCONFIG-SOLR-749.XML, SCHEMA-COLLATE.XML, BAD-SCHEMA-OMIT-TF-BUT-NOT-POS.XML, SCHEMA_CODEC.XML, HUNSPELL-TEST.AFF, ADDFIELDS.UPDATEPROCESSOR.JS, SCHEMA11.XML, BAD-SCHEMA-CODEC-GLOBAL-VS-FT-MISMATCH.XML, STOP-SNOWBALL.TXT, SCHEMA-BINARYFIELD.XML, SOLRCONFIG-NATIVELOCK.XML]
[junit4:junit4]   2> 3860 T2370 oasc.CachingDirectoryFactory.close Releasing directory:/mnt/ssd/jenkins/workspace/Lucene-Solr-trunk-Linux/solr/build/solr-core/test-files/solr/collection1/data
[junit4:junit4]   2> 3861 T2370 oass.SolrIndexSearcher.<init> Opening Searcher@1b4117b main
[junit4:junit4]   2> 3861 T2370 oasu.CommitTracker.<init> Hard AutoCommit: disabled
[junit4:junit4]   2> 3861 T2370 oasu.CommitTracker.<init> Soft AutoCommit: disabled
[junit4:junit4]   2> 3862 T2370 oashc.SpellCheckComponent.inform Initializing spell checkers
[junit4:junit4]   2> 3863 T2370 oass.DirectSolrSpellChecker.init init: {name=direct,classname=DirectSolrSpellChecker,field=lowerfilt,minQueryLength=3}
[junit4:junit4]   2> 3873 T2373 oasc.SolrCore.registerSearcher [collection1] Registered new searcher Searcher@1b4117b main{StandardDirectoryReader(segments_1:1)}
[junit4:junit4]   2> 3877 T2370 oasc.CoreContainer.registerCore registering core: collection1
[junit4:junit4]   2> 3878 T2362 oasc.CoreContainer.create Creating SolrCore 'collectionLazy2' using instanceDir: /mnt/ssd/jenkins/workspace/Lucene-Solr-trunk-Linux/solr/build/solr-core/test-files/solr/collection1
[junit4:junit4]   2> 3878 T2362 oasc.SolrResourceLoader.<init> new SolrResourceLoader for directory: '/mnt/ssd/jenkins/workspace/Lucene-Solr-trunk-Linux/solr/build/solr-core/test-files/solr/collection1/'
[junit4:junit4]   2> 3879 T2362 oasc.SolrResourceLoader.replaceClassLoader Adding 'file:/mnt/ssd/jenkins/workspace/Lucene-Solr-trunk-Linux/solr/build/solr-core/test-files/solr/collection1/lib/README' to classloader
[junit4:junit4]   2> 3879 T2362 oasc.SolrResourceLoader.replaceClassLoader Adding 'file:/mnt/ssd/jenkins/workspace/Lucene-Solr-trunk-Linux/solr/build/solr-core/test-files/solr/collection1/lib/classes/' to classloader
[junit4:junit4]   2> 3912 T2362 oasc.SolrConfig.<init> Using Lucene MatchVersion: LUCENE_50
[junit4:junit4]   2> 3956 T2362 oasc.SolrConfig.<init> Loaded SolrConfig: solrconfig.xml
[junit4:junit4]   2> 3956 T2362 oass.IndexSchema.readSchema Reading Solr Schema
[junit4:junit4]   2> 3961 T2362 oass.IndexSchema.readSchema Schema name=test
[junit4:junit4]   2> 4342 T2362 oass.OpenExchangeRatesOrgProvider.init Initialized with rates=open-exchange-rates.json, refreshInterval=1440.
[junit4:junit4]   2> 4349 T2362 oass.IndexSchema.readSchema default search field in schema is text
[junit4:junit4]   2> 4352 T2362 oass.IndexSchema.readSchema unique key field: id
[junit4:junit4]   2> 4356 T2362 oass.FileExchangeRateProvider.reload Reloading exchange rates from file currency.xml
[junit4:junit4]   2> 4359 T2362 oass.FileExchangeRateProvider.reload Reloading exchange rates from file currency.xml
[junit4:junit4]   2> 4362 T2362 oass.OpenExchangeRatesOrgProvider.reload Reloading exchange rates from open-exchange-rates.json
[junit4:junit4]   2> 4363 T2362 oass.OpenExchangeRatesOrgProvider.reload Reloading exchange rates from open-exchange-rates.json
[junit4:junit4]   2> 4363 T2362 oasc.SolrCore.<init> [collectionLazy2] Opening new SolrCore at /mnt/ssd/jenkins/workspace/Lucene-Solr-trunk-Linux/solr/build/solr-core/test-files/solr/collection1/, dataDir=/mnt/ssd/jenkins/workspace/Lucene-Solr-trunk-Linux/solr/build/solr-core/test-files/solr/collection1/data/
[junit4:junit4]   2> 4364 T2362 oasc.JmxMonitoredMap.<init> JMX monitoring is enabled. Adding Solr mbeans to JMX Server: com.sun.jmx.mbeanserver.JmxMBeanServer@d4fdf1
[junit4:junit4]   2> 4364 T2362 oasc.SolrCore.initDirectoryFactory org.apache.solr.core.MockDirectoryFactory
[junit4:junit4]   2> 4365 T2362 oasc.CachingDirectoryFactory.injectLockFactory WARNING No lockType configured for MockDirWrapper(org.apache.lucene.store.RAMDirectory@10062e4 lockFactory=org.apache.lucene.store.SingleInstanceLockFactory@5c6846) assuming 'simple'
[junit4:junit4]   2> 4366 T2362 oasc.CachingDirectoryFactory.get return new directory for /mnt/ssd/jenkins/workspace/Lucene-Solr-trunk-Linux/solr/build/solr-core/test-files/solr/collection1/data forceNew:false
[junit4:junit4]   2> 4366 T2362 oasc.CachingDirectoryFactory.close Releasing directory:/mnt/ssd/jenkins/workspace/Lucene-Solr-trunk-Linux/solr/build/solr-core/test-files/solr/collection1/data
[junit4:junit4]   2> 4367 T2362 oasc.SolrCore.getNewIndexDir New index directory detected: old=null new=/mnt/ssd/jenkins/workspace/Lucene-Solr-trunk-Linux/solr/build/solr-core/test-files/solr/collection1/data/index/
[junit4:junit4]   2> 4367 T2362 oasc.SolrCore.initIndex WARNING [collectionLazy2] Solr index directory '/mnt/ssd/jenkins/workspace/Lucene-Solr-trunk-Linux/solr/build/solr-core/test-files/solr/collection1/data/index' doesn't exist. Creating new index...
[junit4:junit4]   2> 4368 T2362 oasc.CachingDirectoryFactory.get return new directory for /mnt/ssd/jenkins/workspace/Lucene-Solr-trunk-Linux/solr/build/solr-core/test-files/solr/collection1/data/index forceNew:false
[junit4:junit4]   2> 4369 T2362 oasc.SolrDeletionPolicy.onCommit SolrDeletionPolicy.onCommit: commits:num=1
[junit4:junit4]   2> 		commit{dir=MockDirWrapper(NRTCachingDirectory(org.apache.lucene.store.RAMDirectory@147550c lockFactory=org.apache.lucene.store.NativeFSLockFactory@1d9c396; maxCacheMB=0.5771484375 maxMergeSizeMB=0.4052734375)),segFN=segments_1,generation=1,filenames=[segments_1]
[junit4:junit4]   2> 4370 T2362 oasc.SolrDeletionPolicy.updateCommits newest commit = 1[segments_1]
[junit4:junit4]   2> 4370 T2362 oasc.CachingDirectoryFactory.close Releasing directory:/mnt/ssd/jenkins/workspace/Lucene-Solr-trunk-Linux/solr/build/solr-core/test-files/solr/collection1/data/index
[junit4:junit4]   2> 4370 T2362 oasc.SolrCore.initWriters created xml: solr.XMLResponseWriter
[junit4:junit4]   2> 4372 T2362 oasup.UpdateRequestProcessorChain.init inserting DistributedUpdateProcessorFactory into updateRequestProcessorChain "dedupe"
[junit4:junit4]   2> 4372 T2362 oasup.UpdateRequestProcessorChain.init inserting DistributedUpdateProcessorFactory into updateRequestProcessorChain "dedupe-allfields"
[junit4:junit4]   2> 4373 T2362 oasup.UpdateRequestProcessorChain.init inserting DistributedUpdateProcessorFactory into updateRequestProcessorChain "stored_sig"
[junit4:junit4]   2> 4373 T2362 oasup.UpdateRequestProcessorChain.init inserting DistributedUpdateProcessorFactory into updateRequestProcessorChain "uniq-fields"
[junit4:junit4]   2> 4374 T2362 oasup.UpdateRequestProcessorChain.init inserting DistributedUpdateProcessorFactory into updateRequestProcessorChain "distrib-dup-test-chain-implicit"
[junit4:junit4]   2> 4374 T2362 oasc.RequestHandlers.initHandlersFromConfig adding lazy requestHandler: solr.ReplicationHandler
[junit4:junit4]   2> 4375 T2362 oasc.RequestHandlers.initHandlersFromConfig created /replication: solr.ReplicationHandler
[junit4:junit4]   2> 4376 T2362 oasc.RequestHandlers.initHandlersFromConfig created standard: solr.StandardRequestHandler
[junit4:junit4]   2> 4377 T2362 oasc.RequestHandlers.initHandlersFromConfig created /get: solr.RealTimeGetHandler
[junit4:junit4]   2> 4378 T2362 oasc.RequestHandlers.initHandlersFromConfig created dismax: solr.SearchHandler
[junit4:junit4]   2> 4379 T2362 oasc.RequestHandlers.initHandlersFromConfig created mock: org.apache.solr.core.MockQuerySenderListenerReqHandler
[junit4:junit4]   2> 4379 T2362 oasc.RequestHandlers.initHandlersFromConfig created /admin/: org.apache.solr.handler.admin.AdminHandlers
[junit4:junit4]   2> 4380 T2362 oasc.RequestHandlers.initHandlersFromConfig created defaults: solr.StandardRequestHandler
[junit4:junit4]   2> 4381 T2362 oasc.RequestHandlers.initHandlersFromConfig adding lazy requestHandler: solr.StandardRequestHandler
[junit4:junit4]   2> 4381 T2362 oasc.RequestHandlers.initHandlersFromConfig created lazy: solr.StandardRequestHandler
[junit4:junit4]   2> 4382 T2362 oasc.RequestHandlers.initHandlersFromConfig created /update: solr.UpdateRequestHandler
[junit4:junit4]   2> 4383 T2362 oasc.RequestHandlers.initHandlersFromConfig created /terms: org.apache.solr.handler.component.SearchHandler
[junit4:junit4]   2> 4384 T2362 oasc.RequestHandlers.initHandlersFromConfig created spellCheckCompRH: org.apache.solr.handler.component.SearchHandler
[junit4:junit4]   2> 4385 T2362 oasc.RequestHandlers.initHandlersFromConfig created spellCheckCompRH_Direct: org.apache.solr.handler.component.SearchHandler
[junit4:junit4]   2> 4386 T2362 oasc.RequestHandlers.initHandlersFromConfig created spellCheckWithWordbreak: org.apache.solr.handler.component.SearchHandler
[junit4:junit4]   2> 4387 T2362 oasc.RequestHandlers.initHandlersFromConfig created spellCheckWithWordbreak_Direct: org.apache.solr.handler.component.SearchHandler
[junit4:junit4]   2> 4388 T2362 oasc.RequestHandlers.initHandlersFromConfig created spellCheckCompRH1: org.apache.solr.handler.component.SearchHandler
[junit4:junit4]   2> 4389 T2362 oasc.RequestHandlers.initHandlersFromConfig created tvrh: org.apache.solr.handler.component.SearchHandler
[junit4:junit4]   2> 4390 T2362 oasc.RequestHandlers.initHandlersFromConfig created /mlt: solr.MoreLikeThisHandler
[junit4:junit4]   2> 4391 T2362 oasc.RequestHandlers.initHandlersFromConfig created /debug/dump: solr.DumpRequestHandler
[junit4:junit4]   2> 4394 T2362 oashl.XMLLoader.init xsltCacheLifetimeSeconds=60
[junit4:junit4]   2> 4396 T2362 oasc.SolrCore.initDeprecatedSupport WARNING solrconfig.xml uses deprecated <admin/gettableFiles>, Please update your config to use the ShowFileRequestHandler.
[junit4:junit4]   2> 4397 T2362 oasc.SolrCore.initDeprecatedSupport WARNING adding ShowFileRequestHandler with hidden files: [BAD-SOLRCONFIG-INVALID-SCRIPTFILE.XML, SOLRCONFIG-UPDATE-PROCESSOR-CHAINS.XML, BAD-SCHEMA-CURRENCY-FT-MULTIVALUED.XML, MISSLEADING.EXTENSION.UPDATEPROCESSOR.JS.TXT, SCHEMA-SNIPPET-FIELD.XML, XSLT, SOLRCONFIG-MASTER2.XML, SOLRCONFIG-DELPOLICY1.XML, BAD-SOLRCONFIG-MISSING-SCRIPTFILE.XML, SOLRCONFIG-MASTER.XML, SCHEMA-STOP-KEEP.XML, BAD-SCHEMA-CURRENCY-MULTIVALUED.XML, BAD-SCHEMA-NOT-INDEXED-BUT-NORMS.XML, SOLRCONFIG-PROPINJECT.XML, SCHEMA-TFIDF.XML, SCHEMA-SPATIAL.XML, FRENCHARTICLES.TXT, FUZZYSUGGEST.TXT, SCHEMA-NUMERIC.XML, SCHEMA-BM25.XML, MISSING.FUNCTIONS.UPDATEPROCESSOR.JS, SOLRCONFIG_PERF.XML, SOLRCONFIG-CACHING.XML, SOLRCONFIG-SOLCOREPROPERTIES.XML, SCHEMA-SNIPPET-TYPE.XML, COMPOUNDDICTIONARY.TXT, SOLRCONFIG-REQHANDLER.INCL, SCHEMA-PHRASESUGGEST.XML, ELEVATE.XML, SOLRCONFIG-ELEVATE.XML, SCHEMA-REVERSED.XML, SOLRCONFIG-HIGHLIGHT.XML, SOLRCONFIG-DELPOLICY2.XML, SOLRCONFIG-INDEXCONFIG.XML, BAD-SCHEMA-NONTEXT-ANALYZER.XML, SOLRCONFIG-NOCACHE.XML, MAPPING-ISOLATIN1ACCENT.TXT, SOLRCONFIG-LAZYWRITER.XML, BAD-SCHEMA-DUP-FIELDTYPE.XML, SCHEMA-REPLICATION1.XML, SCHEMA-COPYFIELD-TEST.XML, BAD-SCHEMA-SIM-GLOBAL-VS-FT-MISMATCH.XML, SCHEMA15.XML, SCHEMA-BEHAVIOR.XML, SOLRCONFIG-SIMPLELOCK.XML, BAD_SOLRCONFIG.XML, BAD-SCHEMA-UNIQUEKEY-USES-DEFAULT.XML, KEEP-2.TXT, BAD-SCHEMA-NOT-INDEXED-BUT-POS.XML, SCHEMASURROUND.XML, SOLRCONFIG-SCRIPT-UPDATEPROCESSOR.XML, SOLRCONFIG-SNIPPET-PROCESSOR.XML, SOLRCONFIG-TRANSFORMERS.XML, SOLRCONFIG-FUNCTIONQUERY.XML, SCHEMA-SPELLCHECKER.XML, BAD-SCHEMA-DUP-DYNAMICFIELD.XML, THROW.ERROR.ON.ADD.UPDATEPROCESSOR.JS, SOLRCONFIG-QUERYSENDER.XML, SCHEMA-TRIE.XML, SCHEMA-LMJELINEKMERCER.XML, SOLRCONFIG-PROPINJECT-INDEXDEFAULT.XML, SCHEMA-CHARFILTERS.XML, SOLRCONFIG-SPELLCHECKCOMPONENT.XML, SOLRCONFIG-ALTDIRECTORY.XML, SCHEMA-FOLDING.XML, SCHEMA-EFF.XML, SOLRCONFIG-XINCLUDE.XML, SCHEMA-NOT-REQUIRED-UNIQUE-KEY.XML, BAD-SCHEMA-UNIQUEKEY-IS-COPYFIELD-DEST.XML, STEMDICT.TXT, STOPTYPES-1.TXT, SOLRCONFIG-QUERYSENDER-NOQUERY.XML, HUNSPELL-TEST.DIC, SCHEMA-REQUIRED-FIELDS.XML, SOLRCONFIG-ENABLEPLUGIN.XML, SCHEMA.XML, STOPWITHBOM.TXT, SCHEMA-LMDIRICHLET.XML, SYNONYMS.TXT, SOLRCONFIG-MERGEPOLICY.XML, CURRENCY.XML, TRIVIAL.UPDATEPROCESSOR1.JS, SOLRCONFIG-SLAVE.XML, SCHEMA12.XML, STOPTYPES-2.TXT, BAD-SCHEMA-ANALYZER-CLASS-AND-NESTED.XML, BAD-MP-SOLRCONFIG.XML, BAD-SCHEMA-CURRENCY-DYNAMIC-MULTIVALUED.XML, SOLRCONFIG-TERMINDEX.XML, BAD-SCHEMA-EXTERNAL-FILEFIELD.XML, SCHEMA-LUCENEMATCHVERSION.XML, SCHEMA-REPLICATION2.XML, TRIVIAL.UPDATEPROCESSOR0.JS, OLD_SYNONYMS.TXT, PROTWORDS.TXT, BAD-SOLRCONFIG-BOGUS-SCRIPTENGINE-NAME.XML, KEEP-1.TXT, SOLRCONFIG-SLAVE1.XML, SCHEMA-IB.XML, STOP-2.TXT, SCHEMA-MINIMAL.XML, BAD-SCHEMA-UNIQUEKEY-MULTIVALUED.XML, OPEN-EXCHANGE-RATES.JSON, DA_COMPOUNDDICTIONARY.TXT, SCHEMA-DFR.XML, SOLRCONFIG-REPEATER.XML, STOP-1.TXT, SOLRCONFIG-MASTER1.XML, HYPHENATION.DTD, SOLRCONFIG-RESPONSE-LOG-COMPONENT.XML, SOLRCONFIG-BASIC.XML, PHRASESUGGEST.TXT, JASUGGEST.TXT, SCHEMA-SIM.XML, SOLRCONFIG_CODEC.XML, DA_UTF8.XML, BAD-SCHEMA-DUP-FIELD.XML, SOLRCONFIG-PHRASESUGGEST.XML, SOLRCONFIG-TLOG.XML, STOPWORDSWRONGENCODING.TXT, SOLRCONFIG-MASTER1-KEEPONEBACKUP.XML, SOLRCONFIG-SPELLCHECKER.XML, SCHEMA-XINCLUDE.XML, BAD-SCHEMA-NOT-INDEXED-BUT-TF.XML, CONDITIONAL.UPDATEPROCESSOR.JS, SOLRCONFIG-MASTER3.XML, WDFTYPES.TXT, STOPWORDS.TXT, SOLRCONFIG-SOLR-749.XML, SCHEMA-COLLATE.XML, BAD-SCHEMA-OMIT-TF-BUT-NOT-POS.XML, SCHEMA_CODEC.XML, HUNSPELL-TEST.AFF, ADDFIELDS.UPDATEPROCESSOR.JS, SCHEMA11.XML, BAD-SCHEMA-CODEC-GLOBAL-VS-FT-MISMATCH.XML, STOP-SNOWBALL.TXT, SCHEMA-BINARYFIELD.XML, SOLRCONFIG-NATIVELOCK.XML]
[junit4:junit4]   2> 4399 T2362 oasc.CachingDirectoryFactory.close Releasing directory:/mnt/ssd/jenkins/workspace/Lucene-Solr-trunk-Linux/solr/build/solr-core/test-files/solr/collection1/data
[junit4:junit4]   2> 4400 T2362 oass.SolrIndexSearcher.<init> Opening Searcher@116450d main
[junit4:junit4]   2> 4401 T2362 oasu.CommitTracker.<init> Hard AutoCommit: disabled
[junit4:junit4]   2> 4401 T2362 oasu.CommitTracker.<init> Soft AutoCommit: disabled
[junit4:junit4]   2> 4402 T2362 oashc.SpellCheckComponent.inform Initializing spell checkers
[junit4:junit4]   2> 4403 T2362 oass.DirectSolrSpellChecker.init init: {name=direct,classname=DirectSolrSpellChecker,field=lowerfilt,minQueryLength=3}
[junit4:junit4]   2> 4414 T2374 oasc.SolrCore.registerSearcher [collectionLazy2] Registered new searcher Searcher@116450d main{StandardDirectoryReader(segments_1:1)}
[junit4:junit4]   2> 4418 T2362 oasc.CoreContainer.registerCore registering core: collectionLazy2
[junit4:junit4]   2> 4419 T2362 oasc.CachingDirectoryFactory.close Releasing directory:/mnt/ssd/jenkins/workspace/Lucene-Solr-trunk-Linux/solr/build/solr-core/test-files/solr/collection1/data
[junit4:junit4]   2> 4420 T2362 oasc.SolrDeletionPolicy.onInit SolrDeletionPolicy.onInit: commits:num=1
[junit4:junit4]   2> 		commit{dir=MockDirWrapper(NRTCachingDirectory(org.apache.lucene.store.RAMDirectory@147550c lockFactory=org.apache.lucene.store.NativeFSLockFactory@1d9c396; maxCacheMB=0.5771484375 maxMergeSizeMB=0.4052734375)),segFN=segments_1,generation=1,filenames=[segments_1]
[junit4:junit4]   2> 4420 T2362 oasc.SolrDeletionPolicy.updateCommits newest commit = 1[segments_1]
[junit4:junit4]   2> 4423 T2362 oasu.DirectUpdateHandler2.commit start commit{flags=0,_version_=0,optimize=false,openSearcher=true,waitSearcher=true,expungeDeletes=false,softCommit=false}
[junit4:junit4]   2> 4424 T2362 oasc.SolrDeletionPolicy.onCommit SolrDeletionPolicy.onCommit: commits:num=2
[junit4:junit4]   2> 		commit{dir=MockDirWrapper(NRTCachingDirectory(org.apache.lucene.store.RAMDirectory@147550c lockFactory=org.apache.lucene.store.NativeFSLockFactory@1d9c396; maxCacheMB=0.5771484375 maxMergeSizeMB=0.4052734375)),segFN=segments_1,generation=1,filenames=[segments_1]
[junit4:junit4]   2> 		commit{dir=MockDirWrapper(NRTCachingDirectory(org.apache.lucene.store.RAMDirectory@147550c lockFactory=org.apache.lucene.store.NativeFSLockFactory@1d9c396; maxCacheMB=0.5771484375 maxMergeSizeMB=0.4052734375)),segFN=segments_2,generation=2,filenames=[_0.pst, segments_2, _0.fld, _0_8.len, _0_9.len, _0.si, _0_4.len, _0_6.len, _0.inf, _0_1.len, _0_7.len, _0_3.len]
[junit4:junit4]   2> 4425 T2362 oasc.SolrDeletionPolicy.updateCommits newest commit = 2[_0.pst, segments_2, _0.fld, _0_8.len, _0_9.len, _0.si, _0_4.len, _0_6.len, _0.inf, _0_1.len, _0_7.len, _0_3.len]
[junit4:junit4]   2> 4425 T2362 oasc.CachingDirectoryFactory.close Releasing directory:/mnt/ssd/jenkins/workspace/Lucene-Solr-trunk-Linux/solr/build/solr-core/test-files/solr/collection1/data
[junit4:junit4]   2> 4427 T2362 oass.SolrIndexSearcher.<init> Opening Searcher@16c95e8 main
[junit4:junit4]   2> 4427 T2362 oasu.DirectUpdateHandler2.commit end_commit_flush
[junit4:junit4]   2> 4429 T2374 oasc.SolrCore.registerSearcher [collectionLazy2] Registered new searcher Searcher@16c95e8 main{StandardDirectoryReader(segments_2:3 _0(5.0):C7)}
[junit4:junit4]   2> 4430 T2374 oasc.CachingDirectoryFactory.close Releasing directory:/mnt/ssd/jenkins/workspace/Lucene-Solr-trunk-Linux/solr/build/solr-core/test-files/solr/collection1/data/index
[junit4:junit4]   2> ASYNC  NEW_CORE C284 name=collectionLazy2 org.apache.solr.core.SolrCore@1d905a0
[junit4:junit4]   2> 4430 T2362 C284 REQ [collection1] webapp=null path=null params={q={!prefix+f%3Dv_t}hel} hits=2 status=0 QTime=0 
[junit4:junit4]   2> 4435 T2362 C284 REQ [collection1] webapp=null path=null params={q={!raw+f%3Dv_t}hello} hits=2 status=0 QTime=0 
[junit4:junit4]   2> ASYNC  NEW_CORE C285 name=collection1 org.apache.solr.core.SolrCore@1def026
[junit4:junit4]   2> 4437 T2362 C285 REQ [collection1] webapp=null path=null params={q={!raw+f%3Dv_t}hello} hits=0 status=0 QTime=0 
[junit4:junit4]   2> 4439 T2362 C284 REQ [collection1] webapp=null path=null params={q={!raw+f%3Dv_t}Hello} hits=0 status=0 QTime=0 
[junit4:junit4]   2> 4441 T2362 C284 REQ [collection1] webapp=null path=null params={q={!raw+f%3Dv_f}1.5} hits=0 status=0 QTime=1 
[junit4:junit4]   2> 4442 T2362 oasc.CachingDirectoryFactory.close Releasing directory:/mnt/ssd/jenkins/workspace/Lucene-Solr-trunk-Linux/solr/build/solr-core/test-files/solr/collection1/data/index
[junit4:junit4]   2> 4443 T2362 oasc.CoreContainer.shutdown Shutting down CoreContainer instance=9498171
[junit4:junit4]   2> 4443 T2362 oasc.SolrCore.close [collectionLazy5]  CLOSING SolrCore org.apache.solr.core.SolrCore@e0b667
[junit4:junit4]   2> 4453 T2362 oasu.DirectUpdateHandler2.close closing DirectUpdateHandler2{commits=0,autocommits=0,soft autocommits=0,optimizes=0,rollbacks=0,expungeDeletes=0,docsPending=0,adds=0,deletesById=0,deletesByQuery=0,errors=0,cumulative_adds=0,cumulative_deletesById=0,cumulative_deletesByQuery=0,cumulative_errors=0}
[junit4:junit4]   2> 4454 T2362 oasc.SolrCore.decrefSolrCoreState Closing SolrCoreState
[junit4:junit4]   2> 4455 T2362 oasu.DefaultSolrCoreState.closeIndexWriter SolrCoreState ref count has reached 0 - closing IndexWriter
[junit4:junit4]   2> 4455 T2362 oasu.DefaultSolrCoreState.closeIndexWriter closing IndexWriter with IndexWriterCloser
[junit4:junit4]   2> 4455 T2362 oasc.SolrCore.closeSearcher [collectionLazy5] Closing main searcher on request.
[junit4:junit4]   2> 4456 T2362 oasc.CachingDirectoryFactory.close Releasing directory:/mnt/ssd/jenkins/workspace/Lucene-Solr-trunk-Linux/solr/build/solr-core/test-files/solr/collection1/data/index
[junit4:junit4]   2> 4457 T2362 oasc.SolrCore.close [collection1]  CLOSING SolrCore org.apache.solr.core.SolrCore@c0552f
[junit4:junit4]   2> 4467 T2362 oasu.DirectUpdateHandler2.close closing DirectUpdateHandler2{commits=0,autocommits=0,soft autocommits=0,optimizes=0,rollbacks=0,expungeDeletes=0,docsPending=0,adds=0,deletesById=0,deletesByQuery=0,errors=0,cumulative_adds=0,cumulative_deletesById=0,cumulative_deletesByQuery=0,cumulative_errors=0}
[junit4:junit4]   2> 4468 T2362 oasc.SolrCore.decrefSolrCoreState Closing SolrCoreState
[junit4:junit4]   2> 4468 T2362 oasu.DefaultSolrCoreState.closeIndexWriter SolrCoreState ref count has reached 0 - closing IndexWriter
[junit4:junit4]   2> 4468 T2362 oasu.DefaultSolrCoreState.closeIndexWriter closing IndexWriter with IndexWriterCloser
[junit4:junit4]   2> 4469 T2362 oasc.SolrCore.closeSearcher [collection1] Closing main searcher on request.
[junit4:junit4]   2> 4470 T2362 oasc.CachingDirectoryFactory.close Releasing directory:/mnt/ssd/jenkins/workspace/Lucene-Solr-trunk-Linux/solr/build/solr-core/test-files/solr/collection1/data/index
[junit4:junit4]   2> 4470 T2362 oasc.SolrCore.close [collectionLazy2]  CLOSING SolrCore org.apache.solr.core.SolrCore@1d905a0
[junit4:junit4]   2> 4476 T2362 oasc.JmxMonitoredMap$SolrDynamicMBean.getMBeanInfo WARNING Could not getStatistics on info bean org.apache.solr.search.SolrIndexSearcher org.apache.lucene.store.AlreadyClosedException: this IndexReader is closed
[junit4:junit4]   2> 	at org.apache.lucene.index.IndexReader.ensureOpen(IndexReader.java:251)
[junit4:junit4]   2> 	at org.apache.lucene.index.StandardDirectoryReader.getVersion(StandardDirectoryReader.java:312)
[junit4:junit4]   2> 	at org.apache.solr.search.SolrIndexSearcher.getStatistics(SolrIndexSearcher.java:1988)
[junit4:junit4]   2> 	at org.apache.solr.core.JmxMonitoredMap$SolrDynamicMBean.getMBeanInfo(JmxMonitoredMap.java:231)
[junit4:junit4]   2> 	at com.sun.jmx.interceptor.DefaultMBeanServerInterceptor.getClassName(DefaultMBeanServerInterceptor.java:1804)
[junit4:junit4]   2> 	at com.sun.jmx.interceptor.DefaultMBeanServerInterceptor.safeGetClassName(DefaultMBeanServerInterceptor.java:1595)
[junit4:junit4]   2> 	at com.sun.jmx.interceptor.DefaultMBeanServerInterceptor.checkMBeanPermission(DefaultMBeanServerInterceptor.java:1813)
[junit4:junit4]   2> 	at com.sun.jmx.interceptor.DefaultMBeanServerInterceptor.getAttribute(DefaultMBeanServerInterceptor.java:644)
[junit4:junit4]   2> 	at com.sun.jmx.mbeanserver.JmxMBeanServer.getAttribute(JmxMBeanServer.java:668)
[junit4:junit4]   2> 	at org.apache.solr.core.JmxMonitoredMap.unregister(JmxMonitoredMap.java:174)
[junit4:junit4]   2> 	at org.apache.solr.core.JmxMonitoredMap.clear(JmxMonitoredMap.java:116)
[junit4:junit4]   2> 	at org.apache.solr.core.SolrCore.close(SolrCore.java:975)
[junit4:junit4]   2> 	at org.apache.solr.core.CoreContainer.shutdown(CoreContainer.java:733)
[junit4:junit4]   2> 	at org.apache.solr.core.TestLazyCores.testLazySearch(TestLazyCores.java:162)
[junit4:junit4]   2> 	at sun.reflect.NativeMethodAccessorImpl.invoke0(Native Method)
[junit4:junit4]   2> 	at sun.reflect.NativeMethodAccessorImpl.invoke(NativeMethodAccessorImpl.java:57)
[junit4:junit4]   2> 	at sun.reflect.DelegatingMethodAccessorImpl.invoke(DelegatingMethodAccessorImpl.java:43)
[junit4:junit4]   2> 	at java.lang.reflect.Method.invoke(Method.java:474)
[junit4:junit4]   2> 	at com.carrotsearch.randomizedtesting.RandomizedRunner.invoke(RandomizedRunner.java:1559)
[junit4:junit4]   2> 	at com.carrotsearch.randomizedtesting.RandomizedRunner.access$600(RandomizedRunner.java:79)
[junit4:junit4]   2> 	at com.carrotsearch.randomizedtesting.RandomizedRunner$6.evaluate(RandomizedRunner.java:737)
[junit4:junit4]   2> 	at com.carrotsearch.randomizedtesting.RandomizedRunner$7.evaluate(RandomizedRunner.java:773)
[junit4:junit4]   2> 	at com.carrotsearch.randomizedtesting.RandomizedRunner$8.evaluate(RandomizedRunner.java:787)
[junit4:junit4]   2> 	at com.carrotsearch.randomizedtesting.rules.SystemPropertiesRestoreRule$1.evaluate(SystemPropertiesRestoreRule.java:53)
[junit4:junit4]   2> 	at org.apache.lucene.util.TestRuleSetupTeardownChained$1.evaluate(TestRuleSetupTeardownChained.java:50)
[junit4:junit4]   2> 	at org.apache.lucene.util.TestRuleFieldCacheSanity$1.evaluate(TestRuleFieldCacheSanity.java:51)
[junit4:junit4]   2> 	at org.apache.lucene.util.AbstractBeforeAfterRule$1.evaluate(AbstractBeforeAfterRule.java:45)
[junit4:junit4]   2> 	at com.carrotsearch.randomizedtesting.rules.SystemPropertiesInvariantRule$1.evaluate(SystemPropertiesInvariantRule.java:55)
[junit4:junit4]   2> 	at org.apache.lucene.util.TestRuleThreadAndTestName$1.evaluate(TestRuleThreadAndTestName.java:48)
[junit4:junit4]   2> 	at org.apache.lucene.util.TestRuleIgnoreAfterMaxFailures$1.evaluate(TestRuleIgnoreAfterMaxFailures.java:70)
[junit4:junit4]   2> 	at org.apache.lucene.util.TestRuleMarkFailure$1.evaluate(TestRuleMarkFailure.java:48)
[junit4:junit4]   2> 	at com.carrotsearch.randomizedtesting.rules.StatementAdapter.evaluate(StatementAdapter.java:36)
[junit4:junit4]   2> 	at com.carrotsearch.randomizedtesting.ThreadLeakControl$StatementRunner.run(ThreadLeakControl.java:358)
[junit4:junit4]   2> 	at com.carrotsearch.randomizedtesting.ThreadLeakControl.forkTimeoutingTask(ThreadLeakControl.java:782)
[junit4:junit4]   2> 	at com.carrotsearch.randomizedtesting.ThreadLeakControl$3.evaluate(ThreadLeakControl.java:442)
[junit4:junit4]   2> 	at com.carrotsearch.randomizedtesting.RandomizedRunner.runSingleTest(RandomizedRunner.java:746)
[junit4:junit4]   2> 	at com.carrotsearch.randomizedtesting.RandomizedRunner$3.evaluate(RandomizedRunner.java:648)
[junit4:junit4]   2> 	at com.carrotsearch.randomizedtesting.RandomizedRunner$4.evaluate(RandomizedRunner.java:682)
[junit4:junit4]   2> 	at com.carrotsearch.randomizedtesting.RandomizedRunner$5.evaluate(RandomizedRunner.java:693)
[junit4:junit4]   2> 	at com.carrotsearch.randomizedtesting.rules.StatementAdapter.evaluate(StatementAdapter.java:36)
[junit4:junit4]   2> 	at com.carrotsearch.randomizedtesting.rules.SystemPropertiesRestoreRule$1.evaluate(SystemPropertiesRestoreRule.java:53)
[junit4:junit4]   2> 	at org.apache.lucene.util.AbstractBeforeAfterRule$1.evaluate(AbstractBeforeAfterRule.java:45)
[junit4:junit4]   2> 	at org.apache.lucene.util.TestRuleStoreClassName$1.evaluate(TestRuleStoreClassName.java:42)
[junit4:junit4]   2> 	at com.carrotsearch.randomizedtesting.rules.SystemPropertiesInvariantRule$1.evaluate(SystemPropertiesInvariantRule.java:55)
[junit4:junit4]   2> 	at com.carrotsearch.randomizedtesting.rules.NoShadowingOrOverridesOnMethodsRule$1.evaluate(NoShadowingOrOverridesOnMethodsRule.java:39)
[junit4:junit4]   2> 	at com.carrotsearch.randomizedtesting.rules.NoShadowingOrOverridesOnMethodsRule$1.evaluate(NoShadowingOrOverridesOnMethodsRule.java:39)
[junit4:junit4]   2> 	at com.carrotsearch.randomizedtesting.rules.StatementAdapter.evaluate(StatementAdapter.java:36)
[junit4:junit4]   2> 	at org.apache.lucene.util.TestRuleAssertionsRequired$1.evaluate(TestRuleAssertionsRequired.java:43)
[junit4:junit4]   2> 	at org.apache.lucene.util.TestRuleMarkFailure$1.evaluate(TestRuleMarkFailure.java:48)
[junit4:junit4]   2> 	at org.apache.lucene.util.TestRuleIgnoreAfterMaxFailures$1.evaluate(TestRuleIgnoreAfterMaxFailures.java:70)
[junit4:junit4]   2> 	at org.apache.lucene.util.TestRuleIgnoreTestSuites$1.evaluate(TestRuleIgnoreTestSuites.java:55)
[junit4:junit4]   2> 	at com.carrotsearch.randomizedtesting.rules.StatementAdapter.evaluate(StatementAdapter.java:36)
[junit4:junit4]   2> 	at com.carrotsearch.randomizedtesting.ThreadLeakControl$StatementRunner.run(ThreadLeakControl.java:358)
[junit4:junit4]   2> 	at java.lang.Thread.run(Thread.java:722)
[junit4:junit4]   2> 
[junit4:junit4]   2> 4478 T2362 oasc.JmxMonitoredMap$SolrDynamicMBean.getMBeanInfo WARNING Could not getStatistics on info bean org.apache.solr.search.SolrIndexSearcher org.apache.lucene.store.AlreadyClosedException: this IndexReader is closed
[junit4:junit4]   2> 	at org.apache.lucene.index.IndexReader.ensureOpen(IndexReader.java:251)
[junit4:junit4]   2> 	at org.apache.lucene.index.StandardDirectoryReader.getVersion(StandardDirectoryReader.java:312)
[junit4:junit4]   2> 	at org.apache.solr.search.SolrIndexSearcher.getStatistics(SolrIndexSearcher.java:1988)
[junit4:junit4]   2> 	at org.apache.solr.core.JmxMonitoredMap$SolrDynamicMBean.getMBeanInfo(JmxMonitoredMap.java:231)
[junit4:junit4]   2> 	at com.sun.jmx.interceptor.DefaultMBeanServerInterceptor.getClassName(DefaultMBeanServerInterceptor.java:1804)
[junit4:junit4]   2> 	at com.sun.jmx.interceptor.DefaultMBeanServerInterceptor.safeGetClassName(DefaultMBeanServerInterceptor.java:1595)
[junit4:junit4]   2> 	at com.sun.jmx.interceptor.DefaultMBeanServerInterceptor.checkMBeanPermission(DefaultMBeanServerInterceptor.java:1813)
[junit4:junit4]   2> 	at com.sun.jmx.interceptor.DefaultMBeanServerInterceptor.exclusiveUnregisterMBean(DefaultMBeanServerInterceptor.java:430)
[junit4:junit4]   2> 	at com.sun.jmx.interceptor.DefaultMBeanServerInterceptor.unregisterMBean(DefaultMBeanServerInterceptor.java:415)
[junit4:junit4]   2> 	at com.sun.jmx.mbeanserver.JmxMBeanServer.unregisterMBean(JmxMBeanServer.java:536)
[junit4:junit4]   2> 	at org.apache.solr.core.JmxMonitoredMap.unregister(JmxMonitoredMap.java:175)
[junit4:junit4]   2> 	at org.apache.solr.core.JmxMonitoredMap.clear(JmxMonitoredMap.java:116)
[junit4:junit4]   2> 	at org.apache.solr.core.SolrCore.close(SolrCore.java:975)
[junit4:junit4]   2> 	at org.apache.solr.core.CoreContainer.shutdown(CoreContainer.java:733)
[junit4:junit4]   2> 	at org.apache.solr.core.TestLazyCores.testLazySearch(TestLazyCores.java:162)
[junit4:junit4]   2> 	at sun.reflect.NativeMethodAccessorImpl.invoke0(Native Method)
[junit4:junit4]   2> 	at sun.reflect.NativeMethodAccessorImpl.invoke(NativeMethodAccessorImpl.java:57)
[junit4:junit4]   2> 	at sun.reflect.DelegatingMethodAccessorImpl.invoke(DelegatingMethodAccessorImpl.java:43)
[junit4:junit4]   2> 	at java.lang.reflect.Method.invoke(Method.java:474)
[junit4:junit4]   2> 	at com.carrotsearch.randomizedtesting.RandomizedRunner.invoke(RandomizedRunner.java:1559)
[junit4:junit4]   2> 	at com.carrotsearch.randomizedtesting.RandomizedRunner.access$600(RandomizedRunner.java:79)
[junit4:junit4]   2> 	at com.carrotsearch.randomizedtesting.RandomizedRunner$6.evaluate(RandomizedRunner.java:737)
[junit4:junit4]   2> 	at com.carrotsearch.randomizedtesting.RandomizedRunner$7.evaluate(RandomizedRunner.java:773)
[junit4:junit4]   2> 	at com.carrotsearch.randomizedtesting.RandomizedRunner$8.evaluate(RandomizedRunner.java:787)
[junit4:junit4]   2> 	at com.carrotsearch.randomizedtesting.rules.SystemPropertiesRestoreRule$1.evaluate(SystemPropertiesRestoreRule.java:53)
[junit4:junit4]   2> 	at org.apache.lucene.util.TestRuleSetupTeardownChained$1.evaluate(TestRuleSetupTeardownChained.java:50)
[junit4:junit4]   2> 	at org.apache.lucene.util.TestRuleFieldCacheSanity$1.evaluate(TestRuleFieldCacheSanity.java:51)
[junit4:junit4]   2> 	at org.apache.lucene.util.AbstractBeforeAfterRule$1.evaluate(AbstractBeforeAfterRule.java:45)
[junit4:junit4]   2> 	at com.carrotsearch.randomizedtesting.rules.SystemPropertiesInvariantRule$1.evaluate(SystemPropertiesInvariantRule.java:55)
[junit4:junit4]   2> 	at org.apache.lucene.util.TestRuleThreadAndTestName$1.evaluate(TestRuleThreadAndTestName.java:48)
[junit4:junit4]   2> 	at org.apache.lucene.util.TestRuleIgnoreAfterMaxFailures$1.evaluate(TestRuleIgnoreAfterMaxFailures.java:70)
[junit4:junit4]   2> 	at org.apache.lucene.util.TestRuleMarkFailure$1.evaluate(TestRuleMarkFailure.java:48)
[junit4:junit4]   2> 	at com.carrotsearch.randomizedtesting.rules.StatementAdapter.evaluate(StatementAdapter.java:36)
[junit4:junit4]   2> 	at com.carrotsearch.randomizedtesting.ThreadLeakControl$StatementRunner.run(ThreadLeakControl.java:358)
[junit4:junit4]   2> 	at com.carrotsearch.randomizedtesting.ThreadLeakControl.forkTimeoutingTask(ThreadLeakControl.java:782)
[junit4:junit4]   2> 	at com.carrotsearch.randomizedtesting.ThreadLeakControl$3.evaluate(ThreadLeakControl.java:442)
[junit4:junit4]   2> 	at com.carrotsearch.randomizedtesting.RandomizedRunner.runSingleTest(RandomizedRunner.java:746)
[junit4:junit4]   2> 	at com.carrotsearch.randomizedtesting.RandomizedRunner$3.evaluate(RandomizedRunner.java:648)
[junit4:junit4]   2> 	at com.carrotsearch.randomizedtesting.RandomizedRunner$4.evaluate(RandomizedRunner.java:682)
[junit4:junit4]   2> 	at com.carrotsearch.randomizedtesting.RandomizedRunner$5.evaluate(RandomizedRunner.java:693)
[junit4:junit4]   2> 	at com.carrotsearch.randomizedtesting.rules.StatementAdapter.evaluate(StatementAdapter.java:36)
[junit4:junit4]   2> 	at com.carrotsearch.randomizedtesting.rules.SystemPropertiesRestoreRule$1.evaluate(SystemPropertiesRestoreRule.java:53)
[junit4:junit4]   2> 	at org.apache.lucene.util.AbstractBeforeAfterRule$1.evaluate(AbstractBeforeAfterRule.java:45)
[junit4:junit4]   2> 	at org.apache.lucene.util.TestRuleStoreClassName$1.evaluate(TestRuleStoreClassName.java:42)
[junit4:junit4]   2> 	at com.carrotsearch.randomizedtesting.rules.SystemPropertiesInvariantRule$1.evaluate(SystemPropertiesInvariantRule.java:55)
[junit4:junit4]   2> 	at com.carrotsearch.randomizedtesting.rules.NoShadowingOrOverridesOnMethodsRule$1.evaluate(NoShadowingOrOverridesOnMethodsRule.java:39)
[junit4:junit4]   2> 	at com.carrotsearch.randomizedtesting.rules.NoShadowingOrOverridesOnMethodsRule$1.evaluate(NoShadowingOrOverridesOnMethodsRule.java:39)
[junit4:junit4]   2> 	at com.carrotsearch.randomizedtesting.rules.StatementAdapter.evaluate(StatementAdapter.java:36)
[junit4:junit4]   2> 	at org.apache.lucene.util.TestRuleAssertionsRequired$1.evaluate(TestRuleAssertionsRequired.java:43)
[junit4:junit4]   2> 	at org.apache.lucene.util.TestRuleMarkFailure$1.evaluate(TestRuleMarkFailure.java:48)
[junit4:junit4]   2> 	at org.apache.lucene.util.TestRuleIgnoreAfterMaxFailures$1.evaluate(TestRuleIgnoreAfterMaxFailures.java:70)
[junit4:junit4]   2> 	at org.apache.lucene.util.TestRuleIgnoreTestSuites$1.evaluate(TestRuleIgnoreTestSuites.java:55)
[junit4:junit4]   2> 	at com.carrotsearch.randomizedtesting.rules.StatementAdapter.evaluate(StatementAdapter.java:36)
[junit4:junit4]   2> 	at com.carrotsearch.randomizedtesting.ThreadLeakControl$StatementRunner.run(ThreadLeakControl.java:358)
[junit4:junit4]   2> 	at java.lang.Thread.run(Thread.java:722)
[junit4:junit4]   2> 
[junit4:junit4]   2> 4485 T2362 oasu.DirectUpdateHandler2.close closing DirectUpdateHandler2{commits=1,autocommits=0,soft autocommits=0,optimizes=0,rollbacks=0,expungeDeletes=0,docsPending=0,adds=0,deletesById=0,deletesByQuery=0,errors=0,cumulative_adds=7,cumulative_deletesById=0,cumulative_deletesByQuery=0,cumulative_errors=0}
[junit4:junit4]   2> 4485 T2362 oasc.SolrCore.decrefSolrCoreState Closing SolrCoreState
[junit4:junit4]   2> 4486 T2362 oasu.DefaultSolrCoreState.closeIndexWriter SolrCoreState ref count has reached 0 - closing IndexWriter
[junit4:junit4]   2> 4486 T2362 oasu.DefaultSolrCoreState.closeIndexWriter closing IndexWriter with IndexWriterCloser
[junit4:junit4]   2> 4487 T2362 C284 oasc.CachingDirectoryFactory.close Releasing directory:/mnt/ssd/jenkins/workspace/Lucene-Solr-trunk-Linux/solr/build/solr-core/test-files/solr/collection1/data/index
[junit4:junit4]   2> 4487 T2362 oasc.SolrCore.closeSearcher [collectionLazy2] Closing main searcher on request.
[junit4:junit4]   2> 4488 T2362 oas.SolrTestCaseJ4.tearDown ###Ending testLazySearch
[junit4:junit4]   2> 4493 T2362 oas.SolrTestCaseJ4.setUp ###Starting testLazyLoad
[junit4:junit4]   2> 4494 T2362 oasc.SolrResourceLoader.locateSolrHome JNDI not configured for solr (NoInitialContextEx)
[junit4:junit4]   2> 4494 T2362 oasc.SolrResourceLoader.locateSolrHome using system property solr.solr.home: /mnt/ssd/jenkins/workspace/Lucene-Solr-trunk-Linux/solr/build/solr-core/test-files/solr
[junit4:junit4]   2> 4495 T2362 oasc.CoreContainer.<init> New CoreContainer 11222862
[junit4:junit4]   2> 4495 T2362 oasc.CoreContainer.load Loading CoreContainer using Solr Home: '/mnt/ssd/jenkins/workspace/Lucene-Solr-trunk-Linux/solr/build/solr-core/test-files/solr/'
[junit4:junit4]   2> 4495 T2362 oasc.SolrResourceLoader.<init> new SolrResourceLoader for directory: '/mnt/ssd/jenkins/workspace/Lucene-Solr-trunk-Linux/solr/build/solr-core/test-files/solr/'
[junit4:junit4]   2> 4514 T2362 oasc.CoreContainer.load Registering Log Listener
[junit4:junit4]   2> 4551 T2375 oasc.CoreContainer.create Creating SolrCore 'collection1' using instanceDir: /mnt/ssd/jenkins/workspace/Lucene-Solr-trunk-Linux/solr/build/solr-core/test-files/solr/collection1
[junit4:junit4]   2> 4552 T2375 oasc.SolrResourceLoader.<init> new SolrResourceLoader for directory: '/mnt/ssd/jenkins/workspace/Lucene-Solr-trunk-Linux/solr/build/solr-core/test-files/solr/collection1/'
[junit4:junit4]   2> 4552 T2375 oasc.SolrResourceLoader.replaceClassLoader Adding 'file:/mnt/ssd/jenkins/workspace/Lucene-Solr-trunk-Linux/solr/build/solr-core/test-files/solr/collection1/lib/README' to classloader
[junit4:junit4]   2> 4552 T2375 oasc.SolrResourceLoader.replaceClassLoader Adding 'file:/mnt/ssd/jenkins/workspace/Lucene-Solr-trunk-Linux/solr/build/solr-core/test-files/solr/collection1/lib/classes/' to classloader
[junit4:junit4]   2> 4554 T2376 oasc.CoreContainer.create Creating SolrCore 'collectionLazy5' using instanceDir: /mnt/ssd/jenkins/workspace/Lucene-Solr-trunk-Linux/solr/build/solr-core/test-files/solr/collection1
[junit4:junit4]   2> 4554 T2376 oasc.SolrResourceLoader.<init> new SolrResourceLoader for directory: '/mnt/ssd/jenkins/workspace/Lucene-Solr-trunk-Linux/solr/build/solr-core/test-files/solr/collection1/'
[junit4:junit4]   2> 4555 T2376 oasc.SolrResourceLoader.replaceClassLoader Adding 'file:/mnt/ssd/jenkins/workspace/Lucene-Solr-trunk-Linux/solr/build/solr-core/test-files/solr/collection1/lib/README' to classloader
[junit4:junit4]   2> 4555 T2376 oasc.SolrResourceLoader.replaceClassLoader Adding 'file:/mnt/ssd/jenkins/workspace/Lucene-Solr-trunk-Linux/solr/build/solr-core/test-files/solr/collection1/lib/classes/' to classloader
[junit4:junit4]   2> 4599 T2375 oasc.SolrConfig.<init> Using Lucene MatchVersion: LUCENE_50
[junit4:junit4]   2> 4603 T2376 oasc.SolrConfig.<init> Using Lucene MatchVersion: LUCENE_50
[junit4:junit4]   2> 4669 T2375 oasc.SolrConfig.<init> Loaded SolrConfig: solrconfig.xml
[junit4:junit4]   2> 4670 T2375 oass.IndexSchema.readSchema Reading Solr Schema
[junit4:junit4]   2> 4673 T2376 oasc.SolrConfig.<init> Loaded SolrConfig: solrconfig.xml
[junit4:junit4]   2> 4674 T2376 oass.IndexSchema.readSchema Reading Solr Schema
[junit4:junit4]   2> 4677 T2375 oass.IndexSchema.readSchema Schema name=test
[junit4:junit4]   2> 4680 T2376 oass.IndexSchema.readSchema Schema name=test
[junit4:junit4]   2> 5121 T2376 oass.OpenExchangeRatesOrgProvider.init Initialized with rates=open-exchange-rates.json, refreshInterval=1440.
[junit4:junit4]   2> 5127 T2376 oass.IndexSchema.readSchema default search field in schema is text
[junit4:junit4]   2> 5130 T2376 oass.IndexSchema.readSchema unique key field: id
[junit4:junit4]   2> 5134 T2376 oass.FileExchangeRateProvider.reload Reloading exchange rates from file currency.xml
[junit4:junit4]   2> 5138 T2376 oass.FileExchangeRateProvider.reload Reloading exchange rates from file currency.xml
[junit4:junit4]   2> 5140 T2376 oass.OpenExchangeRatesOrgProvider.reload Reloading exchange rates from open-exchange-rates.json
[junit4:junit4]   2> 5141 T2376 oass.OpenExchangeRatesOrgProvider.reload Reloading exchange rates from open-exchange-rates.json
[junit4:junit4]   2> 5141 T2376 oasc.SolrCore.<init> [collectionLazy5] Opening new SolrCore at /mnt/ssd/jenkins/workspace/Lucene-Solr-trunk-Linux/solr/build/solr-core/test-files/solr/collection1/, dataDir=/mnt/ssd/jenkins/workspace/Lucene-Solr-trunk-Linux/solr/build/solr-core/test-files/solr/collection1/data/
[junit4:junit4]   2> 5142 T2376 oasc.JmxMonitoredMap.<init> JMX monitoring is enabled. Adding Solr mbeans to JMX Server: com.sun.jmx.mbeanserver.JmxMBeanServer@d4fdf1
[junit4:junit4]   2> 5142 T2376 oasc.SolrCore.initDirectoryFactory org.apache.solr.core.MockDirectoryFactory
[junit4:junit4]   2> 5143 T2376 oasc.CachingDirectoryFactory.injectLockFactory WARNING No lockType configured for MockDirWrapper(org.apache.lucene.store.RAMDirectory@1494f7e lockFactory=org.apache.lucene.store.SingleInstanceLockFactory@20b18) assuming 'simple'
[junit4:junit4]   2> 5143 T2376 oasc.CachingDirectoryFactory.get return new directory for /mnt/ssd/jenkins/workspace/Lucene-Solr-trunk-Linux/solr/build/solr-core/test-files/solr/collection1/data forceNew:false
[junit4:junit4]   2> 5143 T2376 oasc.CachingDirectoryFactory.close Releasing directory:/mnt/ssd/jenkins/workspace/Lucene-Solr-trunk-Linux/solr/build/solr-core/test-files/solr/collection1/data
[junit4:junit4]   2> 5143 T2376 oasc.SolrCore.getNewIndexDir New index directory detected: old=null new=/mnt/ssd/jenkins/workspace/Lucene-Solr-trunk-Linux/solr/build/solr-core/test-files/solr/collection1/data/index/
[junit4:junit4]   2> 5144 T2376 oasc.SolrCore.initIndex WARNING [collectionLazy5] Solr index directory '/mnt/ssd/jenkins/workspace/Lucene-Solr-trunk-Linux/solr/build/solr-core/test-files/solr/collection1/data/index' doesn't exist. Creating new index...
[junit4:junit4]   2> 5144 T2376 oasc.CachingDirectoryFactory.get return new directory for /mnt/ssd/jenkins/workspace/Lucene-Solr-trunk-Linux/solr/build/solr-core/test-files/solr/collection1/data/index forceNew:false
[junit4:junit4]   2> 5145 T2376 oasc.SolrDeletionPolicy.onCommit SolrDeletionPolicy.onCommit: commits:num=1
[junit4:junit4]   2> 		commit{dir=MockDirWrapper(org.apache.lucene.store.RAMDirectory@75c59a lockFactory=org.apache.lucene.store.NativeFSLockFactory@138a58c),segFN=segments_1,generation=1,filenames=[segments_1]
[junit4:junit4]   2> 5145 T2376 oasc.SolrDeletionPolicy.updateCommits newest commit = 1[segments_1]
[junit4:junit4]   2> 5145 T2376 oasc.CachingDirectoryFactory.close Releasing directory:/mnt/ssd/jenkins/workspace/Lucene-Solr-trunk-Linux/solr/build/solr-core/test-files/solr/collection1/data/index
[junit4:junit4]   2> 5146 T2376 oasc.SolrCore.initWriters created xml: solr.XMLResponseWriter
[junit4:junit4]   2> 5147 T2376 oasup.UpdateRequestProcessorChain.init inserting DistributedUpdateProcessorFactory into updateRequestProcessorChain "dedupe"
[junit4:junit4]   2> 5147 T2376 oasup.UpdateRequestProcessorChain.init inserting DistributedUpdateProcessorFactory into updateRequestProcessorChain "dedupe-allfields"
[junit4:junit4]   2> 5147 T2376 oasup.UpdateRequestProcessorChain.init inserting DistributedUpdateProcessorFactory into updateRequestProcessorChain "stored_sig"
[junit4:junit4]   2> 5148 T2376 oasup.UpdateRequestProcessorChain.init inserting DistributedUpdateProcessorFactory into updateRequestProcessorChain "uniq-fields"
[junit4:junit4]   2> 5148 T2376 oasup.UpdateRequestProcessorChain.init inserting DistributedUpdateProcessorFactory into updateRequestProcessorChain "distrib-dup-test-chain-implicit"
[junit4:junit4]   2> 5148 T2376 oasc.RequestHandlers.initHandlersFromConfig adding lazy requestHandler: solr.ReplicationHandler
[junit4:junit4]   2> 5149 T2376 oasc.RequestHandlers.initHandlersFromConfig created /replication: solr.ReplicationHandler
[junit4:junit4]   2> 5149 T2376 oasc.RequestHandlers.initHandlersFromConfig created standard: solr.StandardRequestHandler
[junit4:junit4]   2> 5150 T2376 oasc.RequestHandlers.initHandlersFromConfig created /get: solr.RealTimeGetHandler
[junit4:junit4]   2> 5151 T2376 oasc.RequestHandlers.initHandlersFromConfig created dismax: solr.SearchHandler
[junit4:junit4]   2> 5151 T2376 oasc.RequestHandlers.initHandlersFromConfig created mock: org.apache.solr.core.MockQuerySenderListenerReqHandler
[junit4:junit4]   2> 5152 T2376 oasc.RequestHandlers.initHandlersFromConfig created /admin/: org.apache.solr.handler.admin.AdminHandlers
[junit4:junit4]   2> 5152 T2376 oasc.RequestHandlers.initHandlersFromConfig created defaults: solr.StandardRequestHandler
[junit4:junit4]   2> 5152 T2376 oasc.RequestHandlers.initHandlersFromConfig adding lazy requestHandler: solr.StandardRequestHandler
[junit4:junit4]   2> 5153 T2376 oasc.RequestHandlers.initHandlersFromConfig created lazy: solr.StandardRequestHandler
[junit4:junit4]   2> 5153 T2376 oasc.RequestHandlers.initHandlersFromConfig created /update: solr.UpdateRequestHandler
[junit4:junit4]   2> 5154 T2376 oasc.RequestHandlers.initHandlersFromConfig created /terms: org.apache.solr.handler.component.SearchHandler
[junit4:junit4]   2> 5155 T2376 oasc.RequestHandlers.initHandlersFromConfig created spellCheckCompRH: org.apache.solr.handler.component.SearchHandler
[junit4:junit4]   2> 5155 T2376 oasc.RequestHandlers.initHandlersFromConfig created spellCheckCompRH_Direct: org.apache.solr.handler.component.SearchHandler
[junit4:junit4]   2> 5156 T2376 oasc.RequestHandlers.initHandlersFromConfig created spellCheckWithWordbreak: org.apache.solr.handler.component.SearchHandler
[junit4:junit4]   2> 5156 T2376 oasc.RequestHandlers.initHandlersFromConfig created spellCheckWithWordbreak_Direct: org.apache.solr.handler.component.SearchHandler
[junit4:junit4]   2> 5157 T2376 oasc.RequestHandlers.initHandlersFromConfig created spellCheckCompRH1: org.apache.solr.handler.component.SearchHandler
[junit4:junit4]   2> 5158 T2376 oasc.RequestHandlers.initHandlersFromConfig created tvrh: org.apache.solr.handler.component.SearchHandler
[junit4:junit4]   2> 5158 T2376 oasc.RequestHandlers.initHandlersFromConfig created /mlt: solr.MoreLikeThisHandler
[junit4:junit4]   2> 5159 T2376 oasc.RequestHandlers.initHandlersFromConfig created /debug/dump: solr.DumpRequestHandler
[junit4:junit4]   2> 5162 T2376 oashl.XMLLoader.init xsltCacheLifetimeSeconds=60
[junit4:junit4]   2> 5164 T2376 oasc.SolrCore.initDeprecatedSupport WARNING solrconfig.xml uses deprecated <admin/gettableFiles>, Please update your config to use the ShowFileRequestHandler.
[junit4:junit4]   2> 5165 T2376 oasc.SolrCore.initDeprecatedSupport WARNING adding ShowFileRequestHandler with hidden files: [BAD-SOLRCONFIG-INVALID-SCRIPTFILE.XML, SOLRCONFIG-UPDATE-PROCESSOR-CHAINS.XML, BAD-SCHEMA-CURRENCY-FT-MULTIVALUED.XML, MISSLEADING.EXTENSION.UPDATEPROCESSOR.JS.TXT, SCHEMA-SNIPPET-FIELD.XML, XSLT, SOLRCONFIG-MASTER2.XML, SOLRCONFIG-DELPOLICY1.XML, BAD-SOLRCONFIG-MISSING-SCRIPTFILE.XML, SOLRCONFIG-MASTER.XML, SCHEMA-STOP-KEEP.XML, BAD-SCHEMA-CURRENCY-MULTIVALUED.XML, BAD-SCHEMA-NOT-INDEXED-BUT-NORMS.XML, SOLRCONFIG-PROPINJECT.XML, SCHEMA-TFIDF.XML, SCHEMA-SPATIAL.XML, FRENCHARTICLES.TXT, FUZZYSUGGEST.TXT, SCHEMA-NUMERIC.XML, SCHEMA-BM25.XML, MISSING.FUNCTIONS.UPDATEPROCESSOR.JS, SOLRCONFIG_PERF.XML, SOLRCONFIG-CACHING.XML, SOLRCONFIG-SOLCOREPROPERTIES.XML, SCHEMA-SNIPPET-TYPE.XML, COMPOUNDDICTIONARY.TXT, SOLRCONFIG-REQHANDLER.INCL, SCHEMA-PHRASESUGGEST.XML, ELEVATE.XML, SOLRCONFIG-ELEVATE.XML, SCHEMA-REVERSED.XML, SOLRCONFIG-HIGHLIGHT.XML, SOLRCONFIG-DELPOLICY2.XML, SOLRCONFIG-INDEXCONFIG.XML, BAD-SCHEMA-NONTEXT-ANALYZER.XML, SOLRCONFIG-NOCACHE.XML, MAPPING-ISOLATIN1ACCENT.TXT, SOLRCONFIG-LAZYWRITER.XML, BAD-SCHEMA-DUP-FIELDTYPE.XML, SCHEMA-REPLICATION1.XML, SCHEMA-COPYFIELD-TEST.XML, BAD-SCHEMA-SIM-GLOBAL-VS-FT-MISMATCH.XML, SCHEMA15.XML, SCHEMA-BEHAVIOR.XML, SOLRCONFIG-SIMPLELOCK.XML, BAD_SOLRCONFIG.XML, BAD-SCHEMA-UNIQUEKEY-USES-DEFAULT.XML, KEEP-2.TXT, BAD-SCHEMA-NOT-INDEXED-BUT-POS.XML, SCHEMASURROUND.XML, SOLRCONFIG-SCRIPT-UPDATEPROCESSOR.XML, SOLRCONFIG-SNIPPET-PROCESSOR.XML, SOLRCONFIG-TRANSFORMERS.XML, SOLRCONFIG-FUNCTIONQUERY.XML, SCHEMA-SPELLCHECKER.XML, BAD-SCHEMA-DUP-DYNAMICFIELD.XML, THROW.ERROR.ON.ADD.UPDATEPROCESSOR.JS, SOLRCONFIG-QUERYSENDER.XML, SCHEMA-TRIE.XML, SCHEMA-LMJELINEKMERCER.XML, SOLRCONFIG-PROPINJECT-INDEXDEFAULT.XML, SCHEMA-CHARFILTERS.XML, SOLRCONFIG-SPELLCHECKCOMPONENT.XML, SOLRCONFIG-ALTDIRECTORY.XML, SCHEMA-FOLDING.XML, SCHEMA-EFF.XML, SOLRCONFIG-XINCLUDE.XML, SCHEMA-NOT-REQUIRED-UNIQUE-KEY.XML, BAD-SCHEMA-UNIQUEKEY-IS-COPYFIELD-DEST.XML, STEMDICT.TXT, STOPTYPES-1.TXT, SOLRCONFIG-QUERYSENDER-NOQUERY.XML, HUNSPELL-TEST.DIC, SCHEMA-REQUIRED-FIELDS.XML, SOLRCONFIG-ENABLEPLUGIN.XML, SCHEMA.XML, STOPWITHBOM.TXT, SCHEMA-LMDIRICHLET.XML, SYNONYMS.TXT, SOLRCONFIG-MERGEPOLICY.XML, CURRENCY.XML, TRIVIAL.UPDATEPROCESSOR1.JS, SOLRCONFIG-SLAVE.XML, SCHEMA12.XML, STOPTYPES-2.TXT, BAD-SCHEMA-ANALYZER-CLASS-AND-NESTED.XML, BAD-MP-SOLRCONFIG.XML, BAD-SCHEMA-CURRENCY-DYNAMIC-MULTIVALUED.XML, SOLRCONFIG-TERMINDEX.XML, BAD-SCHEMA-EXTERNAL-FILEFIELD.XML, SCHEMA-LUCENEMATCHVERSION.XML, SCHEMA-REPLICATION2.XML, TRIVIAL.UPDATEPROCESSOR0.JS, OLD_SYNONYMS.TXT, PROTWORDS.TXT, BAD-SOLRCONFIG-BOGUS-SCRIPTENGINE-NAME.XML, KEEP-1.TXT, SOLRCONFIG-SLAVE1.XML, SCHEMA-IB.XML, STOP-2.TXT, SCHEMA-MINIMAL.XML, BAD-SCHEMA-UNIQUEKEY-MULTIVALUED.XML, OPEN-EXCHANGE-RATES.JSON, DA_COMPOUNDDICTIONARY.TXT, SCHEMA-DFR.XML, SOLRCONFIG-REPEATER.XML, STOP-1.TXT, SOLRCONFIG-MASTER1.XML, HYPHENATION.DTD, SOLRCONFIG-RESPONSE-LOG-COMPONENT.XML, SOLRCONFIG-BASIC.XML, PHRASESUGGEST.TXT, JASUGGEST.TXT, SCHEMA-SIM.XML, SOLRCONFIG_CODEC.XML, DA_UTF8.XML, BAD-SCHEMA-DUP-FIELD.XML, SOLRCONFIG-PHRASESUGGEST.XML, SOLRCONFIG-TLOG.XML, STOPWORDSWRONGENCODING.TXT, SOLRCONFIG-MASTER1-KEEPONEBACKUP.XML, SOLRCONFIG-SPELLCHECKER.XML, SCHEMA-XINCLUDE.XML, BAD-SCHEMA-NOT-INDEXED-BUT-TF.XML, CONDITIONAL.UPDATEPROCESSOR.JS, SOLRCONFIG-MASTER3.XML, WDFTYPES.TXT, STOPWORDS.TXT, SOLRCONFIG-SOLR-749.XML, SCHEMA-COLLATE.XML, BAD-SCHEMA-OMIT-TF-BUT-NOT-POS.XML, SCHEMA_CODEC.XML, HUNSPELL-TEST.AFF, ADDFIELDS.UPDATEPROCESSOR.JS, SCHEMA11.XML, BAD-SCHEMA-CODEC-GLOBAL-VS-FT-MISMATCH.XML, STOP-SNOWBALL.TXT, SCHEMA-BINARYFIELD.XML, SOLRCONFIG-NATIVELOCK.XML]
[junit4:junit4]   2> 5167 T2376 oasc.CachingDirectoryFactory.close Releasing directory:/mnt/ssd/jenkins/workspace/Lucene-Solr-trunk-Linux/solr/build/solr-core/test-files/solr/collection1/data
[junit4:junit4]   2> 5176 T2376 oass.SolrIndexSearcher.<init> Opening Searcher@142b5f0 main
[junit4:junit4]   2> 5177 T2376 oasu.CommitTracker.<init> Hard AutoCommit: disabled
[junit4:junit4]   2> 5177 T2376 oasu.CommitTracker.<init> Soft AutoCommit: disabled
[junit4:junit4]   2> 5177 T2376 oashc.SpellCheckComponent.inform Initializing spell checkers
[junit4:junit4]   2> 5178 T2376 oass.DirectSolrSpellChecker.init init: {name=direct,classname=DirectSolrSpellChecker,field=lowerfilt,minQueryLength=3}
[junit4:junit4]   2> 5182 T2376 oashc.HttpShardHandlerFactory.getParameter Setting socketTimeout to: 0
[junit4:junit4]   2> 5182 T2376 oashc.HttpShardHandlerFactory.getParameter Setting urlScheme to: http://
[junit4:junit4]   2> 5182 T2376 oashc.HttpShardHandlerFactory.getParameter Setting connTimeout to: 0
[junit4:junit4]   2> 5183 T2376 oashc.HttpShardHandlerFactory.getParameter Setting maxConnectionsPerHost to: 20
[junit4:junit4]   2> 5183 T2376 oashc.HttpShardHandlerFactory.getParameter Setting corePoolSize to: 0
[junit4:junit4]   2> 5183 T2376 oashc.HttpShardHandlerFactory.getParameter Setting maximumPoolSize to: 2147483647
[junit4:junit4]   2> 5183 T2376 oashc.HttpShardHandlerFactory.getParameter Setting maxThreadIdleTime to: 5
[junit4:junit4]   2> 5184 T2376 oashc.HttpShardHandlerFactory.getParameter Setting sizeOfQueue to: -1
[junit4:junit4]   2> 5184 T2376 oashc.HttpShardHandlerFactory.getParameter Setting fairnessPolicy to: false
[junit4:junit4]   2> 5184 T2376 oascsi.HttpClientUtil.createClient Creating new http client, config:maxConnectionsPerHost=20&maxConnections=10000&socketTimeout=0&connTimeout=0&retry=false
[junit4:junit4]   2> 5191 T2377 oasc.SolrCore.registerSearcher [collectionLazy5] Registered new searcher Searcher@142b5f0 main{StandardDirectoryReader(segments_1:1)}
[junit4:junit4]   2> 5194 T2376 oasc.CoreContainer.registerCore registering core: collectionLazy5
[junit4:junit4]   2> 5201 T2375 oass.OpenExchangeRatesOrgProvider.init Initialized with rates=open-exchange-rates.json, refreshInterval=1440.
[junit4:junit4]   2> 5206 T2375 oass.IndexSchema.readSchema default search field in schema is text
[junit4:junit4]   2> 5209 T2375 oass.IndexSchema.readSchema unique key field: id
[junit4:junit4]   2> 5213 T2375 oass.FileExchangeRateProvider.reload Reloading exchange rates from file currency.xml
[junit4:junit4]   2> 5217 T2375 oass.FileExchangeRateProvider.reload Reloading exchange rates from file currency.xml
[junit4:junit4]   2> 5219 T2375 oass.OpenExchangeRatesOrgProvider.reload Reloading exchange rates from open-exchange-rates.json
[junit4:junit4]   2> 5219 T2375 oass.OpenExchangeRatesOrgProvider.reload Reloading exchange rates from open-exchange-rates.json
[junit4:junit4]   2> 5220 T2375 oasc.SolrCore.<init> [collection1] Opening new SolrCore at /mnt/ssd/jenkins/workspace/Lucene-Solr-trunk-Linux/solr/build/solr-core/test-files/solr/collection1/, dataDir=/mnt/ssd/jenkins/workspace/Lucene-Solr-trunk-Linux/solr/build/solr-core/test-files/solr/collection1/data/
[junit4:junit4]   2> 5220 T2375 oasc.JmxMonitoredMap.<init> JMX monitoring is enabled. Adding Solr mbeans to JMX Server: com.sun.jmx.mbeanserver.JmxMBeanServer@d4fdf1
[junit4:junit4]   2> 5220 T2375 oasc.SolrCore.initDirectoryFactory org.apache.solr.core.MockDirectoryFactory
[junit4:junit4]   2> 5221 T2375 oasc.CachingDirectoryFactory.injectLockFactory WARNING No lockType configured for MockDirWrapper(org.apache.lucene.store.RAMDirectory@161327b lockFactory=org.apache.lucene.store.SingleInstanceLockFactory@393748) assuming 'simple'
[junit4:junit4]   2> 5221 T2375 oasc.CachingDirectoryFactory.get return new directory for /mnt/ssd/jenkins/workspace/Lucene-Solr-trunk-Linux/solr/build/solr-core/test-files/solr/collection1/data forceNew:false
[junit4:junit4]   2> 5222 T2375 oasc.CachingDirectoryFactory.close Releasing directory:/mnt/ssd/jenkins/workspace/Lucene-Solr-trunk-Linux/solr/build/solr-core/test-files/solr/collection1/data
[junit4:junit4]   2> 5222 T2375 oasc.SolrCore.getNewIndexDir New index directory detected: old=null new=/mnt/ssd/jenkins/workspace/Lucene-Solr-trunk-Linux/solr/build/solr-core/test-files/solr/collection1/data/index/
[junit4:junit4]   2> 5222 T2375 oasc.SolrCore.initIndex WARNING [collection1] Solr index directory '/mnt/ssd/jenkins/workspace/Lucene-Solr-trunk-Linux/solr/build/solr-core/test-files/solr/collection1/data/index' doesn't exist. Creating new index...
[junit4:junit4]   2> 5222 T2375 oasc.CachingDirectoryFactory.get return new directory for /mnt/ssd/jenkins/workspace/Lucene-Solr-trunk-Linux/solr/build/solr-core/test-files/solr/collection1/data/index forceNew:false
[junit4:junit4]   2> 5223 T2375 oasc.SolrDeletionPolicy.onCommit SolrDeletionPolicy.onCommit: commits:num=1
[junit4:junit4]   2> 		commit{dir=MockDirWrapper(org.apache.lucene.store.RAMDirectory@92d4bd lockFactory=org.apache.lucene.store.NativeFSLockFactory@1b3907f),segFN=segments_1,generation=1,filenames=[segments_1]
[junit4:junit4]   2> 5224 T2375 oasc.SolrDeletionPolicy.updateCommits newest commit = 1[segments_1]
[junit4:junit4]   2> 5224 T2375 oasc.CachingDirectoryFactory.close Releasing directory:/mnt/ssd/jenkins/workspace/Lucene-Solr-trunk-Linux/solr/build/solr-core/test-files/solr/collection1/data/index
[junit4:junit4]   2> 5224 T2375 oasc.SolrCore.initWriters created xml: solr.XMLResponseWriter
[junit4:junit4]   2> 5225 T2375 oasup.UpdateRequestProcessorChain.init inserting DistributedUpdateProcessorFactory into updateRequestProcessorChain "dedupe"
[junit4:junit4]   2> 5225 T2375 oasup.UpdateRequestProcessorChain.init inserting DistributedUpdateProcessorFactory into updateRequestProcessorChain "dedupe-allfields"
[junit4:junit4]   2> 5226 T2375 oasup.UpdateRequestProcessorChain.init inserting DistributedUpdateProcessorFactory into updateRequestProcessorChain "stored_sig"
[junit4:junit4]   2> 5226 T2375 oasup.UpdateRequestProcessorChain.init inserting DistributedUpdateProcessorFactory into updateRequestProcessorChain "uniq-fields"
[junit4:junit4]   2> 5226 T2375 oasup.UpdateRequestProcessorChain.init inserting DistributedUpdateProcessorFactory into updateRequestProcessorChain "distrib-dup-test-chain-implicit"
[junit4:junit4]   2> 5226 T2375 oasc.RequestHandlers.initHandlersFromConfig adding lazy requestHandler: solr.ReplicationHandler
[junit4:junit4]   2> 5227 T2375 oasc.RequestHandlers.initHandlersFromConfig created /replication: solr.ReplicationHandler
[junit4:junit4]   2> 5227 T2375 oasc.RequestHandlers.initHandlersFromConfig created standard: solr.StandardRequestHandler
[junit4:junit4]   2> 5228 T2375 oasc.RequestHandlers.initHandlersFromConfig created /get: solr.RealTimeGetHandler
[junit4:junit4]   2> 5228 T2375 oasc.RequestHandlers.initHandlersFromConfig created dismax: solr.SearchHandler
[junit4:junit4]   2> 5229 T2375 oasc.RequestHandlers.initHandlersFromConfig created mock: org.apache.solr.core.MockQuerySenderListenerReqHandler
[junit4:junit4]   2> 5229 T2375 oasc.RequestHandlers.initHandlersFromConfig created /admin/: org.apache.solr.handler.admin.AdminHandlers
[junit4:junit4]   2> 5230 T2375 oasc.RequestHandlers.initHandlersFromConfig created defaults: solr.StandardRequestHandler
[junit4:junit4]   2> 5230 T2375 oasc.RequestHandlers.initHandlersFromConfig adding lazy requestHandler: solr.StandardRequestHandler
[junit4:junit4]   2> 5230 T2375 oasc.RequestHandlers.initHandlersFromConfig created lazy: solr.StandardRequestHandler
[junit4:junit4]   2> 5231 T2375 oasc.RequestHandlers.initHandlersFromConfig created /update: solr.UpdateRequestHandler
[junit4:junit4]   2> 5231 T2375 oasc.RequestHandlers.initHandlersFromConfig created /terms: org.apache.solr.handler.component.SearchHandler
[junit4:junit4]   2> 5232 T2375 oasc.RequestHandlers.initHandlersFromConfig created spellCheckCompRH: org.apache.solr.handler.component.SearchHandler
[junit4:junit4]   2> 5233 T2375 oasc.RequestHandlers.initHandlersFromConfig created spellCheckCompRH_Direct: org.apache.solr.handler.component.SearchHandler
[junit4:junit4]   2> 5233 T2375 oasc.RequestHandlers.initHandlersFromConfig created spellCheckWithWordbreak: org.apache.solr.handler.component.SearchHandler
[junit4:junit4]   2> 5234 T2375 oasc.RequestHandlers.initHandlersFromConfig created spellCheckWithWordbreak_Direct: org.apache.solr.handler.component.SearchHandler
[junit4:junit4]   2> 5234 T2375 oasc.RequestHandlers.initHandlersFromConfig created spellCheckCompRH1: org.apache.solr.handler.component.SearchHandler
[junit4:junit4]   2> 5235 T2375 oasc.RequestHandlers.initHandlersFromConfig created tvrh: org.apache.solr.handler.component.SearchHandler
[junit4:junit4]   2> 5235 T2375 oasc.RequestHandlers.initHandlersFromConfig created /mlt: solr.MoreLikeThisHandler
[junit4:junit4]   2> 5236 T2375 oasc.RequestHandlers.initHandlersFromConfig created /debug/dump: solr.DumpRequestHandler
[junit4:junit4]   2> 5238 T2375 oashl.XMLLoader.i

[...truncated too long message...]

ne.util.TestRuleAssertionsRequired$1.evaluate(TestRuleAssertionsRequired.java:43)
[junit4:junit4]    > 	at org.apache.lucene.util.TestRuleMarkFailure$1.evaluate(TestRuleMarkFailure.java:48)
[junit4:junit4]    > 	at org.apache.lucene.util.TestRuleIgnoreAfterMaxFailures$1.evaluate(TestRuleIgnoreAfterMaxFailures.java:70)
[junit4:junit4]    > 	at org.apache.lucene.util.TestRuleIgnoreTestSuites$1.evaluate(TestRuleIgnoreTestSuites.java:55)
[junit4:junit4]    > 	at com.carrotsearch.randomizedtesting.rules.StatementAdapter.evaluate(StatementAdapter.java:36)
[junit4:junit4]    > 	at com.carrotsearch.randomizedtesting.ThreadLeakControl$StatementRunner.run(ThreadLeakControl.java:358)
[junit4:junit4]    > 	at java.lang.Thread.run(Thread.java:722)
[junit4:junit4]    > Throwable #2: com.carrotsearch.randomizedtesting.ThreadLeakError: 4 threads leaked from SUITE scope at org.apache.solr.core.TestLazyCores: 
[junit4:junit4]    >    1) Thread[id=2367, name=searcherExecutor-2375-thread-1, state=WAITING, group=TGRP-TestLazyCores]
[junit4:junit4]    >         at sun.misc.Unsafe.park(Native Method)
[junit4:junit4]    >         at java.util.concurrent.locks.LockSupport.park(LockSupport.java:186)
[junit4:junit4]    >         at java.util.concurrent.locks.AbstractQueuedSynchronizer$ConditionObject.await(AbstractQueuedSynchronizer.java:2038)
[junit4:junit4]    >         at java.util.concurrent.LinkedBlockingQueue.take(LinkedBlockingQueue.java:439)
[junit4:junit4]    >         at java.util.concurrent.ThreadPoolExecutor.getTask(ThreadPoolExecutor.java:1045)
[junit4:junit4]    >         at java.util.concurrent.ThreadPoolExecutor.runWorker(ThreadPoolExecutor.java:1103)
[junit4:junit4]    >         at java.util.concurrent.ThreadPoolExecutor$Worker.run(ThreadPoolExecutor.java:603)
[junit4:junit4]    >         at java.lang.Thread.run(Thread.java:722)
[junit4:junit4]    >    2) Thread[id=2369, name=searcherExecutor-2381-thread-1, state=WAITING, group=TGRP-TestLazyCores]
[junit4:junit4]    >         at sun.misc.Unsafe.park(Native Method)
[junit4:junit4]    >         at java.util.concurrent.locks.LockSupport.park(LockSupport.java:186)
[junit4:junit4]    >         at java.util.concurrent.locks.AbstractQueuedSynchronizer$ConditionObject.await(AbstractQueuedSynchronizer.java:2038)
[junit4:junit4]    >         at java.util.concurrent.LinkedBlockingQueue.take(LinkedBlockingQueue.java:439)
[junit4:junit4]    >         at java.util.concurrent.ThreadPoolExecutor.getTask(ThreadPoolExecutor.java:1045)
[junit4:junit4]    >         at java.util.concurrent.ThreadPoolExecutor.runWorker(ThreadPoolExecutor.java:1103)
[junit4:junit4]    >         at java.util.concurrent.ThreadPoolExecutor$Worker.run(ThreadPoolExecutor.java:603)
[junit4:junit4]    >         at java.lang.Thread.run(Thread.java:722)
[junit4:junit4]    >    3) Thread[id=2366, name=searcherExecutor-2369-thread-1, state=WAITING, group=TGRP-TestLazyCores]
[junit4:junit4]    >         at sun.misc.Unsafe.park(Native Method)
[junit4:junit4]    >         at java.util.concurrent.locks.LockSupport.park(LockSupport.java:186)
[junit4:junit4]    >         at java.util.concurrent.locks.AbstractQueuedSynchronizer$ConditionObject.await(AbstractQueuedSynchronizer.java:2038)
[junit4:junit4]    >         at java.util.concurrent.LinkedBlockingQueue.take(LinkedBlockingQueue.java:439)
[junit4:junit4]    >         at java.util.concurrent.ThreadPoolExecutor.getTask(ThreadPoolExecutor.java:1045)
[junit4:junit4]    >         at java.util.concurrent.ThreadPoolExecutor.runWorker(ThreadPoolExecutor.java:1103)
[junit4:junit4]    >         at java.util.concurrent.ThreadPoolExecutor$Worker.run(ThreadPoolExecutor.java:603)
[junit4:junit4]    >         at java.lang.Thread.run(Thread.java:722)
[junit4:junit4]    >    4) Thread[id=2368, name=searcherExecutor-2378-thread-1, state=WAITING, group=TGRP-TestLazyCores]
[junit4:junit4]    >         at sun.misc.Unsafe.park(Native Method)
[junit4:junit4]    >         at java.util.concurrent.locks.LockSupport.park(LockSupport.java:186)
[junit4:junit4]    >         at java.util.concurrent.locks.AbstractQueuedSynchronizer$ConditionObject.await(AbstractQueuedSynchronizer.java:2038)
[junit4:junit4]    >         at java.util.concurrent.LinkedBlockingQueue.take(LinkedBlockingQueue.java:439)
[junit4:junit4]    >         at java.util.concurrent.ThreadPoolExecutor.getTask(ThreadPoolExecutor.java:1045)
[junit4:junit4]    >         at java.util.concurrent.ThreadPoolExecutor.runWorker(ThreadPoolExecutor.java:1103)
[junit4:junit4]    >         at java.util.concurrent.ThreadPoolExecutor$Worker.run(ThreadPoolExecutor.java:603)
[junit4:junit4]    >         at java.lang.Thread.run(Thread.java:722)
[junit4:junit4]    > 	at __randomizedtesting.SeedInfo.seed([CF50389D6DA57BF1]:0)
[junit4:junit4]    > Throwable #3: com.carrotsearch.randomizedtesting.ThreadLeakError: There are still zombie threads that couldn't be terminated:
[junit4:junit4]    >    1) Thread[id=2369, name=searcherExecutor-2381-thread-1, state=WAITING, group=TGRP-TestLazyCores]
[junit4:junit4]    >         at sun.misc.Unsafe.park(Native Method)
[junit4:junit4]    >         at java.util.concurrent.locks.LockSupport.park(LockSupport.java:186)
[junit4:junit4]    >         at java.util.concurrent.locks.AbstractQueuedSynchronizer$ConditionObject.await(AbstractQueuedSynchronizer.java:2038)
[junit4:junit4]    >         at java.util.concurrent.LinkedBlockingQueue.take(LinkedBlockingQueue.java:439)
[junit4:junit4]    >         at java.util.concurrent.ThreadPoolExecutor.getTask(ThreadPoolExecutor.java:1045)
[junit4:junit4]    >         at java.util.concurrent.ThreadPoolExecutor.runWorker(ThreadPoolExecutor.java:1103)
[junit4:junit4]    >         at java.util.concurrent.ThreadPoolExecutor$Worker.run(ThreadPoolExecutor.java:603)
[junit4:junit4]    >         at java.lang.Thread.run(Thread.java:722)
[junit4:junit4]    >    2) Thread[id=2367, name=searcherExecutor-2375-thread-1, state=WAITING, group=TGRP-TestLazyCores]
[junit4:junit4]    >         at sun.misc.Unsafe.park(Native Method)
[junit4:junit4]    >         at java.util.concurrent.locks.LockSupport.park(LockSupport.java:186)
[junit4:junit4]    >         at java.util.concurrent.locks.AbstractQueuedSynchronizer$ConditionObject.await(AbstractQueuedSynchronizer.java:2038)
[junit4:junit4]    >         at java.util.concurrent.LinkedBlockingQueue.take(LinkedBlockingQueue.java:439)
[junit4:junit4]    >         at java.util.concurrent.ThreadPoolExecutor.getTask(ThreadPoolExecutor.java:1045)
[junit4:junit4]    >         at java.util.concurrent.ThreadPoolExecutor.runWorker(ThreadPoolExecutor.java:1103)
[junit4:junit4]    >         at java.util.concurrent.ThreadPoolExecutor$Worker.run(ThreadPoolExecutor.java:603)
[junit4:junit4]    >         at java.lang.Thread.run(Thread.java:722)
[junit4:junit4]    >    3) Thread[id=2368, name=searcherExecutor-2378-thread-1, state=WAITING, group=TGRP-TestLazyCores]
[junit4:junit4]    >         at sun.misc.Unsafe.park(Native Method)
[junit4:junit4]    >         at java.util.concurrent.locks.LockSupport.park(LockSupport.java:186)
[junit4:junit4]    >         at java.util.concurrent.locks.AbstractQueuedSynchronizer$ConditionObject.await(AbstractQueuedSynchronizer.java:2038)
[junit4:junit4]    >         at java.util.concurrent.LinkedBlockingQueue.take(LinkedBlockingQueue.java:439)
[junit4:junit4]    >         at java.util.concurrent.ThreadPoolExecutor.getTask(ThreadPoolExecutor.java:1045)
[junit4:junit4]    >         at java.util.concurrent.ThreadPoolExecutor.runWorker(ThreadPoolExecutor.java:1103)
[junit4:junit4]    >         at java.util.concurrent.ThreadPoolExecutor$Worker.run(ThreadPoolExecutor.java:603)
[junit4:junit4]    >         at java.lang.Thread.run(Thread.java:722)
[junit4:junit4]    >    4) Thread[id=2366, name=searcherExecutor-2369-thread-1, state=WAITING, group=TGRP-TestLazyCores]
[junit4:junit4]    >         at sun.misc.Unsafe.park(Native Method)
[junit4:junit4]    >         at java.util.concurrent.locks.LockSupport.park(LockSupport.java:186)
[junit4:junit4]    >         at java.util.concurrent.locks.AbstractQueuedSynchronizer$ConditionObject.await(AbstractQueuedSynchronizer.java:2038)
[junit4:junit4]    >         at java.util.concurrent.LinkedBlockingQueue.take(LinkedBlockingQueue.java:439)
[junit4:junit4]    >         at java.util.concurrent.ThreadPoolExecutor.getTask(ThreadPoolExecutor.java:1045)
[junit4:junit4]    >         at java.util.concurrent.ThreadPoolExecutor.runWorker(ThreadPoolExecutor.java:1103)
[junit4:junit4]    >         at java.util.concurrent.ThreadPoolExecutor$Worker.run(ThreadPoolExecutor.java:603)
[junit4:junit4]    >         at java.lang.Thread.run(Thread.java:722)
[junit4:junit4]    > 	at __randomizedtesting.SeedInfo.seed([CF50389D6DA57BF1]:0)
[junit4:junit4] Completed on J0 in 151.27s, 3 tests, 2 failures, 2 errors <<< FAILURES!

[...truncated 11 lines...]
BUILD FAILED
/mnt/ssd/jenkins/workspace/Lucene-Solr-trunk-Linux/build.xml:335: The following error occurred while executing this line:
/mnt/ssd/jenkins/workspace/Lucene-Solr-trunk-Linux/build.xml:39: The following error occurred while executing this line:
/mnt/ssd/jenkins/workspace/Lucene-Solr-trunk-Linux/solr/build.xml:178: The following error occurred while executing this line:
/mnt/ssd/jenkins/workspace/Lucene-Solr-trunk-Linux/solr/common-build.xml:438: The following error occurred while executing this line:
/mnt/ssd/jenkins/workspace/Lucene-Solr-trunk-Linux/lucene/common-build.xml:1163: The following error occurred while executing this line:
/mnt/ssd/jenkins/workspace/Lucene-Solr-trunk-Linux/lucene/common-build.xml:827: There were test failures: 236 suites, 980 tests, 3 suite-level errors, 1 failure, 7 ignored (2 assumptions)

Total time: 30 minutes 24 seconds
Build step 'Invoke Ant' marked build as failure
Archiving artifacts
Recording test results
Description set: Java: 32bit/jdk1.8.0-ea-b65 -client -XX:+UseParallelGC
Email was triggered for: Failure
Sending email for trigger: Failure



Mime
View raw message