lucene-dev mailing list archives

Site index · List index
Message view « Date » · « Thread »
Top « Date » · « Thread »
From Apache Jenkins Server <jenk...@builds.apache.org>
Subject [JENKINS] Lucene-Solr-Tests-4.x-java7 - Build # 816 - Failure
Date Thu, 20 Dec 2012 19:20:18 GMT
Build: https://builds.apache.org/job/Lucene-Solr-Tests-4.x-java7/816/

3 tests failed.
REGRESSION:  org.apache.solr.cloud.BasicDistributedZkTest.testDistribSearch

Error Message:
Test abandoned because suite timeout was reached.

Stack Trace:
java.lang.Exception: Test abandoned because suite timeout was reached.
	at __randomizedtesting.SeedInfo.seed([5C9F7C8FCAF62C21]:0)


FAILED:  junit.framework.TestSuite.org.apache.solr.cloud.BasicDistributedZkTest

Error Message:
Suite timeout exceeded (>= 7200000 msec).

Stack Trace:
java.lang.Exception: Suite timeout exceeded (>= 7200000 msec).
	at __randomizedtesting.SeedInfo.seed([5C9F7C8FCAF62C21]:0)


REGRESSION:  org.apache.solr.cloud.SyncSliceTest.testDistribSearch

Error Message:
shard1 should have just been set up to be inconsistent - but it's still consistent

Stack Trace:
java.lang.AssertionError: shard1 should have just been set up to be inconsistent - but it's still consistent
	at __randomizedtesting.SeedInfo.seed([5C9F7C8FCAF62C21:DD79F297BDA94C1D]:0)
	at org.junit.Assert.fail(Assert.java:93)
	at org.junit.Assert.assertTrue(Assert.java:43)
	at org.junit.Assert.assertNotNull(Assert.java:526)
	at org.apache.solr.cloud.SyncSliceTest.doTest(SyncSliceTest.java:220)
	at org.apache.solr.BaseDistributedSearchTestCase.testDistribSearch(BaseDistributedSearchTestCase.java:794)
	at sun.reflect.NativeMethodAccessorImpl.invoke0(Native Method)
	at sun.reflect.NativeMethodAccessorImpl.invoke(NativeMethodAccessorImpl.java:57)
	at sun.reflect.DelegatingMethodAccessorImpl.invoke(DelegatingMethodAccessorImpl.java:43)
	at java.lang.reflect.Method.invoke(Method.java:601)
	at com.carrotsearch.randomizedtesting.RandomizedRunner.invoke(RandomizedRunner.java:1559)
	at com.carrotsearch.randomizedtesting.RandomizedRunner.access$600(RandomizedRunner.java:79)
	at com.carrotsearch.randomizedtesting.RandomizedRunner$6.evaluate(RandomizedRunner.java:737)
	at com.carrotsearch.randomizedtesting.RandomizedRunner$7.evaluate(RandomizedRunner.java:773)
	at com.carrotsearch.randomizedtesting.RandomizedRunner$8.evaluate(RandomizedRunner.java:787)
	at com.carrotsearch.randomizedtesting.rules.SystemPropertiesRestoreRule$1.evaluate(SystemPropertiesRestoreRule.java:53)
	at org.apache.lucene.util.TestRuleSetupTeardownChained$1.evaluate(TestRuleSetupTeardownChained.java:50)
	at org.apache.lucene.util.TestRuleFieldCacheSanity$1.evaluate(TestRuleFieldCacheSanity.java:51)
	at org.apache.lucene.util.AbstractBeforeAfterRule$1.evaluate(AbstractBeforeAfterRule.java:46)
	at com.carrotsearch.randomizedtesting.rules.SystemPropertiesInvariantRule$1.evaluate(SystemPropertiesInvariantRule.java:55)
	at org.apache.lucene.util.TestRuleThreadAndTestName$1.evaluate(TestRuleThreadAndTestName.java:49)
	at org.apache.lucene.util.TestRuleIgnoreAfterMaxFailures$1.evaluate(TestRuleIgnoreAfterMaxFailures.java:70)
	at org.apache.lucene.util.TestRuleMarkFailure$1.evaluate(TestRuleMarkFailure.java:48)
	at com.carrotsearch.randomizedtesting.rules.StatementAdapter.evaluate(StatementAdapter.java:36)
	at com.carrotsearch.randomizedtesting.ThreadLeakControl$StatementRunner.run(ThreadLeakControl.java:358)
	at com.carrotsearch.randomizedtesting.ThreadLeakControl.forkTimeoutingTask(ThreadLeakControl.java:782)
	at com.carrotsearch.randomizedtesting.ThreadLeakControl$3.evaluate(ThreadLeakControl.java:442)
	at com.carrotsearch.randomizedtesting.RandomizedRunner.runSingleTest(RandomizedRunner.java:746)
	at com.carrotsearch.randomizedtesting.RandomizedRunner$3.evaluate(RandomizedRunner.java:648)
	at com.carrotsearch.randomizedtesting.RandomizedRunner$4.evaluate(RandomizedRunner.java:682)
	at com.carrotsearch.randomizedtesting.RandomizedRunner$5.evaluate(RandomizedRunner.java:693)
	at com.carrotsearch.randomizedtesting.rules.StatementAdapter.evaluate(StatementAdapter.java:36)
	at com.carrotsearch.randomizedtesting.rules.SystemPropertiesRestoreRule$1.evaluate(SystemPropertiesRestoreRule.java:53)
	at org.apache.lucene.util.AbstractBeforeAfterRule$1.evaluate(AbstractBeforeAfterRule.java:46)
	at org.apache.lucene.util.TestRuleStoreClassName$1.evaluate(TestRuleStoreClassName.java:42)
	at com.carrotsearch.randomizedtesting.rules.SystemPropertiesInvariantRule$1.evaluate(SystemPropertiesInvariantRule.java:55)
	at com.carrotsearch.randomizedtesting.rules.NoShadowingOrOverridesOnMethodsRule$1.evaluate(NoShadowingOrOverridesOnMethodsRule.java:39)
	at com.carrotsearch.randomizedtesting.rules.NoShadowingOrOverridesOnMethodsRule$1.evaluate(NoShadowingOrOverridesOnMethodsRule.java:39)
	at com.carrotsearch.randomizedtesting.rules.StatementAdapter.evaluate(StatementAdapter.java:36)
	at org.apache.lucene.util.TestRuleAssertionsRequired$1.evaluate(TestRuleAssertionsRequired.java:43)
	at org.apache.lucene.util.TestRuleMarkFailure$1.evaluate(TestRuleMarkFailure.java:48)
	at org.apache.lucene.util.TestRuleIgnoreAfterMaxFailures$1.evaluate(TestRuleIgnoreAfterMaxFailures.java:70)
	at org.apache.lucene.util.TestRuleIgnoreTestSuites$1.evaluate(TestRuleIgnoreTestSuites.java:55)
	at com.carrotsearch.randomizedtesting.rules.StatementAdapter.evaluate(StatementAdapter.java:36)
	at com.carrotsearch.randomizedtesting.ThreadLeakControl$StatementRunner.run(ThreadLeakControl.java:358)
	at java.lang.Thread.run(Thread.java:722)




Build Log:
[...truncated 9187 lines...]
[junit4:junit4] Suite: org.apache.solr.cloud.SyncSliceTest
[junit4:junit4]   2> 0 T3671 oas.BaseDistributedSearchTestCase.initHostContext Setting hostContext system property: /om_z/
[junit4:junit4]   2> 7 T3671 oas.SolrTestCaseJ4.setUp ###Starting testDistribSearch
[junit4:junit4]   2> Creating dataDir: /usr/home/hudson/hudson-slave/workspace/Lucene-Solr-Tests-4.x-java7/solr/build/solr-core/test/J1/./solrtest-SyncSliceTest-1356024816557
[junit4:junit4]   2> 8 T3671 oasc.ZkTestServer.run STARTING ZK TEST SERVER
[junit4:junit4]   2> 9 T3672 oasc.ZkTestServer$ZKServerMain.runFromConfig Starting server
[junit4:junit4]   2> 13 T3672 oazs.ZooKeeperServer.setTickTime tickTime set to 1000
[junit4:junit4]   2> 13 T3672 oazs.ZooKeeperServer.setMinSessionTimeout minSessionTimeout set to -1
[junit4:junit4]   2> 13 T3672 oazs.ZooKeeperServer.setMaxSessionTimeout maxSessionTimeout set to -1
[junit4:junit4]   2> 14 T3672 oazs.NIOServerCnxnFactory.configure binding to port 0.0.0.0/0.0.0.0:0
[junit4:junit4]   2> 15 T3672 oazsp.FileTxnSnapLog.save Snapshotting: 0x0 to /usr/home/hudson/hudson-slave/workspace/Lucene-Solr-Tests-4.x-java7/solr/build/solr-core/test/J1/./org.apache.solr.cloud.SyncSliceTest-1356024816556/zookeeper/server1/data/version-2/snapshot.0
[junit4:junit4]   2> 110 T3671 oasc.ZkTestServer.run start zk server on port:55263
[junit4:junit4]   2> 111 T3671 oaz.ZooKeeper.<init> Initiating client connection, connectString=127.0.0.1:55263 sessionTimeout=10000 watcher=org.apache.solr.common.cloud.ConnectionManager@58aac27e
[junit4:junit4]   2> 112 T3677 oaz.ClientCnxn$SendThread.logStartConnect Opening socket connection to server localhost/127.0.0.1:55263. Will not attempt to authenticate using SASL (access denied ("javax.security.auth.AuthPermission" "getLoginConfiguration"))
[junit4:junit4]   2> 112 T3671 oascc.ConnectionManager.waitForConnected Waiting for client to connect to ZooKeeper
[junit4:junit4]   2> 113 T3677 oaz.ClientCnxn$SendThread.primeConnection Socket connection established to localhost/127.0.0.1:55263, initiating session
[junit4:junit4]   2> 113 T3673 oazs.NIOServerCnxnFactory.run Accepted socket connection from /140.211.11.196:55264
[junit4:junit4]   2> 114 T3673 oazs.ZooKeeperServer.processConnectRequest Client attempting to establish new session at /140.211.11.196:55264
[junit4:junit4]   2> 114 T3675 oazsp.FileTxnLog.append Creating new log file: log.1
[junit4:junit4]   2> 117 T3675 oazs.ZooKeeperServer.finishSessionInit Established session 0x13bb960a3b50000 with negotiated timeout 10000 for client /140.211.11.196:55264
[junit4:junit4]   2> 117 T3677 oaz.ClientCnxn$SendThread.onConnected Session establishment complete on server localhost/127.0.0.1:55263, sessionid = 0x13bb960a3b50000, negotiated timeout = 10000
[junit4:junit4]   2> 118 T3678 oascc.ConnectionManager.process Watcher org.apache.solr.common.cloud.ConnectionManager@58aac27e name:ZooKeeperConnection Watcher:127.0.0.1:55263 got event WatchedEvent state:SyncConnected type:None path:null path:null type:None
[junit4:junit4]   2> 118 T3671 oascc.ConnectionManager.waitForConnected Client is connected to ZooKeeper
[junit4:junit4]   2> 119 T3671 oascc.SolrZkClient.makePath makePath: /solr
[junit4:junit4]   2> 122 T3676 oazs.PrepRequestProcessor.pRequest2Txn Processed session termination for sessionid: 0x13bb960a3b50000
[junit4:junit4]   2> 137 T3678 oaz.ClientCnxn$EventThread.run EventThread shut down
[junit4:junit4]   2> 138 T3673 oazs.NIOServerCnxn.closeSock Closed socket connection for client /140.211.11.196:55264 which had sessionid 0x13bb960a3b50000
[junit4:junit4]   2> 137 T3671 oaz.ZooKeeper.close Session: 0x13bb960a3b50000 closed
[junit4:junit4]   2> 138 T3671 oaz.ZooKeeper.<init> Initiating client connection, connectString=127.0.0.1:55263/solr sessionTimeout=10000 watcher=org.apache.solr.common.cloud.ConnectionManager@635a3bb4
[junit4:junit4]   2> 140 T3679 oaz.ClientCnxn$SendThread.logStartConnect Opening socket connection to server localhost/127.0.0.1:55263. Will not attempt to authenticate using SASL (access denied ("javax.security.auth.AuthPermission" "getLoginConfiguration"))
[junit4:junit4]   2> 139 T3671 oascc.ConnectionManager.waitForConnected Waiting for client to connect to ZooKeeper
[junit4:junit4]   2> 140 T3679 oaz.ClientCnxn$SendThread.primeConnection Socket connection established to localhost/127.0.0.1:55263, initiating session
[junit4:junit4]   2> 141 T3673 oazs.NIOServerCnxnFactory.run Accepted socket connection from /140.211.11.196:55265
[junit4:junit4]   2> 141 T3673 oazs.ZooKeeperServer.processConnectRequest Client attempting to establish new session at /140.211.11.196:55265
[junit4:junit4]   2> 142 T3675 oazs.ZooKeeperServer.finishSessionInit Established session 0x13bb960a3b50001 with negotiated timeout 10000 for client /140.211.11.196:55265
[junit4:junit4]   2> 142 T3679 oaz.ClientCnxn$SendThread.onConnected Session establishment complete on server localhost/127.0.0.1:55263, sessionid = 0x13bb960a3b50001, negotiated timeout = 10000
[junit4:junit4]   2> 143 T3680 oascc.ConnectionManager.process Watcher org.apache.solr.common.cloud.ConnectionManager@635a3bb4 name:ZooKeeperConnection Watcher:127.0.0.1:55263/solr got event WatchedEvent state:SyncConnected type:None path:null path:null type:None
[junit4:junit4]   2> 143 T3671 oascc.ConnectionManager.waitForConnected Client is connected to ZooKeeper
[junit4:junit4]   2> 144 T3671 oascc.SolrZkClient.makePath makePath: /collections/collection1
[junit4:junit4]   2> 148 T3671 oascc.SolrZkClient.makePath makePath: /collections/collection1/shards
[junit4:junit4]   2> 151 T3671 oascc.SolrZkClient.makePath makePath: /collections/control_collection
[junit4:junit4]   2> 154 T3671 oascc.SolrZkClient.makePath makePath: /collections/control_collection/shards
[junit4:junit4]   2> 158 T3671 oasc.AbstractZkTestCase.putConfig put /usr/home/hudson/hudson-slave/workspace/Lucene-Solr-Tests-4.x-java7/solr/build/solr-core/test-files/solr/collection1/conf/solrconfig.xml to /configs/conf1/solrconfig.xml
[junit4:junit4]   2> 159 T3671 oascc.SolrZkClient.makePath makePath: /configs/conf1/solrconfig.xml
[junit4:junit4]   2> 164 T3671 oasc.AbstractZkTestCase.putConfig put /usr/home/hudson/hudson-slave/workspace/Lucene-Solr-Tests-4.x-java7/solr/build/solr-core/test-files/solr/collection1/conf/schema.xml to /configs/conf1/schema.xml
[junit4:junit4]   2> 166 T3671 oascc.SolrZkClient.makePath makePath: /configs/conf1/schema.xml
[junit4:junit4]   2> 269 T3671 oasc.AbstractZkTestCase.putConfig put /usr/home/hudson/hudson-slave/workspace/Lucene-Solr-Tests-4.x-java7/solr/build/solr-core/test-files/solr/collection1/conf/stopwords.txt to /configs/conf1/stopwords.txt
[junit4:junit4]   2> 270 T3671 oascc.SolrZkClient.makePath makePath: /configs/conf1/stopwords.txt
[junit4:junit4]   2> 274 T3671 oasc.AbstractZkTestCase.putConfig put /usr/home/hudson/hudson-slave/workspace/Lucene-Solr-Tests-4.x-java7/solr/build/solr-core/test-files/solr/collection1/conf/protwords.txt to /configs/conf1/protwords.txt
[junit4:junit4]   2> 275 T3671 oascc.SolrZkClient.makePath makePath: /configs/conf1/protwords.txt
[junit4:junit4]   2> 278 T3671 oasc.AbstractZkTestCase.putConfig put /usr/home/hudson/hudson-slave/workspace/Lucene-Solr-Tests-4.x-java7/solr/build/solr-core/test-files/solr/collection1/conf/currency.xml to /configs/conf1/currency.xml
[junit4:junit4]   2> 279 T3671 oascc.SolrZkClient.makePath makePath: /configs/conf1/currency.xml
[junit4:junit4]   2> 286 T3671 oasc.AbstractZkTestCase.putConfig put /usr/home/hudson/hudson-slave/workspace/Lucene-Solr-Tests-4.x-java7/solr/build/solr-core/test-files/solr/collection1/conf/open-exchange-rates.json to /configs/conf1/open-exchange-rates.json
[junit4:junit4]   2> 287 T3671 oascc.SolrZkClient.makePath makePath: /configs/conf1/open-exchange-rates.json
[junit4:junit4]   2> 291 T3671 oasc.AbstractZkTestCase.putConfig put /usr/home/hudson/hudson-slave/workspace/Lucene-Solr-Tests-4.x-java7/solr/build/solr-core/test-files/solr/collection1/conf/mapping-ISOLatin1Accent.txt to /configs/conf1/mapping-ISOLatin1Accent.txt
[junit4:junit4]   2> 292 T3671 oascc.SolrZkClient.makePath makePath: /configs/conf1/mapping-ISOLatin1Accent.txt
[junit4:junit4]   2> 295 T3671 oasc.AbstractZkTestCase.putConfig put /usr/home/hudson/hudson-slave/workspace/Lucene-Solr-Tests-4.x-java7/solr/build/solr-core/test-files/solr/collection1/conf/old_synonyms.txt to /configs/conf1/old_synonyms.txt
[junit4:junit4]   2> 296 T3671 oascc.SolrZkClient.makePath makePath: /configs/conf1/old_synonyms.txt
[junit4:junit4]   2> 299 T3671 oasc.AbstractZkTestCase.putConfig put /usr/home/hudson/hudson-slave/workspace/Lucene-Solr-Tests-4.x-java7/solr/build/solr-core/test-files/solr/collection1/conf/synonyms.txt to /configs/conf1/synonyms.txt
[junit4:junit4]   2> 300 T3671 oascc.SolrZkClient.makePath makePath: /configs/conf1/synonyms.txt
[junit4:junit4]   2> 303 T3676 oazs.PrepRequestProcessor.pRequest2Txn Processed session termination for sessionid: 0x13bb960a3b50001
[junit4:junit4]   2> 310 T3680 oaz.ClientCnxn$EventThread.run EventThread shut down
[junit4:junit4]   2> 310 T3673 oazs.NIOServerCnxn.closeSock Closed socket connection for client /140.211.11.196:55265 which had sessionid 0x13bb960a3b50001
[junit4:junit4]   2> 310 T3671 oaz.ZooKeeper.close Session: 0x13bb960a3b50001 closed
[junit4:junit4]   2> 469 T3671 oejs.Server.doStart jetty-8.1.8.v20121106
[junit4:junit4]   2> 476 T3671 oejs.AbstractConnector.doStart Started SocketConnector@127.0.0.1:55266
[junit4:junit4]   2> 478 T3671 oasc.SolrResourceLoader.locateSolrHome JNDI not configured for solr (NoInitialContextEx)
[junit4:junit4]   2> 479 T3671 oasc.SolrResourceLoader.locateSolrHome using system property solr.solr.home: /usr/home/hudson/hudson-slave/workspace/Lucene-Solr-Tests-4.x-java7/solr/build/solr-core/test/J1/./org.apache.solr.cloud.SyncSliceTest-controljetty-1356024816860
[junit4:junit4]   2> 480 T3671 oasc.SolrResourceLoader.<init> new SolrResourceLoader for deduced Solr Home: '/usr/home/hudson/hudson-slave/workspace/Lucene-Solr-Tests-4.x-java7/solr/build/solr-core/test/J1/./org.apache.solr.cloud.SyncSliceTest-controljetty-1356024816860/'
[junit4:junit4]   2> 522 T3671 oass.SolrDispatchFilter.init SolrDispatchFilter.init()
[junit4:junit4]   2> 523 T3671 oasc.SolrResourceLoader.locateSolrHome JNDI not configured for solr (NoInitialContextEx)
[junit4:junit4]   2> 524 T3671 oasc.SolrResourceLoader.locateSolrHome using system property solr.solr.home: /usr/home/hudson/hudson-slave/workspace/Lucene-Solr-Tests-4.x-java7/solr/build/solr-core/test/J1/./org.apache.solr.cloud.SyncSliceTest-controljetty-1356024816860
[junit4:junit4]   2> 524 T3671 oasc.CoreContainer$Initializer.initialize looking for solr.xml: /usr/home/hudson/hudson-slave/workspace/Lucene-Solr-Tests-4.x-java7/solr/build/solr-core/test/J1/./org.apache.solr.cloud.SyncSliceTest-controljetty-1356024816860/solr.xml
[junit4:junit4]   2> 525 T3671 oasc.CoreContainer.<init> New CoreContainer 271778251
[junit4:junit4]   2> 526 T3671 oasc.CoreContainer.load Loading CoreContainer using Solr Home: '/usr/home/hudson/hudson-slave/workspace/Lucene-Solr-Tests-4.x-java7/solr/build/solr-core/test/J1/./org.apache.solr.cloud.SyncSliceTest-controljetty-1356024816860/'
[junit4:junit4]   2> 527 T3671 oasc.SolrResourceLoader.<init> new SolrResourceLoader for directory: '/usr/home/hudson/hudson-slave/workspace/Lucene-Solr-Tests-4.x-java7/solr/build/solr-core/test/J1/./org.apache.solr.cloud.SyncSliceTest-controljetty-1356024816860/'
[junit4:junit4]   2> 557 T3671 oashc.HttpShardHandlerFactory.getParameter Setting socketTimeout to: 30000
[junit4:junit4]   2> 558 T3671 oashc.HttpShardHandlerFactory.getParameter Setting urlScheme to: http://
[junit4:junit4]   2> 559 T3671 oashc.HttpShardHandlerFactory.getParameter Setting connTimeout to: 15000
[junit4:junit4]   2> 560 T3671 oashc.HttpShardHandlerFactory.getParameter Setting maxConnectionsPerHost to: 20
[junit4:junit4]   2> 560 T3671 oashc.HttpShardHandlerFactory.getParameter Setting corePoolSize to: 0
[junit4:junit4]   2> 561 T3671 oashc.HttpShardHandlerFactory.getParameter Setting maximumPoolSize to: 2147483647
[junit4:junit4]   2> 562 T3671 oashc.HttpShardHandlerFactory.getParameter Setting maxThreadIdleTime to: 5
[junit4:junit4]   2> 563 T3671 oashc.HttpShardHandlerFactory.getParameter Setting sizeOfQueue to: -1
[junit4:junit4]   2> 564 T3671 oashc.HttpShardHandlerFactory.getParameter Setting fairnessPolicy to: false
[junit4:junit4]   2> 565 T3671 oascsi.HttpClientUtil.createClient Creating new http client, config:maxConnectionsPerHost=20&maxConnections=10000&socketTimeout=30000&connTimeout=15000&retry=false
[junit4:junit4]   2> 587 T3671 oasc.CoreContainer.load Registering Log Listener
[junit4:junit4]   2> 607 T3671 oasc.CoreContainer.initZooKeeper Zookeeper client=127.0.0.1:55263/solr
[junit4:junit4]   2> 608 T3671 oasc.ZkController.checkChrootPath zkHost includes chroot
[junit4:junit4]   2> 609 T3671 oaz.ZooKeeper.<init> Initiating client connection, connectString=127.0.0.1:55263 sessionTimeout=60000 watcher=org.apache.solr.common.cloud.ConnectionManager@4acb9622
[junit4:junit4]   2> 611 T3690 oaz.ClientCnxn$SendThread.logStartConnect Opening socket connection to server localhost/127.0.0.1:55263. Will not attempt to authenticate using SASL (access denied ("javax.security.auth.AuthPermission" "getLoginConfiguration"))
[junit4:junit4]   2> 610 T3671 oascc.ConnectionManager.waitForConnected Waiting for client to connect to ZooKeeper
[junit4:junit4]   2> 612 T3690 oaz.ClientCnxn$SendThread.primeConnection Socket connection established to localhost/127.0.0.1:55263, initiating session
[junit4:junit4]   2> 612 T3673 oazs.NIOServerCnxnFactory.run Accepted socket connection from /140.211.11.196:55267
[junit4:junit4]   2> 612 T3673 oazs.ZooKeeperServer.processConnectRequest Client attempting to establish new session at /140.211.11.196:55267
[junit4:junit4]   2> 614 T3675 oazs.ZooKeeperServer.finishSessionInit Established session 0x13bb960a3b50002 with negotiated timeout 20000 for client /140.211.11.196:55267
[junit4:junit4]   2> 614 T3690 oaz.ClientCnxn$SendThread.onConnected Session establishment complete on server localhost/127.0.0.1:55263, sessionid = 0x13bb960a3b50002, negotiated timeout = 20000
[junit4:junit4]   2> 615 T3691 oascc.ConnectionManager.process Watcher org.apache.solr.common.cloud.ConnectionManager@4acb9622 name:ZooKeeperConnection Watcher:127.0.0.1:55263 got event WatchedEvent state:SyncConnected type:None path:null path:null type:None
[junit4:junit4]   2> 615 T3671 oascc.ConnectionManager.waitForConnected Client is connected to ZooKeeper
[junit4:junit4]   2> 616 T3676 oazs.PrepRequestProcessor.pRequest2Txn Processed session termination for sessionid: 0x13bb960a3b50002
[junit4:junit4]   2> 617 T3691 oaz.ClientCnxn$EventThread.run EventThread shut down
[junit4:junit4]   2> 617 T3673 oazs.NIOServerCnxn.closeSock Closed socket connection for client /140.211.11.196:55267 which had sessionid 0x13bb960a3b50002
[junit4:junit4]   2> 617 T3671 oaz.ZooKeeper.close Session: 0x13bb960a3b50002 closed
[junit4:junit4]   2> 618 T3671 oascsi.HttpClientUtil.createClient Creating new http client, config:maxConnections=500&maxConnectionsPerHost=16&socketTimeout=15000&connTimeout=30000
[junit4:junit4]   2> 630 T3671 oaz.ZooKeeper.<init> Initiating client connection, connectString=127.0.0.1:55263/solr sessionTimeout=30000 watcher=org.apache.solr.common.cloud.ConnectionManager@6f45cd29
[junit4:junit4]   2> 632 T3692 oaz.ClientCnxn$SendThread.logStartConnect Opening socket connection to server localhost/127.0.0.1:55263. Will not attempt to authenticate using SASL (access denied ("javax.security.auth.AuthPermission" "getLoginConfiguration"))
[junit4:junit4]   2> 632 T3671 oascc.ConnectionManager.waitForConnected Waiting for client to connect to ZooKeeper
[junit4:junit4]   2> 633 T3673 oazs.NIOServerCnxnFactory.run Accepted socket connection from /140.211.11.196:55268
[junit4:junit4]   2> 632 T3692 oaz.ClientCnxn$SendThread.primeConnection Socket connection established to localhost/127.0.0.1:55263, initiating session
[junit4:junit4]   2> 633 T3673 oazs.ZooKeeperServer.processConnectRequest Client attempting to establish new session at /140.211.11.196:55268
[junit4:junit4]   2> 634 T3675 oazs.ZooKeeperServer.finishSessionInit Established session 0x13bb960a3b50003 with negotiated timeout 20000 for client /140.211.11.196:55268
[junit4:junit4]   2> 634 T3692 oaz.ClientCnxn$SendThread.onConnected Session establishment complete on server localhost/127.0.0.1:55263, sessionid = 0x13bb960a3b50003, negotiated timeout = 20000
[junit4:junit4]   2> 635 T3693 oascc.ConnectionManager.process Watcher org.apache.solr.common.cloud.ConnectionManager@6f45cd29 name:ZooKeeperConnection Watcher:127.0.0.1:55263/solr got event WatchedEvent state:SyncConnected type:None path:null path:null type:None
[junit4:junit4]   2> 635 T3671 oascc.ConnectionManager.waitForConnected Client is connected to ZooKeeper
[junit4:junit4]   2> 637 T3676 oazs.PrepRequestProcessor.pRequest Got user-level KeeperException when processing sessionid:0x13bb960a3b50003 type:create cxid:0x2 zxid:0x1a txntype:-1 reqpath:n/a Error Path:/solr/overseer Error:KeeperErrorCode = NodeExists for /solr/overseer
[junit4:junit4]   2> 646 T3671 oascc.SolrZkClient.makePath makePath: /live_nodes
[junit4:junit4]   2> 648 T3671 oasc.ZkController.createEphemeralLiveNode Register node as live in ZooKeeper:/live_nodes/127.0.0.1:55266_om_z
[junit4:junit4]   2> 649 T3676 oazs.PrepRequestProcessor.pRequest Got user-level KeeperException when processing sessionid:0x13bb960a3b50003 type:delete cxid:0x7 zxid:0x1c txntype:-1 reqpath:n/a Error Path:/solr/live_nodes/127.0.0.1:55266_om_z Error:KeeperErrorCode = NoNode for /solr/live_nodes/127.0.0.1:55266_om_z
[junit4:junit4]   2> 651 T3671 oascc.SolrZkClient.makePath makePath: /live_nodes/127.0.0.1:55266_om_z
[junit4:junit4]   2> 660 T3671 oascc.SolrZkClient.makePath makePath: /overseer_elect/election
[junit4:junit4]   2> 674 T3676 oazs.PrepRequestProcessor.pRequest Got user-level KeeperException when processing sessionid:0x13bb960a3b50003 type:delete cxid:0x15 zxid:0x21 txntype:-1 reqpath:n/a Error Path:/solr/overseer_elect/leader Error:KeeperErrorCode = NoNode for /solr/overseer_elect/leader
[junit4:junit4]   2> 675 T3671 oascc.SolrZkClient.makePath makePath: /overseer_elect/leader
[junit4:junit4]   2> 678 T3671 oasc.Overseer.start Overseer (id=88868442378403843-127.0.0.1:55266_om_z-n_0000000000) starting
[junit4:junit4]   2> 679 T3676 oazs.PrepRequestProcessor.pRequest Got user-level KeeperException when processing sessionid:0x13bb960a3b50003 type:create cxid:0x1a zxid:0x23 txntype:-1 reqpath:n/a Error Path:/solr/overseer Error:KeeperErrorCode = NodeExists for /solr/overseer
[junit4:junit4]   2> 685 T3676 oazs.PrepRequestProcessor.pRequest Got user-level KeeperException when processing sessionid:0x13bb960a3b50003 type:create cxid:0x1b zxid:0x24 txntype:-1 reqpath:n/a Error Path:/solr/overseer Error:KeeperErrorCode = NodeExists for /solr/overseer
[junit4:junit4]   2> 687 T3676 oazs.PrepRequestProcessor.pRequest Got user-level KeeperException when processing sessionid:0x13bb960a3b50003 type:create cxid:0x1c zxid:0x25 txntype:-1 reqpath:n/a Error Path:/solr/overseer Error:KeeperErrorCode = NodeExists for /solr/overseer
[junit4:junit4]   2> 693 T3676 oazs.PrepRequestProcessor.pRequest Got user-level KeeperException when processing sessionid:0x13bb960a3b50003 type:create cxid:0x1d zxid:0x26 txntype:-1 reqpath:n/a Error Path:/solr/overseer Error:KeeperErrorCode = NodeExists for /solr/overseer
[junit4:junit4]   2> 695 T3695 oasc.OverseerCollectionProcessor.run Process current queue of collection messages
[junit4:junit4]   2> 695 T3671 oascc.SolrZkClient.makePath makePath: /clusterstate.json
[junit4:junit4]   2> 706 T3671 oascc.ZkStateReader.createClusterStateWatchersAndUpdate Updating cluster state from ZooKeeper... 
[junit4:junit4]   2> 708 T3694 oasc.Overseer$ClusterStateUpdater.run Starting to work on the main queue
[junit4:junit4]   2> 714 T3696 oasc.CoreContainer.create Creating SolrCore 'collection1' using instanceDir: /usr/home/hudson/hudson-slave/workspace/Lucene-Solr-Tests-4.x-java7/solr/build/solr-core/test/J1/./org.apache.solr.cloud.SyncSliceTest-controljetty-1356024816860/collection1
[junit4:junit4]   2> 714 T3696 oasc.ZkController.createCollectionZkNode Check for collection zkNode:control_collection
[junit4:junit4]   2> 715 T3696 oasc.ZkController.createCollectionZkNode Collection zkNode exists
[junit4:junit4]   2> 715 T3696 oasc.ZkController.readConfigName Load collection config from:/collections/control_collection
[junit4:junit4]   2> 716 T3696 oasc.SolrResourceLoader.<init> new SolrResourceLoader for directory: '/usr/home/hudson/hudson-slave/workspace/Lucene-Solr-Tests-4.x-java7/solr/build/solr-core/test/J1/./org.apache.solr.cloud.SyncSliceTest-controljetty-1356024816860/collection1/'
[junit4:junit4]   2> 717 T3696 oasc.SolrResourceLoader.replaceClassLoader Adding 'file:/usr/home/hudson/hudson-slave/workspace/Lucene-Solr-Tests-4.x-java7/solr/build/solr-core/test/J1/org.apache.solr.cloud.SyncSliceTest-controljetty-1356024816860/collection1/lib/README' to classloader
[junit4:junit4]   2> 718 T3696 oasc.SolrResourceLoader.replaceClassLoader Adding 'file:/usr/home/hudson/hudson-slave/workspace/Lucene-Solr-Tests-4.x-java7/solr/build/solr-core/test/J1/org.apache.solr.cloud.SyncSliceTest-controljetty-1356024816860/collection1/lib/classes/' to classloader
[junit4:junit4]   2> 771 T3696 oasc.SolrConfig.<init> Using Lucene MatchVersion: LUCENE_41
[junit4:junit4]   2> 841 T3696 oasc.SolrConfig.<init> Loaded SolrConfig: solrconfig.xml
[junit4:junit4]   2> 942 T3696 oass.IndexSchema.readSchema Reading Solr Schema
[junit4:junit4]   2> 950 T3696 oass.IndexSchema.readSchema Schema name=test
[junit4:junit4]   2> 1617 T3696 oass.OpenExchangeRatesOrgProvider.init Initialized with rates=open-exchange-rates.json, refreshInterval=1440.
[junit4:junit4]   2> 1629 T3696 oass.IndexSchema.readSchema default search field in schema is text
[junit4:junit4]   2> 1633 T3696 oass.IndexSchema.readSchema unique key field: id
[junit4:junit4]   2> 1648 T3696 oass.FileExchangeRateProvider.reload Reloading exchange rates from file currency.xml
[junit4:junit4]   2> 1654 T3696 oass.FileExchangeRateProvider.reload Reloading exchange rates from file currency.xml
[junit4:junit4]   2> 1659 T3696 oass.OpenExchangeRatesOrgProvider.reload Reloading exchange rates from open-exchange-rates.json
[junit4:junit4]   2> 1660 T3696 oass.OpenExchangeRatesOrgProvider.reload Reloading exchange rates from open-exchange-rates.json
[junit4:junit4]   2> 1661 T3696 oasc.SolrCore.<init> [collection1] Opening new SolrCore at /usr/home/hudson/hudson-slave/workspace/Lucene-Solr-Tests-4.x-java7/solr/build/solr-core/test/J1/./org.apache.solr.cloud.SyncSliceTest-controljetty-1356024816860/collection1/, dataDir=./org.apache.solr.cloud.SyncSliceTest-1356024816556/control/data/
[junit4:junit4]   2> 1662 T3696 oasc.JmxMonitoredMap.<init> JMX monitoring is enabled. Adding Solr mbeans to JMX Server: com.sun.jmx.mbeanserver.JmxMBeanServer@45ad71f0
[junit4:junit4]   2> 1662 T3696 oasc.SolrCore.initDirectoryFactory solr.NRTCachingDirectoryFactory
[junit4:junit4]   2> 1663 T3696 oasc.CachingDirectoryFactory.get return new directory for /usr/home/hudson/hudson-slave/workspace/Lucene-Solr-Tests-4.x-java7/solr/build/solr-core/test/J1/./org.apache.solr.cloud.SyncSliceTest-1356024816556/control/data forceNew:false
[junit4:junit4]   2> 1664 T3696 oasc.CachingDirectoryFactory.close Releasing directory:/usr/home/hudson/hudson-slave/workspace/Lucene-Solr-Tests-4.x-java7/solr/build/solr-core/test/J1/./org.apache.solr.cloud.SyncSliceTest-1356024816556/control/data
[junit4:junit4]   2> 1665 T3696 oasc.SolrCore.getNewIndexDir New index directory detected: old=null new=./org.apache.solr.cloud.SyncSliceTest-1356024816556/control/data/index/
[junit4:junit4]   2> 1666 T3696 oasc.SolrCore.initIndex WARNING [collection1] Solr index directory './org.apache.solr.cloud.SyncSliceTest-1356024816556/control/data/index' doesn't exist. Creating new index...
[junit4:junit4]   2> 1667 T3696 oasc.CachingDirectoryFactory.get return new directory for /usr/home/hudson/hudson-slave/workspace/Lucene-Solr-Tests-4.x-java7/solr/build/solr-core/test/J1/./org.apache.solr.cloud.SyncSliceTest-1356024816556/control/data/index forceNew:false
[junit4:junit4]   2> 1673 T3696 oasc.SolrDeletionPolicy.onCommit SolrDeletionPolicy.onCommit: commits:num=1
[junit4:junit4]   2> 		commit{dir=RateLimitedDirectoryWrapper(NRTCachingDirectory(org.apache.lucene.store.NIOFSDirectory@/usr/home/hudson/hudson-slave/workspace/Lucene-Solr-Tests-4.x-java7/solr/build/solr-core/test/J1/org.apache.solr.cloud.SyncSliceTest-1356024816556/control/data/index lockFactory=org.apache.lucene.store.NativeFSLockFactory@ba2ac63; maxCacheMB=48.0 maxMergeSizeMB=4.0)),segFN=segments_1,generation=1,filenames=[segments_1]
[junit4:junit4]   2> 1674 T3696 oasc.SolrDeletionPolicy.updateCommits newest commit = 1[segments_1]
[junit4:junit4]   2> 1675 T3696 oasc.CachingDirectoryFactory.close Releasing directory:/usr/home/hudson/hudson-slave/workspace/Lucene-Solr-Tests-4.x-java7/solr/build/solr-core/test/J1/./org.apache.solr.cloud.SyncSliceTest-1356024816556/control/data/index
[junit4:junit4]   2> 1675 T3696 oasc.SolrCore.initWriters created xml: solr.XMLResponseWriter
[junit4:junit4]   2> 1677 T3696 oasup.UpdateRequestProcessorChain.init inserting DistributedUpdateProcessorFactory into updateRequestProcessorChain "dedupe"
[junit4:junit4]   2> 1678 T3696 oasup.UpdateRequestProcessorChain.init inserting DistributedUpdateProcessorFactory into updateRequestProcessorChain "dedupe-allfields"
[junit4:junit4]   2> 1678 T3696 oasup.UpdateRequestProcessorChain.init inserting DistributedUpdateProcessorFactory into updateRequestProcessorChain "stored_sig"
[junit4:junit4]   2> 1678 T3696 oasup.UpdateRequestProcessorChain.init inserting DistributedUpdateProcessorFactory into updateRequestProcessorChain "uniq-fields"
[junit4:junit4]   2> 1679 T3696 oasup.UpdateRequestProcessorChain.init inserting DistributedUpdateProcessorFactory into updateRequestProcessorChain "distrib-dup-test-chain-implicit"
[junit4:junit4]   2> 1680 T3696 oasc.RequestHandlers.initHandlersFromConfig adding lazy requestHandler: solr.ReplicationHandler
[junit4:junit4]   2> 1680 T3696 oasc.RequestHandlers.initHandlersFromConfig created /replication: solr.ReplicationHandler
[junit4:junit4]   2> 1681 T3696 oasc.RequestHandlers.initHandlersFromConfig created standard: solr.StandardRequestHandler
[junit4:junit4]   2> 1682 T3696 oasc.RequestHandlers.initHandlersFromConfig created /get: solr.RealTimeGetHandler
[junit4:junit4]   2> 1683 T3696 oasc.RequestHandlers.initHandlersFromConfig created dismax: solr.SearchHandler
[junit4:junit4]   2> 1684 T3696 oasc.RequestHandlers.initHandlersFromConfig created mock: org.apache.solr.core.MockQuerySenderListenerReqHandler
[junit4:junit4]   2> 1684 T3696 oasc.RequestHandlers.initHandlersFromConfig created /admin/: org.apache.solr.handler.admin.AdminHandlers
[junit4:junit4]   2> 1685 T3696 oasc.RequestHandlers.initHandlersFromConfig created defaults: solr.StandardRequestHandler
[junit4:junit4]   2> 1686 T3696 oasc.RequestHandlers.initHandlersFromConfig adding lazy requestHandler: solr.StandardRequestHandler
[junit4:junit4]   2> 1686 T3696 oasc.RequestHandlers.initHandlersFromConfig created lazy: solr.StandardRequestHandler
[junit4:junit4]   2> 1687 T3696 oasc.RequestHandlers.initHandlersFromConfig created /update: solr.UpdateRequestHandler
[junit4:junit4]   2> 1688 T3696 oasc.RequestHandlers.initHandlersFromConfig created /terms: org.apache.solr.handler.component.SearchHandler
[junit4:junit4]   2> 1689 T3696 oasc.RequestHandlers.initHandlersFromConfig created spellCheckCompRH: org.apache.solr.handler.component.SearchHandler
[junit4:junit4]   2> 1690 T3696 oasc.RequestHandlers.initHandlersFromConfig created spellCheckCompRH_Direct: org.apache.solr.handler.component.SearchHandler
[junit4:junit4]   2> 1691 T3696 oasc.RequestHandlers.initHandlersFromConfig created spellCheckWithWordbreak: org.apache.solr.handler.component.SearchHandler
[junit4:junit4]   2> 1692 T3696 oasc.RequestHandlers.initHandlersFromConfig created spellCheckWithWordbreak_Direct: org.apache.solr.handler.component.SearchHandler
[junit4:junit4]   2> 1693 T3696 oasc.RequestHandlers.initHandlersFromConfig created spellCheckCompRH1: org.apache.solr.handler.component.SearchHandler
[junit4:junit4]   2> 1694 T3696 oasc.RequestHandlers.initHandlersFromConfig created mltrh: org.apache.solr.handler.component.SearchHandler
[junit4:junit4]   2> 1694 T3696 oasc.RequestHandlers.initHandlersFromConfig created tvrh: org.apache.solr.handler.component.SearchHandler
[junit4:junit4]   2> 1695 T3696 oasc.RequestHandlers.initHandlersFromConfig created /mlt: solr.MoreLikeThisHandler
[junit4:junit4]   2> 1696 T3696 oasc.RequestHandlers.initHandlersFromConfig created /debug/dump: solr.DumpRequestHandler
[junit4:junit4]   2> 1709 T3696 oashl.XMLLoader.init xsltCacheLifetimeSeconds=60
[junit4:junit4]   2> 1714 T3696 oasc.SolrCore.initDeprecatedSupport WARNING solrconfig.xml uses deprecated <admin/gettableFiles>, Please update your config to use the ShowFileRequestHandler.
[junit4:junit4]   2> 1715 T3696 oasc.SolrCore.initDeprecatedSupport WARNING adding ShowFileRequestHandler with hidden files: [SCHEMA.XML, OLD_SYNONYMS.TXT, STOPWORDS.TXT, PROTWORDS.TXT, OPEN-EXCHANGE-RATES.JSON, SYNONYMS.TXT, CURRENCY.XML, MAPPING-ISOLATIN1ACCENT.TXT]
[junit4:junit4]   2> 1718 T3696 oasc.CachingDirectoryFactory.close Releasing directory:/usr/home/hudson/hudson-slave/workspace/Lucene-Solr-Tests-4.x-java7/solr/build/solr-core/test/J1/./org.apache.solr.cloud.SyncSliceTest-1356024816556/control/data
[junit4:junit4]   2> 1720 T3696 oass.SolrIndexSearcher.<init> Opening Searcher@401cdf52 main
[junit4:junit4]   2> 1721 T3696 oasu.CommitTracker.<init> Hard AutoCommit: disabled
[junit4:junit4]   2> 1722 T3696 oasu.CommitTracker.<init> Soft AutoCommit: disabled
[junit4:junit4]   2> 1722 T3696 oashc.SpellCheckComponent.inform Initializing spell checkers
[junit4:junit4]   2> 1729 T3696 oass.DirectSolrSpellChecker.init init: {name=direct,classname=DirectSolrSpellChecker,field=lowerfilt,minQueryLength=3}
[junit4:junit4]   2> 1787 T3697 oasc.SolrCore.registerSearcher [collection1] Registered new searcher Searcher@401cdf52 main{StandardDirectoryReader(segments_1:1)}
[junit4:junit4]   2> 1794 T3696 oasc.ZkController.publish publishing core=collection1 state=down
[junit4:junit4]   2> 1795 T3696 oasc.ZkController.publish numShards not found on descriptor - reading it from system property
[junit4:junit4]   2> 1796 T3676 oazs.PrepRequestProcessor.pRequest Got user-level KeeperException when processing sessionid:0x13bb960a3b50003 type:create cxid:0x56 zxid:0x29 txntype:-1 reqpath:n/a Error Path:/solr/overseer/queue Error:KeeperErrorCode = NoNode for /solr/overseer/queue
[junit4:junit4]   2> 2258 T3694 oascc.ZkStateReader.updateClusterState Updating cloud state from ZooKeeper... 
[junit4:junit4]   2> 2259 T3694 oasc.Overseer$ClusterStateUpdater.updateState Update state numShards=1 message={
[junit4:junit4]   2> 	  "operation":"state",
[junit4:junit4]   2> 	  "numShards":"1",
[junit4:junit4]   2> 	  "shard":null,
[junit4:junit4]   2> 	  "roles":null,
[junit4:junit4]   2> 	  "state":"down",
[junit4:junit4]   2> 	  "core":"collection1",
[junit4:junit4]   2> 	  "collection":"control_collection",
[junit4:junit4]   2> 	  "node_name":"127.0.0.1:55266_om_z",
[junit4:junit4]   2> 	  "base_url":"http://127.0.0.1:55266/om_z"}
[junit4:junit4]   2> 2259 T3694 oasc.Overseer$ClusterStateUpdater.createCollection Create collection control_collection with numShards 1
[junit4:junit4]   2> 2259 T3694 oasc.Overseer$ClusterStateUpdater.updateState Assigning new node to shard shard=shard1
[junit4:junit4]   2> 2260 T3676 oazs.PrepRequestProcessor.pRequest Got user-level KeeperException when processing sessionid:0x13bb960a3b50003 type:create cxid:0x5e zxid:0x2c txntype:-1 reqpath:n/a Error Path:/solr/overseer/queue-work Error:KeeperErrorCode = NoNode for /solr/overseer/queue-work
[junit4:junit4]   2> 2278 T3693 oascc.ZkStateReader$2.process A cluster state change: WatchedEvent state:SyncConnected type:NodeDataChanged path:/clusterstate.json, has occurred - updating... (live nodes size: 1)
[junit4:junit4]   2> 2809 T3696 oasc.CoreContainer.registerCore registering core: collection1
[junit4:junit4]   2> 2809 T3696 oasc.ZkController.register Register replica - core:collection1 address:http://127.0.0.1:55266/om_z collection:control_collection shard:shard1
[junit4:junit4]   2> 2810 T3696 oascc.SolrZkClient.makePath makePath: /collections/control_collection/leader_elect/shard1/election
[junit4:junit4]   2> 2828 T3676 oazs.PrepRequestProcessor.pRequest Got user-level KeeperException when processing sessionid:0x13bb960a3b50003 type:delete cxid:0x7b zxid:0x36 txntype:-1 reqpath:n/a Error Path:/solr/collections/control_collection/leaders Error:KeeperErrorCode = NoNode for /solr/collections/control_collection/leaders
[junit4:junit4]   2> 2829 T3696 oasc.ShardLeaderElectionContext.runLeaderProcess Running the leader process.
[junit4:junit4]   2> 2830 T3676 oazs.PrepRequestProcessor.pRequest Got user-level KeeperException when processing sessionid:0x13bb960a3b50003 type:create cxid:0x7c zxid:0x37 txntype:-1 reqpath:n/a Error Path:/solr/overseer Error:KeeperErrorCode = NodeExists for /solr/overseer
[junit4:junit4]   2> 2839 T3696 oasc.ShardLeaderElectionContext.waitForReplicasToComeUp Enough replicas found to continue.
[junit4:junit4]   2> 2839 T3696 oasc.ShardLeaderElectionContext.runLeaderProcess I may be the new leader - try and sync
[junit4:junit4]   2> 2840 T3696 oasc.SyncStrategy.sync Sync replicas to http://127.0.0.1:55266/om_z/collection1/
[junit4:junit4]   2> 2840 T3696 oasc.SyncStrategy.syncReplicas Sync Success - now sync replicas to me
[junit4:junit4]   2> 2841 T3696 oasc.SyncStrategy.syncToMe http://127.0.0.1:55266/om_z/collection1/ has no replicas
[junit4:junit4]   2> 2841 T3696 oasc.ShardLeaderElectionContext.runLeaderProcess I am the new leader: http://127.0.0.1:55266/om_z/collection1/
[junit4:junit4]   2> 2841 T3696 oascc.SolrZkClient.makePath makePath: /collections/control_collection/leaders/shard1
[junit4:junit4]   2> 2845 T3676 oazs.PrepRequestProcessor.pRequest Got user-level KeeperException when processing sessionid:0x13bb960a3b50003 type:create cxid:0x86 zxid:0x3b txntype:-1 reqpath:n/a Error Path:/solr/overseer Error:KeeperErrorCode = NodeExists for /solr/overseer
[junit4:junit4]   2> 3284 T3694 oascc.ZkStateReader.updateClusterState Updating cloud state from ZooKeeper... 
[junit4:junit4]   2> 3301 T3693 oascc.ZkStateReader$2.process A cluster state change: WatchedEvent state:SyncConnected type:NodeDataChanged path:/clusterstate.json, has occurred - updating... (live nodes size: 1)
[junit4:junit4]   2> 3306 T3696 oasc.ZkController.register We are http://127.0.0.1:55266/om_z/collection1/ and leader is http://127.0.0.1:55266/om_z/collection1/
[junit4:junit4]   2> 3306 T3696 oasc.ZkController.register No LogReplay needed for core=collection1 baseURL=http://127.0.0.1:55266/om_z
[junit4:junit4]   2> 3306 T3696 oasc.ZkController.checkRecovery I am the leader, no recovery necessary
[junit4:junit4]   2> 3307 T3696 oasc.ZkController.publish publishing core=collection1 state=active
[junit4:junit4]   2> 3307 T3696 oasc.ZkController.publish numShards not found on descriptor - reading it from system property
[junit4:junit4]   2> 3308 T3696 oascc.ZkStateReader.updateClusterState Updating cloud state from ZooKeeper... 
[junit4:junit4]   2> 3309 T3671 oass.SolrDispatchFilter.init user.dir=/usr/home/hudson/hudson-slave/workspace/Lucene-Solr-Tests-4.x-java7/solr/build/solr-core/test/J1
[junit4:junit4]   2> 3311 T3671 oass.SolrDispatchFilter.init SolrDispatchFilter.init() done
[junit4:junit4]   2> 3312 T3671 oascsi.HttpClientUtil.createClient Creating new http client, config:maxConnections=128&maxConnectionsPerHost=32&followRedirects=false
[junit4:junit4]   2> 3326 T3671 oascsi.HttpClientUtil.createClient Creating new http client, config:
[junit4:junit4]   2> 3335 T3671 oaz.ZooKeeper.<init> Initiating client connection, connectString=127.0.0.1:55263/solr sessionTimeout=10000 watcher=org.apache.solr.common.cloud.ConnectionManager@7c9024c4
[junit4:junit4]   2> 3337 T3698 oaz.ClientCnxn$SendThread.logStartConnect Opening socket connection to server localhost/127.0.0.1:55263. Will not attempt to authenticate using SASL (access denied ("javax.security.auth.AuthPermission" "getLoginConfiguration"))
[junit4:junit4]   2> 3337 T3671 oascc.ConnectionManager.waitForConnected Waiting for client to connect to ZooKeeper
[junit4:junit4]   2> 3338 T3698 oaz.ClientCnxn$SendThread.primeConnection Socket connection established to localhost/127.0.0.1:55263, initiating session
[junit4:junit4]   2> 3338 T3673 oazs.NIOServerCnxnFactory.run Accepted socket connection from /140.211.11.196:55269
[junit4:junit4]   2> 3338 T3673 oazs.ZooKeeperServer.processConnectRequest Client attempting to establish new session at /140.211.11.196:55269
[junit4:junit4]   2> 3340 T3675 oazs.ZooKeeperServer.finishSessionInit Established session 0x13bb960a3b50004 with negotiated timeout 10000 for client /140.211.11.196:55269
[junit4:junit4]   2> 3340 T3698 oaz.ClientCnxn$SendThread.onConnected Session establishment complete on server localhost/127.0.0.1:55263, sessionid = 0x13bb960a3b50004, negotiated timeout = 10000
[junit4:junit4]   2> 3340 T3699 oascc.ConnectionManager.process Watcher org.apache.solr.common.cloud.ConnectionManager@7c9024c4 name:ZooKeeperConnection Watcher:127.0.0.1:55263/solr got event WatchedEvent state:SyncConnected type:None path:null path:null type:None
[junit4:junit4]   2> 3340 T3671 oascc.ConnectionManager.waitForConnected Client is connected to ZooKeeper
[junit4:junit4]   2> 3342 T3671 oascc.ZkStateReader.createClusterStateWatchersAndUpdate Updating cluster state from ZooKeeper... 
[junit4:junit4]   2> 3344 T3671 oasc.ChaosMonkey.monkeyLog monkey: init - expire sessions:true cause connection loss:true
[junit4:junit4]   2> 3510 T3671 oejs.Server.doStart jetty-8.1.8.v20121106
[junit4:junit4]   2> 3514 T3671 oejs.AbstractConnector.doStart Started SocketConnector@127.0.0.1:55270
[junit4:junit4]   2> 3515 T3671 oasc.SolrResourceLoader.locateSolrHome JNDI not configured for solr (NoInitialContextEx)
[junit4:junit4]   2> 3516 T3671 oasc.SolrResourceLoader.locateSolrHome using system property solr.solr.home: /usr/home/hudson/hudson-slave/workspace/Lucene-Solr-Tests-4.x-java7/solr/build/solr-core/test/J1/./org.apache.solr.cloud.SyncSliceTest-jetty1-1356024819894
[junit4:junit4]   2> 3517 T3671 oasc.SolrResourceLoader.<init> new SolrResourceLoader for deduced Solr Home: '/usr/home/hudson/hudson-slave/workspace/Lucene-Solr-Tests-4.x-java7/solr/build/solr-core/test/J1/./org.apache.solr.cloud.SyncSliceTest-jetty1-1356024819894/'
[junit4:junit4]   2> 3559 T3671 oass.SolrDispatchFilter.init SolrDispatchFilter.init()
[junit4:junit4]   2> 3560 T3671 oasc.SolrResourceLoader.locateSolrHome JNDI not configured for solr (NoInitialContextEx)
[junit4:junit4]   2> 3561 T3671 oasc.SolrResourceLoader.locateSolrHome using system property solr.solr.home: /usr/home/hudson/hudson-slave/workspace/Lucene-Solr-Tests-4.x-java7/solr/build/solr-core/test/J1/./org.apache.solr.cloud.SyncSliceTest-jetty1-1356024819894
[junit4:junit4]   2> 3562 T3671 oasc.CoreContainer$Initializer.initialize looking for solr.xml: /usr/home/hudson/hudson-slave/workspace/Lucene-Solr-Tests-4.x-java7/solr/build/solr-core/test/J1/./org.apache.solr.cloud.SyncSliceTest-jetty1-1356024819894/solr.xml
[junit4:junit4]   2> 3563 T3671 oasc.CoreContainer.<init> New CoreContainer 1435278968
[junit4:junit4]   2> 3564 T3671 oasc.CoreContainer.load Loading CoreContainer using Solr Home: '/usr/home/hudson/hudson-slave/workspace/Lucene-Solr-Tests-4.x-java7/solr/build/solr-core/test/J1/./org.apache.solr.cloud.SyncSliceTest-jetty1-1356024819894/'
[junit4:junit4]   2> 3565 T3671 oasc.SolrResourceLoader.<init> new SolrResourceLoader for directory: '/usr/home/hudson/hudson-slave/workspace/Lucene-Solr-Tests-4.x-java7/solr/build/solr-core/test/J1/./org.apache.solr.cloud.SyncSliceTest-jetty1-1356024819894/'
[junit4:junit4]   2> 3594 T3671 oashc.HttpShardHandlerFactory.getParameter Setting socketTimeout to: 30000
[junit4:junit4]   2> 3596 T3671 oashc.HttpShardHandlerFactory.getParameter Setting urlScheme to: http://
[junit4:junit4]   2> 3596 T3671 oashc.HttpShardHandlerFactory.getParameter Setting connTimeout to: 15000
[junit4:junit4]   2> 3597 T3671 oashc.HttpShardHandlerFactory.getParameter Setting maxConnectionsPerHost to: 20
[junit4:junit4]   2> 3598 T3671 oashc.HttpShardHandlerFactory.getParameter Setting corePoolSize to: 0
[junit4:junit4]   2> 3599 T3671 oashc.HttpShardHandlerFactory.getParameter Setting maximumPoolSize to: 2147483647
[junit4:junit4]   2> 3600 T3671 oashc.HttpShardHandlerFactory.getParameter Setting maxThreadIdleTime to: 5
[junit4:junit4]   2> 3601 T3671 oashc.HttpShardHandlerFactory.getParameter Setting sizeOfQueue to: -1
[junit4:junit4]   2> 3602 T3671 oashc.HttpShardHandlerFactory.getParameter Setting fairnessPolicy to: false
[junit4:junit4]   2> 3602 T3671 oascsi.HttpClientUtil.createClient Creating new http client, config:maxConnectionsPerHost=20&maxConnections=10000&socketTimeout=30000&connTimeout=15000&retry=false
[junit4:junit4]   2> 3623 T3671 oasc.CoreContainer.load Registering Log Listener
[junit4:junit4]   2> 3643 T3671 oasc.CoreContainer.initZooKeeper Zookeeper client=127.0.0.1:55263/solr
[junit4:junit4]   2> 3644 T3671 oasc.ZkController.checkChrootPath zkHost includes chroot
[junit4:junit4]   2> 3645 T3671 oaz.ZooKeeper.<init> Initiating client connection, connectString=127.0.0.1:55263 sessionTimeout=60000 watcher=org.apache.solr.common.cloud.ConnectionManager@615b964c
[junit4:junit4]   2> 3647 T3709 oaz.ClientCnxn$SendThread.logStartConnect Opening socket connection to server localhost/127.0.0.1:55263. Will not attempt to authenticate using SASL (access denied ("javax.security.auth.AuthPermission" "getLoginConfiguration"))
[junit4:junit4]   2> 3647 T3671 oascc.ConnectionManager.waitForConnected Waiting for client to connect to ZooKeeper
[junit4:junit4]   2> 3648 T3709 oaz.ClientCnxn$SendThread.primeConnection Socket connection established to localhost/127.0.0.1:55263, initiating session
[junit4:junit4]   2> 3648 T3673 oazs.NIOServerCnxnFactory.run Accepted socket connection from /140.211.11.196:55271
[junit4:junit4]   2> 3649 T3673 oazs.ZooKeeperServer.processConnectRequest Client attempting to establish new session at /140.211.11.196:55271
[junit4:junit4]   2> 3679 T3675 oazs.ZooKeeperServer.finishSessionInit Established session 0x13bb960a3b50005 with negotiated timeout 20000 for client /140.211.11.196:55271
[junit4:junit4]   2> 3679 T3709 oaz.ClientCnxn$SendThread.onConnected Session establishment complete on server localhost/127.0.0.1:55263, sessionid = 0x13bb960a3b50005, negotiated timeout = 20000
[junit4:junit4]   2> 3679 T3710 oascc.ConnectionManager.process Watcher org.apache.solr.common.cloud.ConnectionManager@615b964c name:ZooKeeperConnection Watcher:127.0.0.1:55263 got event WatchedEvent state:SyncConnected type:None path:null path:null type:None
[junit4:junit4]   2> 3680 T3671 oascc.ConnectionManager.waitForConnected Client is connected to ZooKeeper
[junit4:junit4]   2> 3681 T3676 oazs.PrepRequestProcessor.pRequest2Txn Processed session termination for sessionid: 0x13bb960a3b50005
[junit4:junit4]   2> 3683 T3710 oaz.ClientCnxn$EventThread.run EventThread shut down
[junit4:junit4]   2> 3683 T3673 oazs.NIOServerCnxn.closeSock Closed socket connection for client /140.211.11.196:55271 which had sessionid 0x13bb960a3b50005
[junit4:junit4]   2> 3683 T3671 oaz.ZooKeeper.close Session: 0x13bb960a3b50005 closed
[junit4:junit4]   2> 3684 T3671 oascsi.HttpClientUtil.createClient Creating new http client, config:maxConnections=500&maxConnectionsPerHost=16&socketTimeout=15000&connTimeout=30000
[junit4:junit4]   2> 3695 T3671 oaz.ZooKeeper.<init> Initiating client connection, connectString=127.0.0.1:55263/solr sessionTimeout=30000 watcher=org.apache.solr.common.cloud.ConnectionManager@2e954b35
[junit4:junit4]   2> 3697 T3711 oaz.ClientCnxn$SendThread.logStartConnect Opening socket connection to server localhost/127.0.0.1:55263. Will not attempt to authenticate using SASL (access denied ("javax.security.auth.AuthPermission" "getLoginConfiguration"))
[junit4:junit4]   2> 3697 T3671 oascc.ConnectionManager.waitForConnected Waiting for client to connect to ZooKeeper
[junit4:junit4]   2> 3697 T3711 oaz.ClientCnxn$SendThread.primeConnection Socket connection established to localhost/127.0.0.1:55263, initiating session
[junit4:junit4]   2> 3698 T3673 oazs.NIOServerCnxnFactory.run Accepted socket connection from /140.211.11.196:55272
[junit4:junit4]   2> 3698 T3673 oazs.ZooKeeperServer.processConnectRequest Client attempting to establish new session at /140.211.11.196:55272
[junit4:junit4]   2> 3715 T3675 oazs.ZooKeeperServer.finishSessionInit Established session 0x13bb960a3b50006 with negotiated timeout 20000 for client /140.211.11.196:55272
[junit4:junit4]   2> 3715 T3711 oaz.ClientCnxn$SendThread.onConnected Session establishment complete on server localhost/127.0.0.1:55263, sessionid = 0x13bb960a3b50006, negotiated timeout = 20000
[junit4:junit4]   2> 3716 T3712 oascc.ConnectionManager.process Watcher org.apache.solr.common.cloud.ConnectionManager@2e954b35 name:ZooKeeperConnection Watcher:127.0.0.1:55263/solr got event WatchedEvent state:SyncConnected type:None path:null path:null type:None
[junit4:junit4]   2> 3716 T3671 oascc.ConnectionManager.waitForConnected Client is connected to ZooKeeper
[junit4:junit4]   2> 3718 T3676 oazs.PrepRequestProcessor.pRequest Got user-level KeeperException when processing sessionid:0x13bb960a3b50006 type:create cxid:0x1 zxid:0x49 txntype:-1 reqpath:n/a Error Path:/solr/overseer Error:KeeperErrorCode = NodeExists for /solr/overseer
[junit4:junit4]   2> 3719 T3676 oazs.PrepRequestProcessor.pRequest Got user-level KeeperException when processing sessionid:0x13bb960a3b50006 type:create cxid:0x2 zxid:0x4a txntype:-1 reqpath:n/a Error Path:/solr/overseer Error:KeeperErrorCode = NodeExists for /solr/overseer
[junit4:junit4]   2> 3734 T3671 oasc.ZkController.createEphemeralLiveNode Register node as live in ZooKeeper:/live_nodes/127.0.0.1:55270_om_z
[junit4:junit4]   2> 3735 T3676 oazs.PrepRequestProcessor.pRequest Got user-level KeeperException when processing sessionid:0x13bb960a3b50006 type:delete cxid:0x4 zxid:0x4b txntype:-1 reqpath:n/a Error Path:/solr/live_nodes/127.0.0.1:55270_om_z Error:KeeperErrorCode = NoNode for /solr/live_nodes/127.0.0.1:55270_om_z
[junit4:junit4]   2> 3736 T3671 oascc.SolrZkClient.makePath makePath: /live_nodes/127.0.0.1:55270_om_z
[junit4:junit4]   2> 3738 T3693 oascc.ZkStateReader$2.process A cluster state change: WatchedEvent state:SyncConnected type:NodeChildrenChanged path:/live_nodes, has occurred - updating... (live nodes size: 1)
[junit4:junit4]   2> 3739 T3699 oascc.ZkStateReader$3.process Updating live nodes... (2)
[junit4:junit4]   2> 3746 T3693 oascc.ZkStateReader$3.process Updating live nodes... (2)
[junit4:junit4]   2> 3747 T3671 oascc.ZkStateReader.createClusterStateWatchersAndUpdate Updating cluster state from ZooKeeper... 
[junit4:junit4]   2> 3755 T3713 oasc.CoreContainer.create Creating SolrCore 'collection1' using instanceDir: /usr/home/hudson/hudson-slave/workspace/Lucene-Solr-Tests-4.x-java7/solr/build/solr-core/test/J1/./org.apache.solr.cloud.SyncSliceTest-jetty1-1356024819894/collection1
[junit4:junit4]   2> 3755 T3713 oasc.ZkController.createCollectionZkNode Check for collection zkNode:collection1
[junit4:junit4]   2> 3756 T3713 oasc.ZkController.createCollectionZkNode Collection zkNode exists
[junit4:junit4]   2> 3756 T3713 oasc.ZkController.readConfigName Load collection config from:/collections/collection1
[junit4:junit4]   2> 3758 T3713 oasc.SolrResourceLoader.<init> new SolrResourceLoader for directory: '/usr/home/hudson/hudson-slave/workspace/Lucene-Solr-Tests-4.x-java7/solr/build/solr-core/test/J1/./org.apache.solr.cloud.SyncSliceTest-jetty1-1356024819894/collection1/'
[junit4:junit4]   2> 3759 T3713 oasc.SolrResourceLoader.replaceClassLoader Adding 'file:/usr/home/hudson/hudson-slave/workspace/Lucene-Solr-Tests-4.x-java7/solr/build/solr-core/test/J1/org.apache.solr.cloud.SyncSliceTest-jetty1-1356024819894/collection1/lib/README' to classloader
[junit4:junit4]   2> 3760 T3713 oasc.SolrResourceLoader.replaceClassLoader Adding 'file:/usr/home/hudson/hudson-slave/workspace/Lucene-Solr-Tests-4.x-java7/solr/build/solr-core/test/J1/org.apache.solr.cloud.SyncSliceTest-jetty1-1356024819894/collection1/lib/classes/' to classloader
[junit4:junit4]   2> 3805 T3694 oascc.ZkStateReader.updateClusterState Updating cloud state from ZooKeeper... 
[junit4:junit4]   2> 3806 T3694 oasc.Overseer$ClusterStateUpdater.updateState Update state numShards=1 message={
[junit4:junit4]   2> 	  "operation":"state",
[junit4:junit4]   2> 	  "numShards":"1",
[junit4:junit4]   2> 	  "shard":"shard1",
[junit4:junit4]   2> 	  "roles":null,
[junit4:junit4]   2> 	  "state":"active",
[junit4:junit4]   2> 	  "core":"collection1",
[junit4:junit4]   2> 	  "collection":"control_collection",
[junit4:junit4]   2> 	  "node_name":"127.0.0.1:55266_om_z",
[junit4:junit4]   2> 	  "base_url":"http://127.0.0.1:55266/om_z"}
[junit4:junit4]   2> 3812 T3713 oasc.SolrConfig.<init> Using Lucene MatchVersion: LUCENE_41
[junit4:junit4]   2> 3824 T3699 oascc.ZkStateReader$2.process A cluster state change: WatchedEvent state:SyncConnected type:NodeDataChanged path:/clusterstate.json, has occurred - updating... (live nodes size: 2)
[junit4:junit4]   2> 3824 T3693 oascc.ZkStateReader$2.process A cluster state change: WatchedEvent state:SyncConnected type:NodeDataChanged path:/clusterstate.json, has occurred - updating... (live nodes size: 2)
[junit4:junit4]   2> 3824 T3712 oascc.ZkStateReader$2.process A cluster state change: WatchedEvent state:SyncConnected type:NodeDataChanged path:/clusterstate.json, has occurred - updating... (live nodes size: 2)
[junit4:junit4]   2> 3882 T3713 oasc.SolrConfig.<init> Loaded SolrConfig: solrconfig.xml
[junit4:junit4]   2> 3983 T3713 oass.IndexSchema.readSchema Reading Solr Schema
[junit4:junit4]   2> 3991 T3713 oass.IndexSchema.readSchema Schema name=test
[junit4:junit4]   2> 4627 T3713 oass.OpenExchangeRatesOrgProvider.init Initialized with rates=open-exchange-rates.json, refreshInterval=1440.
[junit4:junit4]   2> 4639 T3713 oass.IndexSchema.readSchema default search field in schema is text
[junit4:junit4]   2> 4643 T3713 oass.IndexSchema.readSchema unique key field: id
[junit4:junit4]   2> 4655 T3713 oass.FileExchangeRateProvider.reload Reloading exchange rates from file currency.xml
[junit4:junit4]   2> 4660 T3713 oass.FileExchangeRateProvider.reload Reloading exchange rates from file currency.xml
[junit4:junit4]   2> 4664 T3713 oass.OpenExchangeRatesOrgProvider.reload Reloading exchange rates from open-exchange-rates.json
[junit4:junit4]   2> 4665 T3713 oass.OpenExchangeRatesOrgProvider.reload Reloading exchange rates from open-exchange-rates.json
[junit4:junit4]   2> 4666 T3713 oasc.SolrCore.<init> [collection1] Opening new SolrCore at /usr/home/hudson/hudson-slave/workspace/Lucene-Solr-Tests-4.x-java7/solr/build/solr-core/test/J1/./org.apache.solr.cloud.SyncSliceTest-jetty1-1356024819894/collection1/, dataDir=./org.apache.solr.cloud.SyncSliceTest-1356024816556/jetty1/
[junit4:junit4]   2> 4667 T3713 oasc.JmxMonitoredMap.<init> JMX monitoring is enabled. Adding Solr mbeans to JMX Server: com.sun.jmx.mbeanserver.JmxMBeanServer@45ad71f0
[junit4:junit4]   2> 4667 T3713 oasc.SolrCore.initDirectoryFactory solr.NRTCachingDirectoryFactory
[junit4:junit4]   2> 4668 T3713 oasc.CachingDirectoryFactory.get return new directory for /usr/home/hudson/hudson-slave/workspace/Lucene-Solr-Tests-4.x-java7/solr/build/solr-core/test/J1/./org.apache.solr.cloud.SyncSliceTest-1356024816556/jetty1 forceNew:false
[junit4:junit4]   2> 4669 T3713 oasc.CachingDirectoryFactory.close Releasing directory:/usr/home/hudson/hudson-slave/workspace/Lucene-Solr-Tests-4.x-java7/solr/build/solr-core/test/J1/./org.apache.solr.cloud.SyncSliceTest-1356024816556/jetty1
[junit4:junit4]   2> 4669 T3713 oasc.SolrCore.getNewIndexDir New index directory detected: old=null new=./org.apache.solr.cloud.SyncSliceTest-1356024816556/jetty1/index/
[junit4:junit4]   2> 4670 T3713 oasc.SolrCore.initIndex WARNING [collection1] Solr index directory './org.apache.solr.cloud.SyncSliceTest-1356024816556/jetty1/index' doesn't exist. Creating new index...
[junit4:junit4]   2> 4671 T3713 oasc.CachingDirectoryFactory.get return new directory for /usr/home/hudson/hudson-slave/workspace/Lucene-Solr-Tests-4.x-java7/solr/build/solr-core/test/J1/./org.apache.solr.cloud.SyncSliceTest-1356024816556/jetty1/index forceNew:false
[junit4:junit4]   2> 4702 T3713 oasc.SolrDeletionPolicy.onCommit SolrDeletionPolicy.onCommit: commits:num=1
[junit4:junit4]   2> 		commit{dir=RateLimitedDirectoryWrapper(NRTCachingDirectory(org.apache.lucene.store.NIOFSDirectory@/usr/home/hudson/hudson-slave/workspace/Lucene-Solr-Tests-4.x-java7/solr/build/solr-core/test/J1/org.apache.solr.cloud.SyncSliceTest-1356024816556/jetty1/index lockFactory=org.apache.lucene.store.NativeFSLockFactory@53e8d0f5; maxCacheMB=48.0 maxMergeSizeMB=4.0)),segFN=segments_1,generation=1,filenames=[segments_1]
[junit4:junit4]   2> 4702 T3713 oasc.SolrDeletionPolicy.updateCommits newest commit = 1[segments_1]
[junit4:junit4]   2> 4703 T3713 oasc.CachingDirectoryFactory.close Releasing directory:/usr/home/hudson/hudson-slave/workspace/Lucene-Solr-Tests-4.x-java7/solr/build/solr-core/test/J1/./org.apache.solr.cloud.SyncSliceTest-1356024816556/jetty1/index
[junit4:junit4]   2> 4703 T3713 oasc.SolrCore.initWriters created xml: solr.XMLResponseWriter
[junit4:junit4]   2> 4706 T3713 oasup.UpdateRequestProcessorChain.init inserting DistributedUpdateProcessorFactory into updateRequestProcessorChain "dedupe"
[junit4:junit4]   2> 4706 T3713 oasup.UpdateRequestProcessorChain.init inserting DistributedUpdateProcessorFactory into updateRequestProcessorChain "dedupe-allfields"
[junit4:junit4]   2> 4706 T3713 oasup.UpdateRequestProcessorChain.init inserting DistributedUpdateProcessorFactory into updateRequestProcessorChain "stored_sig"
[junit4:junit4]   2> 4707 T3713 oasup.UpdateRequestProcessorChain.init inserting DistributedUpdateProcessorFactory into updateRequestProcessorChain "uniq-fields"
[junit4:junit4]   2> 4708 T3713 oasup.UpdateRequestProcessorChain.init inserting DistributedUpdateProcessorFactory into updateRequestProcessorChain "distrib-dup-test-chain-implicit"
[junit4:junit4]   2> 4708 T3713 oasc.RequestHandlers.initHandlersFromConfig adding lazy requestHandler: solr.ReplicationHandler
[junit4:junit4]   2> 4708 T3713 oasc.RequestHandlers.initHandlersFromConfig created /replication: solr.ReplicationHandler
[junit4:junit4]   2> 4709 T3713 oasc.RequestHandlers.initHandlersFromConfig created standard: solr.StandardRequestHandler
[junit4:junit4]   2> 4710 T3713 oasc.RequestHandlers.initHandlersFromConfig created /get: solr.RealTimeGetHandler
[junit4:junit4]   2> 4711 T3713 oasc.RequestHandlers.initHandlersFromConfig created dismax: solr.SearchHandler
[junit4:junit4]   2> 4712 T3713 oasc.RequestHandlers.initHandlersFromConfig created mock: org.apache.solr.core.MockQuerySenderListenerReqHandler
[junit4:junit4]   2> 4713 T3713 oasc.RequestHandlers.initHandlersFromConfig created /admin/: org.apache.solr.handler.admin.AdminHandlers
[junit4:junit4]   2> 4714 T3713 oasc.RequestHandlers.initHandlersFromConfig created defaults: solr.StandardRequestHandler
[junit4:junit4]   2> 4714 T3713 oasc.RequestHandlers.initHandlersFromConfig adding lazy requestHandler: solr.StandardRequestHandler
[junit4:junit4]   2> 4715 T3713 oasc.RequestHandlers.initHandlersFromConfig created lazy: solr.StandardRequestHandler
[junit4:junit4]   2> 4716 T3713 oasc.RequestHandlers.initHandlersFromConfig created /update: solr.UpdateRequestHandler
[junit4:junit4]   2> 4717 T3713 oasc.RequestHandlers.initHandlersFromConfig created /terms: org.apache.solr.handler.component.SearchHandler
[junit4:junit4]   2> 4717 T3713 oasc.RequestHandlers.initHandlersFromConfig created spellCheckCompRH: org.apache.solr.handler.component.SearchHandler
[junit4:junit4]   2> 4718 T3713 oasc.RequestHandlers.initHandlersFromConfig created spellCheckCompRH_Direct: org.apache.solr.handler.component.SearchHandler
[junit4:junit4]   2> 4719 T3713 oasc.RequestHandlers.initHandlersFromConfig created spellCheckWithWordbreak: org.apache.solr.handler.component.SearchHandler
[junit4:junit4]   2> 4720 T3713 oasc.RequestHandlers.initHandlersFromConfig created spellCheckWithWordbreak_Direct: org.apache.solr.handler.component.SearchHandler
[junit4:junit4]   2> 4721 T3713 oasc.RequestHandlers.initHandlersFromConfig created spellCheckCompRH1: org.apache.solr.handler.component.SearchHandler
[junit4:junit4]   2> 4722 T3713 oasc.RequestHandlers.initHandlersFromConfig created mltrh: org.apache.solr.handler.component.SearchHandler
[junit4:junit4]   2> 4723 T3713 oasc.RequestHandlers.initHandlersFromConfig created tvrh: org.apache.solr.handler.component.SearchHandler
[junit4:junit4]   2> 4724 T3713 oasc.RequestHandlers.initHandlersFromConfig created /mlt: solr.MoreLikeThisHandler
[junit4:junit4]   2> 4725 T3713 oasc.RequestHandlers.initHandlersFromConfig created /debug/dump: solr.DumpRequestHandler
[junit4:junit4]   2> 4737 T3713 oashl.XMLLoader.init xsltCacheLifetimeSeconds=60
[junit4:junit4]   2> 4741 T3713 oasc.SolrCore.initDeprecatedSupport WARNING solrconfig.xml uses deprecated <admin/gettableFiles>, Please update your config to use the ShowFileRequestHandler.
[junit4:junit4]   2> 4743 T3713 oasc.SolrCore.initDeprecatedSupport WARNING adding ShowFileRequestHandler with hidden files: [SCHEMA.XML, OLD_SYNONYMS.TXT, STOPWORDS.TXT, PROTWORDS.TXT, OPEN-EXCHANGE-RATES.JSON, SYNONYMS.TXT, CURRENCY.XML, MAPPING-ISOLATIN1ACCENT.TXT]
[junit4:junit4]   2> 4745 T3713 oasc.CachingDirectoryFactory.close Releasing directory:/usr/home/hudson/hudson-slave/workspace/Lucene-Solr-Tests-4.x-java7/solr/build/solr-core/test/J1/./org.apache.solr.cloud.SyncSliceTest-1356024816556/jetty1
[junit4:junit4]   2> 4747 T3713 oass.SolrIndexSearcher.<init> Opening Searcher@3edb4684 main
[junit4:junit4]   2> 4748 T3713 oasu.CommitTracker.<init> Hard AutoCommit: disabled
[junit4:junit4]   2> 4749 T3713 oasu.CommitTracker.<init> Soft AutoCommit: disabled
[junit4:junit4]   2> 4749 T3713 oashc.SpellCheckComponent.inform Initializing spell checkers
[junit4:junit4]   2> 4760 T3713 oass.DirectSolrSpellChecker.init init: {name=direct,classname=DirectSolrSpellChecker,field=lowerfilt,minQueryLength=3}
[junit4:junit4]   2> 4809 T3714 oasc.SolrCore.registerSearcher [collection1] Registered new searcher Searcher@3edb4684 main{StandardDirectoryReader(segments_1:1)}
[junit4:junit4]   2> 4814 T3713 oasc.ZkController.publish publishing core=collection1 state=down
[junit4:junit4]   2> 4814 T3713 oasc.ZkController.publish numShards not found on descriptor - reading it from system property
[junit4:junit4]   2> 4829 T3694 oascc.ZkStateReader.updateClusterState Updating cloud state from ZooKeeper... 
[junit4:junit4]   2> 4830 T3694 oasc.Overseer$ClusterStateUpdater.updateState Update state numShards=1 message={
[junit4:junit4]   2> 	  "operation":"state",
[junit4:junit4]   2> 	  "numShards":"1",
[junit4:junit4]   2> 	  "shard":null,
[junit4:junit4]   2> 	  "roles":null,
[junit4:junit4]   2> 	  "state":"down",
[junit4:junit4]   2> 	  "core":"collection1",
[junit4:junit4]   2> 	  "collection":"collection1",
[junit4:junit4]   2> 	  "node_name":"127.0.0.1:55270_om_z",
[junit4:junit4]   2> 	  "base_url":"http://127.0.0.1:55270/om_z"}
[junit4:junit4]   2> 4830 T3694 oasc.Overseer$ClusterStateUpdater.createCollection Create collection collection1 with numShards 1
[junit4:junit4]   2> 4830 T3694 oasc.Overseer$ClusterStateUpdater.updateState Assigning new node to shard shard=shard1
[junit4:junit4]   2> 4843 T3693 oascc.ZkStateReader$2.process A cluster state change: WatchedEvent state:SyncConnected type:NodeDataChanged path:/clusterstate.json, has occurred - updating... (live nodes size: 2)
[junit4:junit4]   2> 4843 T3712 oascc.ZkStateReader$2.process A cluster state change: WatchedEvent state:SyncConnected type:NodeDataChanged path:/clusterstate.json, has occurred - updating... (live nodes size: 2)
[junit4:junit4]   2> 4843 T3699 oascc.ZkStateReader$2.process A cluster state change: WatchedEvent state:SyncConnected type:NodeDataChanged path:/clusterstate.json, has occurred - updating... (live nodes size: 2)
[junit4:junit4]   2> 5817 T3713 oasc.CoreContainer.registerCore registering core: collection1
[junit4:junit4]   2> 5817 T3713 oasc.ZkController.register Register replica - core:collection1 address:http://127.0.0.1:55270/om_z collection:collection1 shard:shard1
[junit4:junit4]   2> 5818 T3713 oascc.SolrZkClient.makePath makePath: /collections/collection1/leader_elect/shard1/election
[junit4:junit4]   2> 5835 T3676 oazs.PrepRequestProcessor.pRequest Got user-level KeeperException when processing sessionid:0x13bb960a3b50006 type:delete cxid:0x45 zxid:0x5b txntype:-1 reqpath:n/a Error Path:/solr/collections/collection1/leaders Error:KeeperErrorCode = NoNode for /solr/collections/collection1/leaders
[junit4:junit4]   2> 5836 T3713 oasc.ShardLeaderElectionContext.runLeaderProcess Running the leader process.
[junit4:junit4]   2> 5837 T3676 oazs.PrepRequestProcessor.pRequest Got user-level KeeperException when processing sessionid:0x13bb960a3b50006 type:create cxid:0x46 zxid:0x5c txntype:-1 reqpath:n/a Error Path:/solr/overseer Error:KeeperErrorCode = NodeExists for /solr/overseer
[junit4:junit4]   2> 5839 T3713 oasc.ShardLeaderElectionContext.waitForReplicasToComeUp Enough replicas found to continue.
[junit4:junit4]   2> 5839 T3713 oasc.ShardLeaderElectionContext.runLeaderProcess I may be the new leader - try and sync
[junit4:junit4]   2> 5839 T3713 oasc.SyncStrategy.sync Sync replicas to http://127.0.0.1:55270/om_z/collection1/
[junit4:junit4]   2> 5840 T3713 oasc.SyncStrategy.syncReplicas Sync Success - now sync replicas to me
[junit4:junit4]   2> 5840 T3713 oasc.SyncStrategy.syncToMe http://127.0.0.1:55270/om_z/collection1/ has no replicas
[junit4:junit4]   2> 5841 T3713 oasc.ShardLeaderElectionContext.runLeaderProcess I am the new leader: http://127.0.0.1:55270/om_z/collection1/
[junit4:junit4]   2> 5841 T3713 oascc.SolrZkClient.makePath makePath: /collections/collection1/leaders/shard1
[junit4:junit4]   2> 5845 T3676 oazs.PrepRequestProcessor.pRequest Got user-level KeeperException when processing sessionid:0x13bb960a3b50006 type:create cxid:0x50 zxid:0x60 txntype:-1 reqpath:n/a Error Path:/solr/overseer Error:KeeperErrorCode = NodeExists for /solr/overseer
[junit4:junit4]   2> 5848 T3694 oascc.ZkStateReader.updateClusterState Updating cloud state from ZooKeeper... 
[junit4:junit4]   2> 5854 T3699 oascc.ZkStateReader$2.process A cluster state change: WatchedEvent state:SyncConnected type:NodeDataChanged path:/clusterstate.json, has occurred - updating... (live nodes size: 2)
[junit4:junit4]   2> 5854 T3712 oascc.ZkStateReader$2.process A cluster state change: WatchedEvent state:SyncConnected type:NodeDataChanged path:/clusterstate.json, has occurred - updating... (live nodes size: 2)
[junit4:junit4]   2> 5854 T3693 oascc.ZkStateReader$2.process A cluster state change: WatchedEvent state:SyncConnected type:NodeDataChanged path:/clusterstate.json, has occurred - updating... (live nodes size: 2)
[junit4:junit4]   2> 5898 T3713 oasc.ZkController.register We are http://127.0.0.1:55270/om_z/collection1/ and leader is http://127.0.0.1:55270/om_z/collection1/
[junit4:junit4]   2> 5898 T3713 oasc.ZkController.register No LogReplay needed for core=collection1 baseURL=http://127.0.0.1:55270/om_z
[junit4:junit4]   2> 5898 T3713 oasc.ZkController.checkRecovery I am the leader, no recovery necessary
[junit4:junit4]   2> 5899 T3713 oasc.ZkController.publish publishing core=collection1 state=active
[junit4:junit4]   2> 5899 T3713 oasc.ZkController.publish numShards not found on descriptor - reading it from system property
[junit4:junit4]   2> 5901 T3713 oascc.ZkStateReader.updateClusterState Updating cloud state from ZooKeeper... 
[junit4:junit4]   2> 5902 T3671 oass.SolrDispatchFilter.init user.dir=/usr/home/hudson/hudson-slave/workspace/Lucene-Solr-Tests-4.x-java7/solr/build/solr-core/test/J1
[junit4:junit4]   2> 5903 T3671 oass.SolrDispatchFilter.init SolrDispatchFilter.init() done
[junit4:junit4]   2> 5904 T3671 oascsi.HttpClientUtil.createClient Creating new http client, config:maxConnections=128&maxConnectionsPerHost=32&followRedirects=false
[junit4:junit4]   2> 6081 T3671 oejs.Server.doStart jetty-8.1.8.v20121106
[junit4:junit4]   2> 6085 T3671 oejs.AbstractConnector.doStart Started SocketConnector@127.0.0.1:55273
[junit4:junit4]   2> 6086 T3671 oasc.SolrResourceLoader.locateSolrHome JNDI not configured for solr (NoInitialContextEx)
[junit4:junit4]   2> 6087 T3671 oasc.SolrResourceLoader.locateSolrHome using system property solr.solr.home: /usr/home/hudson/hudson-slave/workspace/Lucene-Solr-Tests-4.x-java7/solr/build/solr-core/test/J1/./org.apache.solr.cloud.SyncSliceTest-jetty2-1356024822468
[junit4:junit4]   2> 6088 T3671 oasc.SolrResourceLoader.<init> new SolrResourceLoader for deduced Solr Home: '/usr/home/hudson/hudson-slave/workspace/Lucene-Solr-Tests-4.x-java7/solr/build/solr-core/test/J1/./org.apache.solr.cloud.SyncSliceTest-jetty2-1356024822468/'
[junit4:junit4]   2> 6131 T3671 oass.SolrDispatchFilter.init SolrDispatchFilter.init()
[junit4:junit4]   2> 6133 T3671 oasc.SolrResourceLoader.locateSolrHome JNDI not configured for solr (NoInitialContextEx)
[junit4:junit4]   2> 6134 T3671 oasc.SolrResourceLoader.locateSolrHome using system property solr.solr.home: /usr/home/hudson/hudson-slave/workspace/Lucene-Solr-Tests-4.x-java7/solr/build/solr-core/test/J1/./org.apache.solr.cloud.SyncSliceTest-jetty2-1356024822468
[junit4:junit4]   2> 6135 T3671 oasc.CoreContainer$Initializer.initialize looking for solr.xml: /usr/home/hudson/hudson-slave/workspace/Lucene-Solr-Tests-4.x-java7/solr/build/solr-core/test/J1/./org.apache.solr.cloud.SyncSliceTest-jetty2-1356024822468/solr.xml
[junit4:junit4]   2> 6135 T3671 oasc.CoreContainer.<init> New CoreContainer 1230499916
[junit4:junit4]   2> 6136 T3671 oasc.CoreContainer.load Loading CoreContainer using Solr Home: '/usr/home/hudson/hudson-slave/workspace/Lucene-Solr-Tests-4.x-java7/solr/build/solr-core/test/J1/./org.apache.solr.cloud.SyncSliceTest-jetty2-1356024822468/'
[junit4:junit4]   2> 6137 T3671 oasc.SolrResourceLoader.<init> new SolrResourceLoader for directory: '/usr/home/hudson/hudson-slave/workspace/Lucene-Solr-Tests-4.x-java7/solr/build/solr-core/test/J1/./org.apache.solr.cloud.SyncSliceTest-jetty2-1356024822468/'
[junit4:junit4]   2> 6167 T3671 oashc.HttpShardHandlerFactory.getParameter Setting socketTimeout to: 30000
[junit4:junit4]   2> 6169 T3671 oashc.HttpShardHandlerFactory.getParameter Setting urlScheme to: http://
[junit4:junit4]   2> 6169 T3671 oashc.HttpShardHandlerFactory.getParameter Setting connTimeout to: 15000
[junit4:junit4]   2> 6170 T3671 oashc.HttpShardHandlerFactory.getParameter Setting maxConnectionsPerHost to: 20
[junit4:junit4]   2> 6171 T3671 oashc.HttpShardHandlerFactory.getParameter Setting corePoolSize to: 0
[junit4:junit4]   2> 6172 T3671 oashc.HttpShardHandlerFactory.getParameter Setting maximumPoolSize to: 2147483647
[junit4:junit4]   2> 6173 T3671 oashc.HttpShardHandlerFactory.getParameter Setting maxThreadIdleTime to: 5
[junit4:junit4]   2> 6174 T3671 oashc.HttpShardHandlerFactory.getParameter Setting sizeOfQueue to: -1
[junit4:junit4]   2> 6175 T3671 oashc.HttpShardHandlerFactory.getParameter Setting fairnessPolicy to: false
[junit4:junit4]   2> 6175 T3671 oascsi.HttpClientUtil.createClient Creating new http client, config:maxConnectionsPerHost=20&maxConnections=10000&socketTimeout=30000&connTimeout=15000&retry=false
[junit4:junit4]   2> 6196 T3671 oasc.CoreContainer.load Registering Log Listener
[junit4:junit4]   2> 6216 T3671 oasc.CoreContainer.initZooKeeper Zookeeper client=127.0.0.1:55263/solr
[junit4:junit4]   2> 6217 T3671 oasc.ZkController.checkChrootPath zkHost includes chroot
[junit4:junit4]   2> 6218 T3671 oaz.ZooKeeper.<init> Initiating client connection, connectString=127.0.0.1:55263 sessionTimeout=60000 watcher=org.apache.solr.common.cloud.ConnectionManager@3e3acb75
[junit4:junit4]   2> 6220 T3724 oaz.ClientCnxn$SendThread.logStartConnect Opening socket connection to server localhost/127.0.0.1:55263. Will not attempt to authenticate using SASL (access denied ("javax.security.auth.AuthPermission" "getLoginConfiguration"))
[junit4:junit4]   2> 6220 T3671 oascc.ConnectionManager.waitForConnected Waiting for client to connect to ZooKeeper
[junit4:junit4]   2> 6221 T3724 oaz.ClientCnxn$SendThread.primeConnection Socket connection established to localhost/127.0.0.1:55263, initiating session
[junit4:junit4]   2> 6221 T3673 oazs.NIOServerCnxnFactory.run Accepted socket connection from /140.211.11.196:55274
[junit4:junit4]   2> 6222 T3673 oazs.ZooKeeperServer.processConnectRequest Client attempting to establish new session at /140.211.11.196:55274
[junit4:junit4]   2> 6224 T3675 oazs.ZooKeeperServer.finishSessionInit Established session 0x13bb960a3b50007 with negotiated timeout 20000 for client /140.211.11.196:55274
[junit4:junit4]   2> 6224 T3724 oaz.ClientCnxn$SendThread.onConnected Session establishment complete on server localhost/127.0.0.1:55263, sessionid = 0x13bb960a3b50007, negotiated timeout = 20000
[junit4:junit4]   2> 6224 T3725 oascc.ConnectionManager.process Watcher org.apache.solr.common.cloud.ConnectionManager@3e3acb75 name:ZooKeeperConnection Watcher:127.0.0.1:55263 got event WatchedEvent state:SyncConnected type:None path:null path:null type:None
[junit4:junit4]   2> 6225 T3671 oascc.ConnectionManager.waitForConnected Client is connected to ZooKeeper
[junit4:junit4]   2> 6226 T3676 oazs.PrepRequestProcessor.pRequest2Txn Processed session termination for sessionid: 0x13bb960a3b50007
[junit4:junit4]   2> 6238 T3725 oaz.ClientCnxn$EventThread.run EventThread shut down
[junit4:junit4]   2> 6238 T3673 oazs.NIOServerCnxn.closeSock Closed socket connection for client /140.211.11.196:55274 which had sessionid 0x13bb960a3b50007
[junit4:junit4]   2> 6238 T3671 oaz.ZooKeeper.close Session: 0x13bb960a3b50007 closed
[junit4:junit4]   2> 6239 T3671 oascsi.HttpClientUtil.createClient Creating new http client, config:maxConnections=500&maxConnectionsPerHost=16&socketTimeout=15000&connTimeout=30000
[junit4:junit4]   2> 6249 T3671 oaz.ZooKeeper.<init> Initiating client connection, connectString=127.0.0.1:55263/solr sessionTimeout=30000 watcher=org.apache.solr.common.cloud.ConnectionManager@16fb6cc4
[junit4:junit4]   2> 6251 T3726 oaz.ClientCnxn$SendThread.logStartConnect Opening socket connection to server localhost/127.0.0.1:55263. Will not attempt to authenticate using SASL (access denied ("javax.security.auth.AuthPermission" "getLoginConfiguration"))
[junit4:junit4]   2> 6251 T3671 oascc.ConnectionManager.waitForConnected Waiting for client to connect to ZooKeeper
[junit4:junit4]   2> 6252 T3673 oazs.NIOServerCnxnFactory.run Accepted socket connection from /140.211.11.196:55275
[junit4:junit4]   2> 6251 T3726 oaz.ClientCnxn$SendThread.primeConnection Socket connection established to localhost/127.0.0.1:55263, initiating session
[junit4:junit4]   2> 6253 T3673 oazs.ZooKeeperServer.processConnectRequest Client attempting to establish new session at /140.211.11.196:55275
[junit4:junit4]   2> 6254 T3675 oazs.ZooKeeperServer.finishSessionInit Established session 0x13bb960a3b50008 with negotiated timeout 20000 for client /140.211.11.196:55275
[junit4:junit4]   2> 6254 T3726 oaz.ClientCnxn$SendThread.onConnected Session establishment complete on server localhost/127.0.0.1:55263, sessionid = 0x13bb960a3b50008, negotiated timeout = 20000
[junit4:junit4]   2> 6254 T3727 oascc.ConnectionManager.process Watcher org.apache.solr.common.cloud.ConnectionManager@16fb6cc4 name:ZooKeeperConnection Watcher:127.0.0.1:55263/solr got event WatchedEvent state:SyncConnected type:None path:null path:null type:None
[junit4:junit4]   2> 6255 T3671 oascc.ConnectionManager.waitForConnected Client is connected to ZooKeeper
[junit4:junit4]   2> 6256 T3676 oazs.PrepRequestProcessor.pRequest Got user-level KeeperException when processing sessionid:0x13bb960a3b50008 type:create cxid:0x1 zxid:0x6d txntype:-1 reqpath:n/a Error Path:/solr/overseer Error:KeeperErrorCode = NodeExists for /solr/overseer
[junit4:junit4]   2> 6258 T3676 oazs.PrepRequestProcessor.pRequest Got user-level KeeperException when processing sessionid:0x13bb960a3b50008 type:create cxid:0x2 zxid:0x6e txntype:-1 reqpath:n/a Error Path:/solr/overseer Error:KeeperErrorCode = NodeExists for /solr/overseer
[junit4:junit4]   2> 6259 T3671 oasc.ZkController.createEphemeralLiveNode Register node as live in ZooKeeper:/live_nodes/127.0.0.1:55273_om_z
[junit4:junit4]   2> 6260 T3676 oazs.PrepRequestProcessor.pRequest Got user-level KeeperException when processing sessionid:0x13bb960a3b50008 type:delete cxid:0x4 zxid:0x6f txntype:-1 reqpath:n/a Error Path:/solr/live_nodes/127.0.0.1:55273_om_z Error:KeeperErrorCode = NoNode for /solr/live_nodes/127.0.0.1:55273_om_z
[junit4:junit4]   2> 6268 T3671 oascc.SolrZkClient.makePath makePath: /live_nodes/127.0.0.1:55273_om_z
[junit4:junit4]   2> 6271 T3693 oascc.ZkStateReader$2.process A cluster state change: WatchedEvent state:SyncConnected type:NodeChildrenChanged path:/live_nodes, has occurred - updating... (live nodes size: 2)
[junit4:junit4]   2> 6271 T3712 oascc.ZkStateReader$2.process A cluster state change: WatchedEvent state:SyncConnected type:NodeChildrenChanged path:/live_nodes, has occurred - updating... (live nodes size: 2)
[junit4:junit4]   2> 6271 T3699 oascc.ZkStateReader$2.process A cluster state change: WatchedEvent state:SyncConnected type:NodeChildrenChanged path:/live_nodes, has occurred - updating... (live nodes size: 2)
[junit4:junit4]   2> 6272 T3693 oascc.ZkStateReader$3.process Updating live nodes... (3)
[junit4:junit4]   2> 6273 T3712 oascc.ZkStateReader$3.process Updating live nodes... (3)
[junit4:junit4]   2> 6273 T3699 oascc.ZkStateReader$3.process Updating live nodes... (3)
[junit4:junit4]   2> 6274 T3671 oascc.ZkStateReader.createClusterStateWatchersAndUpdate Updating cluster state from ZooKeeper... 
[junit4:junit4]   2> 6282 T3728 oasc.CoreContainer.create Creating SolrCore 'collection1' using instanceDir: /usr/home/hudson/hudson-slave/workspace/Lucene-Solr-Tests-4.x-java7/solr/build/solr-core/test/J1/./org.apache.solr.cloud.SyncSliceTest-jetty2-1356024822468/collection1
[junit4:junit4]   2> 6283 T3728 oasc.ZkController.createCollectionZkNode Check for collection zkNode:collection1
[junit4:junit4]   2> 6283 T3728 oasc.ZkController.createCollectionZkNode Collection zkNode exists
[junit4:junit4]   2> 6284 T3728 oasc.ZkController.readConfigName Load collection config from:/collections/collection1
[junit4:junit4]   2> 6285 T3728 oasc.SolrResourceLoader.<init> new SolrResourceLoader for directory: '/usr/home/hudson/hudson-slave/workspace/Lucene-Solr-Tests-4.x-java7/solr/build/solr-core/test/J1/./org.apache.solr.cloud.SyncSliceTest-jetty2-1356024822468/collection1/'
[junit4:junit4]   2> 6286 T3728 oasc.SolrResourceLoader.replaceClassLoader Adding 'file:/usr/home/hudson/hudson-slave/workspace/Lucene-Solr-Tests-4.x-java7/solr/build/solr-core/test/J1/org.apache.solr.cloud.SyncSliceTest-jetty2-1356024822468/collection1/lib/README' to classloader
[junit4:junit4]   2> 6287 T3728 oasc.SolrResourceLoader.replaceClassLoader Adding 'file:/usr/home/hudson/hudson-slave/workspace/Lucene-Solr-Tests-4.x-java7/solr/build/solr-core/test/J1/org.apache.solr.cloud.SyncSliceTest-jetty2-1356024822468/collection1/lib/classes/' to classloader
[junit4:junit4]   2> 6339 T3728 oasc.SolrConfig.<init> Using Lucene MatchVersion: LUCENE_41
[junit4:junit4]   2> 6360 T3694 oascc.ZkStateReader.updateClusterState Updating cloud state from ZooKeeper... 
[junit4:junit4]   2> 6361 T3694 oasc.Overseer$ClusterStateUpdater.updateState Update state numShards=1 message={
[junit4:junit4]   2> 	  "operation":"state",
[junit4:junit4]   2> 	  "numShards":"1",
[junit4:junit4]   2> 	  "shard":"shard1",
[junit4:junit4]   2> 	  "roles":null,
[junit4:junit4]   2> 	  "state":"active",
[junit4:junit4]   2> 	  "core":"collection1",
[junit4:junit4]   2> 	  "collection":"collection1",
[junit4:junit4]   2> 	  "node_name":"127.0.0.1:55270_om_z",
[junit4:junit4]   2> 	  "base_url":"http://127.0.0.1:55270/om_z"}
[junit4:junit4]   2> 6374 T3699 oascc.ZkStateReader$2.process A cluster state change: WatchedEvent state:SyncConnected type:NodeDataChanged path:/clusterstate.json, has occurred - updating... (live nodes size: 3)
[junit4:junit4]   2> 6374 T3712 oascc.ZkStateReader$2.process A cluster state change: WatchedEvent state:SyncConnected type:NodeDataChanged path:/clusterstate.json, has occurred - updating... (live nodes size: 3)
[junit4:junit4]   2> 6374 T3727 oascc.ZkStateReader$2.process A cluster state change: WatchedEvent state:SyncConnected type:NodeDataChanged path:/clusterstate.json, has occurred - updating... (live nodes size: 3)
[junit4:junit4]   2> 6374 T3693 oascc.ZkStateReader$2.process A cluster state change: WatchedEvent state:SyncConnected type:NodeDataChanged path:/clusterstate.json, has occurred - updating... (live nodes size: 3)
[junit4:junit4]   2> 6437 T3728 oasc.SolrConfig.<init> Loaded SolrConfig: solrconfig.xml
[junit4:junit4]   2> 6538 T3728 oass.IndexSchema.readSchema Reading Solr Schema
[junit4:junit4]   2> 6545 T3728 oass.IndexSchema.readSchema Schema name=test
[junit4:junit4]   2> 7140 T3728 oass.OpenExchangeRatesOrgProvider.init Initialized with rates=open-exchange-rates.json, refreshInterval=1440.
[junit4:junit4]   2> 7152 T3728 oass.IndexSchema.readSchema default search field in schema is text
[junit4:junit4]   2> 7156 T3728 oass.IndexSchema.readSchema unique key field: id
[junit4:junit4]   2> 7168 T3728 oass.FileExchangeRateProvider.reload Reloading exchange rates from file currency.xml
[junit4:junit4]   2> 7173 T3728 oass.FileExchangeRateProvider.reload Reloading exchange rates from file currency.xml
[junit4:junit4]   2> 7178 T3728 oass.OpenExchangeRatesOrgProvider.reload Reloading exchange rates from open-exchange-rates.json
[junit4:junit4]   2> 7179 T3728 oass.OpenExchangeRatesOrgProvider.reload Reloading exchange rates from open-exchange-rates.json
[junit4:junit4]   2> 7180 T3728 oasc.SolrCore.<init> [collection1] Opening new SolrCore at /usr/home/hudson/hudson-slave/workspace/Lucene-Solr-Tests-4.x-java7/solr/build/solr-core/test/J1/./org.apache.solr.cloud.SyncSliceTest-jetty2-1356024822468/collection1/, dataDir=./org.apache.solr.cloud.SyncSliceTest-1356024816556/jetty2/
[junit4:junit4]   2> 7180 T3728 oasc.JmxMonitoredMap.<init> JMX monitoring is enabled. Adding Solr mbeans to JMX Server: com.sun.jmx.mbeanserver.JmxMBeanServer@45ad71f0
[junit4:junit4]   2> 7181 T3728 oasc.SolrCore.initDirectoryFactory solr.NRTCachingDirectoryFactory
[junit4:junit4]   2> 7182 T3728 oasc.CachingDirectoryFactory.get return new directory for /usr/home/hudson/hudson-slave/workspace/Lucene-Solr-Tests-4.x-java7/solr/build/solr-core/test/J1/./org.apache.solr.cloud.SyncSliceTest-1356024816556/jetty2 forceNew:false
[junit4:junit4]   2> 7183 T3728 oasc.CachingDirectoryFactory.close Releasing directory:/usr/home/hudson/hudson-slave/workspace/Lucene-Solr-Tests-4.x-java7/solr/build/solr-core/test/J1/./org.apache.solr.cloud.SyncSliceTest-1356024816556/jetty2
[junit4:junit4]   2> 7183 T3728 oasc.SolrCore.getNewIndexDir New index directory detected: old=null new=./org.apache.solr.cloud.SyncSliceTest-1356024816556/jetty2/index/
[junit4:junit4]   2> 7184 T3728 oasc.SolrCore.initIndex WARNING [collection1] Solr index directory './org.apache.solr.cloud.SyncSliceTest-1356024816556/jetty2/index' doesn't exist. Creating new index...
[junit4:junit4]   2> 7185 T3728 oasc.CachingDirectoryFactory.get return new directory for /usr/home/hudson/hudson-slave/workspace/Lucene-Solr-Tests-4.x-java7/solr/build/solr-core/test/J1/./org.apache.solr.cloud.SyncSliceTest-1356024816556/jetty2/index forceNew:false
[junit4:junit4]   2> 7190 T3728 oasc.SolrDeletionPolicy.onCommit SolrDeletionPolicy.onCommit: commits:num=1
[junit4:junit4]   2> 		commit{dir=RateLimitedDirectoryWrapper(NRTCachingDirectory(org.apache.lucene.store.NIOFSDirectory@/usr/home/hudson/hudson-slave/workspace/Lucene-Solr-Tests-4.x-java7/solr/build/solr-core/test/J1/org.apache.solr.cloud.SyncSliceTest-1356024816556/jetty2/index lockFactory=org.apache.lucene.store.NativeFSLockFactory@5119f746; maxCacheMB=48.0 maxMergeSizeMB=4.0)),segFN=segments_1,generation=1,filenames=[segments_1]
[junit4:junit4]   2> 7191 T3728 oasc.SolrDeletionPolicy.updateCommits newest commit = 1[segments_1]
[junit4:junit4]   2> 7192 T3728 oasc.CachingDirectoryFactory.close Releasing directory:/usr/home/hudson/hudson-slave/workspace/Lucene-Solr-Tests-4.x-java7/solr/build/solr-core/test/J1/./org.apache.solr.cloud.SyncSliceTest-1356024816556/jetty2/index
[junit4:junit4]   2> 7192 T3728 oasc.SolrCore.initWriters created xml: solr.XMLResponseWriter
[junit4:junit4]   2> 7195 T3728 oasup.UpdateRequestProcessorChain.init inserting DistributedUpdateProcessorFactory into updateRequestProcessorChain "dedupe"
[junit4:junit4]   2> 7195 T3728 oasup.UpdateRequestProcessorChain.init inserting DistributedUpdateProcessorFactory into updateRequestProcessorChain "dedupe-allfields"
[junit4:junit4]   2> 7195 T3728 oasup.UpdateRequestProcessorChain.init inserting DistributedUpdateProcessorFactory into updateRequestProcessorChain "stored_sig"
[junit4:junit4]   2> 7196 T3728 oasup.UpdateRequestProcessorChain.init inserting DistributedUpdateProcessorFactory into updateRequestProcessorChain "uniq-fields"
[junit4:junit4]   2> 7197 T3728 oasup.UpdateRequestProcessorChain.init inserting DistributedUpdateProcessorFactory into updateRequestProcessorChain "distrib-dup-test-chain-implicit"
[junit4:junit4]   2> 7197 T3728 oasc.RequestHandlers.initHandlersFromConfig adding lazy requestHandler: solr.ReplicationHandler
[junit4:junit4]   2> 7197 T3728 oasc.RequestHandlers.initHandlersFromConfig created /replication: solr.ReplicationHandler
[junit4:junit4]   2> 7199 T3728 oasc.RequestHandlers.initHandlersFromConfig created standard: solr.StandardRequestHandler
[junit4:junit4]   2> 7200 T3728 oasc.RequestHandlers.initHandlersFromConfig created /get: solr.RealTimeGetHandler
[junit4:junit4]   2> 7200 T3728 oasc.RequestHandlers.initHandlersFromConfig created dismax: solr.SearchHandler
[junit4:junit4]   2> 7201 T3728 oasc.RequestHandlers.initHandlersFromConfig created mock: org.apache.solr.core.MockQuerySenderListenerReqHandler
[junit4:junit4]   2> 7202 T3728 oasc.RequestHandlers.initHandlersFromConfig created /admin/: org.apache.solr.handler.admin.AdminHandlers
[junit4:junit4]   2> 7203 T3728 oasc.RequestHandlers.initHandlersFromConfig created defaults: solr.StandardRequestHandler
[junit4:junit4]   2> 7203 T3728 oasc.RequestHandlers.initHandlersFromConfig adding lazy requestHandler: solr.StandardRequestHandler
[junit4:junit4]   2> 7204 T3728 oasc.RequestHandlers.initHandlersFromConfig created lazy: solr.StandardRequestHandler
[junit4:junit4]   2> 7205 T3728 oasc.RequestHandlers.initHandlersFromConfig created /update: solr.UpdateRequestHandler
[junit4:junit4]   2> 7206 T3728 oasc.RequestHandlers.initHandlersFromConfig created /terms: org.apache.solr.handler.component.SearchHandler
[junit4:junit4]   2> 7207 T3728 oasc.RequestHandlers.initHandlersFromConfig created spellCheckCompRH: org.apache.solr.handler.component.SearchHandler
[junit4:junit4]   2> 7208 T3728 oasc.RequestHandlers.initHandlersFromConfig created spellCheckCompRH_Direct: org.apache.solr.handler.component.SearchHandler
[junit4:junit4]   2> 7209 T3728 oasc.RequestHandlers.initHandlersFromConfig created spellCheckWithWordbreak: org.apache.solr.handler.component.SearchHandler
[junit4:junit4]   2> 7210 T3728 oasc.RequestHandlers.initHandlersFromConfig created spellCheckWithWordbreak_Direct: org.apache.solr.handler.component.SearchHandler
[junit4:junit4]   2> 7210 T3728 oasc.RequestHandlers.initHandlersFromConfig created spellCheckCompRH1: org.apache.solr.handler.component.SearchHandler
[junit4:junit4]   2> 7211 T3728 oasc.RequestHandlers.initHandlersFromConfig created mltrh: org.apache.solr.handler.component.SearchHandler
[junit4:junit4]   2> 7212 T3728 oasc.RequestHandlers.initHandlersFromConfig created tvrh: org.apache.solr.handler.component.SearchHandler
[junit4:junit4]   2> 7213 T3728 oasc.RequestHandlers.initHandlersFromConfig created /mlt: solr.MoreLikeThisHandler
[junit4:junit4]   2> 7214 T3728 oasc.RequestHandlers.initHandlersFromConfig created /debug/dump: solr.DumpRequestHandler
[junit4:junit4]   2> 7226 T3728 oashl.XMLLoader.init xsltCacheLifetimeSeconds=60
[junit4:junit4]   2> 7231 T3728 oasc.SolrCore.initDeprecatedSupport WARNING solrconfig.xml uses deprecated <admin/gettableFiles>, Please update your config to use the ShowFileRequestHandler.
[junit4:junit4]   2> 7233 T3728 oasc.SolrCore.initDeprecatedSupport WARNING adding ShowFileRequestHandler with hidden files: [SCHEMA.XML, OLD_SYNONYMS.TXT, STOPWORDS.TXT, PROTWORDS.TXT, OPEN-EXCHANGE-RATES.JSON, SYNONYMS.TXT, CURRENCY.XML, MAPPING-ISOLATIN1ACCENT.TXT]
[junit4:junit4]   2> 7235 T3728 oasc.CachingDirectoryFactory.close Releasing directory:/usr/home/hudson/hudson-slave/workspace/Lucene-Solr-Tests-4.x-java7/solr/build/solr-core/test/J1/./org.apache.solr.cloud.SyncSliceTest-1356024816556/jetty2
[junit4:junit4]   2> 7237 T3728 oass.SolrIndexSearcher.<init> Opening Searcher@4dc7ff78 main
[junit4:junit4]   2> 7238 T3728 oasu.CommitTracker.<init> Hard AutoCommit: disabled
[junit4:junit4]   2> 7238 T3728 oasu.CommitTracker.<init> Soft AutoCommit: disabled
[junit4:junit4]   2> 7239 T3728 oashc.SpellCheckComponent.inform Initializing spell checkers
[junit4:junit4]   2> 7246 T3728 oass.DirectSolrSpellChecker.init init: {name=direct,classname=DirectSolrSpellChecker,field=lowerfilt,minQueryLength=3}
[junit4:junit4]   2> 7299 T3729 oasc.SolrCore.registerSearcher [collection1] Registered new searcher Searcher@4dc7ff78 main{StandardDirectoryReader(segments_1:1)}
[junit4:junit4]   2> 7303 T3728 oasc.ZkController.publish publishing core=collection1 state=down
[junit4:junit4]   2> 7304 T3728 oasc.ZkController.publish numShards not found on descriptor - reading it from system property
[junit4:junit4]   2> 7380 T3694 oascc.ZkStateReader.updateClusterState Updating cloud state from ZooKeeper... 
[junit4:junit4]   2> 7381 T3694 oasc.Overseer$ClusterStateUpdater.updateState Update state numShards=1 message={
[junit4:junit4]   2> 	  "operation":"state",
[junit4:junit4]   2> 	  "numShards":"1",
[junit4:junit4]   2> 	  "shard":null,
[junit4:junit4]   2> 	  "roles":null,
[junit4:junit4]   2> 	  "state":"down",
[junit4:junit4]   2> 	  "core":"collection1",
[junit4:junit4]   2> 	  "collection":"collection1",
[junit4:junit4]   2> 	  "node_name":"127.0.0.1:55273_om_z",
[junit4:junit4]   2> 	  "base_url":"http://127.0.0.1:55273/om_z"}
[junit4:junit4]   2> 7381 T3694 oasc.Overseer$ClusterStateUpdater.updateState Collection already exists with numShards=1
[junit4:junit4]   2> 7382 T3694 oasc.Overseer$ClusterStateUpdater.updateState Assigning new node to shard shard=shard1
[junit4:junit4]   2> 7394 T3693 oascc.ZkStateReader$2.process A cluster state change: WatchedEvent state:SyncConnected type:NodeDataChanged path:/clusterstate.json, has occurred - updating... (live nodes size: 3)
[junit4:junit4]   2> 7395 T3727 oascc.ZkStateReader$2.process A cluster state change: WatchedEvent state:SyncConnected type:NodeDataChanged path:/clusterstate.json, has occurred - updating... (live nodes size: 3)
[junit4:junit4]   2> 7395 T3712 oascc.ZkStateReader$2.process A cluster state change: WatchedEvent state:SyncConnected type:NodeDataChanged path:/clusterstate.json, has occurred - updating... (live nodes size: 3)
[junit4:junit4]   2> 7395 T3699 oascc.ZkStateReader$2.process A cluster state change: WatchedEvent state:SyncConnected type:NodeDataChanged path:/clusterstate.json, has occurred - updating... (live nodes size: 3)
[junit4:junit4]   2> 8307 T3728 oasc.CoreContainer.registerCore registering core: collection1
[junit4:junit4]   2> 8307 T3728 oasc.ZkController.register Register replica - core:collection1 address:http://127.0.0.1:55273/om_z collection:collection1 shard:shard1
[junit4:junit4]   2> 8310 T3728 oasc.ZkController.register We are http://127.0.0.1:55273/om_z/collection1/ and leader is http://127.0.0.1:55270/om_z/collection1/
[junit4:junit4]   2> 8310 T3728 oasc.ZkController.register No LogReplay needed for core=collection1 baseURL=http://127.0.0.1:55273/om_z
[junit4:junit4]   2> 8310 T3728 oasc.ZkController.checkRecovery Core needs to recover:collection1
[junit4:junit4]   2> 8311 T3728 oasu.DefaultSolrCoreState.doRecovery Running recovery - first canceling any ongoing recovery
[junit4:junit4]   2> ASYNC  NEW_CORE C178 name=collection1 org.apache.solr.core.SolrCore@52f30fdd url=http://127.0.0.1:55273/om_z/collection1 node=127.0.0.1:55273_om_z C178_STATE=coll:collection1 core:collection1 props:{shard=null, roles=null, state=down, core=collection1, collection=collection1, node_name=127.0.0.1:55273_om_z, base_url=http://127.0.0.1:55273/om_z}
[junit4:junit4]   2> 8311 T3730 C178 P55273 oasc.RecoveryStrategy.run Starting recovery process.  core=collection1 recoveringAfterStartup=true
[junit4:junit4]   2> 8311 T3728 oascc.ZkStateReader.updateClusterState Updating cloud state from ZooKeeper... 
[junit4:junit4]   2> 8312 T3730 C178 P55273 oasc.RecoveryStrategy.doRecovery ###### startupVersions=[]
[junit4:junit4]   2> 8313 T3730 C178 P55273 oasc.ZkController.publish publishing core=collection1 state=recovering
[junit4:junit4]   2> 8313 T3730 C178 P55273 oasc.ZkController.publish numShards not found on descriptor - reading it from system property
[junit4:junit4]   2> 8313 T3671 oass.SolrDispatchFilter.init user.dir=/usr/home/hudson/hudson-slave/workspace/Lucene-Solr-Tests-4.x-java7/solr/build/solr-core/test/J1
[junit4:junit4]   2> 8314 T3671 oass.SolrDispatchFilter.init SolrDispatchFilter.init() done
[junit4:junit4]   2> 8315 T3671 oascsi.HttpClientUtil.createClient Creating new http client, config:maxConnections=128&maxConnectionsPerHost=32&followRedirects=false
[junit4:junit4]   2> 8343 T3730 C178 P55273 oasc.RecoveryStrategy.doRecovery Attempting to PeerSync from http://127.0.0.1:55270/om_z/collection1/ core=collection1 - recoveringAfterStartup=true
[junit4:junit4]   2> 8343 T3730 C178 P55273 oasu.PeerSync.sync PeerSync: core=collection1 url=http://127.0.0.1:55273/om_z START replicas=[http://127.0.0.1:55270/om_z/collection1/] nUpdates=100
[junit4:junit4]   2> 8344 T3730 C178 P55273 oasu.PeerSync.sync WARNING no frame of reference to tell of we've missed updates
[junit4:junit4]   2> 8344 T3730 C178 P55273 oasc.RecoveryStrategy.doRecovery PeerSync Recovery was not successful - trying replication. core=collection1
[junit4:junit4]   2> 8344 T3730 C178 P55273 oasc.RecoveryStrategy.doRecovery Starting Replication Recovery. core=collection1
[junit4:junit4]   2> 8345 T3730 C178 P55273 oascsi.HttpClientUtil.createClient Creating new http client, config:maxConnections=128&maxConnectionsPerHost=32&followRedirects=false
[junit4:junit4]   2> ASYNC  NEW_CORE C179 name=collection1 org.apache.solr.core.SolrCore@ea24981 url=http://127.0.0.1:55270/om_z/collection1 node=127.0.0.1:55270_om_z C179_STATE=coll:collection1 core:collection1 props:{shard=shard1, roles=null, state=active, core=collection1, collection=collection1, node_name=127.0.0.1:55270_om_z, base_url=http://127.0.0.1:55270/om_z, leader=true}
[junit4:junit4]   2> 8356 T3702 C179 P55270 REQ /get {distrib=false&qt=/get&wt=javabin&version=2&getVersions=100} status=0 QTime=1 
[junit4:junit4]   2> 8401 T3694 oascc.ZkStateReader.updateClusterState Updating cloud state from ZooKeeper... 
[junit4:junit4]   2> 8402 T3694 oasc.Overseer$ClusterStateUpdater.updateState Update state numShards=1 message={
[junit4:junit4]   2> 	  "operation":"state",
[junit4:junit4]   2> 	  "numShards":"1",
[junit4:junit4]   2> 	  "shard":"shard1",
[junit4:junit4]   2> 	  "roles":null,
[junit4:junit4]   2> 	  "state":"recovering",
[junit4:junit4]   2> 	  "core":"collection1",
[junit4:junit4]   2> 	  "collection":"collection1",
[junit4:junit4]   2> 	  "node_name":"127.0.0.1:55273_om_z",
[junit4:junit4]   2> 	  "base_url":"http://127.0.0.1:55273/om_z"}
[junit4:junit4]   2> 8433 T3727 oascc.ZkStateReader$2.process A cluster state change: WatchedEvent state:SyncConnected type:NodeDataChanged path:/clusterstate.json, has occurred - updating... (live nodes size: 3)
[junit4:junit4]   2> 8433 T3712 oascc.ZkStateReader$2.process A cluster state change: WatchedEvent state:SyncConnected type:NodeDataChanged path:/clusterstate.json, has occurred - updating... (live nodes size: 3)
[junit4:junit4]   2> 8434 T3693 oascc.ZkStateReader$2.process A cluster state change: WatchedEvent state:SyncConnected type:NodeDataChanged path:/clusterstate.json, has occurred - updating... (live nodes size: 3)
[junit4:junit4]   2> 8433 T3699 oascc.ZkStateReader$2.process A cluster state change: WatchedEvent state:SyncConnected type:NodeDataChanged path:/clusterstate.json, has occurred - updating... (live nodes size: 3)
[junit4:junit4]   2> 8495 T3671 oejs.Server.doStart jetty-8.1.8.v20121106
[junit4:junit4]   2> 8499 T3671 oejs.AbstractConnector.doStart Started SocketConnector@127.0.0.1:55278
[junit4:junit4]   2> 8500 T3671 oasc.SolrResourceLoader.locateSolrHome JNDI not configured for solr (NoInitialContextEx)
[junit4:junit4]   2> 8501 T3671 oasc.SolrResourceLoader.locateSolrHome using system property solr.solr.home: /usr/home/hudson/hudson-slave/workspace/Lucene-Solr-Tests-4.x-java7/solr/build/solr-core/test/J1/./org.apache.solr.cloud.SyncSliceTest-jetty3-1356024824880
[junit4:junit4]   2> 8502 T3671 oasc.SolrResourceLoader.<init> new SolrResourceLoader for deduced Solr Home: '/usr/home/hudson/hudson-slave/workspace/Lucene-Solr-Tests-4.x-java7/solr/build/solr-core/test/J1/./org.apache.solr.cloud.SyncSliceTest-jetty3-1356024824880/'
[junit4:junit4]   2> 8544 T3671 oass.SolrDispatchFilter.init SolrDispatchFilter.init()
[junit4:junit4]   2> 8546 T3671 oasc.SolrResourceLoader.locateSolrHome JNDI not configured for solr (NoInitialContextEx)
[junit4:junit4]   2> 8547 T3671 oasc.SolrResourceLoader.locateSolrHome using system property solr.solr.home: /usr/home/hudson/hudson-slave/workspace/Lucene-Solr-Tests-4.x-java7/solr/build/solr-core/test/J1/./org.apache.solr.cloud.SyncSliceTest-jetty3-1356024824880
[junit4:junit4]   2> 8548 T3671 oasc.CoreContainer$Initializer.initialize looking for solr.xml: /usr/home/hudson/hudson-slave/workspace/Lucene-Solr-Tests-4.x-java7/solr/build/solr-core/test/J1/./org.apache.solr.cloud.SyncSliceTest-jetty3-1356024824880/solr.xml
[junit4:junit4]   2> 8548 T3671 oasc.CoreContainer.<init> New CoreContainer 785597849
[junit4:junit4]   2> 8549 T3671 oasc.CoreContainer.load Loading CoreContainer using Solr Home: '/usr/home/hudson/hudson-slave/workspace/Lucene-Solr-Tests-4.x-java7/solr/build/solr-core/test/J1/./org.apache.solr.cloud.SyncSliceTest-jetty3-1356024824880/'
[junit4:junit4]   2> 8550 T3671 oasc.SolrResourceLoader.<init> new SolrResourceLoader for directory: '/usr/home/hudson/hudson-slave/workspace/Lucene-Solr-Tests-4.x-java7/solr/build/solr-core/test/J1/./org.apache.solr.cloud.SyncSliceTest-jetty3-1356024824880/'
[junit4:junit4]   2> 8582 T3671 oashc.HttpShardHandlerFactory.getParameter Setting socketTimeout to: 30000
[junit4:junit4]   2> 8583 T3671 oashc.HttpShardHandlerFactory.getParameter Setting urlScheme to: http://
[junit4:junit4]   2> 8584 T3671 oashc.HttpShardHandlerFactory.getParameter Setting connTimeout to: 15000
[junit4:junit4]   2> 8585 T3671 oashc.HttpShardHandlerFactory.getParameter Setting maxConnectionsPerHost to: 20
[junit4:junit4]   2> 8585 T3671 oashc.HttpShardHandlerFactory.getParameter Setting corePoolSize to: 0
[junit4:junit4]   2> 8586 T3671 oashc.HttpShardHandlerFactory.getParameter Setting maximumPoolSize to: 2147483647
[junit4:junit4]   2> 8587 T3671 oashc.HttpShardHandlerFactory.getParameter Setting maxThreadIdleTime to: 5
[junit4:junit4]   2> 8588 T3671 oashc.HttpShardHandlerFactory.getParameter Setting sizeOfQueue to: -1
[junit4:junit4]   2> 8589 T3671 oashc.HttpShardHandlerFactory.getParameter Setting fairnessPolicy to: false
[junit4:junit4]   2> 8590 T3671 oascsi.HttpClientUtil.createClient Creating new http client, config:maxConnectionsPerHost=20&maxConnections=10000&socketTimeout=30000&connTimeout=15000&retry=false
[junit4:junit4]   2> 8611 T3671 oasc.CoreContainer.load Registering Log Listener
[junit4:junit4]   2> 8650 T3671 oasc.CoreContainer.initZooKeeper Zookeeper client=127.0.0.1:55263/solr
[junit4:junit4]   2> 8651 T3671 oasc.ZkController.checkChrootPath zkHost includes chroot
[junit4:junit4]   2> 8652 T3671 oaz.ZooKeeper.<init> Initiating client connection, connectString=127.0.0.1:55263 sessionTimeout=60000 watcher=org.apache.solr.common.cloud.ConnectionManager@78eda282
[junit4:junit4]   2> 8653 T3671 oascc.ConnectionManager.waitForConnected Waiting for client to connect to ZooKeeper
[junit4:junit4]   2> 8653 T3741 oaz.ClientCnxn$SendThread.logStartConnect Opening socket connection to server localhost/127.0.0.1:55263. Will not attempt to authenticate using SASL (access denied ("javax.security.auth.AuthPermission" "getLoginConfiguration"))
[junit4:junit4]   2> 8654 T3741 oaz.ClientCnxn$SendThread.primeConnection Socket connection established to localhost/127.0.0.1:55263, initiating session
[junit4:junit4]   2> 8654 T3673 oazs.NIOServerCnxnFactory.run Accepted socket connection from /140.211.11.196:55279
[junit4:junit4]   2> 8655 T3673 oazs.ZooKeeperServer.processConnectRequest Client attempting to establish new session at /140.211.11.196:55279
[junit4:junit4]   2> 8685 T3675 oazs.ZooKeeperServer.finishSessionInit Established session 0x13bb960a3b50009 with negotiated timeout 20000 for client /140.211.11.196:55279
[junit4:junit4]   2> 8685 T3741 oaz.ClientCnxn$SendThread.onConnected Session establishment complete on server localhost/127.0.0.1:55263, sessionid = 0x13bb960a3b50009, negotiated timeout = 20000
[junit4:junit4]   2> 8685 T3742 oascc.ConnectionManager.process Watcher org.apache.solr.common.cloud.ConnectionManager@78eda282 name:ZooKeeperConnection Watcher:127.0.0.1:55263 got event WatchedEvent state:SyncConnected type:None path:null path:null type:None
[junit4:junit4]   2> 8686 T3671 oascc.ConnectionManager.waitForConnected Client is connected to ZooKeeper
[junit4:junit4]   2> 8687 T3676 oazs.PrepRequestProcessor.pRequest2Txn Processed session termination for sessionid: 0x13bb960a3b50009
[junit4:junit4]   2> 8688 T3742 oaz.ClientCnxn$EventThread.run EventThread shut down
[junit4:junit4]   2> 8688 T3673 oazs.NIOServerCnxn.closeSock Closed socket connection for client /140.211.11.196:55279 which had sessionid 0x13bb960a3b50009
[junit4:junit4]   2> 8688 T3671 oaz.ZooKeeper.close Session: 0x13bb960a3b50009 closed
[junit4:junit4]   2> 8689 T3671 oascsi.HttpClientUtil.createClient Creating new http client, config:maxConnections=500&maxConnectionsPerHost=16&socketTimeout=15000&connTimeout=30000
[junit4:junit4]   2> 8696 T3671 oaz.ZooKeeper.<init> Initiating client connection, connectString=127.0.0.1:55263/solr sessionTimeout=30000 watcher=org.apache.solr.common.cloud.ConnectionManager@1053cab8
[junit4:junit4]   2> 8698 T3743 oaz.ClientCnxn$SendThread.logStartConnect Opening socket connection to server localhost/127.0.0.1:55263. Will not attempt to authenticate using SASL (access denied ("javax.security.auth.AuthPermission" "getLoginConfiguration"))
[junit4:junit4]   2> 8697 T3671 oascc.ConnectionManager.waitForConnected Waiting for client to connect to ZooKeeper
[junit4:junit4]   2> 8698 T3743 oaz.ClientCnxn$SendThread.primeConnection Socket connection established to localhost/127.0.0.1:55263, initiating session
[junit4:junit4]   2> 8698 T3673 oazs.NIOServerCnxnFactory.run Accepted socket connection from /140.211.11.196:55280
[junit4:junit4]   2> 8699 T3673 oazs.ZooKeeperServer.processConnectRequest Client attempting to establish new session at /140.211.11.196:55280
[junit4:junit4]   2> 8700 T3675 oazs.ZooKeeperServer.finishSessionInit Established session 0x13bb960a3b5000a with negotiated timeout 20000 for client /140.211.11.196:55280
[junit4:junit4]   2> 8700 T3743 oaz.ClientCnxn$SendThread.onConnected Session establishment complete on server localhost/127.0.0.1:55263, sessionid = 0x13bb960a3b5000a, negotiated timeout = 20000
[junit4:junit4]   2> 8700 T3744 oascc.ConnectionManager.process Watcher org.apache.solr.common.cloud.ConnectionManager@1053cab8 name:ZooKeeperConnection Watcher:127.0.0.1:55263/solr got event WatchedEvent state:SyncConnected type:None path:null path:null type:None
[junit4:junit4]   2> 8701 T3671 oascc.ConnectionManager.waitForConnected Client is connected to ZooKeeper
[junit4:junit4]   2> 8702 T3676 oazs.PrepRequestProcessor.pRequest Got user-level KeeperException when processing sessionid:0x13bb960a3b5000a type:create cxid:0x1 zxid:0x84 txntype:-1 reqpath:n/a Error Path:/solr/overseer Error:KeeperErrorCode = NodeExists for /solr/overseer
[junit4:junit4]   2> 8713 T3676 oazs.PrepRequestProcessor.pRequest Got user-level KeeperException when processing sessionid:0x13bb960a3b5000a type:create cxid:0x2 zxid:0x85 txntype:-1 reqpath:n/a Error Path:/solr/overseer Error:KeeperErrorCode = NodeExists for /solr/overseer
[junit4:junit4]   2> 8715 T3671 oasc.ZkController.createEphemeralLiveNode Register node as live in ZooKeeper:/live_nodes/127.0.0.1:55278_om_z
[junit4:junit4]   2> 8716 T3676 oazs.PrepRequestProcessor.pRequest Got user-level KeeperException when processing sessionid:0x13bb960a3b5000a type:delete cxid:0x4 zxid:0x86 txntype:-1 reqpath:n/a Error Path:/solr/live_nodes/127.0.0.1:55278_om_z Error:KeeperErrorCode = NoNode for /solr/live_nodes/127.0.0.1:55278_om_z
[junit4:junit4]   2> 8717 T3671 oascc.SolrZkClient.makePath makePath: /live_nodes/127.0.0.1:55278_om_z
[junit4:junit4]   2> 8754 T3693 oascc.ZkStateReader$2.process A cluster state change: WatchedEvent state:SyncConnected type:NodeChildrenChanged path:/live_nodes, has occurred - updating... (live nodes size: 3)
[junit4:junit4]   2> 8754 T3712 oascc.ZkStateReader$2.process A cluster state change: WatchedEvent state:SyncConnected type:NodeChildrenChanged path:/live_nodes, has occurred - updating... (live nodes size: 3)
[junit4:junit4]   2> 8754 T3727 oascc.ZkStateReader$2.process A cluster state change: WatchedEvent state:SyncConnected type:NodeChildrenChanged path:/live_nodes, has occurred - updating... (live nodes size: 3)
[junit4:junit4]   2> 8754 T3699 oascc.ZkStateReader$2.process A cluster state change: WatchedEvent state:SyncConnected type:NodeChildrenChanged path:/live_nodes, has occurred - updating... (live nodes size: 3)
[junit4:junit4]   2> 8755 T3693 oascc.ZkStateReader$3.process Updating live nodes... (4)
[junit4:junit4]   2> 8756 T3712 oascc.ZkStateReader$3.process Updating live nodes... (4)
[junit4:junit4]   2> 8756 T3727 oascc.ZkStateReader$3.process Updating live nodes... (4)
[junit4:junit4]   2> 8756 T3699 oascc.ZkStateReader$3.process Updating live nodes... (4)
[junit4:junit4]   2> 8757 T3671 oascc.ZkStateReader.createClusterStateWatchersAndUpdate Updating cluster state from ZooKeeper... 
[junit4:junit4]   2> 8764 T3745 oasc.CoreContainer.create Creating SolrCore 'collection1' using instanceDir: /usr/home/hudson/hudson-slave/workspace/Lucene-Solr-Tests-4.x-java7/solr/build/solr-core/test/J1/./org.apache.solr.cloud.SyncSliceTest-jetty3-1356024824880/collection1
[junit4:junit4]   2> 8764 T3745 oasc.ZkController.createCollectionZkNode Check for collection zkNode:collection1
[junit4:junit4]   2> 8765 T3745 oasc.ZkController.createCollectionZkNode Collection zkNode exists
[junit4:junit4]   2> 8765 T3745 oasc.ZkController.readConfigName Load collection config from:/collections/collection1
[junit4:junit4]   2> 8766 T3745 oasc.SolrResourceLoader.<init> new SolrResourceLoader for directory: '/usr/home/hudson/hudson-slave/workspace/Lucene-Solr-Tests-4.x-java7/solr/build/solr-core/test/J1/./org.apache.solr.cloud.SyncSliceTest-jetty3-1356024824880/collection1/'
[junit4:junit4]   2> 8767 T3745 oasc.SolrResourceLoader.replaceClassLoader Adding 'file:/usr/home/hudson/hudson-slave/workspace/Lucene-Solr-Tests-4.x-java7/solr/build/solr-core/test/J1/org.apache.solr.cloud.SyncSliceTest-jetty3-1356024824880/collection1/lib/README' to classloader
[junit4:junit4]   2> 8768 T3745 oasc.SolrResourceLoader.replaceClassLoader Adding 'file:/usr/home/hudson/hudson-slave/workspace/Lucene-Solr-Tests-4.x-java7/solr/build/solr-core/test/J1/org.apache.solr.cloud.SyncSliceTest-jetty3-1356024824880/collection1/lib/classes/' to classloader
[junit4:junit4]   2> 8821 T3745 oasc.SolrConfig.<init> Using Lucene MatchVersion: LUCENE_41
[junit4:junit4]   2> 8891 T3745 oasc.SolrConfig.<init> Loaded SolrConfig: solrconfig.xml
[junit4:junit4]   2> 8992 T3745 oass.IndexSchema.readSchema Reading Solr Schema
[junit4:junit4]   2> 8997 T3745 oass.IndexSchema.readSchema Schema name=test
[junit4:junit4]   2> 9441 T3745 oass.OpenExchangeRatesOrgProvider.init Initialized with rates=open-exchange-rates.json, refreshInterval=1440.
[junit4:junit4]   2> 9449 T3745 oass.IndexSchema.readSchema default search field in schema is text
[junit4:junit4]   2> 9452 T3745 oass.IndexSchema.readSchema unique key field: id
[junit4:junit4]   2> 9461 T3745 oass.FileExchangeRateProvider.reload Reloading exchange rates from file currency.xml
[junit4:junit4]   2> 9465 T3745 oass.FileExchangeRateProvider.reload Reloading exchange rates from file currency.xml
[junit4:junit4]   2> 9469 T3745 oass.OpenExchangeRatesOrgProvider.reload Reloading exchange rates from open-exchange-rates.json
[junit4:junit4]   2> 9470 T3745 oass.OpenExchangeRatesOrgProvider.reload Reloading exchange rates from open-exchange-rates.json
[junit4:junit4]   2> 9471 T3745 oasc.SolrCore.<init> [collection1] Opening new SolrCore at /usr/home/hudson/hudson-slave/workspace/Lucene-Solr-Tests-4.x-java7/solr/build/solr-core/test/J1/./org.apache.solr.cloud.SyncSliceTest-jetty3-1356024824880/collection1/, dataDir=./org.apache.solr.cloud.SyncSliceTest-1356024816556/jetty3/
[junit4:junit4]   2> 9471 T3745 oasc.JmxMonitoredMap.<init> JMX monitoring is enabled. Adding Solr mbeans to JMX Server: com.sun.jmx.mbeanserver.JmxMBeanServer@45ad71f0
[junit4:junit4]   2> 9472 T3745 oasc.SolrCore.initDirectoryFactory solr.NRTCachingDirectoryFactory
[junit4:junit4]   2> 9472 T3745 oasc.CachingDirectoryFactory.get return new directory for /usr/home/hudson/hudson-slave/workspace/Lucene-Solr-Tests-4.x-java7/solr/build/solr-core/test/J1/./org.apache.solr.cloud.SyncSliceTest-1356024816556/jetty3 forceNew:false
[junit4:junit4]   2> 9473 T3745 oasc.CachingDirectoryFactory.close Releasing directory:/usr/home/hudson/hudson-slave/workspace/Lucene-Solr-Tests-4.x-java7/solr/build/solr-core/test/J1/./org.apache.solr.cloud.SyncSliceTest-1356024816556/jetty3
[junit4:junit4]   2> 9473 T3745 oasc.SolrCore.getNewIndexDir New index directory detected: old=null new=./org.apache.solr.cloud.SyncSliceTest-1356024816556/jetty3/index/
[junit4:junit4]   2> 9474 T3745 oasc.SolrCore.initIndex WARNING [collection1] Solr index directory './org.apache.solr.cloud.SyncSliceTest-1356024816556/jetty3/index' doesn't exist. Creating new index...
[junit4:junit4]   2> 9475 T3745 oasc.CachingDirectoryFactory.get return new directory for /usr/home/hudson/hudson-slave/workspace/Lucene-Solr-Tests-4.x-java7/solr/build/solr-core/test/J1/./org.apache.solr.cloud.SyncSliceTest-1356024816556/jetty3/index forceNew:false
[junit4:junit4]   2> 9479 T3745 oasc.SolrDeletionPolicy.onCommit SolrDeletionPolicy.onCommit: commits:num=1
[junit4:junit4]   2> 		commit{dir=RateLimitedDirectoryWrapper(NRTCachingDirectory(org.apache.lucene.store.NIOFSDirectory@/usr/home/hudson/hudson-slave/workspace/Lucene-Solr-Tests-4.x-java7/solr/build/solr-core/test/J1/org.apache.solr.cloud.SyncSliceTest-1356024816556/jetty3/index lockFactory=org.apache.lucene.store.NativeFSLockFactory@70a0252a; maxCacheMB=48.0 maxMergeSizeMB=4.0)),segFN=segments_1,generation=1,filenames=[segments_1]
[junit4:junit4]   2> 9480 T3745 oasc.SolrDeletionPolicy.updateCommits newest commit = 1[segments_1]
[junit4:junit4]   2> 9480 T3745 oasc.CachingDirectoryFactory.close Releasing directory:/usr/home/hudson/hudson-slave/workspace/Lucene-Solr-Tests-4.x-java7/solr/build/solr-core/test/J1/./org.apache.solr.cloud.SyncSliceTest-1356024816556/jetty3/index
[junit4:junit4]   2> 9481 T3745 oasc.SolrCore.initWriters created xml: solr.XMLResponseWriter
[junit4:junit4]   2> 9482 T3745 oasup.UpdateRequestProcessorChain.init inserting DistributedUpdateProcessorFactory into updateRequestProcessorChain "dedupe"
[junit4:junit4]   2> 9483 T3745 oasup.UpdateRequestProcessorChain.init inserting DistributedUpdateProcessorFactory into updateRequestProcessorChain "dedupe-allfields"
[junit4:junit4]   2> 9483 T3745 oasup.UpdateRequestProcessorChain.init inserting DistributedUpdateProcessorFactory into updateRequestProcessorChain "stored_sig"
[junit4:junit4]   2> 9483 T3745 oasup.UpdateRequestProcessorChain.init inserting DistributedUpdateProcessorFactory into updateRequestProcessorChain "uniq-fields"
[junit4:junit4]   2> 9484 T3745 oasup.UpdateRequestProcessorChain.init inserting DistributedUpdateProcessorFactory into updateRequestProcessorChain "distrib-dup-test-chain-implicit"
[junit4:junit4]   2> 9484 T3745 oasc.RequestHandlers.initHandlersFromConfig adding lazy requestHandler: solr.ReplicationHandler
[junit4:junit4]   2> 9484 T3745 oasc.RequestHandlers.initHandlersFromConfig created /replication: solr.ReplicationHandler
[junit4:junit4]   2> 9485 T3745 oasc.RequestHandlers.initHandlersFromConfig created standard: solr.StandardRequestHandler
[junit4:junit4]   2> 9486 T3745 oasc.RequestHandlers.initHandlersFromConfig created /get: solr.RealTimeGetHandler
[junit4:junit4]   2> 9487 T3745 oasc.RequestHandlers.initHandlersFromConfig created dismax: solr.SearchHandler
[junit4:junit4]   2> 9487 T3745 oasc.RequestHandlers.initHandlersFromConfig created mock: org.apache.solr.core.MockQuerySenderListenerReqHandler
[junit4:junit4]   2> 9488 T3745 oasc.RequestHandlers.initHandlersFromConfig created /admin/: org.apache.solr.handler.admin.AdminHandlers
[junit4:junit4]   2> 9488 T3745 oasc.RequestHandlers.initHandlersFromConfig created defaults: solr.StandardRequestHandler
[junit4:junit4]   2> 9489 T3745 oasc.RequestHandlers.initHandlersFromConfig adding lazy requestHandler: solr.StandardRequestHandler
[junit4:junit4]   2> 9489 T3745 oasc.RequestHandlers.initHandlersFromConfig created lazy: solr.StandardRequestHandler
[junit4:junit4]   2> 9490 T3745 oasc.RequestHandlers.initHandlersFromConfig created /update: solr.UpdateRequestHandler
[junit4:junit4]   2> 9491 T3745 oasc.RequestHandlers.initHandlersFromConfig created /terms: org.apache.solr.handler.component.SearchHandler
[junit4:junit4]   2> 9491 T3745 oasc.RequestHandlers.initHandlersFromConfig created spellCheckCompRH: org.apache.solr.handler.component.SearchHandler
[junit4:junit4]   2> 9492 T3745 oasc.RequestHandlers.initHandlersFromConfig created spellCheckCompRH_Direct: org.apache.solr.handler.component.SearchHandler
[junit4:junit4]   2> 9493 T3745 oasc.RequestHandlers.initHandlersFromConfig created spellCheckWithWordbreak: org.apache.solr.handler.component.SearchHandler
[junit4:junit4]   2> 9493 T3745 oasc.RequestHandlers.initHandlersFromConfig created spellCheckWithWordbreak_Direct: org.apache.solr.handler.component.SearchHandler
[junit4:junit4]   2> 9494 T3745 oasc.RequestHandlers.initHandlersFromConfig created spellCheckCompRH1: org.apache.solr.handler.component.SearchHandler
[junit4:junit4]   2> 9495 T3745 oasc.RequestHandlers.initHandlersFromConfig created mltrh: org.apache.solr.handler.component.SearchHandler
[junit4:junit4]   2> 9495 T3745 oasc.RequestHandlers.initHandlersFromConfig created tvrh: org.apache.solr.handler.component.SearchHandler
[junit4:junit4]   2> 9496 T3745 oasc.RequestHandlers.initHandlersFromConfig created /mlt: solr.MoreLikeThisHandler
[junit4:junit4]   2> 9497 T3745 oasc.RequestHandlers.initHandlersFromConfig created /debug/dump: solr.DumpRequestHandler
[junit4:junit4]   2> 9505 T3745 oashl.XMLLoader.init xsltCacheLifetimeSeconds=60
[junit4:junit4]   2> 9509 T3745 oasc.SolrCore.initDeprecatedSupport WARNING solrconfig.xml uses deprecated <admin/gettableFiles>, Please update your config to use the ShowFileRequestHandler.
[junit4:junit4]   2> 9510 T3745 oasc.SolrCore.initDeprecatedSupport WARNING adding ShowFileRequestHandler with hidden files: [SCHEMA.XML, OLD_SYNONYMS.TXT, STOPWORDS.TXT, PROTWORDS.TXT, OPEN-EXCHANGE-RATES.JSON, SYNONYMS.TXT, CURRENCY.XML, MAPPING-ISOLATIN1ACCENT.TXT]
[junit4:junit4]   2> 9512 T3745 oasc.CachingDirectoryFactory.close Releasing directory:/usr/home/hudson/hudson-slave/workspace/Lucene-Solr-Tests-4.x-java7/solr/build/solr-core/test/J1/./org.apache.solr.cloud.SyncSliceTest-1356024816556/jetty3
[junit4:junit4]   2> 9513 T3745 oass.SolrIndexSearcher.<init> Opening Searcher@37573e18 main
[junit4:junit4]   2> 9514 T3745 oasu.CommitTracker.<init> Hard AutoCommit: disabled
[junit4:junit4]   2> 9514 T3745 oasu.CommitTracker.<init> Soft AutoCommit: disabled
[junit4:junit4]   2> 9514 T3745 oashc.SpellCheckComponent.inform Initializing spell checkers
[junit4:junit4]   2> 9520 T3745 oass.DirectSolrSpellChecker.init init: {name=direct,classname=DirectSolrSpellChecker,field=lowerfilt,minQueryLength=3}
[junit4:junit4]   2> 9570 T3746 oasc.SolrCore.registerSearcher [collection1] Registered new searcher Searcher@37573e18 main{StandardDirectoryReader(segments_1:1)}
[junit4:junit4]   2> 9574 T3745 oasc.ZkController.publish publishing core=collection1 state=down
[junit4:junit4]   2> 9574 T3745 oasc.ZkController.publish numShards not found on descriptor - reading it from system property
[junit4:junit4]   2> 9994 T3694 oascc.ZkStateReader.updateClusterState Updating cloud state from ZooKeeper... 
[junit4:junit4]   2> 9994 T3694 oasc.Overseer$ClusterStateUpdater.updateState Update state numShards=1 message={
[junit4:junit4]   2> 	  "operation":"state",
[junit4:junit4]   2> 	  "numShards":"1",
[junit4:junit4]   2> 	  "shard":null,
[junit4:junit4]   2> 	  "roles":null,
[junit4:junit4]   2> 	  "state":"down",
[junit4:junit4]   2> 	  "core":"collection1",
[junit4:junit4]   2> 	  "collection":"collection1",
[junit4:junit4]   2> 	  "node_name":"127.0.0.1:55278_om_z",
[junit4:junit4]   2> 	  "base_url":"http://127.0.0.1:55278/om_z"}
[junit4:junit4]   2> 9995 T3694 oasc.Overseer$ClusterStateUpdater.updateState Collection already exists with numShards=1
[junit4:junit4]   2> 9995 T3694 oasc.Overseer$ClusterStateUpdater.updateState Assigning new node to shard shard=shard1
[junit4:junit4]   2> 10009 T3744 oascc.ZkStateReader$2.process A cluster state change: WatchedEvent state:SyncConnected type:NodeDataChanged path:/clusterstate.json, has occurred - updating... (live nodes size: 4)
[junit4:junit4]   2> 10009 T3727 oascc.ZkStateReader$2.process A cluster state change: WatchedEvent state:SyncConnected type:NodeDataChanged path:/clusterstate.json, has occurred - updating... (live nodes size: 4)
[junit4:junit4]   2> 10009 T3712 oascc.ZkStateReader$2.process A cluster state change: WatchedEvent state:SyncConnected type:NodeDataChanged path:/clusterstate.json, has occurred - updating... (live nodes size: 4)
[junit4:junit4]   2> 10009 T3693 oascc.ZkStateReader$2.process A cluster state change: WatchedEvent state:SyncConnected type:NodeDataChanged path:/clusterstate.json, has occurred - updating... (live nodes size: 4)
[junit4:junit4]   2> 10009 T3699 oascc.ZkStateReader$2.process A cluster state change: WatchedEvent state:SyncConnected type:NodeDataChanged path:/clusterstate.json, has occurred - updating... (live nodes size: 4)
[junit4:junit4]   2> 10577 T3745 oasc.CoreContainer.registerCore registering core: collection1
[junit4:junit4]   2> 10577 T3745 oasc.ZkController.register Register replica - core:collection1 address:http://127.0.0.1:55278/om_z collection:collection1 shard:shard1
[junit4:junit4]   2> 10580 T3745 oasc.ZkController.register We are http://127.0.0.1:55278/om_z/collection1/ and leader is http://127.0.0.1:55270/om_z/collection1/
[junit4:junit4]   2> 10581 T3745 oasc.ZkController.register No LogReplay needed for core=collection1 baseURL=http://127.0.0.1:55278/om_z
[junit4:junit4]   2> 10581 T3745 oasc.ZkController.checkRecovery Core needs to recover:collection1
[junit4:junit4]   2> 10581 T3745 oasu.DefaultSolrCoreState.doRecovery Running recovery - first canceling any ongoing recovery
[junit4:junit4]   2> ASYNC  NEW_CORE C180 name=collection1 org.apache.solr.core.SolrCore@78359ea url=http://127.0.0.1:55278/om_z/collection1 node=127.0.0.1:55278_om_z C180_STATE=coll:collection1 core:collection1 props:{shard=null, roles=null, state=down, core=collection1, collection=collection1, node_name=127.0.0.1:55278_om_z, base_url=http://127.0.0.1:55278/om_z}
[junit4:junit4]   2> 10582 T3747 C180 P55278 oasc.RecoveryStrategy.run Starting recovery process.  core=collection1 recoveringAfterStartup=true
[junit4:junit4]   2> 10582 T3745 oascc.ZkStateReader.updateClusterState Updating cloud state from ZooKeeper... 
[junit4:junit4]   2> 10583 T3747 C180 P55278 oasc.RecoveryStrategy.doRecovery ###### startupVersions=[]
[junit4:junit4]   2> 10583 T3747 C180 P55278 oasc.ZkController.publish publishing core=collection1 state=recovering
[junit4:junit4]   2> 10584 T3747 C180 P55278 oasc.ZkController.publish numShards not found on descriptor - reading it from system property
[junit4:junit4]   2> 10585 T3747 C180 P55278 oasc.RecoveryStrategy.doRecovery Attempting to PeerSync from http://127.0.0.1:55270/om_z/collection1/ core=collection1 - recoveringAfterStartup=true
[junit4:junit4]   2> 10585 T3747 C180 P55278 oasu.PeerSync.sync PeerSync: core=collection1 url=http://127.0.0.1:55278/om_z START replicas=[http://127.0.0.1:55270/om_z/collection1/] nUpdates=100
[junit4:junit4]   2> 10585 T3671 oass.SolrDispatchFilter.init user.dir=/usr/home/hudson/hudson-slave/workspace/Lucene-Solr-Tests-4.x-java7/solr/build/solr-core/test/J1
[junit4:junit4]   2> 10586 T3747 C180 P55278 oasu.PeerSync.sync WARNING no frame of reference to tell of we've missed updates
[junit4:junit4]   2> 10586 T3747 C180 P55278 oasc.RecoveryStrategy.doRecovery PeerSync Recovery was not successful - trying replication. core=collection1
[junit4:junit4]   2> 10587 T3747 C180 P55278 oasc.RecoveryStrategy.doRecovery Starting Replication Recovery. core=collection1
[junit4:junit4]   2> 10586 T3671 oass.SolrDispatchFilter.init SolrDispatchFilter.init() done
[junit4:junit4]   2> 10587 T3747 C180 P55278 oascsi.HttpClientUtil.createClient Creating new http client, config:maxConnections=128&maxConnectionsPerHost=32&followRedirects=false
[junit4:junit4]   2> 10587 T3671 oascsi.HttpClientUtil.createClient Creating new http client, config:maxConnections=128&maxConnectionsPerHost=32&followRedirects=false
[junit4:junit4]   2> 10588 T3702 C179 P55270 REQ /get {distrib=false&qt=/get&wt=javabin&version=2&getVersions=100} status=0 QTime=0 
[junit4:junit4]   2> 10767 T3671 oejs.Server.doStart jetty-8.1.8.v20121106
[junit4:junit4]   2> 10771 T3671 oejs.AbstractConnector.doStart Started SocketConnector@127.0.0.1:55282
[junit4:junit4]   2> 10772 T3671 oasc.SolrResourceLoader.locateSolrHome JNDI not configured for solr (NoInitialContextEx)
[junit4:junit4]   2> 10773 T3671 oasc.SolrResourceLoader.locateSolrHome using system property solr.solr.home: /usr/home/hudson/hudson-slave/workspace/Lucene-Solr-Tests-4.x-java7/solr/build/solr-core/test/J1/./org.apache.solr.cloud.SyncSliceTest-jetty4-1356024827151
[junit4:junit4]   2> 10774 T3671 oasc.SolrResourceLoader.<init> new SolrResourceLoader for deduced Solr Home: '/usr/home/hudson/hudson-slave/workspace/Lucene-Solr-Tests-4.x-java7/solr/build/solr-core/test/J1/./org.apache.solr.cloud.SyncSliceTest-jetty4-1356024827151/'
[junit4:junit4]   2> 10817 T3671 oass.SolrDispatchFilter.init SolrDispatchFilter.init()
[junit4:junit4]   2> 10819 T3671 oasc.SolrResourceLoader.locateSolrHome JNDI not configured for solr (NoInitialContextEx)
[junit4:junit4]   2> 10820 T3671 oasc.SolrResourceLoader.locateSolrHome using system property solr.solr.home: /usr/home/hudson/hudson-slave/workspace/Lucene-Solr-Tests-4.x-java7/solr/build/solr-core/test/J1/./org.apache.solr.cloud.SyncSliceTest-jetty4-1356024827151
[junit4:junit4]   2> 10821 T3671 oasc.CoreContainer$Initializer.initialize looking for solr.xml: /usr/home/hudson/hudson-slave/workspace/Lucene-Solr-Tests-4.x-java7/solr/build/solr-core/test/J1/./org.apache.solr.cloud.SyncSliceTest-jetty4-1356024827151/solr.xml
[junit4:junit4]   2> 10821 T3671 oasc.CoreContainer.<init> New CoreContainer 1162175276
[junit4:junit4]   2> 10822 T3671 oasc.CoreContainer.load Loading CoreContainer using Solr Home: '/usr/home/hudson/hudson-slave/workspace/Lucene-Solr-Tests-4.x-java7/solr/build/solr-core/test/J1/./org.apache.solr.cloud.SyncSliceTest-jetty4-1356024827151/'
[junit4:junit4]   2> 10823 T3671 oasc.SolrResourceLoader.<init> new SolrResourceLoader for directory: '/usr/home/hudson/hudson-slave/workspace/Lucene-Solr-Tests-4.x-java7/solr/build/solr-core/test/J1/./org.apache.solr.cloud.SyncSliceTest-jetty4-1356024827151/'
[junit4:junit4]   2> 10853 T3671 oashc.HttpShardHandlerFactory.getParameter Setting socketTimeout to: 30000
[junit4:junit4]   2> 10854 T3671 oashc.HttpShardHandlerFactory.getParameter Setting urlScheme to: http://
[junit4:junit4]   2> 10855 T3671 oashc.HttpShardHandlerFactory.getParameter Setting connTimeout to: 15000
[junit4:junit4]   2> 10856 T3671 oashc.HttpShardHandlerFactory.getParameter Setting maxConnectionsPerHost to: 20
[junit4:junit4]   2> 10857 T3671 oashc.HttpShardHandlerFactory.getParameter Setting corePoolSize to: 0
[junit4:junit4]   2> 10858 T3671 oashc.HttpShardHandlerFactory.getParameter Setting maximumPoolSize to: 2147483647
[junit4:junit4]   2> 10859 T3671 oashc.HttpShardHandlerFactory.getParameter Setting maxThreadIdleTime to: 5
[junit4:junit4]   2> 10860 T3671 oashc.HttpShardHandlerFactory.getParameter Setting sizeOfQueue to: -1
[junit4:junit4]   2> 10861 T3671 oashc.HttpShardHandlerFactory.getParameter Setting fairnessPolicy to: false
[junit4:junit4]   2> 10861 T3671 oascsi.HttpClientUtil.createClient Creating new http client, config:maxConnectionsPerHost=20&maxConnections=10000&socketTimeout=30000&connTimeout=15000&retry=false
[junit4:junit4]   2> 10883 T3671 oasc.CoreContainer.load Registering Log Listener
[junit4:junit4]   2> 10904 T3671 oasc.CoreContainer.initZooKeeper Zookeeper client=127.0.0.1:55263/solr
[junit4:junit4]   2> 10906 T3671 oasc.ZkController.checkChrootPath zkHost includes chroot
[junit4:junit4]   2> 10907 T3671 oaz.ZooKeeper.<init> Initiating client connection, connectString=127.0.0.1:55263 sessionTimeout=60000 watcher=org.apache.solr.common.cloud.ConnectionManager@57a245bd
[junit4:junit4]   2> 10909 T3758 oaz.ClientCnxn$SendThread.logStartConnect Opening socket connection to server localhost/127.0.0.1:55263. Will not attempt to authenticate using SASL (access denied ("javax.security.auth.AuthPermission" "getLoginConfiguration"))
[junit4:junit4]   2> 10908 T3671 oascc.ConnectionManager.waitForConnected Waiting for client to connect to ZooKeeper
[junit4:junit4]   2> 10909 T3758 oaz.ClientCnxn$SendThread.primeConnection Socket connection established to localhost/127.0.0.1:55263, initiating session
[junit4:junit4]   2> 10909 T3673 oazs.NIOServerCnxnFactory.run Accepted socket connection from /140.211.11.196:55283
[junit4:junit4]   2> 10910 T3673 oazs.ZooKeeperServer.processConnectRequest Client attempting to establish new session at /140.211.11.196:55283
[junit4:junit4]   2> 10912 T3675 oazs.ZooKeeperServer.finishSessionInit Established session 0x13bb960a3b5000b with negotiated timeout 20000 for client /140.211.11.196:55283
[junit4:junit4]   2> 10912 T3758 oaz.ClientCnxn$SendThread.onConnected Session establishment complete on server localhost/127.0.0.1:55263, sessionid = 0x13bb960a3b5000b, negotiated timeout = 20000
[junit4:junit4]   2> 10913 T3759 oascc.ConnectionManager.process Watcher org.apache.solr.common.cloud.ConnectionManager@57a245bd name:ZooKeeperConnection Watcher:127.0.0.1:55263 got event WatchedEvent state:SyncConnected type:None path:null path:null type:None
[junit4:junit4]   2> 10913 T3671 oascc.ConnectionManager.waitForConnected Client is connected to ZooKeeper
[junit4:junit4]   2> 10915 T3676 oazs.PrepRequestProcessor.pRequest2Txn Processed session termination for sessionid: 0x13bb960a3b5000b
[junit4:junit4]   2> 10928 T3759 oaz.ClientCnxn$EventThread.run EventThread shut down
[junit4:junit4]   2> 10928 T3673 oazs.NIOServerCnxn.closeSock Closed socket connection for client /140.211.11.196:55283 which had sessionid 0x13bb960a3b5000b
[junit4:junit4]   2> 10928 T3671 oaz.ZooKeeper.close Session: 0x13bb960a3b5000b closed
[junit4:junit4]   2> 10929 T3671 oascsi.HttpClientUtil.createClient Creating new http client, config:maxConnections=500&maxConnectionsPerHost=16&socketTimeout=15000&connTimeout=30000
[junit4:junit4]   2> 10939 T3671 oaz.ZooKeeper.<init> Initiating client connection, connectString=127.0.0.1:55263/solr sessionTimeout=30000 watcher=org.apache.solr.common.cloud.ConnectionManager@3ee3158a
[junit4:junit4]   2> 10941 T3760 oaz.ClientCnxn$SendThread.logStartConnect Opening socket connection to server localhost/127.0.0.1:55263. Will not attempt to authenticate using SASL (access denied ("javax.security.auth.AuthPermission" "getLoginConfiguration"))
[junit4:junit4]   2> 10941 T3760 oaz.ClientCnxn$SendThread.primeConnection Socket connection established to localhost/127.0.0.1:55263, initiating session
[junit4:junit4]   2> 10941 T3673 oazs.NIOServerCnxnFactory.run Accepted socket connection from /140.211.11.196:55284
[junit4:junit4]   2> 10940 T3671 oascc.ConnectionManager.waitForConnected Waiting for client to connect to ZooKeeper
[junit4:junit4]   2> 10942 T3673 oazs.ZooKeeperServer.processConnectRequest Client attempting to establish new session at /140.211.11.196:55284
[junit4:junit4]   2> 10943 T3675 oazs.ZooKeeperServer.finishSessionInit Established session 0x13bb960a3b5000c with negotiated timeout 20000 for client /140.211.11.196:55284
[junit4:junit4]   2> 10943 T3760 oaz.ClientCnxn$SendThread.onConnected Session establishment complete on server localhost/127.0.0.1:55263, sessionid = 0x13bb960a3b5000c, negotiated timeout = 20000
[junit4:junit4]   2> 10944 T3761 oascc.ConnectionManager.process Watcher org.apache.solr.common.cloud.ConnectionManager@3ee3158a name:ZooKeeperConnection Watcher:127.0.0.1:55263/solr got event WatchedEvent state:SyncConnected type:None path:null path:null type:None
[junit4:junit4]   2> 10944 T3671 oascc.ConnectionManager.waitForConnected Client is connected to ZooKeeper
[junit4:junit4]   2> 10945 T3676 oazs.PrepRequestProcessor.pRequest Got user-level KeeperException when processing sessionid:0x13bb960a3b5000c type:create cxid:0x1 zxid:0x93 txntype:-1 reqpath:n/a Error Path:/solr/overseer Error:KeeperErrorCode = NodeExists for /solr/overseer
[junit4:junit4]   2> 10947 T3676 oazs.PrepRequestProcessor.pRequest Got user-level KeeperException when processing sessionid:0x13bb960a3b5000c type:create cxid:0x2 zxid:0x94 txntype:-1 reqpath:n/a Error Path:/solr/overseer Error:KeeperErrorCode = NodeExists for /solr/overseer
[junit4:junit4]   2> 10948 T3671 oasc.ZkController.createEphemeralLiveNode Register node as live in ZooKeeper:/live_nodes/127.0.0.1:55282_om_z
[junit4:junit4]   2> 10949 T3676 oazs.PrepRequestProcessor.pRequest Got user-level KeeperException when processing sessionid:0x13bb960a3b5000c type:delete cxid:0x4 zxid:0x95 txntype:-1 reqpath:n/a Error Path:/solr/live_nodes/127.0.0.1:55282_om_z Error:KeeperErrorCode = NoNode for /solr/live_nodes/127.0.0.1:55282_om_z
[junit4:junit4]   2> 10956 T3671 oascc.SolrZkClient.makePath makePath: /live_nodes/127.0.0.1:55282_om_z
[junit4:junit4]   2> 10959 T3699 oascc.ZkStateReader$2.process A cluster state change: WatchedEvent state:SyncConnected type:NodeChildrenChanged path:/live_nodes, has occurred - updating... (live nodes size: 4)
[junit4:junit4]   2> 10959 T3712 oascc.ZkStateReader$2.process A cluster state change: WatchedEvent state:SyncConnected type:NodeChildrenChanged path:/live_nodes, has occurred - updating... (live nodes size: 4)
[junit4:junit4]   2> 10959 T3727 oascc.ZkStateReader$2.process A cluster state change: WatchedEvent state:SyncConnected type:NodeChildrenChanged path:/live_nodes, has occurred - updating... (live nodes size: 4)
[junit4:junit4]   2> 10959 T3744 oascc.ZkStateReader$3.process Updating live nodes... (5)
[junit4:junit4]   2> 10959 T3693 oascc.ZkStateReader$2.process A cluster state change: WatchedEvent state:SyncConnected type:NodeChildrenChanged path:/live_nodes, has occurred - updating... (live nodes size: 4)
[junit4:junit4]   2> 10960 T3744 oascc.ZkStateReader$2.process A cluster state change: WatchedEvent state:SyncConnected type:NodeChildrenChanged path:/live_nodes, has occurred - updating... (live nodes size: 5)
[junit4:junit4]   2> 10961 T3699 oascc.ZkStateReader$3.process Updating live nodes... (5)
[junit4:junit4]   2> 10961 T3727 oascc.ZkStateReader$3.process Updating live nodes... (5)
[junit4:junit4]   2> 10961 T3712 oascc.ZkStateReader$3.process Updating live nodes... (5)
[junit4:junit4]   2> 10962 T3693 oascc.ZkStateReader$3.process Updating live nodes... (5)
[junit4:junit4]   2> 10962 T3671 oascc.ZkStateReader.createClusterStateWatchersAndUpdate Updating cluster state from ZooKeeper... 
[junit4:junit4]   2> 10970 T3762 oasc.CoreContainer.create Creating SolrCore 'collection1' using instanceDir: /usr/home/hudson/hudson-slave/workspace/Lucene-Solr-Tests-4.x-java7/solr/build/solr-core/test/J1/./org.apache.solr.cloud.SyncSliceTest-jetty4-1356024827151/collection1
[junit4:junit4]   2> 10971 T3762 oasc.ZkController.createCollectionZkNode Check for collection zkNode:collection1
[junit4:junit4]   2> 10971 T3762 oasc.ZkController.createCollectionZkNode Collection zkNode exists
[junit4:junit4]   2> 10971 T3762 oasc.ZkController.readConfigName Load collection config from:/collections/collection1
[junit4:junit4]   2> 10973 T3762 oasc.SolrResourceLoader.<init> new SolrResourceLoader for directory: '/usr/home/hudson/hudson-slave/workspace/Lucene-Solr-Tests-4.x-java7/solr/build/solr-core/test/J1/./org.apache.solr.cloud.SyncSliceTest-jetty4-1356024827151/collection1/'
[junit4:junit4]   2> 10973 T3762 oasc.SolrResourceLoader.replaceClassLoader Adding 'file:/usr/home/hudson/hudson-slave/workspace/Lucene-Solr-Tests-4.x-java7/solr/build/solr-core/test/J1/org.apache.solr.cloud.SyncSliceTest-jetty4-1356024827151/collection1/lib/classes/' to classloader
[junit4:junit4]   2> 10974 T3762 oasc.SolrResourceLoader.replaceClassLoader Adding 'file:/usr/home/hudson/hudson-slave/workspace/Lucene-Solr-Tests-4.x-java7/solr/build/solr-core/test/J1/org.apache.solr.cloud.SyncSliceTest-jetty4-1356024827151/collection1/lib/README' to classloader
[junit4:junit4]   2> 11010 T3762 oasc.SolrConfig.<init> Using Lucene MatchVersion: LUCENE_41
[junit4:junit4]   2> 11015 T3694 oascc.ZkStateReader.updateClusterState Updating cloud state from ZooKeeper... 
[junit4:junit4]   2> 11016 T3694 oasc.Overseer$ClusterStateUpdater.updateState Update state numShards=1 message={
[junit4:junit4]   2> 	  "operation":"state",
[junit4:junit4]   2> 	  "numShards":"1",
[junit4:junit4]   2> 	  "shard":"shard1",
[junit4:junit4]   2> 	  "roles":null,
[junit4:junit4]   2> 	  "state":"recovering",
[junit4:junit4]   2> 	  "core":"collection1",
[junit4:junit4]   2> 	  "collection":"collection1",
[junit4:junit4]   2> 	  "node_name":"127.0.0.1:55278_om_z",
[junit4:junit4]   2> 	  "base_url":"http://127.0.0.1:55278/om_z"}
[junit4:junit4]   2> 11021 T3727 oascc.ZkStateReader$2.process A cluster state change: WatchedEvent state:SyncConnected type:NodeDataChanged path:/clusterstate.json, has occurred - updating... (live nodes size: 5)
[junit4:junit4]   2> 11021 T3699 oascc.ZkStateReader$2.process A cluster state change: WatchedEvent state:SyncConnected type:NodeDataChanged path:/clusterstate.json, has occurred - updating... (live nodes size: 5)
[junit4:junit4]   2> 11021 T3744 oascc.ZkStateReader$2.process A cluster state change: WatchedEvent state:SyncConnected type:NodeDataChanged path:/clusterstate.json, has occurred - updating... (live nodes size: 5)
[junit4:junit4]   2> 11021 T3693 oascc.ZkStateReader$2.process A cluster state change: WatchedEvent state:SyncConnected type:NodeDataChanged path:/clusterstate.json, has occurred - updating... (live nodes size: 5)
[junit4:junit4]   2> 11021 T3761 oascc.ZkStateReader$2.process A cluster state change: WatchedEvent state:SyncConnected type:NodeDataChanged path:/clusterstate.json, has occurred - updating... (live nodes size: 5)
[junit4:junit4]   2> 11021 T3712 oascc.ZkStateReader$2.process A cluster state change: WatchedEvent state:SyncConnected type:NodeDataChanged path:/clusterstate.json, has occurred - updating... (live nodes size: 5)
[junit4:junit4]   2> 11059 T3762 oasc.SolrConfig.<init> Loaded SolrConfig: solrconfig.xml
[junit4:junit4]   2> 11159 T3762 oass.IndexSchema.readSchema Reading Solr Schema
[junit4:junit4]   2> 11164 T3762 oass.IndexSchema.readSchema Schema name=test
[junit4:junit4]   2>  C178_STATE=coll:collection1 core:collection1 props:{shard=shard1, roles=null, state=recovering, core=collection1, collection=collection1, node_name=127.0.0.1:55273_om_z, base_url=http://127.0.0.1:55273/om_z}
[junit4:junit4]   2> 11356 T3730 C178 P55273 oasc.RecoveryStrategy.doRecovery Begin buffering updates. core=collection1
[junit4:junit4]   2> 11356 T3730 C178 P55273 oasu.UpdateLog.bufferUpdates Starting to buffer updates. FSUpdateLog{state=ACTIVE, tlog=null}
[junit4:junit4]   2> 11357 T3730 C178 P55273 oasc.RecoveryStrategy.replicate Attempting to replicate from http://127.0.0.1:55270/om_z/collection1/. core=collection1
[junit4:junit4]   2> 11357 T3730 C178 P55273 oascsi.HttpClientUtil.createClient Creating new http client, config:maxConnections=128&maxConnectionsPerHost=32&followRedirects=false
[junit4:junit4]   2> 11368 T3705 C179 P55270 oasu.DirectUpdateHandler2.commit start commit{flags=0,_version_=0,optimize=false,openSearcher=false,waitSearcher=true,expungeDeletes=false,softCommit=false}
[junit4:junit4]   2> 11371 T3705 C179 P55270 oasc.CachingDirectoryFactory.close Releasing directory:/usr/home/hudson/hudson-slave/workspace/Lucene-Solr-Tests-4.x-java7/solr/build/solr-core/test/J1/./org.apache.solr.cloud.SyncSliceTest-1356024816556/jetty1
[junit4:junit4]   2> 11376 T3705 C179 P55270 oasc.SolrDeletionPolicy.onInit SolrDeletionPolicy.onInit: commits:num=1
[junit4:junit4]   2> 		commit{dir=RateLimitedDirectoryWrapper(NRTCachingDirectory(org.apache.lucene.store.NIOFSDirectory@/usr/home/hudson/hudson-slave/workspace/Lucene-Solr-Tests-4.x-java7/solr/build/solr-core/test/J1/org.apache.solr.cloud.SyncSliceTest-1356024816556/jetty1/index lockFactory=org.apache.lucene.store.NativeFSLockFactory@53e8d0f5; maxCacheMB=48.0 maxMergeSizeMB=4.0)),segFN=segments_1,generation=1,filenames=[segments_1]
[junit4:junit4]   2> 11377 T3705 C179 P55270 oasc.SolrDeletionPolicy.updateCommits newest commit = 1[segments_1]
[junit4:junit4]   2> 11382 T3705 C179 P55270 oasc.SolrDeletionPolicy.onCommit SolrDeletionPolicy.onCommit: commits:num=2
[junit4:junit4]   2> 		commit{dir=RateLimitedDirectoryWrapper(NRTCachingDirectory(org.apache.lucene.store.NIOFSDirectory@/usr/home/hudson/hudson-slave/workspace/Lucene-Solr-Tests-4.x-java7/solr/build/solr-core/test/J1/org.apache.solr.cloud.SyncSliceTest-1356024816556/jetty1/index lockFactory=org.apache.lucene.store.NativeFSLockFactory@53e8d0f5; maxCacheMB=48.0 maxMergeSizeMB=4.0)),segFN=segments_1,generation=1,filenames=[segments_1]
[junit4:junit4]   2> 		commit{dir=RateLimitedDirectoryWrapper(NRTCachingDirectory(org.apache.lucene.store.NIOFSDirectory@/usr/home/hudson/hudson-slave/workspace/Lucene-Solr-Tests-4.x-java7/solr/build/solr-core/test/J1/org.apache.solr.cloud.SyncSliceTest-1356024816556/jetty1/index lockFactory=org.apache.lucene.store.NativeFSLockFactory@53e8d0f5; maxCacheMB=48.0 maxMergeSizeMB=4.0)),segFN=segments_2,generation=2,filenames=[segments_2]
[junit4:junit4]   2> 11383 T3705 C179 P55270 oasc.SolrDeletionPolicy.updateCommits newest commit = 2[segments_2]
[junit4:junit4]   2> 11384 T3705 C179 P55270 oasc.CachingDirectoryFactory.close Releasing directory:/usr/home/hudson/hudson-slave/workspace/Lucene-Solr-Tests-4.x-java7/solr/build/solr-core/test/J1/./org.apache.solr.cloud.SyncSliceTest-1356024816556/jetty1
[junit4:junit4]   2> 11385 T3705 C179 P55270 oass.SolrIndexSearcher.<init> Opening Searcher@5cb8dcf5 realtime
[junit4:junit4]   2> 11386 T3705 C179 P55270 oasu.DirectUpdateHandler2.commit end_commit_flush
[junit4:junit4]   2> 11386 T3705 C179 P55270 /update {waitSearcher=true&openSearcher=false&commit=true&commit_end_point=true&wt=javabin&softCommit=false&version=2} {commit=} 0 18
[junit4:junit4]   2> 11388 T3730 C178 P55273 oash.ReplicationHandler.inform Commits will be reserved for  10000
[junit4:junit4]   2> 11388 T3730 C178 P55273 oash.SnapPuller.<init>  No value set for 'pollInterval'. Timer Task not started.
[junit4:junit4]   2> 11392 T3706 C179 P55270 oash.ReplicationHandler.inform Commits will be reserved for  10000
[junit4:junit4]   2> 11392 T3706 C179 P55270 REQ /replication {command=indexversion&wt=javabin&qt=/replication&version=2} status=0 QTime=2 
[junit4:junit4]   2> 11393 T3730 C178 P55273 oash.SnapPuller.fetchLatestIndex Master's generation: 2
[junit4:junit4]   2> 11393 T3730 C178 P55273 oash.SnapPuller.fetchLatestIndex Slave's generation: 1
[junit4:junit4]   2> 11394 T3730 C178 P55273 oash.SnapPuller.fetchLatestIndex Starting replication process
[junit4:junit4]   2> 11396 T3706 C179 P55270 oasc.CachingDirectoryFactory.close Releasing directory:/usr/home/hudson/hudson-slave/workspace/Lucene-Solr-Tests-4.x-java7/solr/build/solr-core/test/J1/./org.apache.solr.cloud.SyncSliceTest-1356024816556/jetty1
[junit4:junit4]   2> 11397 T3706 C179 P55270 oasc.CachingDirectoryFactory.close Releasing directory:/usr/home/hudson/hudson-slave/workspace/Lucene-Solr-Tests-4.x-java7/solr/build/solr-core/test/J1/./org.apache.solr.cloud.SyncSliceTest-1356024816556/jetty1/index
[junit4:junit4]   2> 11398 T3706 C179 P55270 REQ /replication {command=filelist&generation=2&wt=javabin&qt=/replication&version=2} status=0 QTime=2 
[junit4:junit4]   2> 11399 T3730 C178 P55273 oash.SnapPuller.fetchLatestIndex Number of files in latest index in master: 1
[junit4:junit4]   2> 11400 T3730 C178 P55273 oasc.CachingDirectoryFactory.get return new directory for /usr/home/hudson/hudson-slave/workspace/Lucene-Solr-Tests-4.x-java7/solr/build/solr-core/test/J1/./org.apache.solr.cloud.SyncSliceTest-1356024816556/jetty2/index.20121220073347948 forceNew:false
[junit4:junit4]   2> 11401 T3730 C178 P55273 oasc.CachingDirectoryFactory.close Releasing directory:/usr/home/hudson/hudson-slave/workspace/Lucene-Solr-Tests-4.x-java7/solr/build/solr-core/test/J1/./org.apache.solr.cloud.SyncSliceTest-1356024816556/jetty2
[junit4:junit4]   2> 11401 T3730 C178 P55273 oash.SnapPuller.fetchLatestIndex Starting download to RateLimitedDirectoryWrapper(NRTCachingDirectory(org.apache.lucene.store.NIOFSDirectory@/usr/home/hudson/hudson-slave/workspace/Lucene-Solr-Tests-4.x-java7/solr/build/solr-core/test/J1/org.apache.solr.cloud.SyncSliceTest-1356024816556/jetty2/index.20121220073347948 lockFactory=org.apache.lucene.store.NativeFSLockFactory@61c2fd66; maxCacheMB=48.0 maxMergeSizeMB=4.0)) fullCopy=true
[junit4:junit4]   2> 11404 T3706 C179 P55270 REQ /replication {file=segments_2&command=filecontent&checksum=true&generation=2&qt=/replication&wt=filestream} status=0 QTime=0 
[junit4:junit4]   2> 11406 T3730 C178 P55273 oasc.CachingDirectoryFactory.close Releasing directory:/usr/home/hudson/hudson-slave/workspace/Lucene-Solr-Tests-4.x-java7/solr/build/solr-core/test/J1/./org.apache.solr.cloud.SyncSliceTest-1356024816556/jetty2/index
[junit4:junit4]   2> 11406 T3730 C178 P55273 oash.SnapPuller.fetchLatestIndex Total time taken for download : 0 secs
[junit4:junit4]   2> 11406 T3730 C178 P55273 oash.SnapPuller.modifyIndexProps New index installed. Updating index properties... index=index.20121220073347948
[junit4:junit4]   2> 11408 T3730 C178 P55273 oasc.CachingDirectoryFactory.close Releasing directory:/usr/home/hudson/hudson-slave/workspace/Lucene-Solr-Tests-4.x-java7/solr/build/solr-core/test/J1/./org.apache.solr.cloud.SyncSliceTest-1356024816556/jetty2
[junit4:junit4]   2> 11409 T3730 C178 P55273 oasc.CachingDirectoryFactory.close Releasing directory:/usr/home/hudson/hudson-slave/workspace/Lucene-Solr-Tests-4.x-java7/solr/build/solr-core/test/J1/./org.apache.solr.cloud.SyncSliceTest-1356024816556/jetty2
[junit4:junit4]   2> 11409 T3730 C178 P55273 oasc.SolrCore.getNewIndexDir New index directory detected: old=./org.apache.solr.cloud.SyncSliceTest-1356024816556/jetty2/index/ new=./org.apache.solr.cloud.SyncSliceTest-1356024816556/jetty2/index.20121220073347948
[junit4:junit4]   2> 11413 T3730 C178 P55273 oasc.SolrDeletionPolicy.onInit SolrDeletionPolicy.onInit: commits:num=1
[junit4:junit4]   2> 		commit{dir=RateLimitedDirectoryWrapper(NRTCachingDirectory(org.apache.lucene.store.NIOFSDirectory@/usr/home/hudson/hudson-slave/workspace/Lucene-Solr-Tests-4.x-java7/solr/build/solr-core/test/J1/org.apache.solr.cloud.SyncSliceTest-1356024816556/jetty2/index.20121220073347948 lockFactory=org.apache.lucene.store.NativeFSLockFactory@61c2fd66; maxCacheMB=48.0 maxMergeSizeMB=4.0)),segFN=segments_2,generation=2,filenames=[segments_2]
[junit4:junit4]   2> 11414 T3730 C178 P55273 oasc.SolrDeletionPolicy.updateCommits newest commit = 2[segments_2]
[junit4:junit4]   2> 11415 T3730 C178 P55273 oasc.CachingDirectoryFactory.close Releasing directory:/usr/home/hudson/hudson-slave/workspace/Lucene-Solr-Tests-4.x-java7/solr/build/solr-core/test/J1/./org.apache.solr.cloud.SyncSliceTest-1356024816556/jetty2
[junit4:junit4]   2> 11416 T3730 C178 P55273 oasu.DefaultSolrCoreState.newIndexWriter Creating new IndexWriter...
[junit4:junit4]   2> 11416 T3730 C178 P55273 oasu.DefaultSolrCoreState.newIndexWriter Waiting until IndexWriter is unused... core=collection1
[junit4:junit4]   2> 11416 T3730 C178 P55273 oasu.DefaultSolrCoreState.newIndexWriter Rollback old IndexWriter... core=collection1
[junit4:junit4]   2> 11417 T3730 C178 P55273 oasc.CachingDirectoryFactory.close Releasing directory:/usr/home/hudson/hudson-slave/workspace/Lucene-Solr-Tests-4.x-java7/solr/build/solr-core/test/J1/./org.apache.solr.cloud.SyncSliceTest-1356024816556/jetty2/index.20121220073347948
[junit4:junit4]   2> 11418 T3730 C178 P55273 oasc.CachingDirectoryFactory.close Releasing directory:/usr/home/hudson/hudson-slave/workspace/Lucene-Solr-Tests-4.x-java7/solr/build/solr-core/test/J1/./org.apache.solr.cloud.SyncSliceTest-1356024816556/jetty2
[junit4:junit4]   2> 11422 T3730 C178 P55273 oasc.SolrDeletionPolicy.onInit SolrDeletionPolicy.onInit: commits:num=1
[junit4:junit4]   2> 		commit{dir=RateLimitedDirectoryWrapper(NRTCachingDirectory(org.apache.lucene.store.NIOFSDirectory@/usr/home/hudson/hudson-slave/workspace/Lucene-Solr-Tests-4.x-java7/solr/build/solr-core/test/J1/org.apache.solr.cloud.SyncSliceTest-1356024816556/jetty2/index.20121220073347948 lockFactory=org.apache.lucene.store.NativeFSLockFactory@61c2fd66; maxCacheMB=48.0 maxMergeSizeMB=4.0)),segFN=segments_2,generation=2,filenames=[segments_2]
[junit4:junit4]   2> 11423 T3730 C178 P55273 oasc.SolrDeletionPolicy.updateCommits newest commit = 2[segments_2]
[junit4:junit4]   2> 11423 T3730 C178 P55273 oasu.DefaultSolrCoreState.newIndexWriter New IndexWriter is ready to be used.
[junit4:junit4]   2> 11424 T3730 C178 P55273 oasc.CachingDirectoryFactory.close Releasing directory:/usr/home/hudson/hudson-slave/workspace/Lucene-Solr-Tests-4.x-java7/solr/build/solr-core/test/J1/./org.apache.solr.cloud.SyncSliceTest-1356024816556/jetty2
[junit4:junit4]   2> 11424 T3730 C178 P55273 oass.SolrIndexSearcher.<init> Opening Searcher@19eab75b main
[junit4:junit4]   2> 11426 T3729 oasc.SolrCore.registerSearcher [collection1] Registered new searcher Searcher@19eab75b main{StandardDirectoryReader(segments_2:1:nrt)}
[junit4:junit4]   2> 11427 T3729 oasc.CachingDirectoryFactory.close Releasing directory:/usr/home/hudson/hudson-slave/workspace/Lucene-Solr-Tests-4.x-java7/solr/build/solr-core/test/J1/./org.apache.solr.cloud.SyncSliceTest-1356024816556/jetty2/index
[junit4:junit4]   2> 11427 T3730 C178 P55273 oasu.DirectUpdateHandler2.commit start commit{flags=0,_version_=0,optimize=false,openSearcher=false,waitSearcher=false,expungeDeletes=false,softCommit=false}
[junit4:junit4]   2> 11431 T3730 C178 P55273 oasc.SolrDeletionPolicy.onCommit SolrDeletionPolicy.onCommit: commits:num=2
[junit4:junit4]   2> 		commit{dir=RateLimitedDirectoryWrapper(NRTCachingDirectory(org.apache.lucene.store.NIOFSDirectory@/usr/home/hudson/hudson-slave/workspace/Lucene-Solr-Tests-4.x-java7/solr/build/solr-core/test/J1/org.apache.solr.cloud.SyncSliceTest-1356024816556/jetty2/index.20121220073347948 lockFactory=org.apache.lucene.store.NativeFSLockFactory@61c2fd66; maxCacheMB=48.0 maxMergeSizeMB=4.0)),segFN=segments_2,generation=2,filenames=[segments_2]
[junit4:junit4]   2> 		commit{dir=RateLimitedDirectoryWrapper(NRTCachingDirectory(org.apache.lucene.store.NIOFSDirectory@/usr/home/hudson/hudson-slave/workspace/Lucene-Solr-Tests-4.x-java7/solr/build/solr-core/test/J1/org.apache.solr.cloud.SyncSliceTest-1356024816556/jetty2/index.20121220073347948 lockFactory=org.apache.lucene.store.NativeFSLockFactory@61c2fd66; maxCacheMB=48.0 maxMergeSizeMB=4.0)),segFN=segments_3,generation=3,filenames=[segments_3]
[junit4:junit4]   2> 11431 T3730 C178 P55273 oasc.SolrDeletionPolicy.updateCommits newest commit = 3[segments_3]
[junit4:junit4]   2> 11433 T3730 C178 P55273 oasc.CachingDirectoryFactory.close Releasing directory:/usr/home/hudson/hudson-slave/workspace/Lucene-Solr-Tests-4.x-java7/solr/build/solr-core/test/J1/./org.apache.solr.cloud.SyncSliceTest-1356024816556/jetty2
[junit4:junit4]   2> 11433 T3730 C178 P55273 oasu.DirectUpdateHandler2.commit end_commit_flush
[junit4:junit4]   2> 11434 T3730 C178 P55273 oasc.CachingDirectoryFactory.close Releasing directory:/usr/home/hudson/hudson-slave/workspace/Lucene-Solr-Tests-4.x-java7/solr/build/solr-core/test/J1/./org.apache.solr.cloud.SyncSliceTest-1356024816556/jetty2/index.20121220073347948
[junit4:junit4]   2> 11434 T3730 C178 P55273 oasc.CachingDirectoryFactory.close Releasing directory:/usr/home/hudson/hudson-slave/workspace/Lucene-Solr-Tests-4.x-java7/solr/build/solr-core/test/J1/./org.apache.solr.cloud.SyncSliceTest-1356024816556/jetty2/index
[junit4:junit4]   2> 11434 T3730 C178 P55273 oasc.RecoveryStrategy.replay No replay needed. core=collection1
[junit4:junit4]   2> 11434 T3730 C178 P55273 oasc.RecoveryStrategy.doRecovery Replication Recovery was successful - registering as Active. core=collection1
[junit4:junit4]   2> 11435 T3730 C178 P55273 oasc.ZkController.publish publishing core=collection1 state=active
[junit4:junit4]   2> 11435 T3730 C178 P55273 oasc.ZkController.publish numShards not found on descriptor - reading it from system property
[junit4:junit4]   2> 11436 T3730 C178 P55273 oasc.RecoveryStrategy.doRecovery Finished recovery process. core=collection1
[junit4:junit4]   2> 11531 T3694 oascc.ZkStateReader.updateClusterState Updating cloud state from ZooKeeper... 
[junit4:junit4]   2> 11532 T3694 oasc.Overseer$ClusterStateUpdater.updateState Update state numShards=1 message={
[junit4:junit4]   2> 	  "operation":"state",
[junit4:junit4]   2> 	  "numShards":"1",
[junit4:junit4]   2> 	  "shard":"shard1",
[junit4:junit4]   2> 	  "roles":null,
[junit4:junit4]   2> 	  "state":"active",
[junit4:junit4]   2> 	  "core":"collection1",
[junit4:junit4]   2> 	  "collection":"collection1",
[junit4:junit4]   2> 	  "node_name":"127.0.0.1:55273_om_z",
[junit4:junit4]   2> 	  "base_url":"http://127.0.0.1:55273/om_z"}
[junit4:junit4]   2> 11545 T3744 oascc.ZkStateReader$2.process A cluster state change: WatchedEvent state:SyncConnected type:NodeDataChanged path:/clusterstate.json, has occurred - updating... (live nodes size: 5)
[junit4:junit4]   2> 11545 T3761 oascc.ZkStateReader$2.process A cluster state change: WatchedEvent state:SyncConnected type:NodeDataChanged path:/clusterstate.json, has occurred - updating... (live nodes size: 5)
[junit4:junit4]   2> 11545 T3693 oascc.ZkStateReader$2.process A cluster state change: WatchedEvent state:SyncConnected type:NodeDataChanged path:/clusterstate.json, has occurred - updating... (live nodes size: 5)
[junit4:junit4]   2> 11545 T3712 oascc.ZkStateReader$2.process A cluster state change: WatchedEvent state:SyncConnected type:NodeDataChanged path:/clusterstate.json, has occurred - updating... (live nodes size: 5)
[junit4:junit4]   2> 11545 T3699 oascc.ZkStateReader$2.process A cluster state change: WatchedEvent state:SyncConnected type:NodeDataChanged path:/clusterstate.json, has occurred - updating... (live nodes size: 5)
[junit4:junit4]   2> 11545 T3727 oascc.ZkStateReader$2.process A cluster state change: WatchedEvent state:SyncConnected type:NodeDataChanged path:/clusterstate.json, has occurred - updating... (live nodes size: 5)
[junit4:junit4]   2> 11695 T3762 oass.OpenExchangeRatesOrgProvider.init Initialized with rates=open-exchange-rates.json, refreshInterval=1440.
[junit4:junit4]   2> 11708 T3762 oass.IndexSchema.readSchema default search field in schema is text
[junit4:junit4]   2> 11713 T3762 oass.IndexSchema.readSchema unique key field: id
[junit4:junit4]   2> 11725 T3762 oass.FileExchangeRateProvider.reload Reloading exchange rates from file currency.xml
[junit4:junit4]   2> 11742 T3762 oass.FileExchangeRateProvider.reload Reloading exchange rates from file currency.xml
[junit4:junit4]   2> 11747 T3762 oass.OpenExchangeRatesOrgProvider.reload Reloading exchange rates from open-exchange-rates.json
[junit4:junit4]   2> 11748 T3762 oass.OpenExchangeRatesOrgProvider.reload Reloading exchange rates from open-exchange-rates.json
[junit4:junit4]   2> 11749 T3762 oasc.SolrCore.<init> [collection1] Opening new SolrCore at /usr/home/hudson/hudson-slave/workspace/Lucene-Solr-Tests-4.x-java7/solr/build/solr-core/test/J1/./org.apache.solr.cloud.SyncSliceTest-jetty4-1356024827151/collection1/, dataDir=./org.apache.solr.cloud.SyncSliceTest-1356024816556/jetty4/
[junit4:junit4]   2> 11749 T3762 oasc.JmxMonitoredMap.<init> JMX monitoring is enabled. Adding Solr mbeans to JMX Server: com.sun.jmx.mbeanserver.JmxMBeanServer@45ad71f0
[junit4:junit4]   2> 11750 T3762 oasc.SolrCore.initDirectoryFactory solr.NRTCachingDirectoryFactory
[junit4:junit4]   2> 11751 T3762 oasc.CachingDirectoryFactory.get return new directory for /usr/home/hudson/hudson-slave/workspace/Lucene-Solr-Tests-4.x-java7/solr/build/solr-core/test/J1/./org.apache.solr.cloud.SyncSliceTest-1356024816556/jetty4 forceNew:false
[junit4:junit4]   2> 11752 T3762 oasc.CachingDirectoryFactory.close Releasing directory:/usr/home/hudson/hudson-slave/workspace/Lucene-Solr-Tests-4.x-java7/solr/build/solr-core/test/J1/./org.apache.solr.cloud.SyncSliceTest-1356024816556/jetty4
[junit4:junit4]   2> 11752 T3762 oasc.SolrCore.getNewIndexDir New index directory detected: old=null new=./org.apache.solr.cloud.SyncSliceTest-1356024816556/jetty4/index/
[junit4:junit4]   2> 11753 T3762 oasc.SolrCore.initIndex WARNING [collection1] Solr index directory './org.apache.solr.cloud.SyncSliceTest-1356024816556/jetty4/index' doesn't exist. Creating new index...
[junit4:junit4]   2> 11754 T3762 oasc.CachingDirectoryFactory.get return new directory for /usr/home/hudson/hudson-slave/workspace/Lucene-Solr-Tests-4.x-java7/solr/build/solr-core/test/J1/./org.apache.solr.cloud.SyncSliceTest-1356024816556/jetty4/index forceNew:false
[junit4:junit4]   2> 11760 T3762 oasc.SolrDeletionPolicy.onCommit SolrDeletionPolicy.onCommit: commits:num=1
[junit4:junit4]   2> 		commit{dir=RateLimitedDirectoryWrapper(NRTCachingDirectory(org.apache.lucene.store.NIOFSDirectory@/usr/home/hudson/hudson-slave/workspace/Lucene-Solr-Tests-4.x-java7/solr/build/solr-core/test/J1/org.apache.solr.cloud.SyncSliceTest-1356024816556/jetty4/index lockFactory=org.apache.lucene.store.NativeFSLockFactory@3d44a7ca; maxCacheMB=48.0 maxMergeSizeMB=4.0)),segFN=segments_1,generation=1,filenames=[segments_1]
[junit4:junit4]   2> 11760 T3762 oasc.SolrDeletionPolicy.updateCommits newest commit = 1[segments_1]
[junit4:junit4]   2> 11761 T3762 oasc.CachingDirectoryFactory.close Releasing directory:/usr/home/hudson/hudson-slave/workspace/Lucene-Solr-Tests-4.x-java7/solr/build/solr-core/test/J1/./org.apache.solr.cloud.SyncSliceTest-1356024816556/jetty4/index
[junit4:junit4]   2> 11762 T3762 oasc.SolrCore.initWriters created xml: solr.XMLResponseWriter
[junit4:junit4]   2> 11764 T3762 oasup.UpdateRequestProcessorChain.init inserting DistributedUpdateProcessorFactory into updateRequestProcessorChain "dedupe"
[junit4:junit4]   2> 11765 T3762 oasup.UpdateRequestProcessorChain.init inserting DistributedUpdateProcessorFactory into updateRequestProcessorChain "dedupe-allfields"
[junit4:junit4]   2> 11765 T3762 oasup.UpdateRequestProcessorChain.init inserting DistributedUpdateProcessorFactory into updateRequestProcessorChain "stored_sig"
[junit4:junit4]   2> 11765 T3762 oasup.UpdateRequestProcessorChain.init inserting DistributedUpdateProcessorFactory into updateRequestProcessorChain "uniq-fields"
[junit4:junit4]   2> 11766 T3762 oasup.UpdateRequestProcessorChain.init inserting DistributedUpdateProcessorFactory into updateRequestProcessorChain "distrib-dup-test-chain-implicit"
[junit4:junit4]   2> 11767 T3762 oasc.RequestHandlers.initHandlersFromConfig adding lazy requestHandler: solr.ReplicationHandler
[junit4:junit4]   2> 11767 T3762 oasc.RequestHandlers.initHandlersFromConfig created /replication: solr.ReplicationHandler
[junit4:junit4]   2> 11768 T3762 oasc.RequestHandlers.initHandlersFromConfig created standard: solr.StandardRequestHandler
[junit4:junit4]   2> 11769 T3762 oasc.RequestHandlers.initHandlersFromConfig created /get: solr.RealTimeGetHandler
[junit4:junit4]   2> 11770 T3762 oasc.RequestHandlers.initHandlersFromConfig created dismax: solr.SearchHandler
[junit4:junit4]   2> 11771 T3762 oasc.RequestHandlers.initHandlersFromConfig created mock: org.apache.solr.core.MockQuerySenderListenerReqHandler
[junit4:junit4]   2> 11772 T3762 oasc.RequestHandlers.initHandlersFromConfig created /admin/: org.apache.solr.handler.admin.AdminHandlers
[junit4:junit4]   2> 11773 T3762 oasc.RequestHandlers.initHandlersFromConfig created defaults: solr.StandardRequestHandler
[junit4:junit4]   2> 11773 T3762 oasc.RequestHandlers.initHandlersFromConfig adding lazy requestHandler: solr.StandardRequestHandler
[junit4:junit4]   2> 11774 T3762 oasc.RequestHandlers.initHandlersFromConfig created lazy: solr.StandardRequestHandler
[junit4:junit4]   2> 11775 T3762 oasc.RequestHandlers.initHandlersFromConfig created /update: solr.UpdateRequestHandler
[junit4:junit4]   2> 11776 T3762 oasc.RequestHandlers.initHandlersFromConfig created /terms: org.apache.solr.handler.component.SearchHandler
[junit4:junit4]   2> 11777 T3762 oasc.RequestHandlers.initHandlersFromConfig created spellCheckCompRH: org.apache.solr.handler.component.SearchHandler
[junit4:junit4]   2> 11778 T3762 oasc.RequestHandlers.initHandlersFromConfig created spellCheckCompRH_Direct: org.apache.solr.handler.component.SearchHandler
[junit4:junit4]   2> 11779 T3762 oasc.RequestHandlers.initHandlersFromConfig created spellCheckWithWordbreak: org.apache.solr.handler.component.SearchHandler
[junit4:junit4]   2> 11780 T3762 oasc.RequestHandlers.initHandlersFromConfig created spellCheckWithWordbreak_Direct: org.apache.solr.handler.component.SearchHandler
[junit4:junit4]   2> 11781 T3762 oasc.RequestHandlers.initHandlersFromConfig created spellCheckCompRH1: org.apache.solr.handler.component.SearchHandler
[junit4:junit4]   2> 11782 T3762 oasc.RequestHandlers.initHandlersFromConfig created mltrh: org.apache.solr.handler.component.SearchHandler
[junit4:junit4]   2> 11783 T3762 oasc.RequestHandlers.initHandlersFromConfig created tvrh: org.apache.solr.handler.component.SearchHandler
[junit4:junit4]   2> 11784 T3762 oasc.RequestHandlers.initHandlersFromConfig created /mlt: solr.MoreLikeThisHandler
[junit4:junit4]   2> 11785 T3762 oasc.RequestHandlers.initHandlersFromConfig created /debug/dump: solr.DumpRequestHandler
[junit4:junit4]   2> 11798 T3762 oashl.XMLLoader.init xsltCacheLifetimeSeconds=60
[junit4:junit4]   2> 11803 T3762 oasc.SolrCore.initDeprecatedSupport WARNING solrconfig.xml uses deprecated <admin/gettableFiles>, Please update your config to use the ShowFileRequestHandler.
[junit4:junit4]   2> 11804 T3762 oasc.SolrCore.initDeprecatedSupport WARNING adding ShowFileRequestHandler with hidden files: [SCHEMA.XML, OLD_SYNONYMS.TXT, STOPWORDS.TXT, PROTWORDS.TXT, OPEN-EXCHANGE-RATES.JSON, SYNONYMS.TXT, CURRENCY.XML, MAPPING-ISOLATIN1ACCENT.TXT]
[junit4:junit4]   2> 11807 T3762 oasc.CachingDirectoryFactory.close Releasing directory:/usr/home/hudson/hudson-slave/workspace/Lucene-Solr-Tests-4.x-java7/solr/build/solr-core/test/J1/./org.apache.solr.cloud.SyncSliceTest-1356024816556/jetty4
[junit4:junit4]   2> 11809 T3762 oass.SolrIndexSearcher.<init> Opening Searcher@6535b76 main
[junit4:junit4]   2> 11810 T3762 oasu.CommitTracker.<init> Hard AutoCommit: disabled
[junit4:junit4]   2> 11811 T3762 oasu.CommitTracker.<init> Soft AutoCommit: disabled
[junit4:junit4]   2> 11811 T3762 oashc.SpellCheckComponent.inform Initializing spell checkers
[junit4:junit4]   2> 11818 T3762 oass.DirectSolrSpellChecker.init init: {name=direct,classname=DirectSolrSpellChecker,field=lowerfilt,minQueryLength=3}
[junit4:junit4]   2> 11871 T3764 oasc.SolrCore.registerSearcher [collection1] Registered new searcher Searcher@6535b76 main{StandardDirectoryReader(segments_1:1)}
[junit4:junit4]   2> 11876 T3762 oasc.ZkController.publish publishing core=collection1 state=down
[junit4:junit4]   2> 11877 T3762 oasc.ZkController.publish numShards not found on descriptor - reading it from system property
[junit4:junit4]   2> 12049 T3694 oascc.ZkStateReader.updateClusterState Updating cloud state from ZooKeeper... 
[junit4:junit4]   2> 12050 T3694 oasc.Overseer$ClusterStateUpdater.updateState Update state numShards=1 message={
[junit4:junit4]   2> 	  "operation":"state",
[junit4:junit4]   2> 	  "numShards":"1",
[junit4:junit4]   2> 	  "shard":null,
[junit4:junit4]   2> 	  "roles":null,
[junit4:junit4]   2> 	  "state":"down",
[junit4:junit4]   2> 	  "core":"collection1",
[junit4:junit4]   2> 	  "collection":"collection1",
[junit4:junit4]   2> 	  "node_name":"127.0.0.1:55282_om_z",
[junit4:junit4]   2> 	  "base_url":"http://127.0.0.1:55282/om_z"}
[junit4:junit4]   2> 12050 T3694 oasc.Overseer$ClusterStateUpdater.updateState Collection already exists with numShards=1
[junit4:junit4]   2> 12050 T3694 oasc.Overseer$ClusterStateUpdater.updateState Assigning new node to shard shard=shard1
[junit4:junit4]   2> 12065 T3693 oascc.ZkStateReader$2.process A cluster state change: WatchedEvent state:SyncConnected type:NodeDataChanged path:/clusterstate.json, has occurred - updating... (live nodes size: 5)
[junit4:junit4]   2> 12065 T3712 oascc.ZkStateReader$2.process A cluster state change: WatchedEvent state:SyncConnected type:NodeDataChanged path:/clusterstate.json, has occurred - updating... (live nodes size: 5)
[junit4:junit4]   2> 12065 T3699 oascc.ZkStateReader$2.process A cluster state change: WatchedEvent state:SyncConnected type:NodeDataChanged path:/clusterstate.json, has occurred - updating... (live nodes size: 5)
[junit4:junit4]   2> 12065 T3727 oascc.ZkStateReader$2.process A cluster state change: WatchedEvent state:SyncConnected type:NodeDataChanged path:/clusterstate.json, has occurred - updating... (live nodes size: 5)
[junit4:junit4]   2> 12065 T3744 oascc.ZkStateReader$2.process A cluster state change: WatchedEvent state:SyncConnected type:NodeDataChanged path:/clusterstate.json, has occurred - updating... (live nodes size: 5)
[junit4:junit4]   2> 12065 T3761 oascc.ZkStateReader$2.process A cluster state change: WatchedEvent state:SyncConnected type:NodeDataChanged path:/clusterstate.json, has occurred - updating... (live nodes size: 5)
[junit4:junit4]   2> 12879 T3762 oasc.CoreContainer.registerCore registering core: collection1
[junit4:junit4]   2> 12879 T3762 oasc.ZkController.register Register replica - core:collection1 address:http://127.0.0.1:55282/om_z collection:collection1 shard:shard1
[junit4:junit4]   2> 12882 T3762 oasc.ZkController.register We are http://127.0.0.1:55282/om_z/collection1/ and leader is http://127.0.0.1:55270/om_z/collection1/
[junit4:junit4]   2> 12883 T3762 oasc.ZkController.register No LogReplay needed for core=collection1 baseURL=http://127.0.0.1:55282/om_z
[junit4:junit4]   2> 12883 T3762 oasc.ZkController.checkRecovery Core needs to recover:collection1
[junit4:junit4]   2> 12883 T3762 oasu.DefaultSolrCoreState.doRecovery Running recovery - first canceling any ongoing recovery
[junit4:junit4]   2> ASYNC  NEW_CORE C181 name=collection1 org.apache.solr.core.SolrCore@4c49c088 url=http://127.0.0.1:55282/om_z/collection1 node=127.0.0.1:55282_om_z C181_STATE=coll:collection1 core:collection1 props:{shard=null, roles=null, state=down, core=collection1, collection=collection1, node_name=127.0.0.1:55282_om_z, base_url=http://127.0.0.1:55282/om_z}
[junit4:junit4]   2> 12884 T3765 C181 P55282 oasc.RecoveryStrategy.run Starting recovery process.  core=collection1 recoveringAfterStartup=true
[junit4:junit4]   2> 12884 T3762 oascc.ZkStateReader.updateClusterState Updating cloud state from ZooKeeper... 
[junit4:junit4]   2> 12885 T3765 C181 P55282 oasc.RecoveryStrategy.doRecovery ###### startupVersions=[]
[junit4:junit4]   2> 12886 T3765 C181 P55282 oasc.ZkController.publish publishing core=collection1 state=recovering
[junit4:junit4]   2> 12886 T3765 C181 P55282 oasc.ZkController.publish numShards not found on descriptor - reading it from system property
[junit4:junit4]   2> 12886 T3671 oass.SolrDispatchFilter.init user.dir=/usr/home/hudson/hudson-slave/workspace/Lucene-Solr-Tests-4.x-java7/solr/build/solr-core/test/J1
[junit4:junit4]   2> 12887 T3765 C181 P55282 oasc.RecoveryStrategy.doRecovery Attempting to PeerSync from http://127.0.0.1:55270/om_z/collection1/ core=collection1 - recoveringAfterStartup=true
[junit4:junit4]   2> 12888 T3765 C181 P55282 oasu.PeerSync.sync PeerSync: core=collection1 url=http://127.0.0.1:55282/om_z START replicas=[http://127.0.0.1:55270/om_z/collection1/] nUpdates=100
[junit4:junit4]   2> 12888 T3671 oass.SolrDispatchFilter.init SolrDispatchFilter.init() done
[junit4:junit4]   2> 12888 T3765 C181 P55282 oasu.PeerSync.sync WARNING no frame of reference to tell of we've missed updates
[junit4:junit4]   2> 12889 T3765 C181 P55282 oasc.RecoveryStrategy.doRecovery PeerSync Recovery was not successful - trying replication. core=collection1
[junit4:junit4]   2> 12889 T3765 C181 P55282 oasc.RecoveryStrategy.doRecovery Starting Replication Recovery. core=collection1
[junit4:junit4]   2> 12889 T3671 oascsi.HttpClientUtil.createClient Creating new http client, config:maxConnections=128&maxConnectionsPerHost=32&followRedirects=false
[junit4:junit4]   2> 12889 T3765 C181 P55282 oascsi.HttpClientUtil.createClient Creating new http client, config:maxConnections=128&maxConnectionsPerHost=32&followRedirects=false
[junit4:junit4]   2> 12891 T3702 C179 P55270 REQ /get {distrib=false&qt=/get&wt=javabin&version=2&getVersions=100} status=0 QTime=0 
[junit4:junit4]   2> 12910 T3671 oascc.ZkStateReader.updateClusterState Updating cloud state from ZooKeeper... 
[junit4:junit4]   2> 12911 T3671 oasc.AbstractFullDistribZkTestBase.waitForThingsToLevelOut Wait for recoveries to finish - wait 15 for each attempt
[junit4:junit4]   2> 12912 T3671 oasc.AbstractDistribZkTestBase.waitForRecoveriesToFinish Wait for recoveries to finish - collection: collection1 failOnTimeout:true timeout (sec):15
[junit4:junit4]   2> 12913 T3671 oascc.ZkStateReader.updateClusterState Updating cloud state from ZooKeeper... 
[junit4:junit4]   2> 13071 T3694 oascc.ZkStateReader.updateClusterState Updating cloud state from ZooKeeper... 
[junit4:junit4]   2> 13072 T3694 oasc.Overseer$ClusterStateUpdater.updateState Update state numShards=1 message={
[junit4:junit4]   2> 	  "operation":"state",
[junit4:junit4]   2> 	  "numShards":"1",
[junit4:junit4]   2> 	  "shard":"shard1",
[junit4:junit4]   2> 	  "roles":null,
[junit4:junit4]   2> 	  "state":"recovering",
[junit4:junit4]   2> 	  "core":"collection1",
[junit4:junit4]   2> 	  "collection":"collection1",
[junit4:junit4]   2> 	  "node_name":"127.0.0.1:55282_om_z",
[junit4:junit4]   2> 	  "base_url":"http://127.0.0.1:55282/om_z"}
[junit4:junit4]   2> 13089 T3744 oascc.ZkStateReader$2.process A cluster state change: WatchedEvent state:SyncConnected type:NodeDataChanged path:/clusterstate.json, has occurred - updating... (live nodes size: 5)
[junit4:junit4]   2> 13090 T3761 oascc.ZkStateReader$2.process A cluster state change: WatchedEvent state:SyncConnected type:NodeDataChanged path:/clusterstate.json, has occurred - updating... (live nodes size: 5)
[junit4:junit4]   2> 13090 T3712 oascc.ZkStateReader$2.process A cluster state change: WatchedEvent state:SyncConnected type:NodeDataChanged path:/clusterstate.json, has occurred - updating... (live nodes size: 5)
[junit4:junit4]   2> 13089 T3699 oascc.ZkStateReader$2.process A cluster state change: WatchedEvent state:SyncConnected type:NodeDataChanged path:/clusterstate.json, has occurred - updating... (live nodes size: 5)
[junit4:junit4]   2> 13089 T3693 oascc.ZkStateReader$2.process A cluster state change: WatchedEvent state:SyncConnected type:NodeDataChanged path:/clusterstate.json, has occurred - updating... (live nodes size: 5)
[junit4:junit4]   2> 13090 T3727 oascc.ZkStateReader$2.process A cluster state change: WatchedEvent state:SyncConnected type:NodeDataChanged path:/clusterstate.json, has occurred - updating... (live nodes size: 5)
[junit4:junit4]   2>  C180_STATE=coll:collection1 core:collection1 props:{shard=shard1, roles=null, state=recovering, core=collection1, collection=collection1, node_name=127.0.0.1:55278_om_z, base_url=http://127.0.0.1:55278/om_z}
[junit4:junit4]   2> 13605 T3747 C180 P55278 oasc.RecoveryStrategy.doRecovery Begin buffering updates. core=collection1
[junit4:junit4]   2> 13605 T3747 C180 P55278 oasu.UpdateLog.bufferUpdates Starting to buffer updates. FSUpdateLog{state=ACTIVE, tlog=null}
[junit4:junit4]   2> 13605 T3747 C180 P55278 oasc.RecoveryStrategy.replicate Attempting to replicate from http://127.0.0.1:55270/om_z/collection1/. core=collection1
[junit4:junit4]   2> 13606 T3747 C180 P55278 oascsi.HttpClientUtil.createClient Creating new http client, config:maxConnections=128&maxConnectionsPerHost=32&followRedirects=false
[junit4:junit4]   2> 13618 T3708 C179 P55270 oasu.DirectUpdateHandler2.commit start commit{flags=0,_version_=0,optimize=false,openSearcher=false,waitSearcher=true,expungeDeletes=false,softCommit=false}
[junit4:junit4]   2> 13673 T3708 C179 P55270 oasc.SolrDeletionPolicy.onCommit SolrDeletionPolicy.onCommit: commits:num=2
[junit4:junit4]   2> 		commit{dir=RateLimitedDirectoryWrapper(NRTCachingDirectory(org.apache.lucene.store.NIOFSDirectory@/usr/home/hudson/hudson-slave/workspace/Lucene-Solr-Tests-4.x-java7/solr/build/solr-core/test/J1/org.apache.solr.cloud.SyncSliceTest-1356024816556/jetty1/index lockFactory=org.apache.lucene.store.NativeFSLockFactory@53e8d0f5; maxCacheMB=48.0 maxMergeSizeMB=4.0)),segFN=segments_2,generation=2,filenames=[segments_2]
[junit4:junit4]   2> 		commit{dir=RateLimitedDirectoryWrapper(NRTCachingDirectory(org.apache.lucene.store.NIOFSDirectory@/usr/home/hudson/hudson-slave/workspace/Lucene-Solr-Tests-4.x-java7/solr/build/solr-core/test/J1/org.apache.solr.cloud.SyncSliceTest-1356024816556/jetty1/index lockFactory=org.apache.lucene.store.NativeFSLockFactory@53e8d0f5; maxCacheMB=48.0 maxMergeSizeMB=4.0)),segFN=segments_3,generation=3,filenames=[segments_3]
[junit4:junit4]   2> 13674 T3708 C179 P55270 oasc.SolrDeletionPolicy.updateCommits newest commit = 3[segments_3]
[junit4:junit4]   2> 13675 T3708 C179 P55270 oasc.CachingDirectoryFactory.close Releasing directory:/usr/home/hudson/hudson-slave/workspace/Lucene-Solr-Tests-4.x-java7/solr/build/solr-core/test/J1/./org.apache.solr.cloud.SyncSliceTest-1356024816556/jetty1
[junit4:junit4]   2> 13676 T3708 C179 P55270 oasu.DirectUpdateHandler2.commit end_commit_flush
[junit4:junit4]   2> 13676 T3708 C179 P55270 /update {waitSearcher=true&openSearcher=false&commit=true&commit_end_point=true&wt=javabin&softCommit=false&version=2} {commit=} 0 59
[junit4:junit4]   2> 13678 T3747 C180 P55278 oash.ReplicationHandler.inform Commits will be reserved for  10000
[junit4:junit4]   2> 13679 T3747 C180 P55278 oash.SnapPuller.<init>  No value set for 'pollInterval'. Timer Task not started.
[junit4:junit4]   2> 13681 T3706 C179 P55270 REQ /replication {command=indexversion&wt=javabin&qt=/replication&version=2} status=0 QTime=0 
[junit4:junit4]   2> 13682 T3747 C180 P55278 oash.SnapPuller.fetchLatestIndex Master's generation: 3
[junit4:junit4]   2> 13682 T3747 C180 P55278 oash.SnapPuller.fetchLatestIndex Slave's generation: 1
[junit4:junit4]   2> 13683 T3747 C180 P55278 oash.SnapPuller.fetchLatestIndex Starting replication process
[junit4:junit4]   2> 13685 T3706 C179 P55270 oasc.CachingDirectoryFactory.close Releasing directory:/usr/home/hudson/hudson-slave/workspace/Lucene-Solr-Tests-4.x-java7/solr/build/solr-core/test/J1/./org.apache.solr.cloud.SyncSliceTest-1356024816556/jetty1
[junit4:junit4]   2> 13686 T3706 C179 P55270 oasc.CachingDirectoryFactory.close Releasing directory:/usr/home/hudson/hudson-slave/workspace/Lucene-Solr-Tests-4.x-java7/solr/build/solr-core/test/J1/./org.apache.solr.cloud.SyncSliceTest-1356024816556/jetty1/index
[junit4:junit4]   2> 13687 T3706 C179 P55270 REQ /replication {command=filelist&generation=3&wt=javabin&qt=/replication&version=2} status=0 QTime=2 
[junit4:junit4]   2> 13687 T3747 C180 P55278 oash.SnapPuller.fetchLatestIndex Number of files in latest index in master: 1
[junit4:junit4]   2> 13689 T3747 C180 P55278 oasc.CachingDirectoryFactory.get return new directory for /usr/home/hudson/hudson-slave/workspace/Lucene-Solr-Tests-4.x-java7/solr/build/solr-core/test/J1/./org.apache.solr.cloud.SyncSliceTest-1356024816556/jetty3/index.20121220073350237 forceNew:false
[junit4:junit4]   2> 13690 T3747 C180 P55278 oasc.CachingDirectoryFactory.close Releasing directory:/usr/home/hudson/hudson-slave/workspace/Lucene-Solr-Tests-4.x-java7/solr/build/solr-core/test/J1/./org.apache.solr.cloud.SyncSliceTest-1356024816556/jetty3
[junit4:junit4]   2> 13691 T3747 C180 P55278 oash.SnapPuller.fetchLatestIndex Starting download to RateLimitedDirectoryWrapper(NRTCachingDirectory(org.apache.lucene.store.NIOFSDirectory@/usr/home/hudson/hudson-slave/workspace/Lucene-Solr-Tests-4.x-java7/solr/build/solr-core/test/J1/org.apache.solr.cloud.SyncSliceTest-1356024816556/jetty3/index.20121220073350237 lockFactory=org.apache.lucene.store.NativeFSLockFactory@55c763be; maxCacheMB=48.0 maxMergeSizeMB=4.0)) fullCopy=true
[junit4:junit4]   2> 13694 T3706 C179 P55270 REQ /replication {file=segments_3&command=filecontent&checksum=true&generation=3&qt=/replication&wt=filestream} status=0 QTime=0 
[junit4:junit4]   2> 13696 T3747 C180 P55278 oasc.CachingDirectoryFactory.close Releasing directory:/usr/home/hudson/hudson-slave/workspace/Lucene-Solr-Tests-4.x-java7/solr/build/solr-core/test/J1/./org.apache.solr.cloud.SyncSliceTest-1356024816556/jetty3/index
[junit4:junit4]   2> 13696 T3747 C180 P55278 oash.SnapPuller.fetchLatestIndex Total time taken for download : 0 secs
[junit4:junit4]   2> 13696 T3747 C180 P55278 oash.SnapPuller.modifyIndexProps New index installed. Updating index properties... index=index.20121220073350237
[junit4:junit4]   2> 13698 T3747 C180 P55278 oasc.CachingDirectoryFactory.close Releasing directory:/usr/home/hudson/hudson-slave/workspace/Lucene-Solr-Tests-4.x-java7/solr/build/solr-core/test/J1/./org.apache.solr.cloud.SyncSliceTest-1356024816556/jetty3
[junit4:junit4]   2> 13698 T3747 C180 P55278 oasc.CachingDirectoryFactory.close Releasing directory:/usr/home/hudson/hudson-slave/workspace/Lucene-Solr-Tests-4.x-java7/solr/build/solr-core/test/J1/./org.apache.solr.cloud.SyncSliceTest-1356024816556/jetty3
[junit4:junit4]   2> 13699 T3747 C180 P55278 oasc.SolrCore.getNewIndexDir New index directory detected: old=./org.apache.solr.cloud.SyncSliceTest-1356024816556/jetty3/index/ new=./org.apache.solr.cloud.SyncSliceTest-1356024816556/jetty3/index.20121220073350237
[junit4:junit4]   2> 13702 T3747 C180 P55278 oasc.SolrDeletionPolicy.onInit SolrDeletionPolicy.onInit: commits:num=1
[junit4:junit4]   2> 		commit{dir=RateLimitedDirectoryWrapper(NRTCachingDirectory(org.apache.lucene.store.NIOFSDirectory@/usr/home/hudson/hudson-slave/workspace/Lucene-Solr-Tests-4.x-java7/solr/build/solr-core/test/J1/org.apache.solr.cloud.SyncSliceTest-1356024816556/jetty3/index.20121220073350237 lockFactory=org.apache.lucene.store.NativeFSLockFactory@55c763be; maxCacheMB=48.0 maxMergeSizeMB=4.0)),segFN=segments_3,generation=3,filenames=[segments_3]
[junit4:junit4]   2> 13703 T3747 C180 P55278 oasc.SolrDeletionPolicy.updateCommits newest commit = 3[segments_3]
[junit4:junit4]   2> 13704 T3747 C180 P55278 oasc.CachingDirectoryFactory.close Releasing directory:/usr/home/hudson/hudson-slave/workspace/Lucene-Solr-Tests-4.x-java7/solr/build/solr-core/test/J1/./org.apache.solr.cloud.SyncSliceTest-1356024816556/jetty3
[junit4:junit4]   2> 13705 T3747 C180 P55278 oasu.DefaultSolrCoreState.newIndexWriter Creating new IndexWriter...
[junit4:junit4]   2> 13705 T3747 C180 P55278 oasu.DefaultSolrCoreState.newIndexWriter Waiting until IndexWriter is unused... core=collection1
[junit4:junit4]   2> 13705 T3747 C180 P55278 oasu.DefaultSolrCoreState.newIndexWriter Rollback old IndexWriter... core=collection1
[junit4:junit4]   2> 13706 T3747 C180 P55278 oasc.CachingDirectoryFactory.close Releasing directory:/usr/home/hudson/hudson-slave/workspace/Lucene-Solr-Tests-4.x-java7/solr/build/solr-core/test/J1/./org.apache.solr.cloud.SyncSliceTest-1356024816556/jetty3/index.20121220073350237
[junit4:junit4]   2> 13707 T3747 C180 P55278 oasc.CachingDirectoryFactory.close Releasing directory:/usr/home/hudson/hudson-slave/workspace/Lucene-Solr-Tests-4.x-java7/solr/build/solr-core/test/J1/./org.apache.solr.cloud.SyncSliceTest-1356024816556/jetty3
[junit4:junit4]   2> 13710 T3747 C180 P55278 oasc.SolrDeletionPolicy.onInit SolrDeletionPolicy.onInit: commits:num=1
[junit4:junit4]   2> 		commit{dir=RateLimitedDirectoryWrapper(NRTCachingDirectory(org.apache.lucene.store.NIOFSDirectory@/usr/home/hudson/hudson-slave/workspace/Lucene-Solr-Tests-4.x-java7/solr/build/solr-core/test/J1/org.apache.solr.cloud.SyncSliceTest-1356024816556/jetty3/index.20121220073350237 lockFactory=org.apache.lucene.store.NativeFSLockFactory@55c763be; maxCacheMB=48.0 maxMergeSizeMB=4.0)),segFN=segments_3,generation=3,filenames=[segments_3]
[junit4:junit4]   2> 13711 T3747 C180 P55278 oasc.SolrDeletionPolicy.updateCommits newest commit = 3[segments_3]
[junit4:junit4]   2> 13711 T3747 C180 P55278 oasu.DefaultSolrCoreState.newIndexWriter New IndexWriter is ready to be used.
[junit4:junit4]   2> 13712 T3747 C180 P55278 oasc.CachingDirectoryFactory.close Releasing directory:/usr/home/hudson/hudson-slave/workspace/Lucene-Solr-Tests-4.x-java7/solr/build/solr-core/test/J1/./org.apache.solr.cloud.SyncSliceTest-1356024816556/jetty3
[junit4:junit4]   2> 13712 T3747 C180 P55278 oass.SolrIndexSearcher.<init> Opening Searcher@549eb6c7 main
[junit4:junit4]   2> 13714 T3746 oasc.SolrCore.registerSearcher [collection1] Registered new searcher Searcher@549eb6c7 main{StandardDirectoryReader(segments_3:1:nrt)}
[junit4:junit4]   2> 13715 T3746 oasc.CachingDirectoryFactory.close Releasing directory:/usr/home/hudson/hudson-slave/workspace/Lucene-Solr-Tests-4.x-java7/solr/build/solr-core/test/J1/./org.apache.solr.cloud.SyncSliceTest-1356024816556/jetty3/index
[junit4:junit4]   2> 13715 T3747 C180 P55278 oasu.DirectUpdateHandler2.commit start commit{flags=0,_version_=0,optimize=false,openSearcher=false,waitSearcher=false,expungeDeletes=false,softCommit=false}
[junit4:junit4]   2> 13718 T3747 C180 P55278 oasc.SolrDeletionPolicy.onCommit SolrDeletionPolicy.onCommit: commits:num=2
[junit4:junit4]   2> 		commit{dir=RateLimitedDirectoryWrapper(NRTCachingDirectory(org.apache.lucene.store.NIOFSDirectory@/usr/home/hudson/hudson-slave/workspace/Lucene-Solr-Tests-4.x-java7/solr/build/solr-core/test/J1/org.apache.solr.cloud.SyncSliceTest-1356024816556/jetty3/index.20121220073350237 lockFactory=org.apache.lucene.store.NativeFSLockFactory@55c763be; maxCacheMB=48.0 maxMergeSizeMB=4.0)),segFN=segments_3,generation=3,filenames=[segments_3]
[junit4:junit4]   2> 		commit{dir=RateLimitedDirectoryWrapper(NRTCachingDirectory(org.apache.lucene.store.NIOFSDirectory@/usr/home/hudson/hudson-slave/workspace/Lucene-Solr-Tests-4.x-java7/solr/build/solr-core/test/J1/org.apache.solr.cloud.SyncSliceTest-1356024816556/jetty3/index.20121220073350237 lockFactory=org.apache.lucene.store.NativeFSLockFactory@55c763be; maxCacheMB=48.0 maxMergeSizeMB=4.0)),segFN=segments_4,generation=4,filenames=[segments_4]
[junit4:junit4]   2> 13718 T3747 C180 P55278 oasc.SolrDeletionPolicy.updateCommits newest commit = 4[segments_4]
[junit4:junit4]   2> 13720 T3747 C180 P55278 oasc.CachingDirectoryFactory.close Releasing directory:/usr/home/hudson/hudson-slave/workspace/Lucene-Solr-Tests-4.x-java7/solr/build/solr-core/test/J1/./org.apache.solr.cloud.SyncSliceTest-1356024816556/jetty3
[junit4:junit4]   2> 13720 T3747 C180 P55278 oasu.DirectUpdateHandler2.commit end_commit_flush
[junit4:junit4]   2> 13720 T3747 C180 P55278 oasc.CachingDirectoryFactory.close Releasing directory:/usr/home/hudson/hudson-slave/workspace/Lucene-Solr-Tests-4.x-java7/solr/build/solr-core/test/J1/./org.apache.solr.cloud.SyncSliceTest-1356024816556/jetty3/index.20121220073350237
[junit4:junit4]   2> 13721 T3747 C180 P55278 oasc.CachingDirectoryFactory.close Releasing directory:/usr/home/hudson/hudson-slave/workspace/Lucene-Solr-Tests-4.x-java7/solr/build/solr-core/test/J1/./org.apache.solr.cloud.SyncSliceTest-1356024816556/jetty3/index
[junit4:junit4]   2> 13721 T3747 C180 P55278 oasc.RecoveryStrategy.replay No replay needed. core=collection1
[junit4:junit4]   2> 13721 T3747 C180 P55278 oasc.RecoveryStrategy.doRecovery Replication Recovery was successful - registering as Active. core=collection1
[junit4:junit4]   2> 13721 T3747 C180 P55278 oasc.ZkController.publish publishing core=collection1 state=active
[junit4:junit4]   2> 13722 T3747 C180 P55278 oasc.ZkController.publish numShards not found on descriptor - reading it from system property
[junit4:junit4]   2> 13730 T3747 C180 P55278 oasc.RecoveryStrategy.doRecovery Finished recovery process. core=collection1
[junit4:junit4]   2> 13915 T3671 oascc.ZkStateReader.updateClusterState Updating cloud state from ZooKeeper... 
[junit4:junit4]   2> 14096 T3694 oascc.ZkStateReader.updateClusterState Updating cloud state from ZooKeeper... 
[junit4:junit4]   2> 14097 T3694 oasc.Overseer$ClusterStateUpdater.updateState Update state numShards=1 message={
[junit4:junit4]   2> 	  "operation":"state",
[junit4:junit4]   2> 	  "numShards":"1",
[junit4:junit4]   2> 	  "shard":"shard1",
[junit4:junit4]   2> 	  "roles":null,
[junit4:junit4]   2> 	  "state":"active",
[junit4:junit4]   2> 	  "core":"collection1",
[junit4:junit4]   2> 	  "collection":"collection1",
[junit4:junit4]   2> 	  "node_name":"127.0.0.1:55278_om_z",
[junit4:junit4]   2> 	  "base_url":"http://127.0.0.1:55278/om_z"}
[junit4:junit4]   2> 14113 T3699 oascc.ZkStateReader$2.process A cluster state change: WatchedEvent state:SyncConnected type:NodeDataChanged path:/clusterstate.json, has occurred - updating... (live nodes size: 5)
[junit4:junit4]   2> 14113 T3693 oascc.ZkStateReader$2.process A cluster state change: WatchedEvent state:SyncConnected type:NodeDataChanged path:/clusterstate.json, has occurred - updating... (live nodes size: 5)
[junit4:junit4]   2> 14113 T3761 oascc.ZkStateReader$2.process A cluster state change: WatchedEvent state:SyncConnected type:NodeDataChanged path:/clusterstate.json, has occurred - updating... (live nodes size: 5)
[junit4:junit4]   2> 14113 T3712 oascc.ZkStateReader$2.process A cluster state change: WatchedEvent state:SyncConnected type:NodeDataChanged path:/clusterstate.json, has occurred - updating... (live nodes size: 5)
[junit4:junit4]   2> 14113 T3727 oascc.ZkStateReader$2.process A cluster state change: WatchedEvent state:SyncConnected type:NodeDataChanged path:/clusterstate.json, has occurred - updating... (live nodes size: 5)
[junit4:junit4]   2> 14113 T3744 oascc.ZkStateReader$2.process A cluster state change: WatchedEvent state:SyncConnected type:NodeDataChanged path:/clusterstate.json, has occurred - updating... (live nodes size: 5)
[junit4:junit4]   2> 14918 T3671 oascc.ZkStateReader.updateClusterState Updating cloud state from ZooKeeper... 
[junit4:junit4]   2>  C181_STATE=coll:collection1 core:collection1 props:{shard=shard1, roles=null, state=recovering, core=collection1, collection=collection1, node_name=127.0.0.1:55282_om_z, base_url=http://127.0.0.1:55282/om_z}
[junit4:junit4]   2> 15912 T3765 C181 P55282 oasc.RecoveryStrategy.doRecovery Begin buffering updates. core=collection1
[junit4:junit4]   2> 15912 T3765 C181 P55282 oasu.UpdateLog.bufferUpdates Starting to buffer updates. FSUpdateLog{state=ACTIVE, tlog=null}
[junit4:junit4]   2> 15912 T3765 C181 P55282 oasc.RecoveryStrategy.replicate Attempting to replicate from http://127.0.0.1:55270/om_z/collection1/. core=collection1
[junit4:junit4]   2> 15913 T3765 C181 P55282 oascsi.HttpClientUtil.createClient Creating new http client, config:maxConnections=128&maxConnectionsPerHost=32&followRedirects=false
[junit4:junit4]   2> 15921 T3671 oascc.ZkStateReader.updateClusterState Updating cloud state from ZooKeeper... 
[junit4:junit4]   2> 15928 T3703 C179 P55270 oasu.DirectUpdateHandler2.commit start commit{flags=0,_version_=0,optimize=false,openSearcher=false,waitSearcher=true,expungeDeletes=false,softCommit=false}
[junit4:junit4]   2> 15932 T3703 C179 P55270 oasc.SolrDeletionPolicy.onCommit SolrDeletionPolicy.onCommit: commits:num=3
[junit4:junit4]   2> 		commit{dir=RateLimitedDirectoryWrapper(NRTCachingDirectory(org.apache.lucene.store.NIOFSDirectory@/usr/home/hudson/hudson-slave/workspace/Lucene-Solr-Tests-4.x-java7/solr/build/solr-core/test/J1/org.apache.solr.cloud.SyncSliceTest-1356024816556/jetty1/index lockFactory=org.apache.lucene.store.NativeFSLockFactory@53e8d0f5; maxCacheMB=48.0 maxMergeSizeMB=4.0)),segFN=segments_2,generation=2,filenames=[segments_2]
[junit4:junit4]   2> 		commit{dir=RateLimitedDirectoryWrapper(NRTCachingDirectory(org.apache.lucene.store.NIOFSDirectory@/usr/home/hudson/hudson-slave/workspace/Lucene-Solr-Tests-4.x-java7/solr/build/solr-core/test/J1/org.apache.solr.cloud.SyncSliceTest-1356024816556/jetty1/index lockFactory=org.apache.lucene.store.NativeFSLockFactory@53e8d0f5; maxCacheMB=48.0 maxMergeSizeMB=4.0)),segFN=segments_3,generation=3,filenames=[segments_3]
[junit4:junit4]   2> 		commit{dir=RateLimitedDirectoryWrapper(NRTCachingDirectory(or

[...truncated too long message...]

[junit4:junit4]   2> 	        at java.util.concurrent.ThreadPoolExecutor.getTask(ThreadPoolExecutor.java:1043)
[junit4:junit4]   2> 	        at java.util.concurrent.ThreadPoolExecutor.runWorker(ThreadPoolExecutor.java:1103)
[junit4:junit4]   2> 	        at java.util.concurrent.ThreadPoolExecutor$Worker.run(ThreadPoolExecutor.java:603)
[junit4:junit4]   2> 	        at java.lang.Thread.run(Thread.java:722)
[junit4:junit4]   2> 	   9) Thread[id=527, name=TEST-BasicDistributedZkTest.testDistribSearch-seed#[5C9F7C8FCAF62C21]-SendThread(localhost:61989), state=RUNNABLE, group=TGRP-BasicDistributedZkTest]
[junit4:junit4]   2> 	        at sun.nio.ch.KQueueArrayWrapper.kevent0(Native Method)
[junit4:junit4]   2> 	        at sun.nio.ch.KQueueArrayWrapper.poll(KQueueArrayWrapper.java:159)
[junit4:junit4]   2> 	        at sun.nio.ch.KQueueSelectorImpl.doSelect(KQueueSelectorImpl.java:103)
[junit4:junit4]   2> 	        at sun.nio.ch.SelectorImpl.lockAndDoSelect(SelectorImpl.java:87)
[junit4:junit4]   2> 	        at sun.nio.ch.SelectorImpl.select(SelectorImpl.java:98)
[junit4:junit4]   2> 	        at org.apache.zookeeper.ClientCnxnSocketNIO.doTransport(ClientCnxnSocketNIO.java:338)
[junit4:junit4]   2> 	        at org.apache.zookeeper.ClientCnxn$SendThread.run(ClientCnxn.java:1068)
[junit4:junit4]   2> 	  10) Thread[id=507, name=qtp528368933-507, state=RUNNABLE, group=TGRP-BasicDistributedZkTest]
[junit4:junit4]   2> 	        at java.net.SocketInputStream.socketRead0(Native Method)
[junit4:junit4]   2> 	        at java.net.SocketInputStream.read(SocketInputStream.java:150)
[junit4:junit4]   2> 	        at java.net.SocketInputStream.read(SocketInputStream.java:121)
[junit4:junit4]   2> 	        at org.eclipse.jetty.io.ByteArrayBuffer.readFrom(ByteArrayBuffer.java:375)
[junit4:junit4]   2> 	        at org.eclipse.jetty.io.bio.StreamEndPoint.fill(StreamEndPoint.java:141)
[junit4:junit4]   2> 	        at org.eclipse.jetty.server.bio.SocketConnector$ConnectorEndPoint.fill(SocketConnector.java:227)
[junit4:junit4]   2> 	        at org.eclipse.jetty.http.HttpParser.fill(HttpParser.java:1035)
[junit4:junit4]   2> 	        at org.eclipse.jetty.http.HttpParser.parseNext(HttpParser.java:280)
[junit4:junit4]   2> 	        at org.eclipse.jetty.http.HttpParser.parseAvailable(HttpParser.java:235)
[junit4:junit4]   2> 	        at org.eclipse.jetty.server.BlockingHttpConnection.handle(BlockingHttpConnection.java:72)
[junit4:junit4]   2> 	        at org.eclipse.jetty.server.bio.SocketConnector$ConnectorEndPoint.run(SocketConnector.java:264)
[junit4:junit4]   2> 	        at org.eclipse.jetty.util.thread.QueuedThreadPool.runJob(QueuedThreadPool.java:608)
[junit4:junit4]   2> 	        at org.eclipse.jetty.util.thread.QueuedThreadPool$3.run(QueuedThreadPool.java:543)
[junit4:junit4]   2> 	        at java.lang.Thread.run(Thread.java:722)
[junit4:junit4]   2> 	  11) Thread[id=500, name=qtp528368933-500 Acceptor0 SocketConnector@127.0.0.1:62015, state=RUNNABLE, group=TGRP-BasicDistributedZkTest]
[junit4:junit4]   2> 	        at java.net.PlainSocketImpl.socketAccept(Native Method)
[junit4:junit4]   2> 	        at java.net.AbstractPlainSocketImpl.accept(AbstractPlainSocketImpl.java:398)
[junit4:junit4]   2> 	        at java.net.ServerSocket.implAccept(ServerSocket.java:522)
[junit4:junit4]   2> 	        at java.net.ServerSocket.accept(ServerSocket.java:490)
[junit4:junit4]   2> 	        at org.eclipse.jetty.server.bio.SocketConnector.accept(SocketConnector.java:117)
[junit4:junit4]   2> 	        at org.eclipse.jetty.server.AbstractConnector$Acceptor.run(AbstractConnector.java:938)
[junit4:junit4]   2> 	        at org.eclipse.jetty.util.thread.QueuedThreadPool.runJob(QueuedThreadPool.java:608)
[junit4:junit4]   2> 	        at org.eclipse.jetty.util.thread.QueuedThreadPool$3.run(QueuedThreadPool.java:543)
[junit4:junit4]   2> 	        at java.lang.Thread.run(Thread.java:722)
[junit4:junit4]   2> 	  12) Thread[id=505, name=qtp528368933-505, state=RUNNABLE, group=TGRP-BasicDistributedZkTest]
[junit4:junit4]   2> 	        at java.net.SocketInputStream.socketRead0(Native Method)
[junit4:junit4]   2> 	        at java.net.SocketInputStream.read(SocketInputStream.java:150)
[junit4:junit4]   2> 	        at java.net.SocketInputStream.read(SocketInputStream.java:121)
[junit4:junit4]   2> 	        at org.eclipse.jetty.io.ByteArrayBuffer.readFrom(ByteArrayBuffer.java:375)
[junit4:junit4]   2> 	        at org.eclipse.jetty.io.bio.StreamEndPoint.fill(StreamEndPoint.java:141)
[junit4:junit4]   2> 	        at org.eclipse.jetty.server.bio.SocketConnector$ConnectorEndPoint.fill(SocketConnector.java:227)
[junit4:junit4]   2> 	        at org.eclipse.jetty.http.HttpParser.fill(HttpParser.java:1035)
[junit4:junit4]   2> 	        at org.eclipse.jetty.http.HttpParser.parseNext(HttpParser.java:280)
[junit4:junit4]   2> 	        at org.eclipse.jetty.http.HttpParser.parseAvailable(HttpParser.java:235)
[junit4:junit4]   2> 	        at org.eclipse.jetty.server.BlockingHttpConnection.handle(BlockingHttpConnection.java:72)
[junit4:junit4]   2> 	        at org.eclipse.jetty.server.bio.SocketConnector$ConnectorEndPoint.run(SocketConnector.java:264)
[junit4:junit4]   2> 	        at org.eclipse.jetty.util.thread.QueuedThreadPool.runJob(QueuedThreadPool.java:608)
[junit4:junit4]   2> 	        at org.eclipse.jetty.util.thread.QueuedThreadPool$3.run(QueuedThreadPool.java:543)
[junit4:junit4]   2> 	        at java.lang.Thread.run(Thread.java:722)
[junit4:junit4]   2> NOTE: test params are: codec=Lucene41: {n_f1=Pulsing41(freqCutoff=4 minBlockSize=90 maxBlockSize=193), foo_b=MockFixedIntBlock(blockSize=73), foo_d=PostingsFormat(name=MockSep), foo_f=MockFixedIntBlock(blockSize=73), n_tl1=Pulsing41(freqCutoff=4 minBlockSize=90 maxBlockSize=193), n_d1=Pulsing41(freqCutoff=11 minBlockSize=90 maxBlockSize=193), rnd_b=PostingsFormat(name=MockSep), intDefault=Pulsing41(freqCutoff=4 minBlockSize=90 maxBlockSize=193), n_td1=Pulsing41(freqCutoff=4 minBlockSize=90 maxBlockSize=193), timestamp=Pulsing41(freqCutoff=11 minBlockSize=90 maxBlockSize=193), id=PostingsFormat(name=MockSep), range_facet_sl=PostingsFormat(name=MockSep), range_facet_si=Pulsing41(freqCutoff=11 minBlockSize=90 maxBlockSize=193), oddField_s=PostingsFormat(name=MockSep), multiDefault=Pulsing41(freqCutoff=11 minBlockSize=90 maxBlockSize=193), n_tf1=Pulsing41(freqCutoff=11 minBlockSize=90 maxBlockSize=193), n_dt1=Pulsing41(freqCutoff=4 minBlockSize=90 maxBlockSize=193), n_ti1=PostingsFormat(name=MockSep), range_facet_l=Pulsing41(freqCutoff=11 minBlockSize=90 maxBlockSize=193), text=MockFixedIntBlock(blockSize=73), _version_=Pulsing41(freqCutoff=4 minBlockSize=90 maxBlockSize=193), SubjectTerms_mfacet=Pulsing41(freqCutoff=4 minBlockSize=90 maxBlockSize=193), a_t=Pulsing41(freqCutoff=11 minBlockSize=90 maxBlockSize=193), n_tdt1=Pulsing41(freqCutoff=4 minBlockSize=90 maxBlockSize=193), other_tl1=Pulsing41(freqCutoff=4 minBlockSize=90 maxBlockSize=193), n_l1=Pulsing41(freqCutoff=11 minBlockSize=90 maxBlockSize=193), a_si=Pulsing41(freqCutoff=4 minBlockSize=90 maxBlockSize=193)}, sim=DefaultSimilarity, locale=hu, timezone=America/Knox_IN
[junit4:junit4]   2> NOTE: FreeBSD 9.0-RELEASE amd64/Oracle Corporation 1.7.0_09 (64-bit)/cpus=16,threads=17,free=81367704,total=207618048
[junit4:junit4]   2> NOTE: All tests run in this JVM: [TestIndexingPerformance, TestQuerySenderNoQuery, TestJmxMonitoredMap, SimplePostToolTest, SimpleFacetsTest, TestStressLucene, BadComponentTest, ResponseLogComponentTest, AutoCommitTest, CircularListTest, MoreLikeThisHandlerTest, TestReload, DistanceFunctionTest, RequestHandlersTest, TestLMDirichletSimilarityFactory, TestJoin, NotRequiredUniqueKeyTest, TestConfig, SortByFunctionTest, TestSolrQueryParser, BinaryUpdateRequestHandlerTest, PreAnalyzedFieldTest, SolrPluginUtilsTest, DistributedTermsComponentTest, TestFastLRUCache, UpdateRequestProcessorFactoryTest, AlternateDirectoryTest, SuggesterFSTTest, SpellCheckCollatorTest, TestCoreContainer, SearchHandlerTest, TestWordDelimiterFilterFactory, PathHierarchyTokenizerFactoryTest, DateMathParserTest, DateFieldTest, SuggesterWFSTTest, CoreAdminHandlerTest, SampleTest, WordBreakSolrSpellCheckerTest, IndexBasedSpellCheckerTest, JsonLoaderTest, BasicDistributedZkTest]
[junit4:junit4]   2> NOTE: reproduce with: ant test  -Dtestcase=BasicDistributedZkTest -Dtests.seed=5C9F7C8FCAF62C21 -Dtests.multiplier=3 -Dtests.slow=true -Dtests.locale=hu -Dtests.timezone=America/Knox_IN -Dtests.file.encoding=US-ASCII
[junit4:junit4] ERROR   0.00s J0 | BasicDistributedZkTest (suite) <<<
[junit4:junit4]    > Throwable #1: java.lang.Exception: Suite timeout exceeded (>= 7200000 msec).
[junit4:junit4]    > 	at __randomizedtesting.SeedInfo.seed([5C9F7C8FCAF62C21]:0)
[junit4:junit4] Completed on J0 in 7223.47s, 1 test, 2 errors <<< FAILURES!

[...truncated 66 lines...]
BUILD FAILED
/usr/home/hudson/hudson-slave/workspace/Lucene-Solr-Tests-4.x-java7/build.xml:353: The following error occurred while executing this line:
/usr/home/hudson/hudson-slave/workspace/Lucene-Solr-Tests-4.x-java7/build.xml:39: The following error occurred while executing this line:
/usr/home/hudson/hudson-slave/workspace/Lucene-Solr-Tests-4.x-java7/solr/build.xml:178: The following error occurred while executing this line:
/usr/home/hudson/hudson-slave/workspace/Lucene-Solr-Tests-4.x-java7/solr/common-build.xml:438: The following error occurred while executing this line:
/usr/home/hudson/hudson-slave/workspace/Lucene-Solr-Tests-4.x-java7/lucene/common-build.xml:1175: The following error occurred while executing this line:
/usr/home/hudson/hudson-slave/workspace/Lucene-Solr-Tests-4.x-java7/lucene/common-build.xml:840: There were test failures: 244 suites, 1011 tests, 1 suite-level error, 1 error, 1 failure, 55 ignored (3 assumptions)

Total time: 142 minutes 1 second
Build step 'Invoke Ant' marked build as failure
Archiving artifacts
Recording test results
Email was triggered for: Failure
Sending email for trigger: Failure



Mime
View raw message