lucene-dev mailing list archives

Site index · List index
Message view « Date » · « Thread »
Top « Date » · « Thread »
From Apache Jenkins Server <jenk...@builds.apache.org>
Subject [JENKINS] Lucene-Solr-Tests-4.x-Java6 - Build # 1132 - Failure
Date Sat, 15 Dec 2012 00:43:51 GMT
Build: https://builds.apache.org/job/Lucene-Solr-Tests-4.x-Java6/1132/

2 tests failed.
FAILED:  org.apache.solr.cloud.BasicDistributedZk2Test.testDistribSearch

Error Message:
Shard still reported as live in zk - 0 jetty

Stack Trace:
java.lang.AssertionError: Shard still reported as live in zk - 0 jetty
	at __randomizedtesting.SeedInfo.seed([F3778F977AD88A20:7291018F0D87EA1C]:0)
	at org.junit.Assert.fail(Assert.java:93)
	at org.apache.solr.cloud.AbstractFullDistribZkTestBase.waitToSeeNotLive(AbstractFullDistribZkTestBase.java:1239)
	at org.apache.solr.cloud.BasicDistributedZk2Test.brindDownShardIndexSomeDocsAndRecover(BasicDistributedZk2Test.java:217)
	at org.apache.solr.cloud.BasicDistributedZk2Test.doTest(BasicDistributedZk2Test.java:92)
	at org.apache.solr.BaseDistributedSearchTestCase.testDistribSearch(BaseDistributedSearchTestCase.java:793)
	at sun.reflect.NativeMethodAccessorImpl.invoke0(Native Method)
	at sun.reflect.NativeMethodAccessorImpl.invoke(NativeMethodAccessorImpl.java:57)
	at sun.reflect.DelegatingMethodAccessorImpl.invoke(DelegatingMethodAccessorImpl.java:43)
	at java.lang.reflect.Method.invoke(Method.java:616)
	at com.carrotsearch.randomizedtesting.RandomizedRunner.invoke(RandomizedRunner.java:1559)
	at com.carrotsearch.randomizedtesting.RandomizedRunner.access$600(RandomizedRunner.java:79)
	at com.carrotsearch.randomizedtesting.RandomizedRunner$6.evaluate(RandomizedRunner.java:737)
	at com.carrotsearch.randomizedtesting.RandomizedRunner$7.evaluate(RandomizedRunner.java:773)
	at com.carrotsearch.randomizedtesting.RandomizedRunner$8.evaluate(RandomizedRunner.java:787)
	at com.carrotsearch.randomizedtesting.rules.SystemPropertiesRestoreRule$1.evaluate(SystemPropertiesRestoreRule.java:53)
	at org.apache.lucene.util.TestRuleSetupTeardownChained$1.evaluate(TestRuleSetupTeardownChained.java:50)
	at org.apache.lucene.util.TestRuleFieldCacheSanity$1.evaluate(TestRuleFieldCacheSanity.java:51)
	at org.apache.lucene.util.AbstractBeforeAfterRule$1.evaluate(AbstractBeforeAfterRule.java:46)
	at com.carrotsearch.randomizedtesting.rules.SystemPropertiesInvariantRule$1.evaluate(SystemPropertiesInvariantRule.java:55)
	at org.apache.lucene.util.TestRuleThreadAndTestName$1.evaluate(TestRuleThreadAndTestName.java:49)
	at org.apache.lucene.util.TestRuleIgnoreAfterMaxFailures$1.evaluate(TestRuleIgnoreAfterMaxFailures.java:70)
	at org.apache.lucene.util.TestRuleMarkFailure$1.evaluate(TestRuleMarkFailure.java:48)
	at com.carrotsearch.randomizedtesting.rules.StatementAdapter.evaluate(StatementAdapter.java:36)
	at com.carrotsearch.randomizedtesting.ThreadLeakControl$StatementRunner.run(ThreadLeakControl.java:358)
	at com.carrotsearch.randomizedtesting.ThreadLeakControl.forkTimeoutingTask(ThreadLeakControl.java:782)
	at com.carrotsearch.randomizedtesting.ThreadLeakControl$3.evaluate(ThreadLeakControl.java:442)
	at com.carrotsearch.randomizedtesting.RandomizedRunner.runSingleTest(RandomizedRunner.java:746)
	at com.carrotsearch.randomizedtesting.RandomizedRunner$3.evaluate(RandomizedRunner.java:648)
	at com.carrotsearch.randomizedtesting.RandomizedRunner$4.evaluate(RandomizedRunner.java:682)
	at com.carrotsearch.randomizedtesting.RandomizedRunner$5.evaluate(RandomizedRunner.java:693)
	at com.carrotsearch.randomizedtesting.rules.StatementAdapter.evaluate(StatementAdapter.java:36)
	at com.carrotsearch.randomizedtesting.rules.SystemPropertiesRestoreRule$1.evaluate(SystemPropertiesRestoreRule.java:53)
	at org.apache.lucene.util.AbstractBeforeAfterRule$1.evaluate(AbstractBeforeAfterRule.java:46)
	at org.apache.lucene.util.TestRuleStoreClassName$1.evaluate(TestRuleStoreClassName.java:42)
	at com.carrotsearch.randomizedtesting.rules.SystemPropertiesInvariantRule$1.evaluate(SystemPropertiesInvariantRule.java:55)
	at com.carrotsearch.randomizedtesting.rules.NoShadowingOrOverridesOnMethodsRule$1.evaluate(NoShadowingOrOverridesOnMethodsRule.java:39)
	at com.carrotsearch.randomizedtesting.rules.NoShadowingOrOverridesOnMethodsRule$1.evaluate(NoShadowingOrOverridesOnMethodsRule.java:39)
	at com.carrotsearch.randomizedtesting.rules.StatementAdapter.evaluate(StatementAdapter.java:36)
	at org.apache.lucene.util.TestRuleAssertionsRequired$1.evaluate(TestRuleAssertionsRequired.java:43)
	at org.apache.lucene.util.TestRuleMarkFailure$1.evaluate(TestRuleMarkFailure.java:48)
	at org.apache.lucene.util.TestRuleIgnoreAfterMaxFailures$1.evaluate(TestRuleIgnoreAfterMaxFailures.java:70)
	at org.apache.lucene.util.TestRuleIgnoreTestSuites$1.evaluate(TestRuleIgnoreTestSuites.java:55)
	at com.carrotsearch.randomizedtesting.rules.StatementAdapter.evaluate(StatementAdapter.java:36)
	at com.carrotsearch.randomizedtesting.ThreadLeakControl$StatementRunner.run(ThreadLeakControl.java:358)
	at java.lang.Thread.run(Thread.java:679)


FAILED:  org.apache.solr.cloud.SyncSliceTest.testDistribSearch

Error Message:
Shard still reported as live in zk - 0 jetty

Stack Trace:
java.lang.AssertionError: Shard still reported as live in zk - 0 jetty
	at __randomizedtesting.SeedInfo.seed([F3778F977AD88A20:7291018F0D87EA1C]:0)
	at org.junit.Assert.fail(Assert.java:93)
	at org.apache.solr.cloud.AbstractFullDistribZkTestBase.waitToSeeNotLive(AbstractFullDistribZkTestBase.java:1239)
	at org.apache.solr.cloud.AbstractFullDistribZkTestBase.waitToSeeNotLive(AbstractFullDistribZkTestBase.java:1224)
	at org.apache.solr.cloud.SyncSliceTest.waitToSeeDownInClusterState(SyncSliceTest.java:259)
	at org.apache.solr.cloud.SyncSliceTest.doTest(SyncSliceTest.java:163)
	at org.apache.solr.BaseDistributedSearchTestCase.testDistribSearch(BaseDistributedSearchTestCase.java:793)
	at sun.reflect.NativeMethodAccessorImpl.invoke0(Native Method)
	at sun.reflect.NativeMethodAccessorImpl.invoke(NativeMethodAccessorImpl.java:57)
	at sun.reflect.DelegatingMethodAccessorImpl.invoke(DelegatingMethodAccessorImpl.java:43)
	at java.lang.reflect.Method.invoke(Method.java:616)
	at com.carrotsearch.randomizedtesting.RandomizedRunner.invoke(RandomizedRunner.java:1559)
	at com.carrotsearch.randomizedtesting.RandomizedRunner.access$600(RandomizedRunner.java:79)
	at com.carrotsearch.randomizedtesting.RandomizedRunner$6.evaluate(RandomizedRunner.java:737)
	at com.carrotsearch.randomizedtesting.RandomizedRunner$7.evaluate(RandomizedRunner.java:773)
	at com.carrotsearch.randomizedtesting.RandomizedRunner$8.evaluate(RandomizedRunner.java:787)
	at com.carrotsearch.randomizedtesting.rules.SystemPropertiesRestoreRule$1.evaluate(SystemPropertiesRestoreRule.java:53)
	at org.apache.lucene.util.TestRuleSetupTeardownChained$1.evaluate(TestRuleSetupTeardownChained.java:50)
	at org.apache.lucene.util.TestRuleFieldCacheSanity$1.evaluate(TestRuleFieldCacheSanity.java:51)
	at org.apache.lucene.util.AbstractBeforeAfterRule$1.evaluate(AbstractBeforeAfterRule.java:46)
	at com.carrotsearch.randomizedtesting.rules.SystemPropertiesInvariantRule$1.evaluate(SystemPropertiesInvariantRule.java:55)
	at org.apache.lucene.util.TestRuleThreadAndTestName$1.evaluate(TestRuleThreadAndTestName.java:49)
	at org.apache.lucene.util.TestRuleIgnoreAfterMaxFailures$1.evaluate(TestRuleIgnoreAfterMaxFailures.java:70)
	at org.apache.lucene.util.TestRuleMarkFailure$1.evaluate(TestRuleMarkFailure.java:48)
	at com.carrotsearch.randomizedtesting.rules.StatementAdapter.evaluate(StatementAdapter.java:36)
	at com.carrotsearch.randomizedtesting.ThreadLeakControl$StatementRunner.run(ThreadLeakControl.java:358)
	at com.carrotsearch.randomizedtesting.ThreadLeakControl.forkTimeoutingTask(ThreadLeakControl.java:782)
	at com.carrotsearch.randomizedtesting.ThreadLeakControl$3.evaluate(ThreadLeakControl.java:442)
	at com.carrotsearch.randomizedtesting.RandomizedRunner.runSingleTest(RandomizedRunner.java:746)
	at com.carrotsearch.randomizedtesting.RandomizedRunner$3.evaluate(RandomizedRunner.java:648)
	at com.carrotsearch.randomizedtesting.RandomizedRunner$4.evaluate(RandomizedRunner.java:682)
	at com.carrotsearch.randomizedtesting.RandomizedRunner$5.evaluate(RandomizedRunner.java:693)
	at com.carrotsearch.randomizedtesting.rules.StatementAdapter.evaluate(StatementAdapter.java:36)
	at com.carrotsearch.randomizedtesting.rules.SystemPropertiesRestoreRule$1.evaluate(SystemPropertiesRestoreRule.java:53)
	at org.apache.lucene.util.AbstractBeforeAfterRule$1.evaluate(AbstractBeforeAfterRule.java:46)
	at org.apache.lucene.util.TestRuleStoreClassName$1.evaluate(TestRuleStoreClassName.java:42)
	at com.carrotsearch.randomizedtesting.rules.SystemPropertiesInvariantRule$1.evaluate(SystemPropertiesInvariantRule.java:55)
	at com.carrotsearch.randomizedtesting.rules.NoShadowingOrOverridesOnMethodsRule$1.evaluate(NoShadowingOrOverridesOnMethodsRule.java:39)
	at com.carrotsearch.randomizedtesting.rules.NoShadowingOrOverridesOnMethodsRule$1.evaluate(NoShadowingOrOverridesOnMethodsRule.java:39)
	at com.carrotsearch.randomizedtesting.rules.StatementAdapter.evaluate(StatementAdapter.java:36)
	at org.apache.lucene.util.TestRuleAssertionsRequired$1.evaluate(TestRuleAssertionsRequired.java:43)
	at org.apache.lucene.util.TestRuleMarkFailure$1.evaluate(TestRuleMarkFailure.java:48)
	at org.apache.lucene.util.TestRuleIgnoreAfterMaxFailures$1.evaluate(TestRuleIgnoreAfterMaxFailures.java:70)
	at org.apache.lucene.util.TestRuleIgnoreTestSuites$1.evaluate(TestRuleIgnoreTestSuites.java:55)
	at com.carrotsearch.randomizedtesting.rules.StatementAdapter.evaluate(StatementAdapter.java:36)
	at com.carrotsearch.randomizedtesting.ThreadLeakControl$StatementRunner.run(ThreadLeakControl.java:358)
	at java.lang.Thread.run(Thread.java:679)




Build Log:
[...truncated 8226 lines...]
[junit4:junit4] Suite: org.apache.solr.cloud.SyncSliceTest
[junit4:junit4]   2> 0 T827 oas.BaseDistributedSearchTestCase.initHostContext Setting hostContext system property: /
[junit4:junit4]   2> 5 T827 oas.SolrTestCaseJ4.setUp ###Starting testDistribSearch
[junit4:junit4]   2> Creating dataDir: /usr/home/hudson/hudson-slave/workspace/Lucene-Solr-Tests-4.x-Java6/solr/build/solr-core/test/J0/./solrtest-SyncSliceTest-1355531696787
[junit4:junit4]   2> 7 T827 oasc.ZkTestServer.run STARTING ZK TEST SERVER
[junit4:junit4]   2> 7 T828 oasc.ZkTestServer$ZKServerMain.runFromConfig Starting server
[junit4:junit4]   2> 11 T828 oazs.ZooKeeperServer.setTickTime tickTime set to 1000
[junit4:junit4]   2> 11 T828 oazs.ZooKeeperServer.setMinSessionTimeout minSessionTimeout set to -1
[junit4:junit4]   2> 12 T828 oazs.ZooKeeperServer.setMaxSessionTimeout maxSessionTimeout set to -1
[junit4:junit4]   2> 12 T828 oazs.NIOServerCnxnFactory.configure binding to port 0.0.0.0/0.0.0.0:0
[junit4:junit4]   2> 13 T828 oazsp.FileTxnSnapLog.save Snapshotting: 0x0 to /usr/home/hudson/hudson-slave/workspace/Lucene-Solr-Tests-4.x-Java6/solr/build/solr-core/test/J0/./org.apache.solr.cloud.SyncSliceTest-1355531696787/zookeeper/server1/data/version-2/snapshot.0
[junit4:junit4]   2> 108 T827 oasc.ZkTestServer.run start zk server on port:37608
[junit4:junit4]   2> 109 T827 oaz.ZooKeeper.<init> Initiating client connection, connectString=127.0.0.1:37608 sessionTimeout=10000 watcher=org.apache.solr.common.cloud.ConnectionManager@1fbdc22
[junit4:junit4]   2> 110 T827 oascc.ConnectionManager.waitForConnected Waiting for client to connect to ZooKeeper
[junit4:junit4]   2> 111 T833 oaz.ClientCnxn$SendThread.logStartConnect Opening socket connection to server localhost/127.0.0.1:37608. Will not attempt to authenticate using SASL (access denied (javax.security.auth.AuthPermission getLoginConfiguration))
[junit4:junit4]   2> 111 T833 oaz.ClientCnxn$SendThread.primeConnection Socket connection established to localhost/127.0.0.1:37608, initiating session
[junit4:junit4]   2> 112 T829 oazs.NIOServerCnxnFactory.run Accepted socket connection from /140.211.11.196:37609
[junit4:junit4]   2> 112 T829 oazs.ZooKeeperServer.processConnectRequest Client attempting to establish new session at /140.211.11.196:37609
[junit4:junit4]   2> 113 T831 oazsp.FileTxnLog.append Creating new log file: log.1
[junit4:junit4]   2> 121 T831 oazs.ZooKeeperServer.finishSessionInit Established session 0x13b9bfc3a9b0000 with negotiated timeout 10000 for client /140.211.11.196:37609
[junit4:junit4]   2> 122 T833 oaz.ClientCnxn$SendThread.onConnected Session establishment complete on server localhost/127.0.0.1:37608, sessionid = 0x13b9bfc3a9b0000, negotiated timeout = 10000
[junit4:junit4]   2> 122 T834 oascc.ConnectionManager.process Watcher org.apache.solr.common.cloud.ConnectionManager@1fbdc22 name:ZooKeeperConnection Watcher:127.0.0.1:37608 got event WatchedEvent state:SyncConnected type:None path:null path:null type:None
[junit4:junit4]   2> 122 T827 oascc.ConnectionManager.waitForConnected Client is connected to ZooKeeper
[junit4:junit4]   2> 123 T827 oascc.SolrZkClient.makePath makePath: /solr
[junit4:junit4]   2> 134 T832 oazs.PrepRequestProcessor.pRequest2Txn Processed session termination for sessionid: 0x13b9bfc3a9b0000
[junit4:junit4]   2> 145 T834 oaz.ClientCnxn$EventThread.run EventThread shut down
[junit4:junit4]   2> 145 T829 oazs.NIOServerCnxn.closeSock Closed socket connection for client /140.211.11.196:37609 which had sessionid 0x13b9bfc3a9b0000
[junit4:junit4]   2> 145 T827 oaz.ZooKeeper.close Session: 0x13b9bfc3a9b0000 closed
[junit4:junit4]   2> 146 T827 oaz.ZooKeeper.<init> Initiating client connection, connectString=127.0.0.1:37608/solr sessionTimeout=10000 watcher=org.apache.solr.common.cloud.ConnectionManager@58fc2912
[junit4:junit4]   2> 147 T827 oascc.ConnectionManager.waitForConnected Waiting for client to connect to ZooKeeper
[junit4:junit4]   2> 147 T835 oaz.ClientCnxn$SendThread.logStartConnect Opening socket connection to server localhost/127.0.0.1:37608. Will not attempt to authenticate using SASL (access denied (javax.security.auth.AuthPermission getLoginConfiguration))
[junit4:junit4]   2> 148 T835 oaz.ClientCnxn$SendThread.primeConnection Socket connection established to localhost/127.0.0.1:37608, initiating session
[junit4:junit4]   2> 148 T829 oazs.NIOServerCnxnFactory.run Accepted socket connection from /140.211.11.196:37610
[junit4:junit4]   2> 148 T829 oazs.ZooKeeperServer.processConnectRequest Client attempting to establish new session at /140.211.11.196:37610
[junit4:junit4]   2> 151 T831 oazs.ZooKeeperServer.finishSessionInit Established session 0x13b9bfc3a9b0001 with negotiated timeout 10000 for client /140.211.11.196:37610
[junit4:junit4]   2> 151 T835 oaz.ClientCnxn$SendThread.onConnected Session establishment complete on server localhost/127.0.0.1:37608, sessionid = 0x13b9bfc3a9b0001, negotiated timeout = 10000
[junit4:junit4]   2> 152 T836 oascc.ConnectionManager.process Watcher org.apache.solr.common.cloud.ConnectionManager@58fc2912 name:ZooKeeperConnection Watcher:127.0.0.1:37608/solr got event WatchedEvent state:SyncConnected type:None path:null path:null type:None
[junit4:junit4]   2> 152 T827 oascc.ConnectionManager.waitForConnected Client is connected to ZooKeeper
[junit4:junit4]   2> 153 T827 oascc.SolrZkClient.makePath makePath: /collections/collection1
[junit4:junit4]   2> 169 T827 oascc.SolrZkClient.makePath makePath: /collections/collection1/shards
[junit4:junit4]   2> 179 T827 oascc.SolrZkClient.makePath makePath: /collections/control_collection
[junit4:junit4]   2> 190 T827 oascc.SolrZkClient.makePath makePath: /collections/control_collection/shards
[junit4:junit4]   2> 205 T827 oasc.AbstractZkTestCase.putConfig put /usr/home/hudson/hudson-slave/workspace/Lucene-Solr-Tests-4.x-Java6/solr/build/solr-core/test-files/solr/collection1/conf/solrconfig.xml to /configs/conf1/solrconfig.xml
[junit4:junit4]   2> 206 T827 oascc.SolrZkClient.makePath makePath: /configs/conf1/solrconfig.xml
[junit4:junit4]   2> 223 T827 oasc.AbstractZkTestCase.putConfig put /usr/home/hudson/hudson-slave/workspace/Lucene-Solr-Tests-4.x-Java6/solr/build/solr-core/test-files/solr/collection1/conf/schema.xml to /configs/conf1/schema.xml
[junit4:junit4]   2> 225 T827 oascc.SolrZkClient.makePath makePath: /configs/conf1/schema.xml
[junit4:junit4]   2> 330 T827 oasc.AbstractZkTestCase.putConfig put /usr/home/hudson/hudson-slave/workspace/Lucene-Solr-Tests-4.x-Java6/solr/build/solr-core/test-files/solr/collection1/conf/stopwords.txt to /configs/conf1/stopwords.txt
[junit4:junit4]   2> 331 T827 oascc.SolrZkClient.makePath makePath: /configs/conf1/stopwords.txt
[junit4:junit4]   2> 336 T827 oasc.AbstractZkTestCase.putConfig put /usr/home/hudson/hudson-slave/workspace/Lucene-Solr-Tests-4.x-Java6/solr/build/solr-core/test-files/solr/collection1/conf/protwords.txt to /configs/conf1/protwords.txt
[junit4:junit4]   2> 337 T827 oascc.SolrZkClient.makePath makePath: /configs/conf1/protwords.txt
[junit4:junit4]   2> 341 T827 oasc.AbstractZkTestCase.putConfig put /usr/home/hudson/hudson-slave/workspace/Lucene-Solr-Tests-4.x-Java6/solr/build/solr-core/test-files/solr/collection1/conf/currency.xml to /configs/conf1/currency.xml
[junit4:junit4]   2> 342 T827 oascc.SolrZkClient.makePath makePath: /configs/conf1/currency.xml
[junit4:junit4]   2> 347 T827 oasc.AbstractZkTestCase.putConfig put /usr/home/hudson/hudson-slave/workspace/Lucene-Solr-Tests-4.x-Java6/solr/build/solr-core/test-files/solr/collection1/conf/open-exchange-rates.json to /configs/conf1/open-exchange-rates.json
[junit4:junit4]   2> 348 T827 oascc.SolrZkClient.makePath makePath: /configs/conf1/open-exchange-rates.json
[junit4:junit4]   2> 352 T827 oasc.AbstractZkTestCase.putConfig put /usr/home/hudson/hudson-slave/workspace/Lucene-Solr-Tests-4.x-Java6/solr/build/solr-core/test-files/solr/collection1/conf/mapping-ISOLatin1Accent.txt to /configs/conf1/mapping-ISOLatin1Accent.txt
[junit4:junit4]   2> 354 T827 oascc.SolrZkClient.makePath makePath: /configs/conf1/mapping-ISOLatin1Accent.txt
[junit4:junit4]   2> 358 T827 oasc.AbstractZkTestCase.putConfig put /usr/home/hudson/hudson-slave/workspace/Lucene-Solr-Tests-4.x-Java6/solr/build/solr-core/test-files/solr/collection1/conf/old_synonyms.txt to /configs/conf1/old_synonyms.txt
[junit4:junit4]   2> 359 T827 oascc.SolrZkClient.makePath makePath: /configs/conf1/old_synonyms.txt
[junit4:junit4]   2> 363 T827 oasc.AbstractZkTestCase.putConfig put /usr/home/hudson/hudson-slave/workspace/Lucene-Solr-Tests-4.x-Java6/solr/build/solr-core/test-files/solr/collection1/conf/synonyms.txt to /configs/conf1/synonyms.txt
[junit4:junit4]   2> 364 T827 oascc.SolrZkClient.makePath makePath: /configs/conf1/synonyms.txt
[junit4:junit4]   2> 369 T832 oazs.PrepRequestProcessor.pRequest2Txn Processed session termination for sessionid: 0x13b9bfc3a9b0001
[junit4:junit4]   2> 370 T829 oazs.NIOServerCnxn.closeSock Closed socket connection for client /140.211.11.196:37610 which had sessionid 0x13b9bfc3a9b0001
[junit4:junit4]   2> 370 T836 oaz.ClientCnxn$EventThread.run EventThread shut down
[junit4:junit4]   2> 370 T827 oaz.ZooKeeper.close Session: 0x13b9bfc3a9b0001 closed
[junit4:junit4]   2> 557 T827 oejs.Server.doStart jetty-8.1.8.v20121106
[junit4:junit4]   2> 569 T827 oejs.AbstractConnector.doStart Started SocketConnector@127.0.0.1:37611
[junit4:junit4]   2> 570 T827 oasc.SolrResourceLoader.locateSolrHome JNDI not configured for solr (NoInitialContextEx)
[junit4:junit4]   2> 571 T827 oasc.SolrResourceLoader.locateSolrHome using system property solr.solr.home: /usr/home/hudson/hudson-slave/workspace/Lucene-Solr-Tests-4.x-Java6/solr/build/solr-core/test/J0/./org.apache.solr.cloud.SyncSliceTest-controljetty-1355531697152
[junit4:junit4]   2> 572 T827 oasc.SolrResourceLoader.<init> new SolrResourceLoader for deduced Solr Home: '/usr/home/hudson/hudson-slave/workspace/Lucene-Solr-Tests-4.x-Java6/solr/build/solr-core/test/J0/./org.apache.solr.cloud.SyncSliceTest-controljetty-1355531697152/'
[junit4:junit4]   2> 610 T827 oass.SolrDispatchFilter.init SolrDispatchFilter.init()
[junit4:junit4]   2> 611 T827 oasc.SolrResourceLoader.locateSolrHome JNDI not configured for solr (NoInitialContextEx)
[junit4:junit4]   2> 611 T827 oasc.SolrResourceLoader.locateSolrHome using system property solr.solr.home: /usr/home/hudson/hudson-slave/workspace/Lucene-Solr-Tests-4.x-Java6/solr/build/solr-core/test/J0/./org.apache.solr.cloud.SyncSliceTest-controljetty-1355531697152
[junit4:junit4]   2> 612 T827 oasc.CoreContainer$Initializer.initialize looking for solr.xml: /usr/home/hudson/hudson-slave/workspace/Lucene-Solr-Tests-4.x-Java6/solr/build/solr-core/test/J0/./org.apache.solr.cloud.SyncSliceTest-controljetty-1355531697152/solr.xml
[junit4:junit4]   2> 613 T827 oasc.CoreContainer.<init> New CoreContainer 1644609396
[junit4:junit4]   2> 613 T827 oasc.CoreContainer.load Loading CoreContainer using Solr Home: '/usr/home/hudson/hudson-slave/workspace/Lucene-Solr-Tests-4.x-Java6/solr/build/solr-core/test/J0/./org.apache.solr.cloud.SyncSliceTest-controljetty-1355531697152/'
[junit4:junit4]   2> 614 T827 oasc.SolrResourceLoader.<init> new SolrResourceLoader for directory: '/usr/home/hudson/hudson-slave/workspace/Lucene-Solr-Tests-4.x-Java6/solr/build/solr-core/test/J0/./org.apache.solr.cloud.SyncSliceTest-controljetty-1355531697152/'
[junit4:junit4]   2> 642 T827 oasc.CoreContainer.load Registering Log Listener
[junit4:junit4]   2> 659 T827 oasc.CoreContainer.initZooKeeper Zookeeper client=127.0.0.1:37608/solr
[junit4:junit4]   2> 660 T827 oasc.ZkController.checkChrootPath zkHost includes chroot
[junit4:junit4]   2> 660 T827 oaz.ZooKeeper.<init> Initiating client connection, connectString=127.0.0.1:37608 sessionTimeout=60000 watcher=org.apache.solr.common.cloud.ConnectionManager@27976c8e
[junit4:junit4]   2> 662 T827 oascc.ConnectionManager.waitForConnected Waiting for client to connect to ZooKeeper
[junit4:junit4]   2> 662 T846 oaz.ClientCnxn$SendThread.logStartConnect Opening socket connection to server localhost/127.0.0.1:37608. Will not attempt to authenticate using SASL (access denied (javax.security.auth.AuthPermission getLoginConfiguration))
[junit4:junit4]   2> 663 T846 oaz.ClientCnxn$SendThread.primeConnection Socket connection established to localhost/127.0.0.1:37608, initiating session
[junit4:junit4]   2> 663 T829 oazs.NIOServerCnxnFactory.run Accepted socket connection from /140.211.11.196:37612
[junit4:junit4]   2> 664 T829 oazs.ZooKeeperServer.processConnectRequest Client attempting to establish new session at /140.211.11.196:37612
[junit4:junit4]   2> 666 T831 oazs.ZooKeeperServer.finishSessionInit Established session 0x13b9bfc3a9b0002 with negotiated timeout 20000 for client /140.211.11.196:37612
[junit4:junit4]   2> 666 T846 oaz.ClientCnxn$SendThread.onConnected Session establishment complete on server localhost/127.0.0.1:37608, sessionid = 0x13b9bfc3a9b0002, negotiated timeout = 20000
[junit4:junit4]   2> 666 T847 oascc.ConnectionManager.process Watcher org.apache.solr.common.cloud.ConnectionManager@27976c8e name:ZooKeeperConnection Watcher:127.0.0.1:37608 got event WatchedEvent state:SyncConnected type:None path:null path:null type:None
[junit4:junit4]   2> 666 T827 oascc.ConnectionManager.waitForConnected Client is connected to ZooKeeper
[junit4:junit4]   2> 668 T832 oazs.PrepRequestProcessor.pRequest2Txn Processed session termination for sessionid: 0x13b9bfc3a9b0002
[junit4:junit4]   2> 669 T847 oaz.ClientCnxn$EventThread.run EventThread shut down
[junit4:junit4]   2> 669 T829 oazs.NIOServerCnxn.closeSock Closed socket connection for client /140.211.11.196:37612 which had sessionid 0x13b9bfc3a9b0002
[junit4:junit4]   2> 669 T827 oaz.ZooKeeper.close Session: 0x13b9bfc3a9b0002 closed
[junit4:junit4]   2> 670 T827 oaz.ZooKeeper.<init> Initiating client connection, connectString=127.0.0.1:37608/solr sessionTimeout=8000 watcher=org.apache.solr.common.cloud.ConnectionManager@2d1b687
[junit4:junit4]   2> 672 T848 oaz.ClientCnxn$SendThread.logStartConnect Opening socket connection to server localhost/127.0.0.1:37608. Will not attempt to authenticate using SASL (access denied (javax.security.auth.AuthPermission getLoginConfiguration))
[junit4:junit4]   2> 671 T827 oascc.ConnectionManager.waitForConnected Waiting for client to connect to ZooKeeper
[junit4:junit4]   2> 672 T848 oaz.ClientCnxn$SendThread.primeConnection Socket connection established to localhost/127.0.0.1:37608, initiating session
[junit4:junit4]   2> 672 T829 oazs.NIOServerCnxnFactory.run Accepted socket connection from /140.211.11.196:37613
[junit4:junit4]   2> 673 T829 oazs.ZooKeeperServer.processConnectRequest Client attempting to establish new session at /140.211.11.196:37613
[junit4:junit4]   2> 674 T831 oazs.ZooKeeperServer.finishSessionInit Established session 0x13b9bfc3a9b0003 with negotiated timeout 8000 for client /140.211.11.196:37613
[junit4:junit4]   2> 674 T848 oaz.ClientCnxn$SendThread.onConnected Session establishment complete on server localhost/127.0.0.1:37608, sessionid = 0x13b9bfc3a9b0003, negotiated timeout = 8000
[junit4:junit4]   2> 674 T849 oascc.ConnectionManager.process Watcher org.apache.solr.common.cloud.ConnectionManager@2d1b687 name:ZooKeeperConnection Watcher:127.0.0.1:37608/solr got event WatchedEvent state:SyncConnected type:None path:null path:null type:None
[junit4:junit4]   2> 674 T827 oascc.ConnectionManager.waitForConnected Client is connected to ZooKeeper
[junit4:junit4]   2> 677 T832 oazs.PrepRequestProcessor.pRequest Got user-level KeeperException when processing sessionid:0x13b9bfc3a9b0003 type:create cxid:0x2 zxid:0x1a txntype:-1 reqpath:n/a Error Path:/solr/overseer Error:KeeperErrorCode = NodeExists for /solr/overseer
[junit4:junit4]   2> 685 T827 oascc.SolrZkClient.makePath makePath: /live_nodes
[junit4:junit4]   2> 688 T827 oasc.ZkController.createEphemeralLiveNode Register node as live in ZooKeeper:/live_nodes/127.0.0.1:37611_
[junit4:junit4]   2> 689 T832 oazs.PrepRequestProcessor.pRequest Got user-level KeeperException when processing sessionid:0x13b9bfc3a9b0003 type:delete cxid:0x7 zxid:0x1c txntype:-1 reqpath:n/a Error Path:/solr/live_nodes/127.0.0.1:37611_ Error:KeeperErrorCode = NoNode for /solr/live_nodes/127.0.0.1:37611_
[junit4:junit4]   2> 690 T827 oascc.SolrZkClient.makePath makePath: /live_nodes/127.0.0.1:37611_
[junit4:junit4]   2> 699 T827 oashc.HttpShardHandlerFactory.getParameter Setting socketTimeout to: 0
[junit4:junit4]   2> 700 T827 oashc.HttpShardHandlerFactory.getParameter Setting urlScheme to: http://
[junit4:junit4]   2> 701 T827 oashc.HttpShardHandlerFactory.getParameter Setting connTimeout to: 0
[junit4:junit4]   2> 702 T827 oashc.HttpShardHandlerFactory.getParameter Setting maxConnectionsPerHost to: 20
[junit4:junit4]   2> 702 T827 oashc.HttpShardHandlerFactory.getParameter Setting corePoolSize to: 0
[junit4:junit4]   2> 703 T827 oashc.HttpShardHandlerFactory.getParameter Setting maximumPoolSize to: 2147483647
[junit4:junit4]   2> 704 T827 oashc.HttpShardHandlerFactory.getParameter Setting maxThreadIdleTime to: 5
[junit4:junit4]   2> 704 T827 oashc.HttpShardHandlerFactory.getParameter Setting sizeOfQueue to: -1
[junit4:junit4]   2> 705 T827 oashc.HttpShardHandlerFactory.getParameter Setting fairnessPolicy to: false
[junit4:junit4]   2> 705 T827 oascsi.HttpClientUtil.createClient Creating new http client, config:maxConnectionsPerHost=20&maxConnections=10000&socketTimeout=0&connTimeout=0&retry=false
[junit4:junit4]   2> 723 T827 oascc.SolrZkClient.makePath makePath: /overseer_elect/election
[junit4:junit4]   2> 752 T832 oazs.PrepRequestProcessor.pRequest Got user-level KeeperException when processing sessionid:0x13b9bfc3a9b0003 type:delete cxid:0x15 zxid:0x21 txntype:-1 reqpath:n/a Error Path:/solr/overseer_elect/leader Error:KeeperErrorCode = NoNode for /solr/overseer_elect/leader
[junit4:junit4]   2> 759 T827 oascc.SolrZkClient.makePath makePath: /overseer_elect/leader
[junit4:junit4]   2> 768 T827 oasc.Overseer.start Overseer (id=88836125281157123-127.0.0.1:37611_-n_0000000000) starting
[junit4:junit4]   2> 768 T832 oazs.PrepRequestProcessor.pRequest Got user-level KeeperException when processing sessionid:0x13b9bfc3a9b0003 type:create cxid:0x1a zxid:0x23 txntype:-1 reqpath:n/a Error Path:/solr/overseer Error:KeeperErrorCode = NodeExists for /solr/overseer
[junit4:junit4]   2> 775 T832 oazs.PrepRequestProcessor.pRequest Got user-level KeeperException when processing sessionid:0x13b9bfc3a9b0003 type:create cxid:0x1b zxid:0x24 txntype:-1 reqpath:n/a Error Path:/solr/overseer Error:KeeperErrorCode = NodeExists for /solr/overseer
[junit4:junit4]   2> 785 T832 oazs.PrepRequestProcessor.pRequest Got user-level KeeperException when processing sessionid:0x13b9bfc3a9b0003 type:create cxid:0x1c zxid:0x25 txntype:-1 reqpath:n/a Error Path:/solr/overseer Error:KeeperErrorCode = NodeExists for /solr/overseer
[junit4:junit4]   2> 786 T832 oazs.PrepRequestProcessor.pRequest Got user-level KeeperException when processing sessionid:0x13b9bfc3a9b0003 type:create cxid:0x1d zxid:0x26 txntype:-1 reqpath:n/a Error Path:/solr/overseer Error:KeeperErrorCode = NodeExists for /solr/overseer
[junit4:junit4]   2> 787 T851 oasc.OverseerCollectionProcessor.run Process current queue of collection messages
[junit4:junit4]   2> 788 T827 oascc.SolrZkClient.makePath makePath: /clusterstate.json
[junit4:junit4]   2> 804 T827 oascc.ZkStateReader.createClusterStateWatchersAndUpdate Updating cluster state from ZooKeeper... 
[junit4:junit4]   2> 813 T852 oasc.CoreContainer.create Creating SolrCore 'collection1' using instanceDir: /usr/home/hudson/hudson-slave/workspace/Lucene-Solr-Tests-4.x-Java6/solr/build/solr-core/test/J0/./org.apache.solr.cloud.SyncSliceTest-controljetty-1355531697152/collection1
[junit4:junit4]   2> 813 T850 oasc.Overseer$ClusterStateUpdater.run Starting to work on the main queue
[junit4:junit4]   2> 814 T852 oasc.ZkController.createCollectionZkNode Check for collection zkNode:control_collection
[junit4:junit4]   2> 814 T852 oasc.ZkController.createCollectionZkNode Collection zkNode exists
[junit4:junit4]   2> 815 T852 oasc.ZkController.readConfigName Load collection config from:/collections/control_collection
[junit4:junit4]   2> 817 T852 oasc.SolrResourceLoader.<init> new SolrResourceLoader for directory: '/usr/home/hudson/hudson-slave/workspace/Lucene-Solr-Tests-4.x-Java6/solr/build/solr-core/test/J0/./org.apache.solr.cloud.SyncSliceTest-controljetty-1355531697152/collection1/'
[junit4:junit4]   2> 818 T852 oasc.SolrResourceLoader.replaceClassLoader Adding 'file:/usr/home/hudson/hudson-slave/workspace/Lucene-Solr-Tests-4.x-Java6/solr/build/solr-core/test/J0/org.apache.solr.cloud.SyncSliceTest-controljetty-1355531697152/collection1/lib/classes/' to classloader
[junit4:junit4]   2> 819 T852 oasc.SolrResourceLoader.replaceClassLoader Adding 'file:/usr/home/hudson/hudson-slave/workspace/Lucene-Solr-Tests-4.x-Java6/solr/build/solr-core/test/J0/org.apache.solr.cloud.SyncSliceTest-controljetty-1355531697152/collection1/lib/README' to classloader
[junit4:junit4]   2> 876 T852 oasc.SolrConfig.<init> Using Lucene MatchVersion: LUCENE_41
[junit4:junit4]   2> 946 T852 oasc.SolrConfig.<init> Loaded SolrConfig: solrconfig.xml
[junit4:junit4]   2> 1047 T852 oass.IndexSchema.readSchema Reading Solr Schema
[junit4:junit4]   2> 1054 T852 oass.IndexSchema.readSchema Schema name=test
[junit4:junit4]   2> 1705 T852 oass.OpenExchangeRatesOrgProvider.init Initialized with rates=open-exchange-rates.json, refreshInterval=1440.
[junit4:junit4]   2> 1717 T852 oass.IndexSchema.readSchema default search field in schema is text
[junit4:junit4]   2> 1721 T852 oass.IndexSchema.readSchema unique key field: id
[junit4:junit4]   2> 1740 T852 oass.FileExchangeRateProvider.reload Reloading exchange rates from file currency.xml
[junit4:junit4]   2> 1747 T852 oass.FileExchangeRateProvider.reload Reloading exchange rates from file currency.xml
[junit4:junit4]   2> 1754 T852 oass.OpenExchangeRatesOrgProvider.reload Reloading exchange rates from open-exchange-rates.json
[junit4:junit4]   2> 1756 T852 oass.OpenExchangeRatesOrgProvider.reload Reloading exchange rates from open-exchange-rates.json
[junit4:junit4]   2> 1757 T852 oasc.SolrCore.<init> [collection1] Opening new SolrCore at /usr/home/hudson/hudson-slave/workspace/Lucene-Solr-Tests-4.x-Java6/solr/build/solr-core/test/J0/./org.apache.solr.cloud.SyncSliceTest-controljetty-1355531697152/collection1/, dataDir=./org.apache.solr.cloud.SyncSliceTest-1355531696787/control/data/
[junit4:junit4]   2> 1757 T852 oasc.JmxMonitoredMap.<init> JMX monitoring is enabled. Adding Solr mbeans to JMX Server: com.sun.jmx.mbeanserver.JmxMBeanServer@61250ff2
[junit4:junit4]   2> 1758 T852 oasc.SolrCore.initDirectoryFactory solr.NRTCachingDirectoryFactory
[junit4:junit4]   2> 1821 T852 oasc.CachingDirectoryFactory.get return new directory for /usr/home/hudson/hudson-slave/workspace/Lucene-Solr-Tests-4.x-Java6/solr/build/solr-core/test/J0/./org.apache.solr.cloud.SyncSliceTest-1355531696787/control/data forceNew:false
[junit4:junit4]   2> 1822 T852 oasc.CachingDirectoryFactory.close Releasing directory:/usr/home/hudson/hudson-slave/workspace/Lucene-Solr-Tests-4.x-Java6/solr/build/solr-core/test/J0/./org.apache.solr.cloud.SyncSliceTest-1355531696787/control/data
[junit4:junit4]   2> 1823 T852 oasc.SolrCore.getNewIndexDir New index directory detected: old=null new=./org.apache.solr.cloud.SyncSliceTest-1355531696787/control/data/index/
[junit4:junit4]   2> 1824 T852 oasc.SolrCore.initIndex WARNING [collection1] Solr index directory './org.apache.solr.cloud.SyncSliceTest-1355531696787/control/data/index' doesn't exist. Creating new index...
[junit4:junit4]   2> 1825 T852 oasc.CachingDirectoryFactory.get return new directory for /usr/home/hudson/hudson-slave/workspace/Lucene-Solr-Tests-4.x-Java6/solr/build/solr-core/test/J0/./org.apache.solr.cloud.SyncSliceTest-1355531696787/control/data/index forceNew:false
[junit4:junit4]   2> 1833 T852 oasc.SolrDeletionPolicy.onCommit SolrDeletionPolicy.onCommit: commits:num=1
[junit4:junit4]   2> 		commit{dir=RateLimitedDirectoryWrapper(NRTCachingDirectory(org.apache.lucene.store.NIOFSDirectory@/usr/home/hudson/hudson-slave/workspace/Lucene-Solr-Tests-4.x-Java6/solr/build/solr-core/test/J0/org.apache.solr.cloud.SyncSliceTest-1355531696787/control/data/index lockFactory=org.apache.lucene.store.NativeFSLockFactory@12d70862; maxCacheMB=48.0 maxMergeSizeMB=4.0)),segFN=segments_1,generation=1,filenames=[segments_1]
[junit4:junit4]   2> 1833 T852 oasc.SolrDeletionPolicy.updateCommits newest commit = 1[segments_1]
[junit4:junit4]   2> 1834 T852 oasc.CachingDirectoryFactory.close Releasing directory:/usr/home/hudson/hudson-slave/workspace/Lucene-Solr-Tests-4.x-Java6/solr/build/solr-core/test/J0/./org.apache.solr.cloud.SyncSliceTest-1355531696787/control/data/index
[junit4:junit4]   2> 1834 T852 oasc.SolrCore.initWriters created xml: solr.XMLResponseWriter
[junit4:junit4]   2> 1836 T852 oasup.UpdateRequestProcessorChain.init inserting DistributedUpdateProcessorFactory into updateRequestProcessorChain "dedupe"
[junit4:junit4]   2> 1837 T852 oasup.UpdateRequestProcessorChain.init inserting DistributedUpdateProcessorFactory into updateRequestProcessorChain "dedupe-allfields"
[junit4:junit4]   2> 1837 T852 oasup.UpdateRequestProcessorChain.init inserting DistributedUpdateProcessorFactory into updateRequestProcessorChain "stored_sig"
[junit4:junit4]   2> 1837 T852 oasup.UpdateRequestProcessorChain.init inserting DistributedUpdateProcessorFactory into updateRequestProcessorChain "uniq-fields"
[junit4:junit4]   2> 1838 T852 oasup.UpdateRequestProcessorChain.init inserting DistributedUpdateProcessorFactory into updateRequestProcessorChain "distrib-dup-test-chain-implicit"
[junit4:junit4]   2> 1838 T852 oasc.RequestHandlers.initHandlersFromConfig adding lazy requestHandler: solr.ReplicationHandler
[junit4:junit4]   2> 1839 T852 oasc.RequestHandlers.initHandlersFromConfig created /replication: solr.ReplicationHandler
[junit4:junit4]   2> 1840 T852 oasc.RequestHandlers.initHandlersFromConfig created standard: solr.StandardRequestHandler
[junit4:junit4]   2> 1840 T852 oasc.RequestHandlers.initHandlersFromConfig created /get: solr.RealTimeGetHandler
[junit4:junit4]   2> 1841 T852 oasc.RequestHandlers.initHandlersFromConfig created dismax: solr.SearchHandler
[junit4:junit4]   2> 1842 T852 oasc.RequestHandlers.initHandlersFromConfig created mock: org.apache.solr.core.MockQuerySenderListenerReqHandler
[junit4:junit4]   2> 1843 T852 oasc.RequestHandlers.initHandlersFromConfig created /admin/: org.apache.solr.handler.admin.AdminHandlers
[junit4:junit4]   2> 1844 T852 oasc.RequestHandlers.initHandlersFromConfig created defaults: solr.StandardRequestHandler
[junit4:junit4]   2> 1844 T852 oasc.RequestHandlers.initHandlersFromConfig adding lazy requestHandler: solr.StandardRequestHandler
[junit4:junit4]   2> 1844 T852 oasc.RequestHandlers.initHandlersFromConfig created lazy: solr.StandardRequestHandler
[junit4:junit4]   2> 1845 T852 oasc.RequestHandlers.initHandlersFromConfig created /update: solr.UpdateRequestHandler
[junit4:junit4]   2> 1846 T852 oasc.RequestHandlers.initHandlersFromConfig created /terms: org.apache.solr.handler.component.SearchHandler
[junit4:junit4]   2> 1847 T852 oasc.RequestHandlers.initHandlersFromConfig created spellCheckCompRH: org.apache.solr.handler.component.SearchHandler
[junit4:junit4]   2> 1848 T852 oasc.RequestHandlers.initHandlersFromConfig created spellCheckCompRH_Direct: org.apache.solr.handler.component.SearchHandler
[junit4:junit4]   2> 1848 T852 oasc.RequestHandlers.initHandlersFromConfig created spellCheckWithWordbreak: org.apache.solr.handler.component.SearchHandler
[junit4:junit4]   2> 1849 T852 oasc.RequestHandlers.initHandlersFromConfig created spellCheckWithWordbreak_Direct: org.apache.solr.handler.component.SearchHandler
[junit4:junit4]   2> 1850 T852 oasc.RequestHandlers.initHandlersFromConfig created spellCheckCompRH1: org.apache.solr.handler.component.SearchHandler
[junit4:junit4]   2> 1851 T852 oasc.RequestHandlers.initHandlersFromConfig created mltrh: org.apache.solr.handler.component.SearchHandler
[junit4:junit4]   2> 1852 T852 oasc.RequestHandlers.initHandlersFromConfig created tvrh: org.apache.solr.handler.component.SearchHandler
[junit4:junit4]   2> 1853 T852 oasc.RequestHandlers.initHandlersFromConfig created /mlt: solr.MoreLikeThisHandler
[junit4:junit4]   2> 1854 T852 oasc.RequestHandlers.initHandlersFromConfig created /debug/dump: solr.DumpRequestHandler
[junit4:junit4]   2> 1861 T852 oashl.XMLLoader.init xsltCacheLifetimeSeconds=60
[junit4:junit4]   2> 1866 T852 oasc.SolrCore.initDeprecatedSupport WARNING solrconfig.xml uses deprecated <admin/gettableFiles>, Please update your config to use the ShowFileRequestHandler.
[junit4:junit4]   2> 1867 T852 oasc.SolrCore.initDeprecatedSupport WARNING adding ShowFileRequestHandler with hidden files: [SCHEMA.XML, OLD_SYNONYMS.TXT, STOPWORDS.TXT, PROTWORDS.TXT, OPEN-EXCHANGE-RATES.JSON, SYNONYMS.TXT, CURRENCY.XML, MAPPING-ISOLATIN1ACCENT.TXT]
[junit4:junit4]   2> 1870 T852 oasc.CachingDirectoryFactory.close Releasing directory:/usr/home/hudson/hudson-slave/workspace/Lucene-Solr-Tests-4.x-Java6/solr/build/solr-core/test/J0/./org.apache.solr.cloud.SyncSliceTest-1355531696787/control/data
[junit4:junit4]   2> 1872 T852 oass.SolrIndexSearcher.<init> Opening Searcher@77bd1ce2 main
[junit4:junit4]   2> 1873 T852 oasu.CommitTracker.<init> Hard AutoCommit: disabled
[junit4:junit4]   2> 1873 T852 oasu.CommitTracker.<init> Soft AutoCommit: disabled
[junit4:junit4]   2> 1874 T852 oashc.SpellCheckComponent.inform Initializing spell checkers
[junit4:junit4]   2> 1897 T852 oass.DirectSolrSpellChecker.init init: {name=direct,classname=DirectSolrSpellChecker,field=lowerfilt,minQueryLength=3}
[junit4:junit4]   2> 1966 T853 oasc.SolrCore.registerSearcher [collection1] Registered new searcher Searcher@77bd1ce2 main{StandardDirectoryReader(segments_1:1)}
[junit4:junit4]   2> 1969 T852 oasc.ZkController.publish publishing core=collection1 state=down
[junit4:junit4]   2> 1970 T852 oasc.ZkController.publish numShards not found on descriptor - reading it from system property
[junit4:junit4]   2> 1971 T832 oazs.PrepRequestProcessor.pRequest Got user-level KeeperException when processing sessionid:0x13b9bfc3a9b0003 type:create cxid:0x56 zxid:0x29 txntype:-1 reqpath:n/a Error Path:/solr/overseer/queue Error:KeeperErrorCode = NoNode for /solr/overseer/queue
[junit4:junit4]   2> 2322 T850 oascc.ZkStateReader.updateClusterState Updating cloud state from ZooKeeper... 
[junit4:junit4]   2> 2323 T850 oasc.Overseer$ClusterStateUpdater.updateState Update state numShards=1 message={
[junit4:junit4]   2> 	  "operation":"state",
[junit4:junit4]   2> 	  "numShards":"1",
[junit4:junit4]   2> 	  "shard":null,
[junit4:junit4]   2> 	  "roles":null,
[junit4:junit4]   2> 	  "state":"down",
[junit4:junit4]   2> 	  "core":"collection1",
[junit4:junit4]   2> 	  "collection":"control_collection",
[junit4:junit4]   2> 	  "node_name":"127.0.0.1:37611_",
[junit4:junit4]   2> 	  "base_url":"http://127.0.0.1:37611"}
[junit4:junit4]   2> 2323 T850 oasc.Overseer$ClusterStateUpdater.createCollection Create collection control_collection with numShards 1
[junit4:junit4]   2> 2330 T850 oasc.Overseer$ClusterStateUpdater.updateState Assigning new node to shard shard=shard1
[junit4:junit4]   2> 2331 T832 oazs.PrepRequestProcessor.pRequest Got user-level KeeperException when processing sessionid:0x13b9bfc3a9b0003 type:create cxid:0x5e zxid:0x2c txntype:-1 reqpath:n/a Error Path:/solr/overseer/queue-work Error:KeeperErrorCode = NoNode for /solr/overseer/queue-work
[junit4:junit4]   2> 2370 T849 oascc.ZkStateReader$2.process A cluster state change: WatchedEvent state:SyncConnected type:NodeDataChanged path:/clusterstate.json, has occurred - updating... (live nodes size: 1)
[junit4:junit4]   2> 2483 T852 oasc.CoreContainer.registerCore registering core: collection1
[junit4:junit4]   2> 2483 T852 oasc.ZkController.register Register shard - core:collection1 address:http://127.0.0.1:37611 shardId:shard1
[junit4:junit4]   2> 2484 T852 oascc.SolrZkClient.makePath makePath: /collections/control_collection/leader_elect/shard1/election
[junit4:junit4]   2> 2519 T832 oazs.PrepRequestProcessor.pRequest Got user-level KeeperException when processing sessionid:0x13b9bfc3a9b0003 type:delete cxid:0x78 zxid:0x36 txntype:-1 reqpath:n/a Error Path:/solr/collections/control_collection/leaders Error:KeeperErrorCode = NoNode for /solr/collections/control_collection/leaders
[junit4:junit4]   2> 2527 T852 oasc.ShardLeaderElectionContext.runLeaderProcess Running the leader process.
[junit4:junit4]   2> 2527 T832 oazs.PrepRequestProcessor.pRequest Got user-level KeeperException when processing sessionid:0x13b9bfc3a9b0003 type:create cxid:0x79 zxid:0x37 txntype:-1 reqpath:n/a Error Path:/solr/overseer Error:KeeperErrorCode = NodeExists for /solr/overseer
[junit4:junit4]   2> 2542 T852 oasc.ShardLeaderElectionContext.waitForReplicasToComeUp Enough replicas found to continue.
[junit4:junit4]   2> 2542 T852 oasc.ShardLeaderElectionContext.runLeaderProcess I may be the new leader - try and sync
[junit4:junit4]   2> 2543 T852 oasc.SyncStrategy.sync Sync replicas to http://127.0.0.1:37611/collection1/
[junit4:junit4]   2> 2543 T852 oasc.SyncStrategy.syncReplicas Sync Success - now sync replicas to me
[junit4:junit4]   2> 2544 T852 oasc.SyncStrategy.syncToMe http://127.0.0.1:37611/collection1/ has no replicas
[junit4:junit4]   2> 2544 T852 oasc.ShardLeaderElectionContext.runLeaderProcess I am the new leader: http://127.0.0.1:37611/collection1/
[junit4:junit4]   2> 2544 T852 oascc.SolrZkClient.makePath makePath: /collections/control_collection/leaders/shard1
[junit4:junit4]   2> 2561 T832 oazs.PrepRequestProcessor.pRequest Got user-level KeeperException when processing sessionid:0x13b9bfc3a9b0003 type:create cxid:0x83 zxid:0x3b txntype:-1 reqpath:n/a Error Path:/solr/overseer Error:KeeperErrorCode = NodeExists for /solr/overseer
[junit4:junit4]   2> 2884 T850 oascc.ZkStateReader.updateClusterState Updating cloud state from ZooKeeper... 
[junit4:junit4]   2> 2924 T849 oascc.ZkStateReader$2.process A cluster state change: WatchedEvent state:SyncConnected type:NodeDataChanged path:/clusterstate.json, has occurred - updating... (live nodes size: 1)
[junit4:junit4]   2> 2972 T852 oasc.ZkController.register We are http://127.0.0.1:37611/collection1/ and leader is http://127.0.0.1:37611/collection1/
[junit4:junit4]   2> 2972 T852 oasc.ZkController.register No LogReplay needed for core=collection1 baseURL=http://127.0.0.1:37611
[junit4:junit4]   2> 2972 T852 oasc.ZkController.checkRecovery I am the leader, no recovery necessary
[junit4:junit4]   2> 2973 T852 oasc.ZkController.publish publishing core=collection1 state=active
[junit4:junit4]   2> 2973 T852 oasc.ZkController.publish numShards not found on descriptor - reading it from system property
[junit4:junit4]   2> 2976 T852 oascc.ZkStateReader.updateClusterState Updating cloud state from ZooKeeper... 
[junit4:junit4]   2> 2977 T827 oass.SolrDispatchFilter.init user.dir=/usr/home/hudson/hudson-slave/workspace/Lucene-Solr-Tests-4.x-Java6/solr/build/solr-core/test/J0
[junit4:junit4]   2> 2978 T827 oass.SolrDispatchFilter.init SolrDispatchFilter.init() done
[junit4:junit4]   2> 2979 T827 oascsi.HttpClientUtil.createClient Creating new http client, config:maxConnections=128&maxConnectionsPerHost=32&followRedirects=false
[junit4:junit4]   2> 2997 T827 oascsi.HttpClientUtil.createClient Creating new http client, config:
[junit4:junit4]   2> 3014 T827 oaz.ZooKeeper.<init> Initiating client connection, connectString=127.0.0.1:37608/solr sessionTimeout=10000 watcher=org.apache.solr.common.cloud.ConnectionManager@5ec262f3
[junit4:junit4]   2> 3015 T827 oascc.ConnectionManager.waitForConnected Waiting for client to connect to ZooKeeper
[junit4:junit4]   2> 3016 T854 oaz.ClientCnxn$SendThread.logStartConnect Opening socket connection to server localhost/127.0.0.1:37608. Will not attempt to authenticate using SASL (access denied (javax.security.auth.AuthPermission getLoginConfiguration))
[junit4:junit4]   2> 3016 T854 oaz.ClientCnxn$SendThread.primeConnection Socket connection established to localhost/127.0.0.1:37608, initiating session
[junit4:junit4]   2> 3017 T829 oazs.NIOServerCnxnFactory.run Accepted socket connection from /140.211.11.196:37614
[junit4:junit4]   2> 3017 T829 oazs.ZooKeeperServer.processConnectRequest Client attempting to establish new session at /140.211.11.196:37614
[junit4:junit4]   2> 3018 T831 oazs.ZooKeeperServer.finishSessionInit Established session 0x13b9bfc3a9b0004 with negotiated timeout 10000 for client /140.211.11.196:37614
[junit4:junit4]   2> 3018 T854 oaz.ClientCnxn$SendThread.onConnected Session establishment complete on server localhost/127.0.0.1:37608, sessionid = 0x13b9bfc3a9b0004, negotiated timeout = 10000
[junit4:junit4]   2> 3019 T855 oascc.ConnectionManager.process Watcher org.apache.solr.common.cloud.ConnectionManager@5ec262f3 name:ZooKeeperConnection Watcher:127.0.0.1:37608/solr got event WatchedEvent state:SyncConnected type:None path:null path:null type:None
[junit4:junit4]   2> 3019 T827 oascc.ConnectionManager.waitForConnected Client is connected to ZooKeeper
[junit4:junit4]   2> 3021 T827 oascc.ZkStateReader.createClusterStateWatchersAndUpdate Updating cluster state from ZooKeeper... 
[junit4:junit4]   2> 3025 T827 oasc.ChaosMonkey.monkeyLog monkey: init - expire sessions:true cause connection loss:true
[junit4:junit4]   2> 3213 T827 oejs.Server.doStart jetty-8.1.8.v20121106
[junit4:junit4]   2> 3216 T827 oejs.AbstractConnector.doStart Started SocketConnector@127.0.0.1:37615
[junit4:junit4]   2> 3217 T827 oasc.SolrResourceLoader.locateSolrHome JNDI not configured for solr (NoInitialContextEx)
[junit4:junit4]   2> 3218 T827 oasc.SolrResourceLoader.locateSolrHome using system property solr.solr.home: /usr/home/hudson/hudson-slave/workspace/Lucene-Solr-Tests-4.x-Java6/solr/build/solr-core/test/J0/./org.apache.solr.cloud.SyncSliceTest-jetty1-1355531699807
[junit4:junit4]   2> 3219 T827 oasc.SolrResourceLoader.<init> new SolrResourceLoader for deduced Solr Home: '/usr/home/hudson/hudson-slave/workspace/Lucene-Solr-Tests-4.x-Java6/solr/build/solr-core/test/J0/./org.apache.solr.cloud.SyncSliceTest-jetty1-1355531699807/'
[junit4:junit4]   2> 3268 T827 oass.SolrDispatchFilter.init SolrDispatchFilter.init()
[junit4:junit4]   2> 3269 T827 oasc.SolrResourceLoader.locateSolrHome JNDI not configured for solr (NoInitialContextEx)
[junit4:junit4]   2> 3269 T827 oasc.SolrResourceLoader.locateSolrHome using system property solr.solr.home: /usr/home/hudson/hudson-slave/workspace/Lucene-Solr-Tests-4.x-Java6/solr/build/solr-core/test/J0/./org.apache.solr.cloud.SyncSliceTest-jetty1-1355531699807
[junit4:junit4]   2> 3270 T827 oasc.CoreContainer$Initializer.initialize looking for solr.xml: /usr/home/hudson/hudson-slave/workspace/Lucene-Solr-Tests-4.x-Java6/solr/build/solr-core/test/J0/./org.apache.solr.cloud.SyncSliceTest-jetty1-1355531699807/solr.xml
[junit4:junit4]   2> 3271 T827 oasc.CoreContainer.<init> New CoreContainer 916373760
[junit4:junit4]   2> 3271 T827 oasc.CoreContainer.load Loading CoreContainer using Solr Home: '/usr/home/hudson/hudson-slave/workspace/Lucene-Solr-Tests-4.x-Java6/solr/build/solr-core/test/J0/./org.apache.solr.cloud.SyncSliceTest-jetty1-1355531699807/'
[junit4:junit4]   2> 3272 T827 oasc.SolrResourceLoader.<init> new SolrResourceLoader for directory: '/usr/home/hudson/hudson-slave/workspace/Lucene-Solr-Tests-4.x-Java6/solr/build/solr-core/test/J0/./org.apache.solr.cloud.SyncSliceTest-jetty1-1355531699807/'
[junit4:junit4]   2> 3305 T827 oasc.CoreContainer.load Registering Log Listener
[junit4:junit4]   2> 3326 T827 oasc.CoreContainer.initZooKeeper Zookeeper client=127.0.0.1:37608/solr
[junit4:junit4]   2> 3327 T827 oasc.ZkController.checkChrootPath zkHost includes chroot
[junit4:junit4]   2> 3328 T827 oaz.ZooKeeper.<init> Initiating client connection, connectString=127.0.0.1:37608 sessionTimeout=60000 watcher=org.apache.solr.common.cloud.ConnectionManager@405cf3b1
[junit4:junit4]   2> 3329 T827 oascc.ConnectionManager.waitForConnected Waiting for client to connect to ZooKeeper
[junit4:junit4]   2> 3330 T865 oaz.ClientCnxn$SendThread.logStartConnect Opening socket connection to server localhost/127.0.0.1:37608. Will not attempt to authenticate using SASL (access denied (javax.security.auth.AuthPermission getLoginConfiguration))
[junit4:junit4]   2> 3331 T865 oaz.ClientCnxn$SendThread.primeConnection Socket connection established to localhost/127.0.0.1:37608, initiating session
[junit4:junit4]   2> 3331 T829 oazs.NIOServerCnxnFactory.run Accepted socket connection from /140.211.11.196:37616
[junit4:junit4]   2> 3331 T829 oazs.ZooKeeperServer.processConnectRequest Client attempting to establish new session at /140.211.11.196:37616
[junit4:junit4]   2> 3338 T831 oazs.ZooKeeperServer.finishSessionInit Established session 0x13b9bfc3a9b0005 with negotiated timeout 20000 for client /140.211.11.196:37616
[junit4:junit4]   2> 3338 T865 oaz.ClientCnxn$SendThread.onConnected Session establishment complete on server localhost/127.0.0.1:37608, sessionid = 0x13b9bfc3a9b0005, negotiated timeout = 20000
[junit4:junit4]   2> 3338 T866 oascc.ConnectionManager.process Watcher org.apache.solr.common.cloud.ConnectionManager@405cf3b1 name:ZooKeeperConnection Watcher:127.0.0.1:37608 got event WatchedEvent state:SyncConnected type:None path:null path:null type:None
[junit4:junit4]   2> 3338 T827 oascc.ConnectionManager.waitForConnected Client is connected to ZooKeeper
[junit4:junit4]   2> 3340 T832 oazs.PrepRequestProcessor.pRequest2Txn Processed session termination for sessionid: 0x13b9bfc3a9b0005
[junit4:junit4]   2> 3423 T866 oaz.ClientCnxn$EventThread.run EventThread shut down
[junit4:junit4]   2> 3423 T829 oazs.NIOServerCnxn.closeSock Closed socket connection for client /140.211.11.196:37616 which had sessionid 0x13b9bfc3a9b0005
[junit4:junit4]   2> 3423 T827 oaz.ZooKeeper.close Session: 0x13b9bfc3a9b0005 closed
[junit4:junit4]   2> 3424 T827 oaz.ZooKeeper.<init> Initiating client connection, connectString=127.0.0.1:37608/solr sessionTimeout=8000 watcher=org.apache.solr.common.cloud.ConnectionManager@6b6d31dd
[junit4:junit4]   2> 3426 T827 oascc.ConnectionManager.waitForConnected Waiting for client to connect to ZooKeeper
[junit4:junit4]   2> 3426 T867 oaz.ClientCnxn$SendThread.logStartConnect Opening socket connection to server localhost/127.0.0.1:37608. Will not attempt to authenticate using SASL (access denied (javax.security.auth.AuthPermission getLoginConfiguration))
[junit4:junit4]   2> 3427 T867 oaz.ClientCnxn$SendThread.primeConnection Socket connection established to localhost/127.0.0.1:37608, initiating session
[junit4:junit4]   2> 3427 T829 oazs.NIOServerCnxnFactory.run Accepted socket connection from /140.211.11.196:37617
[junit4:junit4]   2> 3427 T829 oazs.ZooKeeperServer.processConnectRequest Client attempting to establish new session at /140.211.11.196:37617
[junit4:junit4]   2> 3439 T831 oazs.ZooKeeperServer.finishSessionInit Established session 0x13b9bfc3a9b0006 with negotiated timeout 8000 for client /140.211.11.196:37617
[junit4:junit4]   2> 3439 T867 oaz.ClientCnxn$SendThread.onConnected Session establishment complete on server localhost/127.0.0.1:37608, sessionid = 0x13b9bfc3a9b0006, negotiated timeout = 8000
[junit4:junit4]   2> 3439 T868 oascc.ConnectionManager.process Watcher org.apache.solr.common.cloud.ConnectionManager@6b6d31dd name:ZooKeeperConnection Watcher:127.0.0.1:37608/solr got event WatchedEvent state:SyncConnected type:None path:null path:null type:None
[junit4:junit4]   2> 3439 T827 oascc.ConnectionManager.waitForConnected Client is connected to ZooKeeper
[junit4:junit4]   2> 3441 T832 oazs.PrepRequestProcessor.pRequest Got user-level KeeperException when processing sessionid:0x13b9bfc3a9b0006 type:create cxid:0x1 zxid:0x49 txntype:-1 reqpath:n/a Error Path:/solr/overseer Error:KeeperErrorCode = NodeExists for /solr/overseer
[junit4:junit4]   2> 3441 T850 oascc.ZkStateReader.updateClusterState Updating cloud state from ZooKeeper... 
[junit4:junit4]   2> 3446 T850 oasc.Overseer$ClusterStateUpdater.updateState Update state numShards=1 message={
[junit4:junit4]   2> 	  "operation":"state",
[junit4:junit4]   2> 	  "numShards":"1",
[junit4:junit4]   2> 	  "shard":"shard1",
[junit4:junit4]   2> 	  "roles":null,
[junit4:junit4]   2> 	  "state":"active",
[junit4:junit4]   2> 	  "core":"collection1",
[junit4:junit4]   2> 	  "collection":"control_collection",
[junit4:junit4]   2> 	  "node_name":"127.0.0.1:37611_",
[junit4:junit4]   2> 	  "base_url":"http://127.0.0.1:37611"}
[junit4:junit4]   2> 3446 T832 oazs.PrepRequestProcessor.pRequest Got user-level KeeperException when processing sessionid:0x13b9bfc3a9b0006 type:create cxid:0x2 zxid:0x4a txntype:-1 reqpath:n/a Error Path:/solr/overseer Error:KeeperErrorCode = NodeExists for /solr/overseer
[junit4:junit4]   2> 3463 T827 oasc.ZkController.createEphemeralLiveNode Register node as live in ZooKeeper:/live_nodes/127.0.0.1:37615_
[junit4:junit4]   2> 3464 T832 oazs.PrepRequestProcessor.pRequest Got user-level KeeperException when processing sessionid:0x13b9bfc3a9b0006 type:delete cxid:0x4 zxid:0x4c txntype:-1 reqpath:n/a Error Path:/solr/live_nodes/127.0.0.1:37615_ Error:KeeperErrorCode = NoNode for /solr/live_nodes/127.0.0.1:37615_
[junit4:junit4]   2> 3475 T827 oascc.SolrZkClient.makePath makePath: /live_nodes/127.0.0.1:37615_
[junit4:junit4]   2> 3490 T855 oascc.ZkStateReader$2.process A cluster state change: WatchedEvent state:SyncConnected type:NodeDataChanged path:/clusterstate.json, has occurred - updating... (live nodes size: 1)
[junit4:junit4]   2> 3490 T849 oascc.ZkStateReader$2.process A cluster state change: WatchedEvent state:SyncConnected type:NodeDataChanged path:/clusterstate.json, has occurred - updating... (live nodes size: 1)
[junit4:junit4]   2> 3509 T855 oascc.ZkStateReader$3.process Updating live nodes... (2)
[junit4:junit4]   2> 3509 T827 oashc.HttpShardHandlerFactory.getParameter Setting socketTimeout to: 0
[junit4:junit4]   2> 3509 T827 oashc.HttpShardHandlerFactory.getParameter Setting urlScheme to: http://
[junit4:junit4]   2> 3510 T827 oashc.HttpShardHandlerFactory.getParameter Setting connTimeout to: 0
[junit4:junit4]   2> 3511 T849 oascc.ZkStateReader$3.process Updating live nodes... (2)
[junit4:junit4]   2> 3511 T849 oascc.ZkStateReader$2.process A cluster state change: WatchedEvent state:SyncConnected type:NodeChildrenChanged path:/live_nodes, has occurred - updating... (live nodes size: 2)
[junit4:junit4]   2> 3511 T827 oashc.HttpShardHandlerFactory.getParameter Setting maxConnectionsPerHost to: 20
[junit4:junit4]   2> 3511 T827 oashc.HttpShardHandlerFactory.getParameter Setting corePoolSize to: 0
[junit4:junit4]   2> 3512 T827 oashc.HttpShardHandlerFactory.getParameter Setting maximumPoolSize to: 2147483647
[junit4:junit4]   2> 3513 T827 oashc.HttpShardHandlerFactory.getParameter Setting maxThreadIdleTime to: 5
[junit4:junit4]   2> 3513 T827 oashc.HttpShardHandlerFactory.getParameter Setting sizeOfQueue to: -1
[junit4:junit4]   2> 3514 T827 oashc.HttpShardHandlerFactory.getParameter Setting fairnessPolicy to: false
[junit4:junit4]   2> 3514 T827 oascsi.HttpClientUtil.createClient Creating new http client, config:maxConnectionsPerHost=20&maxConnections=10000&socketTimeout=0&connTimeout=0&retry=false
[junit4:junit4]   2> 3536 T827 oascc.ZkStateReader.createClusterStateWatchersAndUpdate Updating cluster state from ZooKeeper... 
[junit4:junit4]   2> 3545 T869 oasc.CoreContainer.create Creating SolrCore 'collection1' using instanceDir: /usr/home/hudson/hudson-slave/workspace/Lucene-Solr-Tests-4.x-Java6/solr/build/solr-core/test/J0/./org.apache.solr.cloud.SyncSliceTest-jetty1-1355531699807/collection1
[junit4:junit4]   2> 3545 T869 oasc.ZkController.createCollectionZkNode Check for collection zkNode:collection1
[junit4:junit4]   2> 3546 T869 oasc.ZkController.createCollectionZkNode Collection zkNode exists
[junit4:junit4]   2> 3546 T869 oasc.ZkController.readConfigName Load collection config from:/collections/collection1
[junit4:junit4]   2> 3548 T869 oasc.SolrResourceLoader.<init> new SolrResourceLoader for directory: '/usr/home/hudson/hudson-slave/workspace/Lucene-Solr-Tests-4.x-Java6/solr/build/solr-core/test/J0/./org.apache.solr.cloud.SyncSliceTest-jetty1-1355531699807/collection1/'
[junit4:junit4]   2> 3549 T869 oasc.SolrResourceLoader.replaceClassLoader Adding 'file:/usr/home/hudson/hudson-slave/workspace/Lucene-Solr-Tests-4.x-Java6/solr/build/solr-core/test/J0/org.apache.solr.cloud.SyncSliceTest-jetty1-1355531699807/collection1/lib/classes/' to classloader
[junit4:junit4]   2> 3550 T869 oasc.SolrResourceLoader.replaceClassLoader Adding 'file:/usr/home/hudson/hudson-slave/workspace/Lucene-Solr-Tests-4.x-Java6/solr/build/solr-core/test/J0/org.apache.solr.cloud.SyncSliceTest-jetty1-1355531699807/collection1/lib/README' to classloader
[junit4:junit4]   2> 3608 T869 oasc.SolrConfig.<init> Using Lucene MatchVersion: LUCENE_41
[junit4:junit4]   2> 3687 T869 oasc.SolrConfig.<init> Loaded SolrConfig: solrconfig.xml
[junit4:junit4]   2> 3788 T869 oass.IndexSchema.readSchema Reading Solr Schema
[junit4:junit4]   2> 3795 T869 oass.IndexSchema.readSchema Schema name=test
[junit4:junit4]   2> 4471 T869 oass.OpenExchangeRatesOrgProvider.init Initialized with rates=open-exchange-rates.json, refreshInterval=1440.
[junit4:junit4]   2> 4483 T869 oass.IndexSchema.readSchema default search field in schema is text
[junit4:junit4]   2> 4493 T869 oass.IndexSchema.readSchema unique key field: id
[junit4:junit4]   2> 4510 T869 oass.FileExchangeRateProvider.reload Reloading exchange rates from file currency.xml
[junit4:junit4]   2> 4515 T869 oass.FileExchangeRateProvider.reload Reloading exchange rates from file currency.xml
[junit4:junit4]   2> 4520 T869 oass.OpenExchangeRatesOrgProvider.reload Reloading exchange rates from open-exchange-rates.json
[junit4:junit4]   2> 4521 T869 oass.OpenExchangeRatesOrgProvider.reload Reloading exchange rates from open-exchange-rates.json
[junit4:junit4]   2> 4523 T869 oasc.SolrCore.<init> [collection1] Opening new SolrCore at /usr/home/hudson/hudson-slave/workspace/Lucene-Solr-Tests-4.x-Java6/solr/build/solr-core/test/J0/./org.apache.solr.cloud.SyncSliceTest-jetty1-1355531699807/collection1/, dataDir=./org.apache.solr.cloud.SyncSliceTest-1355531696787/jetty1/
[junit4:junit4]   2> 4523 T869 oasc.JmxMonitoredMap.<init> JMX monitoring is enabled. Adding Solr mbeans to JMX Server: com.sun.jmx.mbeanserver.JmxMBeanServer@61250ff2
[junit4:junit4]   2> 4524 T869 oasc.SolrCore.initDirectoryFactory solr.NRTCachingDirectoryFactory
[junit4:junit4]   2> 4525 T869 oasc.CachingDirectoryFactory.get return new directory for /usr/home/hudson/hudson-slave/workspace/Lucene-Solr-Tests-4.x-Java6/solr/build/solr-core/test/J0/./org.apache.solr.cloud.SyncSliceTest-1355531696787/jetty1 forceNew:false
[junit4:junit4]   2> 4525 T869 oasc.CachingDirectoryFactory.close Releasing directory:/usr/home/hudson/hudson-slave/workspace/Lucene-Solr-Tests-4.x-Java6/solr/build/solr-core/test/J0/./org.apache.solr.cloud.SyncSliceTest-1355531696787/jetty1
[junit4:junit4]   2> 4526 T869 oasc.SolrCore.getNewIndexDir New index directory detected: old=null new=./org.apache.solr.cloud.SyncSliceTest-1355531696787/jetty1/index/
[junit4:junit4]   2> 4526 T869 oasc.SolrCore.initIndex WARNING [collection1] Solr index directory './org.apache.solr.cloud.SyncSliceTest-1355531696787/jetty1/index' doesn't exist. Creating new index...
[junit4:junit4]   2> 4527 T869 oasc.CachingDirectoryFactory.get return new directory for /usr/home/hudson/hudson-slave/workspace/Lucene-Solr-Tests-4.x-Java6/solr/build/solr-core/test/J0/./org.apache.solr.cloud.SyncSliceTest-1355531696787/jetty1/index forceNew:false
[junit4:junit4]   2> 4616 T869 oasc.SolrDeletionPolicy.onCommit SolrDeletionPolicy.onCommit: commits:num=1
[junit4:junit4]   2> 		commit{dir=RateLimitedDirectoryWrapper(NRTCachingDirectory(org.apache.lucene.store.NIOFSDirectory@/usr/home/hudson/hudson-slave/workspace/Lucene-Solr-Tests-4.x-Java6/solr/build/solr-core/test/J0/org.apache.solr.cloud.SyncSliceTest-1355531696787/jetty1/index lockFactory=org.apache.lucene.store.NativeFSLockFactory@5dbb7207; maxCacheMB=48.0 maxMergeSizeMB=4.0)),segFN=segments_1,generation=1,filenames=[segments_1]
[junit4:junit4]   2> 4616 T869 oasc.SolrDeletionPolicy.updateCommits newest commit = 1[segments_1]
[junit4:junit4]   2> 4617 T869 oasc.CachingDirectoryFactory.close Releasing directory:/usr/home/hudson/hudson-slave/workspace/Lucene-Solr-Tests-4.x-Java6/solr/build/solr-core/test/J0/./org.apache.solr.cloud.SyncSliceTest-1355531696787/jetty1/index
[junit4:junit4]   2> 4618 T869 oasc.SolrCore.initWriters created xml: solr.XMLResponseWriter
[junit4:junit4]   2> 4620 T869 oasup.UpdateRequestProcessorChain.init inserting DistributedUpdateProcessorFactory into updateRequestProcessorChain "dedupe"
[junit4:junit4]   2> 4620 T869 oasup.UpdateRequestProcessorChain.init inserting DistributedUpdateProcessorFactory into updateRequestProcessorChain "dedupe-allfields"
[junit4:junit4]   2> 4620 T869 oasup.UpdateRequestProcessorChain.init inserting DistributedUpdateProcessorFactory into updateRequestProcessorChain "stored_sig"
[junit4:junit4]   2> 4621 T869 oasup.UpdateRequestProcessorChain.init inserting DistributedUpdateProcessorFactory into updateRequestProcessorChain "uniq-fields"
[junit4:junit4]   2> 4621 T869 oasup.UpdateRequestProcessorChain.init inserting DistributedUpdateProcessorFactory into updateRequestProcessorChain "distrib-dup-test-chain-implicit"
[junit4:junit4]   2> 4622 T869 oasc.RequestHandlers.initHandlersFromConfig adding lazy requestHandler: solr.ReplicationHandler
[junit4:junit4]   2> 4622 T869 oasc.RequestHandlers.initHandlersFromConfig created /replication: solr.ReplicationHandler
[junit4:junit4]   2> 4623 T869 oasc.RequestHandlers.initHandlersFromConfig created standard: solr.StandardRequestHandler
[junit4:junit4]   2> 4624 T869 oasc.RequestHandlers.initHandlersFromConfig created /get: solr.RealTimeGetHandler
[junit4:junit4]   2> 4625 T869 oasc.RequestHandlers.initHandlersFromConfig created dismax: solr.SearchHandler
[junit4:junit4]   2> 4626 T869 oasc.RequestHandlers.initHandlersFromConfig created mock: org.apache.solr.core.MockQuerySenderListenerReqHandler
[junit4:junit4]   2> 4627 T869 oasc.RequestHandlers.initHandlersFromConfig created /admin/: org.apache.solr.handler.admin.AdminHandlers
[junit4:junit4]   2> 4627 T869 oasc.RequestHandlers.initHandlersFromConfig created defaults: solr.StandardRequestHandler
[junit4:junit4]   2> 4628 T869 oasc.RequestHandlers.initHandlersFromConfig adding lazy requestHandler: solr.StandardRequestHandler
[junit4:junit4]   2> 4628 T869 oasc.RequestHandlers.initHandlersFromConfig created lazy: solr.StandardRequestHandler
[junit4:junit4]   2> 4629 T869 oasc.RequestHandlers.initHandlersFromConfig created /update: solr.UpdateRequestHandler
[junit4:junit4]   2> 4630 T869 oasc.RequestHandlers.initHandlersFromConfig created /terms: org.apache.solr.handler.component.SearchHandler
[junit4:junit4]   2> 4631 T869 oasc.RequestHandlers.initHandlersFromConfig created spellCheckCompRH: org.apache.solr.handler.component.SearchHandler
[junit4:junit4]   2> 4632 T869 oasc.RequestHandlers.initHandlersFromConfig created spellCheckCompRH_Direct: org.apache.solr.handler.component.SearchHandler
[junit4:junit4]   2> 4633 T869 oasc.RequestHandlers.initHandlersFromConfig created spellCheckWithWordbreak: org.apache.solr.handler.component.SearchHandler
[junit4:junit4]   2> 4634 T869 oasc.RequestHandlers.initHandlersFromConfig created spellCheckWithWordbreak_Direct: org.apache.solr.handler.component.SearchHandler
[junit4:junit4]   2> 4635 T869 oasc.RequestHandlers.initHandlersFromConfig created spellCheckCompRH1: org.apache.solr.handler.component.SearchHandler
[junit4:junit4]   2> 4636 T869 oasc.RequestHandlers.initHandlersFromConfig created mltrh: org.apache.solr.handler.component.SearchHandler
[junit4:junit4]   2> 4636 T869 oasc.RequestHandlers.initHandlersFromConfig created tvrh: org.apache.solr.handler.component.SearchHandler
[junit4:junit4]   2> 4637 T869 oasc.RequestHandlers.initHandlersFromConfig created /mlt: solr.MoreLikeThisHandler
[junit4:junit4]   2> 4638 T869 oasc.RequestHandlers.initHandlersFromConfig created /debug/dump: solr.DumpRequestHandler
[junit4:junit4]   2> 4645 T869 oashl.XMLLoader.init xsltCacheLifetimeSeconds=60
[junit4:junit4]   2> 4650 T869 oasc.SolrCore.initDeprecatedSupport WARNING solrconfig.xml uses deprecated <admin/gettableFiles>, Please update your config to use the ShowFileRequestHandler.
[junit4:junit4]   2> 4651 T869 oasc.SolrCore.initDeprecatedSupport WARNING adding ShowFileRequestHandler with hidden files: [SCHEMA.XML, OLD_SYNONYMS.TXT, STOPWORDS.TXT, PROTWORDS.TXT, OPEN-EXCHANGE-RATES.JSON, SYNONYMS.TXT, CURRENCY.XML, MAPPING-ISOLATIN1ACCENT.TXT]
[junit4:junit4]   2> 4654 T869 oasc.CachingDirectoryFactory.close Releasing directory:/usr/home/hudson/hudson-slave/workspace/Lucene-Solr-Tests-4.x-Java6/solr/build/solr-core/test/J0/./org.apache.solr.cloud.SyncSliceTest-1355531696787/jetty1
[junit4:junit4]   2> 4656 T869 oass.SolrIndexSearcher.<init> Opening Searcher@482db72c main
[junit4:junit4]   2> 4657 T869 oasu.CommitTracker.<init> Hard AutoCommit: disabled
[junit4:junit4]   2> 4657 T869 oasu.CommitTracker.<init> Soft AutoCommit: disabled
[junit4:junit4]   2> 4657 T869 oashc.SpellCheckComponent.inform Initializing spell checkers
[junit4:junit4]   2> 4736 T869 oass.DirectSolrSpellChecker.init init: {name=direct,classname=DirectSolrSpellChecker,field=lowerfilt,minQueryLength=3}
[junit4:junit4]   2> 4865 T870 oasc.SolrCore.registerSearcher [collection1] Registered new searcher Searcher@482db72c main{StandardDirectoryReader(segments_1:1)}
[junit4:junit4]   2> 4870 T869 oasc.ZkController.publish publishing core=collection1 state=down
[junit4:junit4]   2> 4870 T869 oasc.ZkController.publish numShards not found on descriptor - reading it from system property
[junit4:junit4]   2> 5017 T850 oascc.ZkStateReader.updateClusterState Updating cloud state from ZooKeeper... 
[junit4:junit4]   2> 5018 T850 oasc.Overseer$ClusterStateUpdater.updateState Update state numShards=1 message={
[junit4:junit4]   2> 	  "operation":"state",
[junit4:junit4]   2> 	  "numShards":"1",
[junit4:junit4]   2> 	  "shard":null,
[junit4:junit4]   2> 	  "roles":null,
[junit4:junit4]   2> 	  "state":"down",
[junit4:junit4]   2> 	  "core":"collection1",
[junit4:junit4]   2> 	  "collection":"collection1",
[junit4:junit4]   2> 	  "node_name":"127.0.0.1:37615_",
[junit4:junit4]   2> 	  "base_url":"http://127.0.0.1:37615"}
[junit4:junit4]   2> 5018 T850 oasc.Overseer$ClusterStateUpdater.createCollection Create collection collection1 with numShards 1
[junit4:junit4]   2> 5018 T850 oasc.Overseer$ClusterStateUpdater.updateState Assigning new node to shard shard=shard1
[junit4:junit4]   2> 5040 T855 oascc.ZkStateReader$2.process A cluster state change: WatchedEvent state:SyncConnected type:NodeDataChanged path:/clusterstate.json, has occurred - updating... (live nodes size: 2)
[junit4:junit4]   2> 5040 T868 oascc.ZkStateReader$2.process A cluster state change: WatchedEvent state:SyncConnected type:NodeDataChanged path:/clusterstate.json, has occurred - updating... (live nodes size: 2)
[junit4:junit4]   2> 5040 T849 oascc.ZkStateReader$2.process A cluster state change: WatchedEvent state:SyncConnected type:NodeDataChanged path:/clusterstate.json, has occurred - updating... (live nodes size: 2)
[junit4:junit4]   2> 5374 T869 oasc.CoreContainer.registerCore registering core: collection1
[junit4:junit4]   2> 5374 T869 oasc.ZkController.register Register shard - core:collection1 address:http://127.0.0.1:37615 shardId:shard1
[junit4:junit4]   2> 5375 T869 oascc.SolrZkClient.makePath makePath: /collections/collection1/leader_elect/shard1/election
[junit4:junit4]   2> 5406 T832 oazs.PrepRequestProcessor.pRequest Got user-level KeeperException when processing sessionid:0x13b9bfc3a9b0006 type:delete cxid:0x43 zxid:0x5b txntype:-1 reqpath:n/a Error Path:/solr/collections/collection1/leaders Error:KeeperErrorCode = NoNode for /solr/collections/collection1/leaders
[junit4:junit4]   2> 5415 T869 oasc.ShardLeaderElectionContext.runLeaderProcess Running the leader process.
[junit4:junit4]   2> 5415 T832 oazs.PrepRequestProcessor.pRequest Got user-level KeeperException when processing sessionid:0x13b9bfc3a9b0006 type:create cxid:0x44 zxid:0x5c txntype:-1 reqpath:n/a Error Path:/solr/overseer Error:KeeperErrorCode = NodeExists for /solr/overseer
[junit4:junit4]   2> 5429 T869 oasc.ShardLeaderElectionContext.waitForReplicasToComeUp Enough replicas found to continue.
[junit4:junit4]   2> 5429 T869 oasc.ShardLeaderElectionContext.runLeaderProcess I may be the new leader - try and sync
[junit4:junit4]   2> 5429 T869 oasc.SyncStrategy.sync Sync replicas to http://127.0.0.1:37615/collection1/
[junit4:junit4]   2> 5430 T869 oasc.SyncStrategy.syncReplicas Sync Success - now sync replicas to me
[junit4:junit4]   2> 5430 T869 oasc.SyncStrategy.syncToMe http://127.0.0.1:37615/collection1/ has no replicas
[junit4:junit4]   2> 5431 T869 oasc.ShardLeaderElectionContext.runLeaderProcess I am the new leader: http://127.0.0.1:37615/collection1/
[junit4:junit4]   2> 5431 T869 oascc.SolrZkClient.makePath makePath: /collections/collection1/leaders/shard1
[junit4:junit4]   2> 5437 T832 oazs.PrepRequestProcessor.pRequest Got user-level KeeperException when processing sessionid:0x13b9bfc3a9b0006 type:create cxid:0x4e zxid:0x60 txntype:-1 reqpath:n/a Error Path:/solr/overseer Error:KeeperErrorCode = NodeExists for /solr/overseer
[junit4:junit4]   2> 5553 T850 oascc.ZkStateReader.updateClusterState Updating cloud state from ZooKeeper... 
[junit4:junit4]   2> 5576 T855 oascc.ZkStateReader$2.process A cluster state change: WatchedEvent state:SyncConnected type:NodeDataChanged path:/clusterstate.json, has occurred - updating... (live nodes size: 2)
[junit4:junit4]   2> 5576 T849 oascc.ZkStateReader$2.process A cluster state change: WatchedEvent state:SyncConnected type:NodeDataChanged path:/clusterstate.json, has occurred - updating... (live nodes size: 2)
[junit4:junit4]   2> 5576 T868 oascc.ZkStateReader$2.process A cluster state change: WatchedEvent state:SyncConnected type:NodeDataChanged path:/clusterstate.json, has occurred - updating... (live nodes size: 2)
[junit4:junit4]   2> 5600 T869 oasc.ZkController.register We are http://127.0.0.1:37615/collection1/ and leader is http://127.0.0.1:37615/collection1/
[junit4:junit4]   2> 5600 T869 oasc.ZkController.register No LogReplay needed for core=collection1 baseURL=http://127.0.0.1:37615
[junit4:junit4]   2> 5600 T869 oasc.ZkController.checkRecovery I am the leader, no recovery necessary
[junit4:junit4]   2> 5601 T869 oasc.ZkController.publish publishing core=collection1 state=active
[junit4:junit4]   2> 5601 T869 oasc.ZkController.publish numShards not found on descriptor - reading it from system property
[junit4:junit4]   2> 5609 T869 oascc.ZkStateReader.updateClusterState Updating cloud state from ZooKeeper... 
[junit4:junit4]   2> 5610 T827 oass.SolrDispatchFilter.init user.dir=/usr/home/hudson/hudson-slave/workspace/Lucene-Solr-Tests-4.x-Java6/solr/build/solr-core/test/J0
[junit4:junit4]   2> 5611 T827 oass.SolrDispatchFilter.init SolrDispatchFilter.init() done
[junit4:junit4]   2> 5612 T827 oascsi.HttpClientUtil.createClient Creating new http client, config:maxConnections=128&maxConnectionsPerHost=32&followRedirects=false
[junit4:junit4]   2> 5810 T827 oejs.Server.doStart jetty-8.1.8.v20121106
[junit4:junit4]   2> 5813 T827 oejs.AbstractConnector.doStart Started SocketConnector@127.0.0.1:37618
[junit4:junit4]   2> 5815 T827 oasc.SolrResourceLoader.locateSolrHome JNDI not configured for solr (NoInitialContextEx)
[junit4:junit4]   2> 5816 T827 oasc.SolrResourceLoader.locateSolrHome using system property solr.solr.home: /usr/home/hudson/hudson-slave/workspace/Lucene-Solr-Tests-4.x-Java6/solr/build/solr-core/test/J0/./org.apache.solr.cloud.SyncSliceTest-jetty2-1355531702409
[junit4:junit4]   2> 5816 T827 oasc.SolrResourceLoader.<init> new SolrResourceLoader for deduced Solr Home: '/usr/home/hudson/hudson-slave/workspace/Lucene-Solr-Tests-4.x-Java6/solr/build/solr-core/test/J0/./org.apache.solr.cloud.SyncSliceTest-jetty2-1355531702409/'
[junit4:junit4]   2> 5852 T827 oass.SolrDispatchFilter.init SolrDispatchFilter.init()
[junit4:junit4]   2> 5853 T827 oasc.SolrResourceLoader.locateSolrHome JNDI not configured for solr (NoInitialContextEx)
[junit4:junit4]   2> 5853 T827 oasc.SolrResourceLoader.locateSolrHome using system property solr.solr.home: /usr/home/hudson/hudson-slave/workspace/Lucene-Solr-Tests-4.x-Java6/solr/build/solr-core/test/J0/./org.apache.solr.cloud.SyncSliceTest-jetty2-1355531702409
[junit4:junit4]   2> 5854 T827 oasc.CoreContainer$Initializer.initialize looking for solr.xml: /usr/home/hudson/hudson-slave/workspace/Lucene-Solr-Tests-4.x-Java6/solr/build/solr-core/test/J0/./org.apache.solr.cloud.SyncSliceTest-jetty2-1355531702409/solr.xml
[junit4:junit4]   2> 5855 T827 oasc.CoreContainer.<init> New CoreContainer 357106787
[junit4:junit4]   2> 5855 T827 oasc.CoreContainer.load Loading CoreContainer using Solr Home: '/usr/home/hudson/hudson-slave/workspace/Lucene-Solr-Tests-4.x-Java6/solr/build/solr-core/test/J0/./org.apache.solr.cloud.SyncSliceTest-jetty2-1355531702409/'
[junit4:junit4]   2> 5856 T827 oasc.SolrResourceLoader.<init> new SolrResourceLoader for directory: '/usr/home/hudson/hudson-slave/workspace/Lucene-Solr-Tests-4.x-Java6/solr/build/solr-core/test/J0/./org.apache.solr.cloud.SyncSliceTest-jetty2-1355531702409/'
[junit4:junit4]   2> 5882 T827 oasc.CoreContainer.load Registering Log Listener
[junit4:junit4]   2> 5898 T827 oasc.CoreContainer.initZooKeeper Zookeeper client=127.0.0.1:37608/solr
[junit4:junit4]   2> 5899 T827 oasc.ZkController.checkChrootPath zkHost includes chroot
[junit4:junit4]   2> 5900 T827 oaz.ZooKeeper.<init> Initiating client connection, connectString=127.0.0.1:37608 sessionTimeout=60000 watcher=org.apache.solr.common.cloud.ConnectionManager@724a4f9f
[junit4:junit4]   2> 5901 T827 oascc.ConnectionManager.waitForConnected Waiting for client to connect to ZooKeeper
[junit4:junit4]   2> 5902 T880 oaz.ClientCnxn$SendThread.logStartConnect Opening socket connection to server localhost/127.0.0.1:37608. Will not attempt to authenticate using SASL (access denied (javax.security.auth.AuthPermission getLoginConfiguration))
[junit4:junit4]   2> 5903 T880 oaz.ClientCnxn$SendThread.primeConnection Socket connection established to localhost/127.0.0.1:37608, initiating session
[junit4:junit4]   2> 5903 T829 oazs.NIOServerCnxnFactory.run Accepted socket connection from /140.211.11.196:37619
[junit4:junit4]   2> 5903 T829 oazs.ZooKeeperServer.processConnectRequest Client attempting to establish new session at /140.211.11.196:37619
[junit4:junit4]   2> 5911 T831 oazs.ZooKeeperServer.finishSessionInit Established session 0x13b9bfc3a9b0007 with negotiated timeout 20000 for client /140.211.11.196:37619
[junit4:junit4]   2> 5911 T880 oaz.ClientCnxn$SendThread.onConnected Session establishment complete on server localhost/127.0.0.1:37608, sessionid = 0x13b9bfc3a9b0007, negotiated timeout = 20000
[junit4:junit4]   2> 5911 T881 oascc.ConnectionManager.process Watcher org.apache.solr.common.cloud.ConnectionManager@724a4f9f name:ZooKeeperConnection Watcher:127.0.0.1:37608 got event WatchedEvent state:SyncConnected type:None path:null path:null type:None
[junit4:junit4]   2> 5912 T827 oascc.ConnectionManager.waitForConnected Client is connected to ZooKeeper
[junit4:junit4]   2> 5914 T832 oazs.PrepRequestProcessor.pRequest2Txn Processed session termination for sessionid: 0x13b9bfc3a9b0007
[junit4:junit4]   2> 5919 T881 oaz.ClientCnxn$EventThread.run EventThread shut down
[junit4:junit4]   2> 5919 T829 oazs.NIOServerCnxn.closeSock Closed socket connection for client /140.211.11.196:37619 which had sessionid 0x13b9bfc3a9b0007
[junit4:junit4]   2> 5919 T827 oaz.ZooKeeper.close Session: 0x13b9bfc3a9b0007 closed
[junit4:junit4]   2> 5920 T827 oaz.ZooKeeper.<init> Initiating client connection, connectString=127.0.0.1:37608/solr sessionTimeout=8000 watcher=org.apache.solr.common.cloud.ConnectionManager@44849f2b
[junit4:junit4]   2> 5921 T882 oaz.ClientCnxn$SendThread.logStartConnect Opening socket connection to server localhost/127.0.0.1:37608. Will not attempt to authenticate using SASL (access denied (javax.security.auth.AuthPermission getLoginConfiguration))
[junit4:junit4]   2> 5921 T827 oascc.ConnectionManager.waitForConnected Waiting for client to connect to ZooKeeper
[junit4:junit4]   2> 5922 T882 oaz.ClientCnxn$SendThread.primeConnection Socket connection established to localhost/127.0.0.1:37608, initiating session
[junit4:junit4]   2> 5922 T829 oazs.NIOServerCnxnFactory.run Accepted socket connection from /140.211.11.196:37620
[junit4:junit4]   2> 5922 T829 oazs.ZooKeeperServer.processConnectRequest Client attempting to establish new session at /140.211.11.196:37620
[junit4:junit4]   2> 5927 T831 oazs.ZooKeeperServer.finishSessionInit Established session 0x13b9bfc3a9b0008 with negotiated timeout 8000 for client /140.211.11.196:37620
[junit4:junit4]   2> 5927 T882 oaz.ClientCnxn$SendThread.onConnected Session establishment complete on server localhost/127.0.0.1:37608, sessionid = 0x13b9bfc3a9b0008, negotiated timeout = 8000
[junit4:junit4]   2> 5927 T883 oascc.ConnectionManager.process Watcher org.apache.solr.common.cloud.ConnectionManager@44849f2b name:ZooKeeperConnection Watcher:127.0.0.1:37608/solr got event WatchedEvent state:SyncConnected type:None path:null path:null type:None
[junit4:junit4]   2> 5927 T827 oascc.ConnectionManager.waitForConnected Client is connected to ZooKeeper
[junit4:junit4]   2> 5929 T832 oazs.PrepRequestProcessor.pRequest Got user-level KeeperException when processing sessionid:0x13b9bfc3a9b0008 type:create cxid:0x1 zxid:0x6d txntype:-1 reqpath:n/a Error Path:/solr/overseer Error:KeeperErrorCode = NodeExists for /solr/overseer
[junit4:junit4]   2> 5935 T832 oazs.PrepRequestProcessor.pRequest Got user-level KeeperException when processing sessionid:0x13b9bfc3a9b0008 type:create cxid:0x2 zxid:0x6e txntype:-1 reqpath:n/a Error Path:/solr/overseer Error:KeeperErrorCode = NodeExists for /solr/overseer
[junit4:junit4]   2> 5944 T827 oasc.ZkController.createEphemeralLiveNode Register node as live in ZooKeeper:/live_nodes/127.0.0.1:37618_
[junit4:junit4]   2> 5945 T832 oazs.PrepRequestProcessor.pRequest Got user-level KeeperException when processing sessionid:0x13b9bfc3a9b0008 type:delete cxid:0x4 zxid:0x6f txntype:-1 reqpath:n/a Error Path:/solr/live_nodes/127.0.0.1:37618_ Error:KeeperErrorCode = NoNode for /solr/live_nodes/127.0.0.1:37618_
[junit4:junit4]   2> 5952 T827 oascc.SolrZkClient.makePath makePath: /live_nodes/127.0.0.1:37618_
[junit4:junit4]   2> 5960 T868 oascc.ZkStateReader$2.process A cluster state change: WatchedEvent state:SyncConnected type:NodeChildrenChanged path:/live_nodes, has occurred - updating... (live nodes size: 2)
[junit4:junit4]   2> 5960 T855 oascc.ZkStateReader$3.process Updating live nodes... (3)
[junit4:junit4]   2> 5960 T849 oascc.ZkStateReader$3.process Updating live nodes... (3)
[junit4:junit4]   2> 5961 T855 oascc.ZkStateReader$2.process A cluster state change: WatchedEvent state:SyncConnected type:NodeChildrenChanged path:/live_nodes, has occurred - updating... (live nodes size: 3)
[junit4:junit4]   2> 5961 T849 oascc.ZkStateReader$2.process A cluster state change: WatchedEvent state:SyncConnected type:NodeChildrenChanged path:/live_nodes, has occurred - updating... (live nodes size: 3)
[junit4:junit4]   2> 5961 T827 oashc.HttpShardHandlerFactory.getParameter Setting socketTimeout to: 0
[junit4:junit4]   2> 5962 T868 oascc.ZkStateReader$3.process Updating live nodes... (3)
[junit4:junit4]   2> 5962 T827 oashc.HttpShardHandlerFactory.getParameter Setting urlScheme to: http://
[junit4:junit4]   2> 5962 T827 oashc.HttpShardHandlerFactory.getParameter Setting connTimeout to: 0
[junit4:junit4]   2> 5963 T827 oashc.HttpShardHandlerFactory.getParameter Setting maxConnectionsPerHost to: 20
[junit4:junit4]   2> 5964 T827 oashc.HttpShardHandlerFactory.getParameter Setting corePoolSize to: 0
[junit4:junit4]   2> 5964 T827 oashc.HttpShardHandlerFactory.getParameter Setting maximumPoolSize to: 2147483647
[junit4:junit4]   2> 5965 T827 oashc.HttpShardHandlerFactory.getParameter Setting maxThreadIdleTime to: 5
[junit4:junit4]   2> 5965 T827 oashc.HttpShardHandlerFactory.getParameter Setting sizeOfQueue to: -1
[junit4:junit4]   2> 5966 T827 oashc.HttpShardHandlerFactory.getParameter Setting fairnessPolicy to: false
[junit4:junit4]   2> 5967 T827 oascsi.HttpClientUtil.createClient Creating new http client, config:maxConnectionsPerHost=20&maxConnections=10000&socketTimeout=0&connTimeout=0&retry=false
[junit4:junit4]   2> 5992 T827 oascc.ZkStateReader.createClusterStateWatchersAndUpdate Updating cluster state from ZooKeeper... 
[junit4:junit4]   2> 6001 T884 oasc.CoreContainer.create Creating SolrCore 'collection1' using instanceDir: /usr/home/hudson/hudson-slave/workspace/Lucene-Solr-Tests-4.x-Java6/solr/build/solr-core/test/J0/./org.apache.solr.cloud.SyncSliceTest-jetty2-1355531702409/collection1
[junit4:junit4]   2> 6001 T884 oasc.ZkController.createCollectionZkNode Check for collection zkNode:collection1
[junit4:junit4]   2> 6002 T884 oasc.ZkController.createCollectionZkNode Collection zkNode exists
[junit4:junit4]   2> 6002 T884 oasc.ZkController.readConfigName Load collection config from:/collections/collection1
[junit4:junit4]   2> 6003 T884 oasc.SolrResourceLoader.<init> new SolrResourceLoader for directory: '/usr/home/hudson/hudson-slave/workspace/Lucene-Solr-Tests-4.x-Java6/solr/build/solr-core/test/J0/./org.apache.solr.cloud.SyncSliceTest-jetty2-1355531702409/collection1/'
[junit4:junit4]   2> 6004 T884 oasc.SolrResourceLoader.replaceClassLoader Adding 'file:/usr/home/hudson/hudson-slave/workspace/Lucene-Solr-Tests-4.x-Java6/solr/build/solr-core/test/J0/org.apache.solr.cloud.SyncSliceTest-jetty2-1355531702409/collection1/lib/README' to classloader
[junit4:junit4]   2> 6005 T884 oasc.SolrResourceLoader.replaceClassLoader Adding 'file:/usr/home/hudson/hudson-slave/workspace/Lucene-Solr-Tests-4.x-Java6/solr/build/solr-core/test/J0/org.apache.solr.cloud.SyncSliceTest-jetty2-1355531702409/collection1/lib/classes/' to classloader
[junit4:junit4]   2> 6056 T884 oasc.SolrConfig.<init> Using Lucene MatchVersion: LUCENE_41
[junit4:junit4]   2> 6084 T850 oascc.ZkStateReader.updateClusterState Updating cloud state from ZooKeeper... 
[junit4:junit4]   2> 6085 T850 oasc.Overseer$ClusterStateUpdater.updateState Update state numShards=1 message={
[junit4:junit4]   2> 	  "operation":"state",
[junit4:junit4]   2> 	  "numShards":"1",
[junit4:junit4]   2> 	  "shard":"shard1",
[junit4:junit4]   2> 	  "roles":null,
[junit4:junit4]   2> 	  "state":"active",
[junit4:junit4]   2> 	  "core":"collection1",
[junit4:junit4]   2> 	  "collection":"collection1",
[junit4:junit4]   2> 	  "node_name":"127.0.0.1:37615_",
[junit4:junit4]   2> 	  "base_url":"http://127.0.0.1:37615"}
[junit4:junit4]   2> 6096 T868 oascc.ZkStateReader$2.process A cluster state change: WatchedEvent state:SyncConnected type:NodeDataChanged path:/clusterstate.json, has occurred - updating... (live nodes size: 3)
[junit4:junit4]   2> 6096 T883 oascc.ZkStateReader$2.process A cluster state change: WatchedEvent state:SyncConnected type:NodeDataChanged path:/clusterstate.json, has occurred - updating... (live nodes size: 3)
[junit4:junit4]   2> 6096 T855 oascc.ZkStateReader$2.process A cluster state change: WatchedEvent state:SyncConnected type:NodeDataChanged path:/clusterstate.json, has occurred - updating... (live nodes size: 3)
[junit4:junit4]   2> 6096 T849 oascc.ZkStateReader$2.process A cluster state change: WatchedEvent state:SyncConnected type:NodeDataChanged path:/clusterstate.json, has occurred - updating... (live nodes size: 3)
[junit4:junit4]   2> 6130 T884 oasc.SolrConfig.<init> Loaded SolrConfig: solrconfig.xml
[junit4:junit4]   2> 6231 T884 oass.IndexSchema.readSchema Reading Solr Schema
[junit4:junit4]   2> 6241 T884 oass.IndexSchema.readSchema Schema name=test
[junit4:junit4]   2> 6873 T884 oass.OpenExchangeRatesOrgProvider.init Initialized with rates=open-exchange-rates.json, refreshInterval=1440.
[junit4:junit4]   2> 6885 T884 oass.IndexSchema.readSchema default search field in schema is text
[junit4:junit4]   2> 6889 T884 oass.IndexSchema.readSchema unique key field: id
[junit4:junit4]   2> 6905 T884 oass.FileExchangeRateProvider.reload Reloading exchange rates from file currency.xml
[junit4:junit4]   2> 6910 T884 oass.FileExchangeRateProvider.reload Reloading exchange rates from file currency.xml
[junit4:junit4]   2> 6915 T884 oass.OpenExchangeRatesOrgProvider.reload Reloading exchange rates from open-exchange-rates.json
[junit4:junit4]   2> 6916 T884 oass.OpenExchangeRatesOrgProvider.reload Reloading exchange rates from open-exchange-rates.json
[junit4:junit4]   2> 6918 T884 oasc.SolrCore.<init> [collection1] Opening new SolrCore at /usr/home/hudson/hudson-slave/workspace/Lucene-Solr-Tests-4.x-Java6/solr/build/solr-core/test/J0/./org.apache.solr.cloud.SyncSliceTest-jetty2-1355531702409/collection1/, dataDir=./org.apache.solr.cloud.SyncSliceTest-1355531696787/jetty2/
[junit4:junit4]   2> 6918 T884 oasc.JmxMonitoredMap.<init> JMX monitoring is enabled. Adding Solr mbeans to JMX Server: com.sun.jmx.mbeanserver.JmxMBeanServer@61250ff2
[junit4:junit4]   2> 6919 T884 oasc.SolrCore.initDirectoryFactory solr.NRTCachingDirectoryFactory
[junit4:junit4]   2> 6919 T884 oasc.CachingDirectoryFactory.get return new directory for /usr/home/hudson/hudson-slave/workspace/Lucene-Solr-Tests-4.x-Java6/solr/build/solr-core/test/J0/./org.apache.solr.cloud.SyncSliceTest-1355531696787/jetty2 forceNew:false
[junit4:junit4]   2> 6920 T884 oasc.CachingDirectoryFactory.close Releasing directory:/usr/home/hudson/hudson-slave/workspace/Lucene-Solr-Tests-4.x-Java6/solr/build/solr-core/test/J0/./org.apache.solr.cloud.SyncSliceTest-1355531696787/jetty2
[junit4:junit4]   2> 6920 T884 oasc.SolrCore.getNewIndexDir New index directory detected: old=null new=./org.apache.solr.cloud.SyncSliceTest-1355531696787/jetty2/index/
[junit4:junit4]   2> 6921 T884 oasc.SolrCore.initIndex WARNING [collection1] Solr index directory './org.apache.solr.cloud.SyncSliceTest-1355531696787/jetty2/index' doesn't exist. Creating new index...
[junit4:junit4]   2> 6932 T884 oasc.CachingDirectoryFactory.get return new directory for /usr/home/hudson/hudson-slave/workspace/Lucene-Solr-Tests-4.x-Java6/solr/build/solr-core/test/J0/./org.apache.solr.cloud.SyncSliceTest-1355531696787/jetty2/index forceNew:false
[junit4:junit4]   2> 6948 T884 oasc.SolrDeletionPolicy.onCommit SolrDeletionPolicy.onCommit: commits:num=1
[junit4:junit4]   2> 		commit{dir=RateLimitedDirectoryWrapper(NRTCachingDirectory(org.apache.lucene.store.NIOFSDirectory@/usr/home/hudson/hudson-slave/workspace/Lucene-Solr-Tests-4.x-Java6/solr/build/solr-core/test/J0/org.apache.solr.cloud.SyncSliceTest-1355531696787/jetty2/index lockFactory=org.apache.lucene.store.NativeFSLockFactory@4d06026b; maxCacheMB=48.0 maxMergeSizeMB=4.0)),segFN=segments_1,generation=1,filenames=[segments_1]
[junit4:junit4]   2> 6948 T884 oasc.SolrDeletionPolicy.updateCommits newest commit = 1[segments_1]
[junit4:junit4]   2> 6949 T884 oasc.CachingDirectoryFactory.close Releasing directory:/usr/home/hudson/hudson-slave/workspace/Lucene-Solr-Tests-4.x-Java6/solr/build/solr-core/test/J0/./org.apache.solr.cloud.SyncSliceTest-1355531696787/jetty2/index
[junit4:junit4]   2> 6950 T884 oasc.SolrCore.initWriters created xml: solr.XMLResponseWriter
[junit4:junit4]   2> 6953 T884 oasup.UpdateRequestProcessorChain.init inserting DistributedUpdateProcessorFactory into updateRequestProcessorChain "dedupe"
[junit4:junit4]   2> 6953 T884 oasup.UpdateRequestProcessorChain.init inserting DistributedUpdateProcessorFactory into updateRequestProcessorChain "dedupe-allfields"
[junit4:junit4]   2> 6954 T884 oasup.UpdateRequestProcessorChain.init inserting DistributedUpdateProcessorFactory into updateRequestProcessorChain "stored_sig"
[junit4:junit4]   2> 6954 T884 oasup.UpdateRequestProcessorChain.init inserting DistributedUpdateProcessorFactory into updateRequestProcessorChain "uniq-fields"
[junit4:junit4]   2> 6955 T884 oasup.UpdateRequestProcessorChain.init inserting DistributedUpdateProcessorFactory into updateRequestProcessorChain "distrib-dup-test-chain-implicit"
[junit4:junit4]   2> 6956 T884 oasc.RequestHandlers.initHandlersFromConfig adding lazy requestHandler: solr.ReplicationHandler
[junit4:junit4]   2> 6956 T884 oasc.RequestHandlers.initHandlersFromConfig created /replication: solr.ReplicationHandler
[junit4:junit4]   2> 6958 T884 oasc.RequestHandlers.initHandlersFromConfig created standard: solr.StandardRequestHandler
[junit4:junit4]   2> 6959 T884 oasc.RequestHandlers.initHandlersFromConfig created /get: solr.RealTimeGetHandler
[junit4:junit4]   2> 6960 T884 oasc.RequestHandlers.initHandlersFromConfig created dismax: solr.SearchHandler
[junit4:junit4]   2> 6962 T884 oasc.RequestHandlers.initHandlersFromConfig created mock: org.apache.solr.core.MockQuerySenderListenerReqHandler
[junit4:junit4]   2> 6962 T884 oasc.RequestHandlers.initHandlersFromConfig created /admin/: org.apache.solr.handler.admin.AdminHandlers
[junit4:junit4]   2> 6964 T884 oasc.RequestHandlers.initHandlersFromConfig created defaults: solr.StandardRequestHandler
[junit4:junit4]   2> 6964 T884 oasc.RequestHandlers.initHandlersFromConfig adding lazy requestHandler: solr.StandardRequestHandler
[junit4:junit4]   2> 6964 T884 oasc.RequestHandlers.initHandlersFromConfig created lazy: solr.StandardRequestHandler
[junit4:junit4]   2> 6966 T884 oasc.RequestHandlers.initHandlersFromConfig created /update: solr.UpdateRequestHandler
[junit4:junit4]   2> 6967 T884 oasc.RequestHandlers.initHandlersFromConfig created /terms: org.apache.solr.handler.component.SearchHandler
[junit4:junit4]   2> 6969 T884 oasc.RequestHandlers.initHandlersFromConfig created spellCheckCompRH: org.apache.solr.handler.component.SearchHandler
[junit4:junit4]   2> 6970 T884 oasc.RequestHandlers.initHandlersFromConfig created spellCheckCompRH_Direct: org.apache.solr.handler.component.SearchHandler
[junit4:junit4]   2> 6971 T884 oasc.RequestHandlers.initHandlersFromConfig created spellCheckWithWordbreak: org.apache.solr.handler.component.SearchHandler
[junit4:junit4]   2> 6972 T884 oasc.RequestHandlers.initHandlersFromConfig created spellCheckWithWordbreak_Direct: org.apache.solr.handler.component.SearchHandler
[junit4:junit4]   2> 6974 T884 oasc.RequestHandlers.initHandlersFromConfig created spellCheckCompRH1: org.apache.solr.handler.component.SearchHandler
[junit4:junit4]   2> 6975 T884 oasc.RequestHandlers.initHandlersFromConfig created mltrh: org.apache.solr.handler.component.SearchHandler
[junit4:junit4]   2> 6976 T884 oasc.RequestHandlers.initHandlersFromConfig created tvrh: org.apache.solr.handler.component.SearchHandler
[junit4:junit4]   2> 6977 T884 oasc.RequestHandlers.initHandlersFromConfig created /mlt: solr.MoreLikeThisHandler
[junit4:junit4]   2> 6978 T884 oasc.RequestHandlers.initHandlersFromConfig created /debug/dump: solr.DumpRequestHandler
[junit4:junit4]   2> 6985 T884 oashl.XMLLoader.init xsltCacheLifetimeSeconds=60
[junit4:junit4]   2> 6991 T884 oasc.SolrCore.initDeprecatedSupport WARNING solrconfig.xml uses deprecated <admin/gettableFiles>, Please update your config to use the ShowFileRequestHandler.
[junit4:junit4]   2> 6993 T884 oasc.SolrCore.initDeprecatedSupport WARNING adding ShowFileRequestHandler with hidden files: [SCHEMA.XML, OLD_SYNONYMS.TXT, STOPWORDS.TXT, PROTWORDS.TXT, OPEN-EXCHANGE-RATES.JSON, SYNONYMS.TXT, CURRENCY.XML, MAPPING-ISOLATIN1ACCENT.TXT]
[junit4:junit4]   2> 6995 T884 oasc.CachingDirectoryFactory.close Releasing directory:/usr/home/hudson/hudson-slave/workspace/Lucene-Solr-Tests-4.x-Java6/solr/build/solr-core/test/J0/./org.apache.solr.cloud.SyncSliceTest-1355531696787/jetty2
[junit4:junit4]   2> 6997 T884 oass.SolrIndexSearcher.<init> Opening Searcher@4abb74d3 main
[junit4:junit4]   2> 6998 T884 oasu.CommitTracker.<init> Hard AutoCommit: disabled
[junit4:junit4]   2> 6999 T884 oasu.CommitTracker.<init> Soft AutoCommit: disabled
[junit4:junit4]   2> 6999 T884 oashc.SpellCheckComponent.inform Initializing spell checkers
[junit4:junit4]   2> 7007 T884 oass.DirectSolrSpellChecker.init init: {name=direct,classname=DirectSolrSpellChecker,field=lowerfilt,minQueryLength=3}
[junit4:junit4]   2> 7091 T885 oasc.SolrCore.registerSearcher [collection1] Registered new searcher Searcher@4abb74d3 main{StandardDirectoryReader(segments_1:1)}
[junit4:junit4]   2> 7096 T884 oasc.ZkController.publish publishing core=collection1 state=down
[junit4:junit4]   2> 7096 T884 oasc.ZkController.publish numShards not found on descriptor - reading it from system property
[junit4:junit4]   2> 7105 T850 oascc.ZkStateReader.updateClusterState Updating cloud state from ZooKeeper... 
[junit4:junit4]   2> 7106 T850 oasc.Overseer$ClusterStateUpdater.updateState Update state numShards=1 message={
[junit4:junit4]   2> 	  "operation":"state",
[junit4:junit4]   2> 	  "numShards":"1",
[junit4:junit4]   2> 	  "shard":null,
[junit4:junit4]   2> 	  "roles":null,
[junit4:junit4]   2> 	  "state":"down",
[junit4:junit4]   2> 	  "core":"collection1",
[junit4:junit4]   2> 	  "collection":"collection1",
[junit4:junit4]   2> 	  "node_name":"127.0.0.1:37618_",
[junit4:junit4]   2> 	  "base_url":"http://127.0.0.1:37618"}
[junit4:junit4]   2> 7107 T850 oasc.Overseer$ClusterStateUpdater.updateState Collection already exists with numShards=1
[junit4:junit4]   2> 7107 T850 oasc.Overseer$ClusterStateUpdater.updateState Assigning new node to shard shard=shard1
[junit4:junit4]   2> 7113 T868 oascc.ZkStateReader$2.process A cluster state change: WatchedEvent state:SyncConnected type:NodeDataChanged path:/clusterstate.json, has occurred - updating... (live nodes size: 3)
[junit4:junit4]   2> 7113 T883 oascc.ZkStateReader$2.process A cluster state change: WatchedEvent state:SyncConnected type:NodeDataChanged path:/clusterstate.json, has occurred - updating... (live nodes size: 3)
[junit4:junit4]   2> 7113 T849 oascc.ZkStateReader$2.process A cluster state change: WatchedEvent state:SyncConnected type:NodeDataChanged path:/clusterstate.json, has occurred - updating... (live nodes size: 3)
[junit4:junit4]   2> 7113 T855 oascc.ZkStateReader$2.process A cluster state change: WatchedEvent state:SyncConnected type:NodeDataChanged path:/clusterstate.json, has occurred - updating... (live nodes size: 3)
[junit4:junit4]   2> 7604 T884 oasc.CoreContainer.registerCore registering core: collection1
[junit4:junit4]   2> 7604 T884 oasc.ZkController.register Register shard - core:collection1 address:http://127.0.0.1:37618 shardId:shard1
[junit4:junit4]   2> 7608 T884 oasc.ZkController.register We are http://127.0.0.1:37618/collection1/ and leader is http://127.0.0.1:37615/collection1/
[junit4:junit4]   2> 7609 T884 oasc.ZkController.register No LogReplay needed for core=collection1 baseURL=http://127.0.0.1:37618
[junit4:junit4]   2> 7609 T884 oasc.ZkController.checkRecovery Core needs to recover:collection1
[junit4:junit4]   2> 7609 T884 oasu.DefaultSolrCoreState.doRecovery Running recovery - first canceling any ongoing recovery
[junit4:junit4]   2> ASYNC  NEW_CORE C81 name=collection1 org.apache.solr.core.SolrCore@2455bc16 url=http://127.0.0.1:37618/collection1 node=127.0.0.1:37618_
[junit4:junit4]   2> 7617 T886 C81 P37618 oasc.RecoveryStrategy.run Starting recovery process.  core=collection1 recoveringAfterStartup=true
[junit4:junit4]   2> 7618 T884 oascc.ZkStateReader.updateClusterState Updating cloud state from ZooKeeper... 
[junit4:junit4]   2> 7619 T886 C81 P37618 oasc.RecoveryStrategy.doRecovery ###### startupVersions=[]
[junit4:junit4]   2> 7619 T886 C81 P37618 oasc.ZkController.publish publishing core=collection1 state=recovering
[junit4:junit4]   2> 7619 T886 C81 P37618 oasc.ZkController.publish numShards not found on descriptor - reading it from system property
[junit4:junit4]   2> 7619 T827 oass.SolrDispatchFilter.init user.dir=/usr/home/hudson/hudson-slave/workspace/Lucene-Solr-Tests-4.x-Java6/solr/build/solr-core/test/J0
[junit4:junit4]   2> 7621 T886 C81 P37618 oasc.RecoveryStrategy.doRecovery Attempting to PeerSync from http://127.0.0.1:37615/collection1/ core=collection1 - recoveringAfterStartup=true
[junit4:junit4]   2> 7621 T827 oass.SolrDispatchFilter.init SolrDispatchFilter.init() done
[junit4:junit4]   2> 7621 T827 oascsi.HttpClientUtil.createClient Creating new http client, config:maxConnections=128&maxConnectionsPerHost=32&followRedirects=false
[junit4:junit4]   2> 7631 T886 C81 P37618 oascsi.HttpClientUtil.createClient Creating new http client, config:maxConnectionsPerHost=20&maxConnections=10000&connTimeout=30000&socketTimeout=30000&retry=false
[junit4:junit4]   2> 7654 T886 C81 P37618 oasu.PeerSync.sync PeerSync: core=collection1 url=http://127.0.0.1:37618 START replicas=[http://127.0.0.1:37615/collection1/] nUpdates=100
[junit4:junit4]   2> 7655 T886 C81 P37618 oasu.PeerSync.sync WARNING no frame of reference to tell of we've missed updates
[junit4:junit4]   2> 7655 T886 C81 P37618 oasc.RecoveryStrategy.doRecovery PeerSync Recovery was not successful - trying replication. core=collection1
[junit4:junit4]   2> 7656 T886 C81 P37618 oasc.RecoveryStrategy.doRecovery Starting Replication Recovery. core=collection1
[junit4:junit4]   2> 7656 T886 C81 P37618 oascsi.HttpClientUtil.createClient Creating new http client, config:maxConnections=128&maxConnectionsPerHost=32&followRedirects=false
[junit4:junit4]   2> ASYNC  NEW_CORE C82 name=collection1 org.apache.solr.core.SolrCore@e584d9b url=http://127.0.0.1:37615/collection1 node=127.0.0.1:37615_
[junit4:junit4]   2> 7667 T858 C82 P37615 REQ /get {distrib=false&qt=/get&wt=javabin&version=2&getVersions=100} status=0 QTime=1 
[junit4:junit4]   2> 7831 T827 oejs.Server.doStart jetty-8.1.8.v20121106
[junit4:junit4]   2> 7835 T827 oejs.AbstractConnector.doStart Started SocketConnector@127.0.0.1:37623
[junit4:junit4]   2> 7835 T827 oasc.SolrResourceLoader.locateSolrHome JNDI not configured for solr (NoInitialContextEx)
[junit4:junit4]   2> 7836 T827 oasc.SolrResourceLoader.locateSolrHome using system property solr.solr.home: /usr/home/hudson/hudson-slave/workspace/Lucene-Solr-Tests-4.x-Java6/solr/build/solr-core/test/J0/./org.apache.solr.cloud.SyncSliceTest-jetty3-1355531704422
[junit4:junit4]   2> 7837 T827 oasc.SolrResourceLoader.<init> new SolrResourceLoader for deduced Solr Home: '/usr/home/hudson/hudson-slave/workspace/Lucene-Solr-Tests-4.x-Java6/solr/build/solr-core/test/J0/./org.apache.solr.cloud.SyncSliceTest-jetty3-1355531704422/'
[junit4:junit4]   2> 7873 T827 oass.SolrDispatchFilter.init SolrDispatchFilter.init()
[junit4:junit4]   2> 7874 T827 oasc.SolrResourceLoader.locateSolrHome JNDI not configured for solr (NoInitialContextEx)
[junit4:junit4]   2> 7875 T827 oasc.SolrResourceLoader.locateSolrHome using system property solr.solr.home: /usr/home/hudson/hudson-slave/workspace/Lucene-Solr-Tests-4.x-Java6/solr/build/solr-core/test/J0/./org.apache.solr.cloud.SyncSliceTest-jetty3-1355531704422
[junit4:junit4]   2> 7875 T827 oasc.CoreContainer$Initializer.initialize looking for solr.xml: /usr/home/hudson/hudson-slave/workspace/Lucene-Solr-Tests-4.x-Java6/solr/build/solr-core/test/J0/./org.apache.solr.cloud.SyncSliceTest-jetty3-1355531704422/solr.xml
[junit4:junit4]   2> 7876 T827 oasc.CoreContainer.<init> New CoreContainer 560859589
[junit4:junit4]   2> 7877 T827 oasc.CoreContainer.load Loading CoreContainer using Solr Home: '/usr/home/hudson/hudson-slave/workspace/Lucene-Solr-Tests-4.x-Java6/solr/build/solr-core/test/J0/./org.apache.solr.cloud.SyncSliceTest-jetty3-1355531704422/'
[junit4:junit4]   2> 7877 T827 oasc.SolrResourceLoader.<init> new SolrResourceLoader for directory: '/usr/home/hudson/hudson-slave/workspace/Lucene-Solr-Tests-4.x-Java6/solr/build/solr-core/test/J0/./org.apache.solr.cloud.SyncSliceTest-jetty3-1355531704422/'
[junit4:junit4]   2> 7906 T827 oasc.CoreContainer.load Registering Log Listener
[junit4:junit4]   2> 7923 T827 oasc.CoreContainer.initZooKeeper Zookeeper client=127.0.0.1:37608/solr
[junit4:junit4]   2> 7924 T827 oasc.ZkController.checkChrootPath zkHost includes chroot
[junit4:junit4]   2> 7924 T827 oaz.ZooKeeper.<init> Initiating client connection, connectString=127.0.0.1:37608 sessionTimeout=60000 watcher=org.apache.solr.common.cloud.ConnectionManager@65e1890a
[junit4:junit4]   2> 7926 T827 oascc.ConnectionManager.waitForConnected Waiting for client to connect to ZooKeeper
[junit4:junit4]   2> 7926 T897 oaz.ClientCnxn$SendThread.logStartConnect Opening socket connection to server localhost/127.0.0.1:37608. Will not attempt to authenticate using SASL (access denied (javax.security.auth.AuthPermission getLoginConfiguration))
[junit4:junit4]   2> 7927 T897 oaz.ClientCnxn$SendThread.primeConnection Socket connection established to localhost/127.0.0.1:37608, initiating session
[junit4:junit4]   2> 7927 T829 oazs.NIOServerCnxnFactory.run Accepted socket connection from /140.211.11.196:37624
[junit4:junit4]   2> 7928 T829 oazs.ZooKeeperServer.processConnectRequest Client attempting to establish new session at /140.211.11.196:37624
[junit4:junit4]   2> 7930 T831 oazs.ZooKeeperServer.finishSessionInit Established session 0x13b9bfc3a9b0009 with negotiated timeout 20000 for client /140.211.11.196:37624
[junit4:junit4]   2> 7930 T897 oaz.ClientCnxn$SendThread.onConnected Session establishment complete on server localhost/127.0.0.1:37608, sessionid = 0x13b9bfc3a9b0009, negotiated timeout = 20000
[junit4:junit4]   2> 7930 T898 oascc.ConnectionManager.process Watcher org.apache.solr.common.cloud.ConnectionManager@65e1890a name:ZooKeeperConnection Watcher:127.0.0.1:37608 got event WatchedEvent state:SyncConnected type:None path:null path:null type:None
[junit4:junit4]   2> 7930 T827 oascc.ConnectionManager.waitForConnected Client is connected to ZooKeeper
[junit4:junit4]   2> 7932 T832 oazs.PrepRequestProcessor.pRequest2Txn Processed session termination for sessionid: 0x13b9bfc3a9b0009
[junit4:junit4]   2> 7933 T898 oaz.ClientCnxn$EventThread.run EventThread shut down
[junit4:junit4]   2> 7933 T829 oazs.NIOServerCnxn.closeSock Closed socket connection for client /140.211.11.196:37624 which had sessionid 0x13b9bfc3a9b0009
[junit4:junit4]   2> 7933 T827 oaz.ZooKeeper.close Session: 0x13b9bfc3a9b0009 closed
[junit4:junit4]   2> 7934 T827 oaz.ZooKeeper.<init> Initiating client connection, connectString=127.0.0.1:37608/solr sessionTimeout=8000 watcher=org.apache.solr.common.cloud.ConnectionManager@5d143a6b
[junit4:junit4]   2> 7936 T899 oaz.ClientCnxn$SendThread.logStartConnect Opening socket connection to server localhost/127.0.0.1:37608. Will not attempt to authenticate using SASL (access denied (javax.security.auth.AuthPermission getLoginConfiguration))
[junit4:junit4]   2> 7935 T827 oascc.ConnectionManager.waitForConnected Waiting for client to connect to ZooKeeper
[junit4:junit4]   2> 7936 T899 oaz.ClientCnxn$SendThread.primeConnection Socket connection established to localhost/127.0.0.1:37608, initiating session
[junit4:junit4]   2> 7936 T829 oazs.NIOServerCnxnFactory.run Accepted socket connection from /140.211.11.196:37625
[junit4:junit4]   2> 7937 T829 oazs.ZooKeeperServer.processConnectRequest Client attempting to establish new session at /140.211.11.196:37625
[junit4:junit4]   2> 7942 T831 oazs.ZooKeeperServer.finishSessionInit Established session 0x13b9bfc3a9b000a with negotiated timeout 8000 for client /140.211.11.196:37625
[junit4:junit4]   2> 7942 T899 oaz.ClientCnxn$SendThread.onConnected Session establishment complete on server localhost/127.0.0.1:37608, sessionid = 0x13b9bfc3a9b000a, negotiated timeout = 8000
[junit4:junit4]   2> 7943 T900 oascc.ConnectionManager.process Watcher org.apache.solr.common.cloud.ConnectionManager@5d143a6b name:ZooKeeperConnection Watcher:127.0.0.1:37608/solr got event WatchedEvent state:SyncConnected type:None path:null path:null type:None
[junit4:junit4]   2> 7943 T827 oascc.ConnectionManager.waitForConnected Client is connected to ZooKeeper
[junit4:junit4]   2> 7944 T832 oazs.PrepRequestProcessor.pRequest Got user-level KeeperException when processing sessionid:0x13b9bfc3a9b000a type:create cxid:0x1 zxid:0x80 txntype:-1 reqpath:n/a Error Path:/solr/overseer Error:KeeperErrorCode = NodeExists for /solr/overseer
[junit4:junit4]   2> 7945 T832 oazs.PrepRequestProcessor.pRequest Got user-level KeeperException when processing sessionid:0x13b9bfc3a9b000a type:create cxid:0x2 zxid:0x81 txntype:-1 reqpath:n/a Error Path:/solr/overseer Error:KeeperErrorCode = NodeExists for /solr/overseer
[junit4:junit4]   2> 7947 T827 oasc.ZkController.createEphemeralLiveNode Register node as live in ZooKeeper:/live_nodes/127.0.0.1:37623_
[junit4:junit4]   2> 7948 T832 oazs.PrepRequestProcessor.pRequest Got user-level KeeperException when processing sessionid:0x13b9bfc3a9b000a type:delete cxid:0x4 zxid:0x82 txntype:-1 reqpath:n/a Error Path:/solr/live_nodes/127.0.0.1:37623_ Error:KeeperErrorCode = NoNode for /solr/live_nodes/127.0.0.1:37623_
[junit4:junit4]   2> 7955 T827 oascc.SolrZkClient.makePath makePath: /live_nodes/127.0.0.1:37623_
[junit4:junit4]   2> 7958 T868 oascc.ZkStateReader$2.process A cluster state change: WatchedEvent state:SyncConnected type:NodeChildrenChanged path:/live_nodes, has occurred - updating... (live nodes size: 3)
[junit4:junit4]   2> 7958 T883 oascc.ZkStateReader$3.process Updating live nodes... (4)
[junit4:junit4]   2> 7958 T849 oascc.ZkStateReader$3.process Updating live nodes... (4)
[junit4:junit4]   2> 7959 T883 oascc.ZkStateReader$2.process A cluster state change: WatchedEvent state:SyncConnected type:NodeChildrenChanged path:/live_nodes, has occurred - updating... (live nodes size: 4)
[junit4:junit4]   2> 7959 T855 oascc.ZkStateReader$3.process Updating live nodes... (4)
[junit4:junit4]   2> 7959 T849 oascc.ZkStateReader$2.process A cluster state change: WatchedEvent state:SyncConnected type:NodeChildrenChanged path:/live_nodes, has occurred - updating... (live nodes size: 4)
[junit4:junit4]   2> 7959 T855 oascc.ZkStateReader$2.process A cluster state change: WatchedEvent state:SyncConnected type:NodeChildrenChanged path:/live_nodes, has occurred - updating... (live nodes size: 4)
[junit4:junit4]   2> 7959 T827 oashc.HttpShardHandlerFactory.getParameter Setting socketTimeout to: 0
[junit4:junit4]   2> 7960 T868 oascc.ZkStateReader$3.process Updating live nodes... (4)
[junit4:junit4]   2> 7960 T827 oashc.HttpShardHandlerFactory.getParameter Setting urlScheme to: http://
[junit4:junit4]   2> 7961 T827 oashc.HttpShardHandlerFactory.getParameter Setting connTimeout to: 0
[junit4:junit4]   2> 7962 T827 oashc.HttpShardHandlerFactory.getParameter Setting maxConnectionsPerHost to: 20
[junit4:junit4]   2> 7962 T827 oashc.HttpShardHandlerFactory.getParameter Setting corePoolSize to: 0
[junit4:junit4]   2> 7963 T827 oashc.HttpShardHandlerFactory.getParameter Setting maximumPoolSize to: 2147483647
[junit4:junit4]   2> 7964 T827 oashc.HttpShardHandlerFactory.getParameter Setting maxThreadIdleTime to: 5
[junit4:junit4]   2> 7964 T827 oashc.HttpShardHandlerFactory.getParameter Setting sizeOfQueue to: -1
[junit4:junit4]   2> 7965 T827 oashc.HttpShardHandlerFactory.getParameter Setting fairnessPolicy to: false
[junit4:junit4]   2> 7965 T827 oascsi.HttpClientUtil.createClient Creating new http client, config:maxConnectionsPerHost=20&maxConnections=10000&socketTimeout=0&connTimeout=0&retry=false
[junit4:junit4]   2> 7988 T827 oascc.ZkStateReader.createClusterStateWatchersAndUpdate Updating cluster state from ZooKeeper... 
[junit4:junit4]   2> 7997 T901 oasc.CoreContainer.create Creating SolrCore 'collection1' using instanceDir: /usr/home/hudson/hudson-slave/workspace/Lucene-Solr-Tests-4.x-Java6/solr/build/solr-core/test/J0/./org.apache.solr.cloud.SyncSliceTest-jetty3-1355531704422/collection1
[junit4:junit4]   2> 7998 T901 oasc.ZkController.createCollectionZkNode Check for collection zkNode:collection1
[junit4:junit4]   2> 7998 T901 oasc.ZkController.createCollectionZkNode Collection zkNode exists
[junit4:junit4]   2> 7999 T901 oasc.ZkController.readConfigName Load collection config from:/collections/collection1
[junit4:junit4]   2> 8000 T901 oasc.SolrResourceLoader.<init> new SolrResourceLoader for directory: '/usr/home/hudson/hudson-slave/workspace/Lucene-Solr-Tests-4.x-Java6/solr/build/solr-core/test/J0/./org.apache.solr.cloud.SyncSliceTest-jetty3-1355531704422/collection1/'
[junit4:junit4]   2> 8002 T901 oasc.SolrResourceLoader.replaceClassLoader Adding 'file:/usr/home/hudson/hudson-slave/workspace/Lucene-Solr-Tests-4.x-Java6/solr/build/solr-core/test/J0/org.apache.solr.cloud.SyncSliceTest-jetty3-1355531704422/collection1/lib/README' to classloader
[junit4:junit4]   2> 8003 T901 oasc.SolrResourceLoader.replaceClassLoader Adding 'file:/usr/home/hudson/hudson-slave/workspace/Lucene-Solr-Tests-4.x-Java6/solr/build/solr-core/test/J0/org.apache.solr.cloud.SyncSliceTest-jetty3-1355531704422/collection1/lib/classes/' to classloader
[junit4:junit4]   2> 8063 T901 oasc.SolrConfig.<init> Using Lucene MatchVersion: LUCENE_41
[junit4:junit4]   2> 8122 T850 oascc.ZkStateReader.updateClusterState Updating cloud state from ZooKeeper... 
[junit4:junit4]   2> 8123 T850 oasc.Overseer$ClusterStateUpdater.updateState Update state numShards=1 message={
[junit4:junit4]   2> 	  "operation":"state",
[junit4:junit4]   2> 	  "numShards":"1",
[junit4:junit4]   2> 	  "shard":"shard1",
[junit4:junit4]   2> 	  "roles":null,
[junit4:junit4]   2> 	  "state":"recovering",
[junit4:junit4]   2> 	  "core":"collection1",
[junit4:junit4]   2> 	  "collection":"collection1",
[junit4:junit4]   2> 	  "node_name":"127.0.0.1:37618_",
[junit4:junit4]   2> 	  "base_url":"http://127.0.0.1:37618"}
[junit4:junit4]   2> 8145 T901 oasc.SolrConfig.<init> Loaded SolrConfig: solrconfig.xml
[junit4:junit4]   2> 8149 T900 oascc.ZkStateReader$2.process A cluster state change: WatchedEvent state:SyncConnected type:NodeDataChanged path:/clusterstate.json, has occurred - updating... (live nodes size: 4)
[junit4:junit4]   2> 8149 T849 oascc.ZkStateReader$2.process A cluster state change: WatchedEvent state:SyncConnected type:NodeDataChanged path:/clusterstate.json, has occurred - updating... (live nodes size: 4)
[junit4:junit4]   2> 8149 T855 oascc.ZkStateReader$2.process A cluster state change: WatchedEvent state:SyncConnected type:NodeDataChanged path:/clusterstate.json, has occurred - updating... (live nodes size: 4)
[junit4:junit4]   2> 8149 T868 oascc.ZkStateReader$2.process A cluster state change: WatchedEvent state:SyncConnected type:NodeDataChanged path:/clusterstate.json, has occurred - updating... (live nodes size: 4)
[junit4:junit4]   2> 8150 T901 oass.IndexSchema.readSchema Reading Solr Schema
[junit4:junit4]   2> 8149 T883 oascc.ZkStateReader$2.process A cluster state change: WatchedEvent state:SyncConnected type:NodeDataChanged path:/clusterstate.json, has occurred - updating... (live nodes size: 4)
[junit4:junit4]   2> 8157 T901 oass.IndexSchema.readSchema Schema name=test
[junit4:junit4]   2> 8896 T901 oass.OpenExchangeRatesOrgProvider.init Initialized with rates=open-exchange-rates.json, refreshInterval=1440.
[junit4:junit4]   2> 8910 T901 oass.IndexSchema.readSchema default search field in schema is text
[junit4:junit4]   2> 8917 T901 oass.IndexSchema.readSchema unique key field: id
[junit4:junit4]   2> 8937 T901 oass.FileExchangeRateProvider.reload Reloading exchange rates from file currency.xml
[junit4:junit4]   2> 8943 T901 oass.FileExchangeRateProvider.reload Reloading exchange rates from file currency.xml
[junit4:junit4]   2> 8949 T901 oass.OpenExchangeRatesOrgProvider.reload Reloading exchange rates from open-exchange-rates.json
[junit4:junit4]   2> 8950 T901 oass.OpenExchangeRatesOrgProvider.reload Reloading exchange rates from open-exchange-rates.json
[junit4:junit4]   2> 8952 T901 oasc.SolrCore.<init> [collection1] Opening new SolrCore at /usr/home/hudson/hudson-slave/workspace/Lucene-Solr-Tests-4.x-Java6/solr/build/solr-core/test/J0/./org.apache.solr.cloud.SyncSliceTest-jetty3-1355531704422/collection1/, dataDir=./org.apache.solr.cloud.SyncSliceTest-1355531696787/jetty3/
[junit4:junit4]   2> 8952 T901 oasc.JmxMonitoredMap.<init> JMX monitoring is enabled. Adding Solr mbeans to JMX Server: com.sun.jmx.mbeanserver.JmxMBeanServer@61250ff2
[junit4:junit4]   2> 8953 T901 oasc.SolrCore.initDirectoryFactory solr.NRTCachingDirectoryFactory
[junit4:junit4]   2> 8954 T901 oasc.CachingDirectoryFactory.get return new directory for /usr/home/hudson/hudson-slave/workspace/Lucene-Solr-Tests-4.x-Java6/solr/build/solr-core/test/J0/./org.apache.solr.cloud.SyncSliceTest-1355531696787/jetty3 forceNew:false
[junit4:junit4]   2> 8955 T901 oasc.CachingDirectoryFactory.close Releasing directory:/usr/home/hudson/hudson-slave/workspace/Lucene-Solr-Tests-4.x-Java6/solr/build/solr-core/test/J0/./org.apache.solr.cloud.SyncSliceTest-1355531696787/jetty3
[junit4:junit4]   2> 8956 T901 oasc.SolrCore.getNewIndexDir New index directory detected: old=null new=./org.apache.solr.cloud.SyncSliceTest-1355531696787/jetty3/index/
[junit4:junit4]   2> 8957 T901 oasc.SolrCore.initIndex WARNING [collection1] Solr index directory './org.apache.solr.cloud.SyncSliceTest-1355531696787/jetty3/index' doesn't exist. Creating new index...
[junit4:junit4]   2> 8957 T901 oasc.CachingDirectoryFactory.get return new directory for /usr/home/hudson/hudson-slave/workspace/Lucene-Solr-Tests-4.x-Java6/solr/build/solr-core/test/J0/./org.apache.solr.cloud.SyncSliceTest-1355531696787/jetty3/index forceNew:false
[junit4:junit4]   2> 8975 T901 oasc.SolrDeletionPolicy.onCommit SolrDeletionPolicy.onCommit: commits:num=1
[junit4:junit4]   2> 		commit{dir=RateLimitedDirectoryWrapper(NRTCachingDirectory(org.apache.lucene.store.NIOFSDirectory@/usr/home/hudson/hudson-slave/workspace/Lucene-Solr-Tests-4.x-Java6/solr/build/solr-core/test/J0/org.apache.solr.cloud.SyncSliceTest-1355531696787/jetty3/index lockFactory=org.apache.lucene.store.NativeFSLockFactory@64d59d55; maxCacheMB=48.0 maxMergeSizeMB=4.0)),segFN=segments_1,generation=1,filenames=[segments_1]
[junit4:junit4]   2> 8976 T901 oasc.SolrDeletionPolicy.updateCommits newest commit = 1[segments_1]
[junit4:junit4]   2> 8977 T901 oasc.CachingDirectoryFactory.close Releasing directory:/usr/home/hudson/hudson-slave/workspace/Lucene-Solr-Tests-4.x-Java6/solr/build/solr-core/test/J0/./org.apache.solr.cloud.SyncSliceTest-1355531696787/jetty3/index
[junit4:junit4]   2> 8977 T901 oasc.SolrCore.initWriters created xml: solr.XMLResponseWriter
[junit4:junit4]   2> 8979 T901 oasup.UpdateRequestProcessorChain.init inserting DistributedUpdateProcessorFactory into updateRequestProcessorChain "dedupe"
[junit4:junit4]   2> 8980 T901 oasup.UpdateRequestProcessorChain.init inserting DistributedUpdateProcessorFactory into updateRequestProcessorChain "dedupe-allfields"
[junit4:junit4]   2> 8980 T901 oasup.UpdateRequestProcessorChain.init inserting DistributedUpdateProcessorFactory into updateRequestProcessorChain "stored_sig"
[junit4:junit4]   2> 8980 T901 oasup.UpdateRequestProcessorChain.init inserting DistributedUpdateProcessorFactory into updateRequestProcessorChain "uniq-fields"
[junit4:junit4]   2> 8981 T901 oasup.UpdateRequestProcessorChain.init inserting DistributedUpdateProcessorFactory into updateRequestProcessorChain "distrib-dup-test-chain-implicit"
[junit4:junit4]   2> 8981 T901 oasc.RequestHandlers.initHandlersFromConfig adding lazy requestHandler: solr.ReplicationHandler
[junit4:junit4]   2> 8982 T901 oasc.RequestHandlers.initHandlersFromConfig created /replication: solr.ReplicationHandler
[junit4:junit4]   2> 8983 T901 oasc.RequestHandlers.initHandlersFromConfig created standard: solr.StandardRequestHandler
[junit4:junit4]   2> 8984 T901 oasc.RequestHandlers.initHandlersFromConfig created /get: solr.RealTimeGetHandler
[junit4:junit4]   2> 8985 T901 oasc.RequestHandlers.initHandlersFromConfig created dismax: solr.SearchHandler
[junit4:junit4]   2> 8986 T901 oasc.RequestHandlers.initHandlersFromConfig created mock: org.apache.solr.core.MockQuerySenderListenerReqHandler
[junit4:junit4]   2> 8986 T901 oasc.RequestHandlers.initHandlersFromConfig created /admin/: org.apache.solr.handler.admin.AdminHandlers
[junit4:junit4]   2> 8987 T901 oasc.RequestHandlers.initHandlersFromConfig created defaults: solr.StandardRequestHandler
[junit4:junit4]   2> 8987 T901 oasc.RequestHandlers.initHandlersFromConfig adding lazy requestHandler: solr.StandardRequestHandler
[junit4:junit4]   2> 8988 T901 oasc.RequestHandlers.initHandlersFromConfig created lazy: solr.StandardRequestHandler
[junit4:junit4]   2> 8989 T901 oasc.RequestHandlers.initHandlersFromConfig created /update: solr.UpdateRequestHandler
[junit4:junit4]   2> 8990 T901 oasc.RequestHandlers.initHandlersFromConfig created /terms: org.apache.solr.handler.component.SearchHandler
[junit4:junit4]   2> 8991 T901 oasc.RequestHandlers.initHandlersFromConfig created spellCheckCompRH: org.apache.solr.handler.component.SearchHandler
[junit4:junit4]   2> 8992 T901 oasc.RequestHandlers.initHandlersFromConfig created spellCheckCompRH_Direct: org.apache.solr.handler.component.SearchHandler
[junit4:junit4]   2> 8993 T901 oasc.RequestHandlers.initHandlersFromConfig created spellCheckWithWordbreak: org.apache.solr.handler.component.SearchHandler
[junit4:junit4]   2> 8994 T901 oasc.RequestHandlers.initHandlersFromConfig created spellCheckWithWordbreak_Direct: org.apache.solr.handler.component.SearchHandler
[junit4:junit4]   2> 8995 T901 oasc.RequestHandlers.initHandlersFromConfig created spellCheckCompRH1: org.apache.solr.handler.component.SearchHandler
[junit4:junit4]   2> 8995 T901 oasc.RequestHandlers.initHandlersFromConfig created mltrh: org.apache.solr.handler.component.SearchHandler
[junit4:junit4]   2> 8996 T901 oasc.RequestHandlers.initHandlersFromConfig created tvrh: org.apache.solr.handler.component.SearchHandler
[junit4:junit4]   2> 8997 T901 oasc.RequestHandlers.initHandlersFromConfig created /mlt: solr.MoreLikeThisHandler
[junit4:junit4]   2> 8998 T901 oasc.RequestHandlers.initHandlersFromConfig created /debug/dump: solr.DumpRequestHandler
[junit4:junit4]   2> 9006 T901 oashl.XMLLoader.init xsltCacheLifetimeSeconds=60
[junit4:junit4]   2> 9013 T901 oasc.SolrCore.initDeprecatedSupport WARNING solrconfig.xml uses deprecated <admin/gettableFiles>, Please update your config to use the ShowFileRequestHandler.
[junit4:junit4]   2> 9015 T901 oasc.SolrCore.initDeprecatedSupport WARNING adding ShowFileRequestHandler with hidden files: [SCHEMA.XML, OLD_SYNONYMS.TXT, STOPWORDS.TXT, PROTWORDS.TXT, OPEN-EXCHANGE-RATES.JSON, SYNONYMS.TXT, CURRENCY.XML, MAPPING-ISOLATIN1ACCENT.TXT]
[junit4:junit4]   2> 9018 T901 oasc.CachingDirectoryFactory.close Releasing directory:/usr/home/hudson/hudson-slave/workspace/Lucene-Solr-Tests-4.x-Java6/solr/build/solr-core/test/J0/./org.apache.solr.cloud.SyncSliceTest-1355531696787/jetty3
[junit4:junit4]   2> 9020 T901 oass.SolrIndexSearcher.<init> Opening Searcher@20b64f78 main
[junit4:junit4]   2> 9022 T901 oasu.CommitTracker.<init> Hard AutoCommit: disabled
[junit4:junit4]   2> 9022 T901 oasu.CommitTracker.<init> Soft AutoCommit: disabled
[junit4:junit4]   2> 9023 T901 oashc.SpellCheckComponent.inform Initializing spell checkers
[junit4:junit4]   2> 9045 T901 oass.DirectSolrSpellChecker.init init: {name=direct,classname=DirectSolrSpellChecker,field=lowerfilt,minQueryLength=3}
[junit4:junit4]   2> 9119 T902 oasc.SolrCore.registerSearcher [collection1] Registered new searcher Searcher@20b64f78 main{StandardDirectoryReader(segments_1:1)}
[junit4:junit4]   2> 9124 T901 oasc.ZkController.publish publishing core=collection1 state=down
[junit4:junit4]   2> 9124 T901 oasc.ZkController.publish numShards not found on descriptor - reading it from system property
[junit4:junit4]   2> 9163 T850 oascc.ZkStateReader.updateClusterState Updating cloud state from ZooKeeper... 
[junit4:junit4]   2> 9164 T850 oasc.Overseer$ClusterStateUpdater.updateState Update state numShards=1 message={
[junit4:junit4]   2> 	  "operation":"state",
[junit4:junit4]   2> 	  "numShards":"1",
[junit4:junit4]   2> 	  "shard":null,
[junit4:junit4]   2> 	  "roles":null,
[junit4:junit4]   2> 	  "state":"down",
[junit4:junit4]   2> 	  "core":"collection1",
[junit4:junit4]   2> 	  "collection":"collection1",
[junit4:junit4]   2> 	  "node_name":"127.0.0.1:37623_",
[junit4:junit4]   2> 	  "base_url":"http://127.0.0.1:37623"}
[junit4:junit4]   2> 9164 T850 oasc.Overseer$ClusterStateUpdater.updateState Collection already exists with numShards=1
[junit4:junit4]   2> 9164 T850 oasc.Overseer$ClusterStateUpdater.updateState Assigning new node to shard shard=shard1
[junit4:junit4]   2> 9175 T900 oascc.ZkStateReader$2.process A cluster state change: WatchedEvent state:SyncConnected type:NodeDataChanged path:/clusterstate.json, has occurred - updating... (live nodes size: 4)
[junit4:junit4]   2> 9175 T883 oascc.ZkStateReader$2.process A cluster state change: WatchedEvent state:SyncConnected type:NodeDataChanged path:/clusterstate.json, has occurred - updating... (live nodes size: 4)
[junit4:junit4]   2> 9175 T855 oascc.ZkStateReader$2.process A cluster state change: WatchedEvent state:SyncConnected type:NodeDataChanged path:/clusterstate.json, has occurred - updating... (live nodes size: 4)
[junit4:junit4]   2> 9175 T849 oascc.ZkStateReader$2.process A cluster state change: WatchedEvent state:SyncConnected type:NodeDataChanged path:/clusterstate.json, has occurred - updating... (live nodes size: 4)
[junit4:junit4]   2> 9175 T868 oascc.ZkStateReader$2.process A cluster state change: WatchedEvent state:SyncConnected type:NodeDataChanged path:/clusterstate.json, has occurred - updating... (live nodes size: 4)
[junit4:junit4]   2> 9627 T901 oasc.CoreContainer.registerCore registering core: collection1
[junit4:junit4]   2> 9627 T901 oasc.ZkController.register Register shard - core:collection1 address:http://127.0.0.1:37623 shardId:shard1
[junit4:junit4]   2> 9635 T901 oasc.ZkController.register We are http://127.0.0.1:37623/collection1/ and leader is http://127.0.0.1:37615/collection1/
[junit4:junit4]   2> 9635 T901 oasc.ZkController.register No LogReplay needed for core=collection1 baseURL=http://127.0.0.1:37623
[junit4:junit4]   2> 9635 T901 oasc.ZkController.checkRecovery Core needs to recover:collection1
[junit4:junit4]   2> 9636 T901 oasu.DefaultSolrCoreState.doRecovery Running recovery - first canceling any ongoing recovery
[junit4:junit4]   2> ASYNC  NEW_CORE C83 name=collection1 org.apache.solr.core.SolrCore@772f444b url=http://127.0.0.1:37623/collection1 node=127.0.0.1:37623_
[junit4:junit4]   2> 9636 T903 C83 P37623 oasc.RecoveryStrategy.run Starting recovery process.  core=collection1 recoveringAfterStartup=true
[junit4:junit4]   2> 9637 T903 C83 P37623 oasc.RecoveryStrategy.doRecovery ###### startupVersions=[]
[junit4:junit4]   2> 9637 T901 oascc.ZkStateReader.updateClusterState Updating cloud state from ZooKeeper... 
[junit4:junit4]   2> 9637 T903 C83 P37623 oasc.ZkController.publish publishing core=collection1 state=recovering
[junit4:junit4]   2> 9638 T903 C83 P37623 oasc.ZkController.publish numShards not found on descriptor - reading it from system property
[junit4:junit4]   2> 9638 T827 oass.SolrDispatchFilter.init user.dir=/usr/home/hudson/hudson-slave/workspace/Lucene-Solr-Tests-4.x-Java6/solr/build/solr-core/test/J0
[junit4:junit4]   2> 9639 T827 oass.SolrDispatchFilter.init SolrDispatchFilter.init() done
[junit4:junit4]   2> 9640 T827 oascsi.HttpClientUtil.createClient Creating new http client, config:maxConnections=128&maxConnectionsPerHost=32&followRedirects=false
[junit4:junit4]   2> 9656 T903 C83 P37623 oasc.RecoveryStrategy.doRecovery Attempting to PeerSync from http://127.0.0.1:37615/collection1/ core=collection1 - recoveringAfterStartup=true
[junit4:junit4]   2> 9656 T903 C83 P37623 oasu.PeerSync.sync PeerSync: core=collection1 url=http://127.0.0.1:37623 START replicas=[http://127.0.0.1:37615/collection1/] nUpdates=100
[junit4:junit4]   2> 9657 T903 C83 P37623 oasu.PeerSync.sync WARNING no frame of reference to tell of we've missed updates
[junit4:junit4]   2> 9657 T903 C83 P37623 oasc.RecoveryStrategy.doRecovery PeerSync Recovery was not successful - trying replication. core=collection1
[junit4:junit4]   2> 9658 T903 C83 P37623 oasc.RecoveryStrategy.doRecovery Starting Replication Recovery. core=collection1
[junit4:junit4]   2> 9658 T903 C83 P37623 oascsi.HttpClientUtil.createClient Creating new http client, config:maxConnections=128&maxConnectionsPerHost=32&followRedirects=false
[junit4:junit4]   2> 9660 T858 C82 P37615 REQ /get {distrib=false&qt=/get&wt=javabin&version=2&getVersions=100} status=0 QTime=1 
[junit4:junit4]   2> 9681 T850 oascc.ZkStateReader.updateClusterState Updating cloud state from ZooKeeper... 
[junit4:junit4]   2> 9682 T850 oasc.Overseer$ClusterStateUpdater.updateState Update state numShards=1 message={
[junit4:junit4]   2> 	  "operation":"state",
[junit4:junit4]   2> 	  "numShards":"1",
[junit4:junit4]   2> 	  "shard":"shard1",
[junit4:junit4]   2> 	  "roles":null,
[junit4:junit4]   2> 	  "state":"recovering",
[junit4:junit4]   2> 	  "core":"collection1",
[junit4:junit4]   2> 	  "collection":"collection1",
[junit4:junit4]   2> 	  "node_name":"127.0.0.1:37623_",
[junit4:junit4]   2> 	  "base_url":"http://127.0.0.1:37623"}
[junit4:junit4]   2> 9786 T883 oascc.ZkStateReader$2.process A cluster state change: WatchedEvent state:SyncConnected type:NodeDataChanged path:/clusterstate.json, has occurred - updating... (live nodes size: 4)
[junit4:junit4]   2> 9786 T849 oascc.ZkStateReader$2.process A cluster state change: WatchedEvent state:SyncConnected type:NodeDataChanged path:/clusterstate.json, has occurred - updating... (live nodes size: 4)
[junit4:junit4]   2> 9786 T855 oascc.ZkStateReader$2.process A cluster state change: WatchedEvent state:SyncConnected type:NodeDataChanged path:/clusterstate.json, has occurred - updating... (live nodes size: 4)
[junit4:junit4]   2> 9786 T900 oascc.ZkStateReader$2.process A cluster state change: WatchedEvent state:SyncConnected type:NodeDataChanged path:/clusterstate.json, has occurred - updating... (live nodes size: 4)
[junit4:junit4]   2> 9786 T868 oascc.ZkStateReader$2.process A cluster state change: WatchedEvent state:SyncConnected type:NodeDataChanged path:/clusterstate.json, has occurred - updating... (live nodes size: 4)
[junit4:junit4]   2> 9854 T827 oejs.Server.doStart jetty-8.1.8.v20121106
[junit4:junit4]   2> 9858 T827 oejs.AbstractConnector.doStart Started SocketConnector@127.0.0.1:37627
[junit4:junit4]   2> 9859 T827 oasc.SolrResourceLoader.locateSolrHome JNDI not configured for solr (NoInitialContextEx)
[junit4:junit4]   2> 9859 T827 oasc.SolrResourceLoader.locateSolrHome using system property solr.solr.home: /usr/home/hudson/hudson-slave/workspace/Lucene-Solr-Tests-4.x-Java6/solr/build/solr-core/test/J0/./org.apache.solr.cloud.SyncSliceTest-jetty4-1355531706442
[junit4:junit4]   2> 9860 T827 oasc.SolrResourceLoader.<init> new SolrResourceLoader for deduced Solr Home: '/usr/home/hudson/hudson-slave/workspace/Lucene-Solr-Tests-4.x-Java6/solr/build/solr-core/test/J0/./org.apache.solr.cloud.SyncSliceTest-jetty4-1355531706442/'
[junit4:junit4]   2> 9894 T827 oass.SolrDispatchFilter.init SolrDispatchFilter.init()
[junit4:junit4]   2> 9895 T827 oasc.SolrResourceLoader.locateSolrHome JNDI not configured for solr (NoInitialContextEx)
[junit4:junit4]   2> 9895 T827 oasc.SolrResourceLoader.locateSolrHome using system property solr.solr.home: /usr/home/hudson/hudson-slave/workspace/Lucene-Solr-Tests-4.x-Java6/solr/build/solr-core/test/J0/./org.apache.solr.cloud.SyncSliceTest-jetty4-1355531706442
[junit4:junit4]   2> 9896 T827 oasc.CoreContainer$Initializer.initialize looking for solr.xml: /usr/home/hudson/hudson-slave/workspace/Lucene-Solr-Tests-4.x-Java6/solr/build/solr-core/test/J0/./org.apache.solr.cloud.SyncSliceTest-jetty4-1355531706442/solr.xml
[junit4:junit4]   2> 9897 T827 oasc.CoreContainer.<init> New CoreContainer 319053469
[junit4:junit4]   2> 9897 T827 oasc.CoreContainer.load Loading CoreContainer using Solr Home: '/usr/home/hudson/hudson-slave/workspace/Lucene-Solr-Tests-4.x-Java6/solr/build/solr-core/test/J0/./org.apache.solr.cloud.SyncSliceTest-jetty4-1355531706442/'
[junit4:junit4]   2> 9898 T827 oasc.SolrResourceLoader.<init> new SolrResourceLoader for directory: '/usr/home/hudson/hudson-slave/workspace/Lucene-Solr-Tests-4.x-Java6/solr/build/solr-core/test/J0/./org.apache.solr.cloud.SyncSliceTest-jetty4-1355531706442/'
[junit4:junit4]   2> 9924 T827 oasc.CoreContainer.load Registering Log Listener
[junit4:junit4]   2> 9940 T827 oasc.CoreContainer.initZooKeeper Zookeeper client=127.0.0.1:37608/solr
[junit4:junit4]   2> 9941 T827 oasc.ZkController.checkChrootPath zkHost includes chroot
[junit4:junit4]   2> 9941 T827 oaz.ZooKeeper.<init> Initiating client connection, connectString=127.0.0.1:37608 sessionTimeout=60000 watcher=org.apache.solr.common.cloud.ConnectionManager@4e4b03b0
[junit4:junit4]   2> 9943 T827 oascc.ConnectionManager.waitForConnected Waiting for client to connect to ZooKeeper
[junit4:junit4]   2> 9943 T914 oaz.ClientCnxn$SendThread.logStartConnect Opening socket connection to server localhost/127.0.0.1:37608. Will not attempt to authenticate using SASL (access denied (javax.security.auth.AuthPermission getLoginConfiguration))
[junit4:junit4]   2> 9944 T914 oaz.ClientCnxn$SendThread.primeConnection Socket connection established to localhost/127.0.0.1:37608, initiating session
[junit4:junit4]   2> 9944 T829 oazs.NIOServerCnxnFactory.run Accepted socket connection from /140.211.11.196:37628
[junit4:junit4]   2> 9945 T829 oazs.ZooKeeperServer.processConnectRequest Client attempting to establish new session at /140.211.11.196:37628
[junit4:junit4]   2> 9956 T831 oazs.ZooKeeperServer.finishSessionInit Established session 0x13b9bfc3a9b000b with negotiated timeout 20000 for client /140.211.11.196:37628
[junit4:junit4]   2> 9956 T914 oaz.ClientCnxn$SendThread.onConnected Session establishment complete on server localhost/127.0.0.1:37608, sessionid = 0x13b9bfc3a9b000b, negotiated timeout = 20000
[junit4:junit4]   2> 9956 T915 oascc.ConnectionManager.process Watcher org.apache.solr.common.cloud.ConnectionManager@4e4b03b0 name:ZooKeeperConnection Watcher:127.0.0.1:37608 got event WatchedEvent state:SyncConnected type:None path:null path:null type:None
[junit4:junit4]   2> 9956 T827 oascc.ConnectionManager.waitForConnected Client is connected to ZooKeeper
[junit4:junit4]   2> 9958 T832 oazs.PrepRequestProcessor.pRequest2Txn Processed session termination for sessionid: 0x13b9bfc3a9b000b
[junit4:junit4]   2> 9968 T915 oaz.ClientCnxn$EventThread.run EventThread shut down
[junit4:junit4]   2> 9968 T829 oazs.NIOServerCnxn.closeSock Closed socket connection for client /140.211.11.196:37628 which had sessionid 0x13b9bfc3a9b000b
[junit4:junit4]   2> 9968 T827 oaz.ZooKeeper.close Session: 0x13b9bfc3a9b000b closed
[junit4:junit4]   2> 9969 T827 oaz.ZooKeeper.<init> Initiating client connection, connectString=127.0.0.1:37608/solr sessionTimeout=8000 watcher=org.apache.solr.common.cloud.ConnectionManager@1b55bf47
[junit4:junit4]   2> 9971 T916 oaz.ClientCnxn$SendThread.logStartConnect Opening socket connection to server localhost/127.0.0.1:37608. Will not attempt to authenticate using SASL (access denied (javax.security.auth.AuthPermission getLoginConfiguration))
[junit4:junit4]   2> 9970 T827 oascc.ConnectionManager.waitForConnected Waiting for client to connect to ZooKeeper
[junit4:junit4]   2> 9971 T916 oaz.ClientCnxn$SendThread.primeConnection Socket connection established to localhost/127.0.0.1:37608, initiating session
[junit4:junit4]   2> 9971 T829 oazs.NIOServerCnxnFactory.run Accepted socket connection from /140.211.11.196:37629
[junit4:junit4]   2> 9972 T829 oazs.ZooKeeperServer.processConnectRequest Client attempting to establish new session at /140.211.11.196:37629
[junit4:junit4]   2> 9978 T831 oazs.ZooKeeperServer.finishSessionInit Established session 0x13b9bfc3a9b000c with negotiated timeout 8000 for client /140.211.11.196:37629
[junit4:junit4]   2> 9978 T916 oaz.ClientCnxn$SendThread.onConnected Session establishment complete on server localhost/127.0.0.1:37608, sessionid = 0x13b9bfc3a9b000c, negotiated timeout = 8000
[junit4:junit4]   2> 9978 T917 oascc.ConnectionManager.process Watcher org.apache.solr.common.cloud.ConnectionManager@1b55bf47 name:ZooKeeperConnection Watcher:127.0.0.1:37608/solr got event WatchedEvent state:SyncConnected type:None path:null path:null type:None
[junit4:junit4]   2> 9979 T827 oascc.ConnectionManager.waitForConnected Client is connected to ZooKeeper
[junit4:junit4]   2> 9980 T832 oazs.PrepRequestProcessor.pRequest Got user-level KeeperException when processing sessionid:0x13b9bfc3a9b000c type:create cxid:0x1 zxid:0x97 txntype:-1 reqpath:n/a Error Path:/solr/overseer Error:KeeperErrorCode = NodeExists for /solr/overseer
[junit4:junit4]   2> 9985 T832 oazs.PrepRequestProcessor.pRequest Got user-level KeeperException when processing sessionid:0x13b9bfc3a9b000c type:create cxid:0x2 zxid:0x98 txntype:-1 reqpath:n/a Error Path:/solr/overseer Error:KeeperErrorCode = NodeExists for /solr/overseer
[junit4:junit4]   2> 9997 T827 oasc.ZkController.createEphemeralLiveNode Register node as live in ZooKeeper:/live_nodes/127.0.0.1:37627_
[junit4:junit4]   2> 9997 T832 oazs.PrepRequestProcessor.pRequest Got user-level KeeperException when processing sessionid:0x13b9bfc3a9b000c type:delete cxid:0x4 zxid:0x99 txntype:-1 reqpath:n/a Error Path:/solr/live_nodes/127.0.0.1:37627_ Error:KeeperErrorCode = NoNode for /solr/live_nodes/127.0.0.1:37627_
[junit4:junit4]   2> 10004 T827 oascc.SolrZkClient.makePath makePath: /live_nodes/127.0.0.1:37627_
[junit4:junit4]   2> 10012 T900 oascc.ZkStateReader$2.process A cluster state change: WatchedEvent state:SyncConnected type:NodeChildrenChanged path:/live_nodes, has occurred - updating... (live nodes size: 4)
[junit4:junit4]   2> 10012 T868 oascc.ZkStateReader$2.process A cluster state change: WatchedEvent state:SyncConnected type:NodeChildrenChanged path:/live_nodes, has occurred - updating... (live nodes size: 4)
[junit4:junit4]   2> 10013 T883 oascc.ZkStateReader$3.process Updating live nodes... (5)
[junit4:junit4]   2> 10013 T855 oascc.ZkStateReader$3.process Updating live nodes... (5)
[junit4:junit4]   2> 10013 T849 oascc.ZkStateReader$3.process Updating live nodes... (5)
[junit4:junit4]   2> 10013 T883 oascc.ZkStateReader$2.process A cluster state change: WatchedEvent state:SyncConnected type:NodeChildrenChanged path:/live_nodes, has occurred - updating... (live nodes size: 5)
[junit4:junit4]   2> 10013 T849 oascc.ZkStateReader$2.process A cluster state change: WatchedEvent state:SyncConnected type:NodeChildrenChanged path:/live_nodes, has occurred - updating... (live nodes size: 5)
[junit4:junit4]   2> 10013 T855 oascc.ZkStateReader$2.process A cluster state change: WatchedEvent state:SyncConnected type:NodeChildrenChanged path:/live_nodes, has occurred - updating... (live nodes size: 5)
[junit4:junit4]   2> 10014 T827 oashc.HttpShardHandlerFactory.getParameter Setting socketTimeout to: 0
[junit4:junit4]   2> 10014 T900 oascc.ZkStateReader$3.process Updating live nodes... (5)
[junit4:junit4]   2> 10015 T868 oascc.ZkStateReader$3.process Updating live nodes... (5)
[junit4:junit4]   2> 10015 T827 oashc.HttpShardHandlerFactory.getParameter Setting urlScheme to: http://
[junit4:junit4]   2> 10015 T827 oashc.HttpShardHandlerFactory.getParameter Setting connTimeout to: 0
[junit4:junit4]   2> 10016 T827 oashc.HttpShardHandlerFactory.getParameter Setting maxConnectionsPerHost to: 20
[junit4:junit4]   2> 10016 T827 oashc.HttpShardHandlerFactory.getParameter Setting corePoolSize to: 0
[junit4:junit4]   2> 10017 T827 oashc.HttpShardHandlerFactory.getParameter Setting maximumPoolSize to: 2147483647
[junit4:junit4]   2> 10018 T827 oashc.HttpShardHandlerFactory.getParameter Setting maxThreadIdleTime to: 5
[junit4:junit4]   2> 10018 T827 oashc.HttpShardHandlerFactory.getParameter Setting sizeOfQueue to: -1
[junit4:junit4]   2> 10019 T827 oashc.HttpShardHandlerFactory.getParameter Setting fairnessPolicy to: false
[junit4:junit4]   2> 10020 T827 oascsi.HttpClientUtil.createClient Creating new http client, config:maxConnectionsPerHost=20&maxConnections=10000&socketTimeout=0&connTimeout=0&retry=false
[junit4:junit4]   2> 10046 T827 oascc.ZkStateReader.createClusterStateWatchersAndUpdate Updating cluster state from ZooKeeper... 
[junit4:junit4]   2> 10054 T918 oasc.CoreContainer.create Creating SolrCore 'collection1' using instanceDir: /usr/home/hudson/hudson-slave/workspace/Lucene-Solr-Tests-4.x-Java6/solr/build/solr-core/test/J0/./org.apache.solr.cloud.SyncSliceTest-jetty4-1355531706442/collection1
[junit4:junit4]   2> 10054 T918 oasc.ZkController.createCollectionZkNode Check for collection zkNode:collection1
[junit4:junit4]   2> 10055 T918 oasc.ZkController.createCollectionZkNode Collection zkNode exists
[junit4:junit4]   2> 10055 T918 oasc.ZkController.readConfigName Load collection config from:/collections/collection1
[junit4:junit4]   2> 10057 T918 oasc.SolrResourceLoader.<init> new SolrResourceLoader for directory: '/usr/home/hudson/hudson-slave/workspace/Lucene-Solr-Tests-4.x-Java6/solr/build/solr-core/test/J0/./org.apache.solr.cloud.SyncSliceTest-jetty4-1355531706442/collection1/'
[junit4:junit4]   2> 10058 T918 oasc.SolrResourceLoader.replaceClassLoader Adding 'file:/usr/home/hudson/hudson-slave/workspace/Lucene-Solr-Tests-4.x-Java6/solr/build/solr-core/test/J0/org.apache.solr.cloud.SyncSliceTest-jetty4-1355531706442/collection1/lib/classes/' to classloader
[junit4:junit4]   2> 10059 T918 oasc.SolrResourceLoader.replaceClassLoader Adding 'file:/usr/home/hudson/hudson-slave/workspace/Lucene-Solr-Tests-4.x-Java6/solr/build/solr-core/test/J0/org.apache.solr.cloud.SyncSliceTest-jetty4-1355531706442/collection1/lib/README' to classloader
[junit4:junit4]   2> 10113 T918 oasc.SolrConfig.<init> Using Lucene MatchVersion: LUCENE_41
[junit4:junit4]   2> 10188 T918 oasc.SolrConfig.<init> Loaded SolrConfig: solrconfig.xml
[junit4:junit4]   2> 10289 T918 oass.IndexSchema.readSchema Reading Solr Schema
[junit4:junit4]   2> 10296 T918 oass.IndexSchema.readSchema Schema name=test
[junit4:junit4]   2>  C81_STATE=coll:collection1 core:collection1 props:{shard=shard1, roles=null, state=recovering, core=collection1, collection=collection1, node_name=127.0.0.1:37618_, base_url=http://127.0.0.1:37618}
[junit4:junit4]   2> 10684 T886 C81 P37618 oasc.RecoveryStrategy.doRecovery Begin buffering updates. core=collection1
[junit4:junit4]   2> 10684 T886 C81 P37618 oasu.UpdateLog.bufferUpdates Starting to buffer updates. FSUpdateLog{state=ACTIVE, tlog=null}
[junit4:junit4]   2> 10684 T886 C81 P37618 oasc.RecoveryStrategy.replicate Attempting to replicate from http://127.0.0.1:37615/collection1/. core=collection1
[junit4:junit4]   2> 10685 T886 C81 P37618 oascsi.HttpClientUtil.createClient Creating new http client, config:maxConnections=128&maxConnectionsPerHost=32&followRedirects=false
[junit4:junit4]   2> 10704 T861 C82 P37615 oascsi.HttpClientUtil.createClient Creating new http client, config:maxConnections=500&maxConnectionsPerHost=16
[junit4:junit4]   2> 10720 T861 C82 P37615 oasu.DirectUpdateHandler2.commit start commit{flags=0,_version_=0,optimize=false,openSearcher=false,waitSearcher=true,expungeDeletes=false,softCommit=false}
[junit4:junit4]   2> 10721 T861 C82 P37615 oasc.CachingDirectoryFactory.close Releasing directory:/usr/home/hudson/hudson-slave/workspace/Lucene-Solr-Tests-4.x-Java6/solr/build/solr-core/test/J0/./org.apache.solr.cloud.SyncSliceTest-1355531696787/jetty1
[junit4:junit4]   2> 10727 T861 C82 P37615 oasc.SolrDeletionPolicy.onInit SolrDeletionPolicy.onInit: commits:num=1
[junit4:junit4]   2> 		commit{dir=RateLimitedDirectoryWrapper(NRTCachingDirectory(org.apache.lucene.store.NIOFSDirectory@/usr/home/hudson/hudson-slave/workspace/Lucene-Solr-Tests-4.x-Java6/solr/build/solr-core/test/J0/org.apache.solr.cloud.SyncSliceTest-1355531696787/jetty1/index lockFactory=org.apache.lucene.store.NativeFSLockFactory@5dbb7207; maxCacheMB=48.0 maxMergeSizeMB=4.0)),segFN=segments_1,generation=1,filenames=[segments_1]
[junit4:junit4]   2> 10728 T861 C82 P37615 oasc.SolrDeletionPolicy.updateCommits newest commit = 1[segments_1]
[junit4:junit4]   2> 10742 T861 C82 P37615 oasc.SolrDeletionPolicy.onCommit SolrDeletionPolicy.onCommit: commits:num=2
[junit4:junit4]   2> 		commit{dir=RateLimitedDirectoryWrapper(NRTCachingDirectory(org.apache.lucene.store.NIOFSDirectory@/usr/home/hudson/hudson-slave/workspace/Lucene-Solr-Tests-4.x-Java6/solr/build/solr-core/test/J0/org.apache.solr.cloud.SyncSliceTest-1355531696787/jetty1/index lockFactory=org.apache.lucene.store.NativeFSLockFactory@5dbb7207; maxCacheMB=48.0 maxMergeSizeMB=4.0)),segFN=segments_1,generation=1,filenames=[segments_1]
[junit4:junit4]   2> 		commit{dir=RateLimitedDirectoryWrapper(NRTCachingDirectory(org.apache.lucene.store.NIOFSDirectory@/usr/home/hudson/hudson-slave/workspace/Lucene-Solr-Tests-4.x-Java6/solr/build/solr-core/test/J0/org.apache.solr.cloud.SyncSliceTest-1355531696787/jetty1/index lockFactory=org.apache.lucene.store.NativeFSLockFactory@5dbb7207; maxCacheMB=48.0 maxMergeSizeMB=4.0)),segFN=segments_2,generation=2,filenames=[segments_2]
[junit4:junit4]   2> 10743 T861 C82 P37615 oasc.SolrDeletionPolicy.updateCommits newest commit = 2[segments_2]
[junit4:junit4]   2> 10744 T861 C82 P37615 oasc.CachingDirectoryFactory.close Releasing directory:/usr/home/hudson/hudson-slave/workspace/Lucene-Solr-Tests-4.x-Java6/solr/build/solr-core/test/J0/./org.apache.solr.cloud.SyncSliceTest-1355531696787/jetty1
[junit4:junit4]   2> 10745 T861 C82 P37615 oass.SolrIndexSearcher.<init> Opening Searcher@58671f4 realtime
[junit4:junit4]   2> 10745 T861 C82 P37615 oasu.DirectUpdateHandler2.commit end_commit_flush
[junit4:junit4]   2> 10746 T861 C82 P37615 /update {waitSearcher=true&openSearcher=false&commit=true&commit_end_point=true&wt=javabin&softCommit=false&version=2} {commit=} 0 48
[junit4:junit4]   2> 10748 T886 C81 P37618 oash.ReplicationHandler.inform Commits will be reserved for  10000
[junit4:junit4]   2> 10749 T886 C81 P37618 oascsi.HttpClientUtil.createClient Creating new http client, config:connTimeout=5000&socketTimeout=20000&allowCompression=false&maxConnections=10000&maxConnectionsPerHost=10000
[junit4:junit4]   2> 10778 T886 C81 P37618 oash.SnapPuller.<init>  No value set for 'pollInterval'. Timer Task not started.
[junit4:junit4]   2> 10782 T862 C82 P37615 oash.ReplicationHandler.inform Commits will be reserved for  10000
[junit4:junit4]   2> 10782 T862 C82 P37615 REQ /replication {command=indexversion&wt=javabin&qt=/replication&version=2} status=0 QTime=2 
[junit4:junit4]   2> 10784 T886 C81 P37618 oash.SnapPuller.fetchLatestIndex Master's generation: 2
[junit4:junit4]   2> 10784 T886 C81 P37618 oash.SnapPuller.fetchLatestIndex Slave's generation: 1
[junit4:junit4]   2> 10784 T886 C81 P37618 oash.SnapPuller.fetchLatestIndex Starting replication process
[junit4:junit4]   2> 10786 T862 C82 P37615 oasc.CachingDirectoryFactory.close Releasing directory:/usr/home/hudson/hudson-slave/workspace/Lucene-Solr-Tests-4.x-Java6/solr/build/solr-core/test/J0/./org.apache.solr.cloud.SyncSliceTest-1355531696787/jetty1
[junit4:junit4]   2> 10788 T862 C82 P37615 oasc.CachingDirectoryFactory.close Releasing directory:/usr/home/hudson/hudson-slave/workspace/Lucene-Solr-Tests-4.x-Java6/solr/build/solr-core/test/J0/./org.apache.solr.cloud.SyncSliceTest-1355531696787/jetty1/index
[junit4:junit4]   2> 10788 T862 C82 P37615 REQ /replication {command=filelist&generation=2&wt=javabin&qt=/replication&version=2} status=0 QTime=2 
[junit4:junit4]   2> 10789 T886 C81 P37618 oash.SnapPuller.fetchLatestIndex Number of files in latest index in master: 1
[junit4:junit4]   2> 10791 T886 C81 P37618 oasc.CachingDirectoryFactory.get return new directory for /usr/home/hudson/hudson-slave/workspace/Lucene-Solr-Tests-4.x-Java6/solr/build/solr-core/test/J0/./org.apache.solr.cloud.SyncSliceTest-1355531696787/jetty2/index.20121215033507570 forceNew:false
[junit4:junit4]   2> 10792 T886 C81 P37618 oasc.CachingDirectoryFactory.close Releasing directory:/usr/home/hudson/hudson-slave/workspace/Lucene-Solr-Tests-4.x-Java6/solr/build/solr-core/test/J0/./org.apache.solr.cloud.SyncSliceTest-1355531696787/jetty2
[junit4:junit4]   2> 10793 T886 C81 P37618 oash.SnapPuller.fetchLatestIndex Starting download to RateLimitedDirectoryWrapper(NRTCachingDirectory(org.apache.lucene.store.NIOFSDirectory@/usr/home/hudson/hudson-slave/workspace/Lucene-Solr-Tests-4.x-Java6/solr/build/solr-core/test/J0/org.apache.solr.cloud.SyncSliceTest-1355531696787/jetty2/index.20121215033507570 lockFactory=org.apache.lucene.store.NativeFSLockFactory@3b83c2ea; maxCacheMB=48.0 maxMergeSizeMB=4.0)) fullCopy=true
[junit4:junit4]   2> 10811 T862 C82 P37615 REQ /replication {file=segments_2&command=filecontent&checksum=true&generation=2&qt=/replication&wt=filestream} status=0 QTime=7 
[junit4:junit4]   2> 10820 T886 C81 P37618 oasc.CachingDirectoryFactory.close Releasing directory:/usr/home/hudson/hudson-slave/workspace/Lucene-Solr-Tests-4.x-Java6/solr/build/solr-core/test/J0/./org.apache.solr.cloud.SyncSliceTest-1355531696787/jetty2/index
[junit4:junit4]   2> 10821 T886 C81 P37618 oash.SnapPuller.fetchLatestIndex Total time taken for download : 0 secs
[junit4:junit4]   2> 10821 T886 C81 P37618 oash.SnapPuller.modifyIndexProps New index installed. Updating index properties... index=index.20121215033507570
[junit4:junit4]   2> 10823 T886 C81 P37618 oasc.CachingDirectoryFactory.close Releasing directory:/usr/home/hudson/hudson-slave/workspace/Lucene-Solr-Tests-4.x-Java6/solr/build/solr-core/test/J0/./org.apache.solr.cloud.SyncSliceTest-1355531696787/jetty2
[junit4:junit4]   2> 10824 T886 C81 P37618 oasc.CachingDirectoryFactory.close Releasing directory:/usr/home/hudson/hudson-slave/workspace/Lucene-Solr-Tests-4.x-Java6/solr/build/solr-core/test/J0/./org.apache.solr.cloud.SyncSliceTest-1355531696787/jetty2
[junit4:junit4]   2> 10825 T886 C81 P37618 oasc.SolrCore.getNewIndexDir New index directory detected: old=./org.apache.solr.cloud.SyncSliceTest-1355531696787/jetty2/index/ new=./org.apache.solr.cloud.SyncSliceTest-1355531696787/jetty2/index.20121215033507570
[junit4:junit4]   2> 10830 T886 C81 P37618 oasc.SolrDeletionPolicy.onInit SolrDeletionPolicy.onInit: commits:num=1
[junit4:junit4]   2> 		commit{dir=RateLimitedDirectoryWrapper(NRTCachingDirectory(org.apache.lucene.store.NIOFSDirectory@/usr/home/hudson/hudson-slave/workspace/Lucene-Solr-Tests-4.x-Java6/solr/build/solr-core/test/J0/org.apache.solr.cloud.SyncSliceTest-1355531696787/jetty2/index.20121215033507570 lockFactory=org.apache.lucene.store.NativeFSLockFactory@3b83c2ea; maxCacheMB=48.0 maxMergeSizeMB=4.0)),segFN=segments_2,generation=2,filenames=[segments_2]
[junit4:junit4]   2> 10831 T886 C81 P37618 oasc.SolrDeletionPolicy.updateCommits newest commit = 2[segments_2]
[junit4:junit4]   2> 10833 T886 C81 P37618 oasc.CachingDirectoryFactory.close Releasing directory:/usr/home/hudson/hudson-slave/workspace/Lucene-Solr-Tests-4.x-Java6/solr/build/solr-core/test/J0/./org.apache.solr.cloud.SyncSliceTest-1355531696787/jetty2
[junit4:junit4]   2> 10840 T886 C81 P37618 oasu.DefaultSolrCoreState.newIndexWriter Creating new IndexWriter...
[junit4:junit4]   2> 10840 T886 C81 P37618 oasu.DefaultSolrCoreState.newIndexWriter Waiting until IndexWriter is unused... core=collection1
[junit4:junit4]   2> 10840 T886 C81 P37618 oasu.DefaultSolrCoreState.newIndexWriter Rollback old IndexWriter... core=collection1
[junit4:junit4]   2> 10841 T886 C81 P37618 oasc.CachingDirectoryFactory.close Releasing directory:/usr/home/hudson/hudson-slave/workspace/Lucene-Solr-Tests-4.x-Java6/solr/build/solr-core/test/J0/./org.apache.solr.cloud.SyncSliceTest-1355531696787/jetty2/index.20121215033507570
[junit4:junit4]   2> 10842 T886 C81 P37618 oasc.CachingDirectoryFactory.close Releasing directory:/usr/home/hudson/hudson-slave/workspace/Lucene-Solr-Tests-4.x-Java6/solr/build/solr-core/test/J0/./org.apache.solr.cloud.SyncSliceTest-1355531696787/jetty2
[junit4:junit4]   2> 10847 T886 C81 P37618 oasc.SolrDeletionPolicy.onInit SolrDeletionPolicy.onInit: commits:num=1
[junit4:junit4]   2> 		commit{dir=RateLimitedDirectoryWrapper(NRTCachingDirectory(org.apache.lucene.store.NIOFSDirectory@/usr/home/hudson/hudson-slave/workspace/Lucene-Solr-Tests-4.x-Java6/solr/build/solr-core/test/J0/org.apache.solr.cloud.SyncSliceTest-1355531696787/jetty2/index.20121215033507570 lockFactory=org.apache.lucene.store.NativeFSLockFactory@3b83c2ea; maxCacheMB=48.0 maxMergeSizeMB=4.0)),segFN=segments_2,generation=2,filenames=[segments_2]
[junit4:junit4]   2> 10847 T886 C81 P37618 oasc.SolrDeletionPolicy.updateCommits newest commit = 2[segments_2]
[junit4:junit4]   2> 10847 T886 C81 P37618 oasu.DefaultSolrCoreState.newIndexWriter New IndexWriter is ready to be used.
[junit4:junit4]   2> 10848 T886 C81 P37618 oasc.CachingDirectoryFactory.close Releasing directory:/usr/home/hudson/hudson-slave/workspace/Lucene-Solr-Tests-4.x-Java6/solr/build/solr-core/test/J0/./org.apache.solr.cloud.SyncSliceTest-1355531696787/jetty2
[junit4:junit4]   2> 10848 T886 C81 P37618 oass.SolrIndexSearcher.<init> Opening Searcher@b043e5 main
[junit4:junit4]   2> 10850 T885 oasc.SolrCore.registerSearcher [collection1] Registered new searcher Searcher@b043e5 main{StandardDirectoryReader(segments_2:1:nrt)}
[junit4:junit4]   2> 10851 T885 oasc.CachingDirectoryFactory.close Releasing directory:/usr/home/hudson/hudson-slave/workspace/Lucene-Solr-Tests-4.x-Java6/solr/build/solr-core/test/J0/./org.apache.solr.cloud.SyncSliceTest-1355531696787/jetty2/index
[junit4:junit4]   2> 10851 T886 C81 P37618 oasu.DirectUpdateHandler2.commit start commit{flags=0,_version_=0,optimize=false,openSearcher=false,waitSearcher=false,expungeDeletes=false,softCommit=false}
[junit4:junit4]   2> 10855 T886 C81 P37618 oasc.SolrDeletionPolicy.onCommit SolrDeletionPolicy.onCommit: commits:num=2
[junit4:junit4]   2> 		commit{dir=RateLimitedDirectoryWrapper(NRTCachingDirectory(org.apache.lucene.store.NIOFSDirectory@/usr/home/hudson/hudson-slave/workspace/Lucene-Solr-Tests-4.x-Java6/solr/build/solr-core/test/J0/org.apache.solr.cloud.SyncSliceTest-1355531696787/jetty2/index.20121215033507570 lockFactory=org.apache.lucene.store.NativeFSLockFactory@3b83c2ea; maxCacheMB=48.0 maxMergeSizeMB=4.0)),segFN=segments_2,generation=2,filenames=[segments_2]
[junit4:junit4]   2> 		commit{dir=RateLimitedDirectoryWrapper(NRTCachingDirectory(org.apache.lucene.store.NIOFSDirectory@/usr/home/hudson/hudson-slave/workspace/Lucene-Solr-Tests-4.x-Java6/solr/build/solr-core/test/J0/org.apache.solr.cloud.SyncSliceTest-1355531696787/jetty2/index.20121215033507570 lockFactory=org.apache.lucene.store.NativeFSLockFactory@3b83c2ea; maxCacheMB=48.0 maxMergeSizeMB=4.0)),segFN=segments_3,generation=3,filenames=[segments_3]
[junit4:junit4]   2> 10855 T886 C81 P37618 oasc.SolrDeletionPolicy.updateCommits newest commit = 3[segments_3]
[junit4:junit4]   2> 10857 T886 C81 P37618 oasc.CachingDirectoryFactory.close Releasing directory:/usr/home/hudson/hudson-slave/workspace/Lucene-Solr-Tests-4.x-Java6/solr/build/solr-core/test/J0/./org.apache.solr.cloud.SyncSliceTest-1355531696787/jetty2
[junit4:junit4]   2> 10857 T886 C81 P37618 oasu.DirectUpdateHandler2.commit end_commit_flush
[junit4:junit4]   2> 10858 T886 C81 P37618 oasc.CachingDirectoryFactory.close Releasing directory:/usr/home/hudson/hudson-slave/workspace/Lucene-Solr-Tests-4.x-Java6/solr/build/solr-core/test/J0/./org.apache.solr.cloud.SyncSliceTest-1355531696787/jetty2/index.20121215033507570
[junit4:junit4]   2> 10858 T886 C81 P37618 oasc.CachingDirectoryFactory.close Releasing directory:/usr/home/hudson/hudson-slave/workspace/Lucene-Solr-Tests-4.x-Java6/solr/build/solr-core/test/J0/./org.apache.solr.cloud.SyncSliceTest-1355531696787/jetty2/index
[junit4:junit4]   2> 10858 T886 C81 P37618 oasc.RecoveryStrategy.replay No replay needed. core=collection1
[junit4:junit4]   2> 10858 T886 C81 P37618 oasc.RecoveryStrategy.doRecovery Replication Recovery was successful - registering as Active. core=collection1
[junit4:junit4]   2> 10858 T886 C81 P37618 oasc.ZkController.publish publishing core=collection1 state=active
[junit4:junit4]   2> 10859 T886 C81 P37618 oasc.ZkController.publish numShards not found on descriptor - reading it from system property
[junit4:junit4]   2> 10861 T886 C81 P37618 oasc.RecoveryStrategy.doRecovery Finished recovery process. core=collection1
[junit4:junit4]   2> 11034 T918 oass.OpenExchangeRatesOrgProvider.init Initialized with rates=open-exchange-rates.json, refreshInterval=1440.
[junit4:junit4]   2> 11046 T918 oass.IndexSchema.readSchema default search field in schema is text
[junit4:junit4]   2> 11050 T918 oass.IndexSchema.readSchema unique key field: id
[junit4:junit4]   2> 11068 T918 oass.FileExchangeRateProvider.reload Reloading exchange rates from file currency.xml
[junit4:junit4]   2> 11079 T918 oass.FileExchangeRateProvider.reload Reloading exchange rates from file currency.xml
[junit4:junit4]   2> 11084 T918 oass.OpenExchangeRatesOrgProvider.reload Reloading exchange rates from open-exchange-rates.json
[junit4:junit4]   2> 11086 T918 oass.OpenExchangeRatesOrgProvider.reload Reloading exchange rates from open-exchange-rates.json
[junit4:junit4]   2> 11087 T918 oasc.SolrCore.<init> [collection1] Opening new SolrCore at /usr/home/hudson/hudson-slave/workspace/Lucene-Solr-Tests-4.x-Java6/solr/build/solr-core/test/J0/./org.apache.solr.cloud.SyncSliceTest-jetty4-1355531706442/collection1/, dataDir=./org.apache.solr.cloud.SyncSliceTest-1355531696787/jetty4/
[junit4:junit4]   2> 11087 T918 oasc.JmxMonitoredMap.<init> JMX monitoring is enabled. Adding Solr mbeans to JMX Server: com.sun.jmx.mbeanserver.JmxMBeanServer@61250ff2
[junit4:junit4]   2> 11088 T918 oasc.SolrCore.initDirectoryFactory solr.NRTCachingDirectoryFactory
[junit4:junit4]   2> 11089 T918 oasc.CachingDirectoryFactory.get return new directory for /usr/home/hudson/hudson-slave/workspace/Lucene-Solr-Tests-4.x-Java6/solr/build/solr-core/test/J0/./org.apache.solr.cloud.SyncSliceTest-1355531696787/jetty4 forceNew:false
[junit4:junit4]   2> 11090 T918 oasc.CachingDirectoryFactory.close Releasing directory:/usr/home/hudson/hudson-slave/workspace/Lucene-Solr-Tests-4.x-Java6/solr/build/solr-core/test/J0/./org.apache.solr.cloud.SyncSliceTest-1355531696787/jetty4
[junit4:junit4]   2> 11090 T918 oasc.SolrCore.getNewIndexDir New index directory detected: old=null new=./org.apache.solr.cloud.SyncSliceTest-1355531696787/jetty4/index/
[junit4:junit4]   2> 11091 T918 oasc.SolrCore.initIndex WARNING [collection1] Solr index directory './org.apache.solr.cloud.SyncSliceTest-1355531696787/jetty4/index' doesn't exist. Creating new index...
[junit4:junit4]   2> 11092 T918 oasc.CachingDirectoryFactory.get return new directory for /usr/home/hudson/hudson-slave/workspace/Lucene-Solr-Tests-4.x-Java6/solr/build/solr-core/test/J0/./org.apache.solr.cloud.SyncSliceTest-1355531696787/jetty4/index forceNew:false
[junit4:junit4]   2> 11102 T918 oasc.SolrDeletionPolicy.onCommit SolrDeletionPolicy.onCommit: commits:num=1
[junit4:junit4]   2> 		commit{dir=RateLimitedDirectoryWrapper(NRTCachingDirectory(org.apache.lucene.store.NIOFSDirectory@/usr/home/hudson/hudson-slave/workspace/Lucene-Solr-Tests-4.x-Java6/solr/build/solr-core/test/J0/org.apache.solr.cloud.SyncSliceTest-1355531696787/jetty4/index lockFactory=org.apache.lucene.store.NativeFSLockFactory@3fbaee2c; maxCacheMB=48.0 maxMergeSizeMB=4.0)),segFN=segments_1,generation=1,filenames=[segments_1]
[junit4:junit4]   2> 11103 T918 oasc.SolrDeletionPolicy.updateCommits newest commit = 1[segments_1]
[junit4:junit4]   2> 11103 T918 oasc.CachingDirectoryFactory.close Releasing directory:/usr/home/hudson/hudson-slave/workspace/Lucene-Solr-Tests-4.x-Java6/solr/build/solr-core/test/J0/./org.apache.solr.cloud.SyncSliceTest-1355531696787/jetty4/index
[junit4:junit4]   2> 11104 T918 oasc.SolrCore.initWriters created xml: solr.XMLResponseWriter
[junit4:junit4]   2> 11106 T918 oasup.UpdateRequestProcessorChain.init inserting DistributedUpdateProcessorFactory into updateRequestProcessorChain "dedupe"
[junit4:junit4]   2> 11106 T918 oasup.UpdateRequestProcessorChain.init inserting DistributedUpdateProcessorFactory into updateRequestProcessorChain "dedupe-allfields"
[junit4:junit4]   2> 11106 T918 oasup.UpdateRequestProcessorChain.init inserting DistributedUpdateProcessorFactory into updateRequestProcessorChain "stored_sig"
[junit4:junit4]   2> 11107 T918 oasup.UpdateRequestProcessorChain.init inserting DistributedUpdateProcessorFactory into updateRequestProcessorChain "uniq-fields"
[junit4:junit4]   2> 11107 T918 oasup.UpdateRequestProcessorChain.init inserting DistributedUpdateProcessorFactory into updateRequestProcessorChain "distrib-dup-test-chain-implicit"
[junit4:junit4]   2> 11108 T918 oasc.RequestHandlers.initHandlersFromConfig adding lazy requestHandler: solr.ReplicationHandler
[junit4:junit4]   2> 11108 T918 oasc.RequestHandlers.initHandlersFromConfig created /replication: solr.ReplicationHandler
[junit4:junit4]   2> 11109 T918 oasc.RequestHandlers.initHandlersFromConfig created standard: solr.StandardRequestHandler
[junit4:junit4]   2> 11110 T918 oasc.RequestHandlers.initHandlersFromConfig created /get: solr.RealTimeGetHandler
[junit4:junit4]   2> 11111 T918 oasc.RequestHandlers.initHandlersFromConfig created dismax: solr.SearchHandler
[junit4:junit4]   2> 11112 T918 oasc.RequestHandlers.initHandlersFromConfig created mock: org.apache.solr.core.MockQuerySenderListenerReqHandler
[junit4:junit4]   2> 11113 T918 oasc.RequestHandlers.initHandlersFromConfig created /admin/: org.apache.solr.handler.admin.AdminHandlers
[junit4:junit4]   2> 11114 T918 oasc.RequestHandlers.initHandlersFromConfig created defaults: solr.StandardRequestHandler
[junit4:junit4]   2> 11114 T918 oasc.RequestHandlers.initHandlersFromConfig adding lazy requestHandler: solr.StandardRequestHandler
[junit4:junit4]   2> 11114 T918 oasc.RequestHandlers.initHandlersFromConfig created lazy: solr.StandardRequestHandler
[junit4:junit4]   2> 11115 T918 oasc.RequestHandlers.initHandlersFromConfig created /update: solr.UpdateRequestHandler
[junit4:junit4]   2> 11116 T918 oasc.RequestHandlers.initHandlersFromConfig created /terms: org.apache.solr.handler.component.SearchHandler
[junit4:junit4]   2> 11117 T918 oasc.RequestHandlers.initHandlersFromConfig created spellCheckCompRH: org.apache.solr.handler.component.SearchHandler
[junit4:junit4]   2> 11118 T918 oasc.RequestHandlers.initHandlersFromConfig created spellCheckCompRH_Direct: org.apache.solr.handler.component.SearchHandler
[junit4:junit4]   2> 11119 T918 oasc.RequestHandlers.initHandlersFromConfig created spellCheckWithWordbreak: org.apache.solr.handler.component.SearchHandler
[junit4:junit4]   2> 11120 T918 oasc.RequestHandlers.initHandlersFromConfig created spellCheckWithWordbreak_Direct: org.apache.solr.handler.component.SearchHandler
[junit4:junit4]   2> 11121 T918 oasc.RequestHandlers.initHandlersFromConfig created spellCheckCompRH1: org.apache.solr.handler.component.SearchHandler
[junit4:junit4]   2> 11122 T918 oasc.RequestHandlers.initHandlersFromConfig created mltrh: org.apache.solr.handler.component.SearchHandler
[junit4:junit4]   2> 11123 T918 oasc.RequestHandlers.initHandlersFromConfig created tvrh: org.apache.solr.handler.component.SearchHandler
[junit4:junit4]   2> 11123 T918 oasc.RequestHandlers.initHandlersFromConfig created /mlt: solr.MoreLikeThisHandler
[junit4:junit4]   2> 11124 T918 oasc.RequestHandlers.initHandlersFromConfig created /debug/dump: solr.DumpRequestHandler
[junit4:junit4]   2> 11132 T918 oashl.XMLLoader.init xsltCacheLifetimeSeconds=60
[junit4:junit4]   2> 11137 T918 oasc.SolrCore.initDeprecatedSupport WARNING solrconfig.xml uses deprecated <admin/gettableFiles>, Please update your config to use the ShowFileRequestHandler.
[junit4:junit4]   2> 11139 T918 oasc.SolrCore.initDeprecatedSupport WARNING adding ShowFileRequestHandler with hidden files: [SCHEMA.XML, OLD_SYNONYMS.TXT, STOPWORDS.TXT, PROTWORDS.TXT, OPEN-EXCHANGE-RATES.JSON, SYNONYMS.TXT, CURRENCY.XML, MAPPING-ISOLATIN1ACCENT.TXT]
[junit4:junit4]   2> 11141 T918 oasc.CachingDirectoryFactory.close Releasing directory:/usr/home/hudson/hudson-slave/workspace/Lucene-Solr-Tests-4.x-Java6/solr/build/solr-core/test/J0/./org.apache.solr.cloud.SyncSliceTest-1355531696787/jetty4
[junit4:junit4]   2> 11143 T918 oass.SolrIndexSearcher.<init> Opening Searcher@30479e85 main
[junit4:junit4]   2> 11144 T918 oasu.CommitTracker.<init> Hard AutoCommit: disabled
[junit4:junit4]   2> 11144 T918 oasu.CommitTracker.<init> Soft AutoCommit: disabled
[junit4:junit4]   2> 11145 T918 oashc.SpellCheckComponent.inform Initializing spell checkers
[junit4:junit4]   2> 11153 T918 oass.DirectSolrSpellChecker.init init: {name=direct,classname=DirectSolrSpellChecker,field=lowerfilt,minQueryLength=3}
[junit4:junit4]   2> 11235 T920 oasc.SolrCore.registerSearcher [collection1] Registered new searcher Searcher@30479e85 main{StandardDirectoryReader(segments_1:1)}
[junit4:junit4]   2> 11240 T918 oasc.ZkController.publish publishing core=collection1 state=down
[junit4:junit4]   2> 11240 T918 oasc.ZkController.publish numShards not found on descriptor - reading it from system property
[junit4:junit4]   2> 11344 T850 oascc.ZkStateReader.updateClusterState Updating cloud state from ZooKeeper... 
[junit4:junit4]   2> 11345 T850 oasc.Overseer$ClusterStateUpdater.updateState Update state numShards=1 message={
[junit4:junit4]   2> 	  "operation":"state",
[junit4:junit4]   2> 	  "numShards":"1",
[junit4:junit4]   2> 	  "shard":"shard1",
[junit4:junit4]   2> 	  "roles":null,
[junit4:junit4]   2> 	  "state":"active",
[junit4:junit4]   2> 	  "core":"collection1",
[junit4:junit4]   2> 	  "collection":"collection1",
[junit4:junit4]   2> 	  "node_name":"127.0.0.1:37618_",
[junit4:junit4]   2> 	  "base_url":"http://127.0.0.1:37618"}
[junit4:junit4]   2> 11415 T850 oasc.Overseer$ClusterStateUpdater.updateState Update state numShards=1 message={
[junit4:junit4]   2> 	  "operation":"state",
[junit4:junit4]   2> 	  "numShards":"1",
[junit4:junit4]   2> 	  "shard":null,
[junit4:junit4]   2> 	  "roles":null,
[junit4:junit4]   2> 	  "state":"down",
[junit4:junit4]   2> 	  "core":"collection1",
[junit4:junit4]   2> 	  "collection":"collection1",
[junit4:junit4]   2> 	  "node_name":"127.0.0.1:37627_",
[junit4:junit4]   2> 	  "base_url":"http://127.0.0.1:37627"}
[junit4:junit4]   2> 11415 T850 oasc.Overseer$ClusterStateUpdater.updateState Collection already exists with numShards=1
[junit4:junit4]   2> 11416 T850 oasc.Overseer$ClusterStateUpdater.updateState Assigning new node to shard shard=shard1
[junit4:junit4]   2> 11429 T868 oascc.ZkStateReader$2.process A cluster state change: WatchedEvent state:SyncConnected type:NodeDataChanged path:/clusterstate.json, has occurred - updating... (live nodes size: 5)
[junit4:junit4]   2> 11429 T855 oascc.ZkStateReader$2.process A cluster state change: WatchedEvent state:SyncConnected type:NodeDataChanged path:/clusterstate.json, has occurred - updating... (live nodes size: 5)
[junit4:junit4]   2> 11429 T917 oascc.ZkStateReader$2.process A cluster state change: WatchedEvent state:SyncConnected type:NodeDataChanged path:/clusterstate.json, has occurred - updating... (live nodes size: 5)
[junit4:junit4]   2> 11429 T900 oascc.ZkStateReader$2.process A cluster state change: WatchedEvent state:SyncConnected type:NodeDataChanged path:/clusterstate.json, has occurred - updating... (live nodes size: 5)
[junit4:junit4]   2> 11429 T849 oascc.ZkStateReader$2.process A cluster state change: WatchedEvent state:SyncConnected type:NodeDataChanged path:/clusterstate.json, has occurred - updating... (live nodes size: 5)
[junit4:junit4]   2> 11429 T883 oascc.ZkStateReader$2.process A cluster state change: WatchedEvent state:SyncConnected type:NodeDataChanged path:/clusterstate.json, has occurred - updating... (live nodes size: 5)
[junit4:junit4]   2> 11759 T918 oasc.CoreContainer.registerCore registering core: collection1
[junit4:junit4]   2> 11759 T918 oasc.ZkController.register Register shard - core:collection1 address:http://127.0.0.1:37627 shardId:shard1
[junit4:junit4]   2> 11770 T918 oasc.ZkController.register We are http://127.0.0.1:37627/collection1/ and leader is http://127.0.0.1:37615/collection1/
[junit4:junit4]   2> 11770 T918 oasc.ZkController.register No LogReplay needed for core=collection1 baseURL=http://127.0.0.1:37627
[junit4:junit4]   2> 11771 T918 oasc.ZkController.checkRecovery Core needs to recover:collection1
[junit4:junit4]   2> 11771 T918 oasu.DefaultSolrCoreState.doRecovery Running recovery - first canceling any ongoing recovery
[junit4:junit4]   2> ASYNC  NEW_CORE C84 name=collection1 org.apache.solr.core.SolrCore@5d3765a5 url=http://127.0.0.1:37627/collection1 node=127.0.0.1:37627_
[junit4:junit4]   2> 11771 T921 C84 P37627 oasc.RecoveryStrategy.run Starting recovery process.  core=collection1 recoveringAfterStartup=true
[junit4:junit4]   2> 11772 T921 C84 P37627 oasc.RecoveryStrategy.doRecovery ###### startupVersions=[]
[junit4:junit4]   2> 11772 T918 oascc.ZkStateReader.updateClusterState Updating cloud state from ZooKeeper... 
[junit4:junit4]   2> 11772 T921 C84 P37627 oasc.ZkController.publish publishing core=collection1 state=recovering
[junit4:junit4]   2> 11772 T921 C84 P37627 oasc.ZkController.publish numShards not found on descriptor - reading it from system property
[junit4:junit4]   2> 11773 T827 oass.SolrDispatchFilter.init user.dir=/usr/home/hudson/hudson-slave/workspace/Lucene-Solr-Tests-4.x-Java6/solr/build/solr-core/test/J0
[junit4:junit4]   2> 11774 T827 oass.SolrDispatchFilter.init SolrDispatchFilter.init() done
[junit4:junit4]   2> 11775 T827 oascsi.HttpClientUtil.createClient Creating new http client, config:maxConnections=128&maxConnectionsPerHost=32&followRedirects=false
[junit4:junit4]   2> 11778 T921 C84 P37627 oasc.RecoveryStrategy.doRecovery Attempting to PeerSync from http://127.0.0.1:37615/collection1/ core=collection1 - recoveringAfterStartup=true
[junit4:junit4]   2> 11779 T921 C84 P37627 oasu.PeerSync.sync PeerSync: core=collection1 url=http://127.0.0.1:37627 START replicas=[http://127.0.0.1:37615/collection1/] nUpdates=100
[junit4:junit4]   2> 11779 T921 C84 P37627 oasu.PeerSync.sync WARNING no frame of reference to tell of we've missed updates
[junit4:junit4]   2> 11779 T921 C84 P37627 oasc.RecoveryStrategy.doRecovery PeerSync Recovery was not successful - trying replication. core=collection1
[junit4:junit4]   2> 11780 T921 C84 P37627 oasc.RecoveryStrategy.doRecovery Starting Replication Recovery. core=collection1
[junit4:junit4]   2> 11780 T921 C84 P37627 oascsi.HttpClientUtil.createClient Creating new http client, config:maxConnections=128&maxConnectionsPerHost=32&followRedirects=false
[junit4:junit4]   2> 11781 T858 C82 P37615 REQ /get {distrib=false&qt=/get&wt=javabin&version=2&getVersions=100} status=0 QTime=0 
[junit4:junit4]   2> 11791 T827 oascc.ZkStateReader.updateClusterState Updating cloud state from ZooKeeper... 
[junit4:junit4]   2> 11793 T827 oasc.AbstractFullDistribZkTestBase.waitForThingsToLevelOut Wait for recoveries to finish - wait 15 for each attempt
[junit4:junit4]   2> 11794 T827 oasc.AbstractDistribZkTestBase.waitForRecoveriesToFinish Wait for recoveries to finish - collection: collection1 failOnTimeout:true timeout (sec):15
[junit4:junit4]   2> 11795 T827 oascc.ZkStateReader.updateClusterState Updating cloud state from ZooKeeper... 
[junit4:junit4]   2> 11943 T850 oascc.ZkStateReader.updateClusterState Updating cloud state from ZooKeeper... 
[junit4:junit4]   2> 11944 T850 oasc.Overseer$ClusterStateUpdater.updateState Update state numShards=1 message={
[junit4:junit4]   2> 	  "operation":"state",
[junit4:junit4]   2> 	  "numShards":"1",
[junit4:junit4]   2> 	  "shard":"shard1",
[junit4:junit4]   2> 	  "roles":null,
[junit4:junit4]   2> 	  "state":"recovering",
[junit4:junit4]   2> 	  "core":"collection1",
[junit4:junit4]   2> 	  "collection":"collection1",
[junit4:junit4]   2> 	  "node_name":"127.0.0.1:37627_",
[junit4:junit4]   2> 	  "base_url":"http://127.0.0.1:37627"}
[junit4:junit4]   2> 11989 T855 oascc.ZkStateReader$2.process A cluster state change: WatchedEvent state:SyncConnected type:NodeDataChanged path:/clusterstate.json, has occurred - updating... (live nodes size: 5)
[junit4:junit4]   2> 11989 T883 oascc.ZkStateReader$2.process A cluster state change: WatchedEvent state:SyncConnected type:NodeDataChanged path:/clusterstate.json, has occurred - updating... (live nodes size: 5)
[junit4:junit4]   2> 11989 T917 oascc.ZkStateReader$2.process A cluster state change: WatchedEvent state:SyncConnected type:NodeDataChanged path:/clusterstate.json, has occurred - updating... (live nodes size: 5)
[junit4:junit4]   2> 11989 T849 oascc.ZkStateReader$2.process A cluster state change: WatchedEvent state:SyncConnected type:NodeDataChanged path:/clusterstate.json, has occurred - updating... (live nodes size: 5)
[junit4:junit4]   2> 11989 T868 oascc.ZkStateReader$2.process A cluster state change: WatchedEvent state:SyncConnected type:NodeDataChanged path:/clusterstate.json, has occurred - updating... (live nodes size: 5)
[junit4:junit4]   2> 11989 T900 oascc.ZkStateReader$2.process A cluster state change: WatchedEvent state:SyncConnected type:NodeDataChanged path:/clusterstate.json, has occurred - updating... (live nodes size: 5)
[junit4:junit4]   2>  C83_STATE=coll:collection1 core:collection1 props:{shard=shard1, roles=null, state=recovering, core=collection1, collection=collection1, node_name=127.0.0.1:37623_, base_url=http://127.0.0.1:37623}
[junit4:junit4]   2> 12681 T903 C83 P37623 oasc.RecoveryStrategy.doRecovery Begin buffering updates. core=collection1
[junit4:junit4]   2> 12681 T903 C83 P37623 oasu.UpdateLog.bufferUpdates Starting to buffer updates. FSUpdateLog{state=ACTIVE, tlog=null}
[junit4:junit4]   2> 12682 T903 C83 P37623 oasc.RecoveryStrategy.replicate Attempting to replicate from http://127.0.0.1:37615/collection1/. core=collection1
[junit4:junit4]   2> 12682 T903 C83 P37623 oascsi.HttpClientUtil.createClient Creating new http client, config:maxConnections=128&maxConnectionsPerHost=32&followRedirects=false
[junit4:junit4]   2> 12696 T864 C82 P37615 oasu.DirectUpdateHandler2.commit start commit{flags=0,_version_=0,optimize=false,openSearcher=false,waitSearcher=true,expungeDeletes=false,softCommit=false}
[junit4:junit4]   2> 12707 T864 C82 P37615 oasc.SolrDeletionPolicy.onCommit SolrDeletionPolicy.onCommit: commits:num=2
[junit4:junit4]   2> 		commit{dir=RateLimitedDirectoryWrapper(NRTCachingDirectory(org.apache.lucene.store.NIOFSDirectory@/usr/home/hudson/hudson-slave/workspace/Lucene-Solr-Tests-4.x-Java6/solr/build/solr-core/test/J0/org.apache.solr.cloud.SyncSliceTest-1355531696787/jetty1/index lockFactory=org.apache.lucene.store.NativeFSLockFactory@5dbb7207; maxCacheMB=48.0 maxMergeSizeMB=4.0)),segFN=segments_2,generation=2,filenames=[segments_2]
[junit4:junit4]   2> 		commit{dir=RateLimitedDirectoryWrapper(NRTCachingDirectory(org.apache.lucene.store.NIOFSDirectory@/usr/home/hudson/hudson-slave/workspace/Lucene-Solr-Tests-4.x-Java6/solr/build/solr-core/test/J0/org.apache.solr.cloud.SyncSliceTest-1355531696787/jetty1/index lockFactory=org.apache.lucene.store.NativeFSLockFactory@5dbb7207; maxCacheMB=48.0 maxMergeSizeMB=4.0)),segFN=segments_3,generation=3,filenames=[segments_3]
[junit4:junit4]   2> 12708 T864 C82 P37615 oasc.SolrDeletionPolicy.updateCommits newest commit = 3[segments_3]
[junit4:junit4]   2> 12709 T864 C82 P37615 oasc.CachingDirectoryFactory.close Releasing directory:/usr/home/hudson/hudson-slave/workspace/Lucene-Solr-Tests-4.x-Java6/solr/build/solr-core/test/J0/./org.apache.solr.cloud.SyncSliceTest-1355531696787/jetty1
[junit4:junit4]   2> 12709 T864 C82 P37615 oasu.DirectUpdateHandler2.commit end_commit_flush
[junit4:junit4]   2> 12710 T864 C82 P37615 /update {waitSearcher=true&openSearcher=false&commit=true&commit_end_point=true&wt=javabin&softCommit=false&version=2} {commit=} 0 15
[junit4:junit4]   2> 12712 T903 C83 P37623 oash.ReplicationHandler.inform Commits will be reserved for  10000
[junit4:junit4]   2> 12712 T903 C83 P37623 oash.SnapPuller.<init>  No value set for 'pollInterval'. Timer Task not started.
[junit4:junit4]   2> 12716 T862 C82 P37615 REQ /replication {command=indexversion&wt=javabin&qt=/replication&version=2} status=0 QTime=1 
[junit4:junit4]   2> 12716 T903 C83 P37623 oash.SnapPuller.fetchLatestIndex Master's generation: 3
[junit4:junit4]   2> 12717 T903 C83 P37623 oash.SnapPuller.fetchLatestIndex Slave's generation: 1
[junit4:junit4]   2> 12717 T903 C83 P37623 oash.SnapPuller.fetchLatestIndex Starting replication process
[junit4:junit4]   2> 12719 T862 C82 P37615 oasc.CachingDirectoryFactory.close Releasing directory:/usr/home/hudson/hudson-slave/workspace/Lucene-Solr-Tests-4.x-Java6/solr/build/solr-core/test/J0/./org.apache.solr.cloud.SyncSliceTest-1355531696787/jetty1
[junit4:junit4]   2> 12720 T862 C82 P37615 oasc.CachingDirectoryFactory.close Releasing directory:/usr/home/hudson/hudson-slave/workspace/Lucene-Solr-Tests-4.x-Java6/solr/build/solr-core/test/J0/./org.apache.solr.cloud.SyncSliceTest-1355531696787/jetty1/index
[junit4:junit4]   2> 12720 T862 C82 P37615 REQ /replication {command=filelist&generation=3&wt=javabin&qt=/replication&version=2} status=0 QTime=1 
[junit4:junit4]   2> 12721 T903 C83 P37623 oash.SnapPuller.fetchLatestIndex Number of files in latest index in master: 1
[junit4:junit4]   2> 12722 T903 C83 P37623 oasc.CachingDirectoryFactory.get return new directory for /usr/home/hudson/hudson-slave/workspace/Lucene-Solr-Tests-4.x-Java6/solr/build/solr-core/test/J0/./org.apache.solr.cloud.SyncSliceTest-1355531696787/jetty3/index.20121215033509503 forceNew:false
[junit4:junit4]   2> 12723 T903 C83 P37623 oasc.CachingDirectoryFactory.close Releasing directory:/usr/home/hudson/hudson-slave/workspace/Lucene-Solr-Tests-4.x-Java6/solr/build/solr-core/test/J0/./org.apache.solr.cloud.SyncSliceTest-1355531696787/jetty3
[junit4:junit4]   2> 12724 T903 C83 P37623 oash.SnapPuller.fetchLatestIndex Starting download to RateLimitedDirectoryWrapper(NRTCachingDirectory(org.apache.lucene.store.NIOFSDirectory@/usr/home/hudson/hudson-slave/workspace/Lucene-Solr-Tests-4.x-Java6/solr/build/solr-core/test/J0/org.apache.solr.cloud.SyncSliceTest-1355531696787/jetty3/index.20121215033509503 lockFactory=org.apache.lucene.store.NativeFSLockFactory@342f3856; maxCacheMB=48.0 maxMergeSizeMB=4.0)) fullCopy=true
[junit4:junit4]   2> 12727 T862 C82 P37615 REQ /replication {file=segments_3&command=filecontent&checksum=true&generation=3&qt=/replication&wt=filestream} status=0 QTime=0 
[junit4:junit4]   2> 12729 T903 C83 P37623 oasc.CachingDirectoryFactory.close Releasing directory:/usr/home/hudson/hudson-slave/workspace/Lucene-Solr-Tests-4.x-Java6/solr/build/solr-core/test/J0/./org.apache.solr.cloud.SyncSliceTest-1355531696787/jetty3/index
[junit4:junit4]   2> 12729 T903 C83 P37623 oash.SnapPuller.fetchLatestIndex Total time taken for download : 0 secs
[junit4:junit4]   2> 12730 T903 C83 P37623 oash.SnapPuller.modifyIndexProps New index installed. Updating index properties... index=index.20121215033509503
[junit4:junit4]   2> 12731 T903 C83 P37623 oasc.CachingDirectoryFactory.close Releasing directory:/usr/home/hudson/hudson-slave/workspace/Lucene-Solr-Tests-4.x-Java6/solr/build/solr-core/test/J0/./org.apache.solr.cloud.SyncSliceTest-1355531696787/jetty3
[junit4:junit4]   2> 12732 T903 C83 P37623 oasc.CachingDirectoryFactory.close Releasing directory:/usr/home/hudson/hudson-slave/workspace/Lucene-Solr-Tests-4.x-Java6/solr/build/solr-core/test/J0/./org.apache.solr.cloud.SyncSliceTest-1355531696787/jetty3
[junit4:junit4]   2> 12732 T903 C83 P37623 oasc.SolrCore.getNewIndexDir New index directory detected: old=./org.apache.solr.cloud.SyncSliceTest-1355531696787/jetty3/index/ new=./org.apache.solr.cloud.SyncSliceTest-1355531696787/jetty3/index.20121215033509503
[junit4:junit4]   2> 12736 T903 C83 P37623 oasc.SolrDeletionPolicy.onInit SolrDeletionPolicy.onInit: commits:num=1
[junit4:junit4]   2> 		commit{dir=RateLimitedDirectoryWrapper(NRTCachingDirectory(org.apache.lucene.store.NIOFSDirectory@/usr/home/hudson/hudson-slave/workspace/Lucene-Solr-Tests-4.x-Java6/solr/build/solr-core/test/J0/org.apache.solr.cloud.SyncSliceTest-1355531696787/jetty3/index.20121215033509503 lockFactory=org.apache.lucene.store.NativeFSLockFactory@342f3856; maxCacheMB=48.0 maxMergeSizeMB=4.0)),segFN=segments_3,generation=3,filenames=[segments_3]
[junit4:junit4]   2> 12736 T903 C83 P37623 oasc.SolrDeletionPolicy.updateCommits newest commit = 3[segments_3]
[junit4:junit4]   2> 12737 T903 C83 P37623 oasc.CachingDirectoryFactory.close Releasing directory:/usr/home/hudson/hudson-slave/workspace/Lucene-Solr-Tests-4.x-Java6/solr/build/solr-core/test/J0/./org.apache.solr.cloud.SyncSliceTest-1355531696787/jetty3
[junit4:junit4]   2> 12738 T903 C83 P37623 oasu.DefaultSolrCoreState.newIndexWriter Creating new IndexWriter...
[junit4:junit4]   2> 12738 T903 C83 P37623 oasu.DefaultSolrCoreState.newIndexWriter Waiting until IndexWriter is unused... core=collection1
[junit4:junit4]   2> 12738 T903 C83 P37623 oasu.DefaultSolrCoreState.newIndexWriter Rollback old IndexWriter... core=collection1
[junit4:junit4]   2> 12739 T903 C83 P37623 oasc.CachingDirectoryFactory.close Releasing directory:/usr/home/hudson/hudson-slave/workspace/Lucene-Solr-Tests-4.x-Java6/solr/build/solr-core/test/J0/./org.apache.solr.cloud.SyncSliceTest-1355531696787/jetty3/index.20121215033509503
[junit4:junit4]   2> 12739 T903 C83 P37623 oasc.CachingDirectoryFactory.close Releasing directory:/usr/home/hudson/hudson-slave/workspace/Lucene-Solr-Tests-4.x-Java6/solr/build/solr-core/test/J0/./org.apache.solr.cloud.SyncSliceTest-1355531696787/jetty3
[junit4:junit4]   2> 12743 T903 C83 P37623 oasc.SolrDeletionPolicy.onInit SolrDeletionPolicy.onInit: commits:num=1
[junit4:junit4]   2> 		commit{dir=RateLimitedDirectoryWrapper(NRTCachingDirectory(org.apache.lucene.store.NIOFSDirectory@/usr/home/hudson/hudson-slave/workspace/Lucene-Solr-Tests-4.x-Java6/solr/build/solr-core/test/J0/org.apache.solr.cloud.SyncSliceTest-1355531696787/jetty3/index.20121215033509503 lockFactory=org.apache.lucene.store.NativeFSLockFactory@342f3856; maxCacheMB=48.0 maxMergeSizeMB=4.0)),segFN=segments_3,generation=3,filenames=[segments_3]
[junit4:junit4]   2> 12743 T903 C83 P37623 oasc.SolrDeletionPolicy.updateCommits newest commit = 3[segments_3]
[junit4:junit4]   2> 12743 T903 C83 P37623 oasu.DefaultSolrCoreState.newIndexWriter New IndexWriter is ready to be used.
[junit4:junit4]   2> 12744 T903 C83 P37623 oasc.CachingDirectoryFactory.close Releasing directory:/usr/home/hudson/hudson-slave/workspace/Lucene-Solr-Tests-4.x-Java6/solr/build/solr-core/test/J0/./org.apache.solr.cloud.SyncSliceTest-1355531696787/jetty3
[junit4:junit4]   2> 12744 T903 C83 P37623 oass.SolrIndexSearcher.<init> Opening Searcher@7d83707d main
[junit4:junit4]   2> 12746 T902 oasc.SolrCore.registerSearcher [collection1] Registered new searcher Searcher@7d83707d main{StandardDirectoryReader(segments_3:1:nrt)}
[junit4:junit4]   2> 12746 T902 oasc.CachingDirectoryFactory.close Releasing directory:/usr/home/hudson/hudson-slave/workspace/Lucene-Solr-Tests-4.x-Java6/solr/build/solr-core/test/J0/./org.apache.solr.cloud.SyncSliceTest-1355531696787/jetty3/index
[junit4:junit4]   2> 12746 T903 C83 P37623 oasu.DirectUpdateHandler2.commit start commit{flags=0,_version_=0,optimize=false,openSearcher=false,waitSearcher=false,expungeDeletes=false,softCommit=false}
[junit4:junit4]   2> 12779 T903 C83 P37623 oasc.SolrDeletionPolicy.onCommit SolrDeletionPolicy.onCommit: commits:num=2
[junit4:junit4]   2> 		commit{dir=RateLimitedDirectoryWrapper(NRTCachingDirectory(org.apache.lucene.store.NIOFSDirectory@/usr/home/hudson/hudson-slave/workspace/Lucene-Solr-Tests-4.x-Java6/solr/build/solr-core/test/J0/org.apache.solr.cloud.SyncSliceTest-1355531696787/jetty3/index.20121215033509503 lockFactory=org.apache.lucene.store.NativeFSLockFactory@342f3856; maxCacheMB=48.0 maxMergeSizeMB=4.0)),segFN=segments_3,generation=3,filenames=[segments_3]
[junit4:junit4]   2> 		commit{dir=RateLimitedDirectoryWrapper(NRTCachingDirectory(org.apache.lucene.store.NIOFSDirectory@/usr/home/hudson/hudson-slave/workspace/Lucene-Solr-Tests-4.x-Java6/solr/build/solr-core/test/J0/org.apache.solr.cloud.SyncSliceTest-1355531696787/jetty3/index.20121215033509503 lockFactory=org.apache.lucene.store.NativeFSLockFactory@342f3856; maxCacheMB=48.0 maxMergeSizeMB=4.0)),segFN=segments_4,generation=4,filenames=[segments_4]
[junit4:junit4]   2> 12779 T903 C83 P37623 oasc.SolrDeletionPolicy.updateCommits newest commit = 4[segments_4]
[junit4:junit4]   2> 12781 T903 C83 P37623 oasc.CachingDirectoryFactory.close Releasing directory:/usr/home/hudson/hudson-slave/workspace/Lucene-Solr-Tests-4.x-Java6/solr/build/solr-core/test/J0/./org.apache.solr.cloud.SyncSliceTest-1355531696787/jetty3
[junit4:junit4]   2> 12781 T903 C83 P37623 oasu.DirectUpdateHandler2.commit end_commit_flush
[junit4:junit4]   2> 12781 T903 C83 P37623 oasc.CachingDirectoryFactory.close Releasing directory:/usr/home/hudson/hudson-slave/workspace/Lucene-Solr-Tests-4.x-Java6/solr/build/solr-core/test/J0/./org.apache.solr.cloud.SyncSliceTest-1355531696787/jetty3/index.20121215033509503
[junit4:junit4]   2> 12781 T903 C83 P37623 oasc.CachingDirectoryFactory.close Releasing directory:/usr/home/hudson/hudson-slave/workspace/Lucene-Solr-Tests-4.x-Java6/solr/build/solr-core/test/J0/./org.apache.solr.cloud.SyncSliceTest-1355531696787/jetty3/index
[junit4:junit4]   2> 12781 T903 C83 P37623 oasc.RecoveryStrategy.replay No replay needed. core=collection1
[junit4:junit4]   2> 12782 T903 C83 P37623 oasc.RecoveryStrategy.doRecovery Replication Recovery was successful - registering as Active. core=collection1
[junit4:junit4]   2> 12782 T903 C83 P37623 oasc.ZkController.publish publishing core=collection1 state=active
[junit4:junit4]   2> 12782 T903 C83 P37623 oasc.ZkController.publish numShards not found on descriptor - reading it from system property
[junit4:junit4]   2> 12795 T903 C83 P37623 oasc.RecoveryStrategy.doRecovery Finished recovery process. core=collection1
[junit4:junit4]   2> 12797 T827 oascc.ZkStateReader.updateClusterState Updating cloud state from ZooKeeper... 
[junit4:junit4]   2> 12997 T850 oascc.ZkStateReader.updateClusterState Updating cloud state from ZooKeeper... 
[junit4:junit4]   2> 12998 T850 oasc.Overseer$ClusterStateUpdater.updateState Update state numShards=1 message={
[junit4:junit4]   2> 	  "operation":"state",
[junit4:junit4]   2> 	  "numShards":"1",
[junit4:junit4]   2> 	  "shard":"shard1",
[junit4:junit4]   2> 	  "roles":null,
[junit4:junit4]   2> 	  "state":"active",
[junit4:junit4]   2> 	  "core":"collection1",
[junit4:junit4]   2> 	  "collection":"collection1",
[junit4:junit4]   2> 	  "node_name":"127.0.0.1:37623_",
[junit4:junit4]   2> 	  "base_url":"http://127.0.0.1:37623"}
[junit4:junit4]   2> 13015 T900 oascc.ZkStateReader$2.process A cluster state change: WatchedEvent state:SyncConnected type:NodeDataChanged path:/clusterstate.json, has occurred - updating... (live nodes size: 5)
[junit4:junit4]   2> 13015 T868 oascc.ZkStateReader$2.process A cluster state change: WatchedEvent state:SyncConnected type:NodeDataChanged path:/clusterstate.json, has occurred - updating... (live nodes size: 5)
[junit4:junit4]   2> 13016 T917 oascc.ZkStateReader$2.process A cluster state change: WatchedEvent state:SyncConnected type:NodeDataChanged path:/clusterstate.json, has occurred - updating... (live nodes size: 5)
[junit4:junit4]   2> 13015 T855 oascc.ZkStateReader$2.process A cluster state change: WatchedEvent state:SyncConnected type:NodeDataChanged path:/clusterstate.json, has occurred - updating... (live nodes size: 5)
[junit4:junit4]   2> 13015 T849 oascc.ZkStateReader$2.process A cluster state change: WatchedEvent state:SyncConnected type:NodeDataChanged path:/clusterstate.json, has occurred - updating... (live nodes size: 5)
[junit4:junit4]   2> 13015 T883 oascc.ZkStateReader$2.process A cluster state change: WatchedEvent state:SyncConnected type:NodeDataChanged path:/clusterstate.json, has occurred - updating... (live nodes size: 5)
[junit4:junit4]   2> 13800 T827 oascc.ZkStateReader.updateClusterState Updating cloud state from ZooKeeper... 
[junit4:junit4]   2>  C84_STATE=coll:collection1 core:collection1 props:{shard=shard1, roles=null, state=recovering, core=collection1, collection=collection1, node_name=127.0.0.1:37627_, base_url=http://127.0.0.1:37627}
[junit4:junit4]   2> 14794 T921 C84 P37627 oasc.RecoveryStrategy.doRecovery Begin buffering updates. core=collection1
[junit4:junit4]   2> 14794 T921 C84 P37627 oasu.UpdateLog.bufferUpdates Starting to buffer updates. FSUpdateLog{state=ACTIVE, tlog=null}
[junit4:junit4]   2> 14794 T921 C84 P37627 oasc.RecoveryStrategy.replicate Attempting to replicate from http://127.0.0.1:37615/collection1/. core=collection1
[junit4:junit4]   2> 14794 T921 C84 P37627 oascsi.HttpClientUtil.createClient Creating new http client, config:maxConnections=128&maxConnectionsPerHost=32&followRedirects=false
[junit4:junit4]   2> 14803 T827 oascc.ZkStateReader.updateClusterState Updating cloud state from ZooKeeper... 
[junit4:junit4]   2> 14813 T859 C82 P37615 oasu.DirectUpdateHandler2.commit start commit{flags=0,_version_=0,optimize=false,openSearcher=false,waitSearcher=true,expungeDeletes=false,softCommit=false}
[junit4:junit4]   2> 14831 T859 C82 P37615 oasc.SolrDeletionPolicy.onCommit SolrDeletionPolicy.onCommit: commits:num=3
[junit4:junit4]   2> 		commit{dir=RateLimitedDirectoryWrapper(NRTCachingDirectory(org.apache.lucene.store.NIOFSDirectory@/usr/home/hudson/hudson-slave/workspace/Lucene-Solr-Tests-4.x-Java6/solr/build/solr-core/test/J0/org.apache.solr.cloud.SyncSliceTest-1355531696787/jetty1/index lockFactory=org.apache.lucene.store.NativeFSLockFactory@5dbb7207; maxCacheMB=48.0 maxMergeSizeMB=4.0)),segFN=segments_2,generation=2,filenames=[segments_2]
[junit4:junit4]   2> 		commit{dir=RateLimitedDirectoryWrapper(NRTCachingDirectory(org.apache.lucene.store.NIOFSDirectory@/usr/home/hudson/hudson-slave/workspace/Lucene-Solr-Tests-4.x-Java6/solr/build/solr-core/test/J0/org.apache.solr.cloud.SyncSliceTest-1355531696787/jetty1/index lockFactory=org.apache.lucene.store.NativeFSLockFactory@5dbb7207; maxCacheMB=48.0 maxMergeSizeMB=4.0)),segFN=segments_3,generation=3,filenames=[segments_3]
[junit4:junit4]   2> 		commit{dir=RateLimitedDirectoryWrapper(NRTCachingDirectory(org.apache.lucene.store.NIOFSDirectory@/usr/home/hudson/hudson-slave/workspace/Lucene-Solr-Tests-4.x-Java6/solr/build/solr-core/test/J0/org.apache.solr.cloud.SyncSliceTest-1355531696787/jetty1/index lockFactory=org.apache.lucene.store.NativeFSLockFactory@5dbb7207; maxCacheMB=48.0 maxMergeSizeMB=4.0)),segFN=segments_4,generation=4,filenames=[segments_4]
[junit4:junit4]   2> 14832 T859 C82 P37615 oasc.SolrDeletionPolicy.updateCommits newest commit = 4[segments_4]
[junit4:junit4]   2> 14833 T859 C82 P37615 oasc

[...truncated too long message...]

it4:junit4]   2> 		at org.apache.solr.cloud.LeaderElector.runIamLeaderProcess(LeaderElector.java:155)
[junit4:junit4]   2> 		at org.apache.solr.cloud.LeaderElector.checkIfIamLeader(LeaderElector.java:99)
[junit4:junit4]   2> 		at org.apache.solr.cloud.LeaderElector.access$000(LeaderElector.java:55)
[junit4:junit4]   2> 		at org.apache.solr.cloud.LeaderElector$1.process(LeaderElector.java:128)
[junit4:junit4]   2> 		at org.apache.zookeeper.ClientCnxn$EventThread.processEvent(ClientCnxn.java:519)
[junit4:junit4]   2> 		at org.apache.zookeeper.ClientCnxn$EventThread.run(ClientCnxn.java:495)
[junit4:junit4]   2> 	
[junit4:junit4]   2> 79835 T2559 oasu.DirectUpdateHandler2.close closing DirectUpdateHandler2{commits=5,autocommits=0,soft autocommits=0,optimizes=0,rollbacks=0,expungeDeletes=0,docsPending=0,adds=0,deletesById=0,deletesByQuery=0,errors=0,cumulative_adds=35,cumulative_deletesById=0,cumulative_deletesByQuery=0,cumulative_errors=0}
[junit4:junit4]   2> 79836 T2559 oasc.SolrCore.decrefSolrCoreState Closing SolrCoreState
[junit4:junit4]   2> 79836 T2559 oasu.DefaultSolrCoreState.closeIndexWriter SolrCoreState ref count has reached 0 - closing IndexWriter
[junit4:junit4]   2> 79836 T2559 oasu.DefaultSolrCoreState.closeIndexWriter closing IndexWriter with IndexWriterCloser
[junit4:junit4]   2> 79838 T2559 C161 P30273 oasc.CachingDirectoryFactory.close Releasing directory:/usr/home/hudson/hudson-slave/workspace/Lucene-Solr-Tests-4.x-Java6/solr/build/solr-core/test/J0/./org.apache.solr.cloud.BasicDistributedZk2Test-1355532137546/jetty4/index.20121215084231913
[junit4:junit4]   2> 79838 T2559 oasc.SolrCore.closeSearcher [collection1] Closing main searcher on request.
[junit4:junit4]   2> 79840 T2559 oasc.CachingDirectoryFactory.close Releasing directory:/usr/home/hudson/hudson-slave/workspace/Lucene-Solr-Tests-4.x-Java6/solr/build/solr-core/test/J0/./org.apache.solr.cloud.BasicDistributedZk2Test-1355532137546/jetty4/index.20121215084231913
[junit4:junit4]   2> 79840 T2559 oasc.CachingDirectoryFactory.close Closing directory when closing factory:/usr/home/hudson/hudson-slave/workspace/Lucene-Solr-Tests-4.x-Java6/solr/build/solr-core/test/J0/./org.apache.solr.cloud.BasicDistributedZk2Test-1355532137546/jetty4/index
[junit4:junit4]   2> 79841 T2559 oasc.CachingDirectoryFactory.close Closing directory when closing factory:/usr/home/hudson/hudson-slave/workspace/Lucene-Solr-Tests-4.x-Java6/solr/build/solr-core/test/J0/./org.apache.solr.cloud.BasicDistributedZk2Test-1355532137546/jetty4/index.20121215084231913
[junit4:junit4]   2> 79841 T2559 oasc.CachingDirectoryFactory.close Closing directory when closing factory:/usr/home/hudson/hudson-slave/workspace/Lucene-Solr-Tests-4.x-Java6/solr/build/solr-core/test/J0/./org.apache.solr.cloud.BasicDistributedZk2Test-1355532137546/jetty4
[junit4:junit4]   2> 79841 T2559 oascc.SolrZkClient.makePath makePath: /collections/collection1/leaders/shard2
[junit4:junit4]   2> 79841 T2559 oasc.LeaderElector$1.process WARNING  org.apache.zookeeper.KeeperException$SessionExpiredException: KeeperErrorCode = Session expired for /collections/collection1/leader_elect/shard2/election/88836154166738956-127.0.0.1:30273_e_jpe_collection1-n_0000000001
[junit4:junit4]   2> 	at org.apache.zookeeper.KeeperException.create(KeeperException.java:127)
[junit4:junit4]   2> 	at org.apache.zookeeper.KeeperException.create(KeeperException.java:51)
[junit4:junit4]   2> 	at org.apache.zookeeper.ZooKeeper.delete(ZooKeeper.java:873)
[junit4:junit4]   2> 	at org.apache.solr.common.cloud.SolrZkClient$2.execute(SolrZkClient.java:145)
[junit4:junit4]   2> 	at org.apache.solr.common.cloud.SolrZkClient$2.execute(SolrZkClient.java:142)
[junit4:junit4]   2> 	at org.apache.solr.common.cloud.ZkCmdExecutor.retryOperation(ZkCmdExecutor.java:63)
[junit4:junit4]   2> 	at org.apache.solr.common.cloud.SolrZkClient.delete(SolrZkClient.java:142)
[junit4:junit4]   2> 	at org.apache.solr.cloud.ElectionContext.cancelElection(ElectionContext.java:63)
[junit4:junit4]   2> 	at org.apache.solr.cloud.ShardLeaderElectionContext.runLeaderProcess(ElectionContext.java:243)
[junit4:junit4]   2> 	at org.apache.solr.cloud.LeaderElector.runIamLeaderProcess(LeaderElector.java:155)
[junit4:junit4]   2> 	at org.apache.solr.cloud.LeaderElector.checkIfIamLeader(LeaderElector.java:99)
[junit4:junit4]   2> 	at org.apache.solr.cloud.LeaderElector.access$000(LeaderElector.java:55)
[junit4:junit4]   2> 	at org.apache.solr.cloud.LeaderElector$1.process(LeaderElector.java:128)
[junit4:junit4]   2> 	at org.apache.zookeeper.ClientCnxn$EventThread.processEvent(ClientCnxn.java:519)
[junit4:junit4]   2> 	at org.apache.zookeeper.ClientCnxn$EventThread.run(ClientCnxn.java:495)
[junit4:junit4]   2> 
[junit4:junit4]   2> 79842 T2559 oascc.ZkStateReader$3.process WARNING ZooKeeper watch triggered, but Solr cannot talk to ZK
[junit4:junit4]   2> 79842 T2559 oascc.ZkStateReader$2.process A cluster state change: WatchedEvent state:SyncConnected type:NodeChildrenChanged path:/live_nodes, has occurred - updating... (live nodes size: 5)
[junit4:junit4]   2> 79842 T2559 oascc.ZkStateReader$2.process WARNING ZooKeeper watch triggered, but Solr cannot talk to ZK
[junit4:junit4]   2> 79843 T2559 oascc.ZkStateReader$2.process A cluster state change: WatchedEvent state:SyncConnected type:NodeDataChanged path:/clusterstate.json, has occurred - updating... (live nodes size: 5)
[junit4:junit4]   2> 79843 T2559 oascc.ZkStateReader$2.process WARNING ZooKeeper watch triggered, but Solr cannot talk to ZK
[junit4:junit4]   2> 79843 T2559 oascc.ConnectionManager.process Watcher org.apache.solr.common.cloud.ConnectionManager@6232a3cd name:ZooKeeperConnection Watcher:127.0.0.1:30240/solr got event WatchedEvent state:Disconnected type:None path:null path:null type:None
[junit4:junit4]   2> 79843 T2559 oascc.ConnectionManager.process Client->ZooKeeper status change trigger but we are already closed
[junit4:junit4]   2> 79843 T2559 oaz.ClientCnxn$EventThread.run EventThread shut down
[junit4:junit4]   2> NOTE: test params are: codec=Appending, sim=DefaultSimilarity, locale=zh_SG, timezone=Asia/Macao
[junit4:junit4]   2> NOTE: FreeBSD 9.0-RELEASE amd64/Sun Microsystems Inc. 1.6.0_32 (64-bit)/cpus=16,threads=2,free=162384520,total=448987136
[junit4:junit4]   2> NOTE: All tests run in this JVM: [TestQueryTypes, TestBadConfig, TestRandomFaceting, TestSolrJ, PreAnalyzedFieldTest, TestJmxMonitoredMap, WordBreakSolrSpellCheckerTest, TestJoin, BadComponentTest, NumericFieldsTest, SpellPossibilityIteratorTest, MBeansHandlerTest, TestPseudoReturnFields, SearchHandlerTest, IndexBasedSpellCheckerTest, UpdateRequestProcessorFactoryTest, TestFuzzyAnalyzedSuggestions, RequestHandlersTest, DateFieldTest, ClusterStateUpdateTest, TestFastLRUCache, TestFaceting, PathHierarchyTokenizerFactoryTest, TestIndexSearcher, TestReload, ZkControllerTest, ClusterStateTest, CoreContainerCoreInitFailuresTest, TestLMJelinekMercerSimilarityFactory, DateMathParserTest, CircularListTest, SolrPluginUtilsTest, CacheHeaderTest, TestSystemIdResolver, DistributedTermsComponentTest, SimpleFacetsTest, TestFiltering, CoreAdminHandlerTest, TestGroupingSearch, TestNumberUtils, TestWordDelimiterFilterFactory, DirectUpdateHandlerOptimizeTest, TestPerFieldSimilarity, CopyFieldTest, UniqFieldsUpdateProcessorFactoryTest, TestRangeQuery, QueryElevationComponentTest, SimplePostToolTest, DistributedMLTComponentTest, SampleTest, SuggesterFSTTest, FileBasedSpellCheckerTest, TermsComponentTest, TestDocumentBuilder, AutoCommitTest, AlternateDirectoryTest, DirectSolrConnectionTest, SyncSliceTest, OverseerTest, SpellCheckComponentTest, FullSolrCloudDistribCmdsTest, TestReplicationHandler, LeaderElectionIntegrationTest, LeaderElectionTest, DistributedSpellCheckComponentTest, TestDistributedSearch, DirectUpdateHandlerTest, TestCoreContainer, SortByFunctionTest, HighlighterTest, QueryEqualityTest, SpatialFilterTest, MoreLikeThisHandlerTest, CurrencyFieldTest, DisMaxRequestHandlerTest, DistanceFunctionTest, MinimalSchemaTest, StandardRequestHandlerTest, FieldAnalysisRequestHandlerTest, SuggesterWFSTTest, TestSolrQueryParser, FastVectorHighlighterTest, RequiredFieldsTest, LoggingHandlerTest, SuggesterTSTTest, SuggesterTest, CSVRequestHandlerTest, NotRequiredUniqueKeyTest, TestFoldingMultitermQuery, SolrCoreCheckLockOnStartupTest, TestLuceneMatchVersion, TestWriterPerf, TestUpdate, HighlighterConfigTest, TestMergePolicyConfig, TestXIncludeConfig, TestQuerySenderListener, SolrIndexConfigTest, OutputWriterTest, TestSolrCoreProperties, EchoParamsTest, TestPhraseSuggestions, TestPluginEnable, TestIBSimilarityFactory, TimeZoneUtilsTest, PluginInfoTest, ResourceLoaderTest, TestLRUCache, UUIDFieldTest, SystemInfoHandlerTest, TestCharFilters, BasicDistributedZk2Test]
[junit4:junit4] Completed on J0 in 80.40s, 1 test, 1 failure <<< FAILURES!

[...truncated 11 lines...]
BUILD FAILED
/usr/home/hudson/hudson-slave/workspace/Lucene-Solr-Tests-4.x-Java6/build.xml:353: The following error occurred while executing this line:
/usr/home/hudson/hudson-slave/workspace/Lucene-Solr-Tests-4.x-Java6/build.xml:39: The following error occurred while executing this line:
/usr/home/hudson/hudson-slave/workspace/Lucene-Solr-Tests-4.x-Java6/solr/build.xml:178: The following error occurred while executing this line:
/usr/home/hudson/hudson-slave/workspace/Lucene-Solr-Tests-4.x-Java6/solr/common-build.xml:438: The following error occurred while executing this line:
/usr/home/hudson/hudson-slave/workspace/Lucene-Solr-Tests-4.x-Java6/lucene/common-build.xml:1176: The following error occurred while executing this line:
/usr/home/hudson/hudson-slave/workspace/Lucene-Solr-Tests-4.x-Java6/lucene/common-build.xml:839: There were test failures: 242 suites, 1009 tests, 2 failures, 22 ignored (4 assumptions)

Total time: 33 minutes 7 seconds
Build step 'Invoke Ant' marked build as failure
Archiving artifacts
Recording test results
Email was triggered for: Failure
Sending email for trigger: Failure



Mime
View raw message