lucene-dev mailing list archives

Site index · List index
Message view « Date » · « Thread »
Top « Date » · « Thread »
From Apache Jenkins Server <jenk...@builds.apache.org>
Subject [JENKINS] Lucene-Solr-Tests-trunk-Java6 - Build # 15736 - Failure
Date Fri, 21 Dec 2012 14:44:57 GMT
Build: https://builds.apache.org/job/Lucene-Solr-Tests-trunk-Java6/15736/

1 tests failed.
REGRESSION:  org.apache.solr.cloud.SyncSliceTest.testDistribSearch

Error Message:
shard1 should have just been set up to be inconsistent - but it's still consistent

Stack Trace:
java.lang.AssertionError: shard1 should have just been set up to be inconsistent - but it's still consistent
	at __randomizedtesting.SeedInfo.seed([F2AFF4A2BA2162C5:73497ABACD7E02F9]:0)
	at org.junit.Assert.fail(Assert.java:93)
	at org.junit.Assert.assertTrue(Assert.java:43)
	at org.junit.Assert.assertNotNull(Assert.java:526)
	at org.apache.solr.cloud.SyncSliceTest.doTest(SyncSliceTest.java:220)
	at org.apache.solr.BaseDistributedSearchTestCase.testDistribSearch(BaseDistributedSearchTestCase.java:794)
	at sun.reflect.NativeMethodAccessorImpl.invoke0(Native Method)
	at sun.reflect.NativeMethodAccessorImpl.invoke(NativeMethodAccessorImpl.java:57)
	at sun.reflect.DelegatingMethodAccessorImpl.invoke(DelegatingMethodAccessorImpl.java:43)
	at java.lang.reflect.Method.invoke(Method.java:616)
	at com.carrotsearch.randomizedtesting.RandomizedRunner.invoke(RandomizedRunner.java:1559)
	at com.carrotsearch.randomizedtesting.RandomizedRunner.access$600(RandomizedRunner.java:79)
	at com.carrotsearch.randomizedtesting.RandomizedRunner$6.evaluate(RandomizedRunner.java:737)
	at com.carrotsearch.randomizedtesting.RandomizedRunner$7.evaluate(RandomizedRunner.java:773)
	at com.carrotsearch.randomizedtesting.RandomizedRunner$8.evaluate(RandomizedRunner.java:787)
	at com.carrotsearch.randomizedtesting.rules.SystemPropertiesRestoreRule$1.evaluate(SystemPropertiesRestoreRule.java:53)
	at org.apache.lucene.util.TestRuleSetupTeardownChained$1.evaluate(TestRuleSetupTeardownChained.java:50)
	at org.apache.lucene.util.TestRuleFieldCacheSanity$1.evaluate(TestRuleFieldCacheSanity.java:51)
	at org.apache.lucene.util.AbstractBeforeAfterRule$1.evaluate(AbstractBeforeAfterRule.java:46)
	at com.carrotsearch.randomizedtesting.rules.SystemPropertiesInvariantRule$1.evaluate(SystemPropertiesInvariantRule.java:55)
	at org.apache.lucene.util.TestRuleThreadAndTestName$1.evaluate(TestRuleThreadAndTestName.java:49)
	at org.apache.lucene.util.TestRuleIgnoreAfterMaxFailures$1.evaluate(TestRuleIgnoreAfterMaxFailures.java:70)
	at org.apache.lucene.util.TestRuleMarkFailure$1.evaluate(TestRuleMarkFailure.java:48)
	at com.carrotsearch.randomizedtesting.rules.StatementAdapter.evaluate(StatementAdapter.java:36)
	at com.carrotsearch.randomizedtesting.ThreadLeakControl$StatementRunner.run(ThreadLeakControl.java:358)
	at com.carrotsearch.randomizedtesting.ThreadLeakControl.forkTimeoutingTask(ThreadLeakControl.java:782)
	at com.carrotsearch.randomizedtesting.ThreadLeakControl$3.evaluate(ThreadLeakControl.java:442)
	at com.carrotsearch.randomizedtesting.RandomizedRunner.runSingleTest(RandomizedRunner.java:746)
	at com.carrotsearch.randomizedtesting.RandomizedRunner$3.evaluate(RandomizedRunner.java:648)
	at com.carrotsearch.randomizedtesting.RandomizedRunner$4.evaluate(RandomizedRunner.java:682)
	at com.carrotsearch.randomizedtesting.RandomizedRunner$5.evaluate(RandomizedRunner.java:693)
	at com.carrotsearch.randomizedtesting.rules.StatementAdapter.evaluate(StatementAdapter.java:36)
	at com.carrotsearch.randomizedtesting.rules.SystemPropertiesRestoreRule$1.evaluate(SystemPropertiesRestoreRule.java:53)
	at org.apache.lucene.util.AbstractBeforeAfterRule$1.evaluate(AbstractBeforeAfterRule.java:46)
	at org.apache.lucene.util.TestRuleStoreClassName$1.evaluate(TestRuleStoreClassName.java:42)
	at com.carrotsearch.randomizedtesting.rules.SystemPropertiesInvariantRule$1.evaluate(SystemPropertiesInvariantRule.java:55)
	at com.carrotsearch.randomizedtesting.rules.NoShadowingOrOverridesOnMethodsRule$1.evaluate(NoShadowingOrOverridesOnMethodsRule.java:39)
	at com.carrotsearch.randomizedtesting.rules.NoShadowingOrOverridesOnMethodsRule$1.evaluate(NoShadowingOrOverridesOnMethodsRule.java:39)
	at com.carrotsearch.randomizedtesting.rules.StatementAdapter.evaluate(StatementAdapter.java:36)
	at org.apache.lucene.util.TestRuleAssertionsRequired$1.evaluate(TestRuleAssertionsRequired.java:43)
	at org.apache.lucene.util.TestRuleMarkFailure$1.evaluate(TestRuleMarkFailure.java:48)
	at org.apache.lucene.util.TestRuleIgnoreAfterMaxFailures$1.evaluate(TestRuleIgnoreAfterMaxFailures.java:70)
	at org.apache.lucene.util.TestRuleIgnoreTestSuites$1.evaluate(TestRuleIgnoreTestSuites.java:55)
	at com.carrotsearch.randomizedtesting.rules.StatementAdapter.evaluate(StatementAdapter.java:36)
	at com.carrotsearch.randomizedtesting.ThreadLeakControl$StatementRunner.run(ThreadLeakControl.java:358)
	at java.lang.Thread.run(Thread.java:679)




Build Log:
[...truncated 8793 lines...]
[junit4:junit4] Suite: org.apache.solr.cloud.SyncSliceTest
[junit4:junit4]   2> 0 T2316 oas.BaseDistributedSearchTestCase.initHostContext Setting hostContext system property: /_nia/
[junit4:junit4]   2> 4 T2316 oas.SolrTestCaseJ4.setUp ###Starting testDistribSearch
[junit4:junit4]   2> Creating dataDir: /usr/home/hudson/hudson-slave/workspace/Lucene-Solr-Tests-trunk-Java6/solr/build/solr-core/test/J0/./solrtest-SyncSliceTest-1356100961994
[junit4:junit4]   2> 6 T2316 oasc.ZkTestServer.run STARTING ZK TEST SERVER
[junit4:junit4]   2> 7 T2317 oasc.ZkTestServer$ZKServerMain.runFromConfig Starting server
[junit4:junit4]   2> 10 T2317 oazs.ZooKeeperServer.setTickTime tickTime set to 1000
[junit4:junit4]   2> 10 T2317 oazs.ZooKeeperServer.setMinSessionTimeout minSessionTimeout set to -1
[junit4:junit4]   2> 11 T2317 oazs.ZooKeeperServer.setMaxSessionTimeout maxSessionTimeout set to -1
[junit4:junit4]   2> 11 T2317 oazs.NIOServerCnxnFactory.configure binding to port 0.0.0.0/0.0.0.0:0
[junit4:junit4]   2> 12 T2317 oazsp.FileTxnSnapLog.save Snapshotting: 0x0 to /usr/home/hudson/hudson-slave/workspace/Lucene-Solr-Tests-trunk-Java6/solr/build/solr-core/test/J0/./org.apache.solr.cloud.SyncSliceTest-1356100961993/zookeeper/server1/data/version-2/snapshot.0
[junit4:junit4]   2> 108 T2316 oasc.ZkTestServer.run start zk server on port:41793
[junit4:junit4]   2> 109 T2316 oaz.ZooKeeper.<init> Initiating client connection, connectString=127.0.0.1:41793 sessionTimeout=10000 watcher=org.apache.solr.common.cloud.ConnectionManager@1e3b5752
[junit4:junit4]   2> 110 T2316 oascc.ConnectionManager.waitForConnected Waiting for client to connect to ZooKeeper
[junit4:junit4]   2> 111 T2322 oaz.ClientCnxn$SendThread.logStartConnect Opening socket connection to server localhost/127.0.0.1:41793. Will not attempt to authenticate using SASL (access denied (javax.security.auth.AuthPermission getLoginConfiguration))
[junit4:junit4]   2> 111 T2322 oaz.ClientCnxn$SendThread.primeConnection Socket connection established to localhost/127.0.0.1:41793, initiating session
[junit4:junit4]   2> 111 T2318 oazs.NIOServerCnxnFactory.run Accepted socket connection from /140.211.11.196:41794
[junit4:junit4]   2> 112 T2318 oazs.ZooKeeperServer.processConnectRequest Client attempting to establish new session at /140.211.11.196:41794
[junit4:junit4]   2> 112 T2320 oazsp.FileTxnLog.append Creating new log file: log.1
[junit4:junit4]   2> 119 T2320 oazs.ZooKeeperServer.finishSessionInit Established session 0x13bbdea86d10000 with negotiated timeout 10000 for client /140.211.11.196:41794
[junit4:junit4]   2> 119 T2322 oaz.ClientCnxn$SendThread.onConnected Session establishment complete on server localhost/127.0.0.1:41793, sessionid = 0x13bbdea86d10000, negotiated timeout = 10000
[junit4:junit4]   2> 120 T2323 oascc.ConnectionManager.process Watcher org.apache.solr.common.cloud.ConnectionManager@1e3b5752 name:ZooKeeperConnection Watcher:127.0.0.1:41793 got event WatchedEvent state:SyncConnected type:None path:null path:null type:None
[junit4:junit4]   2> 120 T2316 oascc.ConnectionManager.waitForConnected Client is connected to ZooKeeper
[junit4:junit4]   2> 121 T2316 oascc.SolrZkClient.makePath makePath: /solr
[junit4:junit4]   2> 124 T2321 oazs.PrepRequestProcessor.pRequest2Txn Processed session termination for sessionid: 0x13bbdea86d10000
[junit4:junit4]   2> 125 T2323 oaz.ClientCnxn$EventThread.run EventThread shut down
[junit4:junit4]   2> 125 T2318 oazs.NIOServerCnxn.closeSock Closed socket connection for client /140.211.11.196:41794 which had sessionid 0x13bbdea86d10000
[junit4:junit4]   2> 125 T2316 oaz.ZooKeeper.close Session: 0x13bbdea86d10000 closed
[junit4:junit4]   2> 126 T2316 oaz.ZooKeeper.<init> Initiating client connection, connectString=127.0.0.1:41793/solr sessionTimeout=10000 watcher=org.apache.solr.common.cloud.ConnectionManager@eaebd86
[junit4:junit4]   2> 127 T2316 oascc.ConnectionManager.waitForConnected Waiting for client to connect to ZooKeeper
[junit4:junit4]   2> 127 T2324 oaz.ClientCnxn$SendThread.logStartConnect Opening socket connection to server localhost/127.0.0.1:41793. Will not attempt to authenticate using SASL (access denied (javax.security.auth.AuthPermission getLoginConfiguration))
[junit4:junit4]   2> 128 T2324 oaz.ClientCnxn$SendThread.primeConnection Socket connection established to localhost/127.0.0.1:41793, initiating session
[junit4:junit4]   2> 128 T2318 oazs.NIOServerCnxnFactory.run Accepted socket connection from /140.211.11.196:41795
[junit4:junit4]   2> 129 T2318 oazs.ZooKeeperServer.processConnectRequest Client attempting to establish new session at /140.211.11.196:41795
[junit4:junit4]   2> 135 T2320 oazs.ZooKeeperServer.finishSessionInit Established session 0x13bbdea86d10001 with negotiated timeout 10000 for client /140.211.11.196:41795
[junit4:junit4]   2> 135 T2324 oaz.ClientCnxn$SendThread.onConnected Session establishment complete on server localhost/127.0.0.1:41793, sessionid = 0x13bbdea86d10001, negotiated timeout = 10000
[junit4:junit4]   2> 135 T2325 oascc.ConnectionManager.process Watcher org.apache.solr.common.cloud.ConnectionManager@eaebd86 name:ZooKeeperConnection Watcher:127.0.0.1:41793/solr got event WatchedEvent state:SyncConnected type:None path:null path:null type:None
[junit4:junit4]   2> 135 T2316 oascc.ConnectionManager.waitForConnected Client is connected to ZooKeeper
[junit4:junit4]   2> 136 T2316 oascc.SolrZkClient.makePath makePath: /collections/collection1
[junit4:junit4]   2> 140 T2316 oascc.SolrZkClient.makePath makePath: /collections/collection1/shards
[junit4:junit4]   2> 150 T2316 oascc.SolrZkClient.makePath makePath: /collections/control_collection
[junit4:junit4]   2> 152 T2316 oascc.SolrZkClient.makePath makePath: /collections/control_collection/shards
[junit4:junit4]   2> 156 T2316 oasc.AbstractZkTestCase.putConfig put /usr/home/hudson/hudson-slave/workspace/Lucene-Solr-Tests-trunk-Java6/solr/build/solr-core/test-files/solr/collection1/conf/solrconfig.xml to /configs/conf1/solrconfig.xml
[junit4:junit4]   2> 157 T2316 oascc.SolrZkClient.makePath makePath: /configs/conf1/solrconfig.xml
[junit4:junit4]   2> 163 T2316 oasc.AbstractZkTestCase.putConfig put /usr/home/hudson/hudson-slave/workspace/Lucene-Solr-Tests-trunk-Java6/solr/build/solr-core/test-files/solr/collection1/conf/schema.xml to /configs/conf1/schema.xml
[junit4:junit4]   2> 164 T2316 oascc.SolrZkClient.makePath makePath: /configs/conf1/schema.xml
[junit4:junit4]   2> 269 T2316 oasc.AbstractZkTestCase.putConfig put /usr/home/hudson/hudson-slave/workspace/Lucene-Solr-Tests-trunk-Java6/solr/build/solr-core/test-files/solr/collection1/conf/stopwords.txt to /configs/conf1/stopwords.txt
[junit4:junit4]   2> 270 T2316 oascc.SolrZkClient.makePath makePath: /configs/conf1/stopwords.txt
[junit4:junit4]   2> 273 T2316 oasc.AbstractZkTestCase.putConfig put /usr/home/hudson/hudson-slave/workspace/Lucene-Solr-Tests-trunk-Java6/solr/build/solr-core/test-files/solr/collection1/conf/protwords.txt to /configs/conf1/protwords.txt
[junit4:junit4]   2> 274 T2316 oascc.SolrZkClient.makePath makePath: /configs/conf1/protwords.txt
[junit4:junit4]   2> 283 T2316 oasc.AbstractZkTestCase.putConfig put /usr/home/hudson/hudson-slave/workspace/Lucene-Solr-Tests-trunk-Java6/solr/build/solr-core/test-files/solr/collection1/conf/currency.xml to /configs/conf1/currency.xml
[junit4:junit4]   2> 284 T2316 oascc.SolrZkClient.makePath makePath: /configs/conf1/currency.xml
[junit4:junit4]   2> 288 T2316 oasc.AbstractZkTestCase.putConfig put /usr/home/hudson/hudson-slave/workspace/Lucene-Solr-Tests-trunk-Java6/solr/build/solr-core/test-files/solr/collection1/conf/open-exchange-rates.json to /configs/conf1/open-exchange-rates.json
[junit4:junit4]   2> 288 T2316 oascc.SolrZkClient.makePath makePath: /configs/conf1/open-exchange-rates.json
[junit4:junit4]   2> 292 T2316 oasc.AbstractZkTestCase.putConfig put /usr/home/hudson/hudson-slave/workspace/Lucene-Solr-Tests-trunk-Java6/solr/build/solr-core/test-files/solr/collection1/conf/mapping-ISOLatin1Accent.txt to /configs/conf1/mapping-ISOLatin1Accent.txt
[junit4:junit4]   2> 293 T2316 oascc.SolrZkClient.makePath makePath: /configs/conf1/mapping-ISOLatin1Accent.txt
[junit4:junit4]   2> 296 T2316 oasc.AbstractZkTestCase.putConfig put /usr/home/hudson/hudson-slave/workspace/Lucene-Solr-Tests-trunk-Java6/solr/build/solr-core/test-files/solr/collection1/conf/old_synonyms.txt to /configs/conf1/old_synonyms.txt
[junit4:junit4]   2> 297 T2316 oascc.SolrZkClient.makePath makePath: /configs/conf1/old_synonyms.txt
[junit4:junit4]   2> 301 T2316 oasc.AbstractZkTestCase.putConfig put /usr/home/hudson/hudson-slave/workspace/Lucene-Solr-Tests-trunk-Java6/solr/build/solr-core/test-files/solr/collection1/conf/synonyms.txt to /configs/conf1/synonyms.txt
[junit4:junit4]   2> 302 T2316 oascc.SolrZkClient.makePath makePath: /configs/conf1/synonyms.txt
[junit4:junit4]   2> 305 T2321 oazs.PrepRequestProcessor.pRequest2Txn Processed session termination for sessionid: 0x13bbdea86d10001
[junit4:junit4]   2> 306 T2325 oaz.ClientCnxn$EventThread.run EventThread shut down
[junit4:junit4]   2> 306 T2318 oazs.NIOServerCnxn.closeSock Closed socket connection for client /140.211.11.196:41795 which had sessionid 0x13bbdea86d10001
[junit4:junit4]   2> 306 T2316 oaz.ZooKeeper.close Session: 0x13bbdea86d10001 closed
[junit4:junit4]   2> 477 T2316 oejs.Server.doStart jetty-8.1.8.v20121106
[junit4:junit4]   2> 482 T2316 oejs.AbstractConnector.doStart Started SocketConnector@127.0.0.1:41796
[junit4:junit4]   2> 483 T2316 oasc.SolrResourceLoader.locateSolrHome JNDI not configured for solr (NoInitialContextEx)
[junit4:junit4]   2> 483 T2316 oasc.SolrResourceLoader.locateSolrHome using system property solr.solr.home: /usr/home/hudson/hudson-slave/workspace/Lucene-Solr-Tests-trunk-Java6/solr/build/solr-core/test/J0/./org.apache.solr.cloud.SyncSliceTest-controljetty-1356100962295
[junit4:junit4]   2> 484 T2316 oasc.SolrResourceLoader.<init> new SolrResourceLoader for deduced Solr Home: '/usr/home/hudson/hudson-slave/workspace/Lucene-Solr-Tests-trunk-Java6/solr/build/solr-core/test/J0/./org.apache.solr.cloud.SyncSliceTest-controljetty-1356100962295/'
[junit4:junit4]   2> 521 T2316 oass.SolrDispatchFilter.init SolrDispatchFilter.init()
[junit4:junit4]   2> 522 T2316 oasc.SolrResourceLoader.locateSolrHome JNDI not configured for solr (NoInitialContextEx)
[junit4:junit4]   2> 522 T2316 oasc.SolrResourceLoader.locateSolrHome using system property solr.solr.home: /usr/home/hudson/hudson-slave/workspace/Lucene-Solr-Tests-trunk-Java6/solr/build/solr-core/test/J0/./org.apache.solr.cloud.SyncSliceTest-controljetty-1356100962295
[junit4:junit4]   2> 523 T2316 oasc.CoreContainer$Initializer.initialize looking for solr.xml: /usr/home/hudson/hudson-slave/workspace/Lucene-Solr-Tests-trunk-Java6/solr/build/solr-core/test/J0/./org.apache.solr.cloud.SyncSliceTest-controljetty-1356100962295/solr.xml
[junit4:junit4]   2> 524 T2316 oasc.CoreContainer.<init> New CoreContainer 1811232249
[junit4:junit4]   2> 525 T2316 oasc.CoreContainer.load Loading CoreContainer using Solr Home: '/usr/home/hudson/hudson-slave/workspace/Lucene-Solr-Tests-trunk-Java6/solr/build/solr-core/test/J0/./org.apache.solr.cloud.SyncSliceTest-controljetty-1356100962295/'
[junit4:junit4]   2> 525 T2316 oasc.SolrResourceLoader.<init> new SolrResourceLoader for directory: '/usr/home/hudson/hudson-slave/workspace/Lucene-Solr-Tests-trunk-Java6/solr/build/solr-core/test/J0/./org.apache.solr.cloud.SyncSliceTest-controljetty-1356100962295/'
[junit4:junit4]   2> 548 T2316 oashc.HttpShardHandlerFactory.getParameter Setting socketTimeout to: 30000
[junit4:junit4]   2> 548 T2316 oashc.HttpShardHandlerFactory.getParameter Setting urlScheme to: http://
[junit4:junit4]   2> 549 T2316 oashc.HttpShardHandlerFactory.getParameter Setting connTimeout to: 15000
[junit4:junit4]   2> 550 T2316 oashc.HttpShardHandlerFactory.getParameter Setting maxConnectionsPerHost to: 20
[junit4:junit4]   2> 550 T2316 oashc.HttpShardHandlerFactory.getParameter Setting corePoolSize to: 0
[junit4:junit4]   2> 551 T2316 oashc.HttpShardHandlerFactory.getParameter Setting maximumPoolSize to: 2147483647
[junit4:junit4]   2> 552 T2316 oashc.HttpShardHandlerFactory.getParameter Setting maxThreadIdleTime to: 5
[junit4:junit4]   2> 552 T2316 oashc.HttpShardHandlerFactory.getParameter Setting sizeOfQueue to: -1
[junit4:junit4]   2> 553 T2316 oashc.HttpShardHandlerFactory.getParameter Setting fairnessPolicy to: false
[junit4:junit4]   2> 554 T2316 oascsi.HttpClientUtil.createClient Creating new http client, config:maxConnectionsPerHost=20&maxConnections=10000&socketTimeout=30000&connTimeout=15000&retry=false
[junit4:junit4]   2> 577 T2316 oasc.CoreContainer.load Registering Log Listener
[junit4:junit4]   2> 597 T2316 oasc.CoreContainer.initZooKeeper Zookeeper client=127.0.0.1:41793/solr
[junit4:junit4]   2> 598 T2316 oasc.ZkController.checkChrootPath zkHost includes chroot
[junit4:junit4]   2> 599 T2316 oaz.ZooKeeper.<init> Initiating client connection, connectString=127.0.0.1:41793 sessionTimeout=60000 watcher=org.apache.solr.common.cloud.ConnectionManager@6c6b8fd4
[junit4:junit4]   2> 600 T2316 oascc.ConnectionManager.waitForConnected Waiting for client to connect to ZooKeeper
[junit4:junit4]   2> 600 T2335 oaz.ClientCnxn$SendThread.logStartConnect Opening socket connection to server localhost/127.0.0.1:41793. Will not attempt to authenticate using SASL (access denied (javax.security.auth.AuthPermission getLoginConfiguration))
[junit4:junit4]   2> 601 T2335 oaz.ClientCnxn$SendThread.primeConnection Socket connection established to localhost/127.0.0.1:41793, initiating session
[junit4:junit4]   2> 601 T2318 oazs.NIOServerCnxnFactory.run Accepted socket connection from /140.211.11.196:41797
[junit4:junit4]   2> 602 T2318 oazs.ZooKeeperServer.processConnectRequest Client attempting to establish new session at /140.211.11.196:41797
[junit4:junit4]   2> 603 T2320 oazs.ZooKeeperServer.finishSessionInit Established session 0x13bbdea86d10002 with negotiated timeout 20000 for client /140.211.11.196:41797
[junit4:junit4]   2> 603 T2335 oaz.ClientCnxn$SendThread.onConnected Session establishment complete on server localhost/127.0.0.1:41793, sessionid = 0x13bbdea86d10002, negotiated timeout = 20000
[junit4:junit4]   2> 604 T2336 oascc.ConnectionManager.process Watcher org.apache.solr.common.cloud.ConnectionManager@6c6b8fd4 name:ZooKeeperConnection Watcher:127.0.0.1:41793 got event WatchedEvent state:SyncConnected type:None path:null path:null type:None
[junit4:junit4]   2> 604 T2316 oascc.ConnectionManager.waitForConnected Client is connected to ZooKeeper
[junit4:junit4]   2> 606 T2321 oazs.PrepRequestProcessor.pRequest2Txn Processed session termination for sessionid: 0x13bbdea86d10002
[junit4:junit4]   2> 610 T2318 oazs.NIOServerCnxn.closeSock Closed socket connection for client /140.211.11.196:41797 which had sessionid 0x13bbdea86d10002
[junit4:junit4]   2> 611 T2336 oaz.ClientCnxn$EventThread.run EventThread shut down
[junit4:junit4]   2> 611 T2316 oaz.ZooKeeper.close Session: 0x13bbdea86d10002 closed
[junit4:junit4]   2> 612 T2316 oascsi.HttpClientUtil.createClient Creating new http client, config:maxConnections=500&maxConnectionsPerHost=16&socketTimeout=15000&connTimeout=30000
[junit4:junit4]   2> 623 T2316 oaz.ZooKeeper.<init> Initiating client connection, connectString=127.0.0.1:41793/solr sessionTimeout=30000 watcher=org.apache.solr.common.cloud.ConnectionManager@570f96ac
[junit4:junit4]   2> 624 T2337 oaz.ClientCnxn$SendThread.logStartConnect Opening socket connection to server localhost/127.0.0.1:41793. Will not attempt to authenticate using SASL (access denied (javax.security.auth.AuthPermission getLoginConfiguration))
[junit4:junit4]   2> 624 T2316 oascc.ConnectionManager.waitForConnected Waiting for client to connect to ZooKeeper
[junit4:junit4]   2> 625 T2337 oaz.ClientCnxn$SendThread.primeConnection Socket connection established to localhost/127.0.0.1:41793, initiating session
[junit4:junit4]   2> 625 T2318 oazs.NIOServerCnxnFactory.run Accepted socket connection from /140.211.11.196:41798
[junit4:junit4]   2> 625 T2318 oazs.ZooKeeperServer.processConnectRequest Client attempting to establish new session at /140.211.11.196:41798
[junit4:junit4]   2> 626 T2320 oazs.ZooKeeperServer.finishSessionInit Established session 0x13bbdea86d10003 with negotiated timeout 20000 for client /140.211.11.196:41798
[junit4:junit4]   2> 627 T2337 oaz.ClientCnxn$SendThread.onConnected Session establishment complete on server localhost/127.0.0.1:41793, sessionid = 0x13bbdea86d10003, negotiated timeout = 20000
[junit4:junit4]   2> 627 T2338 oascc.ConnectionManager.process Watcher org.apache.solr.common.cloud.ConnectionManager@570f96ac name:ZooKeeperConnection Watcher:127.0.0.1:41793/solr got event WatchedEvent state:SyncConnected type:None path:null path:null type:None
[junit4:junit4]   2> 627 T2316 oascc.ConnectionManager.waitForConnected Client is connected to ZooKeeper
[junit4:junit4]   2> 630 T2321 oazs.PrepRequestProcessor.pRequest Got user-level KeeperException when processing sessionid:0x13bbdea86d10003 type:create cxid:0x2 zxid:0x1a txntype:-1 reqpath:n/a Error Path:/solr/overseer Error:KeeperErrorCode = NodeExists for /solr/overseer
[junit4:junit4]   2> 638 T2316 oascc.SolrZkClient.makePath makePath: /live_nodes
[junit4:junit4]   2> 640 T2316 oasc.ZkController.createEphemeralLiveNode Register node as live in ZooKeeper:/live_nodes/127.0.0.1:41796__nia
[junit4:junit4]   2> 641 T2321 oazs.PrepRequestProcessor.pRequest Got user-level KeeperException when processing sessionid:0x13bbdea86d10003 type:delete cxid:0x7 zxid:0x1c txntype:-1 reqpath:n/a Error Path:/solr/live_nodes/127.0.0.1:41796__nia Error:KeeperErrorCode = NoNode for /solr/live_nodes/127.0.0.1:41796__nia
[junit4:junit4]   2> 642 T2316 oascc.SolrZkClient.makePath makePath: /live_nodes/127.0.0.1:41796__nia
[junit4:junit4]   2> 654 T2316 oascc.SolrZkClient.makePath makePath: /overseer_elect/election
[junit4:junit4]   2> 667 T2321 oazs.PrepRequestProcessor.pRequest Got user-level KeeperException when processing sessionid:0x13bbdea86d10003 type:delete cxid:0x15 zxid:0x21 txntype:-1 reqpath:n/a Error Path:/solr/overseer_elect/leader Error:KeeperErrorCode = NoNode for /solr/overseer_elect/leader
[junit4:junit4]   2> 668 T2316 oascc.SolrZkClient.makePath makePath: /overseer_elect/leader
[junit4:junit4]   2> 680 T2316 oasc.Overseer.start Overseer (id=88873432645697539-127.0.0.1:41796__nia-n_0000000000) starting
[junit4:junit4]   2> 681 T2321 oazs.PrepRequestProcessor.pRequest Got user-level KeeperException when processing sessionid:0x13bbdea86d10003 type:create cxid:0x1a zxid:0x23 txntype:-1 reqpath:n/a Error Path:/solr/overseer Error:KeeperErrorCode = NodeExists for /solr/overseer
[junit4:junit4]   2> 689 T2321 oazs.PrepRequestProcessor.pRequest Got user-level KeeperException when processing sessionid:0x13bbdea86d10003 type:create cxid:0x1b zxid:0x24 txntype:-1 reqpath:n/a Error Path:/solr/overseer Error:KeeperErrorCode = NodeExists for /solr/overseer
[junit4:junit4]   2> 690 T2321 oazs.PrepRequestProcessor.pRequest Got user-level KeeperException when processing sessionid:0x13bbdea86d10003 type:create cxid:0x1c zxid:0x25 txntype:-1 reqpath:n/a Error Path:/solr/overseer Error:KeeperErrorCode = NodeExists for /solr/overseer
[junit4:junit4]   2> 691 T2321 oazs.PrepRequestProcessor.pRequest Got user-level KeeperException when processing sessionid:0x13bbdea86d10003 type:create cxid:0x1d zxid:0x26 txntype:-1 reqpath:n/a Error Path:/solr/overseer Error:KeeperErrorCode = NodeExists for /solr/overseer
[junit4:junit4]   2> 692 T2340 oasc.OverseerCollectionProcessor.run Process current queue of collection messages
[junit4:junit4]   2> 693 T2316 oascc.SolrZkClient.makePath makePath: /clusterstate.json
[junit4:junit4]   2> 697 T2316 oascc.ZkStateReader.createClusterStateWatchersAndUpdate Updating cluster state from ZooKeeper... 
[junit4:junit4]   2> 699 T2339 oasc.Overseer$ClusterStateUpdater.run Starting to work on the main queue
[junit4:junit4]   2> 705 T2341 oasc.CoreContainer.create Creating SolrCore 'collection1' using instanceDir: /usr/home/hudson/hudson-slave/workspace/Lucene-Solr-Tests-trunk-Java6/solr/build/solr-core/test/J0/./org.apache.solr.cloud.SyncSliceTest-controljetty-1356100962295/collection1
[junit4:junit4]   2> 705 T2341 oasc.ZkController.createCollectionZkNode Check for collection zkNode:control_collection
[junit4:junit4]   2> 706 T2341 oasc.ZkController.createCollectionZkNode Collection zkNode exists
[junit4:junit4]   2> 706 T2341 oasc.ZkController.readConfigName Load collection config from:/collections/control_collection
[junit4:junit4]   2> 707 T2341 oasc.SolrResourceLoader.<init> new SolrResourceLoader for directory: '/usr/home/hudson/hudson-slave/workspace/Lucene-Solr-Tests-trunk-Java6/solr/build/solr-core/test/J0/./org.apache.solr.cloud.SyncSliceTest-controljetty-1356100962295/collection1/'
[junit4:junit4]   2> 709 T2341 oasc.SolrResourceLoader.replaceClassLoader Adding 'file:/usr/home/hudson/hudson-slave/workspace/Lucene-Solr-Tests-trunk-Java6/solr/build/solr-core/test/J0/org.apache.solr.cloud.SyncSliceTest-controljetty-1356100962295/collection1/lib/README' to classloader
[junit4:junit4]   2> 709 T2341 oasc.SolrResourceLoader.replaceClassLoader Adding 'file:/usr/home/hudson/hudson-slave/workspace/Lucene-Solr-Tests-trunk-Java6/solr/build/solr-core/test/J0/org.apache.solr.cloud.SyncSliceTest-controljetty-1356100962295/collection1/lib/classes/' to classloader
[junit4:junit4]   2> 765 T2341 oasc.SolrConfig.<init> Using Lucene MatchVersion: LUCENE_50
[junit4:junit4]   2> 848 T2341 oasc.SolrConfig.<init> Loaded SolrConfig: solrconfig.xml
[junit4:junit4]   2> 949 T2341 oass.IndexSchema.readSchema Reading Solr Schema
[junit4:junit4]   2> 960 T2341 oass.IndexSchema.readSchema Schema name=test
[junit4:junit4]   2> 1556 T2341 oass.OpenExchangeRatesOrgProvider.init Initialized with rates=open-exchange-rates.json, refreshInterval=1440.
[junit4:junit4]   2> 1568 T2341 oass.IndexSchema.readSchema default search field in schema is text
[junit4:junit4]   2> 1573 T2341 oass.IndexSchema.readSchema unique key field: id
[junit4:junit4]   2> 1586 T2341 oass.FileExchangeRateProvider.reload Reloading exchange rates from file currency.xml
[junit4:junit4]   2> 1591 T2341 oass.FileExchangeRateProvider.reload Reloading exchange rates from file currency.xml
[junit4:junit4]   2> 1596 T2341 oass.OpenExchangeRatesOrgProvider.reload Reloading exchange rates from open-exchange-rates.json
[junit4:junit4]   2> 1597 T2341 oass.OpenExchangeRatesOrgProvider.reload Reloading exchange rates from open-exchange-rates.json
[junit4:junit4]   2> 1599 T2341 oasc.SolrCore.<init> [collection1] Opening new SolrCore at /usr/home/hudson/hudson-slave/workspace/Lucene-Solr-Tests-trunk-Java6/solr/build/solr-core/test/J0/./org.apache.solr.cloud.SyncSliceTest-controljetty-1356100962295/collection1/, dataDir=./org.apache.solr.cloud.SyncSliceTest-1356100961993/control/data/
[junit4:junit4]   2> 1599 T2341 oasc.JmxMonitoredMap.<init> JMX monitoring is enabled. Adding Solr mbeans to JMX Server: com.sun.jmx.mbeanserver.JmxMBeanServer@2017b2b2
[junit4:junit4]   2> 1599 T2341 oasc.SolrCore.initDirectoryFactory solr.NRTCachingDirectoryFactory
[junit4:junit4]   2> 1601 T2341 oasc.CachingDirectoryFactory.get return new directory for /usr/home/hudson/hudson-slave/workspace/Lucene-Solr-Tests-trunk-Java6/solr/build/solr-core/test/J0/./org.apache.solr.cloud.SyncSliceTest-1356100961993/control/data forceNew:false
[junit4:junit4]   2> 1602 T2341 oasc.CachingDirectoryFactory.close Releasing directory:/usr/home/hudson/hudson-slave/workspace/Lucene-Solr-Tests-trunk-Java6/solr/build/solr-core/test/J0/./org.apache.solr.cloud.SyncSliceTest-1356100961993/control/data
[junit4:junit4]   2> 1602 T2341 oasc.SolrCore.getNewIndexDir New index directory detected: old=null new=./org.apache.solr.cloud.SyncSliceTest-1356100961993/control/data/index/
[junit4:junit4]   2> 1603 T2341 oasc.SolrCore.initIndex WARNING [collection1] Solr index directory './org.apache.solr.cloud.SyncSliceTest-1356100961993/control/data/index' doesn't exist. Creating new index...
[junit4:junit4]   2> 1604 T2341 oasc.CachingDirectoryFactory.get return new directory for /usr/home/hudson/hudson-slave/workspace/Lucene-Solr-Tests-trunk-Java6/solr/build/solr-core/test/J0/./org.apache.solr.cloud.SyncSliceTest-1356100961993/control/data/index forceNew:false
[junit4:junit4]   2> 1637 T2341 oasc.SolrDeletionPolicy.onCommit SolrDeletionPolicy.onCommit: commits:num=1
[junit4:junit4]   2> 		commit{dir=RateLimitedDirectoryWrapper(NRTCachingDirectory(org.apache.lucene.store.NIOFSDirectory@/usr/home/hudson/hudson-slave/workspace/Lucene-Solr-Tests-trunk-Java6/solr/build/solr-core/test/J0/org.apache.solr.cloud.SyncSliceTest-1356100961993/control/data/index lockFactory=org.apache.lucene.store.NativeFSLockFactory@18ba8d6e; maxCacheMB=48.0 maxMergeSizeMB=4.0)),segFN=segments_1,generation=1,filenames=[segments_1]
[junit4:junit4]   2> 1637 T2341 oasc.SolrDeletionPolicy.updateCommits newest commit = 1[segments_1]
[junit4:junit4]   2> 1638 T2341 oasc.CachingDirectoryFactory.close Releasing directory:/usr/home/hudson/hudson-slave/workspace/Lucene-Solr-Tests-trunk-Java6/solr/build/solr-core/test/J0/./org.apache.solr.cloud.SyncSliceTest-1356100961993/control/data/index
[junit4:junit4]   2> 1638 T2341 oasc.SolrCore.initWriters created xml: solr.XMLResponseWriter
[junit4:junit4]   2> 1640 T2341 oasup.UpdateRequestProcessorChain.init inserting DistributedUpdateProcessorFactory into updateRequestProcessorChain "dedupe"
[junit4:junit4]   2> 1640 T2341 oasup.UpdateRequestProcessorChain.init inserting DistributedUpdateProcessorFactory into updateRequestProcessorChain "dedupe-allfields"
[junit4:junit4]   2> 1641 T2341 oasup.UpdateRequestProcessorChain.init inserting DistributedUpdateProcessorFactory into updateRequestProcessorChain "stored_sig"
[junit4:junit4]   2> 1641 T2341 oasup.UpdateRequestProcessorChain.init inserting DistributedUpdateProcessorFactory into updateRequestProcessorChain "uniq-fields"
[junit4:junit4]   2> 1642 T2341 oasup.UpdateRequestProcessorChain.init inserting DistributedUpdateProcessorFactory into updateRequestProcessorChain "distrib-dup-test-chain-implicit"
[junit4:junit4]   2> 1642 T2341 oasc.RequestHandlers.initHandlersFromConfig adding lazy requestHandler: solr.ReplicationHandler
[junit4:junit4]   2> 1642 T2341 oasc.RequestHandlers.initHandlersFromConfig created /replication: solr.ReplicationHandler
[junit4:junit4]   2> 1643 T2341 oasc.RequestHandlers.initHandlersFromConfig created standard: solr.StandardRequestHandler
[junit4:junit4]   2> 1644 T2341 oasc.RequestHandlers.initHandlersFromConfig created /get: solr.RealTimeGetHandler
[junit4:junit4]   2> 1645 T2341 oasc.RequestHandlers.initHandlersFromConfig created dismax: solr.SearchHandler
[junit4:junit4]   2> 1646 T2341 oasc.RequestHandlers.initHandlersFromConfig created mock: org.apache.solr.core.MockQuerySenderListenerReqHandler
[junit4:junit4]   2> 1646 T2341 oasc.RequestHandlers.initHandlersFromConfig created /admin/: org.apache.solr.handler.admin.AdminHandlers
[junit4:junit4]   2> 1647 T2341 oasc.RequestHandlers.initHandlersFromConfig created defaults: solr.StandardRequestHandler
[junit4:junit4]   2> 1647 T2341 oasc.RequestHandlers.initHandlersFromConfig adding lazy requestHandler: solr.StandardRequestHandler
[junit4:junit4]   2> 1648 T2341 oasc.RequestHandlers.initHandlersFromConfig created lazy: solr.StandardRequestHandler
[junit4:junit4]   2> 1649 T2341 oasc.RequestHandlers.initHandlersFromConfig created /update: solr.UpdateRequestHandler
[junit4:junit4]   2> 1650 T2341 oasc.RequestHandlers.initHandlersFromConfig created /terms: org.apache.solr.handler.component.SearchHandler
[junit4:junit4]   2> 1650 T2341 oasc.RequestHandlers.initHandlersFromConfig created spellCheckCompRH: org.apache.solr.handler.component.SearchHandler
[junit4:junit4]   2> 1651 T2341 oasc.RequestHandlers.initHandlersFromConfig created spellCheckCompRH_Direct: org.apache.solr.handler.component.SearchHandler
[junit4:junit4]   2> 1652 T2341 oasc.RequestHandlers.initHandlersFromConfig created spellCheckWithWordbreak: org.apache.solr.handler.component.SearchHandler
[junit4:junit4]   2> 1653 T2341 oasc.RequestHandlers.initHandlersFromConfig created spellCheckWithWordbreak_Direct: org.apache.solr.handler.component.SearchHandler
[junit4:junit4]   2> 1654 T2341 oasc.RequestHandlers.initHandlersFromConfig created spellCheckCompRH1: org.apache.solr.handler.component.SearchHandler
[junit4:junit4]   2> 1654 T2341 oasc.RequestHandlers.initHandlersFromConfig created mltrh: org.apache.solr.handler.component.SearchHandler
[junit4:junit4]   2> 1655 T2341 oasc.RequestHandlers.initHandlersFromConfig created tvrh: org.apache.solr.handler.component.SearchHandler
[junit4:junit4]   2> 1656 T2341 oasc.RequestHandlers.initHandlersFromConfig created /mlt: solr.MoreLikeThisHandler
[junit4:junit4]   2> 1657 T2341 oasc.RequestHandlers.initHandlersFromConfig created /debug/dump: solr.DumpRequestHandler
[junit4:junit4]   2> 1664 T2341 oashl.XMLLoader.init xsltCacheLifetimeSeconds=60
[junit4:junit4]   2> 1669 T2341 oasc.SolrCore.initDeprecatedSupport WARNING solrconfig.xml uses deprecated <admin/gettableFiles>, Please update your config to use the ShowFileRequestHandler.
[junit4:junit4]   2> 1671 T2341 oasc.SolrCore.initDeprecatedSupport WARNING adding ShowFileRequestHandler with hidden files: [SCHEMA.XML, OLD_SYNONYMS.TXT, STOPWORDS.TXT, PROTWORDS.TXT, OPEN-EXCHANGE-RATES.JSON, SYNONYMS.TXT, CURRENCY.XML, MAPPING-ISOLATIN1ACCENT.TXT]
[junit4:junit4]   2> 1673 T2341 oasc.CachingDirectoryFactory.close Releasing directory:/usr/home/hudson/hudson-slave/workspace/Lucene-Solr-Tests-trunk-Java6/solr/build/solr-core/test/J0/./org.apache.solr.cloud.SyncSliceTest-1356100961993/control/data
[junit4:junit4]   2> 1675 T2341 oass.SolrIndexSearcher.<init> Opening Searcher@119ece02 main
[junit4:junit4]   2> 1676 T2341 oasu.CommitTracker.<init> Hard AutoCommit: disabled
[junit4:junit4]   2> 1677 T2341 oasu.CommitTracker.<init> Soft AutoCommit: disabled
[junit4:junit4]   2> 1677 T2341 oashc.SpellCheckComponent.inform Initializing spell checkers
[junit4:junit4]   2> 1684 T2341 oass.DirectSolrSpellChecker.init init: {name=direct,classname=DirectSolrSpellChecker,field=lowerfilt,minQueryLength=3}
[junit4:junit4]   2> 1756 T2342 oasc.SolrCore.registerSearcher [collection1] Registered new searcher Searcher@119ece02 main{StandardDirectoryReader(segments_1:1)}
[junit4:junit4]   2> 1759 T2341 oasc.ZkController.publish publishing core=collection1 state=down
[junit4:junit4]   2> 1759 T2341 oasc.ZkController.publish numShards not found on descriptor - reading it from system property
[junit4:junit4]   2> 1760 T2321 oazs.PrepRequestProcessor.pRequest Got user-level KeeperException when processing sessionid:0x13bbdea86d10003 type:create cxid:0x56 zxid:0x29 txntype:-1 reqpath:n/a Error Path:/solr/overseer/queue Error:KeeperErrorCode = NoNode for /solr/overseer/queue
[junit4:junit4]   2> 2207 T2339 oascc.ZkStateReader.updateClusterState Updating cloud state from ZooKeeper... 
[junit4:junit4]   2> 2208 T2339 oasc.Overseer$ClusterStateUpdater.updateState Update state numShards=1 message={
[junit4:junit4]   2> 	  "operation":"state",
[junit4:junit4]   2> 	  "numShards":"1",
[junit4:junit4]   2> 	  "shard":null,
[junit4:junit4]   2> 	  "roles":null,
[junit4:junit4]   2> 	  "state":"down",
[junit4:junit4]   2> 	  "core":"collection1",
[junit4:junit4]   2> 	  "collection":"control_collection",
[junit4:junit4]   2> 	  "node_name":"127.0.0.1:41796__nia",
[junit4:junit4]   2> 	  "base_url":"http://127.0.0.1:41796/_nia"}
[junit4:junit4]   2> 2208 T2339 oasc.Overseer$ClusterStateUpdater.createCollection Create collection control_collection with numShards 1
[junit4:junit4]   2> 2209 T2339 oasc.Overseer$ClusterStateUpdater.updateState Assigning new node to shard shard=shard1
[junit4:junit4]   2> 2209 T2321 oazs.PrepRequestProcessor.pRequest Got user-level KeeperException when processing sessionid:0x13bbdea86d10003 type:create cxid:0x5e zxid:0x2c txntype:-1 reqpath:n/a Error Path:/solr/overseer/queue-work Error:KeeperErrorCode = NoNode for /solr/overseer/queue-work
[junit4:junit4]   2> 2225 T2338 oascc.ZkStateReader$2.process A cluster state change: WatchedEvent state:SyncConnected type:NodeDataChanged path:/clusterstate.json, has occurred - updating... (live nodes size: 1)
[junit4:junit4]   2> 2764 T2341 oasc.CoreContainer.registerCore registering core: collection1
[junit4:junit4]   2> 2764 T2341 oasc.ZkController.register Register replica - core:collection1 address:http://127.0.0.1:41796/_nia collection:control_collection shard:shard1
[junit4:junit4]   2> 2765 T2341 oascc.SolrZkClient.makePath makePath: /collections/control_collection/leader_elect/shard1/election
[junit4:junit4]   2> 2780 T2321 oazs.PrepRequestProcessor.pRequest Got user-level KeeperException when processing sessionid:0x13bbdea86d10003 type:delete cxid:0x7b zxid:0x36 txntype:-1 reqpath:n/a Error Path:/solr/collections/control_collection/leaders Error:KeeperErrorCode = NoNode for /solr/collections/control_collection/leaders
[junit4:junit4]   2> 2782 T2341 oasc.ShardLeaderElectionContext.runLeaderProcess Running the leader process.
[junit4:junit4]   2> 2782 T2321 oazs.PrepRequestProcessor.pRequest Got user-level KeeperException when processing sessionid:0x13bbdea86d10003 type:create cxid:0x7c zxid:0x37 txntype:-1 reqpath:n/a Error Path:/solr/overseer Error:KeeperErrorCode = NodeExists for /solr/overseer
[junit4:junit4]   2> 2794 T2341 oasc.ShardLeaderElectionContext.waitForReplicasToComeUp Enough replicas found to continue.
[junit4:junit4]   2> 2794 T2341 oasc.ShardLeaderElectionContext.runLeaderProcess I may be the new leader - try and sync
[junit4:junit4]   2> 2794 T2341 oasc.SyncStrategy.sync Sync replicas to http://127.0.0.1:41796/_nia/collection1/
[junit4:junit4]   2> 2795 T2341 oasc.SyncStrategy.syncReplicas Sync Success - now sync replicas to me
[junit4:junit4]   2> 2795 T2341 oasc.SyncStrategy.syncToMe http://127.0.0.1:41796/_nia/collection1/ has no replicas
[junit4:junit4]   2> 2795 T2341 oasc.ShardLeaderElectionContext.runLeaderProcess I am the new leader: http://127.0.0.1:41796/_nia/collection1/
[junit4:junit4]   2> 2796 T2341 oascc.SolrZkClient.makePath makePath: /collections/control_collection/leaders/shard1
[junit4:junit4]   2> 2800 T2321 oazs.PrepRequestProcessor.pRequest Got user-level KeeperException when processing sessionid:0x13bbdea86d10003 type:create cxid:0x86 zxid:0x3b txntype:-1 reqpath:n/a Error Path:/solr/overseer Error:KeeperErrorCode = NodeExists for /solr/overseer
[junit4:junit4]   2> 3232 T2339 oascc.ZkStateReader.updateClusterState Updating cloud state from ZooKeeper... 
[junit4:junit4]   2> 3254 T2338 oascc.ZkStateReader$2.process A cluster state change: WatchedEvent state:SyncConnected type:NodeDataChanged path:/clusterstate.json, has occurred - updating... (live nodes size: 1)
[junit4:junit4]   2> 3269 T2341 oasc.ZkController.register We are http://127.0.0.1:41796/_nia/collection1/ and leader is http://127.0.0.1:41796/_nia/collection1/
[junit4:junit4]   2> 3269 T2341 oasc.ZkController.register No LogReplay needed for core=collection1 baseURL=http://127.0.0.1:41796/_nia
[junit4:junit4]   2> 3269 T2341 oasc.ZkController.checkRecovery I am the leader, no recovery necessary
[junit4:junit4]   2> 3270 T2341 oasc.ZkController.publish publishing core=collection1 state=active
[junit4:junit4]   2> 3270 T2341 oasc.ZkController.publish numShards not found on descriptor - reading it from system property
[junit4:junit4]   2> 3272 T2341 oascc.ZkStateReader.updateClusterState Updating cloud state from ZooKeeper... 
[junit4:junit4]   2> 3273 T2316 oass.SolrDispatchFilter.init user.dir=/usr/home/hudson/hudson-slave/workspace/Lucene-Solr-Tests-trunk-Java6/solr/build/solr-core/test/J0
[junit4:junit4]   2> 3274 T2316 oass.SolrDispatchFilter.init SolrDispatchFilter.init() done
[junit4:junit4]   2> 3275 T2316 oascsi.HttpClientUtil.createClient Creating new http client, config:maxConnections=128&maxConnectionsPerHost=32&followRedirects=false
[junit4:junit4]   2> 3289 T2316 oascsi.HttpClientUtil.createClient Creating new http client, config:
[junit4:junit4]   2> 3297 T2316 oaz.ZooKeeper.<init> Initiating client connection, connectString=127.0.0.1:41793/solr sessionTimeout=10000 watcher=org.apache.solr.common.cloud.ConnectionManager@201d5a8c
[junit4:junit4]   2> 3298 T2316 oascc.ConnectionManager.waitForConnected Waiting for client to connect to ZooKeeper
[junit4:junit4]   2> 3299 T2343 oaz.ClientCnxn$SendThread.logStartConnect Opening socket connection to server localhost/127.0.0.1:41793. Will not attempt to authenticate using SASL (access denied (javax.security.auth.AuthPermission getLoginConfiguration))
[junit4:junit4]   2> 3299 T2343 oaz.ClientCnxn$SendThread.primeConnection Socket connection established to localhost/127.0.0.1:41793, initiating session
[junit4:junit4]   2> 3300 T2318 oazs.NIOServerCnxnFactory.run Accepted socket connection from /140.211.11.196:41803
[junit4:junit4]   2> 3300 T2318 oazs.ZooKeeperServer.processConnectRequest Client attempting to establish new session at /140.211.11.196:41803
[junit4:junit4]   2> 3302 T2320 oazs.ZooKeeperServer.finishSessionInit Established session 0x13bbdea86d10004 with negotiated timeout 10000 for client /140.211.11.196:41803
[junit4:junit4]   2> 3302 T2343 oaz.ClientCnxn$SendThread.onConnected Session establishment complete on server localhost/127.0.0.1:41793, sessionid = 0x13bbdea86d10004, negotiated timeout = 10000
[junit4:junit4]   2> 3302 T2344 oascc.ConnectionManager.process Watcher org.apache.solr.common.cloud.ConnectionManager@201d5a8c name:ZooKeeperConnection Watcher:127.0.0.1:41793/solr got event WatchedEvent state:SyncConnected type:None path:null path:null type:None
[junit4:junit4]   2> 3302 T2316 oascc.ConnectionManager.waitForConnected Client is connected to ZooKeeper
[junit4:junit4]   2> 3304 T2316 oascc.ZkStateReader.createClusterStateWatchersAndUpdate Updating cluster state from ZooKeeper... 
[junit4:junit4]   2> 3306 T2316 oasc.ChaosMonkey.monkeyLog monkey: init - expire sessions:true cause connection loss:true
[junit4:junit4]   2> 3477 T2316 oejs.Server.doStart jetty-8.1.8.v20121106
[junit4:junit4]   2> 3480 T2316 oejs.AbstractConnector.doStart Started SocketConnector@127.0.0.1:41804
[junit4:junit4]   2> 3481 T2316 oasc.SolrResourceLoader.locateSolrHome JNDI not configured for solr (NoInitialContextEx)
[junit4:junit4]   2> 3482 T2316 oasc.SolrResourceLoader.locateSolrHome using system property solr.solr.home: /usr/home/hudson/hudson-slave/workspace/Lucene-Solr-Tests-trunk-Java6/solr/build/solr-core/test/J0/./org.apache.solr.cloud.SyncSliceTest-jetty1-1356100965295
[junit4:junit4]   2> 3483 T2316 oasc.SolrResourceLoader.<init> new SolrResourceLoader for deduced Solr Home: '/usr/home/hudson/hudson-slave/workspace/Lucene-Solr-Tests-trunk-Java6/solr/build/solr-core/test/J0/./org.apache.solr.cloud.SyncSliceTest-jetty1-1356100965295/'
[junit4:junit4]   2> 3521 T2316 oass.SolrDispatchFilter.init SolrDispatchFilter.init()
[junit4:junit4]   2> 3522 T2316 oasc.SolrResourceLoader.locateSolrHome JNDI not configured for solr (NoInitialContextEx)
[junit4:junit4]   2> 3522 T2316 oasc.SolrResourceLoader.locateSolrHome using system property solr.solr.home: /usr/home/hudson/hudson-slave/workspace/Lucene-Solr-Tests-trunk-Java6/solr/build/solr-core/test/J0/./org.apache.solr.cloud.SyncSliceTest-jetty1-1356100965295
[junit4:junit4]   2> 3523 T2316 oasc.CoreContainer$Initializer.initialize looking for solr.xml: /usr/home/hudson/hudson-slave/workspace/Lucene-Solr-Tests-trunk-Java6/solr/build/solr-core/test/J0/./org.apache.solr.cloud.SyncSliceTest-jetty1-1356100965295/solr.xml
[junit4:junit4]   2> 3524 T2316 oasc.CoreContainer.<init> New CoreContainer 1804957681
[junit4:junit4]   2> 3525 T2316 oasc.CoreContainer.load Loading CoreContainer using Solr Home: '/usr/home/hudson/hudson-slave/workspace/Lucene-Solr-Tests-trunk-Java6/solr/build/solr-core/test/J0/./org.apache.solr.cloud.SyncSliceTest-jetty1-1356100965295/'
[junit4:junit4]   2> 3525 T2316 oasc.SolrResourceLoader.<init> new SolrResourceLoader for directory: '/usr/home/hudson/hudson-slave/workspace/Lucene-Solr-Tests-trunk-Java6/solr/build/solr-core/test/J0/./org.apache.solr.cloud.SyncSliceTest-jetty1-1356100965295/'
[junit4:junit4]   2> 3548 T2316 oashc.HttpShardHandlerFactory.getParameter Setting socketTimeout to: 30000
[junit4:junit4]   2> 3549 T2316 oashc.HttpShardHandlerFactory.getParameter Setting urlScheme to: http://
[junit4:junit4]   2> 3549 T2316 oashc.HttpShardHandlerFactory.getParameter Setting connTimeout to: 15000
[junit4:junit4]   2> 3550 T2316 oashc.HttpShardHandlerFactory.getParameter Setting maxConnectionsPerHost to: 20
[junit4:junit4]   2> 3551 T2316 oashc.HttpShardHandlerFactory.getParameter Setting corePoolSize to: 0
[junit4:junit4]   2> 3551 T2316 oashc.HttpShardHandlerFactory.getParameter Setting maximumPoolSize to: 2147483647
[junit4:junit4]   2> 3552 T2316 oashc.HttpShardHandlerFactory.getParameter Setting maxThreadIdleTime to: 5
[junit4:junit4]   2> 3553 T2316 oashc.HttpShardHandlerFactory.getParameter Setting sizeOfQueue to: -1
[junit4:junit4]   2> 3553 T2316 oashc.HttpShardHandlerFactory.getParameter Setting fairnessPolicy to: false
[junit4:junit4]   2> 3554 T2316 oascsi.HttpClientUtil.createClient Creating new http client, config:maxConnectionsPerHost=20&maxConnections=10000&socketTimeout=30000&connTimeout=15000&retry=false
[junit4:junit4]   2> 3572 T2316 oasc.CoreContainer.load Registering Log Listener
[junit4:junit4]   2> 3591 T2316 oasc.CoreContainer.initZooKeeper Zookeeper client=127.0.0.1:41793/solr
[junit4:junit4]   2> 3592 T2316 oasc.ZkController.checkChrootPath zkHost includes chroot
[junit4:junit4]   2> 3593 T2316 oaz.ZooKeeper.<init> Initiating client connection, connectString=127.0.0.1:41793 sessionTimeout=60000 watcher=org.apache.solr.common.cloud.ConnectionManager@67f424e
[junit4:junit4]   2> 3594 T2316 oascc.ConnectionManager.waitForConnected Waiting for client to connect to ZooKeeper
[junit4:junit4]   2> 3594 T2354 oaz.ClientCnxn$SendThread.logStartConnect Opening socket connection to server localhost/127.0.0.1:41793. Will not attempt to authenticate using SASL (access denied (javax.security.auth.AuthPermission getLoginConfiguration))
[junit4:junit4]   2> 3595 T2354 oaz.ClientCnxn$SendThread.primeConnection Socket connection established to localhost/127.0.0.1:41793, initiating session
[junit4:junit4]   2> 3595 T2318 oazs.NIOServerCnxnFactory.run Accepted socket connection from /140.211.11.196:41805
[junit4:junit4]   2> 3596 T2318 oazs.ZooKeeperServer.processConnectRequest Client attempting to establish new session at /140.211.11.196:41805
[junit4:junit4]   2> 3597 T2320 oazs.ZooKeeperServer.finishSessionInit Established session 0x13bbdea86d10005 with negotiated timeout 20000 for client /140.211.11.196:41805
[junit4:junit4]   2> 3597 T2354 oaz.ClientCnxn$SendThread.onConnected Session establishment complete on server localhost/127.0.0.1:41793, sessionid = 0x13bbdea86d10005, negotiated timeout = 20000
[junit4:junit4]   2> 3598 T2355 oascc.ConnectionManager.process Watcher org.apache.solr.common.cloud.ConnectionManager@67f424e name:ZooKeeperConnection Watcher:127.0.0.1:41793 got event WatchedEvent state:SyncConnected type:None path:null path:null type:None
[junit4:junit4]   2> 3598 T2316 oascc.ConnectionManager.waitForConnected Client is connected to ZooKeeper
[junit4:junit4]   2> 3600 T2321 oazs.PrepRequestProcessor.pRequest2Txn Processed session termination for sessionid: 0x13bbdea86d10005
[junit4:junit4]   2> 3601 T2355 oaz.ClientCnxn$EventThread.run EventThread shut down
[junit4:junit4]   2> 3601 T2318 oazs.NIOServerCnxn.closeSock Closed socket connection for client /140.211.11.196:41805 which had sessionid 0x13bbdea86d10005
[junit4:junit4]   2> 3601 T2316 oaz.ZooKeeper.close Session: 0x13bbdea86d10005 closed
[junit4:junit4]   2> 3602 T2316 oascsi.HttpClientUtil.createClient Creating new http client, config:maxConnections=500&maxConnectionsPerHost=16&socketTimeout=15000&connTimeout=30000
[junit4:junit4]   2> 3611 T2316 oaz.ZooKeeper.<init> Initiating client connection, connectString=127.0.0.1:41793/solr sessionTimeout=30000 watcher=org.apache.solr.common.cloud.ConnectionManager@38f3386e
[junit4:junit4]   2> 3613 T2356 oaz.ClientCnxn$SendThread.logStartConnect Opening socket connection to server localhost/127.0.0.1:41793. Will not attempt to authenticate using SASL (access denied (javax.security.auth.AuthPermission getLoginConfiguration))
[junit4:junit4]   2> 3612 T2316 oascc.ConnectionManager.waitForConnected Waiting for client to connect to ZooKeeper
[junit4:junit4]   2> 3613 T2356 oaz.ClientCnxn$SendThread.primeConnection Socket connection established to localhost/127.0.0.1:41793, initiating session
[junit4:junit4]   2> 3613 T2318 oazs.NIOServerCnxnFactory.run Accepted socket connection from /140.211.11.196:41806
[junit4:junit4]   2> 3614 T2318 oazs.ZooKeeperServer.processConnectRequest Client attempting to establish new session at /140.211.11.196:41806
[junit4:junit4]   2> 3615 T2320 oazs.ZooKeeperServer.finishSessionInit Established session 0x13bbdea86d10006 with negotiated timeout 20000 for client /140.211.11.196:41806
[junit4:junit4]   2> 3615 T2356 oaz.ClientCnxn$SendThread.onConnected Session establishment complete on server localhost/127.0.0.1:41793, sessionid = 0x13bbdea86d10006, negotiated timeout = 20000
[junit4:junit4]   2> 3615 T2357 oascc.ConnectionManager.process Watcher org.apache.solr.common.cloud.ConnectionManager@38f3386e name:ZooKeeperConnection Watcher:127.0.0.1:41793/solr got event WatchedEvent state:SyncConnected type:None path:null path:null type:None
[junit4:junit4]   2> 3615 T2316 oascc.ConnectionManager.waitForConnected Client is connected to ZooKeeper
[junit4:junit4]   2> 3617 T2321 oazs.PrepRequestProcessor.pRequest Got user-level KeeperException when processing sessionid:0x13bbdea86d10006 type:create cxid:0x1 zxid:0x49 txntype:-1 reqpath:n/a Error Path:/solr/overseer Error:KeeperErrorCode = NodeExists for /solr/overseer
[junit4:junit4]   2> 3618 T2321 oazs.PrepRequestProcessor.pRequest Got user-level KeeperException when processing sessionid:0x13bbdea86d10006 type:create cxid:0x2 zxid:0x4a txntype:-1 reqpath:n/a Error Path:/solr/overseer Error:KeeperErrorCode = NodeExists for /solr/overseer
[junit4:junit4]   2> 3619 T2316 oasc.ZkController.createEphemeralLiveNode Register node as live in ZooKeeper:/live_nodes/127.0.0.1:41804__nia
[junit4:junit4]   2> 3620 T2321 oazs.PrepRequestProcessor.pRequest Got user-level KeeperException when processing sessionid:0x13bbdea86d10006 type:delete cxid:0x4 zxid:0x4b txntype:-1 reqpath:n/a Error Path:/solr/live_nodes/127.0.0.1:41804__nia Error:KeeperErrorCode = NoNode for /solr/live_nodes/127.0.0.1:41804__nia
[junit4:junit4]   2> 3632 T2316 oascc.SolrZkClient.makePath makePath: /live_nodes/127.0.0.1:41804__nia
[junit4:junit4]   2> 3635 T2338 oascc.ZkStateReader$3.process Updating live nodes... (2)
[junit4:junit4]   2> 3635 T2344 oascc.ZkStateReader$3.process Updating live nodes... (2)
[junit4:junit4]   2> 3635 T2338 oascc.ZkStateReader$2.process A cluster state change: WatchedEvent state:SyncConnected type:NodeChildrenChanged path:/live_nodes, has occurred - updating... (live nodes size: 2)
[junit4:junit4]   2> 3638 T2316 oascc.ZkStateReader.createClusterStateWatchersAndUpdate Updating cluster state from ZooKeeper... 
[junit4:junit4]   2> 3645 T2358 oasc.CoreContainer.create Creating SolrCore 'collection1' using instanceDir: /usr/home/hudson/hudson-slave/workspace/Lucene-Solr-Tests-trunk-Java6/solr/build/solr-core/test/J0/./org.apache.solr.cloud.SyncSliceTest-jetty1-1356100965295/collection1
[junit4:junit4]   2> 3645 T2358 oasc.ZkController.createCollectionZkNode Check for collection zkNode:collection1
[junit4:junit4]   2> 3646 T2358 oasc.ZkController.createCollectionZkNode Collection zkNode exists
[junit4:junit4]   2> 3646 T2358 oasc.ZkController.readConfigName Load collection config from:/collections/collection1
[junit4:junit4]   2> 3647 T2358 oasc.SolrResourceLoader.<init> new SolrResourceLoader for directory: '/usr/home/hudson/hudson-slave/workspace/Lucene-Solr-Tests-trunk-Java6/solr/build/solr-core/test/J0/./org.apache.solr.cloud.SyncSliceTest-jetty1-1356100965295/collection1/'
[junit4:junit4]   2> 3648 T2358 oasc.SolrResourceLoader.replaceClassLoader Adding 'file:/usr/home/hudson/hudson-slave/workspace/Lucene-Solr-Tests-trunk-Java6/solr/build/solr-core/test/J0/org.apache.solr.cloud.SyncSliceTest-jetty1-1356100965295/collection1/lib/README' to classloader
[junit4:junit4]   2> 3649 T2358 oasc.SolrResourceLoader.replaceClassLoader Adding 'file:/usr/home/hudson/hudson-slave/workspace/Lucene-Solr-Tests-trunk-Java6/solr/build/solr-core/test/J0/org.apache.solr.cloud.SyncSliceTest-jetty1-1356100965295/collection1/lib/classes/' to classloader
[junit4:junit4]   2> 3688 T2358 oasc.SolrConfig.<init> Using Lucene MatchVersion: LUCENE_50
[junit4:junit4]   2> 3736 T2358 oasc.SolrConfig.<init> Loaded SolrConfig: solrconfig.xml
[junit4:junit4]   2> 3760 T2339 oascc.ZkStateReader.updateClusterState Updating cloud state from ZooKeeper... 
[junit4:junit4]   2> 3761 T2339 oasc.Overseer$ClusterStateUpdater.updateState Update state numShards=1 message={
[junit4:junit4]   2> 	  "operation":"state",
[junit4:junit4]   2> 	  "numShards":"1",
[junit4:junit4]   2> 	  "shard":"shard1",
[junit4:junit4]   2> 	  "roles":null,
[junit4:junit4]   2> 	  "state":"active",
[junit4:junit4]   2> 	  "core":"collection1",
[junit4:junit4]   2> 	  "collection":"control_collection",
[junit4:junit4]   2> 	  "node_name":"127.0.0.1:41796__nia",
[junit4:junit4]   2> 	  "base_url":"http://127.0.0.1:41796/_nia"}
[junit4:junit4]   2> 3777 T2338 oascc.ZkStateReader$2.process A cluster state change: WatchedEvent state:SyncConnected type:NodeDataChanged path:/clusterstate.json, has occurred - updating... (live nodes size: 2)
[junit4:junit4]   2> 3777 T2344 oascc.ZkStateReader$2.process A cluster state change: WatchedEvent state:SyncConnected type:NodeDataChanged path:/clusterstate.json, has occurred - updating... (live nodes size: 2)
[junit4:junit4]   2> 3837 T2357 oascc.ZkStateReader$2.process A cluster state change: WatchedEvent state:SyncConnected type:NodeDataChanged path:/clusterstate.json, has occurred - updating... (live nodes size: 2)
[junit4:junit4]   2> 3837 T2358 oass.IndexSchema.readSchema Reading Solr Schema
[junit4:junit4]   2> 3847 T2358 oass.IndexSchema.readSchema Schema name=test
[junit4:junit4]   2> 4273 T2358 oass.OpenExchangeRatesOrgProvider.init Initialized with rates=open-exchange-rates.json, refreshInterval=1440.
[junit4:junit4]   2> 4287 T2358 oass.IndexSchema.readSchema default search field in schema is text
[junit4:junit4]   2> 4292 T2358 oass.IndexSchema.readSchema unique key field: id
[junit4:junit4]   2> 4305 T2358 oass.FileExchangeRateProvider.reload Reloading exchange rates from file currency.xml
[junit4:junit4]   2> 4310 T2358 oass.FileExchangeRateProvider.reload Reloading exchange rates from file currency.xml
[junit4:junit4]   2> 4314 T2358 oass.OpenExchangeRatesOrgProvider.reload Reloading exchange rates from open-exchange-rates.json
[junit4:junit4]   2> 4315 T2358 oass.OpenExchangeRatesOrgProvider.reload Reloading exchange rates from open-exchange-rates.json
[junit4:junit4]   2> 4317 T2358 oasc.SolrCore.<init> [collection1] Opening new SolrCore at /usr/home/hudson/hudson-slave/workspace/Lucene-Solr-Tests-trunk-Java6/solr/build/solr-core/test/J0/./org.apache.solr.cloud.SyncSliceTest-jetty1-1356100965295/collection1/, dataDir=./org.apache.solr.cloud.SyncSliceTest-1356100961993/jetty1/
[junit4:junit4]   2> 4317 T2358 oasc.JmxMonitoredMap.<init> JMX monitoring is enabled. Adding Solr mbeans to JMX Server: com.sun.jmx.mbeanserver.JmxMBeanServer@2017b2b2
[junit4:junit4]   2> 4317 T2358 oasc.SolrCore.initDirectoryFactory solr.NRTCachingDirectoryFactory
[junit4:junit4]   2> 4318 T2358 oasc.CachingDirectoryFactory.get return new directory for /usr/home/hudson/hudson-slave/workspace/Lucene-Solr-Tests-trunk-Java6/solr/build/solr-core/test/J0/./org.apache.solr.cloud.SyncSliceTest-1356100961993/jetty1 forceNew:false
[junit4:junit4]   2> 4319 T2358 oasc.CachingDirectoryFactory.close Releasing directory:/usr/home/hudson/hudson-slave/workspace/Lucene-Solr-Tests-trunk-Java6/solr/build/solr-core/test/J0/./org.apache.solr.cloud.SyncSliceTest-1356100961993/jetty1
[junit4:junit4]   2> 4319 T2358 oasc.SolrCore.getNewIndexDir New index directory detected: old=null new=./org.apache.solr.cloud.SyncSliceTest-1356100961993/jetty1/index/
[junit4:junit4]   2> 4320 T2358 oasc.SolrCore.initIndex WARNING [collection1] Solr index directory './org.apache.solr.cloud.SyncSliceTest-1356100961993/jetty1/index' doesn't exist. Creating new index...
[junit4:junit4]   2> 4321 T2358 oasc.CachingDirectoryFactory.get return new directory for /usr/home/hudson/hudson-slave/workspace/Lucene-Solr-Tests-trunk-Java6/solr/build/solr-core/test/J0/./org.apache.solr.cloud.SyncSliceTest-1356100961993/jetty1/index forceNew:false
[junit4:junit4]   2> 4332 T2358 oasc.SolrDeletionPolicy.onCommit SolrDeletionPolicy.onCommit: commits:num=1
[junit4:junit4]   2> 		commit{dir=RateLimitedDirectoryWrapper(NRTCachingDirectory(org.apache.lucene.store.NIOFSDirectory@/usr/home/hudson/hudson-slave/workspace/Lucene-Solr-Tests-trunk-Java6/solr/build/solr-core/test/J0/org.apache.solr.cloud.SyncSliceTest-1356100961993/jetty1/index lockFactory=org.apache.lucene.store.NativeFSLockFactory@2a0c48ca; maxCacheMB=48.0 maxMergeSizeMB=4.0)),segFN=segments_1,generation=1,filenames=[segments_1]
[junit4:junit4]   2> 4333 T2358 oasc.SolrDeletionPolicy.updateCommits newest commit = 1[segments_1]
[junit4:junit4]   2> 4333 T2358 oasc.CachingDirectoryFactory.close Releasing directory:/usr/home/hudson/hudson-slave/workspace/Lucene-Solr-Tests-trunk-Java6/solr/build/solr-core/test/J0/./org.apache.solr.cloud.SyncSliceTest-1356100961993/jetty1/index
[junit4:junit4]   2> 4334 T2358 oasc.SolrCore.initWriters created xml: solr.XMLResponseWriter
[junit4:junit4]   2> 4336 T2358 oasup.UpdateRequestProcessorChain.init inserting DistributedUpdateProcessorFactory into updateRequestProcessorChain "dedupe"
[junit4:junit4]   2> 4336 T2358 oasup.UpdateRequestProcessorChain.init inserting DistributedUpdateProcessorFactory into updateRequestProcessorChain "dedupe-allfields"
[junit4:junit4]   2> 4336 T2358 oasup.UpdateRequestProcessorChain.init inserting DistributedUpdateProcessorFactory into updateRequestProcessorChain "stored_sig"
[junit4:junit4]   2> 4337 T2358 oasup.UpdateRequestProcessorChain.init inserting DistributedUpdateProcessorFactory into updateRequestProcessorChain "uniq-fields"
[junit4:junit4]   2> 4337 T2358 oasup.UpdateRequestProcessorChain.init inserting DistributedUpdateProcessorFactory into updateRequestProcessorChain "distrib-dup-test-chain-implicit"
[junit4:junit4]   2> 4338 T2358 oasc.RequestHandlers.initHandlersFromConfig adding lazy requestHandler: solr.ReplicationHandler
[junit4:junit4]   2> 4338 T2358 oasc.RequestHandlers.initHandlersFromConfig created /replication: solr.ReplicationHandler
[junit4:junit4]   2> 4339 T2358 oasc.RequestHandlers.initHandlersFromConfig created standard: solr.StandardRequestHandler
[junit4:junit4]   2> 4340 T2358 oasc.RequestHandlers.initHandlersFromConfig created /get: solr.RealTimeGetHandler
[junit4:junit4]   2> 4341 T2358 oasc.RequestHandlers.initHandlersFromConfig created dismax: solr.SearchHandler
[junit4:junit4]   2> 4342 T2358 oasc.RequestHandlers.initHandlersFromConfig created mock: org.apache.solr.core.MockQuerySenderListenerReqHandler
[junit4:junit4]   2> 4342 T2358 oasc.RequestHandlers.initHandlersFromConfig created /admin/: org.apache.solr.handler.admin.AdminHandlers
[junit4:junit4]   2> 4343 T2358 oasc.RequestHandlers.initHandlersFromConfig created defaults: solr.StandardRequestHandler
[junit4:junit4]   2> 4344 T2358 oasc.RequestHandlers.initHandlersFromConfig adding lazy requestHandler: solr.StandardRequestHandler
[junit4:junit4]   2> 4344 T2358 oasc.RequestHandlers.initHandlersFromConfig created lazy: solr.StandardRequestHandler
[junit4:junit4]   2> 4345 T2358 oasc.RequestHandlers.initHandlersFromConfig created /update: solr.UpdateRequestHandler
[junit4:junit4]   2> 4346 T2358 oasc.RequestHandlers.initHandlersFromConfig created /terms: org.apache.solr.handler.component.SearchHandler
[junit4:junit4]   2> 4347 T2358 oasc.RequestHandlers.initHandlersFromConfig created spellCheckCompRH: org.apache.solr.handler.component.SearchHandler
[junit4:junit4]   2> 4348 T2358 oasc.RequestHandlers.initHandlersFromConfig created spellCheckCompRH_Direct: org.apache.solr.handler.component.SearchHandler
[junit4:junit4]   2> 4349 T2358 oasc.RequestHandlers.initHandlersFromConfig created spellCheckWithWordbreak: org.apache.solr.handler.component.SearchHandler
[junit4:junit4]   2> 4350 T2358 oasc.RequestHandlers.initHandlersFromConfig created spellCheckWithWordbreak_Direct: org.apache.solr.handler.component.SearchHandler
[junit4:junit4]   2> 4350 T2358 oasc.RequestHandlers.initHandlersFromConfig created spellCheckCompRH1: org.apache.solr.handler.component.SearchHandler
[junit4:junit4]   2> 4351 T2358 oasc.RequestHandlers.initHandlersFromConfig created mltrh: org.apache.solr.handler.component.SearchHandler
[junit4:junit4]   2> 4352 T2358 oasc.RequestHandlers.initHandlersFromConfig created tvrh: org.apache.solr.handler.component.SearchHandler
[junit4:junit4]   2> 4353 T2358 oasc.RequestHandlers.initHandlersFromConfig created /mlt: solr.MoreLikeThisHandler
[junit4:junit4]   2> 4354 T2358 oasc.RequestHandlers.initHandlersFromConfig created /debug/dump: solr.DumpRequestHandler
[junit4:junit4]   2> 4361 T2358 oashl.XMLLoader.init xsltCacheLifetimeSeconds=60
[junit4:junit4]   2> 4366 T2358 oasc.SolrCore.initDeprecatedSupport WARNING solrconfig.xml uses deprecated <admin/gettableFiles>, Please update your config to use the ShowFileRequestHandler.
[junit4:junit4]   2> 4368 T2358 oasc.SolrCore.initDeprecatedSupport WARNING adding ShowFileRequestHandler with hidden files: [SCHEMA.XML, OLD_SYNONYMS.TXT, STOPWORDS.TXT, PROTWORDS.TXT, OPEN-EXCHANGE-RATES.JSON, SYNONYMS.TXT, CURRENCY.XML, MAPPING-ISOLATIN1ACCENT.TXT]
[junit4:junit4]   2> 4370 T2358 oasc.CachingDirectoryFactory.close Releasing directory:/usr/home/hudson/hudson-slave/workspace/Lucene-Solr-Tests-trunk-Java6/solr/build/solr-core/test/J0/./org.apache.solr.cloud.SyncSliceTest-1356100961993/jetty1
[junit4:junit4]   2> 4372 T2358 oass.SolrIndexSearcher.<init> Opening Searcher@2c5adaf9 main
[junit4:junit4]   2> 4373 T2358 oasu.CommitTracker.<init> Hard AutoCommit: disabled
[junit4:junit4]   2> 4373 T2358 oasu.CommitTracker.<init> Soft AutoCommit: disabled
[junit4:junit4]   2> 4374 T2358 oashc.SpellCheckComponent.inform Initializing spell checkers
[junit4:junit4]   2> 4380 T2358 oass.DirectSolrSpellChecker.init init: {name=direct,classname=DirectSolrSpellChecker,field=lowerfilt,minQueryLength=3}
[junit4:junit4]   2> 4438 T2359 oasc.SolrCore.registerSearcher [collection1] Registered new searcher Searcher@2c5adaf9 main{StandardDirectoryReader(segments_1:1)}
[junit4:junit4]   2> 4441 T2358 oasc.ZkController.publish publishing core=collection1 state=down
[junit4:junit4]   2> 4441 T2358 oasc.ZkController.publish numShards not found on descriptor - reading it from system property
[junit4:junit4]   2> 4788 T2339 oascc.ZkStateReader.updateClusterState Updating cloud state from ZooKeeper... 
[junit4:junit4]   2> 4789 T2339 oasc.Overseer$ClusterStateUpdater.updateState Update state numShards=1 message={
[junit4:junit4]   2> 	  "operation":"state",
[junit4:junit4]   2> 	  "numShards":"1",
[junit4:junit4]   2> 	  "shard":null,
[junit4:junit4]   2> 	  "roles":null,
[junit4:junit4]   2> 	  "state":"down",
[junit4:junit4]   2> 	  "core":"collection1",
[junit4:junit4]   2> 	  "collection":"collection1",
[junit4:junit4]   2> 	  "node_name":"127.0.0.1:41804__nia",
[junit4:junit4]   2> 	  "base_url":"http://127.0.0.1:41804/_nia"}
[junit4:junit4]   2> 4789 T2339 oasc.Overseer$ClusterStateUpdater.createCollection Create collection collection1 with numShards 1
[junit4:junit4]   2> 4790 T2339 oasc.Overseer$ClusterStateUpdater.updateState Assigning new node to shard shard=shard1
[junit4:junit4]   2> 4809 T2357 oascc.ZkStateReader$2.process A cluster state change: WatchedEvent state:SyncConnected type:NodeDataChanged path:/clusterstate.json, has occurred - updating... (live nodes size: 2)
[junit4:junit4]   2> 4809 T2344 oascc.ZkStateReader$2.process A cluster state change: WatchedEvent state:SyncConnected type:NodeDataChanged path:/clusterstate.json, has occurred - updating... (live nodes size: 2)
[junit4:junit4]   2> 4809 T2338 oascc.ZkStateReader$2.process A cluster state change: WatchedEvent state:SyncConnected type:NodeDataChanged path:/clusterstate.json, has occurred - updating... (live nodes size: 2)
[junit4:junit4]   2> 5444 T2358 oasc.CoreContainer.registerCore registering core: collection1
[junit4:junit4]   2> 5444 T2358 oasc.ZkController.register Register replica - core:collection1 address:http://127.0.0.1:41804/_nia collection:collection1 shard:shard1
[junit4:junit4]   2> 5445 T2358 oascc.SolrZkClient.makePath makePath: /collections/collection1/leader_elect/shard1/election
[junit4:junit4]   2> 5465 T2321 oazs.PrepRequestProcessor.pRequest Got user-level KeeperException when processing sessionid:0x13bbdea86d10006 type:delete cxid:0x45 zxid:0x5b txntype:-1 reqpath:n/a Error Path:/solr/collections/collection1/leaders Error:KeeperErrorCode = NoNode for /solr/collections/collection1/leaders
[junit4:junit4]   2> 5466 T2358 oasc.ShardLeaderElectionContext.runLeaderProcess Running the leader process.
[junit4:junit4]   2> 5467 T2321 oazs.PrepRequestProcessor.pRequest Got user-level KeeperException when processing sessionid:0x13bbdea86d10006 type:create cxid:0x46 zxid:0x5c txntype:-1 reqpath:n/a Error Path:/solr/overseer Error:KeeperErrorCode = NodeExists for /solr/overseer
[junit4:junit4]   2> 5478 T2358 oasc.ShardLeaderElectionContext.waitForReplicasToComeUp Enough replicas found to continue.
[junit4:junit4]   2> 5479 T2358 oasc.ShardLeaderElectionContext.runLeaderProcess I may be the new leader - try and sync
[junit4:junit4]   2> 5479 T2358 oasc.SyncStrategy.sync Sync replicas to http://127.0.0.1:41804/_nia/collection1/
[junit4:junit4]   2> 5479 T2358 oasc.SyncStrategy.syncReplicas Sync Success - now sync replicas to me
[junit4:junit4]   2> 5480 T2358 oasc.SyncStrategy.syncToMe http://127.0.0.1:41804/_nia/collection1/ has no replicas
[junit4:junit4]   2> 5480 T2358 oasc.ShardLeaderElectionContext.runLeaderProcess I am the new leader: http://127.0.0.1:41804/_nia/collection1/
[junit4:junit4]   2> 5480 T2358 oascc.SolrZkClient.makePath makePath: /collections/collection1/leaders/shard1
[junit4:junit4]   2> 5484 T2321 oazs.PrepRequestProcessor.pRequest Got user-level KeeperException when processing sessionid:0x13bbdea86d10006 type:create cxid:0x50 zxid:0x60 txntype:-1 reqpath:n/a Error Path:/solr/overseer Error:KeeperErrorCode = NodeExists for /solr/overseer
[junit4:junit4]   2> 5825 T2339 oascc.ZkStateReader.updateClusterState Updating cloud state from ZooKeeper... 
[junit4:junit4]   2> 5842 T2338 oascc.ZkStateReader$2.process A cluster state change: WatchedEvent state:SyncConnected type:NodeDataChanged path:/clusterstate.json, has occurred - updating... (live nodes size: 2)
[junit4:junit4]   2> 5842 T2357 oascc.ZkStateReader$2.process A cluster state change: WatchedEvent state:SyncConnected type:NodeDataChanged path:/clusterstate.json, has occurred - updating... (live nodes size: 2)
[junit4:junit4]   2> 5842 T2344 oascc.ZkStateReader$2.process A cluster state change: WatchedEvent state:SyncConnected type:NodeDataChanged path:/clusterstate.json, has occurred - updating... (live nodes size: 2)
[junit4:junit4]   2> 5850 T2358 oasc.ZkController.register We are http://127.0.0.1:41804/_nia/collection1/ and leader is http://127.0.0.1:41804/_nia/collection1/
[junit4:junit4]   2> 5850 T2358 oasc.ZkController.register No LogReplay needed for core=collection1 baseURL=http://127.0.0.1:41804/_nia
[junit4:junit4]   2> 5850 T2358 oasc.ZkController.checkRecovery I am the leader, no recovery necessary
[junit4:junit4]   2> 5851 T2358 oasc.ZkController.publish publishing core=collection1 state=active
[junit4:junit4]   2> 5851 T2358 oasc.ZkController.publish numShards not found on descriptor - reading it from system property
[junit4:junit4]   2> 5854 T2358 oascc.ZkStateReader.updateClusterState Updating cloud state from ZooKeeper... 
[junit4:junit4]   2> 5855 T2316 oass.SolrDispatchFilter.init user.dir=/usr/home/hudson/hudson-slave/workspace/Lucene-Solr-Tests-trunk-Java6/solr/build/solr-core/test/J0
[junit4:junit4]   2> 5856 T2316 oass.SolrDispatchFilter.init SolrDispatchFilter.init() done
[junit4:junit4]   2> 5857 T2316 oascsi.HttpClientUtil.createClient Creating new http client, config:maxConnections=128&maxConnectionsPerHost=32&followRedirects=false
[junit4:junit4]   2> 6032 T2316 oejs.Server.doStart jetty-8.1.8.v20121106
[junit4:junit4]   2> 6035 T2316 oejs.AbstractConnector.doStart Started SocketConnector@127.0.0.1:41810
[junit4:junit4]   2> 6036 T2316 oasc.SolrResourceLoader.locateSolrHome JNDI not configured for solr (NoInitialContextEx)
[junit4:junit4]   2> 6037 T2316 oasc.SolrResourceLoader.locateSolrHome using system property solr.solr.home: /usr/home/hudson/hudson-slave/workspace/Lucene-Solr-Tests-trunk-Java6/solr/build/solr-core/test/J0/./org.apache.solr.cloud.SyncSliceTest-jetty2-1356100967858
[junit4:junit4]   2> 6038 T2316 oasc.SolrResourceLoader.<init> new SolrResourceLoader for deduced Solr Home: '/usr/home/hudson/hudson-slave/workspace/Lucene-Solr-Tests-trunk-Java6/solr/build/solr-core/test/J0/./org.apache.solr.cloud.SyncSliceTest-jetty2-1356100967858/'
[junit4:junit4]   2> 6074 T2316 oass.SolrDispatchFilter.init SolrDispatchFilter.init()
[junit4:junit4]   2> 6076 T2316 oasc.SolrResourceLoader.locateSolrHome JNDI not configured for solr (NoInitialContextEx)
[junit4:junit4]   2> 6076 T2316 oasc.SolrResourceLoader.locateSolrHome using system property solr.solr.home: /usr/home/hudson/hudson-slave/workspace/Lucene-Solr-Tests-trunk-Java6/solr/build/solr-core/test/J0/./org.apache.solr.cloud.SyncSliceTest-jetty2-1356100967858
[junit4:junit4]   2> 6077 T2316 oasc.CoreContainer$Initializer.initialize looking for solr.xml: /usr/home/hudson/hudson-slave/workspace/Lucene-Solr-Tests-trunk-Java6/solr/build/solr-core/test/J0/./org.apache.solr.cloud.SyncSliceTest-jetty2-1356100967858/solr.xml
[junit4:junit4]   2> 6077 T2316 oasc.CoreContainer.<init> New CoreContainer 209742790
[junit4:junit4]   2> 6078 T2316 oasc.CoreContainer.load Loading CoreContainer using Solr Home: '/usr/home/hudson/hudson-slave/workspace/Lucene-Solr-Tests-trunk-Java6/solr/build/solr-core/test/J0/./org.apache.solr.cloud.SyncSliceTest-jetty2-1356100967858/'
[junit4:junit4]   2> 6079 T2316 oasc.SolrResourceLoader.<init> new SolrResourceLoader for directory: '/usr/home/hudson/hudson-slave/workspace/Lucene-Solr-Tests-trunk-Java6/solr/build/solr-core/test/J0/./org.apache.solr.cloud.SyncSliceTest-jetty2-1356100967858/'
[junit4:junit4]   2> 6102 T2316 oashc.HttpShardHandlerFactory.getParameter Setting socketTimeout to: 30000
[junit4:junit4]   2> 6103 T2316 oashc.HttpShardHandlerFactory.getParameter Setting urlScheme to: http://
[junit4:junit4]   2> 6104 T2316 oashc.HttpShardHandlerFactory.getParameter Setting connTimeout to: 15000
[junit4:junit4]   2> 6105 T2316 oashc.HttpShardHandlerFactory.getParameter Setting maxConnectionsPerHost to: 20
[junit4:junit4]   2> 6105 T2316 oashc.HttpShardHandlerFactory.getParameter Setting corePoolSize to: 0
[junit4:junit4]   2> 6106 T2316 oashc.HttpShardHandlerFactory.getParameter Setting maximumPoolSize to: 2147483647
[junit4:junit4]   2> 6107 T2316 oashc.HttpShardHandlerFactory.getParameter Setting maxThreadIdleTime to: 5
[junit4:junit4]   2> 6107 T2316 oashc.HttpShardHandlerFactory.getParameter Setting sizeOfQueue to: -1
[junit4:junit4]   2> 6108 T2316 oashc.HttpShardHandlerFactory.getParameter Setting fairnessPolicy to: false
[junit4:junit4]   2> 6109 T2316 oascsi.HttpClientUtil.createClient Creating new http client, config:maxConnectionsPerHost=20&maxConnections=10000&socketTimeout=30000&connTimeout=15000&retry=false
[junit4:junit4]   2> 6127 T2316 oasc.CoreContainer.load Registering Log Listener
[junit4:junit4]   2> 6145 T2316 oasc.CoreContainer.initZooKeeper Zookeeper client=127.0.0.1:41793/solr
[junit4:junit4]   2> 6146 T2316 oasc.ZkController.checkChrootPath zkHost includes chroot
[junit4:junit4]   2> 6147 T2316 oaz.ZooKeeper.<init> Initiating client connection, connectString=127.0.0.1:41793 sessionTimeout=60000 watcher=org.apache.solr.common.cloud.ConnectionManager@56794b54
[junit4:junit4]   2> 6148 T2316 oascc.ConnectionManager.waitForConnected Waiting for client to connect to ZooKeeper
[junit4:junit4]   2> 6149 T2369 oaz.ClientCnxn$SendThread.logStartConnect Opening socket connection to server localhost/127.0.0.1:41793. Will not attempt to authenticate using SASL (access denied (javax.security.auth.AuthPermission getLoginConfiguration))
[junit4:junit4]   2> 6149 T2369 oaz.ClientCnxn$SendThread.primeConnection Socket connection established to localhost/127.0.0.1:41793, initiating session
[junit4:junit4]   2> 6150 T2318 oazs.NIOServerCnxnFactory.run Accepted socket connection from /140.211.11.196:41811
[junit4:junit4]   2> 6150 T2318 oazs.ZooKeeperServer.processConnectRequest Client attempting to establish new session at /140.211.11.196:41811
[junit4:junit4]   2> 6152 T2320 oazs.ZooKeeperServer.finishSessionInit Established session 0x13bbdea86d10007 with negotiated timeout 20000 for client /140.211.11.196:41811
[junit4:junit4]   2> 6152 T2369 oaz.ClientCnxn$SendThread.onConnected Session establishment complete on server localhost/127.0.0.1:41793, sessionid = 0x13bbdea86d10007, negotiated timeout = 20000
[junit4:junit4]   2> 6153 T2370 oascc.ConnectionManager.process Watcher org.apache.solr.common.cloud.ConnectionManager@56794b54 name:ZooKeeperConnection Watcher:127.0.0.1:41793 got event WatchedEvent state:SyncConnected type:None path:null path:null type:None
[junit4:junit4]   2> 6153 T2316 oascc.ConnectionManager.waitForConnected Client is connected to ZooKeeper
[junit4:junit4]   2> 6155 T2321 oazs.PrepRequestProcessor.pRequest2Txn Processed session termination for sessionid: 0x13bbdea86d10007
[junit4:junit4]   2> 6156 T2370 oaz.ClientCnxn$EventThread.run EventThread shut down
[junit4:junit4]   2> 6156 T2318 oazs.NIOServerCnxn.closeSock Closed socket connection for client /140.211.11.196:41811 which had sessionid 0x13bbdea86d10007
[junit4:junit4]   2> 6156 T2316 oaz.ZooKeeper.close Session: 0x13bbdea86d10007 closed
[junit4:junit4]   2> 6157 T2316 oascsi.HttpClientUtil.createClient Creating new http client, config:maxConnections=500&maxConnectionsPerHost=16&socketTimeout=15000&connTimeout=30000
[junit4:junit4]   2> 6166 T2316 oaz.ZooKeeper.<init> Initiating client connection, connectString=127.0.0.1:41793/solr sessionTimeout=30000 watcher=org.apache.solr.common.cloud.ConnectionManager@b204ca6
[junit4:junit4]   2> 6167 T2371 oaz.ClientCnxn$SendThread.logStartConnect Opening socket connection to server localhost/127.0.0.1:41793. Will not attempt to authenticate using SASL (access denied (javax.security.auth.AuthPermission getLoginConfiguration))
[junit4:junit4]   2> 6167 T2316 oascc.ConnectionManager.waitForConnected Waiting for client to connect to ZooKeeper
[junit4:junit4]   2> 6168 T2371 oaz.ClientCnxn$SendThread.primeConnection Socket connection established to localhost/127.0.0.1:41793, initiating session
[junit4:junit4]   2> 6168 T2318 oazs.NIOServerCnxnFactory.run Accepted socket connection from /140.211.11.196:41812
[junit4:junit4]   2> 6168 T2318 oazs.ZooKeeperServer.processConnectRequest Client attempting to establish new session at /140.211.11.196:41812
[junit4:junit4]   2> 6170 T2320 oazs.ZooKeeperServer.finishSessionInit Established session 0x13bbdea86d10008 with negotiated timeout 20000 for client /140.211.11.196:41812
[junit4:junit4]   2> 6170 T2371 oaz.ClientCnxn$SendThread.onConnected Session establishment complete on server localhost/127.0.0.1:41793, sessionid = 0x13bbdea86d10008, negotiated timeout = 20000
[junit4:junit4]   2> 6170 T2372 oascc.ConnectionManager.process Watcher org.apache.solr.common.cloud.ConnectionManager@b204ca6 name:ZooKeeperConnection Watcher:127.0.0.1:41793/solr got event WatchedEvent state:SyncConnected type:None path:null path:null type:None
[junit4:junit4]   2> 6170 T2316 oascc.ConnectionManager.waitForConnected Client is connected to ZooKeeper
[junit4:junit4]   2> 6172 T2321 oazs.PrepRequestProcessor.pRequest Got user-level KeeperException when processing sessionid:0x13bbdea86d10008 type:create cxid:0x1 zxid:0x6d txntype:-1 reqpath:n/a Error Path:/solr/overseer Error:KeeperErrorCode = NodeExists for /solr/overseer
[junit4:junit4]   2> 6173 T2321 oazs.PrepRequestProcessor.pRequest Got user-level KeeperException when processing sessionid:0x13bbdea86d10008 type:create cxid:0x2 zxid:0x6e txntype:-1 reqpath:n/a Error Path:/solr/overseer Error:KeeperErrorCode = NodeExists for /solr/overseer
[junit4:junit4]   2> 6174 T2316 oasc.ZkController.createEphemeralLiveNode Register node as live in ZooKeeper:/live_nodes/127.0.0.1:41810__nia
[junit4:junit4]   2> 6175 T2321 oazs.PrepRequestProcessor.pRequest Got user-level KeeperException when processing sessionid:0x13bbdea86d10008 type:delete cxid:0x4 zxid:0x6f txntype:-1 reqpath:n/a Error Path:/solr/live_nodes/127.0.0.1:41810__nia Error:KeeperErrorCode = NoNode for /solr/live_nodes/127.0.0.1:41810__nia
[junit4:junit4]   2> 6186 T2316 oascc.SolrZkClient.makePath makePath: /live_nodes/127.0.0.1:41810__nia
[junit4:junit4]   2> 6189 T2344 oascc.ZkStateReader$3.process Updating live nodes... (3)
[junit4:junit4]   2> 6189 T2357 oascc.ZkStateReader$3.process Updating live nodes... (3)
[junit4:junit4]   2> 6189 T2344 oascc.ZkStateReader$2.process A cluster state change: WatchedEvent state:SyncConnected type:NodeChildrenChanged path:/live_nodes, has occurred - updating... (live nodes size: 3)
[junit4:junit4]   2> 6189 T2338 oascc.ZkStateReader$3.process Updating live nodes... (3)
[junit4:junit4]   2> 6190 T2357 oascc.ZkStateReader$2.process A cluster state change: WatchedEvent state:SyncConnected type:NodeChildrenChanged path:/live_nodes, has occurred - updating... (live nodes size: 3)
[junit4:junit4]   2> 6190 T2338 oascc.ZkStateReader$2.process A cluster state change: WatchedEvent state:SyncConnected type:NodeChildrenChanged path:/live_nodes, has occurred - updating... (live nodes size: 3)
[junit4:junit4]   2> 6193 T2316 oascc.ZkStateReader.createClusterStateWatchersAndUpdate Updating cluster state from ZooKeeper... 
[junit4:junit4]   2> 6201 T2373 oasc.CoreContainer.create Creating SolrCore 'collection1' using instanceDir: /usr/home/hudson/hudson-slave/workspace/Lucene-Solr-Tests-trunk-Java6/solr/build/solr-core/test/J0/./org.apache.solr.cloud.SyncSliceTest-jetty2-1356100967858/collection1
[junit4:junit4]   2> 6201 T2373 oasc.ZkController.createCollectionZkNode Check for collection zkNode:collection1
[junit4:junit4]   2> 6202 T2373 oasc.ZkController.createCollectionZkNode Collection zkNode exists
[junit4:junit4]   2> 6202 T2373 oasc.ZkController.readConfigName Load collection config from:/collections/collection1
[junit4:junit4]   2> 6203 T2373 oasc.SolrResourceLoader.<init> new SolrResourceLoader for directory: '/usr/home/hudson/hudson-slave/workspace/Lucene-Solr-Tests-trunk-Java6/solr/build/solr-core/test/J0/./org.apache.solr.cloud.SyncSliceTest-jetty2-1356100967858/collection1/'
[junit4:junit4]   2> 6204 T2373 oasc.SolrResourceLoader.replaceClassLoader Adding 'file:/usr/home/hudson/hudson-slave/workspace/Lucene-Solr-Tests-trunk-Java6/solr/build/solr-core/test/J0/org.apache.solr.cloud.SyncSliceTest-jetty2-1356100967858/collection1/lib/classes/' to classloader
[junit4:junit4]   2> 6205 T2373 oasc.SolrResourceLoader.replaceClassLoader Adding 'file:/usr/home/hudson/hudson-slave/workspace/Lucene-Solr-Tests-trunk-Java6/solr/build/solr-core/test/J0/org.apache.solr.cloud.SyncSliceTest-jetty2-1356100967858/collection1/lib/README' to classloader
[junit4:junit4]   2> 6260 T2373 oasc.SolrConfig.<init> Using Lucene MatchVersion: LUCENE_50
[junit4:junit4]   2> 6334 T2373 oasc.SolrConfig.<init> Loaded SolrConfig: solrconfig.xml
[junit4:junit4]   2> 6356 T2339 oascc.ZkStateReader.updateClusterState Updating cloud state from ZooKeeper... 
[junit4:junit4]   2> 6357 T2339 oasc.Overseer$ClusterStateUpdater.updateState Update state numShards=1 message={
[junit4:junit4]   2> 	  "operation":"state",
[junit4:junit4]   2> 	  "numShards":"1",
[junit4:junit4]   2> 	  "shard":"shard1",
[junit4:junit4]   2> 	  "roles":null,
[junit4:junit4]   2> 	  "state":"active",
[junit4:junit4]   2> 	  "core":"collection1",
[junit4:junit4]   2> 	  "collection":"collection1",
[junit4:junit4]   2> 	  "node_name":"127.0.0.1:41804__nia",
[junit4:junit4]   2> 	  "base_url":"http://127.0.0.1:41804/_nia"}
[junit4:junit4]   2> 6370 T2357 oascc.ZkStateReader$2.process A cluster state change: WatchedEvent state:SyncConnected type:NodeDataChanged path:/clusterstate.json, has occurred - updating... (live nodes size: 3)
[junit4:junit4]   2> 6370 T2344 oascc.ZkStateReader$2.process A cluster state change: WatchedEvent state:SyncConnected type:NodeDataChanged path:/clusterstate.json, has occurred - updating... (live nodes size: 3)
[junit4:junit4]   2> 6370 T2338 oascc.ZkStateReader$2.process A cluster state change: WatchedEvent state:SyncConnected type:NodeDataChanged path:/clusterstate.json, has occurred - updating... (live nodes size: 3)
[junit4:junit4]   2> 6435 T2372 oascc.ZkStateReader$2.process A cluster state change: WatchedEvent state:SyncConnected type:NodeDataChanged path:/clusterstate.json, has occurred - updating... (live nodes size: 3)
[junit4:junit4]   2> 6435 T2373 oass.IndexSchema.readSchema Reading Solr Schema
[junit4:junit4]   2> 6446 T2373 oass.IndexSchema.readSchema Schema name=test
[junit4:junit4]   2> 7076 T2373 oass.OpenExchangeRatesOrgProvider.init Initialized with rates=open-exchange-rates.json, refreshInterval=1440.
[junit4:junit4]   2> 7089 T2373 oass.IndexSchema.readSchema default search field in schema is text
[junit4:junit4]   2> 7093 T2373 oass.IndexSchema.readSchema unique key field: id
[junit4:junit4]   2> 7107 T2373 oass.FileExchangeRateProvider.reload Reloading exchange rates from file currency.xml
[junit4:junit4]   2> 7113 T2373 oass.FileExchangeRateProvider.reload Reloading exchange rates from file currency.xml
[junit4:junit4]   2> 7117 T2373 oass.OpenExchangeRatesOrgProvider.reload Reloading exchange rates from open-exchange-rates.json
[junit4:junit4]   2> 7118 T2373 oass.OpenExchangeRatesOrgProvider.reload Reloading exchange rates from open-exchange-rates.json
[junit4:junit4]   2> 7120 T2373 oasc.SolrCore.<init> [collection1] Opening new SolrCore at /usr/home/hudson/hudson-slave/workspace/Lucene-Solr-Tests-trunk-Java6/solr/build/solr-core/test/J0/./org.apache.solr.cloud.SyncSliceTest-jetty2-1356100967858/collection1/, dataDir=./org.apache.solr.cloud.SyncSliceTest-1356100961993/jetty2/
[junit4:junit4]   2> 7120 T2373 oasc.JmxMonitoredMap.<init> JMX monitoring is enabled. Adding Solr mbeans to JMX Server: com.sun.jmx.mbeanserver.JmxMBeanServer@2017b2b2
[junit4:junit4]   2> 7121 T2373 oasc.SolrCore.initDirectoryFactory solr.NRTCachingDirectoryFactory
[junit4:junit4]   2> 7121 T2373 oasc.CachingDirectoryFactory.get return new directory for /usr/home/hudson/hudson-slave/workspace/Lucene-Solr-Tests-trunk-Java6/solr/build/solr-core/test/J0/./org.apache.solr.cloud.SyncSliceTest-1356100961993/jetty2 forceNew:false
[junit4:junit4]   2> 7122 T2373 oasc.CachingDirectoryFactory.close Releasing directory:/usr/home/hudson/hudson-slave/workspace/Lucene-Solr-Tests-trunk-Java6/solr/build/solr-core/test/J0/./org.apache.solr.cloud.SyncSliceTest-1356100961993/jetty2
[junit4:junit4]   2> 7122 T2373 oasc.SolrCore.getNewIndexDir New index directory detected: old=null new=./org.apache.solr.cloud.SyncSliceTest-1356100961993/jetty2/index/
[junit4:junit4]   2> 7123 T2373 oasc.SolrCore.initIndex WARNING [collection1] Solr index directory './org.apache.solr.cloud.SyncSliceTest-1356100961993/jetty2/index' doesn't exist. Creating new index...
[junit4:junit4]   2> 7124 T2373 oasc.CachingDirectoryFactory.get return new directory for /usr/home/hudson/hudson-slave/workspace/Lucene-Solr-Tests-trunk-Java6/solr/build/solr-core/test/J0/./org.apache.solr.cloud.SyncSliceTest-1356100961993/jetty2/index forceNew:false
[junit4:junit4]   2> 7144 T2373 oasc.SolrDeletionPolicy.onCommit SolrDeletionPolicy.onCommit: commits:num=1
[junit4:junit4]   2> 		commit{dir=RateLimitedDirectoryWrapper(NRTCachingDirectory(org.apache.lucene.store.NIOFSDirectory@/usr/home/hudson/hudson-slave/workspace/Lucene-Solr-Tests-trunk-Java6/solr/build/solr-core/test/J0/org.apache.solr.cloud.SyncSliceTest-1356100961993/jetty2/index lockFactory=org.apache.lucene.store.NativeFSLockFactory@76f5d0df; maxCacheMB=48.0 maxMergeSizeMB=4.0)),segFN=segments_1,generation=1,filenames=[segments_1]
[junit4:junit4]   2> 7144 T2373 oasc.SolrDeletionPolicy.updateCommits newest commit = 1[segments_1]
[junit4:junit4]   2> 7145 T2373 oasc.CachingDirectoryFactory.close Releasing directory:/usr/home/hudson/hudson-slave/workspace/Lucene-Solr-Tests-trunk-Java6/solr/build/solr-core/test/J0/./org.apache.solr.cloud.SyncSliceTest-1356100961993/jetty2/index
[junit4:junit4]   2> 7145 T2373 oasc.SolrCore.initWriters created xml: solr.XMLResponseWriter
[junit4:junit4]   2> 7147 T2373 oasup.UpdateRequestProcessorChain.init inserting DistributedUpdateProcessorFactory into updateRequestProcessorChain "dedupe"
[junit4:junit4]   2> 7148 T2373 oasup.UpdateRequestProcessorChain.init inserting DistributedUpdateProcessorFactory into updateRequestProcessorChain "dedupe-allfields"
[junit4:junit4]   2> 7148 T2373 oasup.UpdateRequestProcessorChain.init inserting DistributedUpdateProcessorFactory into updateRequestProcessorChain "stored_sig"
[junit4:junit4]   2> 7148 T2373 oasup.UpdateRequestProcessorChain.init inserting DistributedUpdateProcessorFactory into updateRequestProcessorChain "uniq-fields"
[junit4:junit4]   2> 7149 T2373 oasup.UpdateRequestProcessorChain.init inserting DistributedUpdateProcessorFactory into updateRequestProcessorChain "distrib-dup-test-chain-implicit"
[junit4:junit4]   2> 7149 T2373 oasc.RequestHandlers.initHandlersFromConfig adding lazy requestHandler: solr.ReplicationHandler
[junit4:junit4]   2> 7150 T2373 oasc.RequestHandlers.initHandlersFromConfig created /replication: solr.ReplicationHandler
[junit4:junit4]   2> 7151 T2373 oasc.RequestHandlers.initHandlersFromConfig created standard: solr.StandardRequestHandler
[junit4:junit4]   2> 7152 T2373 oasc.RequestHandlers.initHandlersFromConfig created /get: solr.RealTimeGetHandler
[junit4:junit4]   2> 7153 T2373 oasc.RequestHandlers.initHandlersFromConfig created dismax: solr.SearchHandler
[junit4:junit4]   2> 7154 T2373 oasc.RequestHandlers.initHandlersFromConfig created mock: org.apache.solr.core.MockQuerySenderListenerReqHandler
[junit4:junit4]   2> 7154 T2373 oasc.RequestHandlers.initHandlersFromConfig created /admin/: org.apache.solr.handler.admin.AdminHandlers
[junit4:junit4]   2> 7155 T2373 oasc.RequestHandlers.initHandlersFromConfig created defaults: solr.StandardRequestHandler
[junit4:junit4]   2> 7155 T2373 oasc.RequestHandlers.initHandlersFromConfig adding lazy requestHandler: solr.StandardRequestHandler
[junit4:junit4]   2> 7156 T2373 oasc.RequestHandlers.initHandlersFromConfig created lazy: solr.StandardRequestHandler
[junit4:junit4]   2> 7157 T2373 oasc.RequestHandlers.initHandlersFromConfig created /update: solr.UpdateRequestHandler
[junit4:junit4]   2> 7158 T2373 oasc.RequestHandlers.initHandlersFromConfig created /terms: org.apache.solr.handler.component.SearchHandler
[junit4:junit4]   2> 7159 T2373 oasc.RequestHandlers.initHandlersFromConfig created spellCheckCompRH: org.apache.solr.handler.component.SearchHandler
[junit4:junit4]   2> 7159 T2373 oasc.RequestHandlers.initHandlersFromConfig created spellCheckCompRH_Direct: org.apache.solr.handler.component.SearchHandler
[junit4:junit4]   2> 7160 T2373 oasc.RequestHandlers.initHandlersFromConfig created spellCheckWithWordbreak: org.apache.solr.handler.component.SearchHandler
[junit4:junit4]   2> 7161 T2373 oasc.RequestHandlers.initHandlersFromConfig created spellCheckWithWordbreak_Direct: org.apache.solr.handler.component.SearchHandler
[junit4:junit4]   2> 7162 T2373 oasc.RequestHandlers.initHandlersFromConfig created spellCheckCompRH1: org.apache.solr.handler.component.SearchHandler
[junit4:junit4]   2> 7163 T2373 oasc.RequestHandlers.initHandlersFromConfig created mltrh: org.apache.solr.handler.component.SearchHandler
[junit4:junit4]   2> 7164 T2373 oasc.RequestHandlers.initHandlersFromConfig created tvrh: org.apache.solr.handler.component.SearchHandler
[junit4:junit4]   2> 7165 T2373 oasc.RequestHandlers.initHandlersFromConfig created /mlt: solr.MoreLikeThisHandler
[junit4:junit4]   2> 7166 T2373 oasc.RequestHandlers.initHandlersFromConfig created /debug/dump: solr.DumpRequestHandler
[junit4:junit4]   2> 7173 T2373 oashl.XMLLoader.init xsltCacheLifetimeSeconds=60
[junit4:junit4]   2> 7178 T2373 oasc.SolrCore.initDeprecatedSupport WARNING solrconfig.xml uses deprecated <admin/gettableFiles>, Please update your config to use the ShowFileRequestHandler.
[junit4:junit4]   2> 7179 T2373 oasc.SolrCore.initDeprecatedSupport WARNING adding ShowFileRequestHandler with hidden files: [SCHEMA.XML, OLD_SYNONYMS.TXT, STOPWORDS.TXT, PROTWORDS.TXT, OPEN-EXCHANGE-RATES.JSON, SYNONYMS.TXT, CURRENCY.XML, MAPPING-ISOLATIN1ACCENT.TXT]
[junit4:junit4]   2> 7182 T2373 oasc.CachingDirectoryFactory.close Releasing directory:/usr/home/hudson/hudson-slave/workspace/Lucene-Solr-Tests-trunk-Java6/solr/build/solr-core/test/J0/./org.apache.solr.cloud.SyncSliceTest-1356100961993/jetty2
[junit4:junit4]   2> 7183 T2373 oass.SolrIndexSearcher.<init> Opening Searcher@54c55d65 main
[junit4:junit4]   2> 7185 T2373 oasu.CommitTracker.<init> Hard AutoCommit: disabled
[junit4:junit4]   2> 7185 T2373 oasu.CommitTracker.<init> Soft AutoCommit: disabled
[junit4:junit4]   2> 7185 T2373 oashc.SpellCheckComponent.inform Initializing spell checkers
[junit4:junit4]   2> 7192 T2373 oass.DirectSolrSpellChecker.init init: {name=direct,classname=DirectSolrSpellChecker,field=lowerfilt,minQueryLength=3}
[junit4:junit4]   2> 7244 T2374 oasc.SolrCore.registerSearcher [collection1] Registered new searcher Searcher@54c55d65 main{StandardDirectoryReader(segments_1:1)}
[junit4:junit4]   2> 7248 T2373 oasc.ZkController.publish publishing core=collection1 state=down
[junit4:junit4]   2> 7248 T2373 oasc.ZkController.publish numShards not found on descriptor - reading it from system property
[junit4:junit4]   2> 7377 T2339 oascc.ZkStateReader.updateClusterState Updating cloud state from ZooKeeper... 
[junit4:junit4]   2> 7378 T2339 oasc.Overseer$ClusterStateUpdater.updateState Update state numShards=1 message={
[junit4:junit4]   2> 	  "operation":"state",
[junit4:junit4]   2> 	  "numShards":"1",
[junit4:junit4]   2> 	  "shard":null,
[junit4:junit4]   2> 	  "roles":null,
[junit4:junit4]   2> 	  "state":"down",
[junit4:junit4]   2> 	  "core":"collection1",
[junit4:junit4]   2> 	  "collection":"collection1",
[junit4:junit4]   2> 	  "node_name":"127.0.0.1:41810__nia",
[junit4:junit4]   2> 	  "base_url":"http://127.0.0.1:41810/_nia"}
[junit4:junit4]   2> 7378 T2339 oasc.Overseer$ClusterStateUpdater.updateState Collection already exists with numShards=1
[junit4:junit4]   2> 7379 T2339 oasc.Overseer$ClusterStateUpdater.updateState Assigning new node to shard shard=shard1
[junit4:junit4]   2> 7386 T2357 oascc.ZkStateReader$2.process A cluster state change: WatchedEvent state:SyncConnected type:NodeDataChanged path:/clusterstate.json, has occurred - updating... (live nodes size: 3)
[junit4:junit4]   2> 7386 T2338 oascc.ZkStateReader$2.process A cluster state change: WatchedEvent state:SyncConnected type:NodeDataChanged path:/clusterstate.json, has occurred - updating... (live nodes size: 3)
[junit4:junit4]   2> 7386 T2372 oascc.ZkStateReader$2.process A cluster state change: WatchedEvent state:SyncConnected type:NodeDataChanged path:/clusterstate.json, has occurred - updating... (live nodes size: 3)
[junit4:junit4]   2> 7386 T2344 oascc.ZkStateReader$2.process A cluster state change: WatchedEvent state:SyncConnected type:NodeDataChanged path:/clusterstate.json, has occurred - updating... (live nodes size: 3)
[junit4:junit4]   2> 8251 T2373 oasc.CoreContainer.registerCore registering core: collection1
[junit4:junit4]   2> 8251 T2373 oasc.ZkController.register Register replica - core:collection1 address:http://127.0.0.1:41810/_nia collection:collection1 shard:shard1
[junit4:junit4]   2> 8255 T2373 oasc.ZkController.register We are http://127.0.0.1:41810/_nia/collection1/ and leader is http://127.0.0.1:41804/_nia/collection1/
[junit4:junit4]   2> 8256 T2373 oasc.ZkController.register No LogReplay needed for core=collection1 baseURL=http://127.0.0.1:41810/_nia
[junit4:junit4]   2> 8256 T2373 oasc.ZkController.checkRecovery Core needs to recover:collection1
[junit4:junit4]   2> 8256 T2373 oasu.DefaultSolrCoreState.doRecovery Running recovery - first canceling any ongoing recovery
[junit4:junit4]   2> ASYNC  NEW_CORE C169 name=collection1 org.apache.solr.core.SolrCore@21c1201f url=http://127.0.0.1:41810/_nia/collection1 node=127.0.0.1:41810__nia C169_STATE=coll:collection1 core:collection1 props:{shard=null, roles=null, state=down, core=collection1, collection=collection1, node_name=127.0.0.1:41810__nia, base_url=http://127.0.0.1:41810/_nia}
[junit4:junit4]   2> 8257 T2375 C169 P41810 oasc.RecoveryStrategy.run Starting recovery process.  core=collection1 recoveringAfterStartup=true
[junit4:junit4]   2> 8258 T2375 C169 P41810 oasc.RecoveryStrategy.doRecovery ###### startupVersions=[]
[junit4:junit4]   2> 8258 T2375 C169 P41810 oasc.ZkController.publish publishing core=collection1 state=recovering
[junit4:junit4]   2> 8258 T2373 oascc.ZkStateReader.updateClusterState Updating cloud state from ZooKeeper... 
[junit4:junit4]   2> 8258 T2375 C169 P41810 oasc.ZkController.publish numShards not found on descriptor - reading it from system property
[junit4:junit4]   2> 8260 T2375 C169 P41810 oasc.RecoveryStrategy.doRecovery Attempting to PeerSync from http://127.0.0.1:41804/_nia/collection1/ core=collection1 - recoveringAfterStartup=true
[junit4:junit4]   2> 8259 T2316 oass.SolrDispatchFilter.init user.dir=/usr/home/hudson/hudson-slave/workspace/Lucene-Solr-Tests-trunk-Java6/solr/build/solr-core/test/J0
[junit4:junit4]   2> 8260 T2375 C169 P41810 oasu.PeerSync.sync PeerSync: core=collection1 url=http://127.0.0.1:41810/_nia START replicas=[http://127.0.0.1:41804/_nia/collection1/] nUpdates=100
[junit4:junit4]   2> 8261 T2316 oass.SolrDispatchFilter.init SolrDispatchFilter.init() done
[junit4:junit4]   2> 8261 T2375 C169 P41810 oasu.PeerSync.sync WARNING no frame of reference to tell of we've missed updates
[junit4:junit4]   2> 8262 T2375 C169 P41810 oasc.RecoveryStrategy.doRecovery PeerSync Recovery was not successful - trying replication. core=collection1
[junit4:junit4]   2> 8262 T2316 oascsi.HttpClientUtil.createClient Creating new http client, config:maxConnections=128&maxConnectionsPerHost=32&followRedirects=false
[junit4:junit4]   2> 8262 T2375 C169 P41810 oasc.RecoveryStrategy.doRecovery Starting Replication Recovery. core=collection1
[junit4:junit4]   2> 8263 T2375 C169 P41810 oascsi.HttpClientUtil.createClient Creating new http client, config:maxConnections=128&maxConnectionsPerHost=32&followRedirects=false
[junit4:junit4]   2> ASYNC  NEW_CORE C170 name=collection1 org.apache.solr.core.SolrCore@62b8db2c url=http://127.0.0.1:41804/_nia/collection1 node=127.0.0.1:41804__nia C170_STATE=coll:collection1 core:collection1 props:{shard=shard1, roles=null, state=active, core=collection1, collection=collection1, node_name=127.0.0.1:41804__nia, base_url=http://127.0.0.1:41804/_nia, leader=true}
[junit4:junit4]   2> 8271 T2347 C170 P41804 REQ /get {distrib=false&qt=/get&wt=javabin&version=2&getVersions=100} status=0 QTime=0 
[junit4:junit4]   2> 8395 T2339 oascc.ZkStateReader.updateClusterState Updating cloud state from ZooKeeper... 
[junit4:junit4]   2> 8396 T2339 oasc.Overseer$ClusterStateUpdater.updateState Update state numShards=1 message={
[junit4:junit4]   2> 	  "operation":"state",
[junit4:junit4]   2> 	  "numShards":"1",
[junit4:junit4]   2> 	  "shard":"shard1",
[junit4:junit4]   2> 	  "roles":null,
[junit4:junit4]   2> 	  "state":"recovering",
[junit4:junit4]   2> 	  "core":"collection1",
[junit4:junit4]   2> 	  "collection":"collection1",
[junit4:junit4]   2> 	  "node_name":"127.0.0.1:41810__nia",
[junit4:junit4]   2> 	  "base_url":"http://127.0.0.1:41810/_nia"}
[junit4:junit4]   2> 8402 T2357 oascc.ZkStateReader$2.process A cluster state change: WatchedEvent state:SyncConnected type:NodeDataChanged path:/clusterstate.json, has occurred - updating... (live nodes size: 3)
[junit4:junit4]   2> 8402 T2372 oascc.ZkStateReader$2.process A cluster state change: WatchedEvent state:SyncConnected type:NodeDataChanged path:/clusterstate.json, has occurred - updating... (live nodes size: 3)
[junit4:junit4]   2> 8402 T2338 oascc.ZkStateReader$2.process A cluster state change: WatchedEvent state:SyncConnected type:NodeDataChanged path:/clusterstate.json, has occurred - updating... (live nodes size: 3)
[junit4:junit4]   2> 8402 T2344 oascc.ZkStateReader$2.process A cluster state change: WatchedEvent state:SyncConnected type:NodeDataChanged path:/clusterstate.json, has occurred - updating... (live nodes size: 3)
[junit4:junit4]   2> 8457 T2316 oejs.Server.doStart jetty-8.1.8.v20121106
[junit4:junit4]   2> 8460 T2316 oejs.AbstractConnector.doStart Started SocketConnector@127.0.0.1:41818
[junit4:junit4]   2> 8461 T2316 oasc.SolrResourceLoader.locateSolrHome JNDI not configured for solr (NoInitialContextEx)
[junit4:junit4]   2> 8462 T2316 oasc.SolrResourceLoader.locateSolrHome using system property solr.solr.home: /usr/home/hudson/hudson-slave/workspace/Lucene-Solr-Tests-trunk-Java6/solr/build/solr-core/test/J0/./org.apache.solr.cloud.SyncSliceTest-jetty3-1356100970272
[junit4:junit4]   2> 8463 T2316 oasc.SolrResourceLoader.<init> new SolrResourceLoader for deduced Solr Home: '/usr/home/hudson/hudson-slave/workspace/Lucene-Solr-Tests-trunk-Java6/solr/build/solr-core/test/J0/./org.apache.solr.cloud.SyncSliceTest-jetty3-1356100970272/'
[junit4:junit4]   2> 8507 T2316 oass.SolrDispatchFilter.init SolrDispatchFilter.init()
[junit4:junit4]   2> 8508 T2316 oasc.SolrResourceLoader.locateSolrHome JNDI not configured for solr (NoInitialContextEx)
[junit4:junit4]   2> 8509 T2316 oasc.SolrResourceLoader.locateSolrHome using system property solr.solr.home: /usr/home/hudson/hudson-slave/workspace/Lucene-Solr-Tests-trunk-Java6/solr/build/solr-core/test/J0/./org.apache.solr.cloud.SyncSliceTest-jetty3-1356100970272
[junit4:junit4]   2> 8509 T2316 oasc.CoreContainer$Initializer.initialize looking for solr.xml: /usr/home/hudson/hudson-slave/workspace/Lucene-Solr-Tests-trunk-Java6/solr/build/solr-core/test/J0/./org.apache.solr.cloud.SyncSliceTest-jetty3-1356100970272/solr.xml
[junit4:junit4]   2> 8510 T2316 oasc.CoreContainer.<init> New CoreContainer 1038640002
[junit4:junit4]   2> 8511 T2316 oasc.CoreContainer.load Loading CoreContainer using Solr Home: '/usr/home/hudson/hudson-slave/workspace/Lucene-Solr-Tests-trunk-Java6/solr/build/solr-core/test/J0/./org.apache.solr.cloud.SyncSliceTest-jetty3-1356100970272/'
[junit4:junit4]   2> 8512 T2316 oasc.SolrResourceLoader.<init> new SolrResourceLoader for directory: '/usr/home/hudson/hudson-slave/workspace/Lucene-Solr-Tests-trunk-Java6/solr/build/solr-core/test/J0/./org.apache.solr.cloud.SyncSliceTest-jetty3-1356100970272/'
[junit4:junit4]   2> 8535 T2316 oashc.HttpShardHandlerFactory.getParameter Setting socketTimeout to: 30000
[junit4:junit4]   2> 8537 T2316 oashc.HttpShardHandlerFactory.getParameter Setting urlScheme to: http://
[junit4:junit4]   2> 8537 T2316 oashc.HttpShardHandlerFactory.getParameter Setting connTimeout to: 15000
[junit4:junit4]   2> 8538 T2316 oashc.HttpShardHandlerFactory.getParameter Setting maxConnectionsPerHost to: 20
[junit4:junit4]   2> 8539 T2316 oashc.HttpShardHandlerFactory.getParameter Setting corePoolSize to: 0
[junit4:junit4]   2> 8539 T2316 oashc.HttpShardHandlerFactory.getParameter Setting maximumPoolSize to: 2147483647
[junit4:junit4]   2> 8540 T2316 oashc.HttpShardHandlerFactory.getParameter Setting maxThreadIdleTime to: 5
[junit4:junit4]   2> 8541 T2316 oashc.HttpShardHandlerFactory.getParameter Setting sizeOfQueue to: -1
[junit4:junit4]   2> 8541 T2316 oashc.HttpShardHandlerFactory.getParameter Setting fairnessPolicy to: false
[junit4:junit4]   2> 8542 T2316 oascsi.HttpClientUtil.createClient Creating new http client, config:maxConnectionsPerHost=20&maxConnections=10000&socketTimeout=30000&connTimeout=15000&retry=false
[junit4:junit4]   2> 8567 T2316 oasc.CoreContainer.load Registering Log Listener
[junit4:junit4]   2> 8598 T2316 oasc.CoreContainer.initZooKeeper Zookeeper client=127.0.0.1:41793/solr
[junit4:junit4]   2> 8600 T2316 oasc.ZkController.checkChrootPath zkHost includes chroot
[junit4:junit4]   2> 8601 T2316 oaz.ZooKeeper.<init> Initiating client connection, connectString=127.0.0.1:41793 sessionTimeout=60000 watcher=org.apache.solr.common.cloud.ConnectionManager@4521cada
[junit4:junit4]   2> 8603 T2386 oaz.ClientCnxn$SendThread.logStartConnect Opening socket connection to server localhost/127.0.0.1:41793. Will not attempt to authenticate using SASL (access denied (javax.security.auth.AuthPermission getLoginConfiguration))
[junit4:junit4]   2> 8603 T2316 oascc.ConnectionManager.waitForConnected Waiting for client to connect to ZooKeeper
[junit4:junit4]   2> 8604 T2386 oaz.ClientCnxn$SendThread.primeConnection Socket connection established to localhost/127.0.0.1:41793, initiating session
[junit4:junit4]   2> 8604 T2318 oazs.NIOServerCnxnFactory.run Accepted socket connection from /140.211.11.196:41819
[junit4:junit4]   2> 8605 T2318 oazs.ZooKeeperServer.processConnectRequest Client attempting to establish new session at /140.211.11.196:41819
[junit4:junit4]   2> 8607 T2320 oazs.ZooKeeperServer.finishSessionInit Established session 0x13bbdea86d10009 with negotiated timeout 20000 for client /140.211.11.196:41819
[junit4:junit4]   2> 8607 T2386 oaz.ClientCnxn$SendThread.onConnected Session establishment complete on server localhost/127.0.0.1:41793, sessionid = 0x13bbdea86d10009, negotiated timeout = 20000
[junit4:junit4]   2> 8607 T2387 oascc.ConnectionManager.process Watcher org.apache.solr.common.cloud.ConnectionManager@4521cada name:ZooKeeperConnection Watcher:127.0.0.1:41793 got event WatchedEvent state:SyncConnected type:None path:null path:null type:None
[junit4:junit4]   2> 8608 T2316 oascc.ConnectionManager.waitForConnected Client is connected to ZooKeeper
[junit4:junit4]   2> 8610 T2321 oazs.PrepRequestProcessor.pRequest2Txn Processed session termination for sessionid: 0x13bbdea86d10009
[junit4:junit4]   2> 8611 T2387 oaz.ClientCnxn$EventThread.run EventThread shut down
[junit4:junit4]   2> 8611 T2318 oazs.NIOServerCnxn.closeSock Closed socket connection for client /140.211.11.196:41819 which had sessionid 0x13bbdea86d10009
[junit4:junit4]   2> 8611 T2316 oaz.ZooKeeper.close Session: 0x13bbdea86d10009 closed
[junit4:junit4]   2> 8613 T2316 oascsi.HttpClientUtil.createClient Creating new http client, config:maxConnections=500&maxConnectionsPerHost=16&socketTimeout=15000&connTimeout=30000
[junit4:junit4]   2> 8627 T2316 oaz.ZooKeeper.<init> Initiating client connection, connectString=127.0.0.1:41793/solr sessionTimeout=30000 watcher=org.apache.solr.common.cloud.ConnectionManager@7943f84c
[junit4:junit4]   2> 8630 T2388 oaz.ClientCnxn$SendThread.logStartConnect Opening socket connection to server localhost/127.0.0.1:41793. Will not attempt to authenticate using SASL (access denied (javax.security.auth.AuthPermission getLoginConfiguration))
[junit4:junit4]   2> 8629 T2316 oascc.ConnectionManager.waitForConnected Waiting for client to connect to ZooKeeper
[junit4:junit4]   2> 8630 T2318 oazs.NIOServerCnxnFactory.run Accepted socket connection from /140.211.11.196:41820
[junit4:junit4]   2> 8630 T2388 oaz.ClientCnxn$SendThread.primeConnection Socket connection established to localhost/127.0.0.1:41793, initiating session
[junit4:junit4]   2> 8631 T2318 oazs.ZooKeeperServer.processConnectRequest Client attempting to establish new session at /140.211.11.196:41820
[junit4:junit4]   2> 8632 T2320 oazs.ZooKeeperServer.finishSessionInit Established session 0x13bbdea86d1000a with negotiated timeout 20000 for client /140.211.11.196:41820
[junit4:junit4]   2> 8632 T2388 oaz.ClientCnxn$SendThread.onConnected Session establishment complete on server localhost/127.0.0.1:41793, sessionid = 0x13bbdea86d1000a, negotiated timeout = 20000
[junit4:junit4]   2> 8633 T2389 oascc.ConnectionManager.process Watcher org.apache.solr.common.cloud.ConnectionManager@7943f84c name:ZooKeeperConnection Watcher:127.0.0.1:41793/solr got event WatchedEvent state:SyncConnected type:None path:null path:null type:None
[junit4:junit4]   2> 8633 T2316 oascc.ConnectionManager.waitForConnected Client is connected to ZooKeeper
[junit4:junit4]   2> 8635 T2321 oazs.PrepRequestProcessor.pRequest Got user-level KeeperException when processing sessionid:0x13bbdea86d1000a type:create cxid:0x1 zxid:0x84 txntype:-1 reqpath:n/a Error Path:/solr/overseer Error:KeeperErrorCode = NodeExists for /solr/overseer
[junit4:junit4]   2> 8636 T2321 oazs.PrepRequestProcessor.pRequest Got user-level KeeperException when processing sessionid:0x13bbdea86d1000a type:create cxid:0x2 zxid:0x85 txntype:-1 reqpath:n/a Error Path:/solr/overseer Error:KeeperErrorCode = NodeExists for /solr/overseer
[junit4:junit4]   2> 8638 T2316 oasc.ZkController.createEphemeralLiveNode Register node as live in ZooKeeper:/live_nodes/127.0.0.1:41818__nia
[junit4:junit4]   2> 8639 T2321 oazs.PrepRequestProcessor.pRequest Got user-level KeeperException when processing sessionid:0x13bbdea86d1000a type:delete cxid:0x4 zxid:0x86 txntype:-1 reqpath:n/a Error Path:/solr/live_nodes/127.0.0.1:41818__nia Error:KeeperErrorCode = NoNode for /solr/live_nodes/127.0.0.1:41818__nia
[junit4:junit4]   2> 8647 T2316 oascc.SolrZkClient.makePath makePath: /live_nodes/127.0.0.1:41818__nia
[junit4:junit4]   2> 8651 T2357 oascc.ZkStateReader$3.process Updating live nodes... (4)
[junit4:junit4]   2> 8652 T2372 oascc.ZkStateReader$3.process Updating live nodes... (4)
[junit4:junit4]   2> 8651 T2344 oascc.ZkStateReader$3.process Updating live nodes... (4)
[junit4:junit4]   2> 8652 T2357 oascc.ZkStateReader$2.process A cluster state change: WatchedEvent state:SyncConnected type:NodeChildrenChanged path:/live_nodes, has occurred - updating... (live nodes size: 4)
[junit4:junit4]   2> 8652 T2338 oascc.ZkStateReader$3.process Updating live nodes... (4)
[junit4:junit4]   2> 8652 T2344 oascc.ZkStateReader$2.process A cluster state change: WatchedEvent state:SyncConnected type:NodeChildrenChanged path:/live_nodes, has occurred - updating... (live nodes size: 4)
[junit4:junit4]   2> 8652 T2372 oascc.ZkStateReader$2.process A cluster state change: WatchedEvent state:SyncConnected type:NodeChildrenChanged path:/live_nodes, has occurred - updating... (live nodes size: 4)
[junit4:junit4]   2> 8653 T2338 oascc.ZkStateReader$2.process A cluster state change: WatchedEvent state:SyncConnected type:NodeChildrenChanged path:/live_nodes, has occurred - updating... (live nodes size: 4)
[junit4:junit4]   2> 8660 T2316 oascc.ZkStateReader.createClusterStateWatchersAndUpdate Updating cluster state from ZooKeeper... 
[junit4:junit4]   2> 8671 T2390 oasc.CoreContainer.create Creating SolrCore 'collection1' using instanceDir: /usr/home/hudson/hudson-slave/workspace/Lucene-Solr-Tests-trunk-Java6/solr/build/solr-core/test/J0/./org.apache.solr.cloud.SyncSliceTest-jetty3-1356100970272/collection1
[junit4:junit4]   2> 8672 T2390 oasc.ZkController.createCollectionZkNode Check for collection zkNode:collection1
[junit4:junit4]   2> 8672 T2390 oasc.ZkController.createCollectionZkNode Collection zkNode exists
[junit4:junit4]   2> 8673 T2390 oasc.ZkController.readConfigName Load collection config from:/collections/collection1
[junit4:junit4]   2> 8674 T2390 oasc.SolrResourceLoader.<init> new SolrResourceLoader for directory: '/usr/home/hudson/hudson-slave/workspace/Lucene-Solr-Tests-trunk-Java6/solr/build/solr-core/test/J0/./org.apache.solr.cloud.SyncSliceTest-jetty3-1356100970272/collection1/'
[junit4:junit4]   2> 8675 T2390 oasc.SolrResourceLoader.replaceClassLoader Adding 'file:/usr/home/hudson/hudson-slave/workspace/Lucene-Solr-Tests-trunk-Java6/solr/build/solr-core/test/J0/org.apache.solr.cloud.SyncSliceTest-jetty3-1356100970272/collection1/lib/README' to classloader
[junit4:junit4]   2> 8676 T2390 oasc.SolrResourceLoader.replaceClassLoader Adding 'file:/usr/home/hudson/hudson-slave/workspace/Lucene-Solr-Tests-trunk-Java6/solr/build/solr-core/test/J0/org.apache.solr.cloud.SyncSliceTest-jetty3-1356100970272/collection1/lib/classes/' to classloader
[junit4:junit4]   2> 8732 T2390 oasc.SolrConfig.<init> Using Lucene MatchVersion: LUCENE_50
[junit4:junit4]   2> 8805 T2390 oasc.SolrConfig.<init> Loaded SolrConfig: solrconfig.xml
[junit4:junit4]   2> 8906 T2390 oass.IndexSchema.readSchema Reading Solr Schema
[junit4:junit4]   2> 8918 T2390 oass.IndexSchema.readSchema Schema name=test
[junit4:junit4]   2> 9553 T2390 oass.OpenExchangeRatesOrgProvider.init Initialized with rates=open-exchange-rates.json, refreshInterval=1440.
[junit4:junit4]   2> 9565 T2390 oass.IndexSchema.readSchema default search field in schema is text
[junit4:junit4]   2> 9570 T2390 oass.IndexSchema.readSchema unique key field: id
[junit4:junit4]   2> 9583 T2390 oass.FileExchangeRateProvider.reload Reloading exchange rates from file currency.xml
[junit4:junit4]   2> 9589 T2390 oass.FileExchangeRateProvider.reload Reloading exchange rates from file currency.xml
[junit4:junit4]   2> 9594 T2390 oass.OpenExchangeRatesOrgProvider.reload Reloading exchange rates from open-exchange-rates.json
[junit4:junit4]   2> 9595 T2390 oass.OpenExchangeRatesOrgProvider.reload Reloading exchange rates from open-exchange-rates.json
[junit4:junit4]   2> 9596 T2390 oasc.SolrCore.<init> [collection1] Opening new SolrCore at /usr/home/hudson/hudson-slave/workspace/Lucene-Solr-Tests-trunk-Java6/solr/build/solr-core/test/J0/./org.apache.solr.cloud.SyncSliceTest-jetty3-1356100970272/collection1/, dataDir=./org.apache.solr.cloud.SyncSliceTest-1356100961993/jetty3/
[junit4:junit4]   2> 9597 T2390 oasc.JmxMonitoredMap.<init> JMX monitoring is enabled. Adding Solr mbeans to JMX Server: com.sun.jmx.mbeanserver.JmxMBeanServer@2017b2b2
[junit4:junit4]   2> 9597 T2390 oasc.SolrCore.initDirectoryFactory solr.NRTCachingDirectoryFactory
[junit4:junit4]   2> 9598 T2390 oasc.CachingDirectoryFactory.get return new directory for /usr/home/hudson/hudson-slave/workspace/Lucene-Solr-Tests-trunk-Java6/solr/build/solr-core/test/J0/./org.apache.solr.cloud.SyncSliceTest-1356100961993/jetty3 forceNew:false
[junit4:junit4]   2> 9599 T2390 oasc.CachingDirectoryFactory.close Releasing directory:/usr/home/hudson/hudson-slave/workspace/Lucene-Solr-Tests-trunk-Java6/solr/build/solr-core/test/J0/./org.apache.solr.cloud.SyncSliceTest-1356100961993/jetty3
[junit4:junit4]   2> 9599 T2390 oasc.SolrCore.getNewIndexDir New index directory detected: old=null new=./org.apache.solr.cloud.SyncSliceTest-1356100961993/jetty3/index/
[junit4:junit4]   2> 9600 T2390 oasc.SolrCore.initIndex WARNING [collection1] Solr index directory './org.apache.solr.cloud.SyncSliceTest-1356100961993/jetty3/index' doesn't exist. Creating new index...
[junit4:junit4]   2> 9601 T2390 oasc.CachingDirectoryFactory.get return new directory for /usr/home/hudson/hudson-slave/workspace/Lucene-Solr-Tests-trunk-Java6/solr/build/solr-core/test/J0/./org.apache.solr.cloud.SyncSliceTest-1356100961993/jetty3/index forceNew:false
[junit4:junit4]   2> 9623 T2390 oasc.SolrDeletionPolicy.onCommit SolrDeletionPolicy.onCommit: commits:num=1
[junit4:junit4]   2> 		commit{dir=RateLimitedDirectoryWrapper(NRTCachingDirectory(org.apache.lucene.store.NIOFSDirectory@/usr/home/hudson/hudson-slave/workspace/Lucene-Solr-Tests-trunk-Java6/solr/build/solr-core/test/J0/org.apache.solr.cloud.SyncSliceTest-1356100961993/jetty3/index lockFactory=org.apache.lucene.store.NativeFSLockFactory@41d32d8d; maxCacheMB=48.0 maxMergeSizeMB=4.0)),segFN=segments_1,generation=1,filenames=[segments_1]
[junit4:junit4]   2> 9623 T2390 oasc.SolrDeletionPolicy.updateCommits newest commit = 1[segments_1]
[junit4:junit4]   2> 9624 T2390 oasc.CachingDirectoryFactory.close Releasing directory:/usr/home/hudson/hudson-slave/workspace/Lucene-Solr-Tests-trunk-Java6/solr/build/solr-core/test/J0/./org.apache.solr.cloud.SyncSliceTest-1356100961993/jetty3/index
[junit4:junit4]   2> 9625 T2390 oasc.SolrCore.initWriters created xml: solr.XMLResponseWriter
[junit4:junit4]   2> 9627 T2390 oasup.UpdateRequestProcessorChain.init inserting DistributedUpdateProcessorFactory into updateRequestProcessorChain "dedupe"
[junit4:junit4]   2> 9627 T2390 oasup.UpdateRequestProcessorChain.init inserting DistributedUpdateProcessorFactory into updateRequestProcessorChain "dedupe-allfields"
[junit4:junit4]   2> 9627 T2390 oasup.UpdateRequestProcessorChain.init inserting DistributedUpdateProcessorFactory into updateRequestProcessorChain "stored_sig"
[junit4:junit4]   2> 9628 T2390 oasup.UpdateRequestProcessorChain.init inserting DistributedUpdateProcessorFactory into updateRequestProcessorChain "uniq-fields"
[junit4:junit4]   2> 9628 T2390 oasup.UpdateRequestProcessorChain.init inserting DistributedUpdateProcessorFactory into updateRequestProcessorChain "distrib-dup-test-chain-implicit"
[junit4:junit4]   2> 9629 T2390 oasc.RequestHandlers.initHandlersFromConfig adding lazy requestHandler: solr.ReplicationHandler
[junit4:junit4]   2> 9629 T2390 oasc.RequestHandlers.initHandlersFromConfig created /replication: solr.ReplicationHandler
[junit4:junit4]   2> 9630 T2390 oasc.RequestHandlers.initHandlersFromConfig created standard: solr.StandardRequestHandler
[junit4:junit4]   2> 9631 T2390 oasc.RequestHandlers.initHandlersFromConfig created /get: solr.RealTimeGetHandler
[junit4:junit4]   2> 9632 T2390 oasc.RequestHandlers.initHandlersFromConfig created dismax: solr.SearchHandler
[junit4:junit4]   2> 9633 T2390 oasc.RequestHandlers.initHandlersFromConfig created mock: org.apache.solr.core.MockQuerySenderListenerReqHandler
[junit4:junit4]   2> 9634 T2390 oasc.RequestHandlers.initHandlersFromConfig created /admin/: org.apache.solr.handler.admin.AdminHandlers
[junit4:junit4]   2> 9635 T2390 oasc.RequestHandlers.initHandlersFromConfig created defaults: solr.StandardRequestHandler
[junit4:junit4]   2> 9635 T2390 oasc.RequestHandlers.initHandlersFromConfig adding lazy requestHandler: solr.StandardRequestHandler
[junit4:junit4]   2> 9635 T2390 oasc.RequestHandlers.initHandlersFromConfig created lazy: solr.StandardRequestHandler
[junit4:junit4]   2> 9636 T2390 oasc.RequestHandlers.initHandlersFromConfig created /update: solr.UpdateRequestHandler
[junit4:junit4]   2> 9637 T2390 oasc.RequestHandlers.initHandlersFromConfig created /terms: org.apache.solr.handler.component.SearchHandler
[junit4:junit4]   2> 9638 T2390 oasc.RequestHandlers.initHandlersFromConfig created spellCheckCompRH: org.apache.solr.handler.component.SearchHandler
[junit4:junit4]   2> 9639 T2390 oasc.RequestHandlers.initHandlersFromConfig created spellCheckCompRH_Direct: org.apache.solr.handler.component.SearchHandler
[junit4:junit4]   2> 9640 T2390 oasc.RequestHandlers.initHandlersFromConfig created spellCheckWithWordbreak: org.apache.solr.handler.component.SearchHandler
[junit4:junit4]   2> 9641 T2390 oasc.RequestHandlers.initHandlersFromConfig created spellCheckWithWordbreak_Direct: org.apache.solr.handler.component.SearchHandler
[junit4:junit4]   2> 9642 T2390 oasc.RequestHandlers.initHandlersFromConfig created spellCheckCompRH1: org.apache.solr.handler.component.SearchHandler
[junit4:junit4]   2> 9643 T2390 oasc.RequestHandlers.initHandlersFromConfig created mltrh: org.apache.solr.handler.component.SearchHandler
[junit4:junit4]   2> 9643 T2390 oasc.RequestHandlers.initHandlersFromConfig created tvrh: org.apache.solr.handler.component.SearchHandler
[junit4:junit4]   2> 9644 T2390 oasc.RequestHandlers.initHandlersFromConfig created /mlt: solr.MoreLikeThisHandler
[junit4:junit4]   2> 9645 T2390 oasc.RequestHandlers.initHandlersFromConfig created /debug/dump: solr.DumpRequestHandler
[junit4:junit4]   2> 9653 T2390 oashl.XMLLoader.init xsltCacheLifetimeSeconds=60
[junit4:junit4]   2> 9657 T2390 oasc.SolrCore.initDeprecatedSupport WARNING solrconfig.xml uses deprecated <admin/gettableFiles>, Please update your config to use the ShowFileRequestHandler.
[junit4:junit4]   2> 9659 T2390 oasc.SolrCore.initDeprecatedSupport WARNING adding ShowFileRequestHandler with hidden files: [SCHEMA.XML, OLD_SYNONYMS.TXT, STOPWORDS.TXT, PROTWORDS.TXT, OPEN-EXCHANGE-RATES.JSON, SYNONYMS.TXT, CURRENCY.XML, MAPPING-ISOLATIN1ACCENT.TXT]
[junit4:junit4]   2> 9662 T2390 oasc.CachingDirectoryFactory.close Releasing directory:/usr/home/hudson/hudson-slave/workspace/Lucene-Solr-Tests-trunk-Java6/solr/build/solr-core/test/J0/./org.apache.solr.cloud.SyncSliceTest-1356100961993/jetty3
[junit4:junit4]   2> 9663 T2390 oass.SolrIndexSearcher.<init> Opening Searcher@21b31b21 main
[junit4:junit4]   2> 9665 T2390 oasu.CommitTracker.<init> Hard AutoCommit: disabled
[junit4:junit4]   2> 9665 T2390 oasu.CommitTracker.<init> Soft AutoCommit: disabled
[junit4:junit4]   2> 9666 T2390 oashc.SpellCheckComponent.inform Initializing spell checkers
[junit4:junit4]   2> 9673 T2390 oass.DirectSolrSpellChecker.init init: {name=direct,classname=DirectSolrSpellChecker,field=lowerfilt,minQueryLength=3}
[junit4:junit4]   2> 9731 T2391 oasc.SolrCore.registerSearcher [collection1] Registered new searcher Searcher@21b31b21 main{StandardDirectoryReader(segments_1:1)}
[junit4:junit4]   2> 9735 T2390 oasc.ZkController.publish publishing core=collection1 state=down
[junit4:junit4]   2> 9736 T2390 oasc.ZkController.publish numShards not found on descriptor - reading it from system property
[junit4:junit4]   2> 9917 T2339 oascc.ZkStateReader.updateClusterState Updating cloud state from ZooKeeper... 
[junit4:junit4]   2> 9918 T2339 oasc.Overseer$ClusterStateUpdater.updateState Update state numShards=1 message={
[junit4:junit4]   2> 	  "operation":"state",
[junit4:junit4]   2> 	  "numShards":"1",
[junit4:junit4]   2> 	  "shard":null,
[junit4:junit4]   2> 	  "roles":null,
[junit4:junit4]   2> 	  "state":"down",
[junit4:junit4]   2> 	  "core":"collection1",
[junit4:junit4]   2> 	  "collection":"collection1",
[junit4:junit4]   2> 	  "node_name":"127.0.0.1:41818__nia",
[junit4:junit4]   2> 	  "base_url":"http://127.0.0.1:41818/_nia"}
[junit4:junit4]   2> 9919 T2339 oasc.Overseer$ClusterStateUpdater.updateState Collection already exists with numShards=1
[junit4:junit4]   2> 9919 T2339 oasc.Overseer$ClusterStateUpdater.updateState Assigning new node to shard shard=shard1
[junit4:junit4]   2> 9932 T2389 oascc.ZkStateReader$2.process A cluster state change: WatchedEvent state:SyncConnected type:NodeDataChanged path:/clusterstate.json, has occurred - updating... (live nodes size: 4)
[junit4:junit4]   2> 9932 T2344 oascc.ZkStateReader$2.process A cluster state change: WatchedEvent state:SyncConnected type:NodeDataChanged path:/clusterstate.json, has occurred - updating... (live nodes size: 4)
[junit4:junit4]   2> 9932 T2372 oascc.ZkStateReader$2.process A cluster state change: WatchedEvent state:SyncConnected type:NodeDataChanged path:/clusterstate.json, has occurred - updating... (live nodes size: 4)
[junit4:junit4]   2> 9932 T2357 oascc.ZkStateReader$2.process A cluster state change: WatchedEvent state:SyncConnected type:NodeDataChanged path:/clusterstate.json, has occurred - updating... (live nodes size: 4)
[junit4:junit4]   2> 9932 T2338 oascc.ZkStateReader$2.process A cluster state change: WatchedEvent state:SyncConnected type:NodeDataChanged path:/clusterstate.json, has occurred - updating... (live nodes size: 4)
[junit4:junit4]   2> 10738 T2390 oasc.CoreContainer.registerCore registering core: collection1
[junit4:junit4]   2> 10738 T2390 oasc.ZkController.register Register replica - core:collection1 address:http://127.0.0.1:41818/_nia collection:collection1 shard:shard1
[junit4:junit4]   2> 10742 T2390 oasc.ZkController.register We are http://127.0.0.1:41818/_nia/collection1/ and leader is http://127.0.0.1:41804/_nia/collection1/
[junit4:junit4]   2> 10743 T2390 oasc.ZkController.register No LogReplay needed for core=collection1 baseURL=http://127.0.0.1:41818/_nia
[junit4:junit4]   2> 10743 T2390 oasc.ZkController.checkRecovery Core needs to recover:collection1
[junit4:junit4]   2> 10743 T2390 oasu.DefaultSolrCoreState.doRecovery Running recovery - first canceling any ongoing recovery
[junit4:junit4]   2> ASYNC  NEW_CORE C171 name=collection1 org.apache.solr.core.SolrCore@24800623 url=http://127.0.0.1:41818/_nia/collection1 node=127.0.0.1:41818__nia C171_STATE=coll:collection1 core:collection1 props:{shard=null, roles=null, state=down, core=collection1, collection=collection1, node_name=127.0.0.1:41818__nia, base_url=http://127.0.0.1:41818/_nia}
[junit4:junit4]   2> 10744 T2392 C171 P41818 oasc.RecoveryStrategy.run Starting recovery process.  core=collection1 recoveringAfterStartup=true
[junit4:junit4]   2> 10745 T2392 C171 P41818 oasc.RecoveryStrategy.doRecovery ###### startupVersions=[]
[junit4:junit4]   2> 10745 T2390 oascc.ZkStateReader.updateClusterState Updating cloud state from ZooKeeper... 
[junit4:junit4]   2> 10745 T2392 C171 P41818 oasc.ZkController.publish publishing core=collection1 state=recovering
[junit4:junit4]   2> 10745 T2392 C171 P41818 oasc.ZkController.publish numShards not found on descriptor - reading it from system property
[junit4:junit4]   2> 10746 T2316 oass.SolrDispatchFilter.init user.dir=/usr/home/hudson/hudson-slave/workspace/Lucene-Solr-Tests-trunk-Java6/solr/build/solr-core/test/J0
[junit4:junit4]   2> 10747 T2392 C171 P41818 oasc.RecoveryStrategy.doRecovery Attempting to PeerSync from http://127.0.0.1:41804/_nia/collection1/ core=collection1 - recoveringAfterStartup=true
[junit4:junit4]   2> 10747 T2392 C171 P41818 oasu.PeerSync.sync PeerSync: core=collection1 url=http://127.0.0.1:41818/_nia START replicas=[http://127.0.0.1:41804/_nia/collection1/] nUpdates=100
[junit4:junit4]   2> 10747 T2316 oass.SolrDispatchFilter.init SolrDispatchFilter.init() done
[junit4:junit4]   2> 10748 T2392 C171 P41818 oasu.PeerSync.sync WARNING no frame of reference to tell of we've missed updates
[junit4:junit4]   2> 10748 T2392 C171 P41818 oasc.RecoveryStrategy.doRecovery PeerSync Recovery was not successful - trying replication. core=collection1
[junit4:junit4]   2> 10748 T2316 oascsi.HttpClientUtil.createClient Creating new http client, config:maxConnections=128&maxConnectionsPerHost=32&followRedirects=false
[junit4:junit4]   2> 10749 T2392 C171 P41818 oasc.RecoveryStrategy.doRecovery Starting Replication Recovery. core=collection1
[junit4:junit4]   2> 10749 T2392 C171 P41818 oascsi.HttpClientUtil.createClient Creating new http client, config:maxConnections=128&maxConnectionsPerHost=32&followRedirects=false
[junit4:junit4]   2> 10750 T2347 C170 P41804 REQ /get {distrib=false&qt=/get&wt=javabin&version=2&getVersions=100} status=0 QTime=0 
[junit4:junit4]   2> 10940 T2339 oascc.ZkStateReader.updateClusterState Updating cloud state from ZooKeeper... 
[junit4:junit4]   2> 10941 T2339 oasc.Overseer$ClusterStateUpdater.updateState Update state numShards=1 message={
[junit4:junit4]   2> 	  "operation":"state",
[junit4:junit4]   2> 	  "numShards":"1",
[junit4:junit4]   2> 	  "shard":"shard1",
[junit4:junit4]   2> 	  "roles":null,
[junit4:junit4]   2> 	  "state":"recovering",
[junit4:junit4]   2> 	  "core":"collection1",
[junit4:junit4]   2> 	  "collection":"collection1",
[junit4:junit4]   2> 	  "node_name":"127.0.0.1:41818__nia",
[junit4:junit4]   2> 	  "base_url":"http://127.0.0.1:41818/_nia"}
[junit4:junit4]   2> 10947 T2344 oascc.ZkStateReader$2.process A cluster state change: WatchedEvent state:SyncConnected type:NodeDataChanged path:/clusterstate.json, has occurred - updating... (live nodes size: 4)
[junit4:junit4]   2> 10947 T2357 oascc.ZkStateReader$2.process A cluster state change: WatchedEvent state:SyncConnected type:NodeDataChanged path:/clusterstate.json, has occurred - updating... (live nodes size: 4)
[junit4:junit4]   2> 10947 T2338 oascc.ZkStateReader$2.process A cluster state change: WatchedEvent state:SyncConnected type:NodeDataChanged path:/clusterstate.json, has occurred - updating... (live nodes size: 4)
[junit4:junit4]   2> 10947 T2389 oascc.ZkStateReader$2.process A cluster state change: WatchedEvent state:SyncConnected type:NodeDataChanged path:/clusterstate.json, has occurred - updating... (live nodes size: 4)
[junit4:junit4]   2> 10947 T2372 oascc.ZkStateReader$2.process A cluster state change: WatchedEvent state:SyncConnected type:NodeDataChanged path:/clusterstate.json, has occurred - updating... (live nodes size: 4)
[junit4:junit4]   2> 10950 T2316 oejs.Server.doStart jetty-8.1.8.v20121106
[junit4:junit4]   2> 10953 T2316 oejs.AbstractConnector.doStart Started SocketConnector@127.0.0.1:41825
[junit4:junit4]   2> 10954 T2316 oasc.SolrResourceLoader.locateSolrHome JNDI not configured for solr (NoInitialContextEx)
[junit4:junit4]   2> 10955 T2316 oasc.SolrResourceLoader.locateSolrHome using system property solr.solr.home: /usr/home/hudson/hudson-slave/workspace/Lucene-Solr-Tests-trunk-Java6/solr/build/solr-core/test/J0/./org.apache.solr.cloud.SyncSliceTest-jetty4-1356100972761
[junit4:junit4]   2> 10955 T2316 oasc.SolrResourceLoader.<init> new SolrResourceLoader for deduced Solr Home: '/usr/home/hudson/hudson-slave/workspace/Lucene-Solr-Tests-trunk-Java6/solr/build/solr-core/test/J0/./org.apache.solr.cloud.SyncSliceTest-jetty4-1356100972761/'
[junit4:junit4]   2> 10996 T2316 oass.SolrDispatchFilter.init SolrDispatchFilter.init()
[junit4:junit4]   2> 10998 T2316 oasc.SolrResourceLoader.locateSolrHome JNDI not configured for solr (NoInitialContextEx)
[junit4:junit4]   2> 10998 T2316 oasc.SolrResourceLoader.locateSolrHome using system property solr.solr.home: /usr/home/hudson/hudson-slave/workspace/Lucene-Solr-Tests-trunk-Java6/solr/build/solr-core/test/J0/./org.apache.solr.cloud.SyncSliceTest-jetty4-1356100972761
[junit4:junit4]   2> 10999 T2316 oasc.CoreContainer$Initializer.initialize looking for solr.xml: /usr/home/hudson/hudson-slave/workspace/Lucene-Solr-Tests-trunk-Java6/solr/build/solr-core/test/J0/./org.apache.solr.cloud.SyncSliceTest-jetty4-1356100972761/solr.xml
[junit4:junit4]   2> 11000 T2316 oasc.CoreContainer.<init> New CoreContainer 1497992791
[junit4:junit4]   2> 11001 T2316 oasc.CoreContainer.load Loading CoreContainer using Solr Home: '/usr/home/hudson/hudson-slave/workspace/Lucene-Solr-Tests-trunk-Java6/solr/build/solr-core/test/J0/./org.apache.solr.cloud.SyncSliceTest-jetty4-1356100972761/'
[junit4:junit4]   2> 11001 T2316 oasc.SolrResourceLoader.<init> new SolrResourceLoader for directory: '/usr/home/hudson/hudson-slave/workspace/Lucene-Solr-Tests-trunk-Java6/solr/build/solr-core/test/J0/./org.apache.solr.cloud.SyncSliceTest-jetty4-1356100972761/'
[junit4:junit4]   2> 11025 T2316 oashc.HttpShardHandlerFactory.getParameter Setting socketTimeout to: 30000
[junit4:junit4]   2> 11026 T2316 oashc.HttpShardHandlerFactory.getParameter Setting urlScheme to: http://
[junit4:junit4]   2> 11027 T2316 oashc.HttpShardHandlerFactory.getParameter Setting connTimeout to: 15000
[junit4:junit4]   2> 11028 T2316 oashc.HttpShardHandlerFactory.getParameter Setting maxConnectionsPerHost to: 20
[junit4:junit4]   2> 11028 T2316 oashc.HttpShardHandlerFactory.getParameter Setting corePoolSize to: 0
[junit4:junit4]   2> 11029 T2316 oashc.HttpShardHandlerFactory.getParameter Setting maximumPoolSize to: 2147483647
[junit4:junit4]   2> 11030 T2316 oashc.HttpShardHandlerFactory.getParameter Setting maxThreadIdleTime to: 5
[junit4:junit4]   2> 11030 T2316 oashc.HttpShardHandlerFactory.getParameter Setting sizeOfQueue to: -1
[junit4:junit4]   2> 11031 T2316 oashc.HttpShardHandlerFactory.getParameter Setting fairnessPolicy to: false
[junit4:junit4]   2> 11032 T2316 oascsi.HttpClientUtil.createClient Creating new http client, config:maxConnectionsPerHost=20&maxConnections=10000&socketTimeout=30000&connTimeout=15000&retry=false
[junit4:junit4]   2> 11053 T2316 oasc.CoreContainer.load Registering Log Listener
[junit4:junit4]   2> 11073 T2316 oasc.CoreContainer.initZooKeeper Zookeeper client=127.0.0.1:41793/solr
[junit4:junit4]   2> 11074 T2316 oasc.ZkController.checkChrootPath zkHost includes chroot
[junit4:junit4]   2> 11074 T2316 oaz.ZooKeeper.<init> Initiating client connection, connectString=127.0.0.1:41793 sessionTimeout=60000 watcher=org.apache.solr.common.cloud.ConnectionManager@30f757c9
[junit4:junit4]   2> 11076 T2316 oascc.ConnectionManager.waitForConnected Waiting for client to connect to ZooKeeper
[junit4:junit4]   2> 11076 T2403 oaz.ClientCnxn$SendThread.logStartConnect Opening socket connection to server localhost/127.0.0.1:41793. Will not attempt to authenticate using SASL (access denied (javax.security.auth.AuthPermission getLoginConfiguration))
[junit4:junit4]   2> 11077 T2403 oaz.ClientCnxn$SendThread.primeConnection Socket connection established to localhost/127.0.0.1:41793, initiating session
[junit4:junit4]   2> 11077 T2318 oazs.NIOServerCnxnFactory.run Accepted socket connection from /140.211.11.196:41826
[junit4:junit4]   2> 11078 T2318 oazs.ZooKeeperServer.processConnectRequest Client attempting to establish new session at /140.211.11.196:41826
[junit4:junit4]   2> 11080 T2320 oazs.ZooKeeperServer.finishSessionInit Established session 0x13bbdea86d1000b with negotiated timeout 20000 for client /140.211.11.196:41826
[junit4:junit4]   2> 11080 T2403 oaz.ClientCnxn$SendThread.onConnected Session establishment complete on server localhost/127.0.0.1:41793, sessionid = 0x13bbdea86d1000b, negotiated timeout = 20000
[junit4:junit4]   2> 11080 T2404 oascc.ConnectionManager.process Watcher org.apache.solr.common.cloud.ConnectionManager@30f757c9 name:ZooKeeperConnection Watcher:127.0.0.1:41793 got event WatchedEvent state:SyncConnected type:None path:null path:null type:None
[junit4:junit4]   2> 11081 T2316 oascc.ConnectionManager.waitForConnected Client is connected to ZooKeeper
[junit4:junit4]   2> 11082 T2321 oazs.PrepRequestProcessor.pRequest2Txn Processed session termination for sessionid: 0x13bbdea86d1000b
[junit4:junit4]   2> 11083 T2404 oaz.ClientCnxn$EventThread.run EventThread shut down
[junit4:junit4]   2> 11083 T2318 oazs.NIOServerCnxn.closeSock Closed socket connection for client /140.211.11.196:41826 which had sessionid 0x13bbdea86d1000b
[junit4:junit4]   2> 11083 T2316 oaz.ZooKeeper.close Session: 0x13bbdea86d1000b closed
[junit4:junit4]   2> 11084 T2316 oascsi.HttpClientUtil.createClient Creating new http client, config:maxConnections=500&maxConnectionsPerHost=16&socketTimeout=15000&connTimeout=30000
[junit4:junit4]   2> 11095 T2316 oaz.ZooKeeper.<init> Initiating client connection, connectString=127.0.0.1:41793/solr sessionTimeout=30000 watcher=org.apache.solr.common.cloud.ConnectionManager@2b7e51b2
[junit4:junit4]   2> 11097 T2405 oaz.ClientCnxn$SendThread.logStartConnect Opening socket connection to server localhost/127.0.0.1:41793. Will not attempt to authenticate using SASL (access denied (javax.security.auth.AuthPermission getLoginConfiguration))
[junit4:junit4]   2> 11097 T2316 oascc.ConnectionManager.waitForConnected Waiting for client to connect to ZooKeeper
[junit4:junit4]   2> 11097 T2405 oaz.ClientCnxn$SendThread.primeConnection Socket connection established to localhost/127.0.0.1:41793, initiating session
[junit4:junit4]   2> 11097 T2318 oazs.NIOServerCnxnFactory.run Accepted socket connection from /140.211.11.196:41827
[junit4:junit4]   2> 11098 T2318 oazs.ZooKeeperServer.processConnectRequest Client attempting to establish new session at /140.211.11.196:41827
[junit4:junit4]   2> 11099 T2320 oazs.ZooKeeperServer.finishSessionInit Established session 0x13bbdea86d1000c with negotiated timeout 20000 for client /140.211.11.196:41827
[junit4:junit4]   2> 11099 T2405 oaz.ClientCnxn$SendThread.onConnected Session establishment complete on server localhost/127.0.0.1:41793, sessionid = 0x13bbdea86d1000c, negotiated timeout = 20000
[junit4:junit4]   2> 11100 T2406 oascc.ConnectionManager.process Watcher org.apache.solr.common.cloud.ConnectionManager@2b7e51b2 name:ZooKeeperConnection Watcher:127.0.0.1:41793/solr got event WatchedEvent state:SyncConnected type:None path:null path:null type:None
[junit4:junit4]   2> 11100 T2316 oascc.ConnectionManager.waitForConnected Client is connected to ZooKeeper
[junit4:junit4]   2> 11101 T2321 oazs.PrepRequestProcessor.pRequest Got user-level KeeperException when processing sessionid:0x13bbdea86d1000c type:create cxid:0x1 zxid:0x97 txntype:-1 reqpath:n/a Error Path:/solr/overseer Error:KeeperErrorCode = NodeExists for /solr/overseer
[junit4:junit4]   2> 11102 T2321 oazs.PrepRequestProcessor.pRequest Got user-level KeeperException when processing sessionid:0x13bbdea86d1000c type:create cxid:0x2 zxid:0x98 txntype:-1 reqpath:n/a Error Path:/solr/overseer Error:KeeperErrorCode = NodeExists for /solr/overseer
[junit4:junit4]   2> 11104 T2316 oasc.ZkController.createEphemeralLiveNode Register node as live in ZooKeeper:/live_nodes/127.0.0.1:41825__nia
[junit4:junit4]   2> 11105 T2321 oazs.PrepRequestProcessor.pRequest Got user-level KeeperException when processing sessionid:0x13bbdea86d1000c type:delete cxid:0x4 zxid:0x99 txntype:-1 reqpath:n/a Error Path:/solr/live_nodes/127.0.0.1:41825__nia Error:KeeperErrorCode = NoNode for /solr/live_nodes/127.0.0.1:41825__nia
[junit4:junit4]   2> 11113 T2316 oascc.SolrZkClient.makePath makePath: /live_nodes/127.0.0.1:41825__nia
[junit4:junit4]   2> 11115 T2389 oascc.ZkStateReader$2.process A cluster state change: WatchedEvent state:SyncConnected type:NodeChildrenChanged path:/live_nodes, has occurred - updating... (live nodes size: 4)
[junit4:junit4]   2> 11116 T2338 oascc.ZkStateReader$3.process Updating live nodes... (5)
[junit4:junit4]   2> 11116 T2372 oascc.ZkStateReader$3.process Updating live nodes... (5)
[junit4:junit4]   2> 11116 T2344 oascc.ZkStateReader$3.process Updating live nodes... (5)
[junit4:junit4]   2> 11116 T2357 oascc.ZkStateReader$3.process Updating live nodes... (5)
[junit4:junit4]   2> 11116 T2372 oascc.ZkStateReader$2.process A cluster state change: WatchedEvent state:SyncConnected type:NodeChildrenChanged path:/live_nodes, has occurred - updating... (live nodes size: 5)
[junit4:junit4]   2> 11116 T2338 oascc.ZkStateReader$2.process A cluster state change: WatchedEvent state:SyncConnected type:NodeChildrenChanged path:/live_nodes, has occurred - updating... (live nodes size: 5)
[junit4:junit4]   2> 11116 T2344 oascc.ZkStateReader$2.process A cluster state change: WatchedEvent state:SyncConnected type:NodeChildrenChanged path:/live_nodes, has occurred - updating... (live nodes size: 5)
[junit4:junit4]   2> 11117 T2357 oascc.ZkStateReader$2.process A cluster state change: WatchedEvent state:SyncConnected type:NodeChildrenChanged path:/live_nodes, has occurred - updating... (live nodes size: 5)
[junit4:junit4]   2> 11118 T2389 oascc.ZkStateReader$3.process Updating live nodes... (5)
[junit4:junit4]   2> 11126 T2316 oascc.ZkStateReader.createClusterStateWatchersAndUpdate Updating cluster state from ZooKeeper... 
[junit4:junit4]   2> 11136 T2407 oasc.CoreContainer.create Creating SolrCore 'collection1' using instanceDir: /usr/home/hudson/hudson-slave/workspace/Lucene-Solr-Tests-trunk-Java6/solr/build/solr-core/test/J0/./org.apache.solr.cloud.SyncSliceTest-jetty4-1356100972761/collection1
[junit4:junit4]   2> 11136 T2407 oasc.ZkController.createCollectionZkNode Check for collection zkNode:collection1
[junit4:junit4]   2> 11137 T2407 oasc.ZkController.createCollectionZkNode Collection zkNode exists
[junit4:junit4]   2> 11137 T2407 oasc.ZkController.readConfigName Load collection config from:/collections/collection1
[junit4:junit4]   2> 11139 T2407 oasc.SolrResourceLoader.<init> new SolrResourceLoader for directory: '/usr/home/hudson/hudson-slave/workspace/Lucene-Solr-Tests-trunk-Java6/solr/build/solr-core/test/J0/./org.apache.solr.cloud.SyncSliceTest-jetty4-1356100972761/collection1/'
[junit4:junit4]   2> 11140 T2407 oasc.SolrResourceLoader.replaceClassLoader Adding 'file:/usr/home/hudson/hudson-slave/workspace/Lucene-Solr-Tests-trunk-Java6/solr/build/solr-core/test/J0/org.apache.solr.cloud.SyncSliceTest-jetty4-1356100972761/collection1/lib/classes/' to classloader
[junit4:junit4]   2> 11141 T2407 oasc.SolrResourceLoader.replaceClassLoader Adding 'file:/usr/home/hudson/hudson-slave/workspace/Lucene-Solr-Tests-trunk-Java6/solr/build/solr-core/test/J0/org.apache.solr.cloud.SyncSliceTest-jetty4-1356100972761/collection1/lib/README' to classloader
[junit4:junit4]   2> 11196 T2407 oasc.SolrConfig.<init> Using Lucene MatchVersion: LUCENE_50
[junit4:junit4]   2> 11269 T2407 oasc.SolrConfig.<init> Loaded SolrConfig: solrconfig.xml
[junit4:junit4]   2>  C169_STATE=coll:collection1 core:collection1 props:{shard=shard1, roles=null, state=recovering, core=collection1, collection=collection1, node_name=127.0.0.1:41810__nia, base_url=http://127.0.0.1:41810/_nia}
[junit4:junit4]   2> 11287 T2375 C169 P41810 oasc.RecoveryStrategy.doRecovery Begin buffering updates. core=collection1
[junit4:junit4]   2> 11287 T2375 C169 P41810 oasu.UpdateLog.bufferUpdates Starting to buffer updates. FSUpdateLog{state=ACTIVE, tlog=null}
[junit4:junit4]   2> 11287 T2375 C169 P41810 oasc.RecoveryStrategy.replicate Attempting to replicate from http://127.0.0.1:41804/_nia/collection1/. core=collection1
[junit4:junit4]   2> 11287 T2375 C169 P41810 oascsi.HttpClientUtil.createClient Creating new http client, config:maxConnections=128&maxConnectionsPerHost=32&followRedirects=false
[junit4:junit4]   2> 11297 T2350 C170 P41804 oasu.DirectUpdateHandler2.commit start commit{flags=0,_version_=0,optimize=false,openSearcher=false,waitSearcher=true,expungeDeletes=false,softCommit=false}
[junit4:junit4]   2> 11299 T2350 C170 P41804 oasc.CachingDirectoryFactory.close Releasing directory:/usr/home/hudson/hudson-slave/workspace/Lucene-Solr-Tests-trunk-Java6/solr/build/solr-core/test/J0/./org.apache.solr.cloud.SyncSliceTest-1356100961993/jetty1
[junit4:junit4]   2> 11303 T2350 C170 P41804 oasc.SolrDeletionPolicy.onInit SolrDeletionPolicy.onInit: commits:num=1
[junit4:junit4]   2> 		commit{dir=RateLimitedDirectoryWrapper(NRTCachingDirectory(org.apache.lucene.store.NIOFSDirectory@/usr/home/hudson/hudson-slave/workspace/Lucene-Solr-Tests-trunk-Java6/solr/build/solr-core/test/J0/org.apache.solr.cloud.SyncSliceTest-1356100961993/jetty1/index lockFactory=org.apache.lucene.store.NativeFSLockFactory@2a0c48ca; maxCacheMB=48.0 maxMergeSizeMB=4.0)),segFN=segments_1,generation=1,filenames=[segments_1]
[junit4:junit4]   2> 11304 T2350 C170 P41804 oasc.SolrDeletionPolicy.updateCommits newest commit = 1[segments_1]
[junit4:junit4]   2> 11308 T2350 C170 P41804 oasc.SolrDeletionPolicy.onCommit SolrDeletionPolicy.onCommit: commits:num=2
[junit4:junit4]   2> 		commit{dir=RateLimitedDirectoryWrapper(NRTCachingDirectory(org.apache.lucene.store.NIOFSDirectory@/usr/home/hudson/hudson-slave/workspace/Lucene-Solr-Tests-trunk-Java6/solr/build/solr-core/test/J0/org.apache.solr.cloud.SyncSliceTest-1356100961993/jetty1/index lockFactory=org.apache.lucene.store.NativeFSLockFactory@2a0c48ca; maxCacheMB=48.0 maxMergeSizeMB=4.0)),segFN=segments_1,generation=1,filenames=[segments_1]
[junit4:junit4]   2> 		commit{dir=RateLimitedDirectoryWrapper(NRTCachingDirectory(org.apache.lucene.store.NIOFSDirectory@/usr/home/hudson/hudson-slave/workspace/Lucene-Solr-Tests-trunk-Java6/solr/build/solr-core/test/J0/org.apache.solr.cloud.SyncSliceTest-1356100961993/jetty1/index lockFactory=org.apache.lucene.store.NativeFSLockFactory@2a0c48ca; maxCacheMB=48.0 maxMergeSizeMB=4.0)),segFN=segments_2,generation=2,filenames=[segments_2]
[junit4:junit4]   2> 11308 T2350 C170 P41804 oasc.SolrDeletionPolicy.updateCommits newest commit = 2[segments_2]
[junit4:junit4]   2> 11309 T2350 C170 P41804 oasc.CachingDirectoryFactory.close Releasing directory:/usr/home/hudson/hudson-slave/workspace/Lucene-Solr-Tests-trunk-Java6/solr/build/solr-core/test/J0/./org.apache.solr.cloud.SyncSliceTest-1356100961993/jetty1
[junit4:junit4]   2> 11310 T2350 C170 P41804 oass.SolrIndexSearcher.<init> Opening Searcher@2ca79e58 realtime
[junit4:junit4]   2> 11310 T2350 C170 P41804 oasu.DirectUpdateHandler2.commit end_commit_flush
[junit4:junit4]   2> 11311 T2350 C170 P41804 /update {waitSearcher=true&openSearcher=false&commit=true&commit_end_point=true&wt=javabin&softCommit=false&version=2} {commit=} 0 14
[junit4:junit4]   2> 11312 T2375 C169 P41810 oash.ReplicationHandler.inform Commits will be reserved for  10000
[junit4:junit4]   2> 11313 T2375 C169 P41810 oash.SnapPuller.<init>  No value set for 'pollInterval'. Timer Task not started.
[junit4:junit4]   2> 11315 T2351 C170 P41804 oash.ReplicationHandler.inform Commits will be reserved for  10000
[junit4:junit4]   2> 11315 T2351 C170 P41804 REQ /replication {command=indexversion&wt=javabin&qt=/replication&version=2} status=0 QTime=1 
[junit4:junit4]   2> 11316 T2375 C169 P41810 oash.SnapPuller.fetchLatestIndex Master's generation: 2
[junit4:junit4]   2> 11316 T2375 C169 P41810 oash.SnapPuller.fetchLatestIndex Slave's generation: 1
[junit4:junit4]   2> 11317 T2375 C169 P41810 oash.SnapPuller.fetchLatestIndex Starting replication process
[junit4:junit4]   2> 11319 T2351 C170 P41804 oasc.CachingDirectoryFactory.close Releasing directory:/usr/home/hudson/hudson-slave/workspace/Lucene-Solr-Tests-trunk-Java6/solr/build/solr-core/test/J0/./org.apache.solr.cloud.SyncSliceTest-1356100961993/jetty1
[junit4:junit4]   2> 11320 T2351 C170 P41804 oasc.CachingDirectoryFactory.close Releasing directory:/usr/home/hudson/hudson-slave/workspace/Lucene-Solr-Tests-trunk-Java6/solr/build/solr-core/test/J0/./org.apache.solr.cloud.SyncSliceTest-1356100961993/jetty1/index
[junit4:junit4]   2> 11320 T2351 C170 P41804 REQ /replication {command=filelist&generation=2&wt=javabin&qt=/replication&version=2} status=0 QTime=1 
[junit4:junit4]   2> 11321 T2375 C169 P41810 oash.SnapPuller.fetchLatestIndex Number of files in latest index in master: 1
[junit4:junit4]   2> 11322 T2375 C169 P41810 oasc.CachingDirectoryFactory.get return new directory for /usr/home/hudson/hudson-slave/workspace/Lucene-Solr-Tests-trunk-Java6/solr/build/solr-core/test/J0/./org.apache.solr.cloud.SyncSliceTest-1356100961993/jetty2/index.20121222004253310 forceNew:false
[junit4:junit4]   2> 11323 T2375 C169 P41810 oasc.CachingDirectoryFactory.close Releasing directory:/usr/home/hudson/hudson-slave/workspace/Lucene-Solr-Tests-trunk-Java6/solr/build/solr-core/test/J0/./org.apache.solr.cloud.SyncSliceTest-1356100961993/jetty2
[junit4:junit4]   2> 11324 T2375 C169 P41810 oash.SnapPuller.fetchLatestIndex Starting download to RateLimitedDirectoryWrapper(NRTCachingDirectory(org.apache.lucene.store.NIOFSDirectory@/usr/home/hudson/hudson-slave/workspace/Lucene-Solr-Tests-trunk-Java6/solr/build/solr-core/test/J0/org.apache.solr.cloud.SyncSliceTest-1356100961993/jetty2/index.20121222004253310 lockFactory=org.apache.lucene.store.NativeFSLockFactory@5e8b911; maxCacheMB=48.0 maxMergeSizeMB=4.0)) fullCopy=true
[junit4:junit4]   2> 11327 T2351 C170 P41804 REQ /replication {file=segments_2&command=filecontent&checksum=true&generation=2&qt=/replication&wt=filestream} status=0 QTime=0 
[junit4:junit4]   2> 11328 T2375 C169 P41810 oasc.CachingDirectoryFactory.close Releasing directory:/usr/home/hudson/hudson-slave/workspace/Lucene-Solr-Tests-trunk-Java6/solr/build/solr-core/test/J0/./org.apache.solr.cloud.SyncSliceTest-1356100961993/jetty2/index
[junit4:junit4]   2> 11329 T2375 C169 P41810 oash.SnapPuller.fetchLatestIndex Total time taken for download : 0 secs
[junit4:junit4]   2> 11329 T2375 C169 P41810 oash.SnapPuller.modifyIndexProps New index installed. Updating index properties... index=index.20121222004253310
[junit4:junit4]   2> 11330 T2375 C169 P41810 oasc.CachingDirectoryFactory.close Releasing directory:/usr/home/hudson/hudson-slave/workspace/Lucene-Solr-Tests-trunk-Java6/solr/build/solr-core/test/J0/./org.apache.solr.cloud.SyncSliceTest-1356100961993/jetty2
[junit4:junit4]   2> 11331 T2375 C169 P41810 oasc.CachingDirectoryFactory.close Releasing directory:/usr/home/hudson/hudson-slave/workspace/Lucene-Solr-Tests-trunk-Java6/solr/build/solr-core/test/J0/./org.apache.solr.cloud.SyncSliceTest-1356100961993/jetty2
[junit4:junit4]   2> 11331 T2375 C169 P41810 oasc.SolrCore.getNewIndexDir New index directory detected: old=./org.apache.solr.cloud.SyncSliceTest-1356100961993/jetty2/index/ new=./org.apache.solr.cloud.SyncSliceTest-1356100961993/jetty2/index.20121222004253310
[junit4:junit4]   2> 11334 T2375 C169 P41810 oasc.SolrDeletionPolicy.onInit SolrDeletionPolicy.onInit: commits:num=1
[junit4:junit4]   2> 		commit{dir=RateLimitedDirectoryWrapper(NRTCachingDirectory(org.apache.lucene.store.NIOFSDirectory@/usr/home/hudson/hudson-slave/workspace/Lucene-Solr-Tests-trunk-Java6/solr/build/solr-core/test/J0/org.apache.solr.cloud.SyncSliceTest-1356100961993/jetty2/index.20121222004253310 lockFactory=org.apache.lucene.store.NativeFSLockFactory@5e8b911; maxCacheMB=48.0 maxMergeSizeMB=4.0)),segFN=segments_2,generation=2,filenames=[segments_2]
[junit4:junit4]   2> 11335 T2375 C169 P41810 oasc.SolrDeletionPolicy.updateCommits newest commit = 2[segments_2]
[junit4:junit4]   2> 11336 T2375 C169 P41810 oasc.CachingDirectoryFactory.close Releasing directory:/usr/home/hudson/hudson-slave/workspace/Lucene-Solr-Tests-trunk-Java6/solr/build/solr-core/test/J0/./org.apache.solr.cloud.SyncSliceTest-1356100961993/jetty2
[junit4:junit4]   2> 11336 T2375 C169 P41810 oasu.DefaultSolrCoreState.newIndexWriter Creating new IndexWriter...
[junit4:junit4]   2> 11337 T2375 C169 P41810 oasu.DefaultSolrCoreState.newIndexWriter Waiting until IndexWriter is unused... core=collection1
[junit4:junit4]   2> 11337 T2375 C169 P41810 oasu.DefaultSolrCoreState.newIndexWriter Rollback old IndexWriter... core=collection1
[junit4:junit4]   2> 11338 T2375 C169 P41810 oasc.CachingDirectoryFactory.close Releasing directory:/usr/home/hudson/hudson-slave/workspace/Lucene-Solr-Tests-trunk-Java6/solr/build/solr-core/test/J0/./org.apache.solr.cloud.SyncSliceTest-1356100961993/jetty2/index.20121222004253310
[junit4:junit4]   2> 11338 T2375 C169 P41810 oasc.CachingDirectoryFactory.close Releasing directory:/usr/home/hudson/hudson-slave/workspace/Lucene-Solr-Tests-trunk-Java6/solr/build/solr-core/test/J0/./org.apache.solr.cloud.SyncSliceTest-1356100961993/jetty2
[junit4:junit4]   2> 11342 T2375 C169 P41810 oasc.SolrDeletionPolicy.onInit SolrDeletionPolicy.onInit: commits:num=1
[junit4:junit4]   2> 		commit{dir=RateLimitedDirectoryWrapper(NRTCachingDirectory(org.apache.lucene.store.NIOFSDirectory@/usr/home/hudson/hudson-slave/workspace/Lucene-Solr-Tests-trunk-Java6/solr/build/solr-core/test/J0/org.apache.solr.cloud.SyncSliceTest-1356100961993/jetty2/index.20121222004253310 lockFactory=org.apache.lucene.store.NativeFSLockFactory@5e8b911; maxCacheMB=48.0 maxMergeSizeMB=4.0)),segFN=segments_2,generation=2,filenames=[segments_2]
[junit4:junit4]   2> 11342 T2375 C169 P41810 oasc.SolrDeletionPolicy.updateCommits newest commit = 2[segments_2]
[junit4:junit4]   2> 11342 T2375 C169 P41810 oasu.DefaultSolrCoreState.newIndexWriter New IndexWriter is ready to be used.
[junit4:junit4]   2> 11343 T2375 C169 P41810 oasc.CachingDirectoryFactory.close Releasing directory:/usr/home/hudson/hudson-slave/workspace/Lucene-Solr-Tests-trunk-Java6/solr/build/solr-core/test/J0/./org.apache.solr.cloud.SyncSliceTest-1356100961993/jetty2
[junit4:junit4]   2> 11343 T2375 C169 P41810 oass.SolrIndexSearcher.<init> Opening Searcher@4fe00f82 main
[junit4:junit4]   2> 11345 T2374 oasc.SolrCore.registerSearcher [collection1] Registered new searcher Searcher@4fe00f82 main{StandardDirectoryReader(segments_2:1:nrt)}
[junit4:junit4]   2> 11345 T2374 oasc.CachingDirectoryFactory.close Releasing directory:/usr/home/hudson/hudson-slave/workspace/Lucene-Solr-Tests-trunk-Java6/solr/build/solr-core/test/J0/./org.apache.solr.cloud.SyncSliceTest-1356100961993/jetty2/index
[junit4:junit4]   2> 11345 T2375 C169 P41810 oasu.DirectUpdateHandler2.commit start commit{flags=0,_version_=0,optimize=false,openSearcher=false,waitSearcher=false,expungeDeletes=false,softCommit=false}
[junit4:junit4]   2> 11348 T2375 C169 P41810 oasc.SolrDeletionPolicy.onCommit SolrDeletionPolicy.onCommit: commits:num=2
[junit4:junit4]   2> 		commit{dir=RateLimitedDirectoryWrapper(NRTCachingDirectory(org.apache.lucene.store.NIOFSDirectory@/usr/home/hudson/hudson-slave/workspace/Lucene-Solr-Tests-trunk-Java6/solr/build/solr-core/test/J0/org.apache.solr.cloud.SyncSliceTest-1356100961993/jetty2/index.20121222004253310 lockFactory=org.apache.lucene.store.NativeFSLockFactory@5e8b911; maxCacheMB=48.0 maxMergeSizeMB=4.0)),segFN=segments_2,generation=2,filenames=[segments_2]
[junit4:junit4]   2> 		commit{dir=RateLimitedDirectoryWrapper(NRTCachingDirectory(org.apache.lucene.store.NIOFSDirectory@/usr/home/hudson/hudson-slave/workspace/Lucene-Solr-Tests-trunk-Java6/solr/build/solr-core/test/J0/org.apache.solr.cloud.SyncSliceTest-1356100961993/jetty2/index.20121222004253310 lockFactory=org.apache.lucene.store.NativeFSLockFactory@5e8b911; maxCacheMB=48.0 maxMergeSizeMB=4.0)),segFN=segments_3,generation=3,filenames=[segments_3]
[junit4:junit4]   2> 11349 T2375 C169 P41810 oasc.SolrDeletionPolicy.updateCommits newest commit = 3[segments_3]
[junit4:junit4]   2> 11350 T2375 C169 P41810 oasc.CachingDirectoryFactory.close Releasing directory:/usr/home/hudson/hudson-slave/workspace/Lucene-Solr-Tests-trunk-Java6/solr/build/solr-core/test/J0/./org.apache.solr.cloud.SyncSliceTest-1356100961993/jetty2
[junit4:junit4]   2> 11350 T2375 C169 P41810 oasu.DirectUpdateHandler2.commit end_commit_flush
[junit4:junit4]   2> 11350 T2375 C169 P41810 oasc.CachingDirectoryFactory.close Releasing directory:/usr/home/hudson/hudson-slave/workspace/Lucene-Solr-Tests-trunk-Java6/solr/build/solr-core/test/J0/./org.apache.solr.cloud.SyncSliceTest-1356100961993/jetty2/index.20121222004253310
[junit4:junit4]   2> 11351 T2375 C169 P41810 oasc.CachingDirectoryFactory.close Releasing directory:/usr/home/hudson/hudson-slave/workspace/Lucene-Solr-Tests-trunk-Java6/solr/build/solr-core/test/J0/./org.apache.solr.cloud.SyncSliceTest-1356100961993/jetty2/index
[junit4:junit4]   2> 11351 T2375 C169 P41810 oasc.RecoveryStrategy.replay No replay needed. core=collection1
[junit4:junit4]   2> 11351 T2375 C169 P41810 oasc.RecoveryStrategy.doRecovery Replication Recovery was successful - registering as Active. core=collection1
[junit4:junit4]   2> 11351 T2375 C169 P41810 oasc.ZkController.publish publishing core=collection1 state=active
[junit4:junit4]   2> 11352 T2375 C169 P41810 oasc.ZkController.publish numShards not found on descriptor - reading it from system property
[junit4:junit4]   2> 11354 T2375 C169 P41810 oasc.RecoveryStrategy.doRecovery Finished recovery process. core=collection1
[junit4:junit4]   2> 11370 T2407 oass.IndexSchema.readSchema Reading Solr Schema
[junit4:junit4]   2> 11384 T2407 oass.IndexSchema.readSchema Schema name=test
[junit4:junit4]   2> 11458 T2339 oascc.ZkStateReader.updateClusterState Updating cloud state from ZooKeeper... 
[junit4:junit4]   2> 11459 T2339 oasc.Overseer$ClusterStateUpdater.updateState Update state numShards=1 message={
[junit4:junit4]   2> 	  "operation":"state",
[junit4:junit4]   2> 	  "numShards":"1",
[junit4:junit4]   2> 	  "shard":"shard1",
[junit4:junit4]   2> 	  "roles":null,
[junit4:junit4]   2> 	  "state":"active",
[junit4:junit4]   2> 	  "core":"collection1",
[junit4:junit4]   2> 	  "collection":"collection1",
[junit4:junit4]   2> 	  "node_name":"127.0.0.1:41810__nia",
[junit4:junit4]   2> 	  "base_url":"http://127.0.0.1:41810/_nia"}
[junit4:junit4]   2> 11472 T2357 oascc.ZkStateReader$2.process A cluster state change: WatchedEvent state:SyncConnected type:NodeDataChanged path:/clusterstate.json, has occurred - updating... (live nodes size: 5)
[junit4:junit4]   2> 11472 T2344 oascc.ZkStateReader$2.process A cluster state change: WatchedEvent state:SyncConnected type:NodeDataChanged path:/clusterstate.json, has occurred - updating... (live nodes size: 5)
[junit4:junit4]   2> 11472 T2338 oascc.ZkStateReader$2.process A cluster state change: WatchedEvent state:SyncConnected type:NodeDataChanged path:/clusterstate.json, has occurred - updating... (live nodes size: 5)
[junit4:junit4]   2> 11472 T2372 oascc.ZkStateReader$2.process A cluster state change: WatchedEvent state:SyncConnected type:NodeDataChanged path:/clusterstate.json, has occurred - updating... (live nodes size: 5)
[junit4:junit4]   2> 11472 T2389 oascc.ZkStateReader$2.process A cluster state change: WatchedEvent state:SyncConnected type:NodeDataChanged path:/clusterstate.json, has occurred - updating... (live nodes size: 5)
[junit4:junit4]   2> 11472 T2406 oascc.ZkStateReader$2.process A cluster state change: WatchedEvent state:SyncConnected type:NodeDataChanged path:/clusterstate.json, has occurred - updating... (live nodes size: 5)
[junit4:junit4]   2> 11998 T2407 oass.OpenExchangeRatesOrgProvider.init Initialized with rates=open-exchange-rates.json, refreshInterval=1440.
[junit4:junit4]   2> 12010 T2407 oass.IndexSchema.readSchema default search field in schema is text
[junit4:junit4]   2> 12015 T2407 oass.IndexSchema.readSchema unique key field: id
[junit4:junit4]   2> 12028 T2407 oass.FileExchangeRateProvider.reload Reloading exchange rates from file currency.xml
[junit4:junit4]   2> 12033 T2407 oass.FileExchangeRateProvider.reload Reloading exchange rates from file currency.xml
[junit4:junit4]   2> 12038 T2407 oass.OpenExchangeRatesOrgProvider.reload Reloading exchange rates from open-exchange-rates.json
[junit4:junit4]   2> 12039 T2407 oass.OpenExchangeRatesOrgProvider.reload Reloading exchange rates from open-exchange-rates.json
[junit4:junit4]   2> 12041 T2407 oasc.SolrCore.<init> [collection1] Opening new SolrCore at /usr/home/hudson/hudson-slave/workspace/Lucene-Solr-Tests-trunk-Java6/solr/build/solr-core/test/J0/./org.apache.solr.cloud.SyncSliceTest-jetty4-1356100972761/collection1/, dataDir=./org.apache.solr.cloud.SyncSliceTest-1356100961993/jetty4/
[junit4:junit4]   2> 12041 T2407 oasc.JmxMonitoredMap.<init> JMX monitoring is enabled. Adding Solr mbeans to JMX Server: com.sun.jmx.mbeanserver.JmxMBeanServer@2017b2b2
[junit4:junit4]   2> 12042 T2407 oasc.SolrCore.initDirectoryFactory solr.NRTCachingDirectoryFactory
[junit4:junit4]   2> 12043 T2407 oasc.CachingDirectoryFactory.get return new directory for /usr/home/hudson/hudson-slave/workspace/Lucene-Solr-Tests-trunk-Java6/solr/build/solr-core/test/J0/./org.apache.solr.cloud.SyncSliceTest-1356100961993/jetty4 forceNew:false
[junit4:junit4]   2> 12043 T2407 oasc.CachingDirectoryFactory.close Releasing directory:/usr/home/hudson/hudson-slave/workspace/Lucene-Solr-Tests-trunk-Java6/solr/build/solr-core/test/J0/./org.apache.solr.cloud.SyncSliceTest-1356100961993/jetty4
[junit4:junit4]   2> 12044 T2407 oasc.SolrCore.getNewIndexDir New index directory detected: old=null new=./org.apache.solr.cloud.SyncSliceTest-1356100961993/jetty4/index/
[junit4:junit4]   2> 12044 T2407 oasc.SolrCore.initIndex WARNING [collection1] Solr index directory './org.apache.solr.cloud.SyncSliceTest-1356100961993/jetty4/index' doesn't exist. Creating new index...
[junit4:junit4]   2> 12045 T2407 oasc.CachingDirectoryFactory.get return new directory for /usr/home/hudson/hudson-slave/workspace/Lucene-Solr-Tests-trunk-Java6/solr/build/solr-core/test/J0/./org.apache.solr.cloud.SyncSliceTest-1356100961993/jetty4/index forceNew:false
[junit4:junit4]   2> 12077 T2407 oasc.SolrDeletionPolicy.onCommit SolrDeletionPolicy.onCommit: commits:num=1
[junit4:junit4]   2> 		commit{dir=RateLimitedDirectoryWrapper(NRTCachingDirectory(org.apache.lucene.store.NIOFSDirectory@/usr/home/hudson/hudson-slave/workspace/Lucene-Solr-Tests-trunk-Java6/solr/build/solr-core/test/J0/org.apache.solr.cloud.SyncSliceTest-1356100961993/jetty4/index lockFactory=org.apache.lucene.store.NativeFSLockFactory@6d98d8dc; maxCacheMB=48.0 maxMergeSizeMB=4.0)),segFN=segments_1,generation=1,filenames=[segments_1]
[junit4:junit4]   2> 12078 T2407 oasc.SolrDeletionPolicy.updateCommits newest commit = 1[segments_1]
[junit4:junit4]   2> 12078 T2407 oasc.CachingDirectoryFactory.close Releasing directory:/usr/home/hudson/hudson-slave/workspace/Lucene-Solr-Tests-trunk-Java6/solr/build/solr-core/test/J0/./org.apache.solr.cloud.SyncSliceTest-1356100961993/jetty4/index
[junit4:junit4]   2> 12079 T2407 oasc.SolrCore.initWriters created xml: solr.XMLResponseWriter
[junit4:junit4]   2> 12081 T2407 oasup.UpdateRequestProcessorChain.init inserting DistributedUpdateProcessorFactory into updateRequestProcessorChain "dedupe"
[junit4:junit4]   2> 12081 T2407 oasup.UpdateRequestProcessorChain.init inserting DistributedUpdateProcessorFactory into updateRequestProcessorChain "dedupe-allfields"
[junit4:junit4]   2> 12081 T2407 oasup.UpdateRequestProcessorChain.init inserting DistributedUpdateProcessorFactory into updateRequestProcessorChain "stored_sig"
[junit4:junit4]   2> 12082 T2407 oasup.UpdateRequestProcessorChain.init inserting DistributedUpdateProcessorFactory into updateRequestProcessorChain "uniq-fields"
[junit4:junit4]   2> 12082 T2407 oasup.UpdateRequestProcessorChain.init inserting DistributedUpdateProcessorFactory into updateRequestProcessorChain "distrib-dup-test-chain-implicit"
[junit4:junit4]   2> 12083 T2407 oasc.RequestHandlers.initHandlersFromConfig adding lazy requestHandler: solr.ReplicationHandler
[junit4:junit4]   2> 12083 T2407 oasc.RequestHandlers.initHandlersFromConfig created /replication: solr.ReplicationHandler
[junit4:junit4]   2> 12084 T2407 oasc.RequestHandlers.initHandlersFromConfig created standard: solr.StandardRequestHandler
[junit4:junit4]   2> 12085 T2407 oasc.RequestHandlers.initHandlersFromConfig created /get: solr.RealTimeGetHandler
[junit4:junit4]   2> 12086 T2407 oasc.RequestHandlers.initHandlersFromConfig created dismax: solr.SearchHandler
[junit4:junit4]   2> 12087 T2407 oasc.RequestHandlers.initHandlersFromConfig created mock: org.apache.solr.core.MockQuerySenderListenerReqHandler
[junit4:junit4]   2> 12088 T2407 oasc.RequestHandlers.initHandlersFromConfig created /admin/: org.apache.solr.handler.admin.AdminHandlers
[junit4:junit4]   2> 12088 T2407 oasc.RequestHandlers.initHandlersFromConfig created defaults: solr.StandardRequestHandler
[junit4:junit4]   2> 12089 T2407 oasc.RequestHandlers.initHandlersFromConfig adding lazy requestHandler: solr.StandardRequestHandler
[junit4:junit4]   2> 12089 T2407 oasc.RequestHandlers.initHandlersFromConfig created lazy: solr.StandardRequestHandler
[junit4:junit4]   2> 12090 T2407 oasc.RequestHandlers.initHandlersFromConfig created /update: solr.UpdateRequestHandler
[junit4:junit4]   2> 12091 T2407 oasc.RequestHandlers.initHandlersFromConfig created /terms: org.apache.solr.handler.component.SearchHandler
[junit4:junit4]   2> 12092 T2407 oasc.RequestHandlers.initHandlersFromConfig created spellCheckCompRH: org.apache.solr.handler.component.SearchHandler
[junit4:junit4]   2> 12093 T2407 oasc.RequestHandlers.initHandlersFromConfig created spellCheckCompRH_Direct: org.apache.solr.handler.component.SearchHandler
[junit4:junit4]   2> 12094 T2407 oasc.RequestHandlers.initHandlersFromConfig created spellCheckWithWordbreak: org.apache.solr.handler.component.SearchHandler
[junit4:junit4]   2> 12094 T2407 oasc.RequestHandlers.initHandlersFromConfig created spellCheckWithWordbreak_Direct: org.apache.solr.handler.component.SearchHandler
[junit4:junit4]   2> 12096 T2407 oasc.RequestHandlers.initHandlersFromConfig created spellCheckCompRH1: org.apache.solr.handler.component.SearchHandler
[junit4:junit4]   2> 12097 T2407 oasc.RequestHandlers.initHandlersFromConfig created mltrh: org.apache.solr.handler.component.SearchHandler
[junit4:junit4]   2> 12098 T2407 oasc.RequestHandlers.initHandlersFromConfig created tvrh: org.apache.solr.handler.component.SearchHandler
[junit4:junit4]   2> 12099 T2407 oasc.RequestHandlers.initHandlersFromConfig created /mlt: solr.MoreLikeThisHandler
[junit4:junit4]   2> 12101 T2407 oasc.RequestHandlers.initHandlersFromConfig created /debug/dump: solr.DumpRequestHandler
[junit4:junit4]   2> 12108 T2407 oashl.XMLLoader.init xsltCacheLifetimeSeconds=60
[junit4:junit4]   2> 12112 T2407 oasc.SolrCore.initDeprecatedSupport WARNING solrconfig.xml uses deprecated <admin/gettableFiles>, Please update your config to use the ShowFileRequestHandler.
[junit4:junit4]   2> 12114 T2407 oasc.SolrCore.initDeprecatedSupport WARNING adding ShowFileRequestHandler with hidden files: [SCHEMA.XML, OLD_SYNONYMS.TXT, STOPWORDS.TXT, PROTWORDS.TXT, OPEN-EXCHANGE-RATES.JSON, SYNONYMS.TXT, CURRENCY.XML, MAPPING-ISOLATIN1ACCENT.TXT]
[junit4:junit4]   2> 12117 T2407 oasc.CachingDirectoryFactory.close Releasing directory:/usr/home/hudson/hudson-slave/workspace/Lucene-Solr-Tests-trunk-Java6/solr/build/solr-core/test/J0/./org.apache.solr.cloud.SyncSliceTest-1356100961993/jetty4
[junit4:junit4]   2> 12119 T2407 oass.SolrIndexSearcher.<init> Opening Searcher@1f864a0b main
[junit4:junit4]   2> 12120 T2407 oasu.CommitTracker.<init> Hard AutoCommit: disabled
[junit4:junit4]   2> 12120 T2407 oasu.CommitTracker.<init> Soft AutoCommit: disabled
[junit4:junit4]   2> 12121 T2407 oashc.SpellCheckComponent.inform Initializing spell checkers
[junit4:junit4]   2> 12127 T2407 oass.DirectSolrSpellChecker.init init: {name=direct,classname=DirectSolrSpellChecker,field=lowerfilt,minQueryLength=3}
[junit4:junit4]   2> 12186 T2409 oasc.SolrCore.registerSearcher [collection1] Registered new searcher Searcher@1f864a0b main{StandardDirectoryReader(segments_1:1)}
[junit4:junit4]   2> 12190 T2407 oasc.ZkController.publish publishing core=collection1 state=down
[junit4:junit4]   2> 12191 T2407 oasc.ZkController.publish numShards not found on descriptor - reading it from system property
[junit4:junit4]   2> 12479 T2339 oascc.ZkStateReader.updateClusterState Updating cloud state from ZooKeeper... 
[junit4:junit4]   2> 12480 T2339 oasc.Overseer$ClusterStateUpdater.updateState Update state numShards=1 message={
[junit4:junit4]   2> 	  "operation":"state",
[junit4:junit4]   2> 	  "numShards":"1",
[junit4:junit4]   2> 	  "shard":null,
[junit4:junit4]   2> 	  "roles":null,
[junit4:junit4]   2> 	  "state":"down",
[junit4:junit4]   2> 	  "core":"collection1",
[junit4:junit4]   2> 	  "collection":"collection1",
[junit4:junit4]   2> 	  "node_name":"127.0.0.1:41825__nia",
[junit4:junit4]   2> 	  "base_url":"http://127.0.0.1:41825/_nia"}
[junit4:junit4]   2> 12481 T2339 oasc.Overseer$ClusterStateUpdater.updateState Collection already exists with numShards=1
[junit4:junit4]   2> 12481 T2339 oasc.Overseer$ClusterStateUpdater.updateState Assigning new node to shard shard=shard1
[junit4:junit4]   2> 12494 T2357 oascc.ZkStateReader$2.process A cluster state change: WatchedEvent state:SyncConnected type:NodeDataChanged path:/clusterstate.json, has occurred - updating... (live nodes size: 5)
[junit4:junit4]   2> 12494 T2344 oascc.ZkStateReader$2.process A cluster state change: WatchedEvent state:SyncConnected type:NodeDataChanged path:/clusterstate.json, has occurred - updating... (live nodes size: 5)
[junit4:junit4]   2> 12494 T2389 oascc.ZkStateReader$2.process A cluster state change: WatchedEvent state:SyncConnected type:NodeDataChanged path:/clusterstate.json, has occurred - updating... (live nodes size: 5)
[junit4:junit4]   2> 12494 T2338 oascc.ZkStateReader$2.process A cluster state change: WatchedEvent state:SyncConnected type:NodeDataChanged path:/clusterstate.json, has occurred - updating... (live nodes size: 5)
[junit4:junit4]   2> 12494 T2406 oascc.ZkStateReader$2.process A cluster state change: WatchedEvent state:SyncConnected type:NodeDataChanged path:/clusterstate.json, has occurred - updating... (live nodes size: 5)
[junit4:junit4]   2> 12494 T2372 oascc.ZkStateReader$2.process A cluster state change: WatchedEvent state:SyncConnected type:NodeDataChanged path:/clusterstate.json, has occurred - updating... (live nodes size: 5)
[junit4:junit4]   2> 13193 T2407 oasc.CoreContainer.registerCore registering core: collection1
[junit4:junit4]   2> 13194 T2407 oasc.ZkController.register Register replica - core:collection1 address:http://127.0.0.1:41825/_nia collection:collection1 shard:shard1
[junit4:junit4]   2> 13202 T2407 oasc.ZkController.register We are http://127.0.0.1:41825/_nia/collection1/ and leader is http://127.0.0.1:41804/_nia/collection1/
[junit4:junit4]   2> 13202 T2407 oasc.ZkController.register No LogReplay needed for core=collection1 baseURL=http://127.0.0.1:41825/_nia
[junit4:junit4]   2> 13202 T2407 oasc.ZkController.checkRecovery Core needs to recover:collection1
[junit4:junit4]   2> 13203 T2407 oasu.DefaultSolrCoreState.doRecovery Running recovery - first canceling any ongoing recovery
[junit4:junit4]   2> ASYNC  NEW_CORE C172 name=collection1 org.apache.solr.core.SolrCore@72760c5a url=http://127.0.0.1:41825/_nia/collection1 node=127.0.0.1:41825__nia C172_STATE=coll:collection1 core:collection1 props:{shard=null, roles=null, state=down, core=collection1, collection=collection1, node_name=127.0.0.1:41825__nia, base_url=http://127.0.0.1:41825/_nia}
[junit4:junit4]   2> 13203 T2410 C172 P41825 oasc.RecoveryStrategy.run Starting recovery process.  core=collection1 recoveringAfterStartup=true
[junit4:junit4]   2> 13204 T2407 oascc.ZkStateReader.updateClusterState Updating cloud state from ZooKeeper... 
[junit4:junit4]   2> 13204 T2410 C172 P41825 oasc.RecoveryStrategy.doRecovery ###### startupVersions=[]
[junit4:junit4]   2> 13205 T2410 C172 P41825 oasc.ZkController.publish publishing core=collection1 state=recovering
[junit4:junit4]   2> 13205 T2410 C172 P41825 oasc.ZkController.publish numShards not found on descriptor - reading it from system property
[junit4:junit4]   2> 13205 T2316 oass.SolrDispatchFilter.init user.dir=/usr/home/hudson/hudson-slave/workspace/Lucene-Solr-Tests-trunk-Java6/solr/build/solr-core/test/J0
[junit4:junit4]   2> 13207 T2410 C172 P41825 oasc.RecoveryStrategy.doRecovery Attempting to PeerSync from http://127.0.0.1:41804/_nia/collection1/ core=collection1 - recoveringAfterStartup=true
[junit4:junit4]   2> 13207 T2316 oass.SolrDispatchFilter.init SolrDispatchFilter.init() done
[junit4:junit4]   2> 13207 T2410 C172 P41825 oasu.PeerSync.sync PeerSync: core=collection1 url=http://127.0.0.1:41825/_nia START replicas=[http://127.0.0.1:41804/_nia/collection1/] nUpdates=100
[junit4:junit4]   2> 13208 T2410 C172 P41825 oasu.PeerSync.sync WARNING no frame of reference to tell of we've missed updates
[junit4:junit4]   2> 13207 T2316 oascsi.HttpClientUtil.createClient Creating new http client, config:maxConnections=128&maxConnectionsPerHost=32&followRedirects=false
[junit4:junit4]   2> 13208 T2410 C172 P41825 oasc.RecoveryStrategy.doRecovery PeerSync Recovery was not successful - trying replication. core=collection1
[junit4:junit4]   2> 13208 T2410 C172 P41825 oasc.RecoveryStrategy.doRecovery Starting Replication Recovery. core=collection1
[junit4:junit4]   2> 13209 T2410 C172 P41825 oascsi.HttpClientUtil.createClient Creating new http client, config:maxConnections=128&maxConnectionsPerHost=32&followRedirects=false
[junit4:junit4]   2> 13210 T2347 C170 P41804 REQ /get {distrib=false&qt=/get&wt=javabin&version=2&getVersions=100} status=0 QTime=0 
[junit4:junit4]   2> 13228 T2316 oascc.ZkStateReader.updateClusterState Updating cloud state from ZooKeeper... 
[junit4:junit4]   2> 13230 T2316 oasc.AbstractFullDistribZkTestBase.waitForThingsToLevelOut Wait for recoveries to finish - wait 15 for each attempt
[junit4:junit4]   2> 13231 T2316 oasc.AbstractDistribZkTestBase.waitForRecoveriesToFinish Wait for recoveries to finish - collection: collection1 failOnTimeout:true timeout (sec):15
[junit4:junit4]   2> 13232 T2316 oascc.ZkStateReader.updateClusterState Updating cloud state from ZooKeeper... 
[junit4:junit4]   2> 13502 T2339 oascc.ZkStateReader.updateClusterState Updating cloud state from ZooKeeper... 
[junit4:junit4]   2> 13503 T2339 oasc.Overseer$ClusterStateUpdater.updateState Update state numShards=1 message={
[junit4:junit4]   2> 	  "operation":"state",
[junit4:junit4]   2> 	  "numShards":"1",
[junit4:junit4]   2> 	  "shard":"shard1",
[junit4:junit4]   2> 	  "roles":null,
[junit4:junit4]   2> 	  "state":"recovering",
[junit4:junit4]   2> 	  "core":"collection1",
[junit4:junit4]   2> 	  "collection":"collection1",
[junit4:junit4]   2> 	  "node_name":"127.0.0.1:41825__nia",
[junit4:junit4]   2> 	  "base_url":"http://127.0.0.1:41825/_nia"}
[junit4:junit4]   2> 13508 T2357 oascc.ZkStateReader$2.process A cluster state change: WatchedEvent state:SyncConnected type:NodeDataChanged path:/clusterstate.json, has occurred - updating... (live nodes size: 5)
[junit4:junit4]   2> 13508 T2338 oascc.ZkStateReader$2.process A cluster state change: WatchedEvent state:SyncConnected type:NodeDataChanged path:/clusterstate.json, has occurred - updating... (live nodes size: 5)
[junit4:junit4]   2> 13508 T2389 oascc.ZkStateReader$2.process A cluster state change: WatchedEvent state:SyncConnected type:NodeDataChanged path:/clusterstate.json, has occurred - updating... (live nodes size: 5)
[junit4:junit4]   2> 13508 T2406 oascc.ZkStateReader$2.process A cluster state change: WatchedEvent state:SyncConnected type:NodeDataChanged path:/clusterstate.json, has occurred - updating... (live nodes size: 5)
[junit4:junit4]   2> 13508 T2344 oascc.ZkStateReader$2.process A cluster state change: WatchedEvent state:SyncConnected type:NodeDataChanged path:/clusterstate.json, has occurred - updating... (live nodes size: 5)
[junit4:junit4]   2> 13508 T2372 oascc.ZkStateReader$2.process A cluster state change: WatchedEvent state:SyncConnected type:NodeDataChanged path:/clusterstate.json, has occurred - updating... (live nodes size: 5)
[junit4:junit4]   2>  C171_STATE=coll:collection1 core:collection1 props:{shard=shard1, roles=null, state=recovering, core=collection1, collection=collection1, node_name=127.0.0.1:41818__nia, base_url=http://127.0.0.1:41818/_nia}
[junit4:junit4]   2> 13776 T2392 C171 P41818 oasc.RecoveryStrategy.doRecovery Begin buffering updates. core=collection1
[junit4:junit4]   2> 13776 T2392 C171 P41818 oasu.UpdateLog.bufferUpdates Starting to buffer updates. FSUpdateLog{state=ACTIVE, tlog=null}
[junit4:junit4]   2> 13776 T2392 C171 P41818 oasc.RecoveryStrategy.replicate Attempting to replicate from http://127.0.0.1:41804/_nia/collection1/. core=collection1
[junit4:junit4]   2> 13777 T2392 C171 P41818 oascsi.HttpClientUtil.createClient Creating new http client, config:maxConnections=128&maxConnectionsPerHost=32&followRedirects=false
[junit4:junit4]   2> 13787 T2353 C170 P41804 oasu.DirectUpdateHandler2.commit start commit{flags=0,_version_=0,optimize=false,openSearcher=false,waitSearcher=true,expungeDeletes=false,softCommit=false}
[junit4:junit4]   2> 13792 T2353 C170 P41804 oasc.SolrDeletionPolicy.onCommit SolrDeletionPolicy.onCommit: commits:num=2
[junit4:junit4]   2> 		commit{dir=RateLimitedDirectoryWrapper(NRTCachingDirectory(org.apache.lucene.store.NIOFSDirectory@/usr/home/hudson/hudson-slave/workspace/Lucene-Solr-Tests-trunk-Java6/solr/build/solr-core/test/J0/org.apache.solr.cloud.SyncSliceTest-1356100961993/jetty1/index lockFactory=org.apache.lucene.store.NativeFSLockFactory@2a0c48ca; maxCacheMB=48.0 maxMergeSizeMB=4.0)),segFN=segments_2,generation=2,filenames=[segments_2]
[junit4:junit4]   2> 		commit{dir=RateLimitedDirectoryWrapper(NRTCachingDirectory(org.apache.lucene.store.NIOFSDirectory@/usr/home/hudson/hudson-slave/workspace/Lucene-Solr-Tests-trunk-Java6/solr/build/solr-core/test/J0/org.apache.solr.cloud.SyncSliceTest-1356100961993/jetty1/index lockFactory=org.apache.lucene.store.NativeFSLockFactory@2a0c48ca; maxCacheMB=48.0 maxMergeSizeMB=4.0)),segFN=segments_3,generation=3,filenames=[segments_3]
[junit4:junit4]   2> 13792 T2353 C170 P41804 oasc.SolrDeletionPolicy.updateCommits newest commit = 3[segments_3]
[junit4:junit4]   2> 13793 T2353 C170 P41804 oasc.CachingDirectoryFactory.close Releasing directory:/usr/home/hudson/hudson-slave/workspace/Lucene-Solr-Tests-trunk-Java6/solr/build/solr-core/test/J0/./org.apache.solr.cloud.SyncSliceTest-1356100961993/jetty1
[junit4:junit4]   2> 13794 T2353 C170 P41804 oasu.DirectUpdateHandler2.commit end_commit_flush
[junit4:junit4]   2> 13794 T2353 C170 P41804 /update {waitSearcher=true&openSearcher=false&commit=true&commit_end_point=true&wt=javabin&softCommit=false&version=2} {commit=} 0 7
[junit4:junit4]   2> 13796 T2392 C171 P41818 oash.ReplicationHandler.inform Commits will be reserved for  10000
[junit4:junit4]   2> 13796 T2392 C171 P41818 oash.SnapPuller.<init>  No value set for 'pollInterval'. Timer Task not started.
[junit4:junit4]   2> 13799 T2351 C170 P41804 REQ /replication {command=indexversion&wt=javabin&qt=/replication&version=2} status=0 QTime=0 
[junit4:junit4]   2> 13800 T2392 C171 P41818 oash.SnapPuller.fetchLatestIndex Master's generation: 3
[junit4:junit4]   2> 13800 T2392 C171 P41818 oash.SnapPuller.fetchLatestIndex Slave's generation: 1
[junit4:junit4]   2> 13800 T2392 C171 P41818 oash.SnapPuller.fetchLatestIndex Starting replication process
[junit4:junit4]   2> 13803 T2351 C170 P41804 oasc.CachingDirectoryFactory.close Releasing directory:/usr/home/hudson/hudson-slave/workspace/Lucene-Solr-Tests-trunk-Java6/solr/build/solr-core/test/J0/./org.apache.solr.cloud.SyncSliceTest-1356100961993/jetty1
[junit4:junit4]   2> 13804 T2351 C170 P41804 oasc.CachingDirectoryFactory.close Releasing directory:/usr/home/hudson/hudson-slave/workspace/Lucene-Solr-Tests-trunk-Java6/solr/build/solr-core/test/J0/./org.apache.solr.cloud.SyncSliceTest-1356100961993/jetty1/index
[junit4:junit4]   2> 13804 T2351 C170 P41804 REQ /replication {command=filelist&generation=3&wt=javabin&qt=/replication&version=2} status=0 QTime=1 
[junit4:junit4]   2> 13805 T2392 C171 P41818 oash.SnapPuller.fetchLatestIndex Number of files in latest index in master: 1
[junit4:junit4]   2> 13806 T2392 C171 P41818 oasc.CachingDirectoryFactory.get return new directory for /usr/home/hudson/hudson-slave/workspace/Lucene-Solr-Tests-trunk-Java6/solr/build/solr-core/test/J0/./org.apache.solr.cloud.SyncSliceTest-1356100961993/jetty3/index.20121222004255793 forceNew:false
[junit4:junit4]   2> 13807 T2392 C171 P41818 oasc.CachingDirectoryFactory.close Releasing directory:/usr/home/hudson/hudson-slave/workspace/Lucene-Solr-Tests-trunk-Java6/solr/build/solr-core/test/J0/./org.apache.solr.cloud.SyncSliceTest-1356100961993/jetty3
[junit4:junit4]   2> 13807 T2392 C171 P41818 oash.SnapPuller.fetchLatestIndex Starting download to RateLimitedDirectoryWrapper(NRTCachingDirectory(org.apache.lucene.store.NIOFSDirectory@/usr/home/hudson/hudson-slave/workspace/Lucene-Solr-Tests-trunk-Java6/solr/build/solr-core/test/J0/org.apache.solr.cloud.SyncSliceTest-1356100961993/jetty3/index.20121222004255793 lockFactory=org.apache.lucene.store.NativeFSLockFactory@39ae2d5b; maxCacheMB=48.0 maxMergeSizeMB=4.0)) fullCopy=true
[junit4:junit4]   2> 13811 T2351 C170 P41804 REQ /replication {file=segments_3&command=filecontent&checksum=true&generation=3&qt=/replication&wt=filestream} status=0 QTime=0 
[junit4:junit4]   2> 13812 T2392 C171 P41818 oasc.CachingDirectoryFactory.close Releasing directory:/usr/home/hudson/hudson-slave/workspace/Lucene-Solr-Tests-trunk-Java6/solr/build/solr-core/test/J0/./org.apache.solr.cloud.SyncSliceTest-1356100961993/jetty3/index
[junit4:junit4]   2> 13813 T2392 C171 P41818 oash.SnapPuller.fetchLatestIndex Total time taken for download : 0 secs
[junit4:junit4]   2> 13814 T2392 C171 P41818 oash.SnapPuller.modifyIndexProps New index installed. Updating index properties... index=index.20121222004255793
[junit4:junit4]   2> 13815 T2392 C171 P41818 oasc.CachingDirectoryFactory.close Releasing directory:/usr/home/hudson/hudson-slave/workspace/Lucene-Solr-Tests-trunk-Java6/solr/build/solr-core/test/J0/./org.apache.solr.cloud.SyncSliceTest-1356100961993/jetty3
[junit4:junit4]   2> 13816 T2392 C171 P41818 oasc.CachingDirectoryFactory.close Releasing directory:/usr/home/hudson/hudson-slave/workspace/Lucene-Solr-Tests-trunk-Java6/solr/build/solr-core/test/J0/./org.apache.solr.cloud.SyncSliceTest-1356100961993/jetty3
[junit4:junit4]   2> 13816 T2392 C171 P41818 oasc.SolrCore.getNewIndexDir New index directory detected: old=./org.apache.solr.cloud.SyncSliceTest-1356100961993/jetty3/index/ new=./org.apache.solr.cloud.SyncSliceTest-1356100961993/jetty3/index.20121222004255793
[junit4:junit4]   2> 13819 T2392 C171 P41818 oasc.SolrDeletionPolicy.onInit SolrDeletionPolicy.onInit: commits:num=1
[junit4:junit4]   2> 		commit{dir=RateLimitedDirectoryWrapper(NRTCachingDirectory(org.apache.lucene.store.NIOFSDirectory@/usr/home/hudson/hudson-slave/workspace/Lucene-Solr-Tests-trunk-Java6/solr/build/solr-core/test/J0/org.apache.solr.cloud.SyncSliceTest-1356100961993/jetty3/index.20121222004255793 lockFactory=org.apache.lucene.store.NativeFSLockFactory@39ae2d5b; maxCacheMB=48.0 maxMergeSizeMB=4.0)),segFN=segments_3,generation=3,filenames=[segments_3]
[junit4:junit4]   2> 13820 T2392 C171 P41818 oasc.SolrDeletionPolicy.updateCommits newest commit = 3[segments_3]
[junit4:junit4]   2> 13821 T2392 C171 P41818 oasc.CachingDirectoryFactory.close Releasing directory:/usr/home/hudson/hudson-slave/workspace/Lucene-Solr-Tests-trunk-Java6/solr/build/solr-core/test/J0/./org.apache.solr.cloud.SyncSliceTest-1356100961993/jetty3
[junit4:junit4]   2> 13821 T2392 C171 P41818 oasu.DefaultSolrCoreState.newIndexWriter Creating new IndexWriter...
[junit4:junit4]   2> 13822 T2392 C171 P41818 oasu.DefaultSolrCoreState.newIndexWriter Waiting until IndexWriter is unused... core=collection1
[junit4:junit4]   2> 13822 T2392 C171 P41818 oasu.DefaultSolrCoreState.newIndexWriter Rollback old IndexWriter... core=collection1
[junit4:junit4]   2> 13823 T2392 C171 P41818 oasc.CachingDirectoryFactory.close Releasing directory:/usr/home/hudson/hudson-slave/workspace/Lucene-Solr-Tests-trunk-Java6/solr/build/solr-core/test/J0/./org.apache.solr.cloud.SyncSliceTest-1356100961993/jetty3/index.20121222004255793
[junit4:junit4]   2> 13823 T2392 C171 P41818 oasc.CachingDirectoryFactory.close Releasing directory:/usr/home/hudson/hudson-slave/workspace/Lucene-Solr-Tests-trunk-Java6/solr/build/solr-core/test/J0/./org.apache.solr.cloud.SyncSliceTest-1356100961993/jetty3
[junit4:junit4]   2> 13826 T2392 C171 P41818 oasc.SolrDeletionPolicy.onInit SolrDeletionPolicy.onInit: commits:num=1
[junit4:junit4]   2> 		commit{dir=RateLimitedDirectoryWrapper(NRTCachingDirectory(org.apache.lucene.store.NIOFSDirectory@/usr/home/hudson/hudson-slave/workspace/Lucene-Solr-Tests-trunk-Java6/solr/build/solr-core/test/J0/org.apache.solr.cloud.SyncSliceTest-1356100961993/jetty3/index.20121222004255793 lockFactory=org.apache.lucene.store.NativeFSLockFactory@39ae2d5b; maxCacheMB=48.0 maxMergeSizeMB=4.0)),segFN=segments_3,generation=3,filenames=[segments_3]
[junit4:junit4]   2> 13827 T2392 C171 P41818 oasc.SolrDeletionPolicy.updateCommits newest commit = 3[segments_3]
[junit4:junit4]   2> 13827 T2392 C171 P41818 oasu.DefaultSolrCoreState.newIndexWriter New IndexWriter is ready to be used.
[junit4:junit4]   2> 13828 T2392 C171 P41818 oasc.CachingDirectoryFactory.close Releasing directory:/usr/home/hudson/hudson-slave/workspace/Lucene-Solr-Tests-trunk-Java6/solr/build/solr-core/test/J0/./org.apache.solr.cloud.SyncSliceTest-1356100961993/jetty3
[junit4:junit4]   2> 13828 T2392 C171 P41818 oass.SolrIndexSearcher.<init> Opening Searcher@460504ad main
[junit4:junit4]   2> 13830 T2391 oasc.SolrCore.registerSearcher [collection1] Registered new searcher Searcher@460504ad main{StandardDirectoryReader(segments_3:1:nrt)}
[junit4:junit4]   2> 13830 T2391 oasc.CachingDirectoryFactory.close Releasing directory:/usr/home/hudson/hudson-slave/workspace/Lucene-Solr-Tests-trunk-Java6/solr/build/solr-core/test/J0/./org.apache.solr.cloud.SyncSliceTest-1356100961993/jetty3/index
[junit4:junit4]   2> 13830 T2392 C171 P41818 oasu.DirectUpdateHandler2.commit start commit{flags=0,_version_=0,optimize=false,openSearcher=false,waitSearcher=false,expungeDeletes=false,softCommit=false}
[junit4:junit4]   2> 13833 T2392 C171 P41818 oasc.SolrDeletionPolicy.onCommit SolrDeletionPolicy.onCommit: commits:num=2
[junit4:junit4]   2> 		commit{dir=RateLimitedDirectoryWrapper(NRTCachingDirectory(org.apache.lucene.store.NIOFSDirectory@/usr/home/hudson/hudson-slave/workspace/Lucene-Solr-Tests-trunk-Java6/solr/build/solr-core/test/J0/org.apache.solr.cloud.SyncSliceTest-1356100961993/jetty3/index.20121222004255793 lockFactory=org.apache.lucene.store.NativeFSLockFactory@39ae2d5b; maxCacheMB=48.0 maxMergeSizeMB=4.0)),segFN=segments_3,generation=3,filenames=[segments_3]
[junit4:junit4]   2> 		commit{dir=RateLimitedDirectoryWrapper(NRTCachingDirectory(org.apache.lucene.store.NIOFSDirectory@/usr/home/hudson/hudson-slave/workspace/Lucene-Solr-Tests-trunk-Java6/solr/build/solr-core/test/J0/org.apache.solr.cloud.SyncSliceTest-1356100961993/jetty3/index.20121222004255793 lockFactory=org.apache.lucene.store.NativeFSLockFactory@39ae2d5b; maxCacheMB=48.0 maxMergeSizeMB=4.0)),segFN=segments_4,generation=4,filenames=[segments_4]
[junit4:junit4]   2> 13834 T2392 C171 P41818 oasc.SolrDeletionPolicy.updateCommits newest commit = 4[segments_4]
[junit4:junit4]   2> 13835 T2392 C171 P41818 oasc.CachingDirectoryFactory.close Releasing directory:/usr/home/hudson/hudson-slave/workspace/Lucene-Solr-Tests-trunk-Java6/solr/build/solr-core/test/J0/./org.apache.solr.cloud.SyncSliceTest-1356100961993/jetty3
[junit4:junit4]   2> 13835 T2392 C171 P41818 oasu.DirectUpdateHandler2.commit end_commit_flush
[junit4:junit4]   2> 13836 T2392 C171 P41818 oasc.CachingDirectoryFactory.close Releasing directory:/usr/home/hudson/hudson-slave/workspace/Lucene-Solr-Tests-trunk-Java6/solr/build/solr-core/test/J0/./org.apache.solr.cloud.SyncSliceTest-1356100961993/jetty3/index.20121222004255793
[junit4:junit4]   2> 13836 T2392 C171 P41818 oasc.CachingDirectoryFactory.close Releasing directory:/usr/home/hudson/hudson-slave/workspace/Lucene-Solr-Tests-trunk-Java6/solr/build/solr-core/test/J0/./org.apache.solr.cloud.SyncSliceTest-1356100961993/jetty3/index
[junit4:junit4]   2> 13836 T2392 C171 P41818 oasc.RecoveryStrategy.replay No replay needed. core=collection1
[junit4:junit4]   2> 13836 T2392 C171 P41818 oasc.RecoveryStrategy.doRecovery Replication Recovery was successful - registering as Active. core=collection1
[junit4:junit4]   2> 13836 T2392 C171 P41818 oasc.ZkController.publish publishing core=collection1 state=active
[junit4:junit4]   2> 13837 T2392 C171 P41818 oasc.ZkController.publish numShards not found on descriptor - reading it from system property
[junit4:junit4]   2> 13844 T2392 C171 P41818 oasc.RecoveryStrategy.doRecovery Finished recovery process. core=collection1
[junit4:junit4]   2> 14012 T2339 oascc.ZkStateReader.updateClusterState Updating cloud state from ZooKeeper... 
[junit4:junit4]   2> 14013 T2339 oasc.Overseer$ClusterStateUpdater.updateState Update state numShards=1 message={
[junit4:junit4]   2> 	  "operation":"state",
[junit4:junit4]   2> 	  "numShards":"1",
[junit4:junit4]   2> 	  "shard":"shard1",
[junit4:junit4]   2> 	  "roles":null,
[junit4:junit4]   2> 	  "state":"active",
[junit4:junit4]   2> 	  "core":"collection1",
[junit4:junit4]   2> 	  "collection":"collection1",
[junit4:junit4]   2> 	  "node_name":"127.0.0.1:41818__nia",
[junit4:junit4]   2> 	  "base_url":"http://127.0.0.1:41818/_nia"}
[junit4:junit4]   2> 14026 T2357 oascc.ZkStateReader$2.process A cluster state change: WatchedEvent state:SyncConnected type:NodeDataChanged path:/clusterstate.json, has occurred - updating... (live nodes size: 5)
[junit4:junit4]   2> 14026 T2406 oascc.ZkStateReader$2.process A cluster state change: WatchedEvent state:SyncConnected type:NodeDataChanged path:/clusterstate.json, has occurred - updating... (live nodes size: 5)
[junit4:junit4]   2> 14026 T2338 oascc.ZkStateReader$2.process A cluster state change: WatchedEvent state:SyncConnected type:NodeDataChanged path:/clusterstate.json, has occurred - updating... (live nodes size: 5)
[junit4:junit4]   2> 14026 T2372 oascc.ZkStateReader$2.process A cluster state change: WatchedEvent state:SyncConnected type:NodeDataChanged path:/clusterstate.json, has occurred - updating... (live nodes size: 5)
[junit4:junit4]   2> 14026 T2344 oascc.ZkStateReader$2.process A cluster state change: WatchedEvent state:SyncConnected type:NodeDataChanged path:/clusterstate.json, has occurred - updating... (live nodes size: 5)
[junit4:junit4]   2> 14026 T2389 oascc.ZkStateReader$2.process A cluster state change: WatchedEvent state:SyncConnected type:NodeDataChanged path:/clusterstate.json, has occurred - updating... (live nodes size: 5)
[junit4:junit4]   2> 14234 T2316 oascc.ZkStateReader.updateClusterState Updating cloud state from ZooKeeper... 
[junit4:junit4]   2> 15237 T2316 oascc.ZkStateReader.updateClusterState Updating cloud state from ZooKeeper... 
[junit4:junit4]   2>  C172_STATE=coll:collection1 core:collection1 props:{shard=shard1, roles=null, state=recovering, core=collection1, collection=collection1, node_name=127.0.0.1:41825__nia, base_url=http://127.0.0.1:41825/_nia}
[junit4:junit4]   2> 16231 T2410 C172 P41825 oasc.RecoveryStrategy.doRecovery Begin buffering updates. core=collection1
[junit4:junit4]   2> 16231 T2410 C172 P41825 oasu.UpdateLog.bufferUpdates Starting to buffer updates. FSUpdateLog{state=ACTIVE, tlog=null}
[junit4:junit4]   2> 16231 T2410 C172 P41825 oasc.RecoveryStrategy.replicate Attempting to replicate from http://127.0.0.1:41804/_nia/collection1/. core=collection1
[junit4:junit4]   2> 16232 T2410 C172 P41825 oascsi.HttpClientUtil.createClient Creating new http client, config:maxConnections=128&maxConnectionsPerHost=32&followRedirects=false
[junit4:junit4]   2> 16240 T2316 oascc.ZkStateReader.updateClusterState Updating cloud state from ZooKeeper... 
[junit4:junit4]   2> 16246 T2348 C170 P41804 oasu.DirectUpdateHandler2.commit start commit{flags=0,_version_=0,optimize=false,openSearcher=false,waitSearcher=true,expungeDeletes=false,softCommit=false}
[junit4:junit4]   2> 16250 T2348 C170 P41804 oasc.SolrDeletionPolicy.onCommit SolrDeletionPolicy.onCommit: commits:num=3
[junit4:junit4]   2> 		commit{dir=RateLimitedDirectoryWrapper(NRTCachingDirectory(org.apache.lucene.store.NIOFSDirectory@/usr/home/hudson/hudson-slave/workspace/Lucene-Solr-Tests-trunk-Java6/solr/build/solr-core/test/J0/org.apache.solr.cloud.SyncSliceTest-1356100961993/jetty1/index lockFactory=org.apache.lucene.store.NativeFSLockFactory@2a0c48ca; maxCacheMB=48.0 maxMergeSizeMB=4.0)),segFN=segments_2,generation=2,filenames=[segments_2]
[junit4:junit4]   2> 		commit{dir=RateLimitedDirectoryWrapper(NRTCachingDirectory(org.apache.lucene.store.NIOFSDirectory@/usr/home/hudson/hudson-slave/workspace/Lucene-Solr-Tests-trunk-Java6/solr/build/solr-core/test/J0/org.apache.solr.cloud.SyncSliceTest-1356100961993/jetty1/index lockFactory=org.apache.lucene.store.NativeFSLockFactory@2a0c48ca; maxCacheMB=48.0 maxMergeSizeMB=4.0)),segFN=segments_3,generation=3,filenames=[segments_3]
[junit4:junit4]   2> 		commit{dir=RateLimitedDirectoryWrapper(NRTCachingDirectory(org.apache.lucene.store.NIOFSDirectory@/usr/home/hudson/hudson-slave/workspace/Lucene-Solr-Tests-trunk-Java6/solr/build/solr-core/test/J0/org.apache.solr.cloud.SyncSliceTest-1356100961993/jetty1/index lockFactory=org.apache.lucene.store.NativeFSLockFactory@2a0c48ca; maxCacheMB=48.0 maxMergeSizeMB=4.0)),segFN=segments_4,generation=4,filenames=[segments_4]
[junit4:junit4]   2> 16251 T2348 C170 P41804 oasc.SolrDeletionPolicy.updateCommits newest commit = 4[segments_4]
[junit4:junit4]   2> 16251 T2348 C170 P41804 oasc.CachingDirectoryFac

[...truncated too long message...]

497ABACD7E02F9]:0)
[junit4:junit4]    > 	at org.junit.Assert.fail(Assert.java:93)
[junit4:junit4]    > 	at org.junit.Assert.assertTrue(Assert.java:43)
[junit4:junit4]    > 	at org.junit.Assert.assertNotNull(Assert.java:526)
[junit4:junit4]    > 	at org.apache.solr.cloud.SyncSliceTest.doTest(SyncSliceTest.java:220)
[junit4:junit4]    > 	at org.apache.solr.BaseDistributedSearchTestCase.testDistribSearch(BaseDistributedSearchTestCase.java:794)
[junit4:junit4]    > 	at sun.reflect.NativeMethodAccessorImpl.invoke0(Native Method)
[junit4:junit4]    > 	at sun.reflect.NativeMethodAccessorImpl.invoke(NativeMethodAccessorImpl.java:57)
[junit4:junit4]    > 	at sun.reflect.DelegatingMethodAccessorImpl.invoke(DelegatingMethodAccessorImpl.java:43)
[junit4:junit4]    > 	at java.lang.reflect.Method.invoke(Method.java:616)
[junit4:junit4]    > 	at com.carrotsearch.randomizedtesting.RandomizedRunner.invoke(RandomizedRunner.java:1559)
[junit4:junit4]    > 	at com.carrotsearch.randomizedtesting.RandomizedRunner.access$600(RandomizedRunner.java:79)
[junit4:junit4]    > 	at com.carrotsearch.randomizedtesting.RandomizedRunner$6.evaluate(RandomizedRunner.java:737)
[junit4:junit4]    > 	at com.carrotsearch.randomizedtesting.RandomizedRunner$7.evaluate(RandomizedRunner.java:773)
[junit4:junit4]    > 	at com.carrotsearch.randomizedtesting.RandomizedRunner$8.evaluate(RandomizedRunner.java:787)
[junit4:junit4]    > 	at com.carrotsearch.randomizedtesting.rules.SystemPropertiesRestoreRule$1.evaluate(SystemPropertiesRestoreRule.java:53)
[junit4:junit4]    > 	at org.apache.lucene.util.TestRuleSetupTeardownChained$1.evaluate(TestRuleSetupTeardownChained.java:50)
[junit4:junit4]    > 	at org.apache.lucene.util.TestRuleFieldCacheSanity$1.evaluate(TestRuleFieldCacheSanity.java:51)
[junit4:junit4]    > 	at org.apache.lucene.util.AbstractBeforeAfterRule$1.evaluate(AbstractBeforeAfterRule.java:46)
[junit4:junit4]    > 	at com.carrotsearch.randomizedtesting.rules.SystemPropertiesInvariantRule$1.evaluate(SystemPropertiesInvariantRule.java:55)
[junit4:junit4]    > 	at org.apache.lucene.util.TestRuleThreadAndTestName$1.evaluate(TestRuleThreadAndTestName.java:49)
[junit4:junit4]    > 	at org.apache.lucene.util.TestRuleIgnoreAfterMaxFailures$1.evaluate(TestRuleIgnoreAfterMaxFailures.java:70)
[junit4:junit4]    > 	at org.apache.lucene.util.TestRuleMarkFailure$1.evaluate(TestRuleMarkFailure.java:48)
[junit4:junit4]    > 	at com.carrotsearch.randomizedtesting.rules.StatementAdapter.evaluate(StatementAdapter.java:36)
[junit4:junit4]    > 	at com.carrotsearch.randomizedtesting.ThreadLeakControl$StatementRunner.run(ThreadLeakControl.java:358)
[junit4:junit4]    > 	at com.carrotsearch.randomizedtesting.ThreadLeakControl.forkTimeoutingTask(ThreadLeakControl.java:782)
[junit4:junit4]    > 	at com.carrotsearch.randomizedtesting.ThreadLeakControl$3.evaluate(ThreadLeakControl.java:442)
[junit4:junit4]    > 	at com.carrotsearch.randomizedtesting.RandomizedRunner.runSingleTest(RandomizedRunner.java:746)
[junit4:junit4]    > 	at com.carrotsearch.randomizedtesting.RandomizedRunner$3.evaluate(RandomizedRunner.java:648)
[junit4:junit4]    > 	at com.carrotsearch.randomizedtesting.RandomizedRunner$4.evaluate(RandomizedRunner.java:682)
[junit4:junit4]    > 	at com.carrotsearch.randomizedtesting.RandomizedRunner$5.evaluate(RandomizedRunner.java:693)
[junit4:junit4]    > 	at com.carrotsearch.randomizedtesting.rules.StatementAdapter.evaluate(StatementAdapter.java:36)
[junit4:junit4]    > 	at com.carrotsearch.randomizedtesting.rules.SystemPropertiesRestoreRule$1.evaluate(SystemPropertiesRestoreRule.java:53)
[junit4:junit4]    > 	at org.apache.lucene.util.AbstractBeforeAfterRule$1.evaluate(AbstractBeforeAfterRule.java:46)
[junit4:junit4]    > 	at org.apache.lucene.util.TestRuleStoreClassName$1.evaluate(TestRuleStoreClassName.java:42)
[junit4:junit4]    > 	at com.carrotsearch.randomizedtesting.rules.SystemPropertiesInvariantRule$1.evaluate(SystemPropertiesInvariantRule.java:55)
[junit4:junit4]    > 	at com.carrotsearch.randomizedtesting.rules.NoShadowingOrOverridesOnMethodsRule$1.evaluate(NoShadowingOrOverridesOnMethodsRule.java:39)
[junit4:junit4]    > 	at com.carrotsearch.randomizedtesting.rules.NoShadowingOrOverridesOnMethodsRule$1.evaluate(NoShadowingOrOverridesOnMethodsRule.java:39)
[junit4:junit4]    > 	at com.carrotsearch.randomizedtesting.rules.StatementAdapter.evaluate(StatementAdapter.java:36)
[junit4:junit4]    > 	at org.apache.lucene.util.TestRuleAssertionsRequired$1.evaluate(TestRuleAssertionsRequired.java:43)
[junit4:junit4]    > 	at org.apache.lucene.util.TestRuleMarkFailure$1.evaluate(TestRuleMarkFailure.java:48)
[junit4:junit4]    > 	at org.apache.lucene.util.TestRuleIgnoreAfterMaxFailures$1.evaluate(TestRuleIgnoreAfterMaxFailures.java:70)
[junit4:junit4]    > 	at org.apache.lucene.util.TestRuleIgnoreTestSuites$1.evaluate(TestRuleIgnoreTestSuites.java:55)
[junit4:junit4]    > 	at com.carrotsearch.randomizedtesting.rules.StatementAdapter.evaluate(StatementAdapter.java:36)
[junit4:junit4]    > 	at com.carrotsearch.randomizedtesting.ThreadLeakControl$StatementRunner.run(ThreadLeakControl.java:358)
[junit4:junit4]    > 	at java.lang.Thread.run(Thread.java:679)
[junit4:junit4]   2> 124640 T2316 oas.SolrTestCaseJ4.deleteCore ###deleteCore
[junit4:junit4]   2> NOTE: test params are: codec=Lucene41: {range_facet_l=PostingsFormat(name=Memory doPackFST= false), text=PostingsFormat(name=Memory doPackFST= true), _version_=PostingsFormat(name=SimpleText), rnd_b=PostingsFormat(name=Asserting), intDefault=PostingsFormat(name=SimpleText), id=PostingsFormat(name=Asserting), timestamp=PostingsFormat(name=Memory doPackFST= false), a_t=PostingsFormat(name=Memory doPackFST= false), range_facet_sl=PostingsFormat(name=Asserting), range_facet_si=PostingsFormat(name=Memory doPackFST= false), other_tl1=PostingsFormat(name=SimpleText), multiDefault=PostingsFormat(name=Memory doPackFST= false), a_si=PostingsFormat(name=SimpleText)}, sim=DefaultSimilarity, locale=hu, timezone=Pacific/Guam
[junit4:junit4]   2> NOTE: FreeBSD 9.0-RELEASE amd64/Sun Microsystems Inc. 1.6.0_32 (64-bit)/cpus=16,threads=2,free=216405056,total=461242368
[junit4:junit4]   2> NOTE: All tests run in this JVM: [CacheHeaderTest, DistributedSpellCheckComponentTest, ShardRoutingCustomTest, CoreAdminHandlerTest, BinaryUpdateRequestHandlerTest, SolrRequestParserTest, TestBinaryResponseWriter, SystemInfoHandlerTest, NumericFieldsTest, SortByFunctionTest, TestSystemIdResolver, SpellCheckComponentTest, CircularListTest, TestCollationField, TestCoreContainer, TestRTGBase, TestIndexSearcher, TestBadConfig, MinimalSchemaTest, TestJoin, DirectUpdateHandlerOptimizeTest, TestConfig, SimpleFacetsTest, BasicDistributedZk2Test, TestFastLRUCache, TermVectorComponentDistributedTest, TestDefaultSimilarityFactory, CSVRequestHandlerTest, UpdateRequestProcessorFactoryTest, TestIndexingPerformance, ZkControllerTest, NoCacheHeaderTest, TestLMDirichletSimilarityFactory, TestSuggestSpellingConverter, HighlighterConfigTest, SolrCoreCheckLockOnStartupTest, AlternateDirectoryTest, BadComponentTest, TestDocumentBuilder, LoggingHandlerTest, TestLFUCache, JsonLoaderTest, TestNumberUtils, DistributedTermsComponentTest, TestPseudoReturnFields, TestFastWriter, ResourceLoaderTest, TestIBSimilarityFactory, TestPerFieldSimilarity, TestXIncludeConfig, CollectionsAPIDistributedZkTest, MoreLikeThisHandlerTest, TestRangeQuery, SuggesterWFSTTest, SampleTest, SolrPluginUtilsTest, FullSolrCloudDistribCmdsTest, TestReplicationHandler, LeaderElectionIntegrationTest, TestRealTimeGet, TestDistributedGrouping, TestDistributedSearch, SpellCheckCollatorTest, TestExtendedDismaxParser, SoftAutoCommitTest, AutoCommitTest, BasicZkTest, ZkSolrClientTest, WordBreakSolrSpellCheckerTest, StatsComponentTest, SolrCoreTest, LukeRequestHandlerTest, TestSort, DirectSolrSpellCheckerTest, TestFiltering, QueryElevationComponentTest, DirectSolrConnectionTest, TestWordDelimiterFilterFactory, PolyFieldTest, SpatialFilterTest, IndexSchemaTest, TermsComponentTest, XsltUpdateRequestHandlerTest, TestPHPSerializedResponseWriter, TermVectorComponentTest, TestValueSourceCache, DebugComponentTest, RequestHandlersTest, TestOmitPositions, CopyFieldTest, TestArbitraryIndexDir, UniqFieldsUpdateProcessorFactoryTest, SuggesterTest, TestSearchPerf, NotRequiredUniqueKeyTest, TestFoldingMultitermQuery, TestSolrDeletionPolicy1, FieldMutatingUpdateProcessorTest, TestUpdate, SOLR749Test, DefaultValueUpdateProcessorTest, SolrIndexConfigTest, OutputWriterTest, TestSolrCoreProperties, EchoParamsTest, TestBM25SimilarityFactory, LegacyHTMLStripCharFilterTest, TestCodecSupport, URLClassifyProcessorTest, TestLRUCache, RAMDirectoryFactoryTest, ClusterStateTest, OverseerCollectionProcessorTest, SyncSliceTest]
[junit4:junit4] Completed on J0 in 124.66s, 1 test, 1 failure <<< FAILURES!

[...truncated 10 lines...]
BUILD FAILED
/usr/home/hudson/hudson-slave/workspace/Lucene-Solr-Tests-trunk-Java6/build.xml:353: The following error occurred while executing this line:
/usr/home/hudson/hudson-slave/workspace/Lucene-Solr-Tests-trunk-Java6/build.xml:39: The following error occurred while executing this line:
/usr/home/hudson/hudson-slave/workspace/Lucene-Solr-Tests-trunk-Java6/solr/build.xml:178: The following error occurred while executing this line:
/usr/home/hudson/hudson-slave/workspace/Lucene-Solr-Tests-trunk-Java6/solr/common-build.xml:438: The following error occurred while executing this line:
/usr/home/hudson/hudson-slave/workspace/Lucene-Solr-Tests-trunk-Java6/lucene/common-build.xml:1175: The following error occurred while executing this line:
/usr/home/hudson/hudson-slave/workspace/Lucene-Solr-Tests-trunk-Java6/lucene/common-build.xml:840: There were test failures: 243 suites, 1007 tests, 1 failure, 21 ignored (3 assumptions)

Total time: 30 minutes 45 seconds
Build step 'Invoke Ant' marked build as failure
Archiving artifacts
Recording test results
Email was triggered for: Failure
Sending email for trigger: Failure



Mime
View raw message