lucene-dev mailing list archives

Site index · List index
Message view « Date » · « Thread »
Top « Date » · « Thread »
From Apache Jenkins Server <jenk...@builds.apache.org>
Subject [JENKINS] Lucene-Solr-Tests-trunk-Java6 - Build # 15723 - Failure
Date Tue, 18 Dec 2012 16:05:56 GMT
Build: https://builds.apache.org/job/Lucene-Solr-Tests-trunk-Java6/15723/

1 tests failed.
REGRESSION:  org.apache.solr.cloud.SyncSliceTest.testDistribSearch

Error Message:


Stack Trace:
java.lang.AssertionError
	at __randomizedtesting.SeedInfo.seed([E7F8EAEDE8F1510E:661E64F59FAE3132]:0)
	at org.junit.Assert.fail(Assert.java:92)
	at org.junit.Assert.assertTrue(Assert.java:43)
	at org.junit.Assert.assertNotNull(Assert.java:526)
	at org.junit.Assert.assertNotNull(Assert.java:537)
	at org.apache.solr.cloud.SyncSliceTest.doTest(SyncSliceTest.java:211)
	at org.apache.solr.BaseDistributedSearchTestCase.testDistribSearch(BaseDistributedSearchTestCase.java:794)
	at sun.reflect.NativeMethodAccessorImpl.invoke0(Native Method)
	at sun.reflect.NativeMethodAccessorImpl.invoke(NativeMethodAccessorImpl.java:57)
	at sun.reflect.DelegatingMethodAccessorImpl.invoke(DelegatingMethodAccessorImpl.java:43)
	at java.lang.reflect.Method.invoke(Method.java:616)
	at com.carrotsearch.randomizedtesting.RandomizedRunner.invoke(RandomizedRunner.java:1559)
	at com.carrotsearch.randomizedtesting.RandomizedRunner.access$600(RandomizedRunner.java:79)
	at com.carrotsearch.randomizedtesting.RandomizedRunner$6.evaluate(RandomizedRunner.java:737)
	at com.carrotsearch.randomizedtesting.RandomizedRunner$7.evaluate(RandomizedRunner.java:773)
	at com.carrotsearch.randomizedtesting.RandomizedRunner$8.evaluate(RandomizedRunner.java:787)
	at com.carrotsearch.randomizedtesting.rules.SystemPropertiesRestoreRule$1.evaluate(SystemPropertiesRestoreRule.java:53)
	at org.apache.lucene.util.TestRuleSetupTeardownChained$1.evaluate(TestRuleSetupTeardownChained.java:50)
	at org.apache.lucene.util.TestRuleFieldCacheSanity$1.evaluate(TestRuleFieldCacheSanity.java:51)
	at org.apache.lucene.util.AbstractBeforeAfterRule$1.evaluate(AbstractBeforeAfterRule.java:46)
	at com.carrotsearch.randomizedtesting.rules.SystemPropertiesInvariantRule$1.evaluate(SystemPropertiesInvariantRule.java:55)
	at org.apache.lucene.util.TestRuleThreadAndTestName$1.evaluate(TestRuleThreadAndTestName.java:49)
	at org.apache.lucene.util.TestRuleIgnoreAfterMaxFailures$1.evaluate(TestRuleIgnoreAfterMaxFailures.java:70)
	at org.apache.lucene.util.TestRuleMarkFailure$1.evaluate(TestRuleMarkFailure.java:48)
	at com.carrotsearch.randomizedtesting.rules.StatementAdapter.evaluate(StatementAdapter.java:36)
	at com.carrotsearch.randomizedtesting.ThreadLeakControl$StatementRunner.run(ThreadLeakControl.java:358)
	at com.carrotsearch.randomizedtesting.ThreadLeakControl.forkTimeoutingTask(ThreadLeakControl.java:782)
	at com.carrotsearch.randomizedtesting.ThreadLeakControl$3.evaluate(ThreadLeakControl.java:442)
	at com.carrotsearch.randomizedtesting.RandomizedRunner.runSingleTest(RandomizedRunner.java:746)
	at com.carrotsearch.randomizedtesting.RandomizedRunner$3.evaluate(RandomizedRunner.java:648)
	at com.carrotsearch.randomizedtesting.RandomizedRunner$4.evaluate(RandomizedRunner.java:682)
	at com.carrotsearch.randomizedtesting.RandomizedRunner$5.evaluate(RandomizedRunner.java:693)
	at com.carrotsearch.randomizedtesting.rules.StatementAdapter.evaluate(StatementAdapter.java:36)
	at com.carrotsearch.randomizedtesting.rules.SystemPropertiesRestoreRule$1.evaluate(SystemPropertiesRestoreRule.java:53)
	at org.apache.lucene.util.AbstractBeforeAfterRule$1.evaluate(AbstractBeforeAfterRule.java:46)
	at org.apache.lucene.util.TestRuleStoreClassName$1.evaluate(TestRuleStoreClassName.java:42)
	at com.carrotsearch.randomizedtesting.rules.SystemPropertiesInvariantRule$1.evaluate(SystemPropertiesInvariantRule.java:55)
	at com.carrotsearch.randomizedtesting.rules.NoShadowingOrOverridesOnMethodsRule$1.evaluate(NoShadowingOrOverridesOnMethodsRule.java:39)
	at com.carrotsearch.randomizedtesting.rules.NoShadowingOrOverridesOnMethodsRule$1.evaluate(NoShadowingOrOverridesOnMethodsRule.java:39)
	at com.carrotsearch.randomizedtesting.rules.StatementAdapter.evaluate(StatementAdapter.java:36)
	at org.apache.lucene.util.TestRuleAssertionsRequired$1.evaluate(TestRuleAssertionsRequired.java:43)
	at org.apache.lucene.util.TestRuleMarkFailure$1.evaluate(TestRuleMarkFailure.java:48)
	at org.apache.lucene.util.TestRuleIgnoreAfterMaxFailures$1.evaluate(TestRuleIgnoreAfterMaxFailures.java:70)
	at org.apache.lucene.util.TestRuleIgnoreTestSuites$1.evaluate(TestRuleIgnoreTestSuites.java:55)
	at com.carrotsearch.randomizedtesting.rules.StatementAdapter.evaluate(StatementAdapter.java:36)
	at com.carrotsearch.randomizedtesting.ThreadLeakControl$StatementRunner.run(ThreadLeakControl.java:358)
	at java.lang.Thread.run(Thread.java:679)




Build Log:
[...truncated 8172 lines...]
[junit4:junit4] Suite: org.apache.solr.cloud.SyncSliceTest
[junit4:junit4]   2> 0 T145 oas.BaseDistributedSearchTestCase.initHostContext Setting hostContext system property: /c_s/st
[junit4:junit4]   2> 6 T145 oas.SolrTestCaseJ4.setUp ###Starting testDistribSearch
[junit4:junit4]   2> Creating dataDir: /usr/home/hudson/hudson-slave/workspace/Lucene-Solr-Tests-trunk-Java6/solr/build/solr-core/test/J1/./solrtest-SyncSliceTest-1355845925328
[junit4:junit4]   2> 7 T145 oasc.ZkTestServer.run STARTING ZK TEST SERVER
[junit4:junit4]   2> 8 T146 oasc.ZkTestServer$ZKServerMain.runFromConfig Starting server
[junit4:junit4]   2> 10 T146 oazs.ZooKeeperServer.setTickTime tickTime set to 1000
[junit4:junit4]   2> 11 T146 oazs.ZooKeeperServer.setMinSessionTimeout minSessionTimeout set to -1
[junit4:junit4]   2> 11 T146 oazs.ZooKeeperServer.setMaxSessionTimeout maxSessionTimeout set to -1
[junit4:junit4]   2> 11 T146 oazs.NIOServerCnxnFactory.configure binding to port 0.0.0.0/0.0.0.0:0
[junit4:junit4]   2> 12 T146 oazsp.FileTxnSnapLog.save Snapshotting: 0x0 to /usr/home/hudson/hudson-slave/workspace/Lucene-Solr-Tests-trunk-Java6/solr/build/solr-core/test/J1/./org.apache.solr.cloud.SyncSliceTest-1355845925328/zookeeper/server1/data/version-2/snapshot.0
[junit4:junit4]   2> 109 T145 oasc.ZkTestServer.run start zk server on port:45167
[junit4:junit4]   2> 109 T145 oaz.ZooKeeper.<init> Initiating client connection, connectString=127.0.0.1:45167 sessionTimeout=10000 watcher=org.apache.solr.common.cloud.ConnectionManager@57fd5730
[junit4:junit4]   2> 110 T145 oascc.ConnectionManager.waitForConnected Waiting for client to connect to ZooKeeper
[junit4:junit4]   2> 111 T151 oaz.ClientCnxn$SendThread.logStartConnect Opening socket connection to server localhost/127.0.0.1:45167. Will not attempt to authenticate using SASL (access denied (javax.security.auth.AuthPermission getLoginConfiguration))
[junit4:junit4]   2> 112 T151 oaz.ClientCnxn$SendThread.primeConnection Socket connection established to localhost/127.0.0.1:45167, initiating session
[junit4:junit4]   2> 112 T147 oazs.NIOServerCnxnFactory.run Accepted socket connection from /140.211.11.196:59288
[junit4:junit4]   2> 113 T147 oazs.ZooKeeperServer.processConnectRequest Client attempting to establish new session at /140.211.11.196:59288
[junit4:junit4]   2> 113 T149 oazsp.FileTxnLog.append Creating new log file: log.1
[junit4:junit4]   2> 116 T149 oazs.ZooKeeperServer.finishSessionInit Established session 0x13baeb6f9d60000 with negotiated timeout 10000 for client /140.211.11.196:59288
[junit4:junit4]   2> 116 T151 oaz.ClientCnxn$SendThread.onConnected Session establishment complete on server localhost/127.0.0.1:45167, sessionid = 0x13baeb6f9d60000, negotiated timeout = 10000
[junit4:junit4]   2> 116 T152 oascc.ConnectionManager.process Watcher org.apache.solr.common.cloud.ConnectionManager@57fd5730 name:ZooKeeperConnection Watcher:127.0.0.1:45167 got event WatchedEvent state:SyncConnected type:None path:null path:null type:None
[junit4:junit4]   2> 117 T145 oascc.ConnectionManager.waitForConnected Client is connected to ZooKeeper
[junit4:junit4]   2> 117 T145 oascc.SolrZkClient.makePath makePath: /solr
[junit4:junit4]   2> 122 T150 oazs.PrepRequestProcessor.pRequest2Txn Processed session termination for sessionid: 0x13baeb6f9d60000
[junit4:junit4]   2> 124 T147 oazs.NIOServerCnxn.closeSock Closed socket connection for client /140.211.11.196:59288 which had sessionid 0x13baeb6f9d60000
[junit4:junit4]   2> 124 T145 oaz.ZooKeeper.close Session: 0x13baeb6f9d60000 closed
[junit4:junit4]   2> 124 T152 oaz.ClientCnxn$EventThread.run EventThread shut down
[junit4:junit4]   2> 124 T145 oaz.ZooKeeper.<init> Initiating client connection, connectString=127.0.0.1:45167/solr sessionTimeout=10000 watcher=org.apache.solr.common.cloud.ConnectionManager@66e9a555
[junit4:junit4]   2> 125 T145 oascc.ConnectionManager.waitForConnected Waiting for client to connect to ZooKeeper
[junit4:junit4]   2> 126 T153 oaz.ClientCnxn$SendThread.logStartConnect Opening socket connection to server localhost/127.0.0.1:45167. Will not attempt to authenticate using SASL (access denied (javax.security.auth.AuthPermission getLoginConfiguration))
[junit4:junit4]   2> 126 T153 oaz.ClientCnxn$SendThread.primeConnection Socket connection established to localhost/127.0.0.1:45167, initiating session
[junit4:junit4]   2> 126 T147 oazs.NIOServerCnxnFactory.run Accepted socket connection from /140.211.11.196:47600
[junit4:junit4]   2> 127 T147 oazs.ZooKeeperServer.processConnectRequest Client attempting to establish new session at /140.211.11.196:47600
[junit4:junit4]   2> 128 T149 oazs.ZooKeeperServer.finishSessionInit Established session 0x13baeb6f9d60001 with negotiated timeout 10000 for client /140.211.11.196:47600
[junit4:junit4]   2> 128 T153 oaz.ClientCnxn$SendThread.onConnected Session establishment complete on server localhost/127.0.0.1:45167, sessionid = 0x13baeb6f9d60001, negotiated timeout = 10000
[junit4:junit4]   2> 128 T154 oascc.ConnectionManager.process Watcher org.apache.solr.common.cloud.ConnectionManager@66e9a555 name:ZooKeeperConnection Watcher:127.0.0.1:45167/solr got event WatchedEvent state:SyncConnected type:None path:null path:null type:None
[junit4:junit4]   2> 129 T145 oascc.ConnectionManager.waitForConnected Client is connected to ZooKeeper
[junit4:junit4]   2> 129 T145 oascc.SolrZkClient.makePath makePath: /collections/collection1
[junit4:junit4]   2> 139 T145 oascc.SolrZkClient.makePath makePath: /collections/collection1/shards
[junit4:junit4]   2> 143 T145 oascc.SolrZkClient.makePath makePath: /collections/control_collection
[junit4:junit4]   2> 147 T145 oascc.SolrZkClient.makePath makePath: /collections/control_collection/shards
[junit4:junit4]   2> 151 T145 oasc.AbstractZkTestCase.putConfig put /usr/home/hudson/hudson-slave/workspace/Lucene-Solr-Tests-trunk-Java6/solr/build/solr-core/test-files/solr/collection1/conf/solrconfig.xml to /configs/conf1/solrconfig.xml
[junit4:junit4]   2> 152 T145 oascc.SolrZkClient.makePath makePath: /configs/conf1/solrconfig.xml
[junit4:junit4]   2> 165 T145 oasc.AbstractZkTestCase.putConfig put /usr/home/hudson/hudson-slave/workspace/Lucene-Solr-Tests-trunk-Java6/solr/build/solr-core/test-files/solr/collection1/conf/schema.xml to /configs/conf1/schema.xml
[junit4:junit4]   2> 166 T145 oascc.SolrZkClient.makePath makePath: /configs/conf1/schema.xml
[junit4:junit4]   2> 273 T145 oasc.AbstractZkTestCase.putConfig put /usr/home/hudson/hudson-slave/workspace/Lucene-Solr-Tests-trunk-Java6/solr/build/solr-core/test-files/solr/collection1/conf/stopwords.txt to /configs/conf1/stopwords.txt
[junit4:junit4]   2> 273 T145 oascc.SolrZkClient.makePath makePath: /configs/conf1/stopwords.txt
[junit4:junit4]   2> 277 T145 oasc.AbstractZkTestCase.putConfig put /usr/home/hudson/hudson-slave/workspace/Lucene-Solr-Tests-trunk-Java6/solr/build/solr-core/test-files/solr/collection1/conf/protwords.txt to /configs/conf1/protwords.txt
[junit4:junit4]   2> 278 T145 oascc.SolrZkClient.makePath makePath: /configs/conf1/protwords.txt
[junit4:junit4]   2> 287 T145 oasc.AbstractZkTestCase.putConfig put /usr/home/hudson/hudson-slave/workspace/Lucene-Solr-Tests-trunk-Java6/solr/build/solr-core/test-files/solr/collection1/conf/currency.xml to /configs/conf1/currency.xml
[junit4:junit4]   2> 288 T145 oascc.SolrZkClient.makePath makePath: /configs/conf1/currency.xml
[junit4:junit4]   2> 292 T145 oasc.AbstractZkTestCase.putConfig put /usr/home/hudson/hudson-slave/workspace/Lucene-Solr-Tests-trunk-Java6/solr/build/solr-core/test-files/solr/collection1/conf/open-exchange-rates.json to /configs/conf1/open-exchange-rates.json
[junit4:junit4]   2> 292 T145 oascc.SolrZkClient.makePath makePath: /configs/conf1/open-exchange-rates.json
[junit4:junit4]   2> 296 T145 oasc.AbstractZkTestCase.putConfig put /usr/home/hudson/hudson-slave/workspace/Lucene-Solr-Tests-trunk-Java6/solr/build/solr-core/test-files/solr/collection1/conf/mapping-ISOLatin1Accent.txt to /configs/conf1/mapping-ISOLatin1Accent.txt
[junit4:junit4]   2> 297 T145 oascc.SolrZkClient.makePath makePath: /configs/conf1/mapping-ISOLatin1Accent.txt
[junit4:junit4]   2> 301 T145 oasc.AbstractZkTestCase.putConfig put /usr/home/hudson/hudson-slave/workspace/Lucene-Solr-Tests-trunk-Java6/solr/build/solr-core/test-files/solr/collection1/conf/old_synonyms.txt to /configs/conf1/old_synonyms.txt
[junit4:junit4]   2> 302 T145 oascc.SolrZkClient.makePath makePath: /configs/conf1/old_synonyms.txt
[junit4:junit4]   2> 306 T145 oasc.AbstractZkTestCase.putConfig put /usr/home/hudson/hudson-slave/workspace/Lucene-Solr-Tests-trunk-Java6/solr/build/solr-core/test-files/solr/collection1/conf/synonyms.txt to /configs/conf1/synonyms.txt
[junit4:junit4]   2> 307 T145 oascc.SolrZkClient.makePath makePath: /configs/conf1/synonyms.txt
[junit4:junit4]   2> 311 T150 oazs.PrepRequestProcessor.pRequest2Txn Processed session termination for sessionid: 0x13baeb6f9d60001
[junit4:junit4]   2> 313 T154 oaz.ClientCnxn$EventThread.run EventThread shut down
[junit4:junit4]   2> 313 T147 oazs.NIOServerCnxn.closeSock Closed socket connection for client /140.211.11.196:47600 which had sessionid 0x13baeb6f9d60001
[junit4:junit4]   2> 313 T145 oaz.ZooKeeper.close Session: 0x13baeb6f9d60001 closed
[junit4:junit4]   2> 897 T145 oejs.Server.doStart jetty-8.1.8.v20121106
[junit4:junit4]   2> 1171 T145 oejs.AbstractConnector.doStart Started SocketConnector@127.0.0.1:57429
[junit4:junit4]   2> 1206 T145 oasc.SolrResourceLoader.locateSolrHome JNDI not configured for solr (NoInitialContextEx)
[junit4:junit4]   2> 1207 T145 oasc.SolrResourceLoader.locateSolrHome using system property solr.solr.home: /usr/home/hudson/hudson-slave/workspace/Lucene-Solr-Tests-trunk-Java6/solr/build/solr-core/test/J1/./org.apache.solr.cloud.SyncSliceTest-controljetty-1355845925635
[junit4:junit4]   2> 1207 T145 oasc.SolrResourceLoader.<init> new SolrResourceLoader for deduced Solr Home: '/usr/home/hudson/hudson-slave/workspace/Lucene-Solr-Tests-trunk-Java6/solr/build/solr-core/test/J1/./org.apache.solr.cloud.SyncSliceTest-controljetty-1355845925635/'
[junit4:junit4]   2> 1231 T145 oass.SolrDispatchFilter.init SolrDispatchFilter.init()
[junit4:junit4]   2> 1232 T145 oasc.SolrResourceLoader.locateSolrHome JNDI not configured for solr (NoInitialContextEx)
[junit4:junit4]   2> 1232 T145 oasc.SolrResourceLoader.locateSolrHome using system property solr.solr.home: /usr/home/hudson/hudson-slave/workspace/Lucene-Solr-Tests-trunk-Java6/solr/build/solr-core/test/J1/./org.apache.solr.cloud.SyncSliceTest-controljetty-1355845925635
[junit4:junit4]   2> 1233 T145 oasc.CoreContainer$Initializer.initialize looking for solr.xml: /usr/home/hudson/hudson-slave/workspace/Lucene-Solr-Tests-trunk-Java6/solr/build/solr-core/test/J1/./org.apache.solr.cloud.SyncSliceTest-controljetty-1355845925635/solr.xml
[junit4:junit4]   2> 1233 T145 oasc.CoreContainer.<init> New CoreContainer 2070418528
[junit4:junit4]   2> 1234 T145 oasc.CoreContainer.load Loading CoreContainer using Solr Home: '/usr/home/hudson/hudson-slave/workspace/Lucene-Solr-Tests-trunk-Java6/solr/build/solr-core/test/J1/./org.apache.solr.cloud.SyncSliceTest-controljetty-1355845925635/'
[junit4:junit4]   2> 1235 T145 oasc.SolrResourceLoader.<init> new SolrResourceLoader for directory: '/usr/home/hudson/hudson-slave/workspace/Lucene-Solr-Tests-trunk-Java6/solr/build/solr-core/test/J1/./org.apache.solr.cloud.SyncSliceTest-controljetty-1355845925635/'
[junit4:junit4]   2> 1251 T145 oashc.HttpShardHandlerFactory.getParameter Setting socketTimeout to: 30000
[junit4:junit4]   2> 1251 T145 oashc.HttpShardHandlerFactory.getParameter Setting urlScheme to: http://
[junit4:junit4]   2> 1252 T145 oashc.HttpShardHandlerFactory.getParameter Setting connTimeout to: 15000
[junit4:junit4]   2> 1252 T145 oashc.HttpShardHandlerFactory.getParameter Setting maxConnectionsPerHost to: 20
[junit4:junit4]   2> 1253 T145 oashc.HttpShardHandlerFactory.getParameter Setting corePoolSize to: 0
[junit4:junit4]   2> 1253 T145 oashc.HttpShardHandlerFactory.getParameter Setting maximumPoolSize to: 2147483647
[junit4:junit4]   2> 1254 T145 oashc.HttpShardHandlerFactory.getParameter Setting maxThreadIdleTime to: 5
[junit4:junit4]   2> 1254 T145 oashc.HttpShardHandlerFactory.getParameter Setting sizeOfQueue to: -1
[junit4:junit4]   2> 1255 T145 oashc.HttpShardHandlerFactory.getParameter Setting fairnessPolicy to: false
[junit4:junit4]   2> 1255 T145 oascsi.HttpClientUtil.createClient Creating new http client, config:maxConnectionsPerHost=20&maxConnections=10000&socketTimeout=30000&connTimeout=15000&retry=false
[junit4:junit4]   2> 1272 T145 oasc.CoreContainer.load Registering Log Listener
[junit4:junit4]   2> 1286 T145 oasc.CoreContainer.initZooKeeper Zookeeper client=127.0.0.1:45167/solr
[junit4:junit4]   2> 1304 T145 oasc.ZkController.checkChrootPath zkHost includes chroot
[junit4:junit4]   2> 1305 T145 oaz.ZooKeeper.<init> Initiating client connection, connectString=127.0.0.1:45167 sessionTimeout=60000 watcher=org.apache.solr.common.cloud.ConnectionManager@67eaf25d
[junit4:junit4]   2> 1306 T145 oascc.ConnectionManager.waitForConnected Waiting for client to connect to ZooKeeper
[junit4:junit4]   2> 1307 T165 oaz.ClientCnxn$SendThread.logStartConnect Opening socket connection to server localhost/127.0.0.1:45167. Will not attempt to authenticate using SASL (access denied (javax.security.auth.AuthPermission getLoginConfiguration))
[junit4:junit4]   2> 1308 T165 oaz.ClientCnxn$SendThread.primeConnection Socket connection established to localhost/127.0.0.1:45167, initiating session
[junit4:junit4]   2> 1308 T147 oazs.NIOServerCnxnFactory.run Accepted socket connection from /140.211.11.196:55961
[junit4:junit4]   2> 1309 T147 oazs.ZooKeeperServer.processConnectRequest Client attempting to establish new session at /140.211.11.196:55961
[junit4:junit4]   2> 1337 T149 oazs.ZooKeeperServer.finishSessionInit Established session 0x13baeb6f9d60002 with negotiated timeout 20000 for client /140.211.11.196:55961
[junit4:junit4]   2> 1337 T165 oaz.ClientCnxn$SendThread.onConnected Session establishment complete on server localhost/127.0.0.1:45167, sessionid = 0x13baeb6f9d60002, negotiated timeout = 20000
[junit4:junit4]   2> 1338 T166 oascc.ConnectionManager.process Watcher org.apache.solr.common.cloud.ConnectionManager@67eaf25d name:ZooKeeperConnection Watcher:127.0.0.1:45167 got event WatchedEvent state:SyncConnected type:None path:null path:null type:None
[junit4:junit4]   2> 1338 T145 oascc.ConnectionManager.waitForConnected Client is connected to ZooKeeper
[junit4:junit4]   2> 1340 T150 oazs.PrepRequestProcessor.pRequest2Txn Processed session termination for sessionid: 0x13baeb6f9d60002
[junit4:junit4]   2> 1342 T147 oazs.NIOServerCnxn.closeSock Closed socket connection for client /140.211.11.196:55961 which had sessionid 0x13baeb6f9d60002
[junit4:junit4]   2> 1342 T145 oaz.ZooKeeper.close Session: 0x13baeb6f9d60002 closed
[junit4:junit4]   2> 1342 T166 oaz.ClientCnxn$EventThread.run EventThread shut down
[junit4:junit4]   2> 1345 T145 oascsi.HttpClientUtil.createClient Creating new http client, config:maxConnections=500&maxConnectionsPerHost=16&socketTimeout=15000&connTimeout=30000
[junit4:junit4]   2> 1357 T145 oaz.ZooKeeper.<init> Initiating client connection, connectString=127.0.0.1:45167/solr sessionTimeout=30000 watcher=org.apache.solr.common.cloud.ConnectionManager@40c19080
[junit4:junit4]   2> 1358 T145 oascc.ConnectionManager.waitForConnected Waiting for client to connect to ZooKeeper
[junit4:junit4]   2> 1358 T167 oaz.ClientCnxn$SendThread.logStartConnect Opening socket connection to server localhost/127.0.0.1:45167. Will not attempt to authenticate using SASL (access denied (javax.security.auth.AuthPermission getLoginConfiguration))
[junit4:junit4]   2> 1359 T167 oaz.ClientCnxn$SendThread.primeConnection Socket connection established to localhost/127.0.0.1:45167, initiating session
[junit4:junit4]   2> 1359 T147 oazs.NIOServerCnxnFactory.run Accepted socket connection from /140.211.11.196:14948
[junit4:junit4]   2> 1360 T147 oazs.ZooKeeperServer.processConnectRequest Client attempting to establish new session at /140.211.11.196:14948
[junit4:junit4]   2> 1361 T149 oazs.ZooKeeperServer.finishSessionInit Established session 0x13baeb6f9d60003 with negotiated timeout 20000 for client /140.211.11.196:14948
[junit4:junit4]   2> 1361 T167 oaz.ClientCnxn$SendThread.onConnected Session establishment complete on server localhost/127.0.0.1:45167, sessionid = 0x13baeb6f9d60003, negotiated timeout = 20000
[junit4:junit4]   2> 1362 T168 oascc.ConnectionManager.process Watcher org.apache.solr.common.cloud.ConnectionManager@40c19080 name:ZooKeeperConnection Watcher:127.0.0.1:45167/solr got event WatchedEvent state:SyncConnected type:None path:null path:null type:None
[junit4:junit4]   2> 1362 T145 oascc.ConnectionManager.waitForConnected Client is connected to ZooKeeper
[junit4:junit4]   2> 1374 T150 oazs.PrepRequestProcessor.pRequest Got user-level KeeperException when processing sessionid:0x13baeb6f9d60003 type:create cxid:0x2 zxid:0x1a txntype:-1 reqpath:n/a Error Path:/solr/overseer Error:KeeperErrorCode = NodeExists for /solr/overseer
[junit4:junit4]   2> 1382 T145 oascc.SolrZkClient.makePath makePath: /live_nodes
[junit4:junit4]   2> 1385 T145 oasc.ZkController.createEphemeralLiveNode Register node as live in ZooKeeper:/live_nodes/127.0.0.1:57429_c_s%2Fst
[junit4:junit4]   2> 1386 T150 oazs.PrepRequestProcessor.pRequest Got user-level KeeperException when processing sessionid:0x13baeb6f9d60003 type:delete cxid:0x7 zxid:0x1c txntype:-1 reqpath:n/a Error Path:/solr/live_nodes/127.0.0.1:57429_c_s%2Fst Error:KeeperErrorCode = NoNode for /solr/live_nodes/127.0.0.1:57429_c_s%2Fst
[junit4:junit4]   2> 1387 T145 oascc.SolrZkClient.makePath makePath: /live_nodes/127.0.0.1:57429_c_s%2Fst
[junit4:junit4]   2> 1398 T145 oascc.SolrZkClient.makePath makePath: /overseer_elect/election
[junit4:junit4]   2> 1414 T150 oazs.PrepRequestProcessor.pRequest Got user-level KeeperException when processing sessionid:0x13baeb6f9d60003 type:delete cxid:0x15 zxid:0x21 txntype:-1 reqpath:n/a Error Path:/solr/overseer_elect/leader Error:KeeperErrorCode = NoNode for /solr/overseer_elect/leader
[junit4:junit4]   2> 1416 T145 oascc.SolrZkClient.makePath makePath: /overseer_elect/leader
[junit4:junit4]   2> 1420 T145 oasc.Overseer.start Overseer (id=88856718562689027-127.0.0.1:57429_c_s%2Fst-n_0000000000) starting
[junit4:junit4]   2> 1420 T150 oazs.PrepRequestProcessor.pRequest Got user-level KeeperException when processing sessionid:0x13baeb6f9d60003 type:create cxid:0x1a zxid:0x23 txntype:-1 reqpath:n/a Error Path:/solr/overseer Error:KeeperErrorCode = NodeExists for /solr/overseer
[junit4:junit4]   2> 1428 T150 oazs.PrepRequestProcessor.pRequest Got user-level KeeperException when processing sessionid:0x13baeb6f9d60003 type:create cxid:0x1b zxid:0x24 txntype:-1 reqpath:n/a Error Path:/solr/overseer Error:KeeperErrorCode = NodeExists for /solr/overseer
[junit4:junit4]   2> 1430 T150 oazs.PrepRequestProcessor.pRequest Got user-level KeeperException when processing sessionid:0x13baeb6f9d60003 type:create cxid:0x1c zxid:0x25 txntype:-1 reqpath:n/a Error Path:/solr/overseer Error:KeeperErrorCode = NodeExists for /solr/overseer
[junit4:junit4]   2> 1432 T150 oazs.PrepRequestProcessor.pRequest Got user-level KeeperException when processing sessionid:0x13baeb6f9d60003 type:create cxid:0x1d zxid:0x26 txntype:-1 reqpath:n/a Error Path:/solr/overseer Error:KeeperErrorCode = NodeExists for /solr/overseer
[junit4:junit4]   2> 1441 T170 oasc.OverseerCollectionProcessor.run Process current queue of collection messages
[junit4:junit4]   2> 1442 T145 oascc.SolrZkClient.makePath makePath: /clusterstate.json
[junit4:junit4]   2> 1445 T145 oascc.ZkStateReader.createClusterStateWatchersAndUpdate Updating cluster state from ZooKeeper... 
[junit4:junit4]   2> 1460 T169 oasc.Overseer$ClusterStateUpdater.run Starting to work on the main queue
[junit4:junit4]   2> 1467 T171 oasc.CoreContainer.create Creating SolrCore 'collection1' using instanceDir: /usr/home/hudson/hudson-slave/workspace/Lucene-Solr-Tests-trunk-Java6/solr/build/solr-core/test/J1/./org.apache.solr.cloud.SyncSliceTest-controljetty-1355845925635/collection1
[junit4:junit4]   2> 1467 T171 oasc.ZkController.createCollectionZkNode Check for collection zkNode:control_collection
[junit4:junit4]   2> 1469 T171 oasc.ZkController.createCollectionZkNode Collection zkNode exists
[junit4:junit4]   2> 1470 T171 oasc.ZkController.readConfigName Load collection config from:/collections/control_collection
[junit4:junit4]   2> 1472 T171 oasc.SolrResourceLoader.<init> new SolrResourceLoader for directory: '/usr/home/hudson/hudson-slave/workspace/Lucene-Solr-Tests-trunk-Java6/solr/build/solr-core/test/J1/./org.apache.solr.cloud.SyncSliceTest-controljetty-1355845925635/collection1/'
[junit4:junit4]   2> 1474 T171 oasc.SolrResourceLoader.replaceClassLoader Adding 'file:/usr/home/hudson/hudson-slave/workspace/Lucene-Solr-Tests-trunk-Java6/solr/build/solr-core/test/J1/org.apache.solr.cloud.SyncSliceTest-controljetty-1355845925635/collection1/lib/README' to classloader
[junit4:junit4]   2> 1475 T171 oasc.SolrResourceLoader.replaceClassLoader Adding 'file:/usr/home/hudson/hudson-slave/workspace/Lucene-Solr-Tests-trunk-Java6/solr/build/solr-core/test/J1/org.apache.solr.cloud.SyncSliceTest-controljetty-1355845925635/collection1/lib/classes/' to classloader
[junit4:junit4]   2> 1549 T171 oasc.SolrConfig.<init> Using Lucene MatchVersion: LUCENE_50
[junit4:junit4]   2> 1621 T171 oasc.SolrConfig.<init> Loaded SolrConfig: solrconfig.xml
[junit4:junit4]   2> 1723 T171 oass.IndexSchema.readSchema Reading Solr Schema
[junit4:junit4]   2> 1736 T171 oass.IndexSchema.readSchema Schema name=test
[junit4:junit4]   2> 2247 T171 oass.OpenExchangeRatesOrgProvider.init Initialized with rates=open-exchange-rates.json, refreshInterval=1440.
[junit4:junit4]   2> 2262 T171 oass.IndexSchema.readSchema default search field in schema is text
[junit4:junit4]   2> 2270 T171 oass.IndexSchema.readSchema unique key field: id
[junit4:junit4]   2> 2305 T171 oass.FileExchangeRateProvider.reload Reloading exchange rates from file currency.xml
[junit4:junit4]   2> 2312 T171 oass.FileExchangeRateProvider.reload Reloading exchange rates from file currency.xml
[junit4:junit4]   2> 2318 T171 oass.OpenExchangeRatesOrgProvider.reload Reloading exchange rates from open-exchange-rates.json
[junit4:junit4]   2> 2322 T171 oass.OpenExchangeRatesOrgProvider.reload Reloading exchange rates from open-exchange-rates.json
[junit4:junit4]   2> 2325 T171 oasc.SolrCore.<init> [collection1] Opening new SolrCore at /usr/home/hudson/hudson-slave/workspace/Lucene-Solr-Tests-trunk-Java6/solr/build/solr-core/test/J1/./org.apache.solr.cloud.SyncSliceTest-controljetty-1355845925635/collection1/, dataDir=./org.apache.solr.cloud.SyncSliceTest-1355845925328/control/data/
[junit4:junit4]   2> 2330 T171 oasc.JmxMonitoredMap.<init> JMX monitoring is enabled. Adding Solr mbeans to JMX Server: com.sun.jmx.mbeanserver.JmxMBeanServer@6d46b6db
[junit4:junit4]   2> 2331 T171 oasc.SolrCore.initDirectoryFactory solr.NRTCachingDirectoryFactory
[junit4:junit4]   2> 2368 T171 oasc.CachingDirectoryFactory.get return new directory for /usr/home/hudson/hudson-slave/workspace/Lucene-Solr-Tests-trunk-Java6/solr/build/solr-core/test/J1/./org.apache.solr.cloud.SyncSliceTest-1355845925328/control/data forceNew:false
[junit4:junit4]   2> 2369 T171 oasc.CachingDirectoryFactory.close Releasing directory:/usr/home/hudson/hudson-slave/workspace/Lucene-Solr-Tests-trunk-Java6/solr/build/solr-core/test/J1/./org.apache.solr.cloud.SyncSliceTest-1355845925328/control/data
[junit4:junit4]   2> 2370 T171 oasc.SolrCore.getNewIndexDir New index directory detected: old=null new=./org.apache.solr.cloud.SyncSliceTest-1355845925328/control/data/index/
[junit4:junit4]   2> 2370 T171 oasc.SolrCore.initIndex WARNING [collection1] Solr index directory './org.apache.solr.cloud.SyncSliceTest-1355845925328/control/data/index' doesn't exist. Creating new index...
[junit4:junit4]   2> 2372 T171 oasc.CachingDirectoryFactory.get return new directory for /usr/home/hudson/hudson-slave/workspace/Lucene-Solr-Tests-trunk-Java6/solr/build/solr-core/test/J1/./org.apache.solr.cloud.SyncSliceTest-1355845925328/control/data/index forceNew:false
[junit4:junit4]   2> 2501 T171 oasc.SolrDeletionPolicy.onCommit SolrDeletionPolicy.onCommit: commits:num=1
[junit4:junit4]   2> 		commit{dir=RateLimitedDirectoryWrapper(NRTCachingDirectory(org.apache.lucene.store.NIOFSDirectory@/usr/home/hudson/hudson-slave/workspace/Lucene-Solr-Tests-trunk-Java6/solr/build/solr-core/test/J1/org.apache.solr.cloud.SyncSliceTest-1355845925328/control/data/index lockFactory=org.apache.lucene.store.NativeFSLockFactory@1c8aeedc; maxCacheMB=48.0 maxMergeSizeMB=4.0)),segFN=segments_1,generation=1,filenames=[segments_1]
[junit4:junit4]   2> 2501 T171 oasc.SolrDeletionPolicy.updateCommits newest commit = 1[segments_1]
[junit4:junit4]   2> 2502 T171 oasc.CachingDirectoryFactory.close Releasing directory:/usr/home/hudson/hudson-slave/workspace/Lucene-Solr-Tests-trunk-Java6/solr/build/solr-core/test/J1/./org.apache.solr.cloud.SyncSliceTest-1355845925328/control/data/index
[junit4:junit4]   2> 2503 T171 oasc.SolrCore.initWriters created xml: solr.XMLResponseWriter
[junit4:junit4]   2> 2505 T171 oasup.UpdateRequestProcessorChain.init inserting DistributedUpdateProcessorFactory into updateRequestProcessorChain "dedupe"
[junit4:junit4]   2> 2506 T171 oasup.UpdateRequestProcessorChain.init inserting DistributedUpdateProcessorFactory into updateRequestProcessorChain "dedupe-allfields"
[junit4:junit4]   2> 2506 T171 oasup.UpdateRequestProcessorChain.init inserting DistributedUpdateProcessorFactory into updateRequestProcessorChain "stored_sig"
[junit4:junit4]   2> 2507 T171 oasup.UpdateRequestProcessorChain.init inserting DistributedUpdateProcessorFactory into updateRequestProcessorChain "uniq-fields"
[junit4:junit4]   2> 2508 T171 oasup.UpdateRequestProcessorChain.init inserting DistributedUpdateProcessorFactory into updateRequestProcessorChain "distrib-dup-test-chain-implicit"
[junit4:junit4]   2> 2508 T171 oasc.RequestHandlers.initHandlersFromConfig adding lazy requestHandler: solr.ReplicationHandler
[junit4:junit4]   2> 2509 T171 oasc.RequestHandlers.initHandlersFromConfig created /replication: solr.ReplicationHandler
[junit4:junit4]   2> 2510 T171 oasc.RequestHandlers.initHandlersFromConfig created standard: solr.StandardRequestHandler
[junit4:junit4]   2> 2512 T171 oasc.RequestHandlers.initHandlersFromConfig created /get: solr.RealTimeGetHandler
[junit4:junit4]   2> 2513 T171 oasc.RequestHandlers.initHandlersFromConfig created dismax: solr.SearchHandler
[junit4:junit4]   2> 2514 T171 oasc.RequestHandlers.initHandlersFromConfig created mock: org.apache.solr.core.MockQuerySenderListenerReqHandler
[junit4:junit4]   2> 2515 T171 oasc.RequestHandlers.initHandlersFromConfig created /admin/: org.apache.solr.handler.admin.AdminHandlers
[junit4:junit4]   2> 2516 T171 oasc.RequestHandlers.initHandlersFromConfig created defaults: solr.StandardRequestHandler
[junit4:junit4]   2> 2516 T171 oasc.RequestHandlers.initHandlersFromConfig adding lazy requestHandler: solr.StandardRequestHandler
[junit4:junit4]   2> 2517 T171 oasc.RequestHandlers.initHandlersFromConfig created lazy: solr.StandardRequestHandler
[junit4:junit4]   2> 2519 T171 oasc.RequestHandlers.initHandlersFromConfig created /update: solr.UpdateRequestHandler
[junit4:junit4]   2> 2520 T171 oasc.RequestHandlers.initHandlersFromConfig created /terms: org.apache.solr.handler.component.SearchHandler
[junit4:junit4]   2> 2521 T171 oasc.RequestHandlers.initHandlersFromConfig created spellCheckCompRH: org.apache.solr.handler.component.SearchHandler
[junit4:junit4]   2> 2523 T171 oasc.RequestHandlers.initHandlersFromConfig created spellCheckCompRH_Direct: org.apache.solr.handler.component.SearchHandler
[junit4:junit4]   2> 2524 T171 oasc.RequestHandlers.initHandlersFromConfig created spellCheckWithWordbreak: org.apache.solr.handler.component.SearchHandler
[junit4:junit4]   2> 2525 T171 oasc.RequestHandlers.initHandlersFromConfig created spellCheckWithWordbreak_Direct: org.apache.solr.handler.component.SearchHandler
[junit4:junit4]   2> 2527 T171 oasc.RequestHandlers.initHandlersFromConfig created spellCheckCompRH1: org.apache.solr.handler.component.SearchHandler
[junit4:junit4]   2> 2529 T171 oasc.RequestHandlers.initHandlersFromConfig created mltrh: org.apache.solr.handler.component.SearchHandler
[junit4:junit4]   2> 2530 T171 oasc.RequestHandlers.initHandlersFromConfig created tvrh: org.apache.solr.handler.component.SearchHandler
[junit4:junit4]   2> 2531 T171 oasc.RequestHandlers.initHandlersFromConfig created /mlt: solr.MoreLikeThisHandler
[junit4:junit4]   2> 2533 T171 oasc.RequestHandlers.initHandlersFromConfig created /debug/dump: solr.DumpRequestHandler
[junit4:junit4]   2> 2540 T171 oashl.XMLLoader.init xsltCacheLifetimeSeconds=60
[junit4:junit4]   2> 2545 T171 oasc.SolrCore.initDeprecatedSupport WARNING solrconfig.xml uses deprecated <admin/gettableFiles>, Please update your config to use the ShowFileRequestHandler.
[junit4:junit4]   2> 2548 T171 oasc.SolrCore.initDeprecatedSupport WARNING adding ShowFileRequestHandler with hidden files: [SCHEMA.XML, OLD_SYNONYMS.TXT, STOPWORDS.TXT, PROTWORDS.TXT, OPEN-EXCHANGE-RATES.JSON, SYNONYMS.TXT, CURRENCY.XML, MAPPING-ISOLATIN1ACCENT.TXT]
[junit4:junit4]   2> 2551 T171 oasc.CachingDirectoryFactory.close Releasing directory:/usr/home/hudson/hudson-slave/workspace/Lucene-Solr-Tests-trunk-Java6/solr/build/solr-core/test/J1/./org.apache.solr.cloud.SyncSliceTest-1355845925328/control/data
[junit4:junit4]   2> 2553 T171 oass.SolrIndexSearcher.<init> Opening Searcher@1073f623 main
[junit4:junit4]   2> 2578 T171 oasu.CommitTracker.<init> Hard AutoCommit: disabled
[junit4:junit4]   2> 2578 T171 oasu.CommitTracker.<init> Soft AutoCommit: disabled
[junit4:junit4]   2> 2579 T171 oashc.SpellCheckComponent.inform Initializing spell checkers
[junit4:junit4]   2> 2587 T171 oass.DirectSolrSpellChecker.init init: {name=direct,classname=DirectSolrSpellChecker,field=lowerfilt,minQueryLength=3}
[junit4:junit4]   2> 2641 T172 oasc.SolrCore.registerSearcher [collection1] Registered new searcher Searcher@1073f623 main{StandardDirectoryReader(segments_1:1)}
[junit4:junit4]   2> 2646 T171 oasc.ZkController.publish publishing core=collection1 state=down
[junit4:junit4]   2> 2647 T171 oasc.ZkController.publish numShards not found on descriptor - reading it from system property
[junit4:junit4]   2> 2648 T150 oazs.PrepRequestProcessor.pRequest Got user-level KeeperException when processing sessionid:0x13baeb6f9d60003 type:create cxid:0x56 zxid:0x29 txntype:-1 reqpath:n/a Error Path:/solr/overseer/queue Error:KeeperErrorCode = NoNode for /solr/overseer/queue
[junit4:junit4]   2> 2980 T169 oascc.ZkStateReader.updateClusterState Updating cloud state from ZooKeeper... 
[junit4:junit4]   2> 2982 T169 oasc.Overseer$ClusterStateUpdater.updateState Update state numShards=1 message={
[junit4:junit4]   2> 	  "operation":"state",
[junit4:junit4]   2> 	  "numShards":"1",
[junit4:junit4]   2> 	  "shard":null,
[junit4:junit4]   2> 	  "roles":null,
[junit4:junit4]   2> 	  "state":"down",
[junit4:junit4]   2> 	  "core":"collection1",
[junit4:junit4]   2> 	  "collection":"control_collection",
[junit4:junit4]   2> 	  "node_name":"127.0.0.1:57429_c_s%2Fst",
[junit4:junit4]   2> 	  "base_url":"http://127.0.0.1:57429/c_s/st"}
[junit4:junit4]   2> 2982 T169 oasc.Overseer$ClusterStateUpdater.createCollection Create collection control_collection with numShards 1
[junit4:junit4]   2> 2989 T169 oasc.Overseer$ClusterStateUpdater.updateState Assigning new node to shard shard=shard1
[junit4:junit4]   2> 2990 T150 oazs.PrepRequestProcessor.pRequest Got user-level KeeperException when processing sessionid:0x13baeb6f9d60003 type:create cxid:0x5e zxid:0x2c txntype:-1 reqpath:n/a Error Path:/solr/overseer/queue-work Error:KeeperErrorCode = NoNode for /solr/overseer/queue-work
[junit4:junit4]   2> 3008 T168 oascc.ZkStateReader$2.process A cluster state change: WatchedEvent state:SyncConnected type:NodeDataChanged path:/clusterstate.json, has occurred - updating... (live nodes size: 1)
[junit4:junit4]   2> 3161 T171 oasc.CoreContainer.registerCore registering core: collection1
[junit4:junit4]   2> 3161 T171 oasc.ZkController.register Register replica - core:collection1 address:http://127.0.0.1:57429/c_s/st collection:control_collection shard:shard1
[junit4:junit4]   2> 3169 T171 oascsi.HttpClientUtil.createClient Creating new http client, config:maxConnections=10000&maxConnectionsPerHost=20&connTimeout=30000&socketTimeout=30000&retry=false
[junit4:junit4]   2> 3187 T171 oascc.SolrZkClient.makePath makePath: /collections/control_collection/leader_elect/shard1/election
[junit4:junit4]   2> 3209 T150 oazs.PrepRequestProcessor.pRequest Got user-level KeeperException when processing sessionid:0x13baeb6f9d60003 type:delete cxid:0x78 zxid:0x36 txntype:-1 reqpath:n/a Error Path:/solr/collections/control_collection/leaders Error:KeeperErrorCode = NoNode for /solr/collections/control_collection/leaders
[junit4:junit4]   2> 3210 T171 oasc.ShardLeaderElectionContext.runLeaderProcess Running the leader process.
[junit4:junit4]   2> 3211 T150 oazs.PrepRequestProcessor.pRequest Got user-level KeeperException when processing sessionid:0x13baeb6f9d60003 type:create cxid:0x79 zxid:0x37 txntype:-1 reqpath:n/a Error Path:/solr/overseer Error:KeeperErrorCode = NodeExists for /solr/overseer
[junit4:junit4]   2> 3215 T171 oasc.ShardLeaderElectionContext.waitForReplicasToComeUp Enough replicas found to continue.
[junit4:junit4]   2> 3215 T171 oasc.ShardLeaderElectionContext.runLeaderProcess I may be the new leader - try and sync
[junit4:junit4]   2> 3219 T171 oasc.SyncStrategy.sync Sync replicas to http://127.0.0.1:57429/c_s/st/collection1/
[junit4:junit4]   2> 3220 T171 oasc.SyncStrategy.syncReplicas Sync Success - now sync replicas to me
[junit4:junit4]   2> 3220 T171 oasc.SyncStrategy.syncToMe http://127.0.0.1:57429/c_s/st/collection1/ has no replicas
[junit4:junit4]   2> 3221 T171 oasc.ShardLeaderElectionContext.runLeaderProcess I am the new leader: http://127.0.0.1:57429/c_s/st/collection1/
[junit4:junit4]   2> 3221 T171 oascc.SolrZkClient.makePath makePath: /collections/control_collection/leaders/shard1
[junit4:junit4]   2> 3228 T150 oazs.PrepRequestProcessor.pRequest Got user-level KeeperException when processing sessionid:0x13baeb6f9d60003 type:create cxid:0x83 zxid:0x3b txntype:-1 reqpath:n/a Error Path:/solr/overseer Error:KeeperErrorCode = NodeExists for /solr/overseer
[junit4:junit4]   2> 3519 T169 oascc.ZkStateReader.updateClusterState Updating cloud state from ZooKeeper... 
[junit4:junit4]   2> 3538 T168 oascc.ZkStateReader$2.process A cluster state change: WatchedEvent state:SyncConnected type:NodeDataChanged path:/clusterstate.json, has occurred - updating... (live nodes size: 1)
[junit4:junit4]   2> 3596 T171 oasc.ZkController.register We are http://127.0.0.1:57429/c_s/st/collection1/ and leader is http://127.0.0.1:57429/c_s/st/collection1/
[junit4:junit4]   2> 3600 T171 oasc.ZkController.register No LogReplay needed for core=collection1 baseURL=http://127.0.0.1:57429/c_s/st
[junit4:junit4]   2> 3600 T171 oasc.ZkController.checkRecovery I am the leader, no recovery necessary
[junit4:junit4]   2> 3600 T171 oasc.ZkController.publish publishing core=collection1 state=active
[junit4:junit4]   2> 3601 T171 oasc.ZkController.publish numShards not found on descriptor - reading it from system property
[junit4:junit4]   2> 3603 T171 oascc.ZkStateReader.updateClusterState Updating cloud state from ZooKeeper... 
[junit4:junit4]   2> 3605 T145 oass.SolrDispatchFilter.init user.dir=/usr/home/hudson/hudson-slave/workspace/Lucene-Solr-Tests-trunk-Java6/solr/build/solr-core/test/J1
[junit4:junit4]   2> 3605 T145 oass.SolrDispatchFilter.init SolrDispatchFilter.init() done
[junit4:junit4]   2> 3676 T145 oascsi.HttpClientUtil.createClient Creating new http client, config:maxConnections=128&maxConnectionsPerHost=32&followRedirects=false
[junit4:junit4]   2> 3700 T145 oascsi.HttpClientUtil.createClient Creating new http client, config:
[junit4:junit4]   2> 3718 T145 oaz.ZooKeeper.<init> Initiating client connection, connectString=127.0.0.1:45167/solr sessionTimeout=10000 watcher=org.apache.solr.common.cloud.ConnectionManager@5147164d
[junit4:junit4]   2> 3720 T145 oascc.ConnectionManager.waitForConnected Waiting for client to connect to ZooKeeper
[junit4:junit4]   2> 3721 T173 oaz.ClientCnxn$SendThread.logStartConnect Opening socket connection to server localhost/127.0.0.1:45167. Will not attempt to authenticate using SASL (access denied (javax.security.auth.AuthPermission getLoginConfiguration))
[junit4:junit4]   2> 3722 T173 oaz.ClientCnxn$SendThread.primeConnection Socket connection established to localhost/127.0.0.1:45167, initiating session
[junit4:junit4]   2> 3723 T147 oazs.NIOServerCnxnFactory.run Accepted socket connection from /140.211.11.196:56977
[junit4:junit4]   2> 3723 T147 oazs.ZooKeeperServer.processConnectRequest Client attempting to establish new session at /140.211.11.196:56977
[junit4:junit4]   2> 3725 T149 oazs.ZooKeeperServer.finishSessionInit Established session 0x13baeb6f9d60004 with negotiated timeout 10000 for client /140.211.11.196:56977
[junit4:junit4]   2> 3726 T173 oaz.ClientCnxn$SendThread.onConnected Session establishment complete on server localhost/127.0.0.1:45167, sessionid = 0x13baeb6f9d60004, negotiated timeout = 10000
[junit4:junit4]   2> 3726 T174 oascc.ConnectionManager.process Watcher org.apache.solr.common.cloud.ConnectionManager@5147164d name:ZooKeeperConnection Watcher:127.0.0.1:45167/solr got event WatchedEvent state:SyncConnected type:None path:null path:null type:None
[junit4:junit4]   2> 3727 T145 oascc.ConnectionManager.waitForConnected Client is connected to ZooKeeper
[junit4:junit4]   2> 3728 T145 oascc.ZkStateReader.createClusterStateWatchersAndUpdate Updating cluster state from ZooKeeper... 
[junit4:junit4]   2> 3733 T145 oasc.ChaosMonkey.monkeyLog monkey: init - expire sessions:true cause connection loss:true
[junit4:junit4]   2> 3936 T145 oejs.Server.doStart jetty-8.1.8.v20121106
[junit4:junit4]   2> 3940 T145 oejs.AbstractConnector.doStart Started SocketConnector@127.0.0.1:64893
[junit4:junit4]   2> 3941 T145 oasc.SolrResourceLoader.locateSolrHome JNDI not configured for solr (NoInitialContextEx)
[junit4:junit4]   2> 3941 T145 oasc.SolrResourceLoader.locateSolrHome using system property solr.solr.home: /usr/home/hudson/hudson-slave/workspace/Lucene-Solr-Tests-trunk-Java6/solr/build/solr-core/test/J1/./org.apache.solr.cloud.SyncSliceTest-jetty1-1355845929055
[junit4:junit4]   2> 3942 T145 oasc.SolrResourceLoader.<init> new SolrResourceLoader for deduced Solr Home: '/usr/home/hudson/hudson-slave/workspace/Lucene-Solr-Tests-trunk-Java6/solr/build/solr-core/test/J1/./org.apache.solr.cloud.SyncSliceTest-jetty1-1355845929055/'
[junit4:junit4]   2> 3986 T145 oass.SolrDispatchFilter.init SolrDispatchFilter.init()
[junit4:junit4]   2> 3986 T145 oasc.SolrResourceLoader.locateSolrHome JNDI not configured for solr (NoInitialContextEx)
[junit4:junit4]   2> 3987 T145 oasc.SolrResourceLoader.locateSolrHome using system property solr.solr.home: /usr/home/hudson/hudson-slave/workspace/Lucene-Solr-Tests-trunk-Java6/solr/build/solr-core/test/J1/./org.apache.solr.cloud.SyncSliceTest-jetty1-1355845929055
[junit4:junit4]   2> 3988 T145 oasc.CoreContainer$Initializer.initialize looking for solr.xml: /usr/home/hudson/hudson-slave/workspace/Lucene-Solr-Tests-trunk-Java6/solr/build/solr-core/test/J1/./org.apache.solr.cloud.SyncSliceTest-jetty1-1355845929055/solr.xml
[junit4:junit4]   2> 3988 T145 oasc.CoreContainer.<init> New CoreContainer 1310131062
[junit4:junit4]   2> 3989 T145 oasc.CoreContainer.load Loading CoreContainer using Solr Home: '/usr/home/hudson/hudson-slave/workspace/Lucene-Solr-Tests-trunk-Java6/solr/build/solr-core/test/J1/./org.apache.solr.cloud.SyncSliceTest-jetty1-1355845929055/'
[junit4:junit4]   2> 3990 T145 oasc.SolrResourceLoader.<init> new SolrResourceLoader for directory: '/usr/home/hudson/hudson-slave/workspace/Lucene-Solr-Tests-trunk-Java6/solr/build/solr-core/test/J1/./org.apache.solr.cloud.SyncSliceTest-jetty1-1355845929055/'
[junit4:junit4]   2> 4014 T145 oashc.HttpShardHandlerFactory.getParameter Setting socketTimeout to: 30000
[junit4:junit4]   2> 4015 T145 oashc.HttpShardHandlerFactory.getParameter Setting urlScheme to: http://
[junit4:junit4]   2> 4015 T145 oashc.HttpShardHandlerFactory.getParameter Setting connTimeout to: 15000
[junit4:junit4]   2> 4016 T145 oashc.HttpShardHandlerFactory.getParameter Setting maxConnectionsPerHost to: 20
[junit4:junit4]   2> 4016 T145 oashc.HttpShardHandlerFactory.getParameter Setting corePoolSize to: 0
[junit4:junit4]   2> 4017 T145 oashc.HttpShardHandlerFactory.getParameter Setting maximumPoolSize to: 2147483647
[junit4:junit4]   2> 4017 T145 oashc.HttpShardHandlerFactory.getParameter Setting maxThreadIdleTime to: 5
[junit4:junit4]   2> 4018 T145 oashc.HttpShardHandlerFactory.getParameter Setting sizeOfQueue to: -1
[junit4:junit4]   2> 4019 T145 oashc.HttpShardHandlerFactory.getParameter Setting fairnessPolicy to: false
[junit4:junit4]   2> 4019 T145 oascsi.HttpClientUtil.createClient Creating new http client, config:maxConnectionsPerHost=20&maxConnections=10000&socketTimeout=30000&connTimeout=15000&retry=false
[junit4:junit4]   2> 4043 T145 oasc.CoreContainer.load Registering Log Listener
[junit4:junit4]   2> 4055 T169 oascc.ZkStateReader.updateClusterState Updating cloud state from ZooKeeper... 
[junit4:junit4]   2> 4057 T169 oasc.Overseer$ClusterStateUpdater.updateState Update state numShards=1 message={
[junit4:junit4]   2> 	  "operation":"state",
[junit4:junit4]   2> 	  "numShards":"1",
[junit4:junit4]   2> 	  "shard":"shard1",
[junit4:junit4]   2> 	  "roles":null,
[junit4:junit4]   2> 	  "state":"active",
[junit4:junit4]   2> 	  "core":"collection1",
[junit4:junit4]   2> 	  "collection":"control_collection",
[junit4:junit4]   2> 	  "node_name":"127.0.0.1:57429_c_s%2Fst",
[junit4:junit4]   2> 	  "base_url":"http://127.0.0.1:57429/c_s/st"}
[junit4:junit4]   2> 4066 T145 oasc.CoreContainer.initZooKeeper Zookeeper client=127.0.0.1:45167/solr
[junit4:junit4]   2> 4066 T145 oasc.ZkController.checkChrootPath zkHost includes chroot
[junit4:junit4]   2> 4067 T145 oaz.ZooKeeper.<init> Initiating client connection, connectString=127.0.0.1:45167 sessionTimeout=60000 watcher=org.apache.solr.common.cloud.ConnectionManager@1c3087f9
[junit4:junit4]   2> 4068 T145 oascc.ConnectionManager.waitForConnected Waiting for client to connect to ZooKeeper
[junit4:junit4]   2> 4068 T184 oaz.ClientCnxn$SendThread.logStartConnect Opening socket connection to server localhost/127.0.0.1:45167. Will not attempt to authenticate using SASL (access denied (javax.security.auth.AuthPermission getLoginConfiguration))
[junit4:junit4]   2> 4069 T184 oaz.ClientCnxn$SendThread.primeConnection Socket connection established to localhost/127.0.0.1:45167, initiating session
[junit4:junit4]   2> 4069 T147 oazs.NIOServerCnxnFactory.run Accepted socket connection from /140.211.11.196:41244
[junit4:junit4]   2> 4070 T147 oazs.ZooKeeperServer.processConnectRequest Client attempting to establish new session at /140.211.11.196:41244
[junit4:junit4]   2> 4101 T149 oazs.ZooKeeperServer.finishSessionInit Established session 0x13baeb6f9d60005 with negotiated timeout 20000 for client /140.211.11.196:41244
[junit4:junit4]   2> 4101 T184 oaz.ClientCnxn$SendThread.onConnected Session establishment complete on server localhost/127.0.0.1:45167, sessionid = 0x13baeb6f9d60005, negotiated timeout = 20000
[junit4:junit4]   2> 4101 T185 oascc.ConnectionManager.process Watcher org.apache.solr.common.cloud.ConnectionManager@1c3087f9 name:ZooKeeperConnection Watcher:127.0.0.1:45167 got event WatchedEvent state:SyncConnected type:None path:null path:null type:None
[junit4:junit4]   2> 4102 T145 oascc.ConnectionManager.waitForConnected Client is connected to ZooKeeper
[junit4:junit4]   2> 4115 T150 oazs.PrepRequestProcessor.pRequest2Txn Processed session termination for sessionid: 0x13baeb6f9d60005
[junit4:junit4]   2> 4145 T185 oaz.ClientCnxn$EventThread.run EventThread shut down
[junit4:junit4]   2> 4145 T145 oaz.ZooKeeper.close Session: 0x13baeb6f9d60005 closed
[junit4:junit4]   2> 4145 T147 oazs.NIOServerCnxn.closeSock Closed socket connection for client /140.211.11.196:41244 which had sessionid 0x13baeb6f9d60005
[junit4:junit4]   2> 4146 T145 oascsi.HttpClientUtil.createClient Creating new http client, config:maxConnections=500&maxConnectionsPerHost=16&socketTimeout=15000&connTimeout=30000
[junit4:junit4]   2> 4159 T145 oaz.ZooKeeper.<init> Initiating client connection, connectString=127.0.0.1:45167/solr sessionTimeout=30000 watcher=org.apache.solr.common.cloud.ConnectionManager@7b0c81a6
[junit4:junit4]   2> 4161 T145 oascc.ConnectionManager.waitForConnected Waiting for client to connect to ZooKeeper
[junit4:junit4]   2> 4161 T186 oaz.ClientCnxn$SendThread.logStartConnect Opening socket connection to server localhost/127.0.0.1:45167. Will not attempt to authenticate using SASL (access denied (javax.security.auth.AuthPermission getLoginConfiguration))
[junit4:junit4]   2> 4162 T186 oaz.ClientCnxn$SendThread.primeConnection Socket connection established to localhost/127.0.0.1:45167, initiating session
[junit4:junit4]   2> 4162 T147 oazs.NIOServerCnxnFactory.run Accepted socket connection from /140.211.11.196:62154
[junit4:junit4]   2> 4163 T147 oazs.ZooKeeperServer.processConnectRequest Client attempting to establish new session at /140.211.11.196:62154
[junit4:junit4]   2> 4170 T174 oascc.ZkStateReader$2.process A cluster state change: WatchedEvent state:SyncConnected type:NodeDataChanged path:/clusterstate.json, has occurred - updating... (live nodes size: 1)
[junit4:junit4]   2> 4170 T168 oascc.ZkStateReader$2.process A cluster state change: WatchedEvent state:SyncConnected type:NodeDataChanged path:/clusterstate.json, has occurred - updating... (live nodes size: 1)
[junit4:junit4]   2> 4171 T149 oazs.ZooKeeperServer.finishSessionInit Established session 0x13baeb6f9d60006 with negotiated timeout 20000 for client /140.211.11.196:62154
[junit4:junit4]   2> 4171 T186 oaz.ClientCnxn$SendThread.onConnected Session establishment complete on server localhost/127.0.0.1:45167, sessionid = 0x13baeb6f9d60006, negotiated timeout = 20000
[junit4:junit4]   2> 4172 T187 oascc.ConnectionManager.process Watcher org.apache.solr.common.cloud.ConnectionManager@7b0c81a6 name:ZooKeeperConnection Watcher:127.0.0.1:45167/solr got event WatchedEvent state:SyncConnected type:None path:null path:null type:None
[junit4:junit4]   2> 4172 T145 oascc.ConnectionManager.waitForConnected Client is connected to ZooKeeper
[junit4:junit4]   2> 4174 T150 oazs.PrepRequestProcessor.pRequest Got user-level KeeperException when processing sessionid:0x13baeb6f9d60006 type:create cxid:0x1 zxid:0x4c txntype:-1 reqpath:n/a Error Path:/solr/overseer Error:KeeperErrorCode = NodeExists for /solr/overseer
[junit4:junit4]   2> 4176 T150 oazs.PrepRequestProcessor.pRequest Got user-level KeeperException when processing sessionid:0x13baeb6f9d60006 type:create cxid:0x2 zxid:0x4e txntype:-1 reqpath:n/a Error Path:/solr/overseer Error:KeeperErrorCode = NodeExists for /solr/overseer
[junit4:junit4]   2> 4193 T145 oasc.ZkController.createEphemeralLiveNode Register node as live in ZooKeeper:/live_nodes/127.0.0.1:64893_c_s%2Fst
[junit4:junit4]   2> 4195 T150 oazs.PrepRequestProcessor.pRequest Got user-level KeeperException when processing sessionid:0x13baeb6f9d60006 type:delete cxid:0x4 zxid:0x4f txntype:-1 reqpath:n/a Error Path:/solr/live_nodes/127.0.0.1:64893_c_s%2Fst Error:KeeperErrorCode = NoNode for /solr/live_nodes/127.0.0.1:64893_c_s%2Fst
[junit4:junit4]   2> 4196 T145 oascc.SolrZkClient.makePath makePath: /live_nodes/127.0.0.1:64893_c_s%2Fst
[junit4:junit4]   2> 4230 T174 oascc.ZkStateReader$2.process A cluster state change: WatchedEvent state:SyncConnected type:NodeChildrenChanged path:/live_nodes, has occurred - updating... (live nodes size: 1)
[junit4:junit4]   2> 4232 T168 oascc.ZkStateReader$3.process Updating live nodes... (2)
[junit4:junit4]   2> 4233 T168 oascc.ZkStateReader$2.process A cluster state change: WatchedEvent state:SyncConnected type:NodeChildrenChanged path:/live_nodes, has occurred - updating... (live nodes size: 2)
[junit4:junit4]   2> 4234 T174 oascc.ZkStateReader$3.process Updating live nodes... (2)
[junit4:junit4]   2> 4245 T145 oascc.ZkStateReader.createClusterStateWatchersAndUpdate Updating cluster state from ZooKeeper... 
[junit4:junit4]   2> 4255 T188 oasc.CoreContainer.create Creating SolrCore 'collection1' using instanceDir: /usr/home/hudson/hudson-slave/workspace/Lucene-Solr-Tests-trunk-Java6/solr/build/solr-core/test/J1/./org.apache.solr.cloud.SyncSliceTest-jetty1-1355845929055/collection1
[junit4:junit4]   2> 4256 T188 oasc.ZkController.createCollectionZkNode Check for collection zkNode:collection1
[junit4:junit4]   2> 4257 T188 oasc.ZkController.createCollectionZkNode Collection zkNode exists
[junit4:junit4]   2> 4257 T188 oasc.ZkController.readConfigName Load collection config from:/collections/collection1
[junit4:junit4]   2> 4269 T188 oasc.SolrResourceLoader.<init> new SolrResourceLoader for directory: '/usr/home/hudson/hudson-slave/workspace/Lucene-Solr-Tests-trunk-Java6/solr/build/solr-core/test/J1/./org.apache.solr.cloud.SyncSliceTest-jetty1-1355845929055/collection1/'
[junit4:junit4]   2> 4280 T188 oasc.SolrResourceLoader.replaceClassLoader Adding 'file:/usr/home/hudson/hudson-slave/workspace/Lucene-Solr-Tests-trunk-Java6/solr/build/solr-core/test/J1/org.apache.solr.cloud.SyncSliceTest-jetty1-1355845929055/collection1/lib/README' to classloader
[junit4:junit4]   2> 4285 T188 oasc.SolrResourceLoader.replaceClassLoader Adding 'file:/usr/home/hudson/hudson-slave/workspace/Lucene-Solr-Tests-trunk-Java6/solr/build/solr-core/test/J1/org.apache.solr.cloud.SyncSliceTest-jetty1-1355845929055/collection1/lib/classes/' to classloader
[junit4:junit4]   2> 4502 T188 oasc.SolrConfig.<init> Using Lucene MatchVersion: LUCENE_50
[junit4:junit4]   2> 4635 T188 oasc.SolrConfig.<init> Loaded SolrConfig: solrconfig.xml
[junit4:junit4]   2> 4737 T188 oass.IndexSchema.readSchema Reading Solr Schema
[junit4:junit4]   2> 4754 T188 oass.IndexSchema.readSchema Schema name=test
[junit4:junit4]   2> 6306 T188 oass.OpenExchangeRatesOrgProvider.init Initialized with rates=open-exchange-rates.json, refreshInterval=1440.
[junit4:junit4]   2> 6354 T188 oass.IndexSchema.readSchema default search field in schema is text
[junit4:junit4]   2> 6378 T188 oass.IndexSchema.readSchema unique key field: id
[junit4:junit4]   2> 6472 T188 oass.FileExchangeRateProvider.reload Reloading exchange rates from file currency.xml
[junit4:junit4]   2> 6496 T188 oass.FileExchangeRateProvider.reload Reloading exchange rates from file currency.xml
[junit4:junit4]   2> 6519 T188 oass.OpenExchangeRatesOrgProvider.reload Reloading exchange rates from open-exchange-rates.json
[junit4:junit4]   2> 6536 T188 oass.OpenExchangeRatesOrgProvider.reload Reloading exchange rates from open-exchange-rates.json
[junit4:junit4]   2> 6540 T188 oasc.SolrCore.<init> [collection1] Opening new SolrCore at /usr/home/hudson/hudson-slave/workspace/Lucene-Solr-Tests-trunk-Java6/solr/build/solr-core/test/J1/./org.apache.solr.cloud.SyncSliceTest-jetty1-1355845929055/collection1/, dataDir=./org.apache.solr.cloud.SyncSliceTest-1355845925328/jetty1/
[junit4:junit4]   2> 6541 T188 oasc.JmxMonitoredMap.<init> JMX monitoring is enabled. Adding Solr mbeans to JMX Server: com.sun.jmx.mbeanserver.JmxMBeanServer@6d46b6db
[junit4:junit4]   2> 6548 T188 oasc.SolrCore.initDirectoryFactory solr.NRTCachingDirectoryFactory
[junit4:junit4]   2> 6555 T188 oasc.CachingDirectoryFactory.get return new directory for /usr/home/hudson/hudson-slave/workspace/Lucene-Solr-Tests-trunk-Java6/solr/build/solr-core/test/J1/./org.apache.solr.cloud.SyncSliceTest-1355845925328/jetty1 forceNew:false
[junit4:junit4]   2> 6558 T188 oasc.CachingDirectoryFactory.close Releasing directory:/usr/home/hudson/hudson-slave/workspace/Lucene-Solr-Tests-trunk-Java6/solr/build/solr-core/test/J1/./org.apache.solr.cloud.SyncSliceTest-1355845925328/jetty1
[junit4:junit4]   2> 6559 T188 oasc.SolrCore.getNewIndexDir New index directory detected: old=null new=./org.apache.solr.cloud.SyncSliceTest-1355845925328/jetty1/index/
[junit4:junit4]   2> 6566 T188 oasc.SolrCore.initIndex WARNING [collection1] Solr index directory './org.apache.solr.cloud.SyncSliceTest-1355845925328/jetty1/index' doesn't exist. Creating new index...
[junit4:junit4]   2> 6574 T188 oasc.CachingDirectoryFactory.get return new directory for /usr/home/hudson/hudson-slave/workspace/Lucene-Solr-Tests-trunk-Java6/solr/build/solr-core/test/J1/./org.apache.solr.cloud.SyncSliceTest-1355845925328/jetty1/index forceNew:false
[junit4:junit4]   2> 6606 T188 oasc.SolrDeletionPolicy.onCommit SolrDeletionPolicy.onCommit: commits:num=1
[junit4:junit4]   2> 		commit{dir=RateLimitedDirectoryWrapper(NRTCachingDirectory(org.apache.lucene.store.NIOFSDirectory@/usr/home/hudson/hudson-slave/workspace/Lucene-Solr-Tests-trunk-Java6/solr/build/solr-core/test/J1/org.apache.solr.cloud.SyncSliceTest-1355845925328/jetty1/index lockFactory=org.apache.lucene.store.NativeFSLockFactory@671bd50e; maxCacheMB=48.0 maxMergeSizeMB=4.0)),segFN=segments_1,generation=1,filenames=[segments_1]
[junit4:junit4]   2> 6615 T188 oasc.SolrDeletionPolicy.updateCommits newest commit = 1[segments_1]
[junit4:junit4]   2> 6616 T188 oasc.CachingDirectoryFactory.close Releasing directory:/usr/home/hudson/hudson-slave/workspace/Lucene-Solr-Tests-trunk-Java6/solr/build/solr-core/test/J1/./org.apache.solr.cloud.SyncSliceTest-1355845925328/jetty1/index
[junit4:junit4]   2> 6617 T188 oasc.SolrCore.initWriters created xml: solr.XMLResponseWriter
[junit4:junit4]   2> 6620 T188 oasup.UpdateRequestProcessorChain.init inserting DistributedUpdateProcessorFactory into updateRequestProcessorChain "dedupe"
[junit4:junit4]   2> 6622 T188 oasup.UpdateRequestProcessorChain.init inserting DistributedUpdateProcessorFactory into updateRequestProcessorChain "dedupe-allfields"
[junit4:junit4]   2> 6623 T188 oasup.UpdateRequestProcessorChain.init inserting DistributedUpdateProcessorFactory into updateRequestProcessorChain "stored_sig"
[junit4:junit4]   2> 6627 T188 oasup.UpdateRequestProcessorChain.init inserting DistributedUpdateProcessorFactory into updateRequestProcessorChain "uniq-fields"
[junit4:junit4]   2> 6637 T188 oasup.UpdateRequestProcessorChain.init inserting DistributedUpdateProcessorFactory into updateRequestProcessorChain "distrib-dup-test-chain-implicit"
[junit4:junit4]   2> 6638 T188 oasc.RequestHandlers.initHandlersFromConfig adding lazy requestHandler: solr.ReplicationHandler
[junit4:junit4]   2> 6639 T188 oasc.RequestHandlers.initHandlersFromConfig created /replication: solr.ReplicationHandler
[junit4:junit4]   2> 6641 T188 oasc.RequestHandlers.initHandlersFromConfig created standard: solr.StandardRequestHandler
[junit4:junit4]   2> 6642 T188 oasc.RequestHandlers.initHandlersFromConfig created /get: solr.RealTimeGetHandler
[junit4:junit4]   2> 6651 T188 oasc.RequestHandlers.initHandlersFromConfig created dismax: solr.SearchHandler
[junit4:junit4]   2> 6653 T188 oasc.RequestHandlers.initHandlersFromConfig created mock: org.apache.solr.core.MockQuerySenderListenerReqHandler
[junit4:junit4]   2> 6654 T188 oasc.RequestHandlers.initHandlersFromConfig created /admin/: org.apache.solr.handler.admin.AdminHandlers
[junit4:junit4]   2> 6655 T188 oasc.RequestHandlers.initHandlersFromConfig created defaults: solr.StandardRequestHandler
[junit4:junit4]   2> 6656 T188 oasc.RequestHandlers.initHandlersFromConfig adding lazy requestHandler: solr.StandardRequestHandler
[junit4:junit4]   2> 6656 T188 oasc.RequestHandlers.initHandlersFromConfig created lazy: solr.StandardRequestHandler
[junit4:junit4]   2> 6660 T188 oasc.RequestHandlers.initHandlersFromConfig created /update: solr.UpdateRequestHandler
[junit4:junit4]   2> 6667 T188 oasc.RequestHandlers.initHandlersFromConfig created /terms: org.apache.solr.handler.component.SearchHandler
[junit4:junit4]   2> 6669 T188 oasc.RequestHandlers.initHandlersFromConfig created spellCheckCompRH: org.apache.solr.handler.component.SearchHandler
[junit4:junit4]   2> 6671 T188 oasc.RequestHandlers.initHandlersFromConfig created spellCheckCompRH_Direct: org.apache.solr.handler.component.SearchHandler
[junit4:junit4]   2> 6678 T188 oasc.RequestHandlers.initHandlersFromConfig created spellCheckWithWordbreak: org.apache.solr.handler.component.SearchHandler
[junit4:junit4]   2> 6681 T188 oasc.RequestHandlers.initHandlersFromConfig created spellCheckWithWordbreak_Direct: org.apache.solr.handler.component.SearchHandler
[junit4:junit4]   2> 6683 T188 oasc.RequestHandlers.initHandlersFromConfig created spellCheckCompRH1: org.apache.solr.handler.component.SearchHandler
[junit4:junit4]   2> 6684 T188 oasc.RequestHandlers.initHandlersFromConfig created mltrh: org.apache.solr.handler.component.SearchHandler
[junit4:junit4]   2> 6686 T188 oasc.RequestHandlers.initHandlersFromConfig created tvrh: org.apache.solr.handler.component.SearchHandler
[junit4:junit4]   2> 6689 T188 oasc.RequestHandlers.initHandlersFromConfig created /mlt: solr.MoreLikeThisHandler
[junit4:junit4]   2> 6691 T188 oasc.RequestHandlers.initHandlersFromConfig created /debug/dump: solr.DumpRequestHandler
[junit4:junit4]   2> 6742 T188 oashl.XMLLoader.init xsltCacheLifetimeSeconds=60
[junit4:junit4]   2> 6769 T188 oasc.SolrCore.initDeprecatedSupport WARNING solrconfig.xml uses deprecated <admin/gettableFiles>, Please update your config to use the ShowFileRequestHandler.
[junit4:junit4]   2> 6779 T188 oasc.SolrCore.initDeprecatedSupport WARNING adding ShowFileRequestHandler with hidden files: [SCHEMA.XML, OLD_SYNONYMS.TXT, STOPWORDS.TXT, PROTWORDS.TXT, OPEN-EXCHANGE-RATES.JSON, SYNONYMS.TXT, CURRENCY.XML, MAPPING-ISOLATIN1ACCENT.TXT]
[junit4:junit4]   2> 6783 T188 oasc.CachingDirectoryFactory.close Releasing directory:/usr/home/hudson/hudson-slave/workspace/Lucene-Solr-Tests-trunk-Java6/solr/build/solr-core/test/J1/./org.apache.solr.cloud.SyncSliceTest-1355845925328/jetty1
[junit4:junit4]   2> 6790 T188 oass.SolrIndexSearcher.<init> Opening Searcher@5fbf404f main
[junit4:junit4]   2> 6792 T188 oasu.CommitTracker.<init> Hard AutoCommit: disabled
[junit4:junit4]   2> 6793 T188 oasu.CommitTracker.<init> Soft AutoCommit: disabled
[junit4:junit4]   2> 6794 T188 oashc.SpellCheckComponent.inform Initializing spell checkers
[junit4:junit4]   2> 6829 T188 oass.DirectSolrSpellChecker.init init: {name=direct,classname=DirectSolrSpellChecker,field=lowerfilt,minQueryLength=3}
[junit4:junit4]   2> 7026 T189 oasc.SolrCore.registerSearcher [collection1] Registered new searcher Searcher@5fbf404f main{StandardDirectoryReader(segments_1:1)}
[junit4:junit4]   2> 7051 T188 oasc.ZkController.publish publishing core=collection1 state=down
[junit4:junit4]   2> 7052 T188 oasc.ZkController.publish numShards not found on descriptor - reading it from system property
[junit4:junit4]   2> 7227 T169 oascc.ZkStateReader.updateClusterState Updating cloud state from ZooKeeper... 
[junit4:junit4]   2> 7230 T169 oasc.Overseer$ClusterStateUpdater.updateState Update state numShards=1 message={
[junit4:junit4]   2> 	  "operation":"state",
[junit4:junit4]   2> 	  "numShards":"1",
[junit4:junit4]   2> 	  "shard":null,
[junit4:junit4]   2> 	  "roles":null,
[junit4:junit4]   2> 	  "state":"down",
[junit4:junit4]   2> 	  "core":"collection1",
[junit4:junit4]   2> 	  "collection":"collection1",
[junit4:junit4]   2> 	  "node_name":"127.0.0.1:64893_c_s%2Fst",
[junit4:junit4]   2> 	  "base_url":"http://127.0.0.1:64893/c_s/st"}
[junit4:junit4]   2> 7231 T169 oasc.Overseer$ClusterStateUpdater.createCollection Create collection collection1 with numShards 1
[junit4:junit4]   2> 7232 T169 oasc.Overseer$ClusterStateUpdater.updateState Assigning new node to shard shard=shard1
[junit4:junit4]   2> 7246 T168 oascc.ZkStateReader$2.process A cluster state change: WatchedEvent state:SyncConnected type:NodeDataChanged path:/clusterstate.json, has occurred - updating... (live nodes size: 2)
[junit4:junit4]   2> 7247 T174 oascc.ZkStateReader$2.process A cluster state change: WatchedEvent state:SyncConnected type:NodeDataChanged path:/clusterstate.json, has occurred - updating... (live nodes size: 2)
[junit4:junit4]   2> 7247 T187 oascc.ZkStateReader$2.process A cluster state change: WatchedEvent state:SyncConnected type:NodeDataChanged path:/clusterstate.json, has occurred - updating... (live nodes size: 2)
[junit4:junit4]   2> 7561 T188 oasc.CoreContainer.registerCore registering core: collection1
[junit4:junit4]   2> 7561 T188 oasc.ZkController.register Register replica - core:collection1 address:http://127.0.0.1:64893/c_s/st collection:collection1 shard:shard1
[junit4:junit4]   2> 7563 T188 oascc.SolrZkClient.makePath makePath: /collections/collection1/leader_elect/shard1/election
[junit4:junit4]   2> 7599 T150 oazs.PrepRequestProcessor.pRequest Got user-level KeeperException when processing sessionid:0x13baeb6f9d60006 type:delete cxid:0x43 zxid:0x5b txntype:-1 reqpath:n/a Error Path:/solr/collections/collection1/leaders Error:KeeperErrorCode = NoNode for /solr/collections/collection1/leaders
[junit4:junit4]   2> 7603 T188 oasc.ShardLeaderElectionContext.runLeaderProcess Running the leader process.
[junit4:junit4]   2> 7605 T150 oazs.PrepRequestProcessor.pRequest Got user-level KeeperException when processing sessionid:0x13baeb6f9d60006 type:create cxid:0x44 zxid:0x5c txntype:-1 reqpath:n/a Error Path:/solr/overseer Error:KeeperErrorCode = NodeExists for /solr/overseer
[junit4:junit4]   2> 7610 T188 oasc.ShardLeaderElectionContext.waitForReplicasToComeUp Enough replicas found to continue.
[junit4:junit4]   2> 7611 T188 oasc.ShardLeaderElectionContext.runLeaderProcess I may be the new leader - try and sync
[junit4:junit4]   2> 7614 T188 oasc.SyncStrategy.sync Sync replicas to http://127.0.0.1:64893/c_s/st/collection1/
[junit4:junit4]   2> 7619 T188 oasc.SyncStrategy.syncReplicas Sync Success - now sync replicas to me
[junit4:junit4]   2> 7619 T188 oasc.SyncStrategy.syncToMe http://127.0.0.1:64893/c_s/st/collection1/ has no replicas
[junit4:junit4]   2> 7619 T188 oasc.ShardLeaderElectionContext.runLeaderProcess I am the new leader: http://127.0.0.1:64893/c_s/st/collection1/
[junit4:junit4]   2> 7620 T188 oascc.SolrZkClient.makePath makePath: /collections/collection1/leaders/shard1
[junit4:junit4]   2> 7639 T150 oazs.PrepRequestProcessor.pRequest Got user-level KeeperException when processing sessionid:0x13baeb6f9d60006 type:create cxid:0x4e zxid:0x60 txntype:-1 reqpath:n/a Error Path:/solr/overseer Error:KeeperErrorCode = NodeExists for /solr/overseer
[junit4:junit4]   2> 7764 T169 oascc.ZkStateReader.updateClusterState Updating cloud state from ZooKeeper... 
[junit4:junit4]   2> 7800 T168 oascc.ZkStateReader$2.process A cluster state change: WatchedEvent state:SyncConnected type:NodeDataChanged path:/clusterstate.json, has occurred - updating... (live nodes size: 2)
[junit4:junit4]   2> 7800 T187 oascc.ZkStateReader$2.process A cluster state change: WatchedEvent state:SyncConnected type:NodeDataChanged path:/clusterstate.json, has occurred - updating... (live nodes size: 2)
[junit4:junit4]   2> 7800 T174 oascc.ZkStateReader$2.process A cluster state change: WatchedEvent state:SyncConnected type:NodeDataChanged path:/clusterstate.json, has occurred - updating... (live nodes size: 2)
[junit4:junit4]   2> 7855 T188 oasc.ZkController.register We are http://127.0.0.1:64893/c_s/st/collection1/ and leader is http://127.0.0.1:64893/c_s/st/collection1/
[junit4:junit4]   2> 7857 T188 oasc.ZkController.register No LogReplay needed for core=collection1 baseURL=http://127.0.0.1:64893/c_s/st
[junit4:junit4]   2> 7857 T188 oasc.ZkController.checkRecovery I am the leader, no recovery necessary
[junit4:junit4]   2> 7858 T188 oasc.ZkController.publish publishing core=collection1 state=active
[junit4:junit4]   2> 7858 T188 oasc.ZkController.publish numShards not found on descriptor - reading it from system property
[junit4:junit4]   2> 7864 T188 oascc.ZkStateReader.updateClusterState Updating cloud state from ZooKeeper... 
[junit4:junit4]   2> 7867 T145 oass.SolrDispatchFilter.init user.dir=/usr/home/hudson/hudson-slave/workspace/Lucene-Solr-Tests-trunk-Java6/solr/build/solr-core/test/J1
[junit4:junit4]   2> 7868 T145 oass.SolrDispatchFilter.init SolrDispatchFilter.init() done
[junit4:junit4]   2> 7869 T145 oascsi.HttpClientUtil.createClient Creating new http client, config:maxConnections=128&maxConnectionsPerHost=32&followRedirects=false
[junit4:junit4]   2> 8327 T169 oascc.ZkStateReader.updateClusterState Updating cloud state from ZooKeeper... 
[junit4:junit4]   2> 8329 T169 oasc.Overseer$ClusterStateUpdater.updateState Update state numShards=1 message={
[junit4:junit4]   2> 	  "operation":"state",
[junit4:junit4]   2> 	  "numShards":"1",
[junit4:junit4]   2> 	  "shard":"shard1",
[junit4:junit4]   2> 	  "roles":null,
[junit4:junit4]   2> 	  "state":"active",
[junit4:junit4]   2> 	  "core":"collection1",
[junit4:junit4]   2> 	  "collection":"collection1",
[junit4:junit4]   2> 	  "node_name":"127.0.0.1:64893_c_s%2Fst",
[junit4:junit4]   2> 	  "base_url":"http://127.0.0.1:64893/c_s/st"}
[junit4:junit4]   2> 8345 T168 oascc.ZkStateReader$2.process A cluster state change: WatchedEvent state:SyncConnected type:NodeDataChanged path:/clusterstate.json, has occurred - updating... (live nodes size: 2)
[junit4:junit4]   2> 8345 T174 oascc.ZkStateReader$2.process A cluster state change: WatchedEvent state:SyncConnected type:NodeDataChanged path:/clusterstate.json, has occurred - updating... (live nodes size: 2)
[junit4:junit4]   2> 8345 T187 oascc.ZkStateReader$2.process A cluster state change: WatchedEvent state:SyncConnected type:NodeDataChanged path:/clusterstate.json, has occurred - updating... (live nodes size: 2)
[junit4:junit4]   2> 8446 T145 oejs.Server.doStart jetty-8.1.8.v20121106
[junit4:junit4]   2> 8456 T145 oejs.AbstractConnector.doStart Started SocketConnector@127.0.0.1:40156
[junit4:junit4]   2> 8458 T145 oasc.SolrResourceLoader.locateSolrHome JNDI not configured for solr (NoInitialContextEx)
[junit4:junit4]   2> 8459 T145 oasc.SolrResourceLoader.locateSolrHome using system property solr.solr.home: /usr/home/hudson/hudson-slave/workspace/Lucene-Solr-Tests-trunk-Java6/solr/build/solr-core/test/J1/./org.apache.solr.cloud.SyncSliceTest-jetty2-1355845933219
[junit4:junit4]   2> 8460 T145 oasc.SolrResourceLoader.<init> new SolrResourceLoader for deduced Solr Home: '/usr/home/hudson/hudson-slave/workspace/Lucene-Solr-Tests-trunk-Java6/solr/build/solr-core/test/J1/./org.apache.solr.cloud.SyncSliceTest-jetty2-1355845933219/'
[junit4:junit4]   2> 8689 T145 oass.SolrDispatchFilter.init SolrDispatchFilter.init()
[junit4:junit4]   2> 8690 T145 oasc.SolrResourceLoader.locateSolrHome JNDI not configured for solr (NoInitialContextEx)
[junit4:junit4]   2> 8690 T145 oasc.SolrResourceLoader.locateSolrHome using system property solr.solr.home: /usr/home/hudson/hudson-slave/workspace/Lucene-Solr-Tests-trunk-Java6/solr/build/solr-core/test/J1/./org.apache.solr.cloud.SyncSliceTest-jetty2-1355845933219
[junit4:junit4]   2> 8691 T145 oasc.CoreContainer$Initializer.initialize looking for solr.xml: /usr/home/hudson/hudson-slave/workspace/Lucene-Solr-Tests-trunk-Java6/solr/build/solr-core/test/J1/./org.apache.solr.cloud.SyncSliceTest-jetty2-1355845933219/solr.xml
[junit4:junit4]   2> 8692 T145 oasc.CoreContainer.<init> New CoreContainer 1810101068
[junit4:junit4]   2> 8694 T145 oasc.CoreContainer.load Loading CoreContainer using Solr Home: '/usr/home/hudson/hudson-slave/workspace/Lucene-Solr-Tests-trunk-Java6/solr/build/solr-core/test/J1/./org.apache.solr.cloud.SyncSliceTest-jetty2-1355845933219/'
[junit4:junit4]   2> 8694 T145 oasc.SolrResourceLoader.<init> new SolrResourceLoader for directory: '/usr/home/hudson/hudson-slave/workspace/Lucene-Solr-Tests-trunk-Java6/solr/build/solr-core/test/J1/./org.apache.solr.cloud.SyncSliceTest-jetty2-1355845933219/'
[junit4:junit4]   2> 8747 T145 oashc.HttpShardHandlerFactory.getParameter Setting socketTimeout to: 30000
[junit4:junit4]   2> 8748 T145 oashc.HttpShardHandlerFactory.getParameter Setting urlScheme to: http://
[junit4:junit4]   2> 8748 T145 oashc.HttpShardHandlerFactory.getParameter Setting connTimeout to: 15000
[junit4:junit4]   2> 8749 T145 oashc.HttpShardHandlerFactory.getParameter Setting maxConnectionsPerHost to: 20
[junit4:junit4]   2> 8749 T145 oashc.HttpShardHandlerFactory.getParameter Setting corePoolSize to: 0
[junit4:junit4]   2> 8750 T145 oashc.HttpShardHandlerFactory.getParameter Setting maximumPoolSize to: 2147483647
[junit4:junit4]   2> 8750 T145 oashc.HttpShardHandlerFactory.getParameter Setting maxThreadIdleTime to: 5
[junit4:junit4]   2> 8751 T145 oashc.HttpShardHandlerFactory.getParameter Setting sizeOfQueue to: -1
[junit4:junit4]   2> 8751 T145 oashc.HttpShardHandlerFactory.getParameter Setting fairnessPolicy to: false
[junit4:junit4]   2> 8752 T145 oascsi.HttpClientUtil.createClient Creating new http client, config:maxConnectionsPerHost=20&maxConnections=10000&socketTimeout=30000&connTimeout=15000&retry=false
[junit4:junit4]   2> 8779 T145 oasc.CoreContainer.load Registering Log Listener
[junit4:junit4]   2> 8799 T145 oasc.CoreContainer.initZooKeeper Zookeeper client=127.0.0.1:45167/solr
[junit4:junit4]   2> 8799 T145 oasc.ZkController.checkChrootPath zkHost includes chroot
[junit4:junit4]   2> 8800 T145 oaz.ZooKeeper.<init> Initiating client connection, connectString=127.0.0.1:45167 sessionTimeout=60000 watcher=org.apache.solr.common.cloud.ConnectionManager@667053be
[junit4:junit4]   2> 8801 T145 oascc.ConnectionManager.waitForConnected Waiting for client to connect to ZooKeeper
[junit4:junit4]   2> 8802 T199 oaz.ClientCnxn$SendThread.logStartConnect Opening socket connection to server localhost/127.0.0.1:45167. Will not attempt to authenticate using SASL (access denied (javax.security.auth.AuthPermission getLoginConfiguration))
[junit4:junit4]   2> 8803 T199 oaz.ClientCnxn$SendThread.primeConnection Socket connection established to localhost/127.0.0.1:45167, initiating session
[junit4:junit4]   2> 8803 T147 oazs.NIOServerCnxnFactory.run Accepted socket connection from /140.211.11.196:40157
[junit4:junit4]   2> 8804 T147 oazs.ZooKeeperServer.processConnectRequest Client attempting to establish new session at /140.211.11.196:40157
[junit4:junit4]   2> 8824 T149 oazs.ZooKeeperServer.finishSessionInit Established session 0x13baeb6f9d60007 with negotiated timeout 20000 for client /140.211.11.196:40157
[junit4:junit4]   2> 8825 T199 oaz.ClientCnxn$SendThread.onConnected Session establishment complete on server localhost/127.0.0.1:45167, sessionid = 0x13baeb6f9d60007, negotiated timeout = 20000
[junit4:junit4]   2> 8825 T200 oascc.ConnectionManager.process Watcher org.apache.solr.common.cloud.ConnectionManager@667053be name:ZooKeeperConnection Watcher:127.0.0.1:45167 got event WatchedEvent state:SyncConnected type:None path:null path:null type:None
[junit4:junit4]   2> 8826 T145 oascc.ConnectionManager.waitForConnected Client is connected to ZooKeeper
[junit4:junit4]   2> 8828 T150 oazs.PrepRequestProcessor.pRequest2Txn Processed session termination for sessionid: 0x13baeb6f9d60007
[junit4:junit4]   2> 8864 T200 oaz.ClientCnxn$EventThread.run EventThread shut down
[junit4:junit4]   2> 8864 T145 oaz.ZooKeeper.close Session: 0x13baeb6f9d60007 closed
[junit4:junit4]   2> 8864 T147 oazs.NIOServerCnxn.closeSock Closed socket connection for client /140.211.11.196:40157 which had sessionid 0x13baeb6f9d60007
[junit4:junit4]   2> 8865 T145 oascsi.HttpClientUtil.createClient Creating new http client, config:maxConnections=500&maxConnectionsPerHost=16&socketTimeout=15000&connTimeout=30000
[junit4:junit4]   2> 8876 T145 oaz.ZooKeeper.<init> Initiating client connection, connectString=127.0.0.1:45167/solr sessionTimeout=30000 watcher=org.apache.solr.common.cloud.ConnectionManager@1829ae5e
[junit4:junit4]   2> 8877 T145 oascc.ConnectionManager.waitForConnected Waiting for client to connect to ZooKeeper
[junit4:junit4]   2> 8877 T201 oaz.ClientCnxn$SendThread.logStartConnect Opening socket connection to server localhost/127.0.0.1:45167. Will not attempt to authenticate using SASL (access denied (javax.security.auth.AuthPermission getLoginConfiguration))
[junit4:junit4]   2> 8878 T201 oaz.ClientCnxn$SendThread.primeConnection Socket connection established to localhost/127.0.0.1:45167, initiating session
[junit4:junit4]   2> 8878 T147 oazs.NIOServerCnxnFactory.run Accepted socket connection from /140.211.11.196:40158
[junit4:junit4]   2> 8879 T147 oazs.ZooKeeperServer.processConnectRequest Client attempting to establish new session at /140.211.11.196:40158
[junit4:junit4]   2> 8906 T149 oazs.ZooKeeperServer.finishSessionInit Established session 0x13baeb6f9d60008 with negotiated timeout 20000 for client /140.211.11.196:40158
[junit4:junit4]   2> 8906 T201 oaz.ClientCnxn$SendThread.onConnected Session establishment complete on server localhost/127.0.0.1:45167, sessionid = 0x13baeb6f9d60008, negotiated timeout = 20000
[junit4:junit4]   2> 8907 T202 oascc.ConnectionManager.process Watcher org.apache.solr.common.cloud.ConnectionManager@1829ae5e name:ZooKeeperConnection Watcher:127.0.0.1:45167/solr got event WatchedEvent state:SyncConnected type:None path:null path:null type:None
[junit4:junit4]   2> 8907 T145 oascc.ConnectionManager.waitForConnected Client is connected to ZooKeeper
[junit4:junit4]   2> 8909 T150 oazs.PrepRequestProcessor.pRequest Got user-level KeeperException when processing sessionid:0x13baeb6f9d60008 type:create cxid:0x1 zxid:0x71 txntype:-1 reqpath:n/a Error Path:/solr/overseer Error:KeeperErrorCode = NodeExists for /solr/overseer
[junit4:junit4]   2> 8962 T150 oazs.PrepRequestProcessor.pRequest Got user-level KeeperException when processing sessionid:0x13baeb6f9d60008 type:create cxid:0x2 zxid:0x72 txntype:-1 reqpath:n/a Error Path:/solr/overseer Error:KeeperErrorCode = NodeExists for /solr/overseer
[junit4:junit4]   2> 9002 T145 oasc.ZkController.createEphemeralLiveNode Register node as live in ZooKeeper:/live_nodes/127.0.0.1:40156_c_s%2Fst
[junit4:junit4]   2> 9003 T150 oazs.PrepRequestProcessor.pRequest Got user-level KeeperException when processing sessionid:0x13baeb6f9d60008 type:delete cxid:0x4 zxid:0x73 txntype:-1 reqpath:n/a Error Path:/solr/live_nodes/127.0.0.1:40156_c_s%2Fst Error:KeeperErrorCode = NoNode for /solr/live_nodes/127.0.0.1:40156_c_s%2Fst
[junit4:junit4]   2> 9027 T145 oascc.SolrZkClient.makePath makePath: /live_nodes/127.0.0.1:40156_c_s%2Fst
[junit4:junit4]   2> 9067 T187 oascc.ZkStateReader$2.process A cluster state change: WatchedEvent state:SyncConnected type:NodeChildrenChanged path:/live_nodes, has occurred - updating... (live nodes size: 2)
[junit4:junit4]   2> 9067 T174 oascc.ZkStateReader$2.process A cluster state change: WatchedEvent state:SyncConnected type:NodeChildrenChanged path:/live_nodes, has occurred - updating... (live nodes size: 2)
[junit4:junit4]   2> 9068 T168 oascc.ZkStateReader$3.process Updating live nodes... (3)
[junit4:junit4]   2> 9068 T168 oascc.ZkStateReader$2.process A cluster state change: WatchedEvent state:SyncConnected type:NodeChildrenChanged path:/live_nodes, has occurred - updating... (live nodes size: 3)
[junit4:junit4]   2> 9071 T187 oascc.ZkStateReader$3.process Updating live nodes... (3)
[junit4:junit4]   2> 9071 T174 oascc.ZkStateReader$3.process Updating live nodes... (3)
[junit4:junit4]   2> 9076 T145 oascc.ZkStateReader.createClusterStateWatchersAndUpdate Updating cluster state from ZooKeeper... 
[junit4:junit4]   2> 9087 T203 oasc.CoreContainer.create Creating SolrCore 'collection1' using instanceDir: /usr/home/hudson/hudson-slave/workspace/Lucene-Solr-Tests-trunk-Java6/solr/build/solr-core/test/J1/./org.apache.solr.cloud.SyncSliceTest-jetty2-1355845933219/collection1
[junit4:junit4]   2> 9087 T203 oasc.ZkController.createCollectionZkNode Check for collection zkNode:collection1
[junit4:junit4]   2> 9089 T203 oasc.ZkController.createCollectionZkNode Collection zkNode exists
[junit4:junit4]   2> 9089 T203 oasc.ZkController.readConfigName Load collection config from:/collections/collection1
[junit4:junit4]   2> 9091 T203 oasc.SolrResourceLoader.<init> new SolrResourceLoader for directory: '/usr/home/hudson/hudson-slave/workspace/Lucene-Solr-Tests-trunk-Java6/solr/build/solr-core/test/J1/./org.apache.solr.cloud.SyncSliceTest-jetty2-1355845933219/collection1/'
[junit4:junit4]   2> 9092 T203 oasc.SolrResourceLoader.replaceClassLoader Adding 'file:/usr/home/hudson/hudson-slave/workspace/Lucene-Solr-Tests-trunk-Java6/solr/build/solr-core/test/J1/org.apache.solr.cloud.SyncSliceTest-jetty2-1355845933219/collection1/lib/classes/' to classloader
[junit4:junit4]   2> 9093 T203 oasc.SolrResourceLoader.replaceClassLoader Adding 'file:/usr/home/hudson/hudson-slave/workspace/Lucene-Solr-Tests-trunk-Java6/solr/build/solr-core/test/J1/org.apache.solr.cloud.SyncSliceTest-jetty2-1355845933219/collection1/lib/README' to classloader
[junit4:junit4]   2> 9150 T203 oasc.SolrConfig.<init> Using Lucene MatchVersion: LUCENE_50
[junit4:junit4]   2> 9227 T203 oasc.SolrConfig.<init> Loaded SolrConfig: solrconfig.xml
[junit4:junit4]   2> 9328 T203 oass.IndexSchema.readSchema Reading Solr Schema
[junit4:junit4]   2> 9341 T203 oass.IndexSchema.readSchema Schema name=test
[junit4:junit4]   2> 10030 T203 oass.OpenExchangeRatesOrgProvider.init Initialized with rates=open-exchange-rates.json, refreshInterval=1440.
[junit4:junit4]   2> 10049 T203 oass.IndexSchema.readSchema default search field in schema is text
[junit4:junit4]   2> 10053 T203 oass.IndexSchema.readSchema unique key field: id
[junit4:junit4]   2> 10085 T203 oass.FileExchangeRateProvider.reload Reloading exchange rates from file currency.xml
[junit4:junit4]   2> 10094 T203 oass.FileExchangeRateProvider.reload Reloading exchange rates from file currency.xml
[junit4:junit4]   2> 10103 T203 oass.OpenExchangeRatesOrgProvider.reload Reloading exchange rates from open-exchange-rates.json
[junit4:junit4]   2> 10107 T203 oass.OpenExchangeRatesOrgProvider.reload Reloading exchange rates from open-exchange-rates.json
[junit4:junit4]   2> 10113 T203 oasc.SolrCore.<init> [collection1] Opening new SolrCore at /usr/home/hudson/hudson-slave/workspace/Lucene-Solr-Tests-trunk-Java6/solr/build/solr-core/test/J1/./org.apache.solr.cloud.SyncSliceTest-jetty2-1355845933219/collection1/, dataDir=./org.apache.solr.cloud.SyncSliceTest-1355845925328/jetty2/
[junit4:junit4]   2> 10114 T203 oasc.JmxMonitoredMap.<init> JMX monitoring is enabled. Adding Solr mbeans to JMX Server: com.sun.jmx.mbeanserver.JmxMBeanServer@6d46b6db
[junit4:junit4]   2> 10127 T203 oasc.SolrCore.initDirectoryFactory solr.NRTCachingDirectoryFactory
[junit4:junit4]   2> 10130 T203 oasc.CachingDirectoryFactory.get return new directory for /usr/home/hudson/hudson-slave/workspace/Lucene-Solr-Tests-trunk-Java6/solr/build/solr-core/test/J1/./org.apache.solr.cloud.SyncSliceTest-1355845925328/jetty2 forceNew:false
[junit4:junit4]   2> 10131 T203 oasc.CachingDirectoryFactory.close Releasing directory:/usr/home/hudson/hudson-slave/workspace/Lucene-Solr-Tests-trunk-Java6/solr/build/solr-core/test/J1/./org.apache.solr.cloud.SyncSliceTest-1355845925328/jetty2
[junit4:junit4]   2> 10131 T203 oasc.SolrCore.getNewIndexDir New index directory detected: old=null new=./org.apache.solr.cloud.SyncSliceTest-1355845925328/jetty2/index/
[junit4:junit4]   2> 10133 T203 oasc.SolrCore.initIndex WARNING [collection1] Solr index directory './org.apache.solr.cloud.SyncSliceTest-1355845925328/jetty2/index' doesn't exist. Creating new index...
[junit4:junit4]   2> 10134 T203 oasc.CachingDirectoryFactory.get return new directory for /usr/home/hudson/hudson-slave/workspace/Lucene-Solr-Tests-trunk-Java6/solr/build/solr-core/test/J1/./org.apache.solr.cloud.SyncSliceTest-1355845925328/jetty2/index forceNew:false
[junit4:junit4]   2> 10142 T203 oasc.SolrDeletionPolicy.onCommit SolrDeletionPolicy.onCommit: commits:num=1
[junit4:junit4]   2> 		commit{dir=RateLimitedDirectoryWrapper(NRTCachingDirectory(org.apache.lucene.store.NIOFSDirectory@/usr/home/hudson/hudson-slave/workspace/Lucene-Solr-Tests-trunk-Java6/solr/build/solr-core/test/J1/org.apache.solr.cloud.SyncSliceTest-1355845925328/jetty2/index lockFactory=org.apache.lucene.store.NativeFSLockFactory@59441dc0; maxCacheMB=48.0 maxMergeSizeMB=4.0)),segFN=segments_1,generation=1,filenames=[segments_1]
[junit4:junit4]   2> 10143 T203 oasc.SolrDeletionPolicy.updateCommits newest commit = 1[segments_1]
[junit4:junit4]   2> 10145 T203 oasc.CachingDirectoryFactory.close Releasing directory:/usr/home/hudson/hudson-slave/workspace/Lucene-Solr-Tests-trunk-Java6/solr/build/solr-core/test/J1/./org.apache.solr.cloud.SyncSliceTest-1355845925328/jetty2/index
[junit4:junit4]   2> 10145 T203 oasc.SolrCore.initWriters created xml: solr.XMLResponseWriter
[junit4:junit4]   2> 10148 T203 oasup.UpdateRequestProcessorChain.init inserting DistributedUpdateProcessorFactory into updateRequestProcessorChain "dedupe"
[junit4:junit4]   2> 10149 T203 oasup.UpdateRequestProcessorChain.init inserting DistributedUpdateProcessorFactory into updateRequestProcessorChain "dedupe-allfields"
[junit4:junit4]   2> 10150 T203 oasup.UpdateRequestProcessorChain.init inserting DistributedUpdateProcessorFactory into updateRequestProcessorChain "stored_sig"
[junit4:junit4]   2> 10150 T203 oasup.UpdateRequestProcessorChain.init inserting DistributedUpdateProcessorFactory into updateRequestProcessorChain "uniq-fields"
[junit4:junit4]   2> 10151 T203 oasup.UpdateRequestProcessorChain.init inserting DistributedUpdateProcessorFactory into updateRequestProcessorChain "distrib-dup-test-chain-implicit"
[junit4:junit4]   2> 10152 T203 oasc.RequestHandlers.initHandlersFromConfig adding lazy requestHandler: solr.ReplicationHandler
[junit4:junit4]   2> 10152 T203 oasc.RequestHandlers.initHandlersFromConfig created /replication: solr.ReplicationHandler
[junit4:junit4]   2> 10154 T203 oasc.RequestHandlers.initHandlersFromConfig created standard: solr.StandardRequestHandler
[junit4:junit4]   2> 10156 T203 oasc.RequestHandlers.initHandlersFromConfig created /get: solr.RealTimeGetHandler
[junit4:junit4]   2> 10158 T203 oasc.RequestHandlers.initHandlersFromConfig created dismax: solr.SearchHandler
[junit4:junit4]   2> 10160 T203 oasc.RequestHandlers.initHandlersFromConfig created mock: org.apache.solr.core.MockQuerySenderListenerReqHandler
[junit4:junit4]   2> 10161 T203 oasc.RequestHandlers.initHandlersFromConfig created /admin/: org.apache.solr.handler.admin.AdminHandlers
[junit4:junit4]   2> 10192 T203 oasc.RequestHandlers.initHandlersFromConfig created defaults: solr.StandardRequestHandler
[junit4:junit4]   2> 10192 T203 oasc.RequestHandlers.initHandlersFromConfig adding lazy requestHandler: solr.StandardRequestHandler
[junit4:junit4]   2> 10193 T203 oasc.RequestHandlers.initHandlersFromConfig created lazy: solr.StandardRequestHandler
[junit4:junit4]   2> 10194 T203 oasc.RequestHandlers.initHandlersFromConfig created /update: solr.UpdateRequestHandler
[junit4:junit4]   2> 10196 T203 oasc.RequestHandlers.initHandlersFromConfig created /terms: org.apache.solr.handler.component.SearchHandler
[junit4:junit4]   2> 10197 T203 oasc.RequestHandlers.initHandlersFromConfig created spellCheckCompRH: org.apache.solr.handler.component.SearchHandler
[junit4:junit4]   2> 10198 T203 oasc.RequestHandlers.initHandlersFromConfig created spellCheckCompRH_Direct: org.apache.solr.handler.component.SearchHandler
[junit4:junit4]   2> 10200 T203 oasc.RequestHandlers.initHandlersFromConfig created spellCheckWithWordbreak: org.apache.solr.handler.component.SearchHandler
[junit4:junit4]   2> 10201 T203 oasc.RequestHandlers.initHandlersFromConfig created spellCheckWithWordbreak_Direct: org.apache.solr.handler.component.SearchHandler
[junit4:junit4]   2> 10202 T203 oasc.RequestHandlers.initHandlersFromConfig created spellCheckCompRH1: org.apache.solr.handler.component.SearchHandler
[junit4:junit4]   2> 10204 T203 oasc.RequestHandlers.initHandlersFromConfig created mltrh: org.apache.solr.handler.component.SearchHandler
[junit4:junit4]   2> 10205 T203 oasc.RequestHandlers.initHandlersFromConfig created tvrh: org.apache.solr.handler.component.SearchHandler
[junit4:junit4]   2> 10206 T203 oasc.RequestHandlers.initHandlersFromConfig created /mlt: solr.MoreLikeThisHandler
[junit4:junit4]   2> 10208 T203 oasc.RequestHandlers.initHandlersFromConfig created /debug/dump: solr.DumpRequestHandler
[junit4:junit4]   2> 10215 T203 oashl.XMLLoader.init xsltCacheLifetimeSeconds=60
[junit4:junit4]   2> 10220 T203 oasc.SolrCore.initDeprecatedSupport WARNING solrconfig.xml uses deprecated <admin/gettableFiles>, Please update your config to use the ShowFileRequestHandler.
[junit4:junit4]   2> 10223 T203 oasc.SolrCore.initDeprecatedSupport WARNING adding ShowFileRequestHandler with hidden files: [SCHEMA.XML, OLD_SYNONYMS.TXT, STOPWORDS.TXT, PROTWORDS.TXT, OPEN-EXCHANGE-RATES.JSON, SYNONYMS.TXT, CURRENCY.XML, MAPPING-ISOLATIN1ACCENT.TXT]
[junit4:junit4]   2> 10226 T203 oasc.CachingDirectoryFactory.close Releasing directory:/usr/home/hudson/hudson-slave/workspace/Lucene-Solr-Tests-trunk-Java6/solr/build/solr-core/test/J1/./org.apache.solr.cloud.SyncSliceTest-1355845925328/jetty2
[junit4:junit4]   2> 10228 T203 oass.SolrIndexSearcher.<init> Opening Searcher@77026e40 main
[junit4:junit4]   2> 10229 T203 oasu.CommitTracker.<init> Hard AutoCommit: disabled
[junit4:junit4]   2> 10229 T203 oasu.CommitTracker.<init> Soft AutoCommit: disabled
[junit4:junit4]   2> 10230 T203 oashc.SpellCheckComponent.inform Initializing spell checkers
[junit4:junit4]   2> 10237 T203 oass.DirectSolrSpellChecker.init init: {name=direct,classname=DirectSolrSpellChecker,field=lowerfilt,minQueryLength=3}
[junit4:junit4]   2> 10298 T204 oasc.SolrCore.registerSearcher [collection1] Registered new searcher Searcher@77026e40 main{StandardDirectoryReader(segments_1:1)}
[junit4:junit4]   2> 10305 T203 oasc.ZkController.publish publishing core=collection1 state=down
[junit4:junit4]   2> 10305 T203 oasc.ZkController.publish numShards not found on descriptor - reading it from system property
[junit4:junit4]   2> 10376 T169 oascc.ZkStateReader.updateClusterState Updating cloud state from ZooKeeper... 
[junit4:junit4]   2> 10378 T169 oasc.Overseer$ClusterStateUpdater.updateState Update state numShards=1 message={
[junit4:junit4]   2> 	  "operation":"state",
[junit4:junit4]   2> 	  "numShards":"1",
[junit4:junit4]   2> 	  "shard":null,
[junit4:junit4]   2> 	  "roles":null,
[junit4:junit4]   2> 	  "state":"down",
[junit4:junit4]   2> 	  "core":"collection1",
[junit4:junit4]   2> 	  "collection":"collection1",
[junit4:junit4]   2> 	  "node_name":"127.0.0.1:40156_c_s%2Fst",
[junit4:junit4]   2> 	  "base_url":"http://127.0.0.1:40156/c_s/st"}
[junit4:junit4]   2> 10378 T169 oasc.Overseer$ClusterStateUpdater.updateState Collection already exists with numShards=1
[junit4:junit4]   2> 10379 T169 oasc.Overseer$ClusterStateUpdater.updateState Assigning new node to shard shard=shard1
[junit4:junit4]   2> 10392 T174 oascc.ZkStateReader$2.process A cluster state change: WatchedEvent state:SyncConnected type:NodeDataChanged path:/clusterstate.json, has occurred - updating... (live nodes size: 3)
[junit4:junit4]   2> 10392 T168 oascc.ZkStateReader$2.process A cluster state change: WatchedEvent state:SyncConnected type:NodeDataChanged path:/clusterstate.json, has occurred - updating... (live nodes size: 3)
[junit4:junit4]   2> 10392 T202 oascc.ZkStateReader$2.process A cluster state change: WatchedEvent state:SyncConnected type:NodeDataChanged path:/clusterstate.json, has occurred - updating... (live nodes size: 3)
[junit4:junit4]   2> 10392 T187 oascc.ZkStateReader$2.process A cluster state change: WatchedEvent state:SyncConnected type:NodeDataChanged path:/clusterstate.json, has occurred - updating... (live nodes size: 3)
[junit4:junit4]   2> 10808 T203 oasc.CoreContainer.registerCore registering core: collection1
[junit4:junit4]   2> 10808 T203 oasc.ZkController.register Register replica - core:collection1 address:http://127.0.0.1:40156/c_s/st collection:collection1 shard:shard1
[junit4:junit4]   2> 10818 T203 oasc.ZkController.register We are http://127.0.0.1:40156/c_s/st/collection1/ and leader is http://127.0.0.1:64893/c_s/st/collection1/
[junit4:junit4]   2> 10818 T203 oasc.ZkController.register No LogReplay needed for core=collection1 baseURL=http://127.0.0.1:40156/c_s/st
[junit4:junit4]   2> 10818 T203 oasc.ZkController.checkRecovery Core needs to recover:collection1
[junit4:junit4]   2> 10819 T203 oasu.DefaultSolrCoreState.doRecovery Running recovery - first canceling any ongoing recovery
[junit4:junit4]   2> ASYNC  NEW_CORE C4 name=collection1 org.apache.solr.core.SolrCore@4ba5fc52 url=http://127.0.0.1:40156/c_s/st/collection1 node=127.0.0.1:40156_c_s%2Fst C4_STATE=coll:collection1 core:collection1 props:{shard=null, roles=null, state=down, core=collection1, collection=collection1, node_name=127.0.0.1:40156_c_s%2Fst, base_url=http://127.0.0.1:40156/c_s/st}
[junit4:junit4]   2> 10825 T205 C4 P40156 oasc.RecoveryStrategy.run Starting recovery process.  core=collection1 recoveringAfterStartup=true
[junit4:junit4]   2> 10826 T203 oascc.ZkStateReader.updateClusterState Updating cloud state from ZooKeeper... 
[junit4:junit4]   2> 10826 T205 C4 P40156 oasc.RecoveryStrategy.doRecovery ###### startupVersions=[]
[junit4:junit4]   2> 10827 T205 C4 P40156 oasc.ZkController.publish publishing core=collection1 state=recovering
[junit4:junit4]   2> 10828 T205 C4 P40156 oasc.ZkController.publish numShards not found on descriptor - reading it from system property
[junit4:junit4]   2> 10828 T145 oass.SolrDispatchFilter.init user.dir=/usr/home/hudson/hudson-slave/workspace/Lucene-Solr-Tests-trunk-Java6/solr/build/solr-core/test/J1
[junit4:junit4]   2> 10829 T145 oass.SolrDispatchFilter.init SolrDispatchFilter.init() done
[junit4:junit4]   2> 10829 T145 oascsi.HttpClientUtil.createClient Creating new http client, config:maxConnections=128&maxConnectionsPerHost=32&followRedirects=false
[junit4:junit4]   2> 10830 T205 C4 P40156 oasc.RecoveryStrategy.doRecovery Attempting to PeerSync from http://127.0.0.1:64893/c_s/st/collection1/ core=collection1 - recoveringAfterStartup=true
[junit4:junit4]   2> 10839 T205 C4 P40156 oascsi.HttpClientUtil.createClient Creating new http client, config:maxConnectionsPerHost=20&maxConnections=10000&connTimeout=30000&socketTimeout=30000&retry=false
[junit4:junit4]   2> 10858 T205 C4 P40156 oasu.PeerSync.sync PeerSync: core=collection1 url=http://127.0.0.1:40156/c_s/st START replicas=[http://127.0.0.1:64893/c_s/st/collection1/] nUpdates=100
[junit4:junit4]   2> 10870 T205 C4 P40156 oasu.PeerSync.sync WARNING no frame of reference to tell of we've missed updates
[junit4:junit4]   2> 10870 T205 C4 P40156 oasc.RecoveryStrategy.doRecovery PeerSync Recovery was not successful - trying replication. core=collection1
[junit4:junit4]   2> 10870 T205 C4 P40156 oasc.RecoveryStrategy.doRecovery Starting Replication Recovery. core=collection1
[junit4:junit4]   2> 10871 T205 C4 P40156 oascsi.HttpClientUtil.createClient Creating new http client, config:maxConnections=128&maxConnectionsPerHost=32&followRedirects=false
[junit4:junit4]   2> 10900 T169 oascc.ZkStateReader.updateClusterState Updating cloud state from ZooKeeper... 
[junit4:junit4]   2> 10901 T169 oasc.Overseer$ClusterStateUpdater.updateState Update state numShards=1 message={
[junit4:junit4]   2> 	  "operation":"state",
[junit4:junit4]   2> 	  "numShards":"1",
[junit4:junit4]   2> 	  "shard":"shard1",
[junit4:junit4]   2> 	  "roles":null,
[junit4:junit4]   2> 	  "state":"recovering",
[junit4:junit4]   2> 	  "core":"collection1",
[junit4:junit4]   2> 	  "collection":"collection1",
[junit4:junit4]   2> 	  "node_name":"127.0.0.1:40156_c_s%2Fst",
[junit4:junit4]   2> 	  "base_url":"http://127.0.0.1:40156/c_s/st"}
[junit4:junit4]   2> 10917 T174 oascc.ZkStateReader$2.process A cluster state change: WatchedEvent state:SyncConnected type:NodeDataChanged path:/clusterstate.json, has occurred - updating... (live nodes size: 3)
[junit4:junit4]   2> 10917 T168 oascc.ZkStateReader$2.process A cluster state change: WatchedEvent state:SyncConnected type:NodeDataChanged path:/clusterstate.json, has occurred - updating... (live nodes size: 3)
[junit4:junit4]   2> 10917 T187 oascc.ZkStateReader$2.process A cluster state change: WatchedEvent state:SyncConnected type:NodeDataChanged path:/clusterstate.json, has occurred - updating... (live nodes size: 3)
[junit4:junit4]   2> 10917 T202 oascc.ZkStateReader$2.process A cluster state change: WatchedEvent state:SyncConnected type:NodeDataChanged path:/clusterstate.json, has occurred - updating... (live nodes size: 3)
[junit4:junit4]   2> 11036 T145 oejs.Server.doStart jetty-8.1.8.v20121106
[junit4:junit4]   2> 11044 T145 oejs.AbstractConnector.doStart Started SocketConnector@127.0.0.1:40188
[junit4:junit4]   2> 11045 T145 oasc.SolrResourceLoader.locateSolrHome JNDI not configured for solr (NoInitialContextEx)
[junit4:junit4]   2> 11046 T145 oasc.SolrResourceLoader.locateSolrHome using system property solr.solr.home: /usr/home/hudson/hudson-slave/workspace/Lucene-Solr-Tests-trunk-Java6/solr/build/solr-core/test/J1/./org.apache.solr.cloud.SyncSliceTest-jetty3-1355845936165
[junit4:junit4]   2> 11046 T145 oasc.SolrResourceLoader.<init> new SolrResourceLoader for deduced Solr Home: '/usr/home/hudson/hudson-slave/workspace/Lucene-Solr-Tests-trunk-Java6/solr/build/solr-core/test/J1/./org.apache.solr.cloud.SyncSliceTest-jetty3-1355845936165/'
[junit4:junit4]   2> 11283 T145 oass.SolrDispatchFilter.init SolrDispatchFilter.init()
[junit4:junit4]   2> 11284 T145 oasc.SolrResourceLoader.locateSolrHome JNDI not configured for solr (NoInitialContextEx)
[junit4:junit4]   2> 11284 T145 oasc.SolrResourceLoader.locateSolrHome using system property solr.solr.home: /usr/home/hudson/hudson-slave/workspace/Lucene-Solr-Tests-trunk-Java6/solr/build/solr-core/test/J1/./org.apache.solr.cloud.SyncSliceTest-jetty3-1355845936165
[junit4:junit4]   2> 11285 T145 oasc.CoreContainer$Initializer.initialize looking for solr.xml: /usr/home/hudson/hudson-slave/workspace/Lucene-Solr-Tests-trunk-Java6/solr/build/solr-core/test/J1/./org.apache.solr.cloud.SyncSliceTest-jetty3-1355845936165/solr.xml
[junit4:junit4]   2> 11286 T145 oasc.CoreContainer.<init> New CoreContainer 167898123
[junit4:junit4]   2> 11287 T145 oasc.CoreContainer.load Loading CoreContainer using Solr Home: '/usr/home/hudson/hudson-slave/workspace/Lucene-Solr-Tests-trunk-Java6/solr/build/solr-core/test/J1/./org.apache.solr.cloud.SyncSliceTest-jetty3-1355845936165/'
[junit4:junit4]   2> 11287 T145 oasc.SolrResourceLoader.<init> new SolrResourceLoader for directory: '/usr/home/hudson/hudson-slave/workspace/Lucene-Solr-Tests-trunk-Java6/solr/build/solr-core/test/J1/./org.apache.solr.cloud.SyncSliceTest-jetty3-1355845936165/'
[junit4:junit4]   2> 11554 T145 oashc.HttpShardHandlerFactory.getParameter Setting socketTimeout to: 30000
[junit4:junit4]   2> 11554 T145 oashc.HttpShardHandlerFactory.getParameter Setting urlScheme to: http://
[junit4:junit4]   2> 11555 T145 oashc.HttpShardHandlerFactory.getParameter Setting connTimeout to: 15000
[junit4:junit4]   2> 11555 T145 oashc.HttpShardHandlerFactory.getParameter Setting maxConnectionsPerHost to: 20
[junit4:junit4]   2> 11556 T145 oashc.HttpShardHandlerFactory.getParameter Setting corePoolSize to: 0
[junit4:junit4]   2> 11556 T145 oashc.HttpShardHandlerFactory.getParameter Setting maximumPoolSize to: 2147483647
[junit4:junit4]   2> 11557 T145 oashc.HttpShardHandlerFactory.getParameter Setting maxThreadIdleTime to: 5
[junit4:junit4]   2> 11557 T145 oashc.HttpShardHandlerFactory.getParameter Setting sizeOfQueue to: -1
[junit4:junit4]   2> 11558 T145 oashc.HttpShardHandlerFactory.getParameter Setting fairnessPolicy to: false
[junit4:junit4]   2> 11558 T145 oascsi.HttpClientUtil.createClient Creating new http client, config:maxConnectionsPerHost=20&maxConnections=10000&socketTimeout=30000&connTimeout=15000&retry=false
[junit4:junit4]   2> 11619 T145 oasc.CoreContainer.load Registering Log Listener
[junit4:junit4]   2> 11777 T145 oasc.CoreContainer.initZooKeeper Zookeeper client=127.0.0.1:45167/solr
[junit4:junit4]   2> 11778 T145 oasc.ZkController.checkChrootPath zkHost includes chroot
[junit4:junit4]   2> 11778 T145 oaz.ZooKeeper.<init> Initiating client connection, connectString=127.0.0.1:45167 sessionTimeout=60000 watcher=org.apache.solr.common.cloud.ConnectionManager@16554210
[junit4:junit4]   2> 11780 T145 oascc.ConnectionManager.waitForConnected Waiting for client to connect to ZooKeeper
[junit4:junit4]   2> 11780 T216 oaz.ClientCnxn$SendThread.logStartConnect Opening socket connection to server localhost/127.0.0.1:45167. Will not attempt to authenticate using SASL (access denied (javax.security.auth.AuthPermission getLoginConfiguration))
[junit4:junit4]   2> 11781 T216 oaz.ClientCnxn$SendThread.primeConnection Socket connection established to localhost/127.0.0.1:45167, initiating session
[junit4:junit4]   2> 11781 T147 oazs.NIOServerCnxnFactory.run Accepted socket connection from /140.211.11.196:40191
[junit4:junit4]   2> 11782 T147 oazs.ZooKeeperServer.processConnectRequest Client attempting to establish new session at /140.211.11.196:40191
[junit4:junit4]   2> 11804 T149 oazs.ZooKeeperServer.finishSessionInit Established session 0x13baeb6f9d60009 with negotiated timeout 20000 for client /140.211.11.196:40191
[junit4:junit4]   2> 11805 T216 oaz.ClientCnxn$SendThread.onConnected Session establishment complete on server localhost/127.0.0.1:45167, sessionid = 0x13baeb6f9d60009, negotiated timeout = 20000
[junit4:junit4]   2> 11805 T217 oascc.ConnectionManager.process Watcher org.apache.solr.common.cloud.ConnectionManager@16554210 name:ZooKeeperConnection Watcher:127.0.0.1:45167 got event WatchedEvent state:SyncConnected type:None path:null path:null type:None
[junit4:junit4]   2> 11806 T145 oascc.ConnectionManager.waitForConnected Client is connected to ZooKeeper
[junit4:junit4]   2> 11808 T150 oazs.PrepRequestProcessor.pRequest2Txn Processed session termination for sessionid: 0x13baeb6f9d60009
[junit4:junit4]   2> 11809 T217 oaz.ClientCnxn$EventThread.run EventThread shut down
[junit4:junit4]   2> 11809 T147 oazs.NIOServerCnxn.closeSock Closed socket connection for client /140.211.11.196:40191 which had sessionid 0x13baeb6f9d60009
[junit4:junit4]   2> 11809 T145 oaz.ZooKeeper.close Session: 0x13baeb6f9d60009 closed
[junit4:junit4]   2> 11810 T145 oascsi.HttpClientUtil.createClient Creating new http client, config:maxConnections=500&maxConnectionsPerHost=16&socketTimeout=15000&connTimeout=30000
[junit4:junit4]   2> 11829 T145 oaz.ZooKeeper.<init> Initiating client connection, connectString=127.0.0.1:45167/solr sessionTimeout=30000 watcher=org.apache.solr.common.cloud.ConnectionManager@2bd8e0f3
[junit4:junit4]   2> 11830 T145 oascc.ConnectionManager.waitForConnected Waiting for client to connect to ZooKeeper
[junit4:junit4]   2> 11831 T218 oaz.ClientCnxn$SendThread.logStartConnect Opening socket connection to server localhost/127.0.0.1:45167. Will not attempt to authenticate using SASL (access denied (javax.security.auth.AuthPermission getLoginConfiguration))
[junit4:junit4]   2> 11832 T218 oaz.ClientCnxn$SendThread.primeConnection Socket connection established to localhost/127.0.0.1:45167, initiating session
[junit4:junit4]   2> 11832 T147 oazs.NIOServerCnxnFactory.run Accepted socket connection from /140.211.11.196:40192
[junit4:junit4]   2> 11832 T147 oazs.ZooKeeperServer.processConnectRequest Client attempting to establish new session at /140.211.11.196:40192
[junit4:junit4]   2> 11834 T149 oazs.ZooKeeperServer.finishSessionInit Established session 0x13baeb6f9d6000a with negotiated timeout 20000 for client /140.211.11.196:40192
[junit4:junit4]   2> 11834 T218 oaz.ClientCnxn$SendThread.onConnected Session establishment complete on server localhost/127.0.0.1:45167, sessionid = 0x13baeb6f9d6000a, negotiated timeout = 20000
[junit4:junit4]   2> 11835 T219 oascc.ConnectionManager.process Watcher org.apache.solr.common.cloud.ConnectionManager@2bd8e0f3 name:ZooKeeperConnection Watcher:127.0.0.1:45167/solr got event WatchedEvent state:SyncConnected type:None path:null path:null type:None
[junit4:junit4]   2> 11835 T145 oascc.ConnectionManager.waitForConnected Client is connected to ZooKeeper
[junit4:junit4]   2> 11837 T150 oazs.PrepRequestProcessor.pRequest Got user-level KeeperException when processing sessionid:0x13baeb6f9d6000a type:create cxid:0x1 zxid:0x84 txntype:-1 reqpath:n/a Error Path:/solr/overseer Error:KeeperErrorCode = NodeExists for /solr/overseer
[junit4:junit4]   2> 11839 T150 oazs.PrepRequestProcessor.pRequest Got user-level KeeperException when processing sessionid:0x13baeb6f9d6000a type:create cxid:0x2 zxid:0x85 txntype:-1 reqpath:n/a Error Path:/solr/overseer Error:KeeperErrorCode = NodeExists for /solr/overseer
[junit4:junit4]   2> 11841 T145 oasc.ZkController.createEphemeralLiveNode Register node as live in ZooKeeper:/live_nodes/127.0.0.1:40188_c_s%2Fst
[junit4:junit4]   2> 11842 T150 oazs.PrepRequestProcessor.pRequest Got user-level KeeperException when processing sessionid:0x13baeb6f9d6000a type:delete cxid:0x4 zxid:0x86 txntype:-1 reqpath:n/a Error Path:/solr/live_nodes/127.0.0.1:40188_c_s%2Fst Error:KeeperErrorCode = NoNode for /solr/live_nodes/127.0.0.1:40188_c_s%2Fst
[junit4:junit4]   2> 11849 T145 oascc.SolrZkClient.makePath makePath: /live_nodes/127.0.0.1:40188_c_s%2Fst
[junit4:junit4]   2> 11852 T174 oascc.ZkStateReader$2.process A cluster state change: WatchedEvent state:SyncConnected type:NodeChildrenChanged path:/live_nodes, has occurred - updating... (live nodes size: 3)
[junit4:junit4]   2> 11852 T187 oascc.ZkStateReader$2.process A cluster state change: WatchedEvent state:SyncConnected type:NodeChildrenChanged path:/live_nodes, has occurred - updating... (live nodes size: 3)
[junit4:junit4]   2> 11853 T168 oascc.ZkStateReader$3.process Updating live nodes... (4)
[junit4:junit4]   2> 11853 T202 oascc.ZkStateReader$3.process Updating live nodes... (4)
[junit4:junit4]   2> 11854 T168 oascc.ZkStateReader$2.process A cluster state change: WatchedEvent state:SyncConnected type:NodeChildrenChanged path:/live_nodes, has occurred - updating... (live nodes size: 4)
[junit4:junit4]   2> 11854 T202 oascc.ZkStateReader$2.process A cluster state change: WatchedEvent state:SyncConnected type:NodeChildrenChanged path:/live_nodes, has occurred - updating... (live nodes size: 4)
[junit4:junit4]   2> 11856 T174 oascc.ZkStateReader$3.process Updating live nodes... (4)
[junit4:junit4]   2> 11856 T187 oascc.ZkStateReader$3.process Updating live nodes... (4)
[junit4:junit4]   2> 11859 T145 oascc.ZkStateReader.createClusterStateWatchersAndUpdate Updating cluster state from ZooKeeper... 
[junit4:junit4]   2> 11890 T220 oasc.CoreContainer.create Creating SolrCore 'collection1' using instanceDir: /usr/home/hudson/hudson-slave/workspace/Lucene-Solr-Tests-trunk-Java6/solr/build/solr-core/test/J1/./org.apache.solr.cloud.SyncSliceTest-jetty3-1355845936165/collection1
[junit4:junit4]   2> 11890 T220 oasc.ZkController.createCollectionZkNode Check for collection zkNode:collection1
[junit4:junit4]   2> 11892 T220 oasc.ZkController.createCollectionZkNode Collection zkNode exists
[junit4:junit4]   2> 11892 T220 oasc.ZkController.readConfigName Load collection config from:/collections/collection1
[junit4:junit4]   2> 11894 T220 oasc.SolrResourceLoader.<init> new SolrResourceLoader for directory: '/usr/home/hudson/hudson-slave/workspace/Lucene-Solr-Tests-trunk-Java6/solr/build/solr-core/test/J1/./org.apache.solr.cloud.SyncSliceTest-jetty3-1355845936165/collection1/'
[junit4:junit4]   2> 11895 T220 oasc.SolrResourceLoader.replaceClassLoader Adding 'file:/usr/home/hudson/hudson-slave/workspace/Lucene-Solr-Tests-trunk-Java6/solr/build/solr-core/test/J1/org.apache.solr.cloud.SyncSliceTest-jetty3-1355845936165/collection1/lib/README' to classloader
[junit4:junit4]   2> 11896 T220 oasc.SolrResourceLoader.replaceClassLoader Adding 'file:/usr/home/hudson/hudson-slave/workspace/Lucene-Solr-Tests-trunk-Java6/solr/build/solr-core/test/J1/org.apache.solr.cloud.SyncSliceTest-jetty3-1355845936165/collection1/lib/classes/' to classloader
[junit4:junit4]   2> ASYNC  NEW_CORE C5 name=collection1 org.apache.solr.core.SolrCore@725a0faf url=http://127.0.0.1:64893/c_s/st/collection1 node=127.0.0.1:64893_c_s%2Fst C5_STATE=coll:collection1 core:collection1 props:{shard=shard1, roles=null, state=active, core=collection1, collection=collection1, node_name=127.0.0.1:64893_c_s%2Fst, base_url=http://127.0.0.1:64893/c_s/st, leader=true}
[junit4:junit4]   2> 12290 T177 C5 P64893 REQ /get {distrib=false&qt=/get&wt=javabin&version=2&getVersions=100} status=0 QTime=11 
[junit4:junit4]   2> 12335 T220 oasc.SolrConfig.<init> Using Lucene MatchVersion: LUCENE_50
[junit4:junit4]   2> 12516 T220 oasc.SolrConfig.<init> Loaded SolrConfig: solrconfig.xml
[junit4:junit4]   2> 12617 T220 oass.IndexSchema.readSchema Reading Solr Schema
[junit4:junit4]   2> 12634 T220 oass.IndexSchema.readSchema Schema name=test
[junit4:junit4]   2> 13330 T220 oass.OpenExchangeRatesOrgProvider.init Initialized with rates=open-exchange-rates.json, refreshInterval=1440.
[junit4:junit4]   2> 13345 T220 oass.IndexSchema.readSchema default search field in schema is text
[junit4:junit4]   2> 13350 T220 oass.IndexSchema.readSchema unique key field: id
[junit4:junit4]   2> 13382 T220 oass.FileExchangeRateProvider.reload Reloading exchange rates from file currency.xml
[junit4:junit4]   2> 13388 T220 oass.FileExchangeRateProvider.reload Reloading exchange rates from file currency.xml
[junit4:junit4]   2> 13394 T220 oass.OpenExchangeRatesOrgProvider.reload Reloading exchange rates from open-exchange-rates.json
[junit4:junit4]   2> 13397 T220 oass.OpenExchangeRatesOrgProvider.reload Reloading exchange rates from open-exchange-rates.json
[junit4:junit4]   2> 13400 T220 oasc.SolrCore.<init> [collection1] Opening new SolrCore at /usr/home/hudson/hudson-slave/workspace/Lucene-Solr-Tests-trunk-Java6/solr/build/solr-core/test/J1/./org.apache.solr.cloud.SyncSliceTest-jetty3-1355845936165/collection1/, dataDir=./org.apache.solr.cloud.SyncSliceTest-1355845925328/jetty3/
[junit4:junit4]   2> 13400 T220 oasc.JmxMonitoredMap.<init> JMX monitoring is enabled. Adding Solr mbeans to JMX Server: com.sun.jmx.mbeanserver.JmxMBeanServer@6d46b6db
[junit4:junit4]   2> 13401 T220 oasc.SolrCore.initDirectoryFactory solr.NRTCachingDirectoryFactory
[junit4:junit4]   2> 13402 T220 oasc.CachingDirectoryFactory.get return new directory for /usr/home/hudson/hudson-slave/workspace/Lucene-Solr-Tests-trunk-Java6/solr/build/solr-core/test/J1/./org.apache.solr.cloud.SyncSliceTest-1355845925328/jetty3 forceNew:false
[junit4:junit4]   2> 13403 T220 oasc.CachingDirectoryFactory.close Releasing directory:/usr/home/hudson/hudson-slave/workspace/Lucene-Solr-Tests-trunk-Java6/solr/build/solr-core/test/J1/./org.apache.solr.cloud.SyncSliceTest-1355845925328/jetty3
[junit4:junit4]   2> 13403 T220 oasc.SolrCore.getNewIndexDir New index directory detected: old=null new=./org.apache.solr.cloud.SyncSliceTest-1355845925328/jetty3/index/
[junit4:junit4]   2> 13404 T220 oasc.SolrCore.initIndex WARNING [collection1] Solr index directory './org.apache.solr.cloud.SyncSliceTest-1355845925328/jetty3/index' doesn't exist. Creating new index...
[junit4:junit4]   2> 13404 T220 oasc.CachingDirectoryFactory.get return new directory for /usr/home/hudson/hudson-slave/workspace/Lucene-Solr-Tests-trunk-Java6/solr/build/solr-core/test/J1/./org.apache.solr.cloud.SyncSliceTest-1355845925328/jetty3/index forceNew:false
[junit4:junit4]   2> 13417 T220 oasc.SolrDeletionPolicy.onCommit SolrDeletionPolicy.onCommit: commits:num=1
[junit4:junit4]   2> 		commit{dir=RateLimitedDirectoryWrapper(NRTCachingDirectory(org.apache.lucene.store.NIOFSDirectory@/usr/home/hudson/hudson-slave/workspace/Lucene-Solr-Tests-trunk-Java6/solr/build/solr-core/test/J1/org.apache.solr.cloud.SyncSliceTest-1355845925328/jetty3/index lockFactory=org.apache.lucene.store.NativeFSLockFactory@71d9a2ab; maxCacheMB=48.0 maxMergeSizeMB=4.0)),segFN=segments_1,generation=1,filenames=[segments_1]
[junit4:junit4]   2> 13417 T220 oasc.SolrDeletionPolicy.updateCommits newest commit = 1[segments_1]
[junit4:junit4]   2> 13418 T220 oasc.CachingDirectoryFactory.close Releasing directory:/usr/home/hudson/hudson-slave/workspace/Lucene-Solr-Tests-trunk-Java6/solr/build/solr-core/test/J1/./org.apache.solr.cloud.SyncSliceTest-1355845925328/jetty3/index
[junit4:junit4]   2> 13418 T220 oasc.SolrCore.initWriters created xml: solr.XMLResponseWriter
[junit4:junit4]   2> 13421 T220 oasup.UpdateRequestProcessorChain.init inserting DistributedUpdateProcessorFactory into updateRequestProcessorChain "dedupe"
[junit4:junit4]   2> 13421 T220 oasup.UpdateRequestProcessorChain.init inserting DistributedUpdateProcessorFactory into updateRequestProcessorChain "dedupe-allfields"
[junit4:junit4]   2> 13422 T220 oasup.UpdateRequestProcessorChain.init inserting DistributedUpdateProcessorFactory into updateRequestProcessorChain "stored_sig"
[junit4:junit4]   2> 13422 T220 oasup.UpdateRequestProcessorChain.init inserting DistributedUpdateProcessorFactory into updateRequestProcessorChain "uniq-fields"
[junit4:junit4]   2> 13423 T220 oasup.UpdateRequestProcessorChain.init inserting DistributedUpdateProcessorFactory into updateRequestProcessorChain "distrib-dup-test-chain-implicit"
[junit4:junit4]   2> 13423 T220 oasc.RequestHandlers.initHandlersFromConfig adding lazy requestHandler: solr.ReplicationHandler
[junit4:junit4]   2> 13424 T220 oasc.RequestHandlers.initHandlersFromConfig created /replication: solr.ReplicationHandler
[junit4:junit4]   2> 13425 T220 oasc.RequestHandlers.initHandlersFromConfig created standard: solr.StandardRequestHandler
[junit4:junit4]   2> 13427 T220 oasc.RequestHandlers.initHandlersFromConfig created /get: solr.RealTimeGetHandler
[junit4:junit4]   2> 13428 T220 oasc.RequestHandlers.initHandlersFromConfig created dismax: solr.SearchHandler
[junit4:junit4]   2> 13430 T220 oasc.RequestHandlers.initHandlersFromConfig created mock: org.apache.solr.core.MockQuerySenderListenerReqHandler
[junit4:junit4]   2> 13430 T220 oasc.RequestHandlers.initHandlersFromConfig created /admin/: org.apache.solr.handler.admin.AdminHandlers
[junit4:junit4]   2> 13432 T220 oasc.RequestHandlers.initHandlersFromConfig created defaults: solr.StandardRequestHandler
[junit4:junit4]   2> 13432 T220 oasc.RequestHandlers.initHandlersFromConfig adding lazy requestHandler: solr.StandardRequestHandler
[junit4:junit4]   2> 13432 T220 oasc.RequestHandlers.initHandlersFromConfig created lazy: solr.StandardRequestHandler
[junit4:junit4]   2> 13434 T220 oasc.RequestHandlers.initHandlersFromConfig created /update: solr.UpdateRequestHandler
[junit4:junit4]   2> 13436 T220 oasc.RequestHandlers.initHandlersFromConfig created /terms: org.apache.solr.handler.component.SearchHandler
[junit4:junit4]   2> 13437 T220 oasc.RequestHandlers.initHandlersFromConfig created spellCheckCompRH: org.apache.solr.handler.component.SearchHandler
[junit4:junit4]   2> 13438 T220 oasc.RequestHandlers.initHandlersFromConfig created spellCheckCompRH_Direct: org.apache.solr.handler.component.SearchHandler
[junit4:junit4]   2> 13440 T220 oasc.RequestHandlers.initHandlersFromConfig created spellCheckWithWordbreak: org.apache.solr.handler.component.SearchHandler
[junit4:junit4]   2> 13441 T220 oasc.RequestHandlers.initHandlersFromConfig created spellCheckWithWordbreak_Direct: org.apache.solr.handler.component.SearchHandler
[junit4:junit4]   2> 13442 T220 oasc.RequestHandlers.initHandlersFromConfig created spellCheckCompRH1: org.apache.solr.handler.component.SearchHandler
[junit4:junit4]   2> 13444 T220 oasc.RequestHandlers.initHandlersFromConfig created mltrh: org.apache.solr.handler.component.SearchHandler
[junit4:junit4]   2> 13445 T220 oasc.RequestHandlers.initHandlersFromConfig created tvrh: org.apache.solr.handler.component.SearchHandler
[junit4:junit4]   2> 13446 T220 oasc.RequestHandlers.initHandlersFromConfig created /mlt: solr.MoreLikeThisHandler
[junit4:junit4]   2> 13448 T220 oasc.RequestHandlers.initHandlersFromConfig created /debug/dump: solr.DumpRequestHandler
[junit4:junit4]   2> 13455 T220 oashl.XMLLoader.init xsltCacheLifetimeSeconds=60
[junit4:junit4]   2> 13460 T220 oasc.SolrCore.initDeprecatedSupport WARNING solrconfig.xml uses deprecated <admin/gettableFiles>, Please update your config to use the ShowFileRequestHandler.
[junit4:junit4]   2> 13462 T220 oasc.SolrCore.initDeprecatedSupport WARNING adding ShowFileRequestHandler with hidden files: [SCHEMA.XML, OLD_SYNONYMS.TXT, STOPWORDS.TXT, PROTWORDS.TXT, OPEN-EXCHANGE-RATES.JSON, SYNONYMS.TXT, CURRENCY.XML, MAPPING-ISOLATIN1ACCENT.TXT]
[junit4:junit4]   2> 13465 T220 oasc.CachingDirectoryFactory.close Releasing directory:/usr/home/hudson/hudson-slave/workspace/Lucene-Solr-Tests-trunk-Java6/solr/build/solr-core/test/J1/./org.apache.solr.cloud.SyncSliceTest-1355845925328/jetty3
[junit4:junit4]   2> 13467 T220 oass.SolrIndexSearcher.<init> Opening Searcher@51fe8884 main
[junit4:junit4]   2> 13468 T220 oasu.CommitTracker.<init> Hard AutoCommit: disabled
[junit4:junit4]   2> 13468 T220 oasu.CommitTracker.<init> Soft AutoCommit: disabled
[junit4:junit4]   2> 13469 T220 oashc.SpellCheckComponent.inform Initializing spell checkers
[junit4:junit4]   2> 13476 T220 oass.DirectSolrSpellChecker.init init: {name=direct,classname=DirectSolrSpellChecker,field=lowerfilt,minQueryLength=3}
[junit4:junit4]   2> 13540 T221 oasc.SolrCore.registerSearcher [collection1] Registered new searcher Searcher@51fe8884 main{StandardDirectoryReader(segments_1:1)}
[junit4:junit4]   2> 13547 T220 oasc.ZkController.publish publishing core=collection1 state=down
[junit4:junit4]   2> 13547 T220 oasc.ZkController.publish numShards not found on descriptor - reading it from system property
[junit4:junit4]   2> 13941 T169 oascc.ZkStateReader.updateClusterState Updating cloud state from ZooKeeper... 
[junit4:junit4]   2> 13942 T169 oasc.Overseer$ClusterStateUpdater.updateState Update state numShards=1 message={
[junit4:junit4]   2> 	  "operation":"state",
[junit4:junit4]   2> 	  "numShards":"1",
[junit4:junit4]   2> 	  "shard":null,
[junit4:junit4]   2> 	  "roles":null,
[junit4:junit4]   2> 	  "state":"down",
[junit4:junit4]   2> 	  "core":"collection1",
[junit4:junit4]   2> 	  "collection":"collection1",
[junit4:junit4]   2> 	  "node_name":"127.0.0.1:40188_c_s%2Fst",
[junit4:junit4]   2> 	  "base_url":"http://127.0.0.1:40188/c_s/st"}
[junit4:junit4]   2> 13943 T169 oasc.Overseer$ClusterStateUpdater.updateState Collection already exists with numShards=1
[junit4:junit4]   2> 13943 T169 oasc.Overseer$ClusterStateUpdater.updateState Assigning new node to shard shard=shard1
[junit4:junit4]   2> 14039 T219 oascc.ZkStateReader$2.process A cluster state change: WatchedEvent state:SyncConnected type:NodeDataChanged path:/clusterstate.json, has occurred - updating... (live nodes size: 4)
[junit4:junit4]   2> 14039 T168 oascc.ZkStateReader$2.process A cluster state change: WatchedEvent state:SyncConnected type:NodeDataChanged path:/clusterstate.json, has occurred - updating... (live nodes size: 4)
[junit4:junit4]   2> 14039 T202 oascc.ZkStateReader$2.process A cluster state change: WatchedEvent state:SyncConnected type:NodeDataChanged path:/clusterstate.json, has occurred - updating... (live nodes size: 4)
[junit4:junit4]   2> 14039 T187 oascc.ZkStateReader$2.process A cluster state change: WatchedEvent state:SyncConnected type:NodeDataChanged path:/clusterstate.json, has occurred - updating... (live nodes size: 4)
[junit4:junit4]   2> 14039 T174 oascc.ZkStateReader$2.process A cluster state change: WatchedEvent state:SyncConnected type:NodeDataChanged path:/clusterstate.json, has occurred - updating... (live nodes size: 4)
[junit4:junit4]   2> 14051 T220 oasc.CoreContainer.registerCore registering core: collection1
[junit4:junit4]   2> 14051 T220 oasc.ZkController.register Register replica - core:collection1 address:http://127.0.0.1:40188/c_s/st collection:collection1 shard:shard1
[junit4:junit4]   2> 14056 T220 oasc.ZkController.register We are http://127.0.0.1:40188/c_s/st/collection1/ and leader is http://127.0.0.1:64893/c_s/st/collection1/
[junit4:junit4]   2> 14056 T220 oasc.ZkController.register No LogReplay needed for core=collection1 baseURL=http://127.0.0.1:40188/c_s/st
[junit4:junit4]   2> 14057 T220 oasc.ZkController.checkRecovery Core needs to recover:collection1
[junit4:junit4]   2> 14057 T220 oasu.DefaultSolrCoreState.doRecovery Running recovery - first canceling any ongoing recovery
[junit4:junit4]   2> ASYNC  NEW_CORE C6 name=collection1 org.apache.solr.core.SolrCore@58d67b44 url=http://127.0.0.1:40188/c_s/st/collection1 node=127.0.0.1:40188_c_s%2Fst C6_STATE=coll:collection1 core:collection1 props:{shard=null, roles=null, state=down, core=collection1, collection=collection1, node_name=127.0.0.1:40188_c_s%2Fst, base_url=http://127.0.0.1:40188/c_s/st}
[junit4:junit4]   2> 14057 T222 C6 P40188 oasc.RecoveryStrategy.run Starting recovery process.  core=collection1 recoveringAfterStartup=true
[junit4:junit4]   2> 14058 T222 C6 P40188 oasc.RecoveryStrategy.doRecovery ###### startupVersions=[]
[junit4:junit4]   2> 14059 T220 oascc.ZkStateReader.updateClusterState Updating cloud state from ZooKeeper... 
[junit4:junit4]   2> 14059 T222 C6 P40188 oasc.ZkController.publish publishing core=collection1 state=recovering
[junit4:junit4]   2> 14060 T222 C6 P40188 oasc.ZkController.publish numShards not found on descriptor - reading it from system property
[junit4:junit4]   2> 14061 T145 oass.SolrDispatchFilter.init user.dir=/usr/home/hudson/hudson-slave/workspace/Lucene-Solr-Tests-trunk-Java6/solr/build/solr-core/test/J1
[junit4:junit4]   2> 14062 T145 oass.SolrDispatchFilter.init SolrDispatchFilter.init() done
[junit4:junit4]   2> 14063 T145 oascsi.HttpClientUtil.createClient Creating new http client, config:maxConnections=128&maxConnectionsPerHost=32&followRedirects=false
[junit4:junit4]   2> 14071 T222 C6 P40188 oasc.RecoveryStrategy.doRecovery Attempting to PeerSync from http://127.0.0.1:64893/c_s/st/collection1/ core=collection1 - recoveringAfterStartup=true
[junit4:junit4]   2> 14072 T222 C6 P40188 oasu.PeerSync.sync PeerSync: core=collection1 url=http://127.0.0.1:40188/c_s/st START replicas=[http://127.0.0.1:64893/c_s/st/collection1/] nUpdates=100
[junit4:junit4]   2> 14073 T222 C6 P40188 oasu.PeerSync.sync WARNING no frame of reference to tell of we've missed updates
[junit4:junit4]   2> 14074 T222 C6 P40188 oasc.RecoveryStrategy.doRecovery PeerSync Recovery was not successful - trying replication. core=collection1
[junit4:junit4]   2> 14074 T222 C6 P40188 oasc.RecoveryStrategy.doRecovery Starting Replication Recovery. core=collection1
[junit4:junit4]   2> 14074 T222 C6 P40188 oascsi.HttpClientUtil.createClient Creating new http client, config:maxConnections=128&maxConnectionsPerHost=32&followRedirects=false
[junit4:junit4]   2> 14078 T177 C5 P64893 REQ /get {distrib=false&qt=/get&wt=javabin&version=2&getVersions=100} status=0 QTime=1 
[junit4:junit4]   2> 14235 T145 oejs.Server.doStart jetty-8.1.8.v20121106
[junit4:junit4]   2> 14238 T145 oejs.AbstractConnector.doStart Started SocketConnector@127.0.0.1:40215
[junit4:junit4]   2> 14239 T145 oasc.SolrResourceLoader.locateSolrHome JNDI not configured for solr (NoInitialContextEx)
[junit4:junit4]   2> 14240 T145 oasc.SolrResourceLoader.locateSolrHome using system property solr.solr.home: /usr/home/hudson/hudson-slave/workspace/Lucene-Solr-Tests-trunk-Java6/solr/build/solr-core/test/J1/./org.apache.solr.cloud.SyncSliceTest-jetty4-1355845939400
[junit4:junit4]   2> 14241 T145 oasc.SolrResourceLoader.<init> new SolrResourceLoader for deduced Solr Home: '/usr/home/hudson/hudson-slave/workspace/Lucene-Solr-Tests-trunk-Java6/solr/build/solr-core/test/J1/./org.apache.solr.cloud.SyncSliceTest-jetty4-1355845939400/'
[junit4:junit4]   2> 14276 T145 oass.SolrDispatchFilter.init SolrDispatchFilter.init()
[junit4:junit4]   2> 14276 T145 oasc.SolrResourceLoader.locateSolrHome JNDI not configured for solr (NoInitialContextEx)
[junit4:junit4]   2> 14277 T145 oasc.SolrResourceLoader.locateSolrHome using system property solr.solr.home: /usr/home/hudson/hudson-slave/workspace/Lucene-Solr-Tests-trunk-Java6/solr/build/solr-core/test/J1/./org.apache.solr.cloud.SyncSliceTest-jetty4-1355845939400
[junit4:junit4]   2> 14278 T145 oasc.CoreContainer$Initializer.initialize looking for solr.xml: /usr/home/hudson/hudson-slave/workspace/Lucene-Solr-Tests-trunk-Java6/solr/build/solr-core/test/J1/./org.apache.solr.cloud.SyncSliceTest-jetty4-1355845939400/solr.xml
[junit4:junit4]   2> 14278 T145 oasc.CoreContainer.<init> New CoreContainer 270037926
[junit4:junit4]   2> 14279 T145 oasc.CoreContainer.load Loading CoreContainer using Solr Home: '/usr/home/hudson/hudson-slave/workspace/Lucene-Solr-Tests-trunk-Java6/solr/build/solr-core/test/J1/./org.apache.solr.cloud.SyncSliceTest-jetty4-1355845939400/'
[junit4:junit4]   2> 14280 T145 oasc.SolrResourceLoader.<init> new SolrResourceLoader for directory: '/usr/home/hudson/hudson-slave/workspace/Lucene-Solr-Tests-trunk-Java6/solr/build/solr-core/test/J1/./org.apache.solr.cloud.SyncSliceTest-jetty4-1355845939400/'
[junit4:junit4]   2> 14303 T145 oashc.HttpShardHandlerFactory.getParameter Setting socketTimeout to: 30000
[junit4:junit4]   2> 14303 T145 oashc.HttpShardHandlerFactory.getParameter Setting urlScheme to: http://
[junit4:junit4]   2> 14304 T145 oashc.HttpShardHandlerFactory.getParameter Setting connTimeout to: 15000
[junit4:junit4]   2> 14304 T145 oashc.HttpShardHandlerFactory.getParameter Setting maxConnectionsPerHost to: 20
[junit4:junit4]   2> 14305 T145 oashc.HttpShardHandlerFactory.getParameter Setting corePoolSize to: 0
[junit4:junit4]   2> 14305 T145 oashc.HttpShardHandlerFactory.getParameter Setting maximumPoolSize to: 2147483647
[junit4:junit4]   2> 14306 T145 oashc.HttpShardHandlerFactory.getParameter Setting maxThreadIdleTime to: 5
[junit4:junit4]   2> 14306 T145 oashc.HttpShardHandlerFactory.getParameter Setting sizeOfQueue to: -1
[junit4:junit4]   2> 14307 T145 oashc.HttpShardHandlerFactory.getParameter Setting fairnessPolicy to: false
[junit4:junit4]   2> 14308 T145 oascsi.HttpClientUtil.createClient Creating new http client, config:maxConnectionsPerHost=20&maxConnections=10000&socketTimeout=30000&connTimeout=15000&retry=false
[junit4:junit4]   2> 14328 T145 oasc.CoreContainer.load Registering Log Listener
[junit4:junit4]   2> 14347 T145 oasc.CoreContainer.initZooKeeper Zookeeper client=127.0.0.1:45167/solr
[junit4:junit4]   2> 14348 T145 oasc.ZkController.checkChrootPath zkHost includes chroot
[junit4:junit4]   2> 14349 T145 oaz.ZooKeeper.<init> Initiating client connection, connectString=127.0.0.1:45167 sessionTimeout=60000 watcher=org.apache.solr.common.cloud.ConnectionManager@401a7a05
[junit4:junit4]   2> 14350 T145 oascc.ConnectionManager.waitForConnected Waiting for client to connect to ZooKeeper
[junit4:junit4]   2> 14350 T233 oaz.ClientCnxn$SendThread.logStartConnect Opening socket connection to server localhost/127.0.0.1:45167. Will not attempt to authenticate using SASL (access denied (javax.security.auth.AuthPermission getLoginConfiguration))
[junit4:junit4]   2> 14352 T233 oaz.ClientCnxn$SendThread.primeConnection Socket connection established to localhost/127.0.0.1:45167, initiating session
[junit4:junit4]   2> 14352 T147 oazs.NIOServerCnxnFactory.run Accepted socket connection from /140.211.11.196:40216
[junit4:junit4]   2> 14353 T147 oazs.ZooKeeperServer.processConnectRequest Client attempting to establish new session at /140.211.11.196:40216
[junit4:junit4]   2> 14358 T149 oazs.ZooKeeperServer.finishSessionInit Established session 0x13baeb6f9d6000b with negotiated timeout 20000 for client /140.211.11.196:40216
[junit4:junit4]   2> 14358 T233 oaz.ClientCnxn$SendThread.onConnected Session establishment complete on server localhost/127.0.0.1:45167, sessionid = 0x13baeb6f9d6000b, negotiated timeout = 20000
[junit4:junit4]   2> 14359 T234 oascc.ConnectionManager.process Watcher org.apache.solr.common.cloud.ConnectionManager@401a7a05 name:ZooKeeperConnection Watcher:127.0.0.1:45167 got event WatchedEvent state:SyncConnected type:None path:null path:null type:None
[junit4:junit4]   2> 14359 T145 oascc.ConnectionManager.waitForConnected Client is connected to ZooKeeper
[junit4:junit4]   2> 14361 T150 oazs.PrepRequestProcessor.pRequest2Txn Processed session termination for sessionid: 0x13baeb6f9d6000b
[junit4:junit4]   2> 14368 T234 oaz.ClientCnxn$EventThread.run EventThread shut down
[junit4:junit4]   2> 14368 T145 oaz.ZooKeeper.close Session: 0x13baeb6f9d6000b closed
[junit4:junit4]   2> 14368 T147 oazs.NIOServerCnxn.closeSock Closed socket connection for client /140.211.11.196:40216 which had sessionid 0x13baeb6f9d6000b
[junit4:junit4]   2> 14369 T145 oascsi.HttpClientUtil.createClient Creating new http client, config:maxConnections=500&maxConnectionsPerHost=16&socketTimeout=15000&connTimeout=30000
[junit4:junit4]   2> 14379 T145 oaz.ZooKeeper.<init> Initiating client connection, connectString=127.0.0.1:45167/solr sessionTimeout=30000 watcher=org.apache.solr.common.cloud.ConnectionManager@6249e4f
[junit4:junit4]   2> 14380 T145 oascc.ConnectionManager.waitForConnected Waiting for client to connect to ZooKeeper
[junit4:junit4]   2> 14381 T235 oaz.ClientCnxn$SendThread.logStartConnect Opening socket connection to server localhost/127.0.0.1:45167. Will not attempt to authenticate using SASL (access denied (javax.security.auth.AuthPermission getLoginConfiguration))
[junit4:junit4]   2> 14382 T235 oaz.ClientCnxn$SendThread.primeConnection Socket connection established to localhost/127.0.0.1:45167, initiating session
[junit4:junit4]   2> 14382 T147 oazs.NIOServerCnxnFactory.run Accepted socket connection from /140.211.11.196:40217
[junit4:junit4]   2> 14383 T147 oazs.ZooKeeperServer.processConnectRequest Client attempting to establish new session at /140.211.11.196:40217
[junit4:junit4]   2> 14384 T149 oazs.ZooKeeperServer.finishSessionInit Established session 0x13baeb6f9d6000c with negotiated timeout 20000 for client /140.211.11.196:40217
[junit4:junit4]   2> 14384 T235 oaz.ClientCnxn$SendThread.onConnected Session establishment complete on server localhost/127.0.0.1:45167, sessionid = 0x13baeb6f9d6000c, negotiated timeout = 20000
[junit4:junit4]   2> 14385 T236 oascc.ConnectionManager.process Watcher org.apache.solr.common.cloud.ConnectionManager@6249e4f name:ZooKeeperConnection Watcher:127.0.0.1:45167/solr got event WatchedEvent state:SyncConnected type:None path:null path:null type:None
[junit4:junit4]   2> 14385 T145 oascc.ConnectionManager.waitForConnected Client is connected to ZooKeeper
[junit4:junit4]   2> 14386 T150 oazs.PrepRequestProcessor.pRequest Got user-level KeeperException when processing sessionid:0x13baeb6f9d6000c type:create cxid:0x1 zxid:0x93 txntype:-1 reqpath:n/a Error Path:/solr/overseer Error:KeeperErrorCode = NodeExists for /solr/overseer
[junit4:junit4]   2> 14388 T150 oazs.PrepRequestProcessor.pRequest Got user-level KeeperException when processing sessionid:0x13baeb6f9d6000c type:create cxid:0x2 zxid:0x94 txntype:-1 reqpath:n/a Error Path:/solr/overseer Error:KeeperErrorCode = NodeExists for /solr/overseer
[junit4:junit4]   2> 14395 T145 oasc.ZkController.createEphemeralLiveNode Register node as live in ZooKeeper:/live_nodes/127.0.0.1:40215_c_s%2Fst
[junit4:junit4]   2> 14396 T150 oazs.PrepRequestProcessor.pRequest Got user-level KeeperException when processing sessionid:0x13baeb6f9d6000c type:delete cxid:0x4 zxid:0x95 txntype:-1 reqpath:n/a Error Path:/solr/live_nodes/127.0.0.1:40215_c_s%2Fst Error:KeeperErrorCode = NoNode for /solr/live_nodes/127.0.0.1:40215_c_s%2Fst
[junit4:junit4]   2> 14397 T145 oascc.SolrZkClient.makePath makePath: /live_nodes/127.0.0.1:40215_c_s%2Fst
[junit4:junit4]   2> 14401 T174 oascc.ZkStateReader$2.process A cluster state change: WatchedEvent state:SyncConnected type:NodeChildrenChanged path:/live_nodes, has occurred - updating... (live nodes size: 4)
[junit4:junit4]   2> 14401 T187 oascc.ZkStateReader$2.process A cluster state change: WatchedEvent state:SyncConnected type:NodeChildrenChanged path:/live_nodes, has occurred - updating... (live nodes size: 4)
[junit4:junit4]   2> 14401 T219 oascc.ZkStateReader$2.process A cluster state change: WatchedEvent state:SyncConnected type:NodeChildrenChanged path:/live_nodes, has occurred - updating... (live nodes size: 4)
[junit4:junit4]   2> 14402 T202 oascc.ZkStateReader$3.process Updating live nodes... (5)
[junit4:junit4]   2> 14403 T202 oascc.ZkStateReader$2.process A cluster state change: WatchedEvent state:SyncConnected type:NodeChildrenChanged path:/live_nodes, has occurred - updating... (live nodes size: 5)
[junit4:junit4]   2> 14403 T168 oascc.ZkStateReader$3.process Updating live nodes... (5)
[junit4:junit4]   2> 14403 T168 oascc.ZkStateReader$2.process A cluster state change: WatchedEvent state:SyncConnected type:NodeChildrenChanged path:/live_nodes, has occurred - updating... (live nodes size: 5)
[junit4:junit4]   2> 14405 T174 oascc.ZkStateReader$3.process Updating live nodes... (5)
[junit4:junit4]   2> 14406 T219 oascc.ZkStateReader$3.process Updating live nodes... (5)
[junit4:junit4]   2> 14405 T187 oascc.ZkStateReader$3.process Updating live nodes... (5)
[junit4:junit4]   2> 14409 T145 oascc.ZkStateReader.createClusterStateWatchersAndUpdate Updating cluster state from ZooKeeper... 
[junit4:junit4]   2> 14418 T237 oasc.CoreContainer.create Creating SolrCore 'collection1' using instanceDir: /usr/home/hudson/hudson-slave/workspace/Lucene-Solr-Tests-trunk-Java6/solr/build/solr-core/test/J1/./org.apache.solr.cloud.SyncSliceTest-jetty4-1355845939400/collection1
[junit4:junit4]   2> 14419 T237 oasc.ZkController.createCollectionZkNode Check for collection zkNode:collection1
[junit4:junit4]   2> 14422 T237 oasc.ZkController.createCollectionZkNode Collection zkNode exists
[junit4:junit4]   2> 14422 T237 oasc.ZkController.readConfigName Load collection config from:/collections/collection1
[junit4:junit4]   2> 14425 T237 oasc.SolrResourceLoader.<init> new SolrResourceLoader for directory: '/usr/home/hudson/hudson-slave/workspace/Lucene-Solr-Tests-trunk-Java6/solr/build/solr-core/test/J1/./org.apache.solr.cloud.SyncSliceTest-jetty4-1355845939400/collection1/'
[junit4:junit4]   2> 14426 T237 oasc.SolrResourceLoader.replaceClassLoader Adding 'file:/usr/home/hudson/hudson-slave/workspace/Lucene-Solr-Tests-trunk-Java6/solr/build/solr-core/test/J1/org.apache.solr.cloud.SyncSliceTest-jetty4-1355845939400/collection1/lib/README' to classloader
[junit4:junit4]   2> 14427 T237 oasc.SolrResourceLoader.replaceClassLoader Adding 'file:/usr/home/hudson/hudson-slave/workspace/Lucene-Solr-Tests-trunk-Java6/solr/build/solr-core/test/J1/org.apache.solr.cloud.SyncSliceTest-jetty4-1355845939400/collection1/lib/classes/' to classloader
[junit4:junit4]   2>  C4_STATE=coll:collection1 core:collection1 props:{shard=shard1, roles=null, state=recovering, core=collection1, collection=collection1, node_name=127.0.0.1:40156_c_s%2Fst, base_url=http://127.0.0.1:40156/c_s/st}
[junit4:junit4]   2> 14469 T205 C4 P40156 oasc.RecoveryStrategy.doRecovery Begin buffering updates. core=collection1
[junit4:junit4]   2> 14469 T205 C4 P40156 oasu.UpdateLog.bufferUpdates Starting to buffer updates. FSUpdateLog{state=ACTIVE, tlog=null}
[junit4:junit4]   2> 14470 T205 C4 P40156 oasc.RecoveryStrategy.replicate Attempting to replicate from http://127.0.0.1:64893/c_s/st/collection1/. core=collection1
[junit4:junit4]   2> 14470 T205 C4 P40156 oascsi.HttpClientUtil.createClient Creating new http client, config:maxConnections=128&maxConnectionsPerHost=32&followRedirects=false
[junit4:junit4]   2> 14500 T180 C5 P64893 oasu.DirectUpdateHandler2.commit start commit{flags=0,_version_=0,optimize=false,openSearcher=false,waitSearcher=true,expungeDeletes=false,softCommit=false}
[junit4:junit4]   2> 14502 T180 C5 P64893 oasc.CachingDirectoryFactory.close Releasing directory:/usr/home/hudson/hudson-slave/workspace/Lucene-Solr-Tests-trunk-Java6/solr/build/solr-core/test/J1/./org.apache.solr.cloud.SyncSliceTest-1355845925328/jetty1
[junit4:junit4]   2> 14502 T237 oasc.SolrConfig.<init> Using Lucene MatchVersion: LUCENE_50
[junit4:junit4]   2> 14507 T180 C5 P64893 oasc.SolrDeletionPolicy.onInit SolrDeletionPolicy.onInit: commits:num=1
[junit4:junit4]   2> 		commit{dir=RateLimitedDirectoryWrapper(NRTCachingDirectory(org.apache.lucene.store.NIOFSDirectory@/usr/home/hudson/hudson-slave/workspace/Lucene-Solr-Tests-trunk-Java6/solr/build/solr-core/test/J1/org.apache.solr.cloud.SyncSliceTest-1355845925328/jetty1/index lockFactory=org.apache.lucene.store.NativeFSLockFactory@671bd50e; maxCacheMB=48.0 maxMergeSizeMB=4.0)),segFN=segments_1,generation=1,filenames=[segments_1]
[junit4:junit4]   2> 14508 T180 C5 P64893 oasc.SolrDeletionPolicy.updateCommits newest commit = 1[segments_1]
[junit4:junit4]   2> 14513 T180 C5 P64893 oasc.SolrDeletionPolicy.onCommit SolrDeletionPolicy.onCommit: commits:num=2
[junit4:junit4]   2> 		commit{dir=RateLimitedDirectoryWrapper(NRTCachingDirectory(org.apache.lucene.store.NIOFSDirectory@/usr/home/hudson/hudson-slave/workspace/Lucene-Solr-Tests-trunk-Java6/solr/build/solr-core/test/J1/org.apache.solr.cloud.SyncSliceTest-1355845925328/jetty1/index lockFactory=org.apache.lucene.store.NativeFSLockFactory@671bd50e; maxCacheMB=48.0 maxMergeSizeMB=4.0)),segFN=segments_1,generation=1,filenames=[segments_1]
[junit4:junit4]   2> 		commit{dir=RateLimitedDirectoryWrapper(NRTCachingDirectory(org.apache.lucene.store.NIOFSDirectory@/usr/home/hudson/hudson-slave/workspace/Lucene-Solr-Tests-trunk-Java6/solr/build/solr-core/test/J1/org.apache.solr.cloud.SyncSliceTest-1355845925328/jetty1/index lockFactory=org.apache.lucene.store.NativeFSLockFactory@671bd50e; maxCacheMB=48.0 maxMergeSizeMB=4.0)),segFN=segments_2,generation=2,filenames=[segments_2]
[junit4:junit4]   2> 14513 T180 C5 P64893 oasc.SolrDeletionPolicy.updateCommits newest commit = 2[segments_2]
[junit4:junit4]   2> 14515 T180 C5 P64893 oasc.CachingDirectoryFactory.close Releasing directory:/usr/home/hudson/hudson-slave/workspace/Lucene-Solr-Tests-trunk-Java6/solr/build/solr-core/test/J1/./org.apache.solr.cloud.SyncSliceTest-1355845925328/jetty1
[junit4:junit4]   2> 14516 T180 C5 P64893 oass.SolrIndexSearcher.<init> Opening Searcher@2721e92 realtime
[junit4:junit4]   2> 14516 T180 C5 P64893 oasu.DirectUpdateHandler2.commit end_commit_flush
[junit4:junit4]   2> 14517 T180 C5 P64893 /update {waitSearcher=true&openSearcher=false&commit=true&commit_end_point=true&wt=javabin&softCommit=false&version=2} {commit=} 0 26
[junit4:junit4]   2> 14548 T169 oascc.ZkStateReader.updateClusterState Updating cloud state from ZooKeeper... 
[junit4:junit4]   2> 14549 T169 oasc.Overseer$ClusterStateUpdater.updateState Update state numShards=1 message={
[junit4:junit4]   2> 	  "operation":"state",
[junit4:junit4]   2> 	  "numShards":"1",
[junit4:junit4]   2> 	  "shard":"shard1",
[junit4:junit4]   2> 	  "roles":null,
[junit4:junit4]   2> 	  "state":"recovering",
[junit4:junit4]   2> 	  "core":"collection1",
[junit4:junit4]   2> 	  "collection":"collection1",
[junit4:junit4]   2> 	  "node_name":"127.0.0.1:40188_c_s%2Fst",
[junit4:junit4]   2> 	  "base_url":"http://127.0.0.1:40188/c_s/st"}
[junit4:junit4]   2> 14562 T236 oascc.ZkStateReader$2.process A cluster state change: WatchedEvent state:SyncConnected type:NodeDataChanged path:/clusterstate.json, has occurred - updating... (live nodes size: 5)
[junit4:junit4]   2> 14563 T219 oascc.ZkStateReader$2.process A cluster state change: WatchedEvent state:SyncConnected type:NodeDataChanged path:/clusterstate.json, has occurred - updating... (live nodes size: 5)
[junit4:junit4]   2> 14563 T187 oascc.ZkStateReader$2.process A cluster state change: WatchedEvent state:SyncConnected type:NodeDataChanged path:/clusterstate.json, has occurred - updating... (live nodes size: 5)
[junit4:junit4]   2> 14563 T202 oascc.ZkStateReader$2.process A cluster state change: WatchedEvent state:SyncConnected type:NodeDataChanged path:/clusterstate.json, has occurred - updating... (live nodes size: 5)
[junit4:junit4]   2> 14562 T168 oascc.ZkStateReader$2.process A cluster state change: WatchedEvent state:SyncConnected type:NodeDataChanged path:/clusterstate.json, has occurred - updating... (live nodes size: 5)
[junit4:junit4]   2> 14562 T174 oascc.ZkStateReader$2.process A cluster state change: WatchedEvent state:SyncConnected type:NodeDataChanged path:/clusterstate.json, has occurred - updating... (live nodes size: 5)
[junit4:junit4]   2> 14579 T205 C4 P40156 oash.ReplicationHandler.inform Commits will be reserved for  10000
[junit4:junit4]   2> 14580 T205 C4 P40156 oascsi.HttpClientUtil.createClient Creating new http client, config:connTimeout=5000&socketTimeout=20000&allowCompression=false&maxConnections=10000&maxConnectionsPerHost=10000
[junit4:junit4]   2> 14606 T205 C4 P40156 oash.SnapPuller.<init>  No value set for 'pollInterval'. Timer Task not started.
[junit4:junit4]   2> 14679 T181 C5 P64893 oash.ReplicationHandler.inform Commits will be reserved for  10000
[junit4:junit4]   2> 14680 T181 C5 P64893 REQ /replication {command=indexversion&wt=javabin&qt=/replication&version=2} status=0 QTime=71 
[junit4:junit4]   2> 14682 T205 C4 P40156 oash.SnapPuller.fetchLatestIndex Master's generation: 2
[junit4:junit4]   2> 14682 T205 C4 P40156 oash.SnapPuller.fetchLatestIndex Slave's generation: 1
[junit4:junit4]   2> 14682 T205 C4 P40156 oash.SnapPuller.fetchLatestIndex Starting replication process
[junit4:junit4]   2> 14686 T181 C5 P64893 oasc.CachingDirectoryFactory.close Releasing directory:/usr/home/hudson/hudson-slave/workspace/Lucene-Solr-Tests-trunk-Java6/solr/build/solr-core/test/J1/./org.apache.solr.cloud.SyncSliceTest-1355845925328/jetty1
[junit4:junit4]   2> 14687 T181 C5 P64893 oasc.CachingDirectoryFactory.close Releasing directory:/usr/home/hudson/hudson-slave/workspace/Lucene-Solr-Tests-trunk-Java6/solr/build/solr-core/test/J1/./org.apache.solr.cloud.SyncSliceTest-1355845925328/jetty1/index
[junit4:junit4]   2> 14687 T181 C5 P64893 REQ /replication {command=filelist&generation=2&wt=javabin&qt=/replication&version=2} status=0 QTime=2 
[junit4:junit4]   2> 14689 T205 C4 P40156 oash.SnapPuller.fetchLatestIndex Number of files in latest index in master: 1
[junit4:junit4]   2> 14690 T205 C4 P40156 oasc.CachingDirectoryFactory.get return new directory for /usr/home/hudson/hudson-slave/workspace/Lucene-Solr-Tests-trunk-Java6/solr/build/solr-core/test/J1/./org.apache.solr.cloud.SyncSliceTest-1355845925328/jetty2/index.20121218185220010 forceNew:false
[junit4:junit4]   2> 14691 T205 C4 P40156 oasc.CachingDirectoryFactory.close Releasing directory:/usr/home/hudson/hudson-slave/workspace/Lucene-Solr-Tests-trunk-Java6/solr/build/solr-core/test/J1/./org.apache.solr.cloud.SyncSliceTest-1355845925328/jetty2
[junit4:junit4]   2> 14692 T205 C4 P40156 oash.SnapPuller.fetchLatestIndex Starting download to RateLimitedDirectoryWrapper(NRTCachingDirectory(org.apache.lucene.store.NIOFSDirectory@/usr/home/hudson/hudson-slave/workspace/Lucene-Solr-Tests-trunk-Java6/solr/build/solr-core/test/J1/org.apache.solr.cloud.SyncSliceTest-1355845925328/jetty2/index.20121218185220010 lockFactory=org.apache.lucene.store.NativeFSLockFactory@15129dc2; maxCacheMB=48.0 maxMergeSizeMB=4.0)) fullCopy=true
[junit4:junit4]   2> 14703 T237 oasc.SolrConfig.<init> Loaded SolrConfig: solrconfig.xml
[junit4:junit4]   2> 14710 T181 C5 P64893 REQ /replication {file=segments_2&command=filecontent&checksum=true&generation=2&qt=/replication&wt=filestream} status=0 QTime=6 
[junit4:junit4]   2> 14725 T205 C4 P40156 oasc.CachingDirectoryFactory.close Releasing directory:/usr/home/hudson/hudson-slave/workspace/Lucene-Solr-Tests-trunk-Java6/solr/build/solr-core/test/J1/./org.apache.solr.cloud.SyncSliceTest-1355845925328/jetty2/index
[junit4:junit4]   2> 14726 T205 C4 P40156 oash.SnapPuller.fetchLatestIndex Total time taken for download : 0 secs
[junit4:junit4]   2> 14726 T205 C4 P40156 oash.SnapPuller.modifyIndexProps New index installed. Updating index properties... index=index.20121218185220010
[junit4:junit4]   2> 14733 T205 C4 P40156 oasc.CachingDirectoryFactory.close Releasing directory:/usr/home/hudson/hudson-slave/workspace/Lucene-Solr-Tests-trunk-Java6/solr/build/solr-core/test/J1/./org.apache.solr.cloud.SyncSliceTest-1355845925328/jetty2
[junit4:junit4]   2> 14734 T205 C4 P40156 oasc.CachingDirectoryFactory.close Releasing directory:/usr/home/hudson/hudson-slave/workspace/Lucene-Solr-Tests-trunk-Java6/solr/build/solr-core/test/J1/./org.apache.solr.cloud.SyncSliceTest-1355845925328/jetty2
[junit4:junit4]   2> 14735 T205 C4 P40156 oasc.SolrCore.getNewIndexDir New index directory detected: old=./org.apache.solr.cloud.SyncSliceTest-1355845925328/jetty2/index/ new=./org.apache.solr.cloud.SyncSliceTest-1355845925328/jetty2/index.20121218185220010
[junit4:junit4]   2> 14738 T205 C4 P40156 oasc.SolrDeletionPolicy.onInit SolrDeletionPolicy.onInit: commits:num=1
[junit4:junit4]   2> 		commit{dir=RateLimitedDirectoryWrapper(NRTCachingDirectory(org.apache.lucene.store.NIOFSDirectory@/usr/home/hudson/hudson-slave/workspace/Lucene-Solr-Tests-trunk-Java6/solr/build/solr-core/test/J1/org.apache.solr.cloud.SyncSliceTest-1355845925328/jetty2/index.20121218185220010 lockFactory=org.apache.lucene.store.NativeFSLockFactory@15129dc2; maxCacheMB=48.0 maxMergeSizeMB=4.0)),segFN=segments_2,generation=2,filenames=[segments_2]
[junit4:junit4]   2> 14739 T205 C4 P40156 oasc.SolrDeletionPolicy.updateCommits newest commit = 2[segments_2]
[junit4:junit4]   2> 14741 T205 C4 P40156 oasc.CachingDirectoryFactory.close Releasing directory:/usr/home/hudson/hudson-slave/workspace/Lucene-Solr-Tests-trunk-Java6/solr/build/solr-core/test/J1/./org.apache.solr.cloud.SyncSliceTest-1355845925328/jetty2
[junit4:junit4]   2> 14745 T205 C4 P40156 oasu.DefaultSolrCoreState.newIndexWriter Creating new IndexWriter...
[junit4:junit4]   2> 14745 T205 C4 P40156 oasu.DefaultSolrCoreState.newIndexWriter Waiting until IndexWriter is unused... core=collection1
[junit4:junit4]   2> 14745 T205 C4 P40156 oasu.DefaultSolrCoreState.newIndexWriter Rollback old IndexWriter... core=collection1
[junit4:junit4]   2> 14746 T205 C4 P40156 oasc.CachingDirectoryFactory.close Releasing directory:/usr/home/hudson/hudson-slave/workspace/Lucene-Solr-Tests-trunk-Java6/solr/build/solr-core/test/J1/./org.apache.solr.cloud.SyncSliceTest-1355845925328/jetty2/index.20121218185220010
[junit4:junit4]   2> 14747 T205 C4 P40156 oasc.CachingDirectoryFactory.close Releasing directory:/usr/home/hudson/hudson-slave/workspace/Lucene-Solr-Tests-trunk-Java6/solr/build/solr-core/test/J1/./org.apache.solr.cloud.SyncSliceTest-1355845925328/jetty2
[junit4:junit4]   2> 14751 T205 C4 P40156 oasc.SolrDeletionPolicy.onInit SolrDeletionPolicy.onInit: commits:num=1
[junit4:junit4]   2> 		commit{dir=RateLimitedDirectoryWrapper(NRTCachingDirectory(org.apache.lucene.store.NIOFSDirectory@/usr/home/hudson/hudson-slave/workspace/Lucene-Solr-Tests-trunk-Java6/solr/build/solr-core/test/J1/org.apache.solr.cloud.SyncSliceTest-1355845925328/jetty2/index.20121218185220010 lockFactory=org.apache.lucene.store.NativeFSLockFactory@15129dc2; maxCacheMB=48.0 maxMergeSizeMB=4.0)),segFN=segments_2,generation=2,filenames=[segments_2]
[junit4:junit4]   2> 14751 T205 C4 P40156 oasc.SolrDeletionPolicy.updateCommits newest commit = 2[segments_2]
[junit4:junit4]   2> 14752 T205 C4 P40156 oasu.DefaultSolrCoreState.newIndexWriter New IndexWriter is ready to be used.
[junit4:junit4]   2> 14752 T205 C4 P40156 oasc.CachingDirectoryFactory.close Releasing directory:/usr/home/hudson/hudson-slave/workspace/Lucene-Solr-Tests-trunk-Java6/solr/build/solr-core/test/J1/./org.apache.solr.cloud.SyncSliceTest-1355845925328/jetty2
[junit4:junit4]   2> 14753 T205 C4 P40156 oass.SolrIndexSearcher.<init> Opening Searcher@10b2d28b main
[junit4:junit4]   2> 14755 T204 oasc.SolrCore.registerSearcher [collection1] Registered new searcher Searcher@10b2d28b main{StandardDirectoryReader(segments_2:1:nrt)}
[junit4:junit4]   2> 14756 T204 oasc.CachingDirectoryFactory.close Releasing directory:/usr/home/hudson/hudson-slave/workspace/Lucene-Solr-Tests-trunk-Java6/solr/build/solr-core/test/J1/./org.apache.solr.cloud.SyncSliceTest-1355845925328/jetty2/index
[junit4:junit4]   2> 14756 T205 C4 P40156 oasu.DirectUpdateHandler2.commit start commit{flags=0,_version_=0,optimize=false,openSearcher=false,waitSearcher=false,expungeDeletes=false,softCommit=false}
[junit4:junit4]   2> 14772 T205 C4 P40156 oasc.SolrDeletionPolicy.onCommit SolrDeletionPolicy.onCommit: commits:num=2
[junit4:junit4]   2> 		commit{dir=RateLimitedDirectoryWrapper(NRTCachingDirectory(org.apache.lucene.store.NIOFSDirectory@/usr/home/hudson/hudson-slave/workspace/Lucene-Solr-Tests-trunk-Java6/solr/build/solr-core/test/J1/org.apache.solr.cloud.SyncSliceTest-1355845925328/jetty2/index.20121218185220010 lockFactory=org.apache.lucene.store.NativeFSLockFactory@15129dc2; maxCacheMB=48.0 maxMergeSizeMB=4.0)),segFN=segments_2,generation=2,filenames=[segments_2]
[junit4:junit4]   2> 		commit{dir=RateLimitedDirectoryWrapper(NRTCachingDirectory(org.apache.lucene.store.NIOFSDirectory@/usr/home/hudson/hudson-slave/workspace/Lucene-Solr-Tests-trunk-Java6/solr/build/solr-core/test/J1/org.apache.solr.cloud.SyncSliceTest-1355845925328/jetty2/index.20121218185220010 lockFactory=org.apache.lucene.store.NativeFSLockFactory@15129dc2; maxCacheMB=48.0 maxMergeSizeMB=4.0)),segFN=segments_3,generation=3,filenames=[segments_3]
[junit4:junit4]   2> 14772 T205 C4 P40156 oasc.SolrDeletionPolicy.updateCommits newest commit = 3[segments_3]
[junit4:junit4]   2> 14774 T205 C4 P40156 oasc.CachingDirectoryFactory.close Releasing directory:/usr/home/hudson/hudson-slave/workspace/Lucene-Solr-Tests-trunk-Java6/solr/build/solr-core/test/J1/./org.apache.solr.cloud.SyncSliceTest-1355845925328/jetty2
[junit4:junit4]   2> 14774 T205 C4 P40156 oasu.DirectUpdateHandler2.commit end_commit_flush
[junit4:junit4]   2> 14774 T205 C4 P40156 oasc.CachingDirectoryFactory.close Releasing directory:/usr/home/hudson/hudson-slave/workspace/Lucene-Solr-Tests-trunk-Java6/solr/build/solr-core/test/J1/./org.apache.solr.cloud.SyncSliceTest-1355845925328/jetty2/index.20121218185220010
[junit4:junit4]   2> 14775 T205 C4 P40156 oasc.CachingDirectoryFactory.close Releasing directory:/usr/home/hudson/hudson-slave/workspace/Lucene-Solr-Tests-trunk-Java6/solr/build/solr-core/test/J1/./org.apache.solr.cloud.SyncSliceTest-1355845925328/jetty2/index
[junit4:junit4]   2> 14775 T205 C4 P40156 oasc.RecoveryStrategy.replay No replay needed. core=collection1
[junit4:junit4]   2> 14775 T205 C4 P40156 oasc.RecoveryStrategy.doRecovery Replication Recovery was successful - registering as Active. core=collection1
[junit4:junit4]   2> 14776 T205 C4 P40156 oasc.ZkController.publish publishing core=collection1 state=active
[junit4:junit4]   2> 14776 T205 C4 P40156 oasc.ZkController.publish numShards not found on descriptor - reading it from system property
[junit4:junit4]   2> 14778 T205 C4 P40156 oasc.RecoveryStrategy.doRecovery Finished recovery process. core=collection1
[junit4:junit4]   2> 14804 T237 oass.IndexSchema.readSchema Reading Solr Schema
[junit4:junit4]   2> 14909 T237 oass.IndexSchema.readSchema Schema name=test
[junit4:junit4]   2> 15071 T169 oascc.ZkStateReader.updateClusterState Updating cloud state from ZooKeeper... 
[junit4:junit4]   2> 15072 T169 oasc.Overseer$ClusterStateUpdater.updateState Update state numShards=1 message={
[junit4:junit4]   2> 	  "operation":"state",
[junit4:junit4]   2> 	  "numShards":"1",
[junit4:junit4]   2> 	  "shard":"shard1",
[junit4:junit4]   2> 	  "roles":null,
[junit4:junit4]   2> 	  "state":"active",
[junit4:junit4]   2> 	  "core":"collection1",
[junit4:junit4]   2> 	  "collection":"collection1",
[junit4:junit4]   2> 	  "node_name":"127.0.0.1:40156_c_s%2Fst",
[junit4:junit4]   2> 	  "base_url":"http://127.0.0.1:40156/c_s/st"}
[junit4:junit4]   2> 15088 T174 oascc.ZkStateReader$2.process A cluster state change: WatchedEvent state:SyncConnected type:NodeDataChanged path:/clusterstate.json, has occurred - updating... (live nodes size: 5)
[junit4:junit4]   2> 15088 T236 oascc.ZkStateReader$2.process A cluster state change: WatchedEvent state:SyncConnected type:NodeDataChanged path:/clusterstate.json, has occurred - updating... (live nodes size: 5)
[junit4:junit4]   2> 15088 T168 oascc.ZkStateReader$2.process A cluster state change: WatchedEvent state:SyncConnected type:NodeDataChanged path:/clusterstate.json, has occurred - updating... (live nodes size: 5)
[junit4:junit4]   2> 15088 T202 oascc.ZkStateReader$2.process A cluster state change: WatchedEvent state:SyncConnected type:NodeDataChanged path:/clusterstate.json, has occurred - updating... (live nodes size: 5)
[junit4:junit4]   2> 15088 T187 oascc.ZkStateReader$2.process A cluster state change: WatchedEvent state:SyncConnected type:NodeDataChanged path:/clusterstate.json, has occurred - updating... (live nodes size: 5)
[junit4:junit4]   2> 15088 T219 oascc.ZkStateReader$2.process A cluster state change: WatchedEvent state:SyncConnected type:NodeDataChanged path:/clusterstate.json, has occurred - updating... (live nodes size: 5)
[junit4:junit4]   2> 16219 T237 oass.OpenExchangeRatesOrgProvider.init Initialized with rates=open-exchange-rates.json, refreshInterval=1440.
[junit4:junit4]   2> 16233 T237 oass.IndexSchema.readSchema default search field in schema is text
[junit4:junit4]   2> 16248 T237 oass.IndexSchema.readSchema unique key field: id
[junit4:junit4]   2> 16278 T237 oass.FileExchangeRateProvider.reload Reloading exchange rates from file currency.xml
[junit4:junit4]   2> 16282 T237 oass.FileExchangeRateProvider.reload Reloading exchange rates from file currency.xml
[junit4:junit4]   2> 16287 T237 oass.OpenExchangeRatesOrgProvider.reload Reloading exchange rates from open-exchange-rates.json
[junit4:junit4]   2> 16288 T237 oass.OpenExchangeRatesOrgProvider.reload Reloading exchange rates from open-exchange-rates.json
[junit4:junit4]   2> 16290 T237 oasc.SolrCore.<init> [collection1] Opening new SolrCore at /usr/home/hudson/hudson-slave/workspace/Lucene-Solr-Tests-trunk-Java6/solr/build/solr-core/test/J1/./org.apache.solr.cloud.SyncSliceTest-jetty4-1355845939400/collection1/, dataDir=./org.apache.solr.cloud.SyncSliceTest-1355845925328/jetty4/
[junit4:junit4]   2> 16290 T237 oasc.JmxMonitoredMap.<init> JMX monitoring is enabled. Adding Solr mbeans to JMX Server: com.sun.jmx.mbeanserver.JmxMBeanServer@6d46b6db
[junit4:junit4]   2> 16291 T237 oasc.SolrCore.initDirectoryFactory solr.NRTCachingDirectoryFactory
[junit4:junit4]   2> 16292 T237 oasc.CachingDirectoryFactory.get return new directory for /usr/home/hudson/hudson-slave/workspace/Lucene-Solr-Tests-trunk-Java6/solr/build/solr-core/test/J1/./org.apache.solr.cloud.SyncSliceTest-1355845925328/jetty4 forceNew:false
[junit4:junit4]   2> 16292 T237 oasc.CachingDirectoryFactory.close Releasing directory:/usr/home/hudson/hudson-slave/workspace/Lucene-Solr-Tests-trunk-Java6/solr/build/solr-core/test/J1/./org.apache.solr.cloud.SyncSliceTest-1355845925328/jetty4
[junit4:junit4]   2> 16293 T237 oasc.SolrCore.getNewIndexDir New index directory detected: old=null new=./org.apache.solr.cloud.SyncSliceTest-1355845925328/jetty4/index/
[junit4:junit4]   2> 16293 T237 oasc.SolrCore.initIndex WARNING [collection1] Solr index directory './org.apache.solr.cloud.SyncSliceTest-1355845925328/jetty4/index' doesn't exist. Creating new index...
[junit4:junit4]   2> 16294 T237 oasc.CachingDirectoryFactory.get return new directory for /usr/home/hudson/hudson-slave/workspace/Lucene-Solr-Tests-trunk-Java6/solr/build/solr-core/test/J1/./org.apache.solr.cloud.SyncSliceTest-1355845925328/jetty4/index forceNew:false
[junit4:junit4]   2> 16331 T237 oasc.SolrDeletionPolicy.onCommit SolrDeletionPolicy.onCommit: commits:num=1
[junit4:junit4]   2> 		commit{dir=RateLimitedDirectoryWrapper(NRTCachingDirectory(org.apache.lucene.store.NIOFSDirectory@/usr/home/hudson/hudson-slave/workspace/Lucene-Solr-Tests-trunk-Java6/solr/build/solr-core/test/J1/org.apache.solr.cloud.SyncSliceTest-1355845925328/jetty4/index lockFactory=org.apache.lucene.store.NativeFSLockFactory@1fcc4f8; maxCacheMB=48.0 maxMergeSizeMB=4.0)),segFN=segments_1,generation=1,filenames=[segments_1]
[junit4:junit4]   2> 16334 T237 oasc.SolrDeletionPolicy.updateCommits newest commit = 1[segments_1]
[junit4:junit4]   2> 16338 T237 oasc.CachingDirectoryFactory.close Releasing directory:/usr/home/hudson/hudson-slave/workspace/Lucene-Solr-Tests-trunk-Java6/solr/build/solr-core/test/J1/./org.apache.solr.cloud.SyncSliceTest-1355845925328/jetty4/index
[junit4:junit4]   2> 16342 T237 oasc.SolrCore.initWriters created xml: solr.XMLResponseWriter
[junit4:junit4]   2> 16353 T237 oasup.UpdateRequestProcessorChain.init inserting DistributedUpdateProcessorFactory into updateRequestProcessorChain "dedupe"
[junit4:junit4]   2> 16354 T237 oasup.UpdateRequestProcessorChain.init inserting DistributedUpdateProcessorFactory into updateRequestProcessorChain "dedupe-allfields"
[junit4:junit4]   2> 16355 T237 oasup.UpdateRequestProcessorChain.init inserting DistributedUpdateProcessorFactory into updateRequestProcessorChain "stored_sig"
[junit4:junit4]   2> 16356 T237 oasup.UpdateRequestProcessorChain.init inserting DistributedUpdateProcessorFactory into updateRequestProcessorChain "uniq-fields"
[junit4:junit4]   2> 16358 T237 oasup.UpdateRequestProcessorChain.init inserting DistributedUpdateProcessorFactory into updateRequestProcessorChain "distrib-dup-test-chain-implicit"
[junit4:junit4]   2> 16361 T237 oasc.RequestHandlers.initHandlersFromConfig adding lazy requestHandler: solr.ReplicationHandler
[junit4:junit4]   2> 16364 T237 oasc.RequestHandlers.initHandlersFromConfig created /replication: solr.ReplicationHandler
[junit4:junit4]   2> 16367 T237 oasc.RequestHandlers.initHandlersFromConfig created standard: solr.StandardRequestHandler
[junit4:junit4]   2> 16369 T237 oasc.RequestHandlers.initHandlersFromConfig created /get: solr.RealTimeGetHandler
[junit4:junit4]   2> 16371 T237 oasc.RequestHandlers.initHandlersFromConfig created dismax: solr.SearchHandler
[junit4:junit4]   2> 16372 T237 oasc.RequestHandlers.initHandlersFromConfig created mock: org.apache.solr.core.MockQuerySenderListenerReqHandler
[junit4:junit4]   2> 16373 T237 oasc.RequestHandlers.initHandlersFromConfig created /admin/: org.apache.solr.handler.admin.AdminHandlers
[junit4:junit4]   2> 16375 T237 oasc.RequestHandlers.initHandlersFromConfig created defaults: solr.StandardRequestHandler
[junit4:junit4]   2> 16375 T237 oasc.RequestHandlers.initHandlersFromConfig adding lazy requestHandler: solr.StandardRequestHandler
[junit4:junit4]   2> 16376 T237 oasc.RequestHandlers.initHandlersFromConfig created lazy: solr.StandardRequestHandler
[junit4:junit4]   2> 16380 T237 oasc.RequestHandlers.initHandlersFromConfig created /update: solr.UpdateRequestHandler
[junit4:junit4]   2> 16382 T237 oasc.RequestHandlers.initHandlersFromConfig created /terms: org.apache.solr.handler.component.SearchHandler
[junit4:junit4]   2> 16384 T237 oasc.RequestHandlers.initHandlersFromConfig created spellCheckCompRH: org.apache.solr.handler.component.SearchHandler
[junit4:junit4]   2> 16386 T237 oasc.RequestHandlers.initHandlersFromConfig created spellCheckCompRH_Direct: org.apache.solr.handler.component.SearchHandler
[junit4:junit4]   2> 16388 T237 oasc.RequestHandlers.initHandlersFromConfig created spellCheckWithWordbreak: org.apache.solr.handler.component.SearchHandler
[junit4:junit4]   2> 16389 T237 oasc.RequestHandlers.initHandlersFromConfig created spellCheckWithWordbreak_Direct: org.apache.solr.handler.component.SearchHandler
[junit4:junit4]   2> 16393 T237 oasc.RequestHandlers.initHandlersFromConfig created spellCheckCompRH1: org.apache.solr.handler.component.SearchHandler
[junit4:junit4]   2> 16394 T237 oasc.RequestHandlers.initHandlersFromConfig created mltrh: org.apache.solr.handler.component.SearchHandler
[junit4:junit4]   2> 16396 T237 oasc.RequestHandlers.initHandlersFromConfig created tvrh: org.apache.solr.handler.component.SearchHandler
[junit4:junit4]   2> 16401 T237 oasc.RequestHandlers.initHandlersFromConfig created /mlt: solr.MoreLikeThisHandler
[junit4:junit4]   2> 16404 T237 oasc.RequestHandlers.initHandlersFromConfig created /debug/dump: solr.DumpRequestHandler
[junit4:junit4]   2> 16446 T237 oashl.XMLLoader.init xsltCacheLifetimeSeconds=60
[junit4:junit4]   2> 16456 T237 oasc.SolrCore.initDeprecatedSupport WARNING solrconfig.xml uses deprecated <admin/gettableFiles>, Please update your config to use the ShowFileRequestHandler.
[junit4:junit4]   2> 16459 T237 oasc.SolrCore.initDeprecatedSupport WARNING adding ShowFileRequestHandler with hidden files: [SCHEMA.XML, OLD_SYNONYMS.TXT, STOPWORDS.TXT, PROTWORDS.TXT, OPEN-EXCHANGE-RATES.JSON, SYNONYMS.TXT, CURRENCY.XML, MAPPING-ISOLATIN1ACCENT.TXT]
[junit4:junit4]   2> 16464 T237 oasc.CachingDirectoryFactory.close Releasing directory:/usr/home/hudson/hudson-slave/workspace/Lucene-Solr-Tests-trunk-Java6/solr/build/solr-core/test/J1/./org.apache.solr.cloud.SyncSliceTest-1355845925328/jetty4
[junit4:junit4]   2> 16469 T237 oass.SolrIndexSearcher.<init> Opening Searcher@67f42fbb main
[junit4:junit4]   2> 16470 T237 oasu.CommitTracker.<init> Hard AutoCommit: disabled
[junit4:junit4]   2> 16470 T237 oasu.CommitTracker.<init> Soft AutoCommit: disabled
[junit4:junit4]   2> 16471 T237 oashc.SpellCheckComponent.inform Initializing spell checkers
[junit4:junit4]   2> 16513 T237 oass.DirectSolrSpellChecker.init init: {name=direct,classname=DirectSolrSpellChecker,field=lowerfilt,minQueryLength=3}
[junit4:junit4]   2> 16646 T239 oasc.SolrCore.registerSearcher [collection1] Registered new searcher Searcher@67f42fbb main{StandardDirectoryReader(segments_1:1)}
[junit4:junit4]   2> 16654 T237 oasc.ZkController.publish publishing core=collection1 state=down
[junit4:junit4]   2> 16654 T237 oasc.ZkController.publish numShards not found on descriptor - reading it from system property
[junit4:junit4]   2>  C6_STATE=coll:collection1 core:collection1 props:{shard=shard1, roles=null, state=recovering, core=collection1, collection=collection1, node_name=127.0.0.1:40188_c_s%2Fst, base_url=http://127.0.0.1:40188/c_s/st}
[junit4:junit4]   2> 17090 T222 C6 P40188 oasc.RecoveryStrategy.doRecovery Begin buffering updates. core=collection1
[junit4:junit4]   2> 17090 T222 C6 P40188 oasu.UpdateLog.bufferUpdates Starting to buffer updates. FSUpdateLog{state=ACTIVE, tlog=null}
[junit4:junit4]   2> 17091 T222 C6 P40188 oasc.RecoveryStrategy.replicate Attempting to replicate from http://127.0.0.1:64893/c_s/st/collection1/. core=collection1
[junit4:junit4]   2> 17092 T222 C6 P40188 oascsi.HttpClientUtil.createClient Creating new http client, config:maxConnections=128&maxConnectionsPerHost=32&followRedirects=false
[junit4:junit4]   2> 17119 T169 oascc.ZkStateReader.updateClusterState Updating cloud state from ZooKeeper... 
[junit4:junit4]   2> 17125 T169 oasc.Overseer$ClusterStateUpdater.updateState Update state numShards=1 message={
[junit4:junit4]   2> 	  "operation":"state",
[junit4:junit4]   2> 	  "numShards":"1",
[junit4:junit4]   2> 	  "shard":null,
[junit4:junit4]   2> 	  "roles":null,
[junit4:junit4]   2> 	  "state":"down",
[junit4:junit4]   2> 	  "core":"collection1",
[junit4:junit4]   2> 	  "collection":"collection1",
[junit4:junit4]   2> 	  "node_name":"127.0.0.1:40215_c_s%2Fst",
[junit4:junit4]   2> 	  "base_url":"http://127.0.0.1:40215/c_s/st"}
[junit4:junit4]   2> 17125 T169 oasc.Overseer$ClusterStateUpdater.updateState Collection already exists with numShards=1
[junit4:junit4]   2> 17126 T169 oasc.Overseer$ClusterStateUpdater.updateState Assigning new node to shard shard=shard1
[junit4:junit4]   2> 17136 T182 C5 P64893 oasu.DirectUpdateHandler2.commit start commit{flags=0,_version_=0,optimize=false,openSearcher=false,waitSearcher=true,expungeDeletes=false,softCommit=false}
[junit4:junit4]   2> 17147 T168 oascc.ZkStateReader$2.process A cluster state change: WatchedEvent state:SyncConnected type:NodeDataChanged path:/clusterstate.json, has occurred - updating... (live nodes size: 5)
[junit4:junit4]   2> 17148 T236 oascc.ZkStateReader$2.process A cluster state change: WatchedEvent state:SyncConnected type:NodeDataChanged path:/clusterstate.json, has occurred - updating... (live nodes size: 5)
[junit4:junit4]   2> 17148 T219 oascc.ZkStateReader$2.process A cluster state change: WatchedEvent state:SyncConnected type:NodeDataChanged path:/clusterstate.json, has occurred - updating... (live nodes size: 5)
[junit4:junit4]   2> 17148 T174 oascc.ZkStateReader$2.process A cluster state change: WatchedEvent state:SyncConnected type:NodeDataChanged path:/clusterstate.json, has occurred - updating... (live nodes size: 5)
[junit4:junit4]   2> 17148 T187 oascc.ZkStateReader$2.process A cluster state change: WatchedEvent state:SyncConnected type:NodeDataChanged path:/clusterstate.json, has occurred - updating... (live nodes size: 5)
[junit4:junit4]   2> 17148 T202 oascc.ZkStateReader$2.process A cluster state change: WatchedEvent state:SyncConnected type:NodeDataChanged path:/clusterstate.json, has occurred - updating... (live nodes size: 5)
[junit4:junit4]   2> 17156 T182 C5 P64893 oasc.SolrDeletionPolicy.onCommit SolrDeletionPolicy.onCommit: commits:num=2
[junit4:junit4]   2> 		commit{dir=RateLimitedDirectoryWrapper(NRTCachingDirectory(org.apache.lucene.store.NIOFSDirectory@/usr/home/hudson/hudson-slave/workspace/Lucene-Solr-Tests-trunk-Java6/solr/build/solr-core/test/J1/org.apache.solr.cloud.SyncSliceTest-1355845925328/jetty1/index lockFactory=org.apache.lucene.store.NativeFSLockFactory@671bd50e; maxCacheMB=48.0 maxMergeSizeMB=4.0)),segFN=segments_2,generation=2,filenames=[segments_2]
[junit4:junit4]   2> 		commit{dir=RateLimitedDirectoryWrapper(NRTCachingDirectory(org.apache.lucene.store.NIOFSDirectory@/usr/home/hudson/hudson-slave/workspace/Lucene-Solr-Tests-trunk-Java6/solr/build/solr-core/test/J1/org.apache.solr.cloud.SyncSliceTest-1355845925328/jetty1/index lockFactory=org.apache.lucene.store.NativeFSLockFactory@671bd50e; maxCacheMB=48.0 maxMergeSizeMB=4.0)),segFN=segments_3,generation=3,filenames=[segments_3]
[junit4:junit4]   2> 17157 T237 oasc.CoreContainer.registerCore registering core: collection1
[junit4:junit4]   2> 17157 T182 C5 P64893 oasc.SolrDeletionPolicy.updateCommits newest commit = 3[segments_3]
[junit4:junit4]   2> 17158 T237 oasc.ZkController.register Register replica - core:collection1 address:http://127.0.0.1:40215/c_s/st collection:collection1 shard:shard1
[junit4:junit4]   2> 17159 T182 C5 P64893 oasc.CachingDirectoryFactory.close Releasing directory:/usr/home/hudson/hudson-slave/workspace/Lucene-Solr-Tests-trunk-Java6/solr/build/solr-core/test/J1/./org.apache.solr.cloud.SyncSliceTest-1355845925328/jetty1
[junit4:junit4]   2> 17160 T182 C5 P64893 oasu.DirectUpdateHandler2.commit end_commit_flush
[junit4:junit4]   2> 17161 T182 C5 P64893 /update {waitSearcher=true&openSearcher=false&commit=true&commit_end_point=true&wt=javabin&softCommit=false&version=2} {commit=} 0 25
[junit4:junit4]   2> 17163 T222 C6 P40188 oash.ReplicationHandler.inform Commits will be reserved for  10000
[junit4:junit4]   2> 17164 T222 C6 P40188 oash.SnapPuller.<init>  No value set for 'pollInterval'. Timer Task not started.
[junit4:junit4]   2> 17168 T237 oasc.ZkController.register We are http://127.0.0.1:40215/c_s/st/collection1/ and leader is http://127.0.0.1:64893/c_s/st/collection1/
[junit4:junit4]   2> 17168 T181 C5 P64893 REQ /replication {command=indexversion&wt=javabin&qt=/replication&version=2} status=0 QTime=1 
[junit4:junit4]   2> 17168 T237 oasc.ZkController.register No LogReplay needed for core=collection1 baseURL=http://127.0.0.1:40215/c_s/st
[junit4:junit4]   2> 17169 T237 oasc.ZkController.checkRecovery Core needs to recover:collection1
[junit4:junit4]   2> 17169 T237 oasu.DefaultSolrCoreState.doRecovery Running recovery - first canceling any ongoing recovery
[junit4:junit4]   2> 17170 T222 C6 P40188 oash.SnapPuller.fetchLatestIndex Master's generation: 3
[junit4:junit4]   2> ASYNC  NEW_CORE C7 name=collection1 org.apache.solr.core.SolrCore@69e76a88 url=http://127.0.0.1:40215/c_s/st/collection1 node=127.0.0.1:40215_c_s%2Fst C7_STATE=coll:collection1 core:collection1 props:{shard=null, roles=null, state=down, core=collection1, collection=collection1, node_name=127.0.0.1:40215_c_s%2Fst, base_url=http://127.0.0.1:40215/c_s/st}
[junit4:junit4]   2> 17170 T240 C7 P40215 oasc.RecoveryStrategy.run Starting recovery process.  core=collection1 recoveringAfterStartup=true
[junit4:junit4]   2> 17170 T222 C6 P40188 oash.SnapPuller.fetchLatestIndex Slave's generation: 1
[junit4:junit4]   2> 17171 T222 C6 P40188 oash.SnapPuller.fetchLatestIndex Starting replication process
[junit4:junit4]   2> 17172 T237 oascc.ZkStateReader.updateClusterState Updating cloud state from ZooKeeper... 
[junit4:junit4]   2> 17173 T240 C7 P40215 oasc.RecoveryStrategy.doRecovery ###### startupVersions=[]
[junit4:junit4]   2> 17175 T240 C7 P40215 oasc.ZkController.publish publishing core=collection1 state=recovering
[junit4:junit4]   2> 17175 T240 C7 P40215 oasc.ZkController.publish numShards not found on descriptor - reading it from system property
[junit4:junit4]   2> 17175 T181 C5 P64893 oasc.CachingDirectoryFactory.close Releasing directory:/usr/home/hudson/hudson-slave/workspace/Lucene-Solr-Tests-trunk-Java6/solr/build/solr-core/test/J1/./org.apache.solr.cloud.SyncSliceTest-1355845925328/jetty1
[junit4:junit4]   2> 17176 T145 oass.SolrDispatchFilter.init user.dir=/usr/home/hudson/hudson-slave/workspace/Lucene-Solr-Tests-trunk-Java6/solr/build/solr-core/test/J1
[junit4:junit4]   2> 17177 T145 oass.SolrDispatchFilter.init SolrDispatchFilter.init() done
[junit4:junit4]   2> 17178 T145 oascsi.HttpClientUtil.createClient Creating new http client, config:maxConnections=128&maxConnectionsPerHost=32&followRedirects=false
[junit4:junit4]   2> 17177 T181 C5 P64893 oasc.CachingDirectoryFactory.close Releasing directory:/usr/home/hudson/hudson-slave/workspace/Lucene-Solr-Tests-trunk-Java6/solr/build/solr-core/test/J1/./org.apache.solr.cloud.SyncSliceTest-1355845925328/jetty1/index
[junit4:junit4]   2> 17180 T181 C5 P64893 REQ /replication {command=filelist&generation=3&wt=javabin&qt=/replication&version=2} status=0 QTime=5 
[junit4:junit4]   2> 17180 T240 C7 P40215 oasc.RecoveryStrategy.doRecovery Attempting to PeerSync from http://127.0.0.1:64893/c_s/st/collection1/ core=collection1 - recoveringAfterStartup=true
[junit4:junit4]   2> 17181 T240 C7 P40215 oasu.PeerSync.sync PeerSync: core=collection1 url=http://127.0.0.1:40215/c_s/st START replicas=[http://127.0.0.1:64893/c_s/st/collection1/] nUpdates=100
[junit4:junit4]   2> 17181 T222 C6 P40188 oash.SnapPuller.fetchLatestIndex Number of files in latest index in master: 1
[junit4:junit4]   2> 17181 T240 C7 P40215 oasu.PeerSync.sync WARNING no frame of reference to tell of we've missed updates
[junit4:junit4]   2> 17182 T240 C7 P40215 oasc.RecoveryStrategy.doRecovery PeerSync Recovery was not successful - trying replication. core=collection1
[junit4:junit4]   2> 17182 T240 C7 P40215 oasc.RecoveryStrategy.doRecovery Starting Replication Recovery. core=collection1
[junit4:junit4]   2> 17183 T240 C7 P40215 oascsi.HttpClientUtil.createClient Creating new http client, config:maxConnections=128&maxConnectionsPerHost=32&followRedirects=false
[junit4:junit4]   2> 17183 T222 C6 P40188 oasc.CachingDirectoryFactory.get return new directory for /usr/home/hudson/hudson-slave/workspace/Lucene-Solr-Tests-trunk-Java6/solr/build/solr-core/test/J1/./org.apache.solr.cloud.SyncSliceTest-1355845925328/jetty3/index.20121218185222503 forceNew:false
[junit4:junit4]   2> 17186 T222 C6 P40188 oasc.CachingDirectoryFactory.close Releasing directory:/usr/home/hudson/hudson-slave/workspace/Lucene-Solr-Tests-trunk-Java6/solr/build/solr-core/test/J1/./org.apache.solr.cloud.SyncSliceTest-1355845925328/jetty3
[junit4:junit4]   2> 17190 T222 C6 P40188 oash.SnapPuller.fetchLatestIndex Starting download to RateLimitedDirectoryWrapper(NRTCachingDirectory(org.apache.lucene.store.NIOFSDirectory@/usr/home/hudson/hudson-slave/workspace/Lucene-Solr-Tests-trunk-Java6/solr/build/solr-core/test/J1/org.apache.solr.cloud.SyncSliceTest-1355845925328/jetty3/index.20121218185222503 lockFactory=org.apache.lucene.store.NativeFSLockFactory@2f30e44c; maxCacheMB=48.0 maxMergeSizeMB=4.0)) fullCopy=true
[junit4:junit4]   2> 17193 T177 C5 P64893 REQ /get {distrib=false&qt=/get&wt=javabin&version=2&getVersions=100} status=0 QTime=0 
[junit4:junit4]   2> 17200 T181 C5 P64893 REQ /replication {file=segments_3&command=filecontent&checksum=true&generation=3&qt=/replication&wt=filestream} status=0 QTime=0 
[junit4:junit4]   2> 17204 T222 C6 P40188 oasc.CachingDirectoryFactory.close Releasing directory:/usr/home/hudson/hudson-slave/workspace/Lucene-Solr-Tests-trunk-Java6/solr/build/solr-core/test/J1/./org.apache.solr.cloud.SyncSliceTest-1355845925328/jetty3/index
[junit4:junit4]   2> 17205 T222 C6 P40188 oash.SnapPuller.fetchLatestIndex Total time taken for download : 0 secs
[junit4:junit4]   2> 17208 T222 C6 P40188 oash.SnapPuller.modifyIndexProps New index installed. Updating index properties... index=index.20121218185222503
[junit4:junit4]   2> 17212 T222 C6 P40188 oasc.CachingDirectoryFactory.close Releasing directory:/usr/home/hudson/hudson-slave/workspace/Lucene-Solr-Tests-trunk-Java6/solr/build/solr-core/test/J1/./org.apache.solr.cloud.SyncSliceTest-1355845925328/jetty3
[junit4:junit4]   2> 17213 T222 C6 P40188 oasc.CachingDirectoryFactory.close Releasing directory:/usr/home/hudson/hudson-slave/workspace/Lucene-Solr-Tests-trunk-Java6/solr/build/solr-core/test/J1/./org.apache.solr.cloud.SyncSliceTest-1355845925328/jetty3
[junit4:junit4]   2> 17213 T222 C6 P40188 oasc.SolrCore.getNewIndexDir New index directory detected: old=./org.apache.solr.cloud.SyncSliceTest-1355845925328/jetty3/index/ new=./org.apache.solr.cloud.SyncSliceTest-1355845925328/jetty3/index.20121218185222503
[junit4:junit4]   2> 17220 T145 oascc.ZkStateReader.updateClusterState Updating cloud state from ZooKeeper... 
[junit4:junit4]   2> 17224 T145 oasc.AbstractFullDistribZkTestBase.waitForThingsToLevelOut Wait for recoveries to finish - wait 15 for each attempt
[junit4:junit4]   2> 17224 T145 oasc.AbstractDistribZkTestBase.waitForRecoveriesToFinish Wait for recoveries to finish - collection: collection1 failOnTimeout:true timeout (sec):15
[junit4:junit4]   2> 17227 T222 C6 P40188 oasc.SolrDeletionPolicy.onInit SolrDeletionPolicy.onInit: commits:num=1
[junit4:junit4]   2> 		commit{dir=RateLimitedDirectoryWrapper(NRTCachingDirectory(org.apache.lucene.store.NIOFSDirectory@/usr/home/hudson/hudson-slave/workspace/Lucene-Solr-Tests-trunk-Java6/solr/build/solr-core/test/J1/org.apache.solr.cloud.SyncSliceTest-1355845925328/jetty3/index.20121218185222503 lockFactory=org.apache.lucene.store.NativeFSLockFactory@2f30e44c; maxCacheMB=48.0 maxMergeSizeMB=4.0)),segFN=segments_3,generation=3,filenames=[segments_3]
[junit4:junit4]   2> 17228 T222 C6 P40188 oasc.SolrDeletionPolicy.updateCommits newest commit = 3[segments_3]
[junit4:junit4]   2> 17227 T145 oascc.ZkStateReader.updateClusterState Updating cloud state from ZooKeeper... 
[junit4:junit4]   2> 17234 T222 C6 P40188 oasc.CachingDirectoryFactory.close Releasing directory:/usr/home/hudson/hudson-slave/workspace/Lucene-Solr-Tests-trunk-Java6/solr/build/solr-core/test/J1/./org.apache.solr.cloud.SyncSliceTest-1355845925328/jetty3
[junit4:junit4]   2> 17235 T222 C6 P40188 oasu.DefaultSolrCoreState.newIndexWriter Creating new IndexWriter...
[junit4:junit4]   2> 17235 T222 C6 P40188 oasu.DefaultSolrCoreState.newIndexWriter Waiting until IndexWriter is unused... core=collection1
[junit4:junit4]   2> 17236 T222 C6 P40188 oasu.DefaultSolrCoreState.newIndexWriter Rollback old IndexWriter... core=collection1
[junit4:junit4]   2> 17238 T222 C6 P40188 oasc.CachingDirectoryFactory.close Releasing directory:/usr/home/hudson/hudson-slave/workspace/Lucene-Solr-Tests-trunk-Java6/solr/build/solr-core/test/J1/./org.apache.solr.cloud.SyncSliceTest-1355845925328/jetty3/index.20121218185222503
[junit4:junit4]   2> 17239 T222 C6 P40188 oasc.CachingDirectoryFactory.close Releasing directory:/usr/home/hudson/hudson-slave/workspace/Lucene-Solr-Tests-trunk-Java6/solr/build/solr-core/test/J1/./org.apache.solr.cloud.SyncSliceTest-1355845925328/jetty3
[junit4:junit4]   2> 17254 T222 C6 P40188 oasc.SolrDeletionPolicy.onInit SolrDeletionPolicy.onInit: commits:num=1
[junit4:junit4]   2> 		commit{dir=RateLimitedDirectoryWrapper(NRTCachingDirectory(org.apache.lucene.store.NIOFSDirectory@/usr/home/hudson/hudson-slave/workspace/Lucene-Solr-Tests-trunk-Java6/solr/build/solr-core/test/J1/org.apache.solr.cloud.SyncSliceTest-1355845925328/jetty3/index.20121218185222503 lockFactory=org.apache.lucene.store.NativeFSLockFactory@2f30e44c; maxCacheMB=48.0 maxMergeSizeMB=4.0)),segFN=segments_3,generation=3,filenames=[segments_3]
[junit4:junit4]   2> 17255 T222 C6 P40188 oasc.SolrDeletionPolicy.updateCommits newest commit = 3[segments_3]
[junit4:junit4]   2> 17256 T222 C6 P40188 oasu.DefaultSolrCoreState.newIndexWriter New IndexWriter is ready to be used.
[junit4:junit4]   2> 17257 T222 C6 P40188 oasc.CachingDirectoryFactory.close Releasing directory:/usr/home/hudson/hudson-slave/workspace/Lucene-Solr-Tests-trunk-Java6/solr/build/solr-core/test/J1/./org.apache.solr.cloud.SyncSliceTest-1355845925328/jetty3
[junit4:junit4]   2> 17258 T222 C6 P40188 oass.SolrIndexSearcher.<init> Opening Searcher@2fe83585 main
[junit4:junit4]   2> 17261 T221 oasc.SolrCore.registerSearcher [collection1] Registered new searcher Searcher@2fe83585 main{StandardDirectoryReader(segments_3:1:nrt)}
[junit4:junit4]   2> 17262 T221 oasc.CachingDirectoryFactory.close Releasing directory:/usr/home/hudson/hudson-slave/workspace/Lucene-Solr-Tests-trunk-Java6/solr/build/solr-core/test/J1/./org.apache.solr.cloud.SyncSliceTest-1355845925328/jetty3/index
[junit4:junit4]   2> 17263 T222 C6 P40188 oasu.DirectUpdateHandler2.commit start commit{flags=0,_version_=0,optimize=false,openSearcher=false,waitSearcher=false,expungeDeletes=false,softCommit=false}
[junit4:junit4]   2> 17267 T222 C6 P40188 oasc.SolrDeletionPolicy.onCommit SolrDeletionPolicy.onCommit: commits:num=2
[junit4:junit4]   2> 		commit{dir=RateLimitedDirectoryWrapper(NRTCachingDirectory(org.apache.lucene.store.NIOFSDirectory@/usr/home/hudson/hudson-slave/workspace/Lucene-Solr-Tests-trunk-Java6/solr/build/solr-core/test/J1/org.apache.solr.cloud.SyncSliceTest-1355845925328/jetty3/index.20121218185222503 lockFactory=org.apache.lucene.store.NativeFSLockFactory@2f30e44c; maxCacheMB=48.0 maxMergeSizeMB=4.0)),segFN=segments_3,generation=3,filenames=[segments_3]
[junit4:junit4]   2> 		commit{dir=RateLimitedDirectoryWrapper(NRTCachingDirectory(org.apache.lucene.store.NIOFSDirectory@/usr/home/hudson/hudson-slave/workspace/Lucene-Solr-Tests-trunk-Java6/solr/build/solr-core/test/J1/org.apache.solr.cloud.SyncSliceTest-1355845925328/jetty3/index.20121218185222503 lockFactory=org.apache.lucene.store.NativeFSLockFactory@2f30e44c; maxCacheMB=48.0 maxMergeSizeMB=4.0)),segFN=segments_4,generation=4,filenames=[segments_4]
[junit4:junit4]   2> 17268 T222 C6 P40188 oasc.SolrDeletionPolicy.updateCommits newest commit = 4[segments_4]
[junit4:junit4]   2> 17270 T222 C6 P40188 oasc.CachingDirectoryFactory.close Releasing directory:/usr/home/hudson/hudson-slave/workspace/Lucene-Solr-Tests-trunk-Java6/solr/build/solr-core/test/J1/./org.apache.solr.cloud.SyncSliceTest-1355845925328/jetty3
[junit4:junit4]   2> 17270 T222 C6 P40188 oasu.DirectUpdateHandler2.commit end_commit_flush
[junit4:junit4]   2> 17270 T222 C6 P40188 oasc.CachingDirectoryFactory.close Releasing directory:/usr/home/hudson/hudson-slave/workspace/Lucene-Solr-Tests-trunk-Java6/solr/build/solr-core/test/J1/./org.apache.solr.cloud.SyncSliceTest-1355845925328/jetty3/index.20121218185222503
[junit4:junit4]   2> 17271 T222 C6 P40188 oasc.CachingDirectoryFactory.close Releasing directory:/usr/home/hudson/hudson-slave/workspace/Lucene-Solr-Tests-trunk-Java6/solr/build/solr-core/test/J1/./org.apache.solr.cloud.SyncSliceTest-1355845925328/jetty3/index
[junit4:junit4]   2> 17271 T222 C6 P40188 oasc.RecoveryStrategy.replay No replay needed. core=collection1
[junit4:junit4]   2> 17272 T222 C6 P40188 oasc.RecoveryStrategy.doRecovery Replication Recovery was successful - registering as Active. core=collection1
[junit4:junit4]   2> 17272 T222 C6 P40188 oasc.ZkController.publish publishing core=collection1 state=active
[junit4:junit4]   2> 17273 T222 C6 P40188 oasc.ZkController.publish numShards not found on descriptor - reading it from system property
[junit4:junit4]   2> 17276 T222 C6 P40188 oasc.RecoveryStrategy.doRecovery Finished recovery process. core=collection1
[junit4:junit4]   2> 17668 T169 oascc.ZkStateReader.updateClusterState Updating cloud state from ZooKeeper... 
[junit4:junit4]   2> 17673 T169 oasc.Overseer$ClusterStateUpdater.updateState Update state numShards=1 message={
[junit4:junit4]   2> 	  "operation":"state",
[junit4:junit4]   2> 	  "numShards":"1",
[junit4:junit4]   2> 	  "shard":"shard1",
[junit4:junit4]   2> 	  "roles":null,
[junit4:junit4]   2> 	  "state":"recovering",
[junit4:junit4]   2> 	  "core":"collection1",
[junit4:junit4]   2> 	  "collection":"collection1",
[junit4:junit4]   2> 	  "node_name":"127.0.0.1:40215_c_s%2Fst",
[junit4:junit4]   2> 	  "base_url":"http://127.0.0.1:40215/c_s/st"}
[junit4:junit4]   2> 17686 T169 oasc.Overseer$ClusterStateUpdater.updateState Update state numShards=1 message={
[junit4:junit4]   2> 	  "operation":"state",
[junit4:junit4]   2> 	  "numShards":"1",
[junit4:junit4]   2> 	  "shard":"shard1",
[junit4:junit4]   2> 	  "roles":null,
[junit4:junit4]   2> 	  "state":"active",
[junit4:junit4]   2> 	  "core":"collection1",
[junit4:junit4]   2> 	  "collection":"collection1",
[junit4:junit4]   2> 	  "node_name":"127.0.0.1:40188_c_s%2Fst",
[junit4:junit4]   2> 	  "base_url":"http://127.0.0.1:40188/c_s/st"}
[junit4:junit4]   2> 17700 T168 oascc.ZkStateReader$2.process A cluster state change: WatchedEvent state:SyncConnected type:NodeDataChanged path:/clusterstate.json, has occurred - updating... (live nodes size: 5)
[junit4:junit4]   2> 17700 T219 oascc.ZkStateReader$2.process A cluster state change: WatchedEvent state:SyncConnected type:NodeDataChanged path:/clusterstate.json, has occurred - updating... (live nodes size: 5)
[junit4:junit4]   2> 17700 T236 oascc.ZkStateReader$2.process A cluster state change: WatchedEvent state:SyncConnected type:NodeDataChanged path:/clusterstate.json, has occurred - updating... (live nodes size: 5)
[junit4:junit4]   2> 17700 T174 oascc.ZkStateReader$2.process A cluster state change: WatchedEvent state:SyncConnected type:NodeDataChanged path:/clusterstate.json, has occurred - updating... (live nodes size: 5)
[junit4:junit4]   2> 17700 T187 oascc.ZkStateReader$2.process A cluster state change: WatchedEvent state:SyncConnected type:NodeDataChanged path:/clusterstate.json, has occurred - updating... (live nodes size: 5)
[junit4:junit4]   2> 17701 T202 oascc.ZkStateReader$2.process A cluster state change: WatchedEvent state:SyncConnected type:NodeDataChanged path:/clusterstate.json, has occurred - updating... (live nodes size: 5)
[junit4:junit4]   2> 18237 T145 oascc.ZkStateReader.updateClusterState Updating cloud state from ZooKeeper... 
[junit4:junit4]   2> 19244 T145 oascc.ZkStateReader.updateClusterState Updating cloud state from ZooKeeper... 
[junit4:junit4]   2> 20261 T145 oascc.ZkStateReader.updateClusterState Updating cloud state from ZooKeeper... 
[junit4:junit4]   2>  C7_STATE=coll:collection1 core:collection1 props:{shard=shard1, roles=null, state=recovering, core=collection1, collection=collection1, node_name=127.0.0.1:40215_c_s%2Fst, base_url=http://127.0.0.1:40215/c_s/st}
[junit4:junit4]   2> 20276 T240 C7 P40215 oasc.RecoveryStrategy.doRecovery Begin buffering updates. core=collection1
[junit4:junit4]   2> 20276 T240 C7 P40215 oasu.UpdateLog.bufferUpdates Starting to buffer updates. FSUpdateLog{state=ACTIVE, tlog=null}
[junit4:junit4]   2> 20277 T240 C7 P40215 oasc.RecoveryStrategy.replicate Attempting to replicate from http://127.0.0.1:64893/c_s/st/collection1/. core=collection1
[junit4:junit4]   2> 20277 T240 C7 P40215 oascsi.HttpClientUtil.createClient Creating new http client, config:maxConnections=128&maxConnectionsPerHost=32&followRedirects=false
[junit4:junit4]   2> 20733 T178 C5 P64893 oasu.DirectUpdateHandler2.commit start commit{flags=0,_version_=0,optimize=false,openSearcher=false,waitSearcher=true,expungeDeletes=false,softCommit=false}
[junit4:junit4]   2> 20758 T178 C5 P64893 oasc.SolrDeletionPolicy.onCommit SolrDeletionPolicy.onCommit: commits:num=3
[junit4:junit4]   2> 		commit{dir=RateLimitedDirectoryWrapper(NRTCachingDirectory(org.apache.lucene.store.NIOFSDirectory@/usr/home/hudson/hudson-slave/workspace/Lucene-Solr-Tests-trunk-Java6/solr/build/solr-core/test/J1/org.apache.solr.cloud.SyncSliceTest-1355845925328/jetty1/index lockFactory=org.apache.lucene.store.NativeFSLockFactory@671bd50e; maxCacheMB=48.0 maxMergeSizeMB=4.0)),segFN=segments_2,generation=2,filenames=[segments_2]
[junit4:junit4]   2> 		commit{dir=RateLimitedDirectoryWrapper(NRTCachingDirectory(org.apache.lucene.store.NIOFSDirectory@/usr/home/hudson/hudson-slave/workspace/Lucene-Solr-Tests-trunk-Java6/solr/build/solr-core/test/J1/org.apache.solr.cloud.SyncSliceTest-1355845925328/jetty1/index lockFactory=org.apache.lucene.store.NativeFSLockFactory@671bd50e; maxCacheMB=48.0 maxMergeSizeMB=4.0)),segFN=segments_3,generation=3,filenames=[segments_3]
[junit4:junit4]   2> 		commit{dir=RateLimitedDirectoryWrapper(NRTCachingDirectory(org.apache.lucene.store.NIOFSDirectory@/usr/home/hudson/hudson-slave/workspace/Lucene-Solr-Tests-trunk-Java6/solr/build/solr-core/test/J1/org.apache.solr.cloud.SyncSliceTest-1355845925328/jetty1/index lockFactory=org.apache.lucene.store.NativeFSLockFactory@671bd50e; maxCacheMB=48.0 maxMergeSizeMB=4.0)),segFN=segments_4,generation=4,filenames=[segments_4]
[junit4:junit4]   2> 20759 T178 C5 P64893 oasc.SolrDeletionPolicy.updateCommits newest commit = 4[segments_4]
[junit4:junit4]   2> 20763 T178 C5 P64893 oasc.CachingDirectoryFactory.close Releasing directory:/usr/home/hudson/hudson-slave/workspace/Lucene-Solr-Tests-trunk-Java6/solr/build/solr-core/test/J1/./org.apache.solr.cloud.SyncSliceTest-1355845925328/jetty1
[junit4:junit4]   2> 20764 T178 C5 P64893 oasu.DirectUpdateHandler2.commit end_commit_flush
[junit4:junit4]   2> 20764 T178 C5 P64893 /update {waitSearcher=true&openSearcher=false&commit=true&commit_end_point=true&wt=javabin&softCommit=false&version=2} {commit=} 0 31
[junit4:junit4]   2> 20767 T240 C7 P40215 oash.ReplicationHandler.inform Commits will be reserved for  10000
[junit4:junit4]   2> 20768 T240 C7 P40215 oash.SnapPuller.<init>  No value set for 'pollInterval'. Timer Task not started.
[junit4:junit4]   2> 20772 T181 C5 P64893 REQ /replication {command=indexversion&wt=javabin&qt=/replication&version=2} status=0 QTime=0 
[junit4:junit4]   2> 20774 T240 C7 P40215 oash.SnapPuller.fetchLatestIndex Master's generation: 4
[junit4:junit4]   2> 20775 T240 C7 P40215 oash.SnapPuller.fetchLatestIndex Slave's generation: 1
[junit4:junit4]   2> 20776 T240 C7 P40215 oash.SnapPuller.fetchLatestIndex Starting replication process
[junit4:junit4]   2> 20779 T181 C5 P64893 oasc.CachingDirectoryFactory.close Releasing directory:/usr/home/hudson/hudson-slave/workspace/Lucene-Solr-Tests-trunk-Java6/solr/build/solr-core/test/J1/./org.apache.solr.cloud.SyncSliceTest-1355845925328/jetty1
[junit4:junit4]   2> 20782 T181 C5 P64893 oasc.CachingDirectoryFactory.close Releasing directory:/usr/home/hudson/hudson-slave/workspace/Lucene-Solr-Tests-trunk-Java6/solr/build/solr-core/test/J1/./org.apache.solr.cloud.SyncSliceTest-1355845925328/jetty1/index
[junit4:junit4]   2> 20783 T181

[...truncated too long message...]

  2> 131189 T145 oasc.CachingDirectoryFactory.close Closing directory:/usr/home/hudson/hudson-slave/workspace/Lucene-Solr-Tests-trunk-Java6/solr/build/solr-core/test/J1/./org.apache.solr.cloud.SyncSliceTest-1355845925328/jetty4/index.20121218185226106
[junit4:junit4]   2> 131190 T145 oash.SnapPuller$2.preClose removing old index files RateLimitedDirectoryWrapper(NRTCachingDirectory(org.apache.lucene.store.NIOFSDirectory@/usr/home/hudson/hudson-slave/workspace/Lucene-Solr-Tests-trunk-Java6/solr/build/solr-core/test/J1/org.apache.solr.cloud.SyncSliceTest-1355845925328/jetty4/index lockFactory=org.apache.lucene.store.NativeFSLockFactory@1fcc4f8; maxCacheMB=48.0 maxMergeSizeMB=4.0))
[junit4:junit4]   2> 131192 T145 oasc.CachingDirectoryFactory.close Closing directory:/usr/home/hudson/hudson-slave/workspace/Lucene-Solr-Tests-trunk-Java6/solr/build/solr-core/test/J1/./org.apache.solr.cloud.SyncSliceTest-1355845925328/jetty4/index.20121218185226106
[junit4:junit4]   2> 131193 T145 oash.SnapPuller$2.postClose removing old index directory RateLimitedDirectoryWrapper(NRTCachingDirectory(org.apache.lucene.store.NIOFSDirectory@/usr/home/hudson/hudson-slave/workspace/Lucene-Solr-Tests-trunk-Java6/solr/build/solr-core/test/J1/org.apache.solr.cloud.SyncSliceTest-1355845925328/jetty4/index lockFactory=org.apache.lucene.store.NativeFSLockFactory@1fcc4f8; maxCacheMB=48.0 maxMergeSizeMB=4.0))
[junit4:junit4]   2> 131195 T145 oasc.CachingDirectoryFactory.close Closing directory when closing factory:/usr/home/hudson/hudson-slave/workspace/Lucene-Solr-Tests-trunk-Java6/solr/build/solr-core/test/J1/./org.apache.solr.cloud.SyncSliceTest-1355845925328/jetty4/index
[junit4:junit4]   2> 131195 T145 oasc.CachingDirectoryFactory.close Closing directory when closing factory:/usr/home/hudson/hudson-slave/workspace/Lucene-Solr-Tests-trunk-Java6/solr/build/solr-core/test/J1/./org.apache.solr.cloud.SyncSliceTest-1355845925328/jetty4
[junit4:junit4]   2> 131414 T236 oaz.ClientCnxn$EventThread.run EventThread shut down
[junit4:junit4]   2> 131414 T145 oaz.ZooKeeper.close Session: 0x13baeb6f9d6000c closed
[junit4:junit4]   2> 131416 T145 oejsh.ContextHandler.doStop stopped o.e.j.s.ServletContextHandler{/c_s/st,null}
[junit4:junit4]   2> 131574 T145 oas.SolrTestCaseJ4.tearDown ###Ending testDistribSearch
[junit4:junit4]   1> client port:0.0.0.0/0.0.0.0:0
[junit4:junit4]   2> NOTE: reproduce with: ant test  -Dtestcase=SyncSliceTest -Dtests.method=testDistribSearch -Dtests.seed=E7F8EAEDE8F1510E -Dtests.multiplier=3 -Dtests.slow=true -Dtests.locale=ar_TN -Dtests.timezone=Asia/Kuwait -Dtests.file.encoding=UTF-8
[junit4:junit4] FAILURE  132s J1 | SyncSliceTest.testDistribSearch <<<
[junit4:junit4]    > Throwable #1: java.lang.AssertionError
[junit4:junit4]    > 	at __randomizedtesting.SeedInfo.seed([E7F8EAEDE8F1510E:661E64F59FAE3132]:0)
[junit4:junit4]    > 	at org.junit.Assert.fail(Assert.java:92)
[junit4:junit4]    > 	at org.junit.Assert.assertTrue(Assert.java:43)
[junit4:junit4]    > 	at org.junit.Assert.assertNotNull(Assert.java:526)
[junit4:junit4]    > 	at org.junit.Assert.assertNotNull(Assert.java:537)
[junit4:junit4]    > 	at org.apache.solr.cloud.SyncSliceTest.doTest(SyncSliceTest.java:211)
[junit4:junit4]    > 	at org.apache.solr.BaseDistributedSearchTestCase.testDistribSearch(BaseDistributedSearchTestCase.java:794)
[junit4:junit4]    > 	at sun.reflect.NativeMethodAccessorImpl.invoke0(Native Method)
[junit4:junit4]    > 	at sun.reflect.NativeMethodAccessorImpl.invoke(NativeMethodAccessorImpl.java:57)
[junit4:junit4]    > 	at sun.reflect.DelegatingMethodAccessorImpl.invoke(DelegatingMethodAccessorImpl.java:43)
[junit4:junit4]    > 	at java.lang.reflect.Method.invoke(Method.java:616)
[junit4:junit4]    > 	at com.carrotsearch.randomizedtesting.RandomizedRunner.invoke(RandomizedRunner.java:1559)
[junit4:junit4]    > 	at com.carrotsearch.randomizedtesting.RandomizedRunner.access$600(RandomizedRunner.java:79)
[junit4:junit4]    > 	at com.carrotsearch.randomizedtesting.RandomizedRunner$6.evaluate(RandomizedRunner.java:737)
[junit4:junit4]    > 	at com.carrotsearch.randomizedtesting.RandomizedRunner$7.evaluate(RandomizedRunner.java:773)
[junit4:junit4]    > 	at com.carrotsearch.randomizedtesting.RandomizedRunner$8.evaluate(RandomizedRunner.java:787)
[junit4:junit4]    > 	at com.carrotsearch.randomizedtesting.rules.SystemPropertiesRestoreRule$1.evaluate(SystemPropertiesRestoreRule.java:53)
[junit4:junit4]    > 	at org.apache.lucene.util.TestRuleSetupTeardownChained$1.evaluate(TestRuleSetupTeardownChained.java:50)
[junit4:junit4]    > 	at org.apache.lucene.util.TestRuleFieldCacheSanity$1.evaluate(TestRuleFieldCacheSanity.java:51)
[junit4:junit4]    > 	at org.apache.lucene.util.AbstractBeforeAfterRule$1.evaluate(AbstractBeforeAfterRule.java:46)
[junit4:junit4]    > 	at com.carrotsearch.randomizedtesting.rules.SystemPropertiesInvariantRule$1.evaluate(SystemPropertiesInvariantRule.java:55)
[junit4:junit4]    > 	at org.apache.lucene.util.TestRuleThreadAndTestName$1.evaluate(TestRuleThreadAndTestName.java:49)
[junit4:junit4]    > 	at org.apache.lucene.util.TestRuleIgnoreAfterMaxFailures$1.evaluate(TestRuleIgnoreAfterMaxFailures.java:70)
[junit4:junit4]    > 	at org.apache.lucene.util.TestRuleMarkFailure$1.evaluate(TestRuleMarkFailure.java:48)
[junit4:junit4]    > 	at com.carrotsearch.randomizedtesting.rules.StatementAdapter.evaluate(StatementAdapter.java:36)
[junit4:junit4]    > 	at com.carrotsearch.randomizedtesting.ThreadLeakControl$StatementRunner.run(ThreadLeakControl.java:358)
[junit4:junit4]    > 	at com.carrotsearch.randomizedtesting.ThreadLeakControl.forkTimeoutingTask(ThreadLeakControl.java:782)
[junit4:junit4]    > 	at com.carrotsearch.randomizedtesting.ThreadLeakControl$3.evaluate(ThreadLeakControl.java:442)
[junit4:junit4]    > 	at com.carrotsearch.randomizedtesting.RandomizedRunner.runSingleTest(RandomizedRunner.java:746)
[junit4:junit4]    > 	at com.carrotsearch.randomizedtesting.RandomizedRunner$3.evaluate(RandomizedRunner.java:648)
[junit4:junit4]    > 	at com.carrotsearch.randomizedtesting.RandomizedRunner$4.evaluate(RandomizedRunner.java:682)
[junit4:junit4]    > 	at com.carrotsearch.randomizedtesting.RandomizedRunner$5.evaluate(RandomizedRunner.java:693)
[junit4:junit4]    > 	at com.carrotsearch.randomizedtesting.rules.StatementAdapter.evaluate(StatementAdapter.java:36)
[junit4:junit4]    > 	at com.carrotsearch.randomizedtesting.rules.SystemPropertiesRestoreRule$1.evaluate(SystemPropertiesRestoreRule.java:53)
[junit4:junit4]    > 	at org.apache.lucene.util.AbstractBeforeAfterRule$1.evaluate(AbstractBeforeAfterRule.java:46)
[junit4:junit4]    > 	at org.apache.lucene.util.TestRuleStoreClassName$1.evaluate(TestRuleStoreClassName.java:42)
[junit4:junit4]    > 	at com.carrotsearch.randomizedtesting.rules.SystemPropertiesInvariantRule$1.evaluate(SystemPropertiesInvariantRule.java:55)
[junit4:junit4]    > 	at com.carrotsearch.randomizedtesting.rules.NoShadowingOrOverridesOnMethodsRule$1.evaluate(NoShadowingOrOverridesOnMethodsRule.java:39)
[junit4:junit4]    > 	at com.carrotsearch.randomizedtesting.rules.NoShadowingOrOverridesOnMethodsRule$1.evaluate(NoShadowingOrOverridesOnMethodsRule.java:39)
[junit4:junit4]    > 	at com.carrotsearch.randomizedtesting.rules.StatementAdapter.evaluate(StatementAdapter.java:36)
[junit4:junit4]    > 	at org.apache.lucene.util.TestRuleAssertionsRequired$1.evaluate(TestRuleAssertionsRequired.java:43)
[junit4:junit4]    > 	at org.apache.lucene.util.TestRuleMarkFailure$1.evaluate(TestRuleMarkFailure.java:48)
[junit4:junit4]    > 	at org.apache.lucene.util.TestRuleIgnoreAfterMaxFailures$1.evaluate(TestRuleIgnoreAfterMaxFailures.java:70)
[junit4:junit4]    > 	at org.apache.lucene.util.TestRuleIgnoreTestSuites$1.evaluate(TestRuleIgnoreTestSuites.java:55)
[junit4:junit4]    > 	at com.carrotsearch.randomizedtesting.rules.StatementAdapter.evaluate(StatementAdapter.java:36)
[junit4:junit4]    > 	at com.carrotsearch.randomizedtesting.ThreadLeakControl$StatementRunner.run(ThreadLeakControl.java:358)
[junit4:junit4]    > 	at java.lang.Thread.run(Thread.java:679)
[junit4:junit4]   2> 131669 T145 oas.SolrTestCaseJ4.deleteCore ###deleteCore
[junit4:junit4]   2> NOTE: test params are: codec=Lucene40, sim=DefaultSimilarity, locale=ar_TN, timezone=Asia/Kuwait
[junit4:junit4]   2> NOTE: FreeBSD 9.0-RELEASE amd64/Sun Microsystems Inc. 1.6.0_32 (64-bit)/cpus=16,threads=2,free=367288744,total=482410496
[junit4:junit4]   2> NOTE: All tests run in this JVM: [DirectUpdateHandlerTest, SolrCoreTest, CoreContainerCoreInitFailuresTest, OverseerCollectionProcessorTest, ZkSolrClientTest, TestPluginEnable, TestCodecSupport, TestLRUCache, TestDocumentBuilder, TestHashPartitioner, ResponseLogComponentTest, PrimUtilsTest, SyncSliceTest]
[junit4:junit4] Completed on J1 in 131.70s, 1 test, 1 failure <<< FAILURES!

[...truncated 622 lines...]
BUILD FAILED
/usr/home/hudson/hudson-slave/workspace/Lucene-Solr-Tests-trunk-Java6/build.xml:353: The following error occurred while executing this line:
/usr/home/hudson/hudson-slave/workspace/Lucene-Solr-Tests-trunk-Java6/build.xml:39: The following error occurred while executing this line:
/usr/home/hudson/hudson-slave/workspace/Lucene-Solr-Tests-trunk-Java6/solr/build.xml:178: The following error occurred while executing this line:
/usr/home/hudson/hudson-slave/workspace/Lucene-Solr-Tests-trunk-Java6/solr/common-build.xml:438: The following error occurred while executing this line:
/usr/home/hudson/hudson-slave/workspace/Lucene-Solr-Tests-trunk-Java6/lucene/common-build.xml:1175: The following error occurred while executing this line:
/usr/home/hudson/hudson-slave/workspace/Lucene-Solr-Tests-trunk-Java6/lucene/common-build.xml:840: There were test failures: 242 suites, 1007 tests, 1 failure, 21 ignored (3 assumptions)

Total time: 31 minutes 19 seconds
Build step 'Invoke Ant' marked build as failure
Archiving artifacts
Recording test results
Email was triggered for: Failure
Sending email for trigger: Failure



Mime
View raw message