lucene-dev mailing list archives

Site index · List index
Message view « Date » · « Thread »
Top « Date » · « Thread »
From Apache Jenkins Server <jenk...@builds.apache.org>
Subject [JENKINS] Lucene-Solr-NightlyTests-4.x - Build # 124 - Still Failing
Date Mon, 17 Dec 2012 15:04:36 GMT
Build: https://builds.apache.org/job/Lucene-Solr-NightlyTests-4.x/124/

1 tests failed.
FAILED:  org.apache.solr.cloud.BasicDistributedZkTest.testDistribSearch

Error Message:
Captured an uncaught exception in thread: Thread[id=3215, name=testExecutor-2770-thread-42, state=RUNNABLE, group=TGRP-BasicDistributedZkTest]

Stack Trace:
com.carrotsearch.randomizedtesting.UncaughtExceptionError: Captured an uncaught exception in thread: Thread[id=3215, name=testExecutor-2770-thread-42, state=RUNNABLE, group=TGRP-BasicDistributedZkTest]
Caused by: java.lang.RuntimeException: org.apache.solr.client.solrj.SolrServerException: IOException occured when talking to server at: http://127.0.0.1:29829
	at __randomizedtesting.SeedInfo.seed([19AFAF7A9A3E4804]:0)
	at org.apache.solr.cloud.BasicDistributedZkTest$2.run(BasicDistributedZkTest.java:722)
	at java.util.concurrent.ThreadPoolExecutor.runWorker(ThreadPoolExecutor.java:1110)
	at java.util.concurrent.ThreadPoolExecutor$Worker.run(ThreadPoolExecutor.java:603)
	at java.lang.Thread.run(Thread.java:679)
Caused by: org.apache.solr.client.solrj.SolrServerException: IOException occured when talking to server at: http://127.0.0.1:29829
	at org.apache.solr.client.solrj.impl.HttpSolrServer.request(HttpSolrServer.java:413)
	at org.apache.solr.client.solrj.impl.HttpSolrServer.request(HttpSolrServer.java:181)
	at org.apache.solr.cloud.BasicDistributedZkTest$2.run(BasicDistributedZkTest.java:720)
	... 3 more
Caused by: org.apache.http.conn.ConnectionPoolTimeoutException: Timeout waiting for connection
	at org.apache.http.impl.conn.tsccm.ConnPoolByRoute.getEntryBlocking(ConnPoolByRoute.java:417)
	at org.apache.http.impl.conn.tsccm.ConnPoolByRoute$1.getPoolEntry(ConnPoolByRoute.java:300)
	at org.apache.http.impl.conn.tsccm.ThreadSafeClientConnManager$1.getConnection(ThreadSafeClientConnManager.java:224)
	at org.apache.http.impl.client.DefaultRequestDirector.execute(DefaultRequestDirector.java:401)
	at org.apache.http.impl.client.AbstractHttpClient.execute(AbstractHttpClient.java:820)
	at org.apache.http.impl.client.AbstractHttpClient.execute(AbstractHttpClient.java:754)
	at org.apache.http.impl.client.AbstractHttpClient.execute(AbstractHttpClient.java:732)
	at org.apache.solr.client.solrj.impl.HttpSolrServer.request(HttpSolrServer.java:352)
	... 5 more




Build Log:
[...truncated 8321 lines...]
[junit4:junit4] Suite: org.apache.solr.cloud.BasicDistributedZkTest
[junit4:junit4]   2> 0 T1377 oas.BaseDistributedSearchTestCase.initHostContext Setting hostContext system property: /
[junit4:junit4]   2> 5 T1377 oas.SolrTestCaseJ4.setUp ###Starting testDistribSearch
[junit4:junit4]   2> Creating dataDir: /usr/home/hudson/hudson-slave/workspace/Lucene-Solr-NightlyTests-4.x/solr/build/solr-core/test/J0/./solrtest-BasicDistributedZkTest-1355729494208
[junit4:junit4]   2> 7 T1377 oasc.ZkTestServer.run STARTING ZK TEST SERVER
[junit4:junit4]   2> 7 T1378 oasc.ZkTestServer$ZKServerMain.runFromConfig Starting server
[junit4:junit4]   2> 11 T1378 oazs.ZooKeeperServer.setTickTime tickTime set to 1000
[junit4:junit4]   2> 11 T1378 oazs.ZooKeeperServer.setMinSessionTimeout minSessionTimeout set to -1
[junit4:junit4]   2> 11 T1378 oazs.ZooKeeperServer.setMaxSessionTimeout maxSessionTimeout set to -1
[junit4:junit4]   2> 11 T1378 oazs.NIOServerCnxnFactory.configure binding to port 0.0.0.0/0.0.0.0:0
[junit4:junit4]   2> 12 T1378 oazsp.FileTxnSnapLog.save Snapshotting: 0x0 to /usr/home/hudson/hudson-slave/workspace/Lucene-Solr-NightlyTests-4.x/solr/build/solr-core/test/J0/./org.apache.solr.cloud.BasicDistributedZkTest-1355729494208/zookeeper/server1/data/version-2/snapshot.0
[junit4:junit4]   2> 108 T1377 oasc.ZkTestServer.run start zk server on port:27598
[junit4:junit4]   2> 109 T1377 oaz.ZooKeeper.<init> Initiating client connection, connectString=127.0.0.1:27598 sessionTimeout=10000 watcher=org.apache.solr.common.cloud.ConnectionManager@26fb554c
[junit4:junit4]   2> 110 T1377 oascc.ConnectionManager.waitForConnected Waiting for client to connect to ZooKeeper
[junit4:junit4]   2> 110 T1383 oaz.ClientCnxn$SendThread.logStartConnect Opening socket connection to server localhost/127.0.0.1:27598. Will not attempt to authenticate using SASL (access denied (javax.security.auth.AuthPermission getLoginConfiguration))
[junit4:junit4]   2> 110 T1383 oaz.ClientCnxn$SendThread.primeConnection Socket connection established to localhost/127.0.0.1:27598, initiating session
[junit4:junit4]   2> 111 T1379 oazs.NIOServerCnxnFactory.run Accepted socket connection from /140.211.11.196:55733
[junit4:junit4]   2> 111 T1379 oazs.ZooKeeperServer.processConnectRequest Client attempting to establish new session at /140.211.11.196:55733
[junit4:junit4]   2> 112 T1381 oazsp.FileTxnLog.append Creating new log file: log.1
[junit4:junit4]   2> 114 T1381 oazs.ZooKeeperServer.finishSessionInit Established session 0x13ba7c660c70000 with negotiated timeout 10000 for client /140.211.11.196:55733
[junit4:junit4]   2> 114 T1383 oaz.ClientCnxn$SendThread.onConnected Session establishment complete on server localhost/127.0.0.1:27598, sessionid = 0x13ba7c660c70000, negotiated timeout = 10000
[junit4:junit4]   2> 114 T1384 oascc.ConnectionManager.process Watcher org.apache.solr.common.cloud.ConnectionManager@26fb554c name:ZooKeeperConnection Watcher:127.0.0.1:27598 got event WatchedEvent state:SyncConnected type:None path:null path:null type:None
[junit4:junit4]   2> 115 T1377 oascc.ConnectionManager.waitForConnected Client is connected to ZooKeeper
[junit4:junit4]   2> 115 T1377 oascc.SolrZkClient.makePath makePath: /solr
[junit4:junit4]   2> 119 T1382 oazs.PrepRequestProcessor.pRequest2Txn Processed session termination for sessionid: 0x13ba7c660c70000
[junit4:junit4]   2> 126 T1384 oaz.ClientCnxn$EventThread.run EventThread shut down
[junit4:junit4]   2> 126 T1379 oazs.NIOServerCnxn.closeSock Closed socket connection for client /140.211.11.196:55733 which had sessionid 0x13ba7c660c70000
[junit4:junit4]   2> 126 T1377 oaz.ZooKeeper.close Session: 0x13ba7c660c70000 closed
[junit4:junit4]   2> 127 T1377 oaz.ZooKeeper.<init> Initiating client connection, connectString=127.0.0.1:27598/solr sessionTimeout=10000 watcher=org.apache.solr.common.cloud.ConnectionManager@66e74f94
[junit4:junit4]   2> 128 T1377 oascc.ConnectionManager.waitForConnected Waiting for client to connect to ZooKeeper
[junit4:junit4]   2> 128 T1385 oaz.ClientCnxn$SendThread.logStartConnect Opening socket connection to server localhost/127.0.0.1:27598. Will not attempt to authenticate using SASL (access denied (javax.security.auth.AuthPermission getLoginConfiguration))
[junit4:junit4]   2> 129 T1385 oaz.ClientCnxn$SendThread.primeConnection Socket connection established to localhost/127.0.0.1:27598, initiating session
[junit4:junit4]   2> 129 T1379 oazs.NIOServerCnxnFactory.run Accepted socket connection from /140.211.11.196:41854
[junit4:junit4]   2> 129 T1379 oazs.ZooKeeperServer.processConnectRequest Client attempting to establish new session at /140.211.11.196:41854
[junit4:junit4]   2> 131 T1381 oazs.ZooKeeperServer.finishSessionInit Established session 0x13ba7c660c70001 with negotiated timeout 10000 for client /140.211.11.196:41854
[junit4:junit4]   2> 131 T1385 oaz.ClientCnxn$SendThread.onConnected Session establishment complete on server localhost/127.0.0.1:27598, sessionid = 0x13ba7c660c70001, negotiated timeout = 10000
[junit4:junit4]   2> 131 T1386 oascc.ConnectionManager.process Watcher org.apache.solr.common.cloud.ConnectionManager@66e74f94 name:ZooKeeperConnection Watcher:127.0.0.1:27598/solr got event WatchedEvent state:SyncConnected type:None path:null path:null type:None
[junit4:junit4]   2> 131 T1377 oascc.ConnectionManager.waitForConnected Client is connected to ZooKeeper
[junit4:junit4]   2> 132 T1377 oascc.SolrZkClient.makePath makePath: /collections/collection1
[junit4:junit4]   2> 143 T1377 oascc.SolrZkClient.makePath makePath: /collections/collection1/shards
[junit4:junit4]   2> 146 T1377 oascc.SolrZkClient.makePath makePath: /collections/control_collection
[junit4:junit4]   2> 149 T1377 oascc.SolrZkClient.makePath makePath: /collections/control_collection/shards
[junit4:junit4]   2> 158 T1377 oasc.AbstractZkTestCase.putConfig put /usr/home/hudson/hudson-slave/workspace/Lucene-Solr-NightlyTests-4.x/solr/build/solr-core/test-files/solr/collection1/conf/solrconfig.xml to /configs/conf1/solrconfig.xml
[junit4:junit4]   2> 159 T1377 oascc.SolrZkClient.makePath makePath: /configs/conf1/solrconfig.xml
[junit4:junit4]   2> 172 T1377 oasc.AbstractZkTestCase.putConfig put /usr/home/hudson/hudson-slave/workspace/Lucene-Solr-NightlyTests-4.x/solr/build/solr-core/test-files/solr/collection1/conf/schema.xml to /configs/conf1/schema.xml
[junit4:junit4]   2> 173 T1377 oascc.SolrZkClient.makePath makePath: /configs/conf1/schema.xml
[junit4:junit4]   2> 279 T1377 oasc.AbstractZkTestCase.putConfig put /usr/home/hudson/hudson-slave/workspace/Lucene-Solr-NightlyTests-4.x/solr/build/solr-core/test-files/solr/collection1/conf/stopwords.txt to /configs/conf1/stopwords.txt
[junit4:junit4]   2> 280 T1377 oascc.SolrZkClient.makePath makePath: /configs/conf1/stopwords.txt
[junit4:junit4]   2> 283 T1377 oasc.AbstractZkTestCase.putConfig put /usr/home/hudson/hudson-slave/workspace/Lucene-Solr-NightlyTests-4.x/solr/build/solr-core/test-files/solr/collection1/conf/protwords.txt to /configs/conf1/protwords.txt
[junit4:junit4]   2> 284 T1377 oascc.SolrZkClient.makePath makePath: /configs/conf1/protwords.txt
[junit4:junit4]   2> 294 T1377 oasc.AbstractZkTestCase.putConfig put /usr/home/hudson/hudson-slave/workspace/Lucene-Solr-NightlyTests-4.x/solr/build/solr-core/test-files/solr/collection1/conf/currency.xml to /configs/conf1/currency.xml
[junit4:junit4]   2> 295 T1377 oascc.SolrZkClient.makePath makePath: /configs/conf1/currency.xml
[junit4:junit4]   2> 299 T1377 oasc.AbstractZkTestCase.putConfig put /usr/home/hudson/hudson-slave/workspace/Lucene-Solr-NightlyTests-4.x/solr/build/solr-core/test-files/solr/collection1/conf/open-exchange-rates.json to /configs/conf1/open-exchange-rates.json
[junit4:junit4]   2> 300 T1377 oascc.SolrZkClient.makePath makePath: /configs/conf1/open-exchange-rates.json
[junit4:junit4]   2> 303 T1377 oasc.AbstractZkTestCase.putConfig put /usr/home/hudson/hudson-slave/workspace/Lucene-Solr-NightlyTests-4.x/solr/build/solr-core/test-files/solr/collection1/conf/mapping-ISOLatin1Accent.txt to /configs/conf1/mapping-ISOLatin1Accent.txt
[junit4:junit4]   2> 304 T1377 oascc.SolrZkClient.makePath makePath: /configs/conf1/mapping-ISOLatin1Accent.txt
[junit4:junit4]   2> 308 T1377 oasc.AbstractZkTestCase.putConfig put /usr/home/hudson/hudson-slave/workspace/Lucene-Solr-NightlyTests-4.x/solr/build/solr-core/test-files/solr/collection1/conf/old_synonyms.txt to /configs/conf1/old_synonyms.txt
[junit4:junit4]   2> 308 T1377 oascc.SolrZkClient.makePath makePath: /configs/conf1/old_synonyms.txt
[junit4:junit4]   2> 312 T1377 oasc.AbstractZkTestCase.putConfig put /usr/home/hudson/hudson-slave/workspace/Lucene-Solr-NightlyTests-4.x/solr/build/solr-core/test-files/solr/collection1/conf/synonyms.txt to /configs/conf1/synonyms.txt
[junit4:junit4]   2> 313 T1377 oascc.SolrZkClient.makePath makePath: /configs/conf1/synonyms.txt
[junit4:junit4]   2> 316 T1382 oazs.PrepRequestProcessor.pRequest2Txn Processed session termination for sessionid: 0x13ba7c660c70001
[junit4:junit4]   2> 317 T1386 oaz.ClientCnxn$EventThread.run EventThread shut down
[junit4:junit4]   2> 317 T1379 oazs.NIOServerCnxn.closeSock Closed socket connection for client /140.211.11.196:41854 which had sessionid 0x13ba7c660c70001
[junit4:junit4]   2> 317 T1377 oaz.ZooKeeper.close Session: 0x13ba7c660c70001 closed
[junit4:junit4]   2> 478 T1377 oejs.Server.doStart jetty-8.1.8.v20121106
[junit4:junit4]   2> 484 T1377 oejs.AbstractConnector.doStart Started SocketConnector@127.0.0.1:54669
[junit4:junit4]   2> 485 T1377 oasc.SolrResourceLoader.locateSolrHome JNDI not configured for solr (NoInitialContextEx)
[junit4:junit4]   2> 486 T1377 oasc.SolrResourceLoader.locateSolrHome using system property solr.solr.home: /usr/home/hudson/hudson-slave/workspace/Lucene-Solr-NightlyTests-4.x/solr/build/solr-core/test/J0/./org.apache.solr.cloud.BasicDistributedZkTest-controljetty-1355729494520
[junit4:junit4]   2> 486 T1377 oasc.SolrResourceLoader.<init> new SolrResourceLoader for deduced Solr Home: '/usr/home/hudson/hudson-slave/workspace/Lucene-Solr-NightlyTests-4.x/solr/build/solr-core/test/J0/./org.apache.solr.cloud.BasicDistributedZkTest-controljetty-1355729494520/'
[junit4:junit4]   2> 522 T1377 oass.SolrDispatchFilter.init SolrDispatchFilter.init()
[junit4:junit4]   2> 522 T1377 oasc.SolrResourceLoader.locateSolrHome JNDI not configured for solr (NoInitialContextEx)
[junit4:junit4]   2> 523 T1377 oasc.SolrResourceLoader.locateSolrHome using system property solr.solr.home: /usr/home/hudson/hudson-slave/workspace/Lucene-Solr-NightlyTests-4.x/solr/build/solr-core/test/J0/./org.apache.solr.cloud.BasicDistributedZkTest-controljetty-1355729494520
[junit4:junit4]   2> 524 T1377 oasc.CoreContainer$Initializer.initialize looking for solr.xml: /usr/home/hudson/hudson-slave/workspace/Lucene-Solr-NightlyTests-4.x/solr/build/solr-core/test/J0/./org.apache.solr.cloud.BasicDistributedZkTest-controljetty-1355729494520/solr.xml
[junit4:junit4]   2> 524 T1377 oasc.CoreContainer.<init> New CoreContainer 791786064
[junit4:junit4]   2> 525 T1377 oasc.CoreContainer.load Loading CoreContainer using Solr Home: '/usr/home/hudson/hudson-slave/workspace/Lucene-Solr-NightlyTests-4.x/solr/build/solr-core/test/J0/./org.apache.solr.cloud.BasicDistributedZkTest-controljetty-1355729494520/'
[junit4:junit4]   2> 525 T1377 oasc.SolrResourceLoader.<init> new SolrResourceLoader for directory: '/usr/home/hudson/hudson-slave/workspace/Lucene-Solr-NightlyTests-4.x/solr/build/solr-core/test/J0/./org.apache.solr.cloud.BasicDistributedZkTest-controljetty-1355729494520/'
[junit4:junit4]   2> 549 T1377 oashc.HttpShardHandlerFactory.getParameter Setting socketTimeout to: 30000
[junit4:junit4]   2> 550 T1377 oashc.HttpShardHandlerFactory.getParameter Setting urlScheme to: http://
[junit4:junit4]   2> 551 T1377 oashc.HttpShardHandlerFactory.getParameter Setting connTimeout to: 15000
[junit4:junit4]   2> 551 T1377 oashc.HttpShardHandlerFactory.getParameter Setting maxConnectionsPerHost to: 20
[junit4:junit4]   2> 552 T1377 oashc.HttpShardHandlerFactory.getParameter Setting corePoolSize to: 0
[junit4:junit4]   2> 552 T1377 oashc.HttpShardHandlerFactory.getParameter Setting maximumPoolSize to: 2147483647
[junit4:junit4]   2> 553 T1377 oashc.HttpShardHandlerFactory.getParameter Setting maxThreadIdleTime to: 5
[junit4:junit4]   2> 553 T1377 oashc.HttpShardHandlerFactory.getParameter Setting sizeOfQueue to: -1
[junit4:junit4]   2> 554 T1377 oashc.HttpShardHandlerFactory.getParameter Setting fairnessPolicy to: false
[junit4:junit4]   2> 554 T1377 oascsi.HttpClientUtil.createClient Creating new http client, config:maxConnectionsPerHost=20&maxConnections=10000&socketTimeout=30000&connTimeout=15000&retry=false
[junit4:junit4]   2> 578 T1377 oasc.CoreContainer.load Registering Log Listener
[junit4:junit4]   2> 602 T1377 oasc.CoreContainer.initZooKeeper Zookeeper client=127.0.0.1:27598/solr
[junit4:junit4]   2> 603 T1377 oasc.ZkController.checkChrootPath zkHost includes chroot
[junit4:junit4]   2> 604 T1377 oaz.ZooKeeper.<init> Initiating client connection, connectString=127.0.0.1:27598 sessionTimeout=60000 watcher=org.apache.solr.common.cloud.ConnectionManager@4544306b
[junit4:junit4]   2> 605 T1377 oascc.ConnectionManager.waitForConnected Waiting for client to connect to ZooKeeper
[junit4:junit4]   2> 605 T1396 oaz.ClientCnxn$SendThread.logStartConnect Opening socket connection to server localhost/127.0.0.1:27598. Will not attempt to authenticate using SASL (access denied (javax.security.auth.AuthPermission getLoginConfiguration))
[junit4:junit4]   2> 606 T1396 oaz.ClientCnxn$SendThread.primeConnection Socket connection established to localhost/127.0.0.1:27598, initiating session
[junit4:junit4]   2> 606 T1379 oazs.NIOServerCnxnFactory.run Accepted socket connection from /140.211.11.196:17084
[junit4:junit4]   2> 607 T1379 oazs.ZooKeeperServer.processConnectRequest Client attempting to establish new session at /140.211.11.196:17084
[junit4:junit4]   2> 608 T1381 oazs.ZooKeeperServer.finishSessionInit Established session 0x13ba7c660c70002 with negotiated timeout 20000 for client /140.211.11.196:17084
[junit4:junit4]   2> 609 T1396 oaz.ClientCnxn$SendThread.onConnected Session establishment complete on server localhost/127.0.0.1:27598, sessionid = 0x13ba7c660c70002, negotiated timeout = 20000
[junit4:junit4]   2> 609 T1397 oascc.ConnectionManager.process Watcher org.apache.solr.common.cloud.ConnectionManager@4544306b name:ZooKeeperConnection Watcher:127.0.0.1:27598 got event WatchedEvent state:SyncConnected type:None path:null path:null type:None
[junit4:junit4]   2> 609 T1377 oascc.ConnectionManager.waitForConnected Client is connected to ZooKeeper
[junit4:junit4]   2> 611 T1382 oazs.PrepRequestProcessor.pRequest2Txn Processed session termination for sessionid: 0x13ba7c660c70002
[junit4:junit4]   2> 612 T1397 oaz.ClientCnxn$EventThread.run EventThread shut down
[junit4:junit4]   2> 612 T1379 oazs.NIOServerCnxn.closeSock Closed socket connection for client /140.211.11.196:17084 which had sessionid 0x13ba7c660c70002
[junit4:junit4]   2> 612 T1377 oaz.ZooKeeper.close Session: 0x13ba7c660c70002 closed
[junit4:junit4]   2> 613 T1377 oascsi.HttpClientUtil.createClient Creating new http client, config:maxConnections=500&maxConnectionsPerHost=16&socketTimeout=15000&connTimeout=30000
[junit4:junit4]   2> 625 T1377 oaz.ZooKeeper.<init> Initiating client connection, connectString=127.0.0.1:27598/solr sessionTimeout=30000 watcher=org.apache.solr.common.cloud.ConnectionManager@1727517f
[junit4:junit4]   2> 626 T1377 oascc.ConnectionManager.waitForConnected Waiting for client to connect to ZooKeeper
[junit4:junit4]   2> 627 T1398 oaz.ClientCnxn$SendThread.logStartConnect Opening socket connection to server localhost/127.0.0.1:27598. Will not attempt to authenticate using SASL (access denied (javax.security.auth.AuthPermission getLoginConfiguration))
[junit4:junit4]   2> 627 T1398 oaz.ClientCnxn$SendThread.primeConnection Socket connection established to localhost/127.0.0.1:27598, initiating session
[junit4:junit4]   2> 628 T1379 oazs.NIOServerCnxnFactory.run Accepted socket connection from /140.211.11.196:43332
[junit4:junit4]   2> 628 T1379 oazs.ZooKeeperServer.processConnectRequest Client attempting to establish new session at /140.211.11.196:43332
[junit4:junit4]   2> 629 T1381 oazs.ZooKeeperServer.finishSessionInit Established session 0x13ba7c660c70003 with negotiated timeout 20000 for client /140.211.11.196:43332
[junit4:junit4]   2> 629 T1398 oaz.ClientCnxn$SendThread.onConnected Session establishment complete on server localhost/127.0.0.1:27598, sessionid = 0x13ba7c660c70003, negotiated timeout = 20000
[junit4:junit4]   2> 630 T1399 oascc.ConnectionManager.process Watcher org.apache.solr.common.cloud.ConnectionManager@1727517f name:ZooKeeperConnection Watcher:127.0.0.1:27598/solr got event WatchedEvent state:SyncConnected type:None path:null path:null type:None
[junit4:junit4]   2> 630 T1377 oascc.ConnectionManager.waitForConnected Client is connected to ZooKeeper
[junit4:junit4]   2> 632 T1382 oazs.PrepRequestProcessor.pRequest Got user-level KeeperException when processing sessionid:0x13ba7c660c70003 type:create cxid:0x2 zxid:0x1a txntype:-1 reqpath:n/a Error Path:/solr/overseer Error:KeeperErrorCode = NodeExists for /solr/overseer
[junit4:junit4]   2> 640 T1377 oascc.SolrZkClient.makePath makePath: /live_nodes
[junit4:junit4]   2> 644 T1377 oasc.ZkController.createEphemeralLiveNode Register node as live in ZooKeeper:/live_nodes/127.0.0.1:54669_
[junit4:junit4]   2> 644 T1382 oazs.PrepRequestProcessor.pRequest Got user-level KeeperException when processing sessionid:0x13ba7c660c70003 type:delete cxid:0x7 zxid:0x1c txntype:-1 reqpath:n/a Error Path:/solr/live_nodes/127.0.0.1:54669_ Error:KeeperErrorCode = NoNode for /solr/live_nodes/127.0.0.1:54669_
[junit4:junit4]   2> 646 T1377 oascc.SolrZkClient.makePath makePath: /live_nodes/127.0.0.1:54669_
[junit4:junit4]   2> 656 T1377 oascc.SolrZkClient.makePath makePath: /overseer_elect/election
[junit4:junit4]   2> 670 T1382 oazs.PrepRequestProcessor.pRequest Got user-level KeeperException when processing sessionid:0x13ba7c660c70003 type:delete cxid:0x15 zxid:0x21 txntype:-1 reqpath:n/a Error Path:/solr/overseer_elect/leader Error:KeeperErrorCode = NoNode for /solr/overseer_elect/leader
[junit4:junit4]   2> 671 T1377 oascc.SolrZkClient.makePath makePath: /overseer_elect/leader
[junit4:junit4]   2> 674 T1377 oasc.Overseer.start Overseer (id=88849088132874243-127.0.0.1:54669_-n_0000000000) starting
[junit4:junit4]   2> 675 T1382 oazs.PrepRequestProcessor.pRequest Got user-level KeeperException when processing sessionid:0x13ba7c660c70003 type:create cxid:0x1a zxid:0x23 txntype:-1 reqpath:n/a Error Path:/solr/overseer Error:KeeperErrorCode = NodeExists for /solr/overseer
[junit4:junit4]   2> 681 T1382 oazs.PrepRequestProcessor.pRequest Got user-level KeeperException when processing sessionid:0x13ba7c660c70003 type:create cxid:0x1b zxid:0x24 txntype:-1 reqpath:n/a Error Path:/solr/overseer Error:KeeperErrorCode = NodeExists for /solr/overseer
[junit4:junit4]   2> 682 T1382 oazs.PrepRequestProcessor.pRequest Got user-level KeeperException when processing sessionid:0x13ba7c660c70003 type:create cxid:0x1c zxid:0x25 txntype:-1 reqpath:n/a Error Path:/solr/overseer Error:KeeperErrorCode = NodeExists for /solr/overseer
[junit4:junit4]   2> 689 T1382 oazs.PrepRequestProcessor.pRequest Got user-level KeeperException when processing sessionid:0x13ba7c660c70003 type:create cxid:0x1d zxid:0x26 txntype:-1 reqpath:n/a Error Path:/solr/overseer Error:KeeperErrorCode = NodeExists for /solr/overseer
[junit4:junit4]   2> 690 T1401 oasc.OverseerCollectionProcessor.run Process current queue of collection messages
[junit4:junit4]   2> 692 T1377 oascc.SolrZkClient.makePath makePath: /clusterstate.json
[junit4:junit4]   2> 695 T1377 oascc.ZkStateReader.createClusterStateWatchersAndUpdate Updating cluster state from ZooKeeper... 
[junit4:junit4]   2> 698 T1400 oasc.Overseer$ClusterStateUpdater.run Starting to work on the main queue
[junit4:junit4]   2> 705 T1402 oasc.CoreContainer.create Creating SolrCore 'collection1' using instanceDir: /usr/home/hudson/hudson-slave/workspace/Lucene-Solr-NightlyTests-4.x/solr/build/solr-core/test/J0/./org.apache.solr.cloud.BasicDistributedZkTest-controljetty-1355729494520/collection1
[junit4:junit4]   2> 705 T1402 oasc.ZkController.createCollectionZkNode Check for collection zkNode:control_collection
[junit4:junit4]   2> 706 T1402 oasc.ZkController.createCollectionZkNode Collection zkNode exists
[junit4:junit4]   2> 706 T1402 oasc.ZkController.readConfigName Load collection config from:/collections/control_collection
[junit4:junit4]   2> 708 T1402 oasc.SolrResourceLoader.<init> new SolrResourceLoader for directory: '/usr/home/hudson/hudson-slave/workspace/Lucene-Solr-NightlyTests-4.x/solr/build/solr-core/test/J0/./org.apache.solr.cloud.BasicDistributedZkTest-controljetty-1355729494520/collection1/'
[junit4:junit4]   2> 714 T1402 oasc.SolrResourceLoader.replaceClassLoader Adding 'file:/usr/home/hudson/hudson-slave/workspace/Lucene-Solr-NightlyTests-4.x/solr/build/solr-core/test/J0/org.apache.solr.cloud.BasicDistributedZkTest-controljetty-1355729494520/collection1/lib/README' to classloader
[junit4:junit4]   2> 715 T1402 oasc.SolrResourceLoader.replaceClassLoader Adding 'file:/usr/home/hudson/hudson-slave/workspace/Lucene-Solr-NightlyTests-4.x/solr/build/solr-core/test/J0/org.apache.solr.cloud.BasicDistributedZkTest-controljetty-1355729494520/collection1/lib/classes/' to classloader
[junit4:junit4]   2> 767 T1402 oasc.SolrConfig.<init> Using Lucene MatchVersion: LUCENE_41
[junit4:junit4]   2> 837 T1402 oasc.SolrConfig.<init> Loaded SolrConfig: solrconfig.xml
[junit4:junit4]   2> 938 T1402 oass.IndexSchema.readSchema Reading Solr Schema
[junit4:junit4]   2> 947 T1402 oass.IndexSchema.readSchema Schema name=test
[junit4:junit4]   2> 1556 T1402 oass.OpenExchangeRatesOrgProvider.init Initialized with rates=open-exchange-rates.json, refreshInterval=1440.
[junit4:junit4]   2> 1568 T1402 oass.IndexSchema.readSchema default search field in schema is text
[junit4:junit4]   2> 1573 T1402 oass.IndexSchema.readSchema unique key field: id
[junit4:junit4]   2> 1589 T1402 oass.FileExchangeRateProvider.reload Reloading exchange rates from file currency.xml
[junit4:junit4]   2> 1594 T1402 oass.FileExchangeRateProvider.reload Reloading exchange rates from file currency.xml
[junit4:junit4]   2> 1599 T1402 oass.OpenExchangeRatesOrgProvider.reload Reloading exchange rates from open-exchange-rates.json
[junit4:junit4]   2> 1600 T1402 oass.OpenExchangeRatesOrgProvider.reload Reloading exchange rates from open-exchange-rates.json
[junit4:junit4]   2> 1602 T1402 oasc.SolrCore.<init> [collection1] Opening new SolrCore at /usr/home/hudson/hudson-slave/workspace/Lucene-Solr-NightlyTests-4.x/solr/build/solr-core/test/J0/./org.apache.solr.cloud.BasicDistributedZkTest-controljetty-1355729494520/collection1/, dataDir=./org.apache.solr.cloud.BasicDistributedZkTest-1355729494208/control/data/
[junit4:junit4]   2> 1602 T1402 oasc.JmxMonitoredMap.<init> JMX monitoring is enabled. Adding Solr mbeans to JMX Server: com.sun.jmx.mbeanserver.JmxMBeanServer@6bab600f
[junit4:junit4]   2> 1602 T1402 oasc.SolrCore.initDirectoryFactory solr.NRTCachingDirectoryFactory
[junit4:junit4]   2> 1604 T1402 oasc.CachingDirectoryFactory.get return new directory for /usr/home/hudson/hudson-slave/workspace/Lucene-Solr-NightlyTests-4.x/solr/build/solr-core/test/J0/./org.apache.solr.cloud.BasicDistributedZkTest-1355729494208/control/data forceNew:false
[junit4:junit4]   2> 1604 T1402 oasc.CachingDirectoryFactory.close Releasing directory:/usr/home/hudson/hudson-slave/workspace/Lucene-Solr-NightlyTests-4.x/solr/build/solr-core/test/J0/./org.apache.solr.cloud.BasicDistributedZkTest-1355729494208/control/data
[junit4:junit4]   2> 1605 T1402 oasc.SolrCore.getNewIndexDir New index directory detected: old=null new=./org.apache.solr.cloud.BasicDistributedZkTest-1355729494208/control/data/index/
[junit4:junit4]   2> 1606 T1402 oasc.SolrCore.initIndex WARNING [collection1] Solr index directory './org.apache.solr.cloud.BasicDistributedZkTest-1355729494208/control/data/index' doesn't exist. Creating new index...
[junit4:junit4]   2> 1607 T1402 oasc.CachingDirectoryFactory.get return new directory for /usr/home/hudson/hudson-slave/workspace/Lucene-Solr-NightlyTests-4.x/solr/build/solr-core/test/J0/./org.apache.solr.cloud.BasicDistributedZkTest-1355729494208/control/data/index forceNew:false
[junit4:junit4]   2> 1613 T1402 oasc.SolrDeletionPolicy.onCommit SolrDeletionPolicy.onCommit: commits:num=1
[junit4:junit4]   2> 		commit{dir=RateLimitedDirectoryWrapper(NRTCachingDirectory(org.apache.lucene.store.NIOFSDirectory@/usr/home/hudson/hudson-slave/workspace/Lucene-Solr-NightlyTests-4.x/solr/build/solr-core/test/J0/org.apache.solr.cloud.BasicDistributedZkTest-1355729494208/control/data/index lockFactory=org.apache.lucene.store.NativeFSLockFactory@3841d54b; maxCacheMB=48.0 maxMergeSizeMB=4.0)),segFN=segments_1,generation=1,filenames=[segments_1]
[junit4:junit4]   2> 1614 T1402 oasc.SolrDeletionPolicy.updateCommits newest commit = 1[segments_1]
[junit4:junit4]   2> 1614 T1402 oasc.CachingDirectoryFactory.close Releasing directory:/usr/home/hudson/hudson-slave/workspace/Lucene-Solr-NightlyTests-4.x/solr/build/solr-core/test/J0/./org.apache.solr.cloud.BasicDistributedZkTest-1355729494208/control/data/index
[junit4:junit4]   2> 1615 T1402 oasc.SolrCore.initWriters created xml: solr.XMLResponseWriter
[junit4:junit4]   2> 1616 T1402 oasup.UpdateRequestProcessorChain.init inserting DistributedUpdateProcessorFactory into updateRequestProcessorChain "dedupe"
[junit4:junit4]   2> 1617 T1402 oasup.UpdateRequestProcessorChain.init inserting DistributedUpdateProcessorFactory into updateRequestProcessorChain "dedupe-allfields"
[junit4:junit4]   2> 1617 T1402 oasup.UpdateRequestProcessorChain.init inserting DistributedUpdateProcessorFactory into updateRequestProcessorChain "stored_sig"
[junit4:junit4]   2> 1618 T1402 oasup.UpdateRequestProcessorChain.init inserting DistributedUpdateProcessorFactory into updateRequestProcessorChain "uniq-fields"
[junit4:junit4]   2> 1618 T1402 oasup.UpdateRequestProcessorChain.init inserting DistributedUpdateProcessorFactory into updateRequestProcessorChain "distrib-dup-test-chain-implicit"
[junit4:junit4]   2> 1619 T1402 oasc.RequestHandlers.initHandlersFromConfig adding lazy requestHandler: solr.ReplicationHandler
[junit4:junit4]   2> 1619 T1402 oasc.RequestHandlers.initHandlersFromConfig created /replication: solr.ReplicationHandler
[junit4:junit4]   2> 1620 T1402 oasc.RequestHandlers.initHandlersFromConfig created standard: solr.StandardRequestHandler
[junit4:junit4]   2> 1621 T1402 oasc.RequestHandlers.initHandlersFromConfig created /get: solr.RealTimeGetHandler
[junit4:junit4]   2> 1621 T1402 oasc.RequestHandlers.initHandlersFromConfig created dismax: solr.SearchHandler
[junit4:junit4]   2> 1622 T1402 oasc.RequestHandlers.initHandlersFromConfig created mock: org.apache.solr.core.MockQuerySenderListenerReqHandler
[junit4:junit4]   2> 1623 T1402 oasc.RequestHandlers.initHandlersFromConfig created /admin/: org.apache.solr.handler.admin.AdminHandlers
[junit4:junit4]   2> 1623 T1402 oasc.RequestHandlers.initHandlersFromConfig created defaults: solr.StandardRequestHandler
[junit4:junit4]   2> 1623 T1402 oasc.RequestHandlers.initHandlersFromConfig adding lazy requestHandler: solr.StandardRequestHandler
[junit4:junit4]   2> 1624 T1402 oasc.RequestHandlers.initHandlersFromConfig created lazy: solr.StandardRequestHandler
[junit4:junit4]   2> 1625 T1402 oasc.RequestHandlers.initHandlersFromConfig created /update: solr.UpdateRequestHandler
[junit4:junit4]   2> 1625 T1402 oasc.RequestHandlers.initHandlersFromConfig created /terms: org.apache.solr.handler.component.SearchHandler
[junit4:junit4]   2> 1626 T1402 oasc.RequestHandlers.initHandlersFromConfig created spellCheckCompRH: org.apache.solr.handler.component.SearchHandler
[junit4:junit4]   2> 1627 T1402 oasc.RequestHandlers.initHandlersFromConfig created spellCheckCompRH_Direct: org.apache.solr.handler.component.SearchHandler
[junit4:junit4]   2> 1628 T1402 oasc.RequestHandlers.initHandlersFromConfig created spellCheckWithWordbreak: org.apache.solr.handler.component.SearchHandler
[junit4:junit4]   2> 1628 T1402 oasc.RequestHandlers.initHandlersFromConfig created spellCheckWithWordbreak_Direct: org.apache.solr.handler.component.SearchHandler
[junit4:junit4]   2> 1629 T1402 oasc.RequestHandlers.initHandlersFromConfig created spellCheckCompRH1: org.apache.solr.handler.component.SearchHandler
[junit4:junit4]   2> 1630 T1402 oasc.RequestHandlers.initHandlersFromConfig created mltrh: org.apache.solr.handler.component.SearchHandler
[junit4:junit4]   2> 1631 T1402 oasc.RequestHandlers.initHandlersFromConfig created tvrh: org.apache.solr.handler.component.SearchHandler
[junit4:junit4]   2> 1631 T1402 oasc.RequestHandlers.initHandlersFromConfig created /mlt: solr.MoreLikeThisHandler
[junit4:junit4]   2> 1632 T1402 oasc.RequestHandlers.initHandlersFromConfig created /debug/dump: solr.DumpRequestHandler
[junit4:junit4]   2> 1640 T1402 oashl.XMLLoader.init xsltCacheLifetimeSeconds=60
[junit4:junit4]   2> 1644 T1402 oasc.SolrCore.initDeprecatedSupport WARNING solrconfig.xml uses deprecated <admin/gettableFiles>, Please update your config to use the ShowFileRequestHandler.
[junit4:junit4]   2> 1646 T1402 oasc.SolrCore.initDeprecatedSupport WARNING adding ShowFileRequestHandler with hidden files: [SCHEMA.XML, OLD_SYNONYMS.TXT, STOPWORDS.TXT, PROTWORDS.TXT, OPEN-EXCHANGE-RATES.JSON, SYNONYMS.TXT, CURRENCY.XML, MAPPING-ISOLATIN1ACCENT.TXT]
[junit4:junit4]   2> 1649 T1402 oasc.CachingDirectoryFactory.close Releasing directory:/usr/home/hudson/hudson-slave/workspace/Lucene-Solr-NightlyTests-4.x/solr/build/solr-core/test/J0/./org.apache.solr.cloud.BasicDistributedZkTest-1355729494208/control/data
[junit4:junit4]   2> 1651 T1402 oass.SolrIndexSearcher.<init> Opening Searcher@58095281 main
[junit4:junit4]   2> 1652 T1402 oasu.CommitTracker.<init> Hard AutoCommit: disabled
[junit4:junit4]   2> 1652 T1402 oasu.CommitTracker.<init> Soft AutoCommit: disabled
[junit4:junit4]   2> 1652 T1402 oashc.SpellCheckComponent.inform Initializing spell checkers
[junit4:junit4]   2> 1671 T1402 oass.DirectSolrSpellChecker.init init: {name=direct,classname=DirectSolrSpellChecker,field=lowerfilt,minQueryLength=3}
[junit4:junit4]   2> 1733 T1403 oasc.SolrCore.registerSearcher [collection1] Registered new searcher Searcher@58095281 main{StandardDirectoryReader(segments_1:1)}
[junit4:junit4]   2> 1736 T1402 oasc.ZkController.publish publishing core=collection1 state=down
[junit4:junit4]   2> 1737 T1402 oasc.ZkController.publish numShards not found on descriptor - reading it from system property
[junit4:junit4]   2> 1737 T1382 oazs.PrepRequestProcessor.pRequest Got user-level KeeperException when processing sessionid:0x13ba7c660c70003 type:create cxid:0x56 zxid:0x29 txntype:-1 reqpath:n/a Error Path:/solr/overseer/queue Error:KeeperErrorCode = NoNode for /solr/overseer/queue
[junit4:junit4]   2> 2206 T1400 oascc.ZkStateReader.updateClusterState Updating cloud state from ZooKeeper... 
[junit4:junit4]   2> 2207 T1400 oasc.Overseer$ClusterStateUpdater.updateState Update state numShards=1 message={
[junit4:junit4]   2> 	  "operation":"state",
[junit4:junit4]   2> 	  "numShards":"1",
[junit4:junit4]   2> 	  "shard":null,
[junit4:junit4]   2> 	  "roles":null,
[junit4:junit4]   2> 	  "state":"down",
[junit4:junit4]   2> 	  "core":"collection1",
[junit4:junit4]   2> 	  "collection":"control_collection",
[junit4:junit4]   2> 	  "node_name":"127.0.0.1:54669_",
[junit4:junit4]   2> 	  "base_url":"http://127.0.0.1:54669"}
[junit4:junit4]   2> 2208 T1400 oasc.Overseer$ClusterStateUpdater.createCollection Create collection control_collection with numShards 1
[junit4:junit4]   2> 2208 T1400 oasc.Overseer$ClusterStateUpdater.updateState Assigning new node to shard shard=shard1
[junit4:junit4]   2> 2208 T1382 oazs.PrepRequestProcessor.pRequest Got user-level KeeperException when processing sessionid:0x13ba7c660c70003 type:create cxid:0x5e zxid:0x2c txntype:-1 reqpath:n/a Error Path:/solr/overseer/queue-work Error:KeeperErrorCode = NoNode for /solr/overseer/queue-work
[junit4:junit4]   2> 2230 T1399 oascc.ZkStateReader$2.process A cluster state change: WatchedEvent state:SyncConnected type:NodeDataChanged path:/clusterstate.json, has occurred - updating... (live nodes size: 1)
[junit4:junit4]   2> 2248 T1402 oasc.CoreContainer.registerCore registering core: collection1
[junit4:junit4]   2> 2248 T1402 oasc.ZkController.register Register shard - core:collection1 address:http://127.0.0.1:54669 shardId:shard1
[junit4:junit4]   2> 2249 T1402 oascc.SolrZkClient.makePath makePath: /collections/control_collection/leader_elect/shard1/election
[junit4:junit4]   2> 2263 T1382 oazs.PrepRequestProcessor.pRequest Got user-level KeeperException when processing sessionid:0x13ba7c660c70003 type:delete cxid:0x78 zxid:0x36 txntype:-1 reqpath:n/a Error Path:/solr/collections/control_collection/leaders Error:KeeperErrorCode = NoNode for /solr/collections/control_collection/leaders
[junit4:junit4]   2> 2267 T1402 oasc.ShardLeaderElectionContext.runLeaderProcess Running the leader process.
[junit4:junit4]   2> 2268 T1382 oazs.PrepRequestProcessor.pRequest Got user-level KeeperException when processing sessionid:0x13ba7c660c70003 type:create cxid:0x79 zxid:0x37 txntype:-1 reqpath:n/a Error Path:/solr/overseer Error:KeeperErrorCode = NodeExists for /solr/overseer
[junit4:junit4]   2> 2282 T1402 oasc.ShardLeaderElectionContext.waitForReplicasToComeUp Enough replicas found to continue.
[junit4:junit4]   2> 2282 T1402 oasc.ShardLeaderElectionContext.runLeaderProcess I may be the new leader - try and sync
[junit4:junit4]   2> 2283 T1402 oasc.SyncStrategy.sync Sync replicas to http://127.0.0.1:54669/collection1/
[junit4:junit4]   2> 2283 T1402 oasc.SyncStrategy.syncReplicas Sync Success - now sync replicas to me
[junit4:junit4]   2> 2283 T1402 oasc.SyncStrategy.syncToMe http://127.0.0.1:54669/collection1/ has no replicas
[junit4:junit4]   2> 2284 T1402 oasc.ShardLeaderElectionContext.runLeaderProcess I am the new leader: http://127.0.0.1:54669/collection1/
[junit4:junit4]   2> 2284 T1402 oascc.SolrZkClient.makePath makePath: /collections/control_collection/leaders/shard1
[junit4:junit4]   2> 2288 T1382 oazs.PrepRequestProcessor.pRequest Got user-level KeeperException when processing sessionid:0x13ba7c660c70003 type:create cxid:0x83 zxid:0x3b txntype:-1 reqpath:n/a Error Path:/solr/overseer Error:KeeperErrorCode = NodeExists for /solr/overseer
[junit4:junit4]   2> 2735 T1400 oascc.ZkStateReader.updateClusterState Updating cloud state from ZooKeeper... 
[junit4:junit4]   2> 2779 T1399 oascc.ZkStateReader$2.process A cluster state change: WatchedEvent state:SyncConnected type:NodeDataChanged path:/clusterstate.json, has occurred - updating... (live nodes size: 1)
[junit4:junit4]   2> 2807 T1402 oasc.ZkController.register We are http://127.0.0.1:54669/collection1/ and leader is http://127.0.0.1:54669/collection1/
[junit4:junit4]   2> 2807 T1402 oasc.ZkController.register No LogReplay needed for core=collection1 baseURL=http://127.0.0.1:54669
[junit4:junit4]   2> 2807 T1402 oasc.ZkController.checkRecovery I am the leader, no recovery necessary
[junit4:junit4]   2> 2807 T1402 oasc.ZkController.publish publishing core=collection1 state=active
[junit4:junit4]   2> 2808 T1402 oasc.ZkController.publish numShards not found on descriptor - reading it from system property
[junit4:junit4]   2> 2810 T1402 oascc.ZkStateReader.updateClusterState Updating cloud state from ZooKeeper... 
[junit4:junit4]   2> 2811 T1377 oass.SolrDispatchFilter.init user.dir=/usr/home/hudson/hudson-slave/workspace/Lucene-Solr-NightlyTests-4.x/solr/build/solr-core/test/J0
[junit4:junit4]   2> 2812 T1377 oass.SolrDispatchFilter.init SolrDispatchFilter.init() done
[junit4:junit4]   2> 2812 T1377 oascsi.HttpClientUtil.createClient Creating new http client, config:maxConnections=128&maxConnectionsPerHost=32&followRedirects=false
[junit4:junit4]   2> 2826 T1377 oascsi.HttpClientUtil.createClient Creating new http client, config:
[junit4:junit4]   2> 2836 T1377 oaz.ZooKeeper.<init> Initiating client connection, connectString=127.0.0.1:27598/solr sessionTimeout=10000 watcher=org.apache.solr.common.cloud.ConnectionManager@a27ebd9
[junit4:junit4]   2> 2837 T1377 oascc.ConnectionManager.waitForConnected Waiting for client to connect to ZooKeeper
[junit4:junit4]   2> 2838 T1404 oaz.ClientCnxn$SendThread.logStartConnect Opening socket connection to server localhost/127.0.0.1:27598. Will not attempt to authenticate using SASL (access denied (javax.security.auth.AuthPermission getLoginConfiguration))
[junit4:junit4]   2> 2838 T1404 oaz.ClientCnxn$SendThread.primeConnection Socket connection established to localhost/127.0.0.1:27598, initiating session
[junit4:junit4]   2> 2838 T1379 oazs.NIOServerCnxnFactory.run Accepted socket connection from /140.211.11.196:26570
[junit4:junit4]   2> 2839 T1379 oazs.ZooKeeperServer.processConnectRequest Client attempting to establish new session at /140.211.11.196:26570
[junit4:junit4]   2> 2840 T1381 oazs.ZooKeeperServer.finishSessionInit Established session 0x13ba7c660c70004 with negotiated timeout 10000 for client /140.211.11.196:26570
[junit4:junit4]   2> 2840 T1404 oaz.ClientCnxn$SendThread.onConnected Session establishment complete on server localhost/127.0.0.1:27598, sessionid = 0x13ba7c660c70004, negotiated timeout = 10000
[junit4:junit4]   2> 2840 T1405 oascc.ConnectionManager.process Watcher org.apache.solr.common.cloud.ConnectionManager@a27ebd9 name:ZooKeeperConnection Watcher:127.0.0.1:27598/solr got event WatchedEvent state:SyncConnected type:None path:null path:null type:None
[junit4:junit4]   2> 2840 T1377 oascc.ConnectionManager.waitForConnected Client is connected to ZooKeeper
[junit4:junit4]   2> 2842 T1377 oascc.ZkStateReader.createClusterStateWatchersAndUpdate Updating cluster state from ZooKeeper... 
[junit4:junit4]   2> 2844 T1377 oasc.ChaosMonkey.monkeyLog monkey: init - expire sessions:true cause connection loss:true
[junit4:junit4]   2> 3000 T1377 oejs.Server.doStart jetty-8.1.8.v20121106
[junit4:junit4]   2> 3003 T1377 oejs.AbstractConnector.doStart Started SocketConnector@127.0.0.1:47665
[junit4:junit4]   2> 3003 T1377 oasc.SolrResourceLoader.locateSolrHome JNDI not configured for solr (NoInitialContextEx)
[junit4:junit4]   2> 3004 T1377 oasc.SolrResourceLoader.locateSolrHome using system property solr.solr.home: /usr/home/hudson/hudson-slave/workspace/Lucene-Solr-NightlyTests-4.x/solr/build/solr-core/test/J0/./org.apache.solr.cloud.BasicDistributedZkTest-jetty1-1355729497047
[junit4:junit4]   2> 3005 T1377 oasc.SolrResourceLoader.<init> new SolrResourceLoader for deduced Solr Home: '/usr/home/hudson/hudson-slave/workspace/Lucene-Solr-NightlyTests-4.x/solr/build/solr-core/test/J0/./org.apache.solr.cloud.BasicDistributedZkTest-jetty1-1355729497047/'
[junit4:junit4]   2> 3040 T1377 oass.SolrDispatchFilter.init SolrDispatchFilter.init()
[junit4:junit4]   2> 3041 T1377 oasc.SolrResourceLoader.locateSolrHome JNDI not configured for solr (NoInitialContextEx)
[junit4:junit4]   2> 3041 T1377 oasc.SolrResourceLoader.locateSolrHome using system property solr.solr.home: /usr/home/hudson/hudson-slave/workspace/Lucene-Solr-NightlyTests-4.x/solr/build/solr-core/test/J0/./org.apache.solr.cloud.BasicDistributedZkTest-jetty1-1355729497047
[junit4:junit4]   2> 3042 T1377 oasc.CoreContainer$Initializer.initialize looking for solr.xml: /usr/home/hudson/hudson-slave/workspace/Lucene-Solr-NightlyTests-4.x/solr/build/solr-core/test/J0/./org.apache.solr.cloud.BasicDistributedZkTest-jetty1-1355729497047/solr.xml
[junit4:junit4]   2> 3042 T1377 oasc.CoreContainer.<init> New CoreContainer 779355821
[junit4:junit4]   2> 3043 T1377 oasc.CoreContainer.load Loading CoreContainer using Solr Home: '/usr/home/hudson/hudson-slave/workspace/Lucene-Solr-NightlyTests-4.x/solr/build/solr-core/test/J0/./org.apache.solr.cloud.BasicDistributedZkTest-jetty1-1355729497047/'
[junit4:junit4]   2> 3043 T1377 oasc.SolrResourceLoader.<init> new SolrResourceLoader for directory: '/usr/home/hudson/hudson-slave/workspace/Lucene-Solr-NightlyTests-4.x/solr/build/solr-core/test/J0/./org.apache.solr.cloud.BasicDistributedZkTest-jetty1-1355729497047/'
[junit4:junit4]   2> 3067 T1377 oashc.HttpShardHandlerFactory.getParameter Setting socketTimeout to: 30000
[junit4:junit4]   2> 3068 T1377 oashc.HttpShardHandlerFactory.getParameter Setting urlScheme to: http://
[junit4:junit4]   2> 3068 T1377 oashc.HttpShardHandlerFactory.getParameter Setting connTimeout to: 15000
[junit4:junit4]   2> 3069 T1377 oashc.HttpShardHandlerFactory.getParameter Setting maxConnectionsPerHost to: 20
[junit4:junit4]   2> 3069 T1377 oashc.HttpShardHandlerFactory.getParameter Setting corePoolSize to: 0
[junit4:junit4]   2> 3070 T1377 oashc.HttpShardHandlerFactory.getParameter Setting maximumPoolSize to: 2147483647
[junit4:junit4]   2> 3070 T1377 oashc.HttpShardHandlerFactory.getParameter Setting maxThreadIdleTime to: 5
[junit4:junit4]   2> 3071 T1377 oashc.HttpShardHandlerFactory.getParameter Setting sizeOfQueue to: -1
[junit4:junit4]   2> 3071 T1377 oashc.HttpShardHandlerFactory.getParameter Setting fairnessPolicy to: false
[junit4:junit4]   2> 3072 T1377 oascsi.HttpClientUtil.createClient Creating new http client, config:maxConnectionsPerHost=20&maxConnections=10000&socketTimeout=30000&connTimeout=15000&retry=false
[junit4:junit4]   2> 3091 T1377 oasc.CoreContainer.load Registering Log Listener
[junit4:junit4]   2> 3109 T1377 oasc.CoreContainer.initZooKeeper Zookeeper client=127.0.0.1:27598/solr
[junit4:junit4]   2> 3110 T1377 oasc.ZkController.checkChrootPath zkHost includes chroot
[junit4:junit4]   2> 3111 T1377 oaz.ZooKeeper.<init> Initiating client connection, connectString=127.0.0.1:27598 sessionTimeout=60000 watcher=org.apache.solr.common.cloud.ConnectionManager@6f77bb11
[junit4:junit4]   2> 3112 T1377 oascc.ConnectionManager.waitForConnected Waiting for client to connect to ZooKeeper
[junit4:junit4]   2> 3113 T1415 oaz.ClientCnxn$SendThread.logStartConnect Opening socket connection to server localhost/127.0.0.1:27598. Will not attempt to authenticate using SASL (access denied (javax.security.auth.AuthPermission getLoginConfiguration))
[junit4:junit4]   2> 3113 T1415 oaz.ClientCnxn$SendThread.primeConnection Socket connection established to localhost/127.0.0.1:27598, initiating session
[junit4:junit4]   2> 3114 T1379 oazs.NIOServerCnxnFactory.run Accepted socket connection from /140.211.11.196:32412
[junit4:junit4]   2> 3114 T1379 oazs.ZooKeeperServer.processConnectRequest Client attempting to establish new session at /140.211.11.196:32412
[junit4:junit4]   2> 3116 T1381 oazs.ZooKeeperServer.finishSessionInit Established session 0x13ba7c660c70005 with negotiated timeout 20000 for client /140.211.11.196:32412
[junit4:junit4]   2> 3116 T1415 oaz.ClientCnxn$SendThread.onConnected Session establishment complete on server localhost/127.0.0.1:27598, sessionid = 0x13ba7c660c70005, negotiated timeout = 20000
[junit4:junit4]   2> 3116 T1416 oascc.ConnectionManager.process Watcher org.apache.solr.common.cloud.ConnectionManager@6f77bb11 name:ZooKeeperConnection Watcher:127.0.0.1:27598 got event WatchedEvent state:SyncConnected type:None path:null path:null type:None
[junit4:junit4]   2> 3117 T1377 oascc.ConnectionManager.waitForConnected Client is connected to ZooKeeper
[junit4:junit4]   2> 3118 T1382 oazs.PrepRequestProcessor.pRequest2Txn Processed session termination for sessionid: 0x13ba7c660c70005
[junit4:junit4]   2> 3128 T1416 oaz.ClientCnxn$EventThread.run EventThread shut down
[junit4:junit4]   2> 3128 T1379 oazs.NIOServerCnxn.closeSock Closed socket connection for client /140.211.11.196:32412 which had sessionid 0x13ba7c660c70005
[junit4:junit4]   2> 3128 T1377 oaz.ZooKeeper.close Session: 0x13ba7c660c70005 closed
[junit4:junit4]   2> 3129 T1377 oascsi.HttpClientUtil.createClient Creating new http client, config:maxConnections=500&maxConnectionsPerHost=16&socketTimeout=15000&connTimeout=30000
[junit4:junit4]   2> 3139 T1377 oaz.ZooKeeper.<init> Initiating client connection, connectString=127.0.0.1:27598/solr sessionTimeout=30000 watcher=org.apache.solr.common.cloud.ConnectionManager@7c13a5c
[junit4:junit4]   2> 3140 T1377 oascc.ConnectionManager.waitForConnected Waiting for client to connect to ZooKeeper
[junit4:junit4]   2> 3141 T1417 oaz.ClientCnxn$SendThread.logStartConnect Opening socket connection to server localhost/127.0.0.1:27598. Will not attempt to authenticate using SASL (access denied (javax.security.auth.AuthPermission getLoginConfiguration))
[junit4:junit4]   2> 3141 T1417 oaz.ClientCnxn$SendThread.primeConnection Socket connection established to localhost/127.0.0.1:27598, initiating session
[junit4:junit4]   2> 3141 T1379 oazs.NIOServerCnxnFactory.run Accepted socket connection from /140.211.11.196:65426
[junit4:junit4]   2> 3142 T1379 oazs.ZooKeeperServer.processConnectRequest Client attempting to establish new session at /140.211.11.196:65426
[junit4:junit4]   2> 3143 T1381 oazs.ZooKeeperServer.finishSessionInit Established session 0x13ba7c660c70006 with negotiated timeout 20000 for client /140.211.11.196:65426
[junit4:junit4]   2> 3143 T1417 oaz.ClientCnxn$SendThread.onConnected Session establishment complete on server localhost/127.0.0.1:27598, sessionid = 0x13ba7c660c70006, negotiated timeout = 20000
[junit4:junit4]   2> 3143 T1418 oascc.ConnectionManager.process Watcher org.apache.solr.common.cloud.ConnectionManager@7c13a5c name:ZooKeeperConnection Watcher:127.0.0.1:27598/solr got event WatchedEvent state:SyncConnected type:None path:null path:null type:None
[junit4:junit4]   2> 3144 T1377 oascc.ConnectionManager.waitForConnected Client is connected to ZooKeeper
[junit4:junit4]   2> 3145 T1382 oazs.PrepRequestProcessor.pRequest Got user-level KeeperException when processing sessionid:0x13ba7c660c70006 type:create cxid:0x1 zxid:0x49 txntype:-1 reqpath:n/a Error Path:/solr/overseer Error:KeeperErrorCode = NodeExists for /solr/overseer
[junit4:junit4]   2> 3146 T1382 oazs.PrepRequestProcessor.pRequest Got user-level KeeperException when processing sessionid:0x13ba7c660c70006 type:create cxid:0x2 zxid:0x4a txntype:-1 reqpath:n/a Error Path:/solr/overseer Error:KeeperErrorCode = NodeExists for /solr/overseer
[junit4:junit4]   2> 3154 T1377 oasc.ZkController.createEphemeralLiveNode Register node as live in ZooKeeper:/live_nodes/127.0.0.1:47665_
[junit4:junit4]   2> 3155 T1382 oazs.PrepRequestProcessor.pRequest Got user-level KeeperException when processing sessionid:0x13ba7c660c70006 type:delete cxid:0x4 zxid:0x4b txntype:-1 reqpath:n/a Error Path:/solr/live_nodes/127.0.0.1:47665_ Error:KeeperErrorCode = NoNode for /solr/live_nodes/127.0.0.1:47665_
[junit4:junit4]   2> 3156 T1377 oascc.SolrZkClient.makePath makePath: /live_nodes/127.0.0.1:47665_
[junit4:junit4]   2> 3159 T1399 oascc.ZkStateReader$2.process A cluster state change: WatchedEvent state:SyncConnected type:NodeChildrenChanged path:/live_nodes, has occurred - updating... (live nodes size: 1)
[junit4:junit4]   2> 3160 T1405 oascc.ZkStateReader$3.process Updating live nodes... (2)
[junit4:junit4]   2> 3161 T1399 oascc.ZkStateReader$3.process Updating live nodes... (2)
[junit4:junit4]   2> 3169 T1377 oascc.ZkStateReader.createClusterStateWatchersAndUpdate Updating cluster state from ZooKeeper... 
[junit4:junit4]   2> 3177 T1419 oasc.CoreContainer.create Creating SolrCore 'collection1' using instanceDir: /usr/home/hudson/hudson-slave/workspace/Lucene-Solr-NightlyTests-4.x/solr/build/solr-core/test/J0/./org.apache.solr.cloud.BasicDistributedZkTest-jetty1-1355729497047/collection1
[junit4:junit4]   2> 3177 T1419 oasc.ZkController.createCollectionZkNode Check for collection zkNode:collection1
[junit4:junit4]   2> 3178 T1419 oasc.ZkController.createCollectionZkNode Collection zkNode exists
[junit4:junit4]   2> 3178 T1419 oasc.ZkController.readConfigName Load collection config from:/collections/collection1
[junit4:junit4]   2> 3180 T1419 oasc.SolrResourceLoader.<init> new SolrResourceLoader for directory: '/usr/home/hudson/hudson-slave/workspace/Lucene-Solr-NightlyTests-4.x/solr/build/solr-core/test/J0/./org.apache.solr.cloud.BasicDistributedZkTest-jetty1-1355729497047/collection1/'
[junit4:junit4]   2> 3181 T1419 oasc.SolrResourceLoader.replaceClassLoader Adding 'file:/usr/home/hudson/hudson-slave/workspace/Lucene-Solr-NightlyTests-4.x/solr/build/solr-core/test/J0/org.apache.solr.cloud.BasicDistributedZkTest-jetty1-1355729497047/collection1/lib/README' to classloader
[junit4:junit4]   2> 3182 T1419 oasc.SolrResourceLoader.replaceClassLoader Adding 'file:/usr/home/hudson/hudson-slave/workspace/Lucene-Solr-NightlyTests-4.x/solr/build/solr-core/test/J0/org.apache.solr.cloud.BasicDistributedZkTest-jetty1-1355729497047/collection1/lib/classes/' to classloader
[junit4:junit4]   2> 3244 T1419 oasc.SolrConfig.<init> Using Lucene MatchVersion: LUCENE_41
[junit4:junit4]   2> 3293 T1400 oascc.ZkStateReader.updateClusterState Updating cloud state from ZooKeeper... 
[junit4:junit4]   2> 3295 T1400 oasc.Overseer$ClusterStateUpdater.updateState Update state numShards=1 message={
[junit4:junit4]   2> 	  "operation":"state",
[junit4:junit4]   2> 	  "numShards":"1",
[junit4:junit4]   2> 	  "shard":"shard1",
[junit4:junit4]   2> 	  "roles":null,
[junit4:junit4]   2> 	  "state":"active",
[junit4:junit4]   2> 	  "core":"collection1",
[junit4:junit4]   2> 	  "collection":"control_collection",
[junit4:junit4]   2> 	  "node_name":"127.0.0.1:54669_",
[junit4:junit4]   2> 	  "base_url":"http://127.0.0.1:54669"}
[junit4:junit4]   2> 3308 T1405 oascc.ZkStateReader$2.process A cluster state change: WatchedEvent state:SyncConnected type:NodeDataChanged path:/clusterstate.json, has occurred - updating... (live nodes size: 2)
[junit4:junit4]   2> 3308 T1418 oascc.ZkStateReader$2.process A cluster state change: WatchedEvent state:SyncConnected type:NodeDataChanged path:/clusterstate.json, has occurred - updating... (live nodes size: 2)
[junit4:junit4]   2> 3308 T1399 oascc.ZkStateReader$2.process A cluster state change: WatchedEvent state:SyncConnected type:NodeDataChanged path:/clusterstate.json, has occurred - updating... (live nodes size: 2)
[junit4:junit4]   2> 3327 T1419 oasc.SolrConfig.<init> Loaded SolrConfig: solrconfig.xml
[junit4:junit4]   2> 3428 T1419 oass.IndexSchema.readSchema Reading Solr Schema
[junit4:junit4]   2> 3438 T1419 oass.IndexSchema.readSchema Schema name=test
[junit4:junit4]   2> 4071 T1419 oass.OpenExchangeRatesOrgProvider.init Initialized with rates=open-exchange-rates.json, refreshInterval=1440.
[junit4:junit4]   2> 4083 T1419 oass.IndexSchema.readSchema default search field in schema is text
[junit4:junit4]   2> 4088 T1419 oass.IndexSchema.readSchema unique key field: id
[junit4:junit4]   2> 4106 T1419 oass.FileExchangeRateProvider.reload Reloading exchange rates from file currency.xml
[junit4:junit4]   2> 4112 T1419 oass.FileExchangeRateProvider.reload Reloading exchange rates from file currency.xml
[junit4:junit4]   2> 4116 T1419 oass.OpenExchangeRatesOrgProvider.reload Reloading exchange rates from open-exchange-rates.json
[junit4:junit4]   2> 4118 T1419 oass.OpenExchangeRatesOrgProvider.reload Reloading exchange rates from open-exchange-rates.json
[junit4:junit4]   2> 4119 T1419 oasc.SolrCore.<init> [collection1] Opening new SolrCore at /usr/home/hudson/hudson-slave/workspace/Lucene-Solr-NightlyTests-4.x/solr/build/solr-core/test/J0/./org.apache.solr.cloud.BasicDistributedZkTest-jetty1-1355729497047/collection1/, dataDir=./org.apache.solr.cloud.BasicDistributedZkTest-1355729494208/jetty1/
[junit4:junit4]   2> 4120 T1419 oasc.JmxMonitoredMap.<init> JMX monitoring is enabled. Adding Solr mbeans to JMX Server: com.sun.jmx.mbeanserver.JmxMBeanServer@6bab600f
[junit4:junit4]   2> 4120 T1419 oasc.SolrCore.initDirectoryFactory solr.NRTCachingDirectoryFactory
[junit4:junit4]   2> 4121 T1419 oasc.CachingDirectoryFactory.get return new directory for /usr/home/hudson/hudson-slave/workspace/Lucene-Solr-NightlyTests-4.x/solr/build/solr-core/test/J0/./org.apache.solr.cloud.BasicDistributedZkTest-1355729494208/jetty1 forceNew:false
[junit4:junit4]   2> 4122 T1419 oasc.CachingDirectoryFactory.close Releasing directory:/usr/home/hudson/hudson-slave/workspace/Lucene-Solr-NightlyTests-4.x/solr/build/solr-core/test/J0/./org.apache.solr.cloud.BasicDistributedZkTest-1355729494208/jetty1
[junit4:junit4]   2> 4122 T1419 oasc.SolrCore.getNewIndexDir New index directory detected: old=null new=./org.apache.solr.cloud.BasicDistributedZkTest-1355729494208/jetty1/index/
[junit4:junit4]   2> 4123 T1419 oasc.SolrCore.initIndex WARNING [collection1] Solr index directory './org.apache.solr.cloud.BasicDistributedZkTest-1355729494208/jetty1/index' doesn't exist. Creating new index...
[junit4:junit4]   2> 4124 T1419 oasc.CachingDirectoryFactory.get return new directory for /usr/home/hudson/hudson-slave/workspace/Lucene-Solr-NightlyTests-4.x/solr/build/solr-core/test/J0/./org.apache.solr.cloud.BasicDistributedZkTest-1355729494208/jetty1/index forceNew:false
[junit4:junit4]   2> 4130 T1419 oasc.SolrDeletionPolicy.onCommit SolrDeletionPolicy.onCommit: commits:num=1
[junit4:junit4]   2> 		commit{dir=RateLimitedDirectoryWrapper(NRTCachingDirectory(org.apache.lucene.store.NIOFSDirectory@/usr/home/hudson/hudson-slave/workspace/Lucene-Solr-NightlyTests-4.x/solr/build/solr-core/test/J0/org.apache.solr.cloud.BasicDistributedZkTest-1355729494208/jetty1/index lockFactory=org.apache.lucene.store.NativeFSLockFactory@1cd810d1; maxCacheMB=48.0 maxMergeSizeMB=4.0)),segFN=segments_1,generation=1,filenames=[segments_1]
[junit4:junit4]   2> 4131 T1419 oasc.SolrDeletionPolicy.updateCommits newest commit = 1[segments_1]
[junit4:junit4]   2> 4131 T1419 oasc.CachingDirectoryFactory.close Releasing directory:/usr/home/hudson/hudson-slave/workspace/Lucene-Solr-NightlyTests-4.x/solr/build/solr-core/test/J0/./org.apache.solr.cloud.BasicDistributedZkTest-1355729494208/jetty1/index
[junit4:junit4]   2> 4132 T1419 oasc.SolrCore.initWriters created xml: solr.XMLResponseWriter
[junit4:junit4]   2> 4134 T1419 oasup.UpdateRequestProcessorChain.init inserting DistributedUpdateProcessorFactory into updateRequestProcessorChain "dedupe"
[junit4:junit4]   2> 4134 T1419 oasup.UpdateRequestProcessorChain.init inserting DistributedUpdateProcessorFactory into updateRequestProcessorChain "dedupe-allfields"
[junit4:junit4]   2> 4134 T1419 oasup.UpdateRequestProcessorChain.init inserting DistributedUpdateProcessorFactory into updateRequestProcessorChain "stored_sig"
[junit4:junit4]   2> 4135 T1419 oasup.UpdateRequestProcessorChain.init inserting DistributedUpdateProcessorFactory into updateRequestProcessorChain "uniq-fields"
[junit4:junit4]   2> 4135 T1419 oasup.UpdateRequestProcessorChain.init inserting DistributedUpdateProcessorFactory into updateRequestProcessorChain "distrib-dup-test-chain-implicit"
[junit4:junit4]   2> 4136 T1419 oasc.RequestHandlers.initHandlersFromConfig adding lazy requestHandler: solr.ReplicationHandler
[junit4:junit4]   2> 4136 T1419 oasc.RequestHandlers.initHandlersFromConfig created /replication: solr.ReplicationHandler
[junit4:junit4]   2> 4137 T1419 oasc.RequestHandlers.initHandlersFromConfig created standard: solr.StandardRequestHandler
[junit4:junit4]   2> 4138 T1419 oasc.RequestHandlers.initHandlersFromConfig created /get: solr.RealTimeGetHandler
[junit4:junit4]   2> 4139 T1419 oasc.RequestHandlers.initHandlersFromConfig created dismax: solr.SearchHandler
[junit4:junit4]   2> 4139 T1419 oasc.RequestHandlers.initHandlersFromConfig created mock: org.apache.solr.core.MockQuerySenderListenerReqHandler
[junit4:junit4]   2> 4140 T1419 oasc.RequestHandlers.initHandlersFromConfig created /admin/: org.apache.solr.handler.admin.AdminHandlers
[junit4:junit4]   2> 4141 T1419 oasc.RequestHandlers.initHandlersFromConfig created defaults: solr.StandardRequestHandler
[junit4:junit4]   2> 4141 T1419 oasc.RequestHandlers.initHandlersFromConfig adding lazy requestHandler: solr.StandardRequestHandler
[junit4:junit4]   2> 4141 T1419 oasc.RequestHandlers.initHandlersFromConfig created lazy: solr.StandardRequestHandler
[junit4:junit4]   2> 4142 T1419 oasc.RequestHandlers.initHandlersFromConfig created /update: solr.UpdateRequestHandler
[junit4:junit4]   2> 4143 T1419 oasc.RequestHandlers.initHandlersFromConfig created /terms: org.apache.solr.handler.component.SearchHandler
[junit4:junit4]   2> 4144 T1419 oasc.RequestHandlers.initHandlersFromConfig created spellCheckCompRH: org.apache.solr.handler.component.SearchHandler
[junit4:junit4]   2> 4145 T1419 oasc.RequestHandlers.initHandlersFromConfig created spellCheckCompRH_Direct: org.apache.solr.handler.component.SearchHandler
[junit4:junit4]   2> 4145 T1419 oasc.RequestHandlers.initHandlersFromConfig created spellCheckWithWordbreak: org.apache.solr.handler.component.SearchHandler
[junit4:junit4]   2> 4146 T1419 oasc.RequestHandlers.initHandlersFromConfig created spellCheckWithWordbreak_Direct: org.apache.solr.handler.component.SearchHandler
[junit4:junit4]   2> 4147 T1419 oasc.RequestHandlers.initHandlersFromConfig created spellCheckCompRH1: org.apache.solr.handler.component.SearchHandler
[junit4:junit4]   2> 4148 T1419 oasc.RequestHandlers.initHandlersFromConfig created mltrh: org.apache.solr.handler.component.SearchHandler
[junit4:junit4]   2> 4149 T1419 oasc.RequestHandlers.initHandlersFromConfig created tvrh: org.apache.solr.handler.component.SearchHandler
[junit4:junit4]   2> 4150 T1419 oasc.RequestHandlers.initHandlersFromConfig created /mlt: solr.MoreLikeThisHandler
[junit4:junit4]   2> 4150 T1419 oasc.RequestHandlers.initHandlersFromConfig created /debug/dump: solr.DumpRequestHandler
[junit4:junit4]   2> 4158 T1419 oashl.XMLLoader.init xsltCacheLifetimeSeconds=60
[junit4:junit4]   2> 4162 T1419 oasc.SolrCore.initDeprecatedSupport WARNING solrconfig.xml uses deprecated <admin/gettableFiles>, Please update your config to use the ShowFileRequestHandler.
[junit4:junit4]   2> 4164 T1419 oasc.SolrCore.initDeprecatedSupport WARNING adding ShowFileRequestHandler with hidden files: [SCHEMA.XML, OLD_SYNONYMS.TXT, STOPWORDS.TXT, PROTWORDS.TXT, OPEN-EXCHANGE-RATES.JSON, SYNONYMS.TXT, CURRENCY.XML, MAPPING-ISOLATIN1ACCENT.TXT]
[junit4:junit4]   2> 4166 T1419 oasc.CachingDirectoryFactory.close Releasing directory:/usr/home/hudson/hudson-slave/workspace/Lucene-Solr-NightlyTests-4.x/solr/build/solr-core/test/J0/./org.apache.solr.cloud.BasicDistributedZkTest-1355729494208/jetty1
[junit4:junit4]   2> 4168 T1419 oass.SolrIndexSearcher.<init> Opening Searcher@1275c0bb main
[junit4:junit4]   2> 4169 T1419 oasu.CommitTracker.<init> Hard AutoCommit: disabled
[junit4:junit4]   2> 4169 T1419 oasu.CommitTracker.<init> Soft AutoCommit: disabled
[junit4:junit4]   2> 4170 T1419 oashc.SpellCheckComponent.inform Initializing spell checkers
[junit4:junit4]   2> 4177 T1419 oass.DirectSolrSpellChecker.init init: {name=direct,classname=DirectSolrSpellChecker,field=lowerfilt,minQueryLength=3}
[junit4:junit4]   2> 4238 T1420 oasc.SolrCore.registerSearcher [collection1] Registered new searcher Searcher@1275c0bb main{StandardDirectoryReader(segments_1:1)}
[junit4:junit4]   2> 4242 T1419 oasc.ZkController.publish publishing core=collection1 state=down
[junit4:junit4]   2> 4242 T1419 oasc.ZkController.publish numShards not found on descriptor - reading it from system property
[junit4:junit4]   2> 4318 T1400 oascc.ZkStateReader.updateClusterState Updating cloud state from ZooKeeper... 
[junit4:junit4]   2> 4319 T1400 oasc.Overseer$ClusterStateUpdater.updateState Update state numShards=2 message={
[junit4:junit4]   2> 	  "operation":"state",
[junit4:junit4]   2> 	  "numShards":"2",
[junit4:junit4]   2> 	  "shard":null,
[junit4:junit4]   2> 	  "roles":null,
[junit4:junit4]   2> 	  "state":"down",
[junit4:junit4]   2> 	  "core":"collection1",
[junit4:junit4]   2> 	  "collection":"collection1",
[junit4:junit4]   2> 	  "node_name":"127.0.0.1:47665_",
[junit4:junit4]   2> 	  "base_url":"http://127.0.0.1:47665"}
[junit4:junit4]   2> 4319 T1400 oasc.Overseer$ClusterStateUpdater.createCollection Create collection collection1 with numShards 2
[junit4:junit4]   2> 4319 T1400 oasc.Overseer$ClusterStateUpdater.updateState Assigning new node to shard shard=shard1
[junit4:junit4]   2> 4332 T1405 oascc.ZkStateReader$2.process A cluster state change: WatchedEvent state:SyncConnected type:NodeDataChanged path:/clusterstate.json, has occurred - updating... (live nodes size: 2)
[junit4:junit4]   2> 4332 T1418 oascc.ZkStateReader$2.process A cluster state change: WatchedEvent state:SyncConnected type:NodeDataChanged path:/clusterstate.json, has occurred - updating... (live nodes size: 2)
[junit4:junit4]   2> 4332 T1399 oascc.ZkStateReader$2.process A cluster state change: WatchedEvent state:SyncConnected type:NodeDataChanged path:/clusterstate.json, has occurred - updating... (live nodes size: 2)
[junit4:junit4]   2> 4745 T1419 oasc.CoreContainer.registerCore registering core: collection1
[junit4:junit4]   2> 4745 T1419 oasc.ZkController.register Register shard - core:collection1 address:http://127.0.0.1:47665 shardId:shard1
[junit4:junit4]   2> 4746 T1419 oascc.SolrZkClient.makePath makePath: /collections/collection1/leader_elect/shard1/election
[junit4:junit4]   2> 4764 T1382 oazs.PrepRequestProcessor.pRequest Got user-level KeeperException when processing sessionid:0x13ba7c660c70006 type:delete cxid:0x45 zxid:0x5b txntype:-1 reqpath:n/a Error Path:/solr/collections/collection1/leaders Error:KeeperErrorCode = NoNode for /solr/collections/collection1/leaders
[junit4:junit4]   2> 4765 T1419 oasc.ShardLeaderElectionContext.runLeaderProcess Running the leader process.
[junit4:junit4]   2> 4766 T1382 oazs.PrepRequestProcessor.pRequest Got user-level KeeperException when processing sessionid:0x13ba7c660c70006 type:create cxid:0x46 zxid:0x5c txntype:-1 reqpath:n/a Error Path:/solr/overseer Error:KeeperErrorCode = NodeExists for /solr/overseer
[junit4:junit4]   2> 4775 T1419 oasc.ShardLeaderElectionContext.waitForReplicasToComeUp Enough replicas found to continue.
[junit4:junit4]   2> 4776 T1419 oasc.ShardLeaderElectionContext.runLeaderProcess I may be the new leader - try and sync
[junit4:junit4]   2> 4776 T1419 oasc.SyncStrategy.sync Sync replicas to http://127.0.0.1:47665/collection1/
[junit4:junit4]   2> 4776 T1419 oasc.SyncStrategy.syncReplicas Sync Success - now sync replicas to me
[junit4:junit4]   2> 4777 T1419 oasc.SyncStrategy.syncToMe http://127.0.0.1:47665/collection1/ has no replicas
[junit4:junit4]   2> 4777 T1419 oasc.ShardLeaderElectionContext.runLeaderProcess I am the new leader: http://127.0.0.1:47665/collection1/
[junit4:junit4]   2> 4777 T1419 oascc.SolrZkClient.makePath makePath: /collections/collection1/leaders/shard1
[junit4:junit4]   2> 4783 T1382 oazs.PrepRequestProcessor.pRequest Got user-level KeeperException when processing sessionid:0x13ba7c660c70006 type:create cxid:0x50 zxid:0x60 txntype:-1 reqpath:n/a Error Path:/solr/overseer Error:KeeperErrorCode = NodeExists for /solr/overseer
[junit4:junit4]   2> 4838 T1400 oascc.ZkStateReader.updateClusterState Updating cloud state from ZooKeeper... 
[junit4:junit4]   2> 4854 T1399 oascc.ZkStateReader$2.process A cluster state change: WatchedEvent state:SyncConnected type:NodeDataChanged path:/clusterstate.json, has occurred - updating... (live nodes size: 2)
[junit4:junit4]   2> 4854 T1405 oascc.ZkStateReader$2.process A cluster state change: WatchedEvent state:SyncConnected type:NodeDataChanged path:/clusterstate.json, has occurred - updating... (live nodes size: 2)
[junit4:junit4]   2> 4854 T1418 oascc.ZkStateReader$2.process A cluster state change: WatchedEvent state:SyncConnected type:NodeDataChanged path:/clusterstate.json, has occurred - updating... (live nodes size: 2)
[junit4:junit4]   2> 4895 T1419 oasc.ZkController.register We are http://127.0.0.1:47665/collection1/ and leader is http://127.0.0.1:47665/collection1/
[junit4:junit4]   2> 4895 T1419 oasc.ZkController.register No LogReplay needed for core=collection1 baseURL=http://127.0.0.1:47665
[junit4:junit4]   2> 4895 T1419 oasc.ZkController.checkRecovery I am the leader, no recovery necessary
[junit4:junit4]   2> 4896 T1419 oasc.ZkController.publish publishing core=collection1 state=active
[junit4:junit4]   2> 4896 T1419 oasc.ZkController.publish numShards not found on descriptor - reading it from system property
[junit4:junit4]   2> 4898 T1419 oascc.ZkStateReader.updateClusterState Updating cloud state from ZooKeeper... 
[junit4:junit4]   2> 4899 T1377 oass.SolrDispatchFilter.init user.dir=/usr/home/hudson/hudson-slave/workspace/Lucene-Solr-NightlyTests-4.x/solr/build/solr-core/test/J0
[junit4:junit4]   2> 4900 T1377 oass.SolrDispatchFilter.init SolrDispatchFilter.init() done
[junit4:junit4]   2> 4901 T1377 oascsi.HttpClientUtil.createClient Creating new http client, config:maxConnections=128&maxConnectionsPerHost=32&followRedirects=false
[junit4:junit4]   2> 5073 T1377 oejs.Server.doStart jetty-8.1.8.v20121106
[junit4:junit4]   2> 5076 T1377 oejs.AbstractConnector.doStart Started SocketConnector@127.0.0.1:21485
[junit4:junit4]   2> 5077 T1377 oasc.SolrResourceLoader.locateSolrHome JNDI not configured for solr (NoInitialContextEx)
[junit4:junit4]   2> 5078 T1377 oasc.SolrResourceLoader.locateSolrHome using system property solr.solr.home: /usr/home/hudson/hudson-slave/workspace/Lucene-Solr-NightlyTests-4.x/solr/build/solr-core/test/J0/./org.apache.solr.cloud.BasicDistributedZkTest-jetty2-1355729499117
[junit4:junit4]   2> 5078 T1377 oasc.SolrResourceLoader.<init> new SolrResourceLoader for deduced Solr Home: '/usr/home/hudson/hudson-slave/workspace/Lucene-Solr-NightlyTests-4.x/solr/build/solr-core/test/J0/./org.apache.solr.cloud.BasicDistributedZkTest-jetty2-1355729499117/'
[junit4:junit4]   2> 5113 T1377 oass.SolrDispatchFilter.init SolrDispatchFilter.init()
[junit4:junit4]   2> 5114 T1377 oasc.SolrResourceLoader.locateSolrHome JNDI not configured for solr (NoInitialContextEx)
[junit4:junit4]   2> 5114 T1377 oasc.SolrResourceLoader.locateSolrHome using system property solr.solr.home: /usr/home/hudson/hudson-slave/workspace/Lucene-Solr-NightlyTests-4.x/solr/build/solr-core/test/J0/./org.apache.solr.cloud.BasicDistributedZkTest-jetty2-1355729499117
[junit4:junit4]   2> 5115 T1377 oasc.CoreContainer$Initializer.initialize looking for solr.xml: /usr/home/hudson/hudson-slave/workspace/Lucene-Solr-NightlyTests-4.x/solr/build/solr-core/test/J0/./org.apache.solr.cloud.BasicDistributedZkTest-jetty2-1355729499117/solr.xml
[junit4:junit4]   2> 5116 T1377 oasc.CoreContainer.<init> New CoreContainer 1680482184
[junit4:junit4]   2> 5116 T1377 oasc.CoreContainer.load Loading CoreContainer using Solr Home: '/usr/home/hudson/hudson-slave/workspace/Lucene-Solr-NightlyTests-4.x/solr/build/solr-core/test/J0/./org.apache.solr.cloud.BasicDistributedZkTest-jetty2-1355729499117/'
[junit4:junit4]   2> 5117 T1377 oasc.SolrResourceLoader.<init> new SolrResourceLoader for directory: '/usr/home/hudson/hudson-slave/workspace/Lucene-Solr-NightlyTests-4.x/solr/build/solr-core/test/J0/./org.apache.solr.cloud.BasicDistributedZkTest-jetty2-1355729499117/'
[junit4:junit4]   2> 5141 T1377 oashc.HttpShardHandlerFactory.getParameter Setting socketTimeout to: 30000
[junit4:junit4]   2> 5142 T1377 oashc.HttpShardHandlerFactory.getParameter Setting urlScheme to: http://
[junit4:junit4]   2> 5142 T1377 oashc.HttpShardHandlerFactory.getParameter Setting connTimeout to: 15000
[junit4:junit4]   2> 5143 T1377 oashc.HttpShardHandlerFactory.getParameter Setting maxConnectionsPerHost to: 20
[junit4:junit4]   2> 5143 T1377 oashc.HttpShardHandlerFactory.getParameter Setting corePoolSize to: 0
[junit4:junit4]   2> 5144 T1377 oashc.HttpShardHandlerFactory.getParameter Setting maximumPoolSize to: 2147483647
[junit4:junit4]   2> 5144 T1377 oashc.HttpShardHandlerFactory.getParameter Setting maxThreadIdleTime to: 5
[junit4:junit4]   2> 5145 T1377 oashc.HttpShardHandlerFactory.getParameter Setting sizeOfQueue to: -1
[junit4:junit4]   2> 5145 T1377 oashc.HttpShardHandlerFactory.getParameter Setting fairnessPolicy to: false
[junit4:junit4]   2> 5146 T1377 oascsi.HttpClientUtil.createClient Creating new http client, config:maxConnectionsPerHost=20&maxConnections=10000&socketTimeout=30000&connTimeout=15000&retry=false
[junit4:junit4]   2> 5165 T1377 oasc.CoreContainer.load Registering Log Listener
[junit4:junit4]   2> 5184 T1377 oasc.CoreContainer.initZooKeeper Zookeeper client=127.0.0.1:27598/solr
[junit4:junit4]   2> 5185 T1377 oasc.ZkController.checkChrootPath zkHost includes chroot
[junit4:junit4]   2> 5185 T1377 oaz.ZooKeeper.<init> Initiating client connection, connectString=127.0.0.1:27598 sessionTimeout=60000 watcher=org.apache.solr.common.cloud.ConnectionManager@3fa96785
[junit4:junit4]   2> 5186 T1377 oascc.ConnectionManager.waitForConnected Waiting for client to connect to ZooKeeper
[junit4:junit4]   2> 5187 T1430 oaz.ClientCnxn$SendThread.logStartConnect Opening socket connection to server localhost/127.0.0.1:27598. Will not attempt to authenticate using SASL (access denied (javax.security.auth.AuthPermission getLoginConfiguration))
[junit4:junit4]   2> 5188 T1430 oaz.ClientCnxn$SendThread.primeConnection Socket connection established to localhost/127.0.0.1:27598, initiating session
[junit4:junit4]   2> 5188 T1379 oazs.NIOServerCnxnFactory.run Accepted socket connection from /140.211.11.196:36657
[junit4:junit4]   2> 5188 T1379 oazs.ZooKeeperServer.processConnectRequest Client attempting to establish new session at /140.211.11.196:36657
[junit4:junit4]   2> 5190 T1381 oazs.ZooKeeperServer.finishSessionInit Established session 0x13ba7c660c70007 with negotiated timeout 20000 for client /140.211.11.196:36657
[junit4:junit4]   2> 5190 T1430 oaz.ClientCnxn$SendThread.onConnected Session establishment complete on server localhost/127.0.0.1:27598, sessionid = 0x13ba7c660c70007, negotiated timeout = 20000
[junit4:junit4]   2> 5191 T1431 oascc.ConnectionManager.process Watcher org.apache.solr.common.cloud.ConnectionManager@3fa96785 name:ZooKeeperConnection Watcher:127.0.0.1:27598 got event WatchedEvent state:SyncConnected type:None path:null path:null type:None
[junit4:junit4]   2> 5191 T1377 oascc.ConnectionManager.waitForConnected Client is connected to ZooKeeper
[junit4:junit4]   2> 5192 T1382 oazs.PrepRequestProcessor.pRequest2Txn Processed session termination for sessionid: 0x13ba7c660c70007
[junit4:junit4]   2> 5202 T1431 oaz.ClientCnxn$EventThread.run EventThread shut down
[junit4:junit4]   2> 5202 T1379 oazs.NIOServerCnxn.closeSock Closed socket connection for client /140.211.11.196:36657 which had sessionid 0x13ba7c660c70007
[junit4:junit4]   2> 5202 T1377 oaz.ZooKeeper.close Session: 0x13ba7c660c70007 closed
[junit4:junit4]   2> 5202 T1377 oascsi.HttpClientUtil.createClient Creating new http client, config:maxConnections=500&maxConnectionsPerHost=16&socketTimeout=15000&connTimeout=30000
[junit4:junit4]   2> 5213 T1377 oaz.ZooKeeper.<init> Initiating client connection, connectString=127.0.0.1:27598/solr sessionTimeout=30000 watcher=org.apache.solr.common.cloud.ConnectionManager@616b99f1
[junit4:junit4]   2> 5214 T1377 oascc.ConnectionManager.waitForConnected Waiting for client to connect to ZooKeeper
[junit4:junit4]   2> 5214 T1432 oaz.ClientCnxn$SendThread.logStartConnect Opening socket connection to server localhost/127.0.0.1:27598. Will not attempt to authenticate using SASL (access denied (javax.security.auth.AuthPermission getLoginConfiguration))
[junit4:junit4]   2> 5215 T1432 oaz.ClientCnxn$SendThread.primeConnection Socket connection established to localhost/127.0.0.1:27598, initiating session
[junit4:junit4]   2> 5215 T1379 oazs.NIOServerCnxnFactory.run Accepted socket connection from /140.211.11.196:53980
[junit4:junit4]   2> 5215 T1379 oazs.ZooKeeperServer.processConnectRequest Client attempting to establish new session at /140.211.11.196:53980
[junit4:junit4]   2> 5217 T1381 oazs.ZooKeeperServer.finishSessionInit Established session 0x13ba7c660c70008 with negotiated timeout 20000 for client /140.211.11.196:53980
[junit4:junit4]   2> 5217 T1432 oaz.ClientCnxn$SendThread.onConnected Session establishment complete on server localhost/127.0.0.1:27598, sessionid = 0x13ba7c660c70008, negotiated timeout = 20000
[junit4:junit4]   2> 5217 T1433 oascc.ConnectionManager.process Watcher org.apache.solr.common.cloud.ConnectionManager@616b99f1 name:ZooKeeperConnection Watcher:127.0.0.1:27598/solr got event WatchedEvent state:SyncConnected type:None path:null path:null type:None
[junit4:junit4]   2> 5217 T1377 oascc.ConnectionManager.waitForConnected Client is connected to ZooKeeper
[junit4:junit4]   2> 5218 T1382 oazs.PrepRequestProcessor.pRequest Got user-level KeeperException when processing sessionid:0x13ba7c660c70008 type:create cxid:0x1 zxid:0x6d txntype:-1 reqpath:n/a Error Path:/solr/overseer Error:KeeperErrorCode = NodeExists for /solr/overseer
[junit4:junit4]   2> 5220 T1382 oazs.PrepRequestProcessor.pRequest Got user-level KeeperException when processing sessionid:0x13ba7c660c70008 type:create cxid:0x2 zxid:0x6e txntype:-1 reqpath:n/a Error Path:/solr/overseer Error:KeeperErrorCode = NodeExists for /solr/overseer
[junit4:junit4]   2> 5228 T1377 oasc.ZkController.createEphemeralLiveNode Register node as live in ZooKeeper:/live_nodes/127.0.0.1:21485_
[junit4:junit4]   2> 5229 T1382 oazs.PrepRequestProcessor.pRequest Got user-level KeeperException when processing sessionid:0x13ba7c660c70008 type:delete cxid:0x4 zxid:0x6f txntype:-1 reqpath:n/a Error Path:/solr/live_nodes/127.0.0.1:21485_ Error:KeeperErrorCode = NoNode for /solr/live_nodes/127.0.0.1:21485_
[junit4:junit4]   2> 5230 T1377 oascc.SolrZkClient.makePath makePath: /live_nodes/127.0.0.1:21485_
[junit4:junit4]   2> 5233 T1405 oascc.ZkStateReader$2.process A cluster state change: WatchedEvent state:SyncConnected type:NodeChildrenChanged path:/live_nodes, has occurred - updating... (live nodes size: 2)
[junit4:junit4]   2> 5233 T1399 oascc.ZkStateReader$2.process A cluster state change: WatchedEvent state:SyncConnected type:NodeChildrenChanged path:/live_nodes, has occurred - updating... (live nodes size: 2)
[junit4:junit4]   2> 5234 T1418 oascc.ZkStateReader$3.process Updating live nodes... (3)
[junit4:junit4]   2> 5234 T1418 oascc.ZkStateReader$2.process A cluster state change: WatchedEvent state:SyncConnected type:NodeChildrenChanged path:/live_nodes, has occurred - updating... (live nodes size: 3)
[junit4:junit4]   2> 5235 T1405 oascc.ZkStateReader$3.process Updating live nodes... (3)
[junit4:junit4]   2> 5235 T1399 oascc.ZkStateReader$3.process Updating live nodes... (3)
[junit4:junit4]   2> 5243 T1377 oascc.ZkStateReader.createClusterStateWatchersAndUpdate Updating cluster state from ZooKeeper... 
[junit4:junit4]   2> 5251 T1434 oasc.CoreContainer.create Creating SolrCore 'collection1' using instanceDir: /usr/home/hudson/hudson-slave/workspace/Lucene-Solr-NightlyTests-4.x/solr/build/solr-core/test/J0/./org.apache.solr.cloud.BasicDistributedZkTest-jetty2-1355729499117/collection1
[junit4:junit4]   2> 5251 T1434 oasc.ZkController.createCollectionZkNode Check for collection zkNode:collection1
[junit4:junit4]   2> 5252 T1434 oasc.ZkController.createCollectionZkNode Collection zkNode exists
[junit4:junit4]   2> 5252 T1434 oasc.ZkController.readConfigName Load collection config from:/collections/collection1
[junit4:junit4]   2> 5254 T1434 oasc.SolrResourceLoader.<init> new SolrResourceLoader for directory: '/usr/home/hudson/hudson-slave/workspace/Lucene-Solr-NightlyTests-4.x/solr/build/solr-core/test/J0/./org.apache.solr.cloud.BasicDistributedZkTest-jetty2-1355729499117/collection1/'
[junit4:junit4]   2> 5255 T1434 oasc.SolrResourceLoader.replaceClassLoader Adding 'file:/usr/home/hudson/hudson-slave/workspace/Lucene-Solr-NightlyTests-4.x/solr/build/solr-core/test/J0/org.apache.solr.cloud.BasicDistributedZkTest-jetty2-1355729499117/collection1/lib/classes/' to classloader
[junit4:junit4]   2> 5255 T1434 oasc.SolrResourceLoader.replaceClassLoader Adding 'file:/usr/home/hudson/hudson-slave/workspace/Lucene-Solr-NightlyTests-4.x/solr/build/solr-core/test/J0/org.apache.solr.cloud.BasicDistributedZkTest-jetty2-1355729499117/collection1/lib/README' to classloader
[junit4:junit4]   2> 5314 T1434 oasc.SolrConfig.<init> Using Lucene MatchVersion: LUCENE_41
[junit4:junit4]   2> 5368 T1400 oascc.ZkStateReader.updateClusterState Updating cloud state from ZooKeeper... 
[junit4:junit4]   2> 5369 T1400 oasc.Overseer$ClusterStateUpdater.updateState Update state numShards=2 message={
[junit4:junit4]   2> 	  "operation":"state",
[junit4:junit4]   2> 	  "numShards":"2",
[junit4:junit4]   2> 	  "shard":"shard1",
[junit4:junit4]   2> 	  "roles":null,
[junit4:junit4]   2> 	  "state":"active",
[junit4:junit4]   2> 	  "core":"collection1",
[junit4:junit4]   2> 	  "collection":"collection1",
[junit4:junit4]   2> 	  "node_name":"127.0.0.1:47665_",
[junit4:junit4]   2> 	  "base_url":"http://127.0.0.1:47665"}
[junit4:junit4]   2> 5381 T1405 oascc.ZkStateReader$2.process A cluster state change: WatchedEvent state:SyncConnected type:NodeDataChanged path:/clusterstate.json, has occurred - updating... (live nodes size: 3)
[junit4:junit4]   2> 5381 T1399 oascc.ZkStateReader$2.process A cluster state change: WatchedEvent state:SyncConnected type:NodeDataChanged path:/clusterstate.json, has occurred - updating... (live nodes size: 3)
[junit4:junit4]   2> 5381 T1433 oascc.ZkStateReader$2.process A cluster state change: WatchedEvent state:SyncConnected type:NodeDataChanged path:/clusterstate.json, has occurred - updating... (live nodes size: 3)
[junit4:junit4]   2> 5381 T1418 oascc.ZkStateReader$2.process A cluster state change: WatchedEvent state:SyncConnected type:NodeDataChanged path:/clusterstate.json, has occurred - updating... (live nodes size: 3)
[junit4:junit4]   2> 5384 T1434 oasc.SolrConfig.<init> Loaded SolrConfig: solrconfig.xml
[junit4:junit4]   2> 5485 T1434 oass.IndexSchema.readSchema Reading Solr Schema
[junit4:junit4]   2> 5492 T1434 oass.IndexSchema.readSchema Schema name=test
[junit4:junit4]   2> 6103 T1434 oass.OpenExchangeRatesOrgProvider.init Initialized with rates=open-exchange-rates.json, refreshInterval=1440.
[junit4:junit4]   2> 6115 T1434 oass.IndexSchema.readSchema default search field in schema is text
[junit4:junit4]   2> 6119 T1434 oass.IndexSchema.readSchema unique key field: id
[junit4:junit4]   2> 6136 T1434 oass.FileExchangeRateProvider.reload Reloading exchange rates from file currency.xml
[junit4:junit4]   2> 6142 T1434 oass.FileExchangeRateProvider.reload Reloading exchange rates from file currency.xml
[junit4:junit4]   2> 6146 T1434 oass.OpenExchangeRatesOrgProvider.reload Reloading exchange rates from open-exchange-rates.json
[junit4:junit4]   2> 6148 T1434 oass.OpenExchangeRatesOrgProvider.reload Reloading exchange rates from open-exchange-rates.json
[junit4:junit4]   2> 6150 T1434 oasc.SolrCore.<init> [collection1] Opening new SolrCore at /usr/home/hudson/hudson-slave/workspace/Lucene-Solr-NightlyTests-4.x/solr/build/solr-core/test/J0/./org.apache.solr.cloud.BasicDistributedZkTest-jetty2-1355729499117/collection1/, dataDir=./org.apache.solr.cloud.BasicDistributedZkTest-1355729494208/jetty2/
[junit4:junit4]   2> 6150 T1434 oasc.JmxMonitoredMap.<init> JMX monitoring is enabled. Adding Solr mbeans to JMX Server: com.sun.jmx.mbeanserver.JmxMBeanServer@6bab600f
[junit4:junit4]   2> 6151 T1434 oasc.SolrCore.initDirectoryFactory solr.NRTCachingDirectoryFactory
[junit4:junit4]   2> 6152 T1434 oasc.CachingDirectoryFactory.get return new directory for /usr/home/hudson/hudson-slave/workspace/Lucene-Solr-NightlyTests-4.x/solr/build/solr-core/test/J0/./org.apache.solr.cloud.BasicDistributedZkTest-1355729494208/jetty2 forceNew:false
[junit4:junit4]   2> 6153 T1434 oasc.CachingDirectoryFactory.close Releasing directory:/usr/home/hudson/hudson-slave/workspace/Lucene-Solr-NightlyTests-4.x/solr/build/solr-core/test/J0/./org.apache.solr.cloud.BasicDistributedZkTest-1355729494208/jetty2
[junit4:junit4]   2> 6153 T1434 oasc.SolrCore.getNewIndexDir New index directory detected: old=null new=./org.apache.solr.cloud.BasicDistributedZkTest-1355729494208/jetty2/index/
[junit4:junit4]   2> 6154 T1434 oasc.SolrCore.initIndex WARNING [collection1] Solr index directory './org.apache.solr.cloud.BasicDistributedZkTest-1355729494208/jetty2/index' doesn't exist. Creating new index...
[junit4:junit4]   2> 6154 T1434 oasc.CachingDirectoryFactory.get return new directory for /usr/home/hudson/hudson-slave/workspace/Lucene-Solr-NightlyTests-4.x/solr/build/solr-core/test/J0/./org.apache.solr.cloud.BasicDistributedZkTest-1355729494208/jetty2/index forceNew:false
[junit4:junit4]   2> 6190 T1434 oasc.SolrDeletionPolicy.onCommit SolrDeletionPolicy.onCommit: commits:num=1
[junit4:junit4]   2> 		commit{dir=RateLimitedDirectoryWrapper(NRTCachingDirectory(org.apache.lucene.store.NIOFSDirectory@/usr/home/hudson/hudson-slave/workspace/Lucene-Solr-NightlyTests-4.x/solr/build/solr-core/test/J0/org.apache.solr.cloud.BasicDistributedZkTest-1355729494208/jetty2/index lockFactory=org.apache.lucene.store.NativeFSLockFactory@2e86563d; maxCacheMB=48.0 maxMergeSizeMB=4.0)),segFN=segments_1,generation=1,filenames=[segments_1]
[junit4:junit4]   2> 6190 T1434 oasc.SolrDeletionPolicy.updateCommits newest commit = 1[segments_1]
[junit4:junit4]   2> 6191 T1434 oasc.CachingDirectoryFactory.close Releasing directory:/usr/home/hudson/hudson-slave/workspace/Lucene-Solr-NightlyTests-4.x/solr/build/solr-core/test/J0/./org.apache.solr.cloud.BasicDistributedZkTest-1355729494208/jetty2/index
[junit4:junit4]   2> 6191 T1434 oasc.SolrCore.initWriters created xml: solr.XMLResponseWriter
[junit4:junit4]   2> 6193 T1434 oasup.UpdateRequestProcessorChain.init inserting DistributedUpdateProcessorFactory into updateRequestProcessorChain "dedupe"
[junit4:junit4]   2> 6194 T1434 oasup.UpdateRequestProcessorChain.init inserting DistributedUpdateProcessorFactory into updateRequestProcessorChain "dedupe-allfields"
[junit4:junit4]   2> 6194 T1434 oasup.UpdateRequestProcessorChain.init inserting DistributedUpdateProcessorFactory into updateRequestProcessorChain "stored_sig"
[junit4:junit4]   2> 6194 T1434 oasup.UpdateRequestProcessorChain.init inserting DistributedUpdateProcessorFactory into updateRequestProcessorChain "uniq-fields"
[junit4:junit4]   2> 6195 T1434 oasup.UpdateRequestProcessorChain.init inserting DistributedUpdateProcessorFactory into updateRequestProcessorChain "distrib-dup-test-chain-implicit"
[junit4:junit4]   2> 6195 T1434 oasc.RequestHandlers.initHandlersFromConfig adding lazy requestHandler: solr.ReplicationHandler
[junit4:junit4]   2> 6196 T1434 oasc.RequestHandlers.initHandlersFromConfig created /replication: solr.ReplicationHandler
[junit4:junit4]   2> 6197 T1434 oasc.RequestHandlers.initHandlersFromConfig created standard: solr.StandardRequestHandler
[junit4:junit4]   2> 6198 T1434 oasc.RequestHandlers.initHandlersFromConfig created /get: solr.RealTimeGetHandler
[junit4:junit4]   2> 6198 T1434 oasc.RequestHandlers.initHandlersFromConfig created dismax: solr.SearchHandler
[junit4:junit4]   2> 6199 T1434 oasc.RequestHandlers.initHandlersFromConfig created mock: org.apache.solr.core.MockQuerySenderListenerReqHandler
[junit4:junit4]   2> 6200 T1434 oasc.RequestHandlers.initHandlersFromConfig created /admin/: org.apache.solr.handler.admin.AdminHandlers
[junit4:junit4]   2> 6200 T1434 oasc.RequestHandlers.initHandlersFromConfig created defaults: solr.StandardRequestHandler
[junit4:junit4]   2> 6201 T1434 oasc.RequestHandlers.initHandlersFromConfig adding lazy requestHandler: solr.StandardRequestHandler
[junit4:junit4]   2> 6201 T1434 oasc.RequestHandlers.initHandlersFromConfig created lazy: solr.StandardRequestHandler
[junit4:junit4]   2> 6202 T1434 oasc.RequestHandlers.initHandlersFromConfig created /update: solr.UpdateRequestHandler
[junit4:junit4]   2> 6203 T1434 oasc.RequestHandlers.initHandlersFromConfig created /terms: org.apache.solr.handler.component.SearchHandler
[junit4:junit4]   2> 6204 T1434 oasc.RequestHandlers.initHandlersFromConfig created spellCheckCompRH: org.apache.solr.handler.component.SearchHandler
[junit4:junit4]   2> 6204 T1434 oasc.RequestHandlers.initHandlersFromConfig created spellCheckCompRH_Direct: org.apache.solr.handler.component.SearchHandler
[junit4:junit4]   2> 6205 T1434 oasc.RequestHandlers.initHandlersFromConfig created spellCheckWithWordbreak: org.apache.solr.handler.component.SearchHandler
[junit4:junit4]   2> 6206 T1434 oasc.RequestHandlers.initHandlersFromConfig created spellCheckWithWordbreak_Direct: org.apache.solr.handler.component.SearchHandler
[junit4:junit4]   2> 6207 T1434 oasc.RequestHandlers.initHandlersFromConfig created spellCheckCompRH1: org.apache.solr.handler.component.SearchHandler
[junit4:junit4]   2> 6208 T1434 oasc.RequestHandlers.initHandlersFromConfig created mltrh: org.apache.solr.handler.component.SearchHandler
[junit4:junit4]   2> 6209 T1434 oasc.RequestHandlers.initHandlersFromConfig created tvrh: org.apache.solr.handler.component.SearchHandler
[junit4:junit4]   2> 6209 T1434 oasc.RequestHandlers.initHandlersFromConfig created /mlt: solr.MoreLikeThisHandler
[junit4:junit4]   2> 6210 T1434 oasc.RequestHandlers.initHandlersFromConfig created /debug/dump: solr.DumpRequestHandler
[junit4:junit4]   2> 6217 T1434 oashl.XMLLoader.init xsltCacheLifetimeSeconds=60
[junit4:junit4]   2> 6222 T1434 oasc.SolrCore.initDeprecatedSupport WARNING solrconfig.xml uses deprecated <admin/gettableFiles>, Please update your config to use the ShowFileRequestHandler.
[junit4:junit4]   2> 6224 T1434 oasc.SolrCore.initDeprecatedSupport WARNING adding ShowFileRequestHandler with hidden files: [SCHEMA.XML, OLD_SYNONYMS.TXT, STOPWORDS.TXT, PROTWORDS.TXT, OPEN-EXCHANGE-RATES.JSON, SYNONYMS.TXT, CURRENCY.XML, MAPPING-ISOLATIN1ACCENT.TXT]
[junit4:junit4]   2> 6226 T1434 oasc.CachingDirectoryFactory.close Releasing directory:/usr/home/hudson/hudson-slave/workspace/Lucene-Solr-NightlyTests-4.x/solr/build/solr-core/test/J0/./org.apache.solr.cloud.BasicDistributedZkTest-1355729494208/jetty2
[junit4:junit4]   2> 6228 T1434 oass.SolrIndexSearcher.<init> Opening Searcher@3b36b0f1 main
[junit4:junit4]   2> 6229 T1434 oasu.CommitTracker.<init> Hard AutoCommit: disabled
[junit4:junit4]   2> 6229 T1434 oasu.CommitTracker.<init> Soft AutoCommit: disabled
[junit4:junit4]   2> 6230 T1434 oashc.SpellCheckComponent.inform Initializing spell checkers
[junit4:junit4]   2> 6237 T1434 oass.DirectSolrSpellChecker.init init: {name=direct,classname=DirectSolrSpellChecker,field=lowerfilt,minQueryLength=3}
[junit4:junit4]   2> 6289 T1435 oasc.SolrCore.registerSearcher [collection1] Registered new searcher Searcher@3b36b0f1 main{StandardDirectoryReader(segments_1:1)}
[junit4:junit4]   2> 6293 T1434 oasc.ZkController.publish publishing core=collection1 state=down
[junit4:junit4]   2> 6293 T1434 oasc.ZkController.publish numShards not found on descriptor - reading it from system property
[junit4:junit4]   2> 6389 T1400 oascc.ZkStateReader.updateClusterState Updating cloud state from ZooKeeper... 
[junit4:junit4]   2> 6389 T1400 oasc.Overseer$ClusterStateUpdater.updateState Update state numShards=2 message={
[junit4:junit4]   2> 	  "operation":"state",
[junit4:junit4]   2> 	  "numShards":"2",
[junit4:junit4]   2> 	  "shard":null,
[junit4:junit4]   2> 	  "roles":null,
[junit4:junit4]   2> 	  "state":"down",
[junit4:junit4]   2> 	  "core":"collection1",
[junit4:junit4]   2> 	  "collection":"collection1",
[junit4:junit4]   2> 	  "node_name":"127.0.0.1:21485_",
[junit4:junit4]   2> 	  "base_url":"http://127.0.0.1:21485"}
[junit4:junit4]   2> 6390 T1400 oasc.Overseer$ClusterStateUpdater.updateState Collection already exists with numShards=2
[junit4:junit4]   2> 6390 T1400 oasc.Overseer$ClusterStateUpdater.updateState Assigning new node to shard shard=shard2
[junit4:junit4]   2> 6403 T1405 oascc.ZkStateReader$2.process A cluster state change: WatchedEvent state:SyncConnected type:NodeDataChanged path:/clusterstate.json, has occurred - updating... (live nodes size: 3)
[junit4:junit4]   2> 6403 T1433 oascc.ZkStateReader$2.process A cluster state change: WatchedEvent state:SyncConnected type:NodeDataChanged path:/clusterstate.json, has occurred - updating... (live nodes size: 3)
[junit4:junit4]   2> 6403 T1399 oascc.ZkStateReader$2.process A cluster state change: WatchedEvent state:SyncConnected type:NodeDataChanged path:/clusterstate.json, has occurred - updating... (live nodes size: 3)
[junit4:junit4]   2> 6403 T1418 oascc.ZkStateReader$2.process A cluster state change: WatchedEvent state:SyncConnected type:NodeDataChanged path:/clusterstate.json, has occurred - updating... (live nodes size: 3)
[junit4:junit4]   2> 6796 T1434 oasc.CoreContainer.registerCore registering core: collection1
[junit4:junit4]   2> 6796 T1434 oasc.ZkController.register Register shard - core:collection1 address:http://127.0.0.1:21485 shardId:shard2
[junit4:junit4]   2> 6797 T1434 oascc.SolrZkClient.makePath makePath: /collections/collection1/leader_elect/shard2/election
[junit4:junit4]   2> 6865 T1382 oazs.PrepRequestProcessor.pRequest Got user-level KeeperException when processing sessionid:0x13ba7c660c70008 type:delete cxid:0x44 zxid:0x7e txntype:-1 reqpath:n/a Error Path:/solr/collections/collection1/leaders/shard2 Error:KeeperErrorCode = NoNode for /solr/collections/collection1/leaders/shard2
[junit4:junit4]   2> 6905 T1434 oasc.ShardLeaderElectionContext.runLeaderProcess Running the leader process.
[junit4:junit4]   2> 6906 T1382 oazs.PrepRequestProcessor.pRequest Got user-level KeeperException when processing sessionid:0x13ba7c660c70008 type:create cxid:0x45 zxid:0x7f txntype:-1 reqpath:n/a Error Path:/solr/overseer Error:KeeperErrorCode = NodeExists for /solr/overseer
[junit4:junit4]   2> 6940 T1434 oasc.ShardLeaderElectionContext.waitForReplicasToComeUp Enough replicas found to continue.
[junit4:junit4]   2> 6940 T1434 oasc.ShardLeaderElectionContext.runLeaderProcess I may be the new leader - try and sync
[junit4:junit4]   2> 6941 T1434 oasc.SyncStrategy.sync Sync replicas to http://127.0.0.1:21485/collection1/
[junit4:junit4]   2> 6941 T1400 oascc.ZkStateReader.updateClusterState Updating cloud state from ZooKeeper... 
[junit4:junit4]   2> 6941 T1434 oasc.SyncStrategy.syncReplicas Sync Success - now sync replicas to me
[junit4:junit4]   2> 6941 T1434 oasc.SyncStrategy.syncToMe http://127.0.0.1:21485/collection1/ has no replicas
[junit4:junit4]   2> 6942 T1434 oasc.ShardLeaderElectionContext.runLeaderProcess I am the new leader: http://127.0.0.1:21485/collection1/
[junit4:junit4]   2> 6942 T1434 oascc.SolrZkClient.makePath makePath: /collections/collection1/leaders/shard2
[junit4:junit4]   2> 7071 T1433 oascc.ZkStateReader$2.process A cluster state change: WatchedEvent state:SyncConnected type:NodeDataChanged path:/clusterstate.json, has occurred - updating... (live nodes size: 3)
[junit4:junit4]   2> 7071 T1405 oascc.ZkStateReader$2.process A cluster state change: WatchedEvent state:SyncConnected type:NodeDataChanged path:/clusterstate.json, has occurred - updating... (live nodes size: 3)
[junit4:junit4]   2> 7071 T1399 oascc.ZkStateReader$2.process A cluster state change: WatchedEvent state:SyncConnected type:NodeDataChanged path:/clusterstate.json, has occurred - updating... (live nodes size: 3)
[junit4:junit4]   2> 7071 T1418 oascc.ZkStateReader$2.process A cluster state change: WatchedEvent state:SyncConnected type:NodeDataChanged path:/clusterstate.json, has occurred - updating... (live nodes size: 3)
[junit4:junit4]   2> 7071 T1382 oazs.PrepRequestProcessor.pRequest Got user-level KeeperException when processing sessionid:0x13ba7c660c70008 type:create cxid:0x4e zxid:0x85 txntype:-1 reqpath:n/a Error Path:/solr/overseer Error:KeeperErrorCode = NodeExists for /solr/overseer
[junit4:junit4]   2> 7663 T1400 oascc.ZkStateReader.updateClusterState Updating cloud state from ZooKeeper... 
[junit4:junit4]   2> 7680 T1405 oascc.ZkStateReader$2.process A cluster state change: WatchedEvent state:SyncConnected type:NodeDataChanged path:/clusterstate.json, has occurred - updating... (live nodes size: 3)
[junit4:junit4]   2> 7681 T1418 oascc.ZkStateReader$2.process A cluster state change: WatchedEvent state:SyncConnected type:NodeDataChanged path:/clusterstate.json, has occurred - updating... (live nodes size: 3)
[junit4:junit4]   2> 7681 T1399 oascc.ZkStateReader$2.process A cluster state change: WatchedEvent state:SyncConnected type:NodeDataChanged path:/clusterstate.json, has occurred - updating... (live nodes size: 3)
[junit4:junit4]   2> 7680 T1433 oascc.ZkStateReader$2.process A cluster state change: WatchedEvent state:SyncConnected type:NodeDataChanged path:/clusterstate.json, has occurred - updating... (live nodes size: 3)
[junit4:junit4]   2> 7693 T1434 oasc.ZkController.register We are http://127.0.0.1:21485/collection1/ and leader is http://127.0.0.1:21485/collection1/
[junit4:junit4]   2> 7693 T1434 oasc.ZkController.register No LogReplay needed for core=collection1 baseURL=http://127.0.0.1:21485
[junit4:junit4]   2> 7693 T1434 oasc.ZkController.checkRecovery I am the leader, no recovery necessary
[junit4:junit4]   2> 7693 T1434 oasc.ZkController.publish publishing core=collection1 state=active
[junit4:junit4]   2> 7694 T1434 oasc.ZkController.publish numShards not found on descriptor - reading it from system property
[junit4:junit4]   2> 7696 T1434 oascc.ZkStateReader.updateClusterState Updating cloud state from ZooKeeper... 
[junit4:junit4]   2> 7697 T1377 oass.SolrDispatchFilter.init user.dir=/usr/home/hudson/hudson-slave/workspace/Lucene-Solr-NightlyTests-4.x/solr/build/solr-core/test/J0
[junit4:junit4]   2> 7698 T1377 oass.SolrDispatchFilter.init SolrDispatchFilter.init() done
[junit4:junit4]   2> 7698 T1377 oascsi.HttpClientUtil.createClient Creating new http client, config:maxConnections=128&maxConnectionsPerHost=32&followRedirects=false
[junit4:junit4]   2> 7874 T1377 oejs.Server.doStart jetty-8.1.8.v20121106
[junit4:junit4]   2> 7878 T1377 oejs.AbstractConnector.doStart Started SocketConnector@127.0.0.1:29829
[junit4:junit4]   2> 7879 T1377 oasc.SolrResourceLoader.locateSolrHome JNDI not configured for solr (NoInitialContextEx)
[junit4:junit4]   2> 7879 T1377 oasc.SolrResourceLoader.locateSolrHome using system property solr.solr.home: /usr/home/hudson/hudson-slave/workspace/Lucene-Solr-NightlyTests-4.x/solr/build/solr-core/test/J0/./org.apache.solr.cloud.BasicDistributedZkTest-jetty3-1355729501915
[junit4:junit4]   2> 7880 T1377 oasc.SolrResourceLoader.<init> new SolrResourceLoader for deduced Solr Home: '/usr/home/hudson/hudson-slave/workspace/Lucene-Solr-NightlyTests-4.x/solr/build/solr-core/test/J0/./org.apache.solr.cloud.BasicDistributedZkTest-jetty3-1355729501915/'
[junit4:junit4]   2> 7916 T1377 oass.SolrDispatchFilter.init SolrDispatchFilter.init()
[junit4:junit4]   2> 7917 T1377 oasc.SolrResourceLoader.locateSolrHome JNDI not configured for solr (NoInitialContextEx)
[junit4:junit4]   2> 7917 T1377 oasc.SolrResourceLoader.locateSolrHome using system property solr.solr.home: /usr/home/hudson/hudson-slave/workspace/Lucene-Solr-NightlyTests-4.x/solr/build/solr-core/test/J0/./org.apache.solr.cloud.BasicDistributedZkTest-jetty3-1355729501915
[junit4:junit4]   2> 7918 T1377 oasc.CoreContainer$Initializer.initialize looking for solr.xml: /usr/home/hudson/hudson-slave/workspace/Lucene-Solr-NightlyTests-4.x/solr/build/solr-core/test/J0/./org.apache.solr.cloud.BasicDistributedZkTest-jetty3-1355729501915/solr.xml
[junit4:junit4]   2> 7918 T1377 oasc.CoreContainer.<init> New CoreContainer 1402397815
[junit4:junit4]   2> 7919 T1377 oasc.CoreContainer.load Loading CoreContainer using Solr Home: '/usr/home/hudson/hudson-slave/workspace/Lucene-Solr-NightlyTests-4.x/solr/build/solr-core/test/J0/./org.apache.solr.cloud.BasicDistributedZkTest-jetty3-1355729501915/'
[junit4:junit4]   2> 7919 T1377 oasc.SolrResourceLoader.<init> new SolrResourceLoader for directory: '/usr/home/hudson/hudson-slave/workspace/Lucene-Solr-NightlyTests-4.x/solr/build/solr-core/test/J0/./org.apache.solr.cloud.BasicDistributedZkTest-jetty3-1355729501915/'
[junit4:junit4]   2> 7942 T1377 oashc.HttpShardHandlerFactory.getParameter Setting socketTimeout to: 30000
[junit4:junit4]   2> 7943 T1377 oashc.HttpShardHandlerFactory.getParameter Setting urlScheme to: http://
[junit4:junit4]   2> 7944 T1377 oashc.HttpShardHandlerFactory.getParameter Setting connTimeout to: 15000
[junit4:junit4]   2> 7944 T1377 oashc.HttpShardHandlerFactory.getParameter Setting maxConnectionsPerHost to: 20
[junit4:junit4]   2> 7945 T1377 oashc.HttpShardHandlerFactory.getParameter Setting corePoolSize to: 0
[junit4:junit4]   2> 7945 T1377 oashc.HttpShardHandlerFactory.getParameter Setting maximumPoolSize to: 2147483647
[junit4:junit4]   2> 7946 T1377 oashc.HttpShardHandlerFactory.getParameter Setting maxThreadIdleTime to: 5
[junit4:junit4]   2> 7946 T1377 oashc.HttpShardHandlerFactory.getParameter Setting sizeOfQueue to: -1
[junit4:junit4]   2> 7947 T1377 oashc.HttpShardHandlerFactory.getParameter Setting fairnessPolicy to: false
[junit4:junit4]   2> 7947 T1377 oascsi.HttpClientUtil.createClient Creating new http client, config:maxConnectionsPerHost=20&maxConnections=10000&socketTimeout=30000&connTimeout=15000&retry=false
[junit4:junit4]   2> 7968 T1377 oasc.CoreContainer.load Registering Log Listener
[junit4:junit4]   2> 7987 T1377 oasc.CoreContainer.initZooKeeper Zookeeper client=127.0.0.1:27598/solr
[junit4:junit4]   2> 7988 T1377 oasc.ZkController.checkChrootPath zkHost includes chroot
[junit4:junit4]   2> 7989 T1377 oaz.ZooKeeper.<init> Initiating client connection, connectString=127.0.0.1:27598 sessionTimeout=60000 watcher=org.apache.solr.common.cloud.ConnectionManager@5e80ed5a
[junit4:junit4]   2> 7990 T1377 oascc.ConnectionManager.waitForConnected Waiting for client to connect to ZooKeeper
[junit4:junit4]   2> 7990 T1445 oaz.ClientCnxn$SendThread.logStartConnect Opening socket connection to server localhost/127.0.0.1:27598. Will not attempt to authenticate using SASL (access denied (javax.security.auth.AuthPermission getLoginConfiguration))
[junit4:junit4]   2> 7994 T1445 oaz.ClientCnxn$SendThread.primeConnection Socket connection established to localhost/127.0.0.1:27598, initiating session
[junit4:junit4]   2> 7995 T1379 oazs.NIOServerCnxnFactory.run Accepted socket connection from /140.211.11.196:51936
[junit4:junit4]   2> 7995 T1379 oazs.ZooKeeperServer.processConnectRequest Client attempting to establish new session at /140.211.11.196:51936
[junit4:junit4]   2> 7997 T1381 oazs.ZooKeeperServer.finishSessionInit Established session 0x13ba7c660c70009 with negotiated timeout 20000 for client /140.211.11.196:51936
[junit4:junit4]   2> 7997 T1445 oaz.ClientCnxn$SendThread.onConnected Session establishment complete on server localhost/127.0.0.1:27598, sessionid = 0x13ba7c660c70009, negotiated timeout = 20000
[junit4:junit4]   2> 7997 T1446 oascc.ConnectionManager.process Watcher org.apache.solr.common.cloud.ConnectionManager@5e80ed5a name:ZooKeeperConnection Watcher:127.0.0.1:27598 got event WatchedEvent state:SyncConnected type:None path:null path:null type:None
[junit4:junit4]   2> 7998 T1377 oascc.ConnectionManager.waitForConnected Client is connected to ZooKeeper
[junit4:junit4]   2> 7999 T1382 oazs.PrepRequestProcessor.pRequest2Txn Processed session termination for sessionid: 0x13ba7c660c70009
[junit4:junit4]   2> 8011 T1446 oaz.ClientCnxn$EventThread.run EventThread shut down
[junit4:junit4]   2> 8011 T1379 oazs.NIOServerCnxn.closeSock Closed socket connection for client /140.211.11.196:51936 which had sessionid 0x13ba7c660c70009
[junit4:junit4]   2> 8011 T1377 oaz.ZooKeeper.close Session: 0x13ba7c660c70009 closed
[junit4:junit4]   2> 8012 T1377 oascsi.HttpClientUtil.createClient Creating new http client, config:maxConnections=500&maxConnectionsPerHost=16&socketTimeout=15000&connTimeout=30000
[junit4:junit4]   2> 8023 T1377 oaz.ZooKeeper.<init> Initiating client connection, connectString=127.0.0.1:27598/solr sessionTimeout=30000 watcher=org.apache.solr.common.cloud.ConnectionManager@4619edfe
[junit4:junit4]   2> 8024 T1377 oascc.ConnectionManager.waitForConnected Waiting for client to connect to ZooKeeper
[junit4:junit4]   2> 8024 T1447 oaz.ClientCnxn$SendThread.logStartConnect Opening socket connection to server localhost/127.0.0.1:27598. Will not attempt to authenticate using SASL (access denied (javax.security.auth.AuthPermission getLoginConfiguration))
[junit4:junit4]   2> 8025 T1447 oaz.ClientCnxn$SendThread.primeConnection Socket connection established to localhost/127.0.0.1:27598, initiating session
[junit4:junit4]   2> 8025 T1379 oazs.NIOServerCnxnFactory.run Accepted socket connection from /140.211.11.196:20058
[junit4:junit4]   2> 8026 T1379 oazs.ZooKeeperServer.processConnectRequest Client attempting to establish new session at /140.211.11.196:20058
[junit4:junit4]   2> 8027 T1381 oazs.ZooKeeperServer.finishSessionInit Established session 0x13ba7c660c7000a with negotiated timeout 20000 for client /140.211.11.196:20058
[junit4:junit4]   2> 8027 T1447 oaz.ClientCnxn$SendThread.onConnected Session establishment complete on server localhost/127.0.0.1:27598, sessionid = 0x13ba7c660c7000a, negotiated timeout = 20000
[junit4:junit4]   2> 8028 T1448 oascc.ConnectionManager.process Watcher org.apache.solr.common.cloud.ConnectionManager@4619edfe name:ZooKeeperConnection Watcher:127.0.0.1:27598/solr got event WatchedEvent state:SyncConnected type:None path:null path:null type:None
[junit4:junit4]   2> 8028 T1377 oascc.ConnectionManager.waitForConnected Client is connected to ZooKeeper
[junit4:junit4]   2> 8030 T1382 oazs.PrepRequestProcessor.pRequest Got user-level KeeperException when processing sessionid:0x13ba7c660c7000a type:create cxid:0x1 zxid:0x90 txntype:-1 reqpath:n/a Error Path:/solr/overseer Error:KeeperErrorCode = NodeExists for /solr/overseer
[junit4:junit4]   2> 8032 T1382 oazs.PrepRequestProcessor.pRequest Got user-level KeeperException when processing sessionid:0x13ba7c660c7000a type:create cxid:0x2 zxid:0x91 txntype:-1 reqpath:n/a Error Path:/solr/overseer Error:KeeperErrorCode = NodeExists for /solr/overseer
[junit4:junit4]   2> 8034 T1377 oasc.ZkController.createEphemeralLiveNode Register node as live in ZooKeeper:/live_nodes/127.0.0.1:29829_
[junit4:junit4]   2> 8034 T1382 oazs.PrepRequestProcessor.pRequest Got user-level KeeperException when processing sessionid:0x13ba7c660c7000a type:delete cxid:0x4 zxid:0x92 txntype:-1 reqpath:n/a Error Path:/solr/live_nodes/127.0.0.1:29829_ Error:KeeperErrorCode = NoNode for /solr/live_nodes/127.0.0.1:29829_
[junit4:junit4]   2> 8043 T1377 oascc.SolrZkClient.makePath makePath: /live_nodes/127.0.0.1:29829_
[junit4:junit4]   2> 8046 T1405 oascc.ZkStateReader$2.process A cluster state change: WatchedEvent state:SyncConnected type:NodeChildrenChanged path:/live_nodes, has occurred - updating... (live nodes size: 3)
[junit4:junit4]   2> 8046 T1399 oascc.ZkStateReader$2.process A cluster state change: WatchedEvent state:SyncConnected type:NodeChildrenChanged path:/live_nodes, has occurred - updating... (live nodes size: 3)
[junit4:junit4]   2> 8046 T1418 oascc.ZkStateReader$3.process Updating live nodes... (4)
[junit4:junit4]   2> 8046 T1418 oascc.ZkStateReader$2.process A cluster state change: WatchedEvent state:SyncConnected type:NodeChildrenChanged path:/live_nodes, has occurred - updating... (live nodes size: 4)
[junit4:junit4]   2> 8046 T1433 oascc.ZkStateReader$3.process Updating live nodes... (4)
[junit4:junit4]   2> 8047 T1433 oascc.ZkStateReader$2.process A cluster state change: WatchedEvent state:SyncConnected type:NodeChildrenChanged path:/live_nodes, has occurred - updating... (live nodes size: 4)
[junit4:junit4]   2> 8048 T1405 oascc.ZkStateReader$3.process Updating live nodes... (4)
[junit4:junit4]   2> 8049 T1399 oascc.ZkStateReader$3.process Updating live nodes... (4)
[junit4:junit4]   2> 8051 T1377 oascc.ZkStateReader.createClusterStateWatchersAndUpdate Updating cluster state from ZooKeeper... 
[junit4:junit4]   2> 8059 T1449 oasc.CoreContainer.create Creating SolrCore 'collection1' using instanceDir: /usr/home/hudson/hudson-slave/workspace/Lucene-Solr-NightlyTests-4.x/solr/build/solr-core/test/J0/./org.apache.solr.cloud.BasicDistributedZkTest-jetty3-1355729501915/collection1
[junit4:junit4]   2> 8059 T1449 oasc.ZkController.createCollectionZkNode Check for collection zkNode:collection1
[junit4:junit4]   2> 8060 T1449 oasc.ZkController.createCollectionZkNode Collection zkNode exists
[junit4:junit4]   2> 8060 T1449 oasc.ZkController.readConfigName Load collection config from:/collections/collection1
[junit4:junit4]   2> 8062 T1449 oasc.SolrResourceLoader.<init> new SolrResourceLoader for directory: '/usr/home/hudson/hudson-slave/workspace/Lucene-Solr-NightlyTests-4.x/solr/build/solr-core/test/J0/./org.apache.solr.cloud.BasicDistributedZkTest-jetty3-1355729501915/collection1/'
[junit4:junit4]   2> 8063 T1449 oasc.SolrResourceLoader.replaceClassLoader Adding 'file:/usr/home/hudson/hudson-slave/workspace/Lucene-Solr-NightlyTests-4.x/solr/build/solr-core/test/J0/org.apache.solr.cloud.BasicDistributedZkTest-jetty3-1355729501915/collection1/lib/README' to classloader
[junit4:junit4]   2> 8064 T1449 oasc.SolrResourceLoader.replaceClassLoader Adding 'file:/usr/home/hudson/hudson-slave/workspace/Lucene-Solr-NightlyTests-4.x/solr/build/solr-core/test/J0/org.apache.solr.cloud.BasicDistributedZkTest-jetty3-1355729501915/collection1/lib/classes/' to classloader
[junit4:junit4]   2> 8116 T1449 oasc.SolrConfig.<init> Using Lucene MatchVersion: LUCENE_41
[junit4:junit4]   2> 8187 T1400 oascc.ZkStateReader.updateClusterState Updating cloud state from ZooKeeper... 
[junit4:junit4]   2> 8188 T1400 oasc.Overseer$ClusterStateUpdater.updateState Update state numShards=2 message={
[junit4:junit4]   2> 	  "operation":"state",
[junit4:junit4]   2> 	  "numShards":"2",
[junit4:junit4]   2> 	  "shard":"shard2",
[junit4:junit4]   2> 	  "roles":null,
[junit4:junit4]   2> 	  "state":"active",
[junit4:junit4]   2> 	  "core":"collection1",
[junit4:junit4]   2> 	  "collection":"collection1",
[junit4:junit4]   2> 	  "node_name":"127.0.0.1:21485_",
[junit4:junit4]   2> 	  "base_url":"http://127.0.0.1:21485"}
[junit4:junit4]   2> 8194 T1449 oasc.SolrConfig.<init> Loaded SolrConfig: solrconfig.xml
[junit4:junit4]   2> 8202 T1448 oascc.ZkStateReader$2.process A cluster state change: WatchedEvent state:SyncConnected type:NodeDataChanged path:/clusterstate.json, has occurred - updating... (live nodes size: 4)
[junit4:junit4]   2> 8202 T1399 oascc.ZkStateReader$2.process A cluster state change: WatchedEvent state:SyncConnected type:NodeDataChanged path:/clusterstate.json, has occurred - updating... (live nodes size: 4)
[junit4:junit4]   2> 8202 T1418 oascc.ZkStateReader$2.process A cluster state change: WatchedEvent state:SyncConnected type:NodeDataChanged path:/clusterstate.json, has occurred - updating... (live nodes size: 4)
[junit4:junit4]   2> 8203 T1449 oass.IndexSchema.readSchema Reading Solr Schema
[junit4:junit4]   2> 8202 T1433 oascc.ZkStateReader$2.process A cluster state change: WatchedEvent state:SyncConnected type:NodeDataChanged path:/clusterstate.json, has occurred - updating... (live nodes size: 4)
[junit4:junit4]   2> 8202 T1405 oascc.ZkStateReader$2.process A cluster state change: WatchedEvent state:SyncConnected type:NodeDataChanged path:/clusterstate.json, has occurred - updating... (live nodes size: 4)
[junit4:junit4]   2> 8211 T1449 oass.IndexSchema.readSchema Schema name=test
[junit4:junit4]   2> 8797 T1449 oass.OpenExchangeRatesOrgProvider.init Initialized with rates=open-exchange-rates.json, refreshInterval=1440.
[junit4:junit4]   2> 8805 T1449 oass.IndexSchema.readSchema default search field in schema is text
[junit4:junit4]   2> 8808 T1449 oass.IndexSchema.readSchema unique key field: id
[junit4:junit4]   2> 8823 T1449 oass.FileExchangeRateProvider.reload Reloading exchange rates from file currency.xml
[junit4:junit4]   2> 8827 T1449 oass.FileExchangeRateProvider.reload Reloading exchange rates from file currency.xml
[junit4:junit4]   2> 8830 T1449 oass.OpenExchangeRatesOrgProvider.reload Reloading exchange rates from open-exchange-rates.json
[junit4:junit4]   2> 8832 T1449 oass.OpenExchangeRatesOrgProvider.reload Reloading exchange rates from open-exchange-rates.json
[junit4:junit4]   2> 8833 T1449 oasc.SolrCore.<init> [collection1] Opening new SolrCore at /usr/home/hudson/hudson-slave/workspace/Lucene-Solr-NightlyTests-4.x/solr/build/solr-core/test/J0/./org.apache.solr.cloud.BasicDistributedZkTest-jetty3-1355729501915/collection1/, dataDir=./org.apache.solr.cloud.BasicDistributedZkTest-1355729494208/jetty3/
[junit4:junit4]   2> 8833 T1449 oasc.JmxMonitoredMap.<init> JMX monitoring is enabled. Adding Solr mbeans to JMX Server: com.sun.jmx.mbeanserver.JmxMBeanServer@6bab600f
[junit4:junit4]   2> 8833 T1449 oasc.SolrCore.initDirectoryFactory solr.NRTCachingDirectoryFactory
[junit4:junit4]   2> 8834 T1449 oasc.CachingDirectoryFactory.get return new directory for /usr/home/hudson/hudson-slave/workspace/Lucene-Solr-NightlyTests-4.x/solr/build/solr-core/test/J0/./org.apache.solr.cloud.BasicDistributedZkTest-1355729494208/jetty3 forceNew:false
[junit4:junit4]   2> 8835 T1449 oasc.CachingDirectoryFactory.close Releasing directory:/usr/home/hudson/hudson-slave/workspace/Lucene-Solr-NightlyTests-4.x/solr/build/solr-core/test/J0/./org.apache.solr.cloud.BasicDistributedZkTest-1355729494208/jetty3
[junit4:junit4]   2> 8835 T1449 oasc.SolrCore.getNewIndexDir New index directory detected: old=null new=./org.apache.solr.cloud.BasicDistributedZkTest-1355729494208/jetty3/index/
[junit4:junit4]   2> 8835 T1449 oasc.SolrCore.initIndex WARNING [collection1] Solr index directory './org.apache.solr.cloud.BasicDistributedZkTest-1355729494208/jetty3/index' doesn't exist. Creating new index...
[junit4:junit4]   2> 8836 T1449 oasc.CachingDirectoryFactory.get return new directory for /usr/home/hudson/hudson-slave/workspace/Lucene-Solr-NightlyTests-4.x/solr/build/solr-core/test/J0/./org.apache.solr.cloud.BasicDistributedZkTest-1355729494208/jetty3/index forceNew:false
[junit4:junit4]   2> 8866 T1449 oasc.SolrDeletionPolicy.onCommit SolrDeletionPolicy.onCommit: commits:num=1
[junit4:junit4]   2> 		commit{dir=RateLimitedDirectoryWrapper(NRTCachingDirectory(org.apache.lucene.store.NIOFSDirectory@/usr/home/hudson/hudson-slave/workspace/Lucene-Solr-NightlyTests-4.x/solr/build/solr-core/test/J0/org.apache.solr.cloud.BasicDistributedZkTest-1355729494208/jetty3/index lockFactory=org.apache.lucene.store.NativeFSLockFactory@2d7c3412; maxCacheMB=48.0 maxMergeSizeMB=4.0)),segFN=segments_1,generation=1,filenames=[segments_1]
[junit4:junit4]   2> 8867 T1449 oasc.SolrDeletionPolicy.updateCommits newest commit = 1[segments_1]
[junit4:junit4]   2> 8867 T1449 oasc.CachingDirectoryFactory.close Releasing directory:/usr/home/hudson/hudson-slave/workspace/Lucene-Solr-NightlyTests-4.x/solr/build/solr-core/test/J0/./org.apache.solr.cloud.BasicDistributedZkTest-1355729494208/jetty3/index
[junit4:junit4]   2> 8867 T1449 oasc.SolrCore.initWriters created xml: solr.XMLResponseWriter
[junit4:junit4]   2> 8869 T1449 oasup.UpdateRequestProcessorChain.init inserting DistributedUpdateProcessorFactory into updateRequestProcessorChain "dedupe"
[junit4:junit4]   2> 8869 T1449 oasup.UpdateRequestProcessorChain.init inserting DistributedUpdateProcessorFactory into updateRequestProcessorChain "dedupe-allfields"
[junit4:junit4]   2> 8869 T1449 oasup.UpdateRequestProcessorChain.init inserting DistributedUpdateProcessorFactory into updateRequestProcessorChain "stored_sig"
[junit4:junit4]   2> 8870 T1449 oasup.UpdateRequestProcessorChain.init inserting DistributedUpdateProcessorFactory into updateRequestProcessorChain "uniq-fields"
[junit4:junit4]   2> 8870 T1449 oasup.UpdateRequestProcessorChain.init inserting DistributedUpdateProcessorFactory into updateRequestProcessorChain "distrib-dup-test-chain-implicit"
[junit4:junit4]   2> 8870 T1449 oasc.RequestHandlers.initHandlersFromConfig adding lazy requestHandler: solr.ReplicationHandler
[junit4:junit4]   2> 8870 T1449 oasc.RequestHandlers.initHandlersFromConfig created /replication: solr.ReplicationHandler
[junit4:junit4]   2> 8871 T1449 oasc.RequestHandlers.initHandlersFromConfig created standard: solr.StandardRequestHandler
[junit4:junit4]   2> 8872 T1449 oasc.RequestHandlers.initHandlersFromConfig created /get: solr.RealTimeGetHandler
[junit4:junit4]   2> 8872 T1449 oasc.RequestHandlers.initHandlersFromConfig created dismax: solr.SearchHandler
[junit4:junit4]   2> 8873 T1449 oasc.RequestHandlers.initHandlersFromConfig created mock: org.apache.solr.core.MockQuerySenderListenerReqHandler
[junit4:junit4]   2> 8873 T1449 oasc.RequestHandlers.initHandlersFromConfig created /admin/: org.apache.solr.handler.admin.AdminHandlers
[junit4:junit4]   2> 8874 T1449 oasc.RequestHandlers.initHandlersFromConfig created defaults: solr.StandardRequestHandler
[junit4:junit4]   2> 8874 T1449 oasc.RequestHandlers.initHandlersFromConfig adding lazy requestHandler: solr.StandardRequestHandler
[junit4:junit4]   2> 8874 T1449 oasc.RequestHandlers.initHandlersFromConfig created lazy: solr.StandardRequestHandler
[junit4:junit4]   2> 8875 T1449 oasc.RequestHandlers.initHandlersFromConfig created /update: solr.UpdateRequestHandler
[junit4:junit4]   2> 8875 T1449 oasc.RequestHandlers.initHandlersFromConfig created /terms: org.apache.solr.handler.component.SearchHandler
[junit4:junit4]   2> 8876 T1449 oasc.RequestHandlers.initHandlersFromConfig created spellCheckCompRH: org.apache.solr.handler.component.SearchHandler
[junit4:junit4]   2> 8876 T1449 oasc.RequestHandlers.initHandlersFromConfig created spellCheckCompRH_Direct: org.apache.solr.handler.component.SearchHandler
[junit4:junit4]   2> 8877 T1449 oasc.RequestHandlers.initHandlersFromConfig created spellCheckWithWordbreak: org.apache.solr.handler.component.SearchHandler
[junit4:junit4]   2> 8877 T1449 oasc.RequestHandlers.initHandlersFromConfig created spellCheckWithWordbreak_Direct: org.apache.solr.handler.component.SearchHandler
[junit4:junit4]   2> 8878 T1449 oasc.RequestHandlers.initHandlersFromConfig created spellCheckCompRH1: org.apache.solr.handler.component.SearchHandler
[junit4:junit4]   2> 8879 T1449 oasc.RequestHandlers.initHandlersFromConfig created mltrh: org.apache.solr.handler.component.SearchHandler
[junit4:junit4]   2> 8879 T1449 oasc.RequestHandlers.initHandlersFromConfig created tvrh: org.apache.solr.handler.component.SearchHandler
[junit4:junit4]   2> 8880 T1449 oasc.RequestHandlers.initHandlersFromConfig created /mlt: solr.MoreLikeThisHandler
[junit4:junit4]   2> 8880 T1449 oasc.RequestHandlers.initHandlersFromConfig created /debug/dump: solr.DumpRequestHandler
[junit4:junit4]   2> 8885 T1449 oashl.XMLLoader.init xsltCacheLifetimeSeconds=60
[junit4:junit4]   2> 8888 T1449 oasc.SolrCore.initDeprecatedSupport WARNING solrconfig.xml uses deprecated <admin/gettableFiles>, Please update your config to use the ShowFileRequestHandler.
[junit4:junit4]   2> 8889 T1449 oasc.SolrCore.initDeprecatedSupport WARNING adding ShowFileRequestHandler with hidden files: [SCHEMA.XML, OLD_SYNONYMS.TXT, STOPWORDS.TXT, PROTWORDS.TXT, OPEN-EXCHANGE-RATES.JSON, SYNONYMS.TXT, CURRENCY.XML, MAPPING-ISOLATIN1ACCENT.TXT]
[junit4:junit4]   2> 8891 T1449 oasc.CachingDirectoryFactory.close Releasing directory:/usr/home/hudson/hudson-slave/workspace/Lucene-Solr-NightlyTests-4.x/solr/build/solr-core/test/J0/./org.apache.solr.cloud.BasicDistributedZkTest-1355729494208/jetty3
[junit4:junit4]   2> 8892 T1449 oass.SolrIndexSearcher.<init> Opening Searcher@34e85aab main
[junit4:junit4]   2> 8893 T1449 oasu.CommitTracker.<init> Hard AutoCommit: disabled
[junit4:junit4]   2> 8893 T1449 oasu.CommitTracker.<init> Soft AutoCommit: disabled
[junit4:junit4]   2> 8894 T1449 oashc.SpellCheckComponent.inform Initializing spell checkers
[junit4:junit4]   2> 8899 T1449 oass.DirectSolrSpellChecker.init init: {name=direct,classname=DirectSolrSpellChecker,field=lowerfilt,minQueryLength=3}
[junit4:junit4]   2> 8953 T1450 oasc.SolrCore.registerSearcher [collection1] Registered new searcher Searcher@34e85aab main{StandardDirectoryReader(segments_1:1)}
[junit4:junit4]   2> 8955 T1449 oasc.ZkController.publish publishing core=collection1 state=down
[junit4:junit4]   2> 8956 T1449 oasc.ZkController.publish numShards not found on descriptor - reading it from system property
[junit4:junit4]   2> 9212 T1400 oascc.ZkStateReader.updateClusterState Updating cloud state from ZooKeeper... 
[junit4:junit4]   2> 9213 T1400 oasc.Overseer$ClusterStateUpdater.updateState Update state numShards=2 message={
[junit4:junit4]   2> 	  "operation":"state",
[junit4:junit4]   2> 	  "numShards":"2",
[junit4:junit4]   2> 	  "shard":null,
[junit4:junit4]   2> 	  "roles":null,
[junit4:junit4]   2> 	  "state":"down",
[junit4:junit4]   2> 	  "core":"collection1",
[junit4:junit4]   2> 	  "collection":"collection1",
[junit4:junit4]   2> 	  "node_name":"127.0.0.1:29829_",
[junit4:junit4]   2> 	  "base_url":"http://127.0.0.1:29829"}
[junit4:junit4]   2> 9213 T1400 oasc.Overseer$ClusterStateUpdater.updateState Collection already exists with numShards=2
[junit4:junit4]   2> 9213 T1400 oasc.Overseer$ClusterStateUpdater.updateState Assigning new node to shard shard=shard1
[junit4:junit4]   2> 9226 T1448 oascc.ZkStateReader$2.process A cluster state change: WatchedEvent state:SyncConnected type:NodeDataChanged path:/clusterstate.json, has occurred - updating... (live nodes size: 4)
[junit4:junit4]   2> 9226 T1399 oascc.ZkStateReader$2.process A cluster state change: WatchedEvent state:SyncConnected type:NodeDataChanged path:/clusterstate.json, has occurred - updating... (live nodes size: 4)
[junit4:junit4]   2> 9226 T1433 oascc.ZkStateReader$2.process A cluster state change: WatchedEvent state:SyncConnected type:NodeDataChanged path:/clusterstate.json, has occurred - updating... (live nodes size: 4)
[junit4:junit4]   2> 9226 T1418 oascc.ZkStateReader$2.process A cluster state change: WatchedEvent state:SyncConnected type:NodeDataChanged path:/clusterstate.json, has occurred - updating... (live nodes size: 4)
[junit4:junit4]   2> 9226 T1405 oascc.ZkStateReader$2.process A cluster state change: WatchedEvent state:SyncConnected type:NodeDataChanged path:/clusterstate.json, has occurred - updating... (live nodes size: 4)
[junit4:junit4]   2> 9458 T1449 oasc.CoreContainer.registerCore registering core: collection1
[junit4:junit4]   2> 9458 T1449 oasc.ZkController.register Register shard - core:collection1 address:http://127.0.0.1:29829 shardId:shard1
[junit4:junit4]   2> 9462 T1449 oasc.ZkController.register We are http://127.0.0.1:29829/collection1/ and leader is http://127.0.0.1:47665/collection1/
[junit4:junit4]   2> 9462 T1449 oasc.ZkController.register No LogReplay needed for core=collection1 baseURL=http://127.0.0.1:29829
[junit4:junit4]   2> 9462 T1449 oasc.ZkController.checkRecovery Core needs to recover:collection1
[junit4:junit4]   2> 9462 T1449 oasu.DefaultSolrCoreState.doRecovery Running recovery - first canceling any ongoing recovery
[junit4:junit4]   2> ASYNC  NEW_CORE C50 name=collection1 org.apache.solr.core.SolrCore@93354b1 url=http://127.0.0.1:29829/collection1 node=127.0.0.1:29829_
[junit4:junit4]   2> 9463 T1451 C50 P29829 oasc.RecoveryStrategy.run Starting recovery process.  core=collection1 recoveringAfterStartup=true
[junit4:junit4]   2> 9463 T1449 oascc.ZkStateReader.updateClusterState Updating cloud state from ZooKeeper... 
[junit4:junit4]   2> 9464 T1451 C50 P29829 oasc.RecoveryStrategy.doRecovery ###### startupVersions=[]
[junit4:junit4]   2> 9464 T1451 C50 P29829 oasc.ZkController.publish publishing core=collection1 state=recovering
[junit4:junit4]   2> 9464 T1451 C50 P29829 oasc.ZkController.publish numShards not found on descriptor - reading it from system property
[junit4:junit4]   2> 9465 T1377 oass.SolrDispatchFilter.init user.dir=/usr/home/hudson/hudson-slave/workspace/Lucene-Solr-NightlyTests-4.x/solr/build/solr-core/test/J0
[junit4:junit4]   2> 9466 T1377 oass.SolrDispatchFilter.init SolrDispatchFilter.init() done
[junit4:junit4]   2> 9466 T1451 C50 P29829 oasc.RecoveryStrategy.doRecovery Attempting to PeerSync from http://127.0.0.1:47665/collection1/ core=collection1 - recoveringAfterStartup=true
[junit4:junit4]   2> 9466 T1451 C50 P29829 oasu.PeerSync.sync PeerSync: core=collection1 url=http://127.0.0.1:29829 START replicas=[http://127.0.0.1:47665/collection1/] nUpdates=100
[junit4:junit4]   2> 9466 T1377 oascsi.HttpClientUtil.createClient Creating new http client, config:maxConnections=128&maxConnectionsPerHost=32&followRedirects=false
[junit4:junit4]   2> 9467 T1451 C50 P29829 oasu.PeerSync.sync WARNING no frame of reference to tell of we've missed updates
[junit4:junit4]   2> 9467 T1451 C50 P29829 oasc.RecoveryStrategy.doRecovery PeerSync Recovery was not successful - trying replication. core=collection1
[junit4:junit4]   2> 9467 T1451 C50 P29829 oasc.RecoveryStrategy.doRecovery Starting Replication Recovery. core=collection1
[junit4:junit4]   2> 9468 T1451 C50 P29829 oascsi.HttpClientUtil.createClient Creating new http client, config:maxConnections=128&maxConnectionsPerHost=32&followRedirects=false
[junit4:junit4]   2> ASYNC  NEW_CORE C51 name=collection1 org.apache.solr.core.SolrCore@5ebbbe17 url=http://127.0.0.1:47665/collection1 node=127.0.0.1:47665_
[junit4:junit4]   2> 9474 T1408 C51 P47665 REQ /get {distrib=false&qt=/get&wt=javabin&version=2&getVersions=100} status=0 QTime=0 
[junit4:junit4]   2> 9640 T1377 oejs.Server.doStart jetty-8.1.8.v20121106
[junit4:junit4]   2> 9643 T1377 oejs.AbstractConnector.doStart Started SocketConnector@127.0.0.1:49868
[junit4:junit4]   2> 9643 T1377 oasc.SolrResourceLoader.locateSolrHome JNDI not configured for solr (NoInitialContextEx)
[junit4:junit4]   2> 9644 T1377 oasc.SolrResourceLoader.locateSolrHome using system property solr.solr.home: /usr/home/hudson/hudson-slave/workspace/Lucene-Solr-NightlyTests-4.x/solr/build/solr-core/test/J0/./org.apache.solr.cloud.BasicDistributedZkTest-jetty4-1355729503684
[junit4:junit4]   2> 9645 T1377 oasc.SolrResourceLoader.<init> new SolrResourceLoader for deduced Solr Home: '/usr/home/hudson/hudson-slave/workspace/Lucene-Solr-NightlyTests-4.x/solr/build/solr-core/test/J0/./org.apache.solr.cloud.BasicDistributedZkTest-jetty4-1355729503684/'
[junit4:junit4]   2> 9687 T1377 oass.SolrDispatchFilter.init SolrDispatchFilter.init()
[junit4:junit4]   2> 9688 T1377 oasc.SolrResourceLoader.locateSolrHome JNDI not configured for solr (NoInitialContextEx)
[junit4:junit4]   2> 9688 T1377 oasc.SolrResourceLoader.locateSolrHome using system property solr.solr.home: /usr/home/hudson/hudson-slave/workspace/Lucene-Solr-NightlyTests-4.x/solr/build/solr-core/test/J0/./org.apache.solr.cloud.BasicDistributedZkTest-jetty4-1355729503684
[junit4:junit4]   2> 9689 T1377 oasc.CoreContainer$Initializer.initialize looking for solr.xml: /usr/home/hudson/hudson-slave/workspace/Lucene-Solr-NightlyTests-4.x/solr/build/solr-core/test/J0/./org.apache.solr.cloud.BasicDistributedZkTest-jetty4-1355729503684/solr.xml
[junit4:junit4]   2> 9689 T1377 oasc.CoreContainer.<init> New CoreContainer 393053996
[junit4:junit4]   2> 9690 T1377 oasc.CoreContainer.load Loading CoreContainer using Solr Home: '/usr/home/hudson/hudson-slave/workspace/Lucene-Solr-NightlyTests-4.x/solr/build/solr-core/test/J0/./org.apache.solr.cloud.BasicDistributedZkTest-jetty4-1355729503684/'
[junit4:junit4]   2> 9691 T1377 oasc.SolrResourceLoader.<init> new SolrResourceLoader for directory: '/usr/home/hudson/hudson-slave/workspace/Lucene-Solr-NightlyTests-4.x/solr/build/solr-core/test/J0/./org.apache.solr.cloud.BasicDistributedZkTest-jetty4-1355729503684/'
[junit4:junit4]   2> 9718 T1377 oashc.HttpShardHandlerFactory.getParameter Setting socketTimeout to: 30000
[junit4:junit4]   2> 9719 T1377 oashc.HttpShardHandlerFactory.getParameter Setting urlScheme to: http://
[junit4:junit4]   2> 9719 T1377 oashc.HttpShardHandlerFactory.getParameter Setting connTimeout to: 15000
[junit4:junit4]   2> 9720 T1377 oashc.HttpShardHandlerFactory.getParameter Setting maxConnectionsPerHost to: 20
[junit4:junit4]   2> 9720 T1377 oashc.HttpShardHandlerFactory.getParameter Setting corePoolSize to: 0
[junit4:junit4]   2> 9721 T1377 oashc.HttpShardHandlerFactory.getParameter Setting maximumPoolSize to: 2147483647
[junit4:junit4]   2> 9721 T1377 oashc.HttpShardHandlerFactory.getParameter Setting maxThreadIdleTime to: 5
[junit4:junit4]   2> 9722 T1377 oashc.HttpShardHandlerFactory.getParameter Setting sizeOfQueue to: -1
[junit4:junit4]   2> 9723 T1377 oashc.HttpShardHandlerFactory.getParameter Setting fairnessPolicy to: false
[junit4:junit4]   2> 9723 T1377 oascsi.HttpClientUtil.createClient Creating new http client, config:maxConnectionsPerHost=20&maxConnections=10000&socketTimeout=30000&connTimeout=15000&retry=false
[junit4:junit4]   2> 9731 T1400 oascc.ZkStateReader.updateClusterState Updating cloud state from ZooKeeper... 
[junit4:junit4]   2> 9731 T1400 oasc.Overseer$ClusterStateUpdater.updateState Update state numShards=2 message={
[junit4:junit4]   2> 	  "operation":"state",
[junit4:junit4]   2> 	  "numShards":"2",
[junit4:junit4]   2> 	  "shard":"shard1",
[junit4:junit4]   2> 	  "roles":null,
[junit4:junit4]   2> 	  "state":"recovering",
[junit4:junit4]   2> 	  "core":"collection1",
[junit4:junit4]   2> 	  "collection":"collection1",
[junit4:junit4]   2> 	  "node_name":"127.0.0.1:29829_",
[junit4:junit4]   2> 	  "base_url":"http://127.0.0.1:29829"}
[junit4:junit4]   2> 9746 T1405 oascc.ZkStateReader$2.process A cluster state change: WatchedEvent state:SyncConnected type:NodeDataChanged path:/clusterstate.json, has occurred - updating... (live nodes size: 4)
[junit4:junit4]   2> 9746 T1418 oascc.ZkStateReader$2.process A cluster state change: WatchedEvent state:SyncConnected type:NodeDataChanged path:/clusterstate.json, has occurred - updating... (live nodes size: 4)
[junit4:junit4]   2> 9745 T1377 oasc.CoreContainer.load Registering Log Listener
[junit4:junit4]   2> 9746 T1433 oascc.ZkStateReader$2.process A cluster state change: WatchedEvent state:SyncConnected type:NodeDataChanged path:/clusterstate.json, has occurred - updating... (live nodes size: 4)
[junit4:junit4]   2> 9746 T1399 oascc.ZkStateReader$2.process A cluster state change: WatchedEvent state:SyncConnected type:NodeDataChanged path:/clusterstate.json, has occurred - updating... (live nodes size: 4)
[junit4:junit4]   2> 9746 T1448 oascc.ZkStateReader$2.process A cluster state change: WatchedEvent state:SyncConnected type:NodeDataChanged path:/clusterstate.json, has occurred - updating... (live nodes size: 4)
[junit4:junit4]   2> 9765 T1377 oasc.CoreContainer.initZooKeeper Zookeeper client=127.0.0.1:27598/solr
[junit4:junit4]   2> 9765 T1377 oasc.ZkController.checkChrootPath zkHost includes chroot
[junit4:junit4]   2> 9766 T1377 oaz.ZooKeeper.<init> Initiating client connection, connectString=127.0.0.1:27598 sessionTimeout=60000 watcher=org.apache.solr.common.cloud.ConnectionManager@20991f39
[junit4:junit4]   2> 9767 T1377 oascc.ConnectionManager.waitForConnected Waiting for client to connect to ZooKeeper
[junit4:junit4]   2> 9768 T1462 oaz.ClientCnxn$SendThread.logStartConnect Opening socket connection to server localhost/127.0.0.1:27598. Will not attempt to authenticate using SASL (access denied (javax.security.auth.AuthPermission getLoginConfiguration))
[junit4:junit4]   2> 9768 T1462 oaz.ClientCnxn$SendThread.primeConnection Socket connection established to localhost/127.0.0.1:27598, initiating session
[junit4:junit4]   2> 9769 T1379 oazs.NIOServerCnxnFactory.run Accepted socket connection from /140.211.11.196:14121
[junit4:junit4]   2> 9769 T1379 oazs.ZooKeeperServer.processConnectRequest Client attempting to establish new session at /140.211.11.196:14121
[junit4:junit4]   2> 9771 T1381 oazs.ZooKeeperServer.finishSessionInit Established session 0x13ba7c660c7000b with negotiated timeout 20000 for client /140.211.11.196:14121
[junit4:junit4]   2> 9771 T1462 oaz.ClientCnxn$SendThread.onConnected Session establishment complete on server localhost/127.0.0.1:27598, sessionid = 0x13ba7c660c7000b, negotiated timeout = 20000
[junit4:junit4]   2> 9771 T1463 oascc.ConnectionManager.process Watcher org.apache.solr.common.cloud.ConnectionManager@20991f39 name:ZooKeeperConnection Watcher:127.0.0.1:27598 got event WatchedEvent state:SyncConnected type:None path:null path:null type:None
[junit4:junit4]   2> 9771 T1377 oascc.ConnectionManager.waitForConnected Client is connected to ZooKeeper
[junit4:junit4]   2> 9773 T1382 oazs.PrepRequestProcessor.pRequest2Txn Processed session termination for sessionid: 0x13ba7c660c7000b
[junit4:junit4]   2> 9774 T1463 oaz.ClientCnxn$EventThread.run EventThread shut down
[junit4:junit4]   2> 9774 T1379 oazs.NIOServerCnxn.closeSock Closed socket connection for client /140.211.11.196:14121 which had sessionid 0x13ba7c660c7000b
[junit4:junit4]   2> 9774 T1377 oaz.ZooKeeper.close Session: 0x13ba7c660c7000b closed
[junit4:junit4]   2> 9775 T1377 oascsi.HttpClientUtil.createClient Creating new http client, config:maxConnections=500&maxConnectionsPerHost=16&socketTimeout=15000&connTimeout=30000
[junit4:junit4]   2> 9784 T1377 oaz.ZooKeeper.<init> Initiating client connection, connectString=127.0.0.1:27598/solr sessionTimeout=30000 watcher=org.apache.solr.common.cloud.ConnectionManager@560fd57d
[junit4:junit4]   2> 9785 T1377 oascc.ConnectionManager.waitForConnected Waiting for client to connect to ZooKeeper
[junit4:junit4]   2> 9785 T1464 oaz.ClientCnxn$SendThread.logStartConnect Opening socket connection to server localhost/127.0.0.1:27598. Will not attempt to authenticate using SASL (access denied (javax.security.auth.AuthPermission getLoginConfiguration))
[junit4:junit4]   2> 9786 T1464 oaz.ClientCnxn$SendThread.primeConnection Socket connection established to localhost/127.0.0.1:27598, initiating session
[junit4:junit4]   2> 9786 T1379 oazs.NIOServerCnxnFactory.run Accepted socket connection from /140.211.11.196:28924
[junit4:junit4]   2> 9786 T1379 oazs.ZooKeeperServer.processConnectRequest Client attempting to establish new session at /140.211.11.196:28924
[junit4:junit4]   2> 9788 T1381 oazs.ZooKeeperServer.finishSessionInit Established session 0x13ba7c660c7000c with negotiated timeout 20000 for client /140.211.11.196:28924
[junit4:junit4]   2> 9788 T1464 oaz.ClientCnxn$SendThread.onConnected Session establishment complete on server localhost/127.0.0.1:27598, sessionid = 0x13ba7c660c7000c, negotiated timeout = 20000
[junit4:junit4]   2> 9788 T1465 oascc.ConnectionManager.process Watcher org.apache.solr.common.cloud.ConnectionManager@560fd57d name:ZooKeeperConnection Watcher:127.0.0.1:27598/solr got event WatchedEvent state:SyncConnected type:None path:null path:null type:None
[junit4:junit4]   2> 9788 T1377 oascc.ConnectionManager.waitForConnected Client is connected to ZooKeeper
[junit4:junit4]   2> 9789 T1382 oazs.PrepRequestProcessor.pRequest Got user-level KeeperException when processing sessionid:0x13ba7c660c7000c type:create cxid:0x1 zxid:0xa7 txntype:-1 reqpath:n/a Error Path:/solr/overseer Error:KeeperErrorCode = NodeExists for /solr/overseer
[junit4:junit4]   2> 9791 T1382 oazs.PrepRequestProcessor.pRequest Got user-level KeeperException when processing sessionid:0x13ba7c660c7000c type:create cxid:0x2 zxid:0xa8 txntype:-1 reqpath:n/a Error Path:/solr/overseer Error:KeeperErrorCode = NodeExists for /solr/overseer
[junit4:junit4]   2> 9798 T1377 oasc.ZkController.createEphemeralLiveNode Register node as live in ZooKeeper:/live_nodes/127.0.0.1:49868_
[junit4:junit4]   2> 9799 T1382 oazs.PrepRequestProcessor.pRequest Got user-level KeeperException when processing sessionid:0x13ba7c660c7000c type:delete cxid:0x4 zxid:0xa9 txntype:-1 reqpath:n/a Error Path:/solr/live_nodes/127.0.0.1:49868_ Error:KeeperErrorCode = NoNode for /solr/live_nodes/127.0.0.1:49868_
[junit4:junit4]   2> 9800 T1377 oascc.SolrZkClient.makePath makePath: /live_nodes/127.0.0.1:49868_
[junit4:junit4]   2> 9803 T1448 oascc.ZkStateReader$2.process A cluster state change: WatchedEvent state:SyncConnected type:NodeChildrenChanged path:/live_nodes, has occurred - updating... (live nodes size: 4)
[junit4:junit4]   2> 9803 T1405 oascc.ZkStateReader$2.process A cluster state change: WatchedEvent state:SyncConnected type:NodeChildrenChanged path:/live_nodes, has occurred - updating... (live nodes size: 4)
[junit4:junit4]   2> 9803 T1399 oascc.ZkStateReader$2.process A cluster state change: WatchedEvent state:SyncConnected type:NodeChildrenChanged path:/live_nodes, has occurred - updating... (live nodes size: 4)
[junit4:junit4]   2> 9804 T1418 oascc.ZkStateReader$3.process Updating live nodes... (5)
[junit4:junit4]   2> 9804 T1433 oascc.ZkStateReader$3.process Updating live nodes... (5)
[junit4:junit4]   2> 9804 T1418 oascc.ZkStateReader$2.process A cluster state change: WatchedEvent state:SyncConnected type:NodeChildrenChanged path:/live_nodes, has occurred - updating... (live nodes size: 5)
[junit4:junit4]   2> 9804 T1433 oascc.ZkStateReader$2.process A cluster state change: WatchedEvent state:SyncConnected type:NodeChildrenChanged path:/live_nodes, has occurred - updating... (live nodes size: 5)
[junit4:junit4]   2> 9805 T1405 oascc.ZkStateReader$3.process Updating live nodes... (5)
[junit4:junit4]   2> 9806 T1448 oascc.ZkStateReader$3.process Updating live nodes... (5)
[junit4:junit4]   2> 9806 T1399 oascc.ZkStateReader$3.process Updating live nodes... (5)
[junit4:junit4]   2> 9809 T1377 oascc.ZkStateReader.createClusterStateWatchersAndUpdate Updating cluster state from ZooKeeper... 
[junit4:junit4]   2> 9816 T1466 oasc.CoreContainer.create Creating SolrCore 'collection1' using instanceDir: /usr/home/hudson/hudson-slave/workspace/Lucene-Solr-NightlyTests-4.x/solr/build/solr-core/test/J0/./org.apache.solr.cloud.BasicDistributedZkTest-jetty4-1355729503684/collection1
[junit4:junit4]   2> 9817 T1466 oasc.ZkController.createCollectionZkNode Check for collection zkNode:collection1
[junit4:junit4]   2> 9818 T1466 oasc.ZkController.createCollectionZkNode Collection zkNode exists
[junit4:junit4]   2> 9818 T1466 oasc.ZkController.readConfigName Load collection config from:/collections/collection1
[junit4:junit4]   2> 9819 T1466 oasc.SolrResourceLoader.<init> new SolrResourceLoader for directory: '/usr/home/hudson/hudson-slave/workspace/Lucene-Solr-NightlyTests-4.x/solr/build/solr-core/test/J0/./org.apache.solr.cloud.BasicDistributedZkTest-jetty4-1355729503684/collection1/'
[junit4:junit4]   2> 9821 T1466 oasc.SolrResourceLoader.replaceClassLoader Adding 'file:/usr/home/hudson/hudson-slave/workspace/Lucene-Solr-NightlyTests-4.x/solr/build/solr-core/test/J0/org.apache.solr.cloud.BasicDistributedZkTest-jetty4-1355729503684/collection1/lib/classes/' to classloader
[junit4:junit4]   2> 9821 T1466 oasc.SolrResourceLoader.replaceClassLoader Adding 'file:/usr/home/hudson/hudson-slave/workspace/Lucene-Solr-NightlyTests-4.x/solr/build/solr-core/test/J0/org.apache.solr.cloud.BasicDistributedZkTest-jetty4-1355729503684/collection1/lib/README' to classloader
[junit4:junit4]   2> 9873 T1466 oasc.SolrConfig.<init> Using Lucene MatchVersion: LUCENE_41
[junit4:junit4]   2> 9943 T1466 oasc.SolrConfig.<init> Loaded SolrConfig: solrconfig.xml
[junit4:junit4]   2> 10044 T1466 oass.IndexSchema.readSchema Reading Solr Schema
[junit4:junit4]   2> 10054 T1466 oass.IndexSchema.readSchema Schema name=test
[junit4:junit4]   2> 10691 T1466 oass.OpenExchangeRatesOrgProvider.init Initialized with rates=open-exchange-rates.json, refreshInterval=1440.
[junit4:junit4]   2> 10704 T1466 oass.IndexSchema.readSchema default search field in schema is text
[junit4:junit4]   2> 10708 T1466 oass.IndexSchema.readSchema unique key field: id
[junit4:junit4]   2> 10726 T1466 oass.FileExchangeRateProvider.reload Reloading exchange rates from file currency.xml
[junit4:junit4]   2> 10736 T1466 oass.FileExchangeRateProvider.reload Reloading exchange rates from file currency.xml
[junit4:junit4]   2> 10742 T1466 oass.OpenExchangeRatesOrgProvider.reload Reloading exchange rates from open-exchange-rates.json
[junit4:junit4]   2> 10743 T1466 oass.OpenExchangeRatesOrgProvider.reload Reloading exchange rates from open-exchange-rates.json
[junit4:junit4]   2> 10744 T1466 oasc.SolrCore.<init> [collection1] Opening new SolrCore at /usr/home/hudson/hudson-slave/workspace/Lucene-Solr-NightlyTests-4.x/solr/build/solr-core/test/J0/./org.apache.solr.cloud.BasicDistributedZkTest-jetty4-1355729503684/collection1/, dataDir=./org.apache.solr.cloud.BasicDistributedZkTest-1355729494208/jetty4/
[junit4:junit4]   2> 10745 T1466 oasc.JmxMonitoredMap.<init> JMX monitoring is enabled. Adding Solr mbeans to JMX Server: com.sun.jmx.mbeanserver.JmxMBeanServer@6bab600f
[junit4:junit4]   2> 10746 T1466 oasc.SolrCore.initDirectoryFactory solr.NRTCachingDirectoryFactory
[junit4:junit4]   2> 10747 T1466 oasc.CachingDirectoryFactory.get return new directory for /usr/home/hudson/hudson-slave/workspace/Lucene-Solr-NightlyTests-4.x/solr/build/solr-core/test/J0/./org.apache.solr.cloud.BasicDistributedZkTest-1355729494208/jetty4 forceNew:false
[junit4:junit4]   2> 10748 T1466 oasc.CachingDirectoryFactory.close Releasing directory:/usr/home/hudson/hudson-slave/workspace/Lucene-Solr-NightlyTests-4.x/solr/build/solr-core/test/J0/./org.apache.solr.cloud.BasicDistributedZkTest-1355729494208/jetty4
[junit4:junit4]   2> 10748 T1466 oasc.SolrCore.getNewIndexDir New index directory detected: old=null new=./org.apache.solr.cloud.BasicDistributedZkTest-1355729494208/jetty4/index/
[junit4:junit4]   2> 10749 T1466 oasc.SolrCore.initIndex WARNING [collection1] Solr index directory './org.apache.solr.cloud.BasicDistributedZkTest-1355729494208/jetty4/index' doesn't exist. Creating new index...
[junit4:junit4]   2> 10750 T1466 oasc.CachingDirectoryFactory.get return new directory for /usr/home/hudson/hudson-slave/workspace/Lucene-Solr-NightlyTests-4.x/solr/build/solr-core/test/J0/./org.apache.solr.cloud.BasicDistributedZkTest-1355729494208/jetty4/index forceNew:false
[junit4:junit4]   2> 10790 T1466 oasc.SolrDeletionPolicy.onCommit SolrDeletionPolicy.onCommit: commits:num=1
[junit4:junit4]   2> 		commit{dir=RateLimitedDirectoryWrapper(NRTCachingDirectory(org.apache.lucene.store.NIOFSDirectory@/usr/home/hudson/hudson-slave/workspace/Lucene-Solr-NightlyTests-4.x/solr/build/solr-core/test/J0/org.apache.solr.cloud.BasicDistributedZkTest-1355729494208/jetty4/index lockFactory=org.apache.lucene.store.NativeFSLockFactory@3bd36d4c; maxCacheMB=48.0 maxMergeSizeMB=4.0)),segFN=segments_1,generation=1,filenames=[segments_1]
[junit4:junit4]   2> 10790 T1466 oasc.SolrDeletionPolicy.updateCommits newest commit = 1[segments_1]
[junit4:junit4]   2> 10791 T1466 oasc.CachingDirectoryFactory.close Releasing directory:/usr/home/hudson/hudson-slave/workspace/Lucene-Solr-NightlyTests-4.x/solr/build/solr-core/test/J0/./org.apache.solr.cloud.BasicDistributedZkTest-1355729494208/jetty4/index
[junit4:junit4]   2> 10791 T1466 oasc.SolrCore.initWriters created xml: solr.XMLResponseWriter
[junit4:junit4]   2> 10793 T1466 oasup.UpdateRequestProcessorChain.init inserting DistributedUpdateProcessorFactory into updateRequestProcessorChain "dedupe"
[junit4:junit4]   2> 10794 T1466 oasup.UpdateRequestProcessorChain.init inserting DistributedUpdateProcessorFactory into updateRequestProcessorChain "dedupe-allfields"
[junit4:junit4]   2> 10794 T1466 oasup.UpdateRequestProcessorChain.init inserting DistributedUpdateProcessorFactory into updateRequestProcessorChain "stored_sig"
[junit4:junit4]   2> 10795 T1466 oasup.UpdateRequestProcessorChain.init inserting DistributedUpdateProcessorFactory into updateRequestProcessorChain "uniq-fields"
[junit4:junit4]   2> 10795 T1466 oasup.UpdateRequestProcessorChain.init inserting DistributedUpdateProcessorFactory into updateRequestProcessorChain "distrib-dup-test-chain-implicit"
[junit4:junit4]   2> 10796 T1466 oasc.RequestHandlers.initHandlersFromConfig adding lazy requestHandler: solr.ReplicationHandler
[junit4:junit4]   2> 10796 T1466 oasc.RequestHandlers.initHandlersFromConfig created /replication: solr.ReplicationHandler
[junit4:junit4]   2> 10797 T1466 oasc.RequestHandlers.initHandlersFromConfig created standard: solr.StandardRequestHandler
[junit4:junit4]   2> 10798 T1466 oasc.RequestHandlers.initHandlersFromConfig created /get: solr.RealTimeGetHandler
[junit4:junit4]   2> 10799 T1466 oasc.RequestHandlers.initHandlersFromConfig created dismax: solr.SearchHandler
[junit4:junit4]   2> 10800 T1466 oasc.RequestHandlers.initHandlersFromConfig created mock: org.apache.solr.core.MockQuerySenderListenerReqHandler
[junit4:junit4]   2> 10800 T1466 oasc.RequestHandlers.initHandlersFromConfig created /admin/: org.apache.solr.handler.admin.AdminHandlers
[junit4:junit4]   2> 10801 T1466 oasc.RequestHandlers.initHandlersFromConfig created defaults: solr.StandardRequestHandler
[junit4:junit4]   2> 10801 T1466 oasc.RequestHandlers.initHandlersFromConfig adding lazy requestHandler: solr.StandardRequestHandler
[junit4:junit4]   2> 10801 T1466 oasc.RequestHandlers.initHandlersFromConfig created lazy: solr.StandardRequestHandler
[junit4:junit4]   2> 10802 T1466 oasc.RequestHandlers.initHandlersFromConfig created /update: solr.UpdateRequestHandler
[junit4:junit4]   2> 10803 T1466 oasc.RequestHandlers.initHandlersFromConfig created /terms: org.apache.solr.handler.component.SearchHandler
[junit4:junit4]   2> 10804 T1466 oasc.RequestHandlers.initHandlersFromConfig created spellCheckCompRH: org.apache.solr.handler.component.SearchHandler
[junit4:junit4]   2> 10805 T1466 oasc.RequestHandlers.initHandlersFromConfig created spellCheckCompRH_Direct: org.apache.solr.handler.component.SearchHandler
[junit4:junit4]   2> 10806 T1466 oasc.RequestHandlers.initHandlersFromConfig created spellCheckWithWordbreak: org.apache.solr.handler.component.SearchHandler
[junit4:junit4]   2> 10806 T1466 oasc.RequestHandlers.initHandlersFromConfig created spellCheckWithWordbreak_Direct: org.apache.solr.handler.component.SearchHandler
[junit4:junit4]   2> 10807 T1466 oasc.RequestHandlers.initHandlersFromConfig created spellCheckCompRH1: org.apache.solr.handler.component.SearchHandler
[junit4:junit4]   2> 10808 T1466 oasc.RequestHandlers.initHandlersFromConfig created mltrh: org.apache.solr.handler.component.SearchHandler
[junit4:junit4]   2> 10809 T1466 oasc.RequestHandlers.initHandlersFromConfig created tvrh: org.apache.solr.handler.component.SearchHandler
[junit4:junit4]   2> 10810 T1466 oasc.RequestHandlers.initHandlersFromConfig created /mlt: solr.MoreLikeThisHandler
[junit4:junit4]   2> 10811 T1466 oasc.RequestHandlers.initHandlersFromConfig created /debug/dump: solr.DumpRequestHandler
[junit4:junit4]   2> 10818 T1466 oashl.XMLLoader.init xsltCacheLifetimeSeconds=60
[junit4:junit4]   2> 10823 T1466 oasc.SolrCore.initDeprecatedSupport WARNING solrconfig.xml uses deprecated <admin/gettableFiles>, Please update your config to use the ShowFileRequestHandler.
[junit4:junit4]   2> 10825 T1466 oasc.SolrCore.initDeprecatedSupport WARNING adding ShowFileRequestHandler with hidden files: [SCHEMA.XML, OLD_SYNONYMS.TXT, STOPWORDS.TXT, PROTWORDS.TXT, OPEN-EXCHANGE-RATES.JSON, SYNONYMS.TXT, CURRENCY.XML, MAPPING-ISOLATIN1ACCENT.TXT]
[junit4:junit4]   2> 10827 T1466 oasc.CachingDirectoryFactory.close Releasing directory:/usr/home/hudson/hudson-slave/workspace/Lucene-Solr-NightlyTests-4.x/solr/build/solr-core/test/J0/./org.apache.solr.cloud.BasicDistributedZkTest-1355729494208/jetty4
[junit4:junit4]   2> 10829 T1466 oass.SolrIndexSearcher.<init> Opening Searcher@5919d25d main
[junit4:junit4]   2> 10830 T1466 oasu.CommitTracker.<init> Hard AutoCommit: disabled
[junit4:junit4]   2> 10830 T1466 oasu.CommitTracker.<init> Soft AutoCommit: disabled
[junit4:junit4]   2> 10831 T1466 oashc.SpellCheckComponent.inform Initializing spell checkers
[junit4:junit4]   2> 10838 T1466 oass.DirectSolrSpellChecker.init init: {name=direct,classname=DirectSolrSpellChecker,field=lowerfilt,minQueryLength=3}
[junit4:junit4]   2> 10888 T1467 oasc.SolrCore.registerSearcher [collection1] Registered new searcher Searcher@5919d25d main{StandardDirectoryReader(segments_1:1)}
[junit4:junit4]   2> 10892 T1466 oasc.ZkController.publish publishing core=collection1 state=down
[junit4:junit4]   2> 10892 T1466 oasc.ZkController.publish numShards not found on descriptor - reading it from system property
[junit4:junit4]   2> 11256 T1400 oascc.ZkStateReader.updateClusterState Updating cloud state from ZooKeeper... 
[junit4:junit4]   2> 11257 T1400 oasc.Overseer$ClusterStateUpdater.updateState Update state numShards=2 message={
[junit4:junit4]   2> 	  "operation":"state",
[junit4:junit4]   2> 	  "numShards":"2",
[junit4:junit4]   2> 	  "shard":null,
[junit4:junit4]   2> 	  "roles":null,
[junit4:junit4]   2> 	  "state":"down",
[junit4:junit4]   2> 	  "core":"collection1",
[junit4:junit4]   2> 	  "collection":"collection1",
[junit4:junit4]   2> 	  "node_name":"127.0.0.1:49868_",
[junit4:junit4]   2> 	  "base_url":"http://127.0.0.1:49868"}
[junit4:junit4]   2> 11257 T1400 oasc.Overseer$ClusterStateUpdater.updateState Collection already exists with numShards=2
[junit4:junit4]   2> 11258 T1400 oasc.Overseer$ClusterStateUpdater.updateState Assigning new node to shard shard=shard2
[junit4:junit4]   2> 11281 T1405 oascc.ZkStateReader$2.process A cluster state change: WatchedEvent state:SyncConnected type:NodeDataChanged path:/clusterstate.json, has occurred - updating... (live nodes size: 5)
[junit4:junit4]   2> 11281 T1433 oascc.ZkStateReader$2.process A cluster state change: WatchedEvent state:SyncConnected type:NodeDataChanged path:/clusterstate.json, has occurred - updating... (live nodes size: 5)
[junit4:junit4]   2> 11281 T1418 oascc.ZkStateReader$2.process A cluster state change: WatchedEvent state:SyncConnected type:NodeDataChanged path:/clusterstate.json, has occurred - updating... (live nodes size: 5)
[junit4:junit4]   2> 11281 T1465 oascc.ZkStateReader$2.process A cluster state change: WatchedEvent state:SyncConnected type:NodeDataChanged path:/clusterstate.json, has occurred - updating... (live nodes size: 5)
[junit4:junit4]   2> 11281 T1448 oascc.ZkStateReader$2.process A cluster state change: WatchedEvent state:SyncConnected type:NodeDataChanged path:/clusterstate.json, has occurred - updating... (live nodes size: 5)
[junit4:junit4]   2> 11281 T1399 oascc.ZkStateReader$2.process A cluster state change: WatchedEvent state:SyncConnected type:NodeDataChanged path:/clusterstate.json, has occurred - updating... (live nodes size: 5)
[junit4:junit4]   2> 11395 T1466 oasc.CoreContainer.registerCore registering core: collection1
[junit4:junit4]   2> 11395 T1466 oasc.ZkController.register Register shard - core:collection1 address:http://127.0.0.1:49868 shardId:shard2
[junit4:junit4]   2> 11399 T1466 oasc.ZkController.register We are http://127.0.0.1:49868/collection1/ and leader is http://127.0.0.1:21485/collection1/
[junit4:junit4]   2> 11400 T1466 oasc.ZkController.register No LogReplay needed for core=collection1 baseURL=http://127.0.0.1:49868
[junit4:junit4]   2> 11400 T1466 oasc.ZkController.checkRecovery Core needs to recover:collection1
[junit4:junit4]   2> 11400 T1466 oasu.DefaultSolrCoreState.doRecovery Running recovery - first canceling any ongoing recovery
[junit4:junit4]   2> ASYNC  NEW_CORE C52 name=collection1 org.apache.solr.core.SolrCore@4f10c46c url=http://127.0.0.1:49868/collection1 node=127.0.0.1:49868_
[junit4:junit4]   2> 11401 T1468 C52 P49868 oasc.RecoveryStrategy.run Starting recovery process.  core=collection1 recoveringAfterStartup=true
[junit4:junit4]   2> 11401 T1468 C52 P49868 oasc.RecoveryStrategy.doRecovery ###### startupVersions=[]
[junit4:junit4]   2> 11401 T1468 C52 P49868 oasc.ZkController.publish publishing core=collection1 state=recovering
[junit4:junit4]   2> 11401 T1466 oascc.ZkStateReader.updateClusterState Updating cloud state from ZooKeeper... 
[junit4:junit4]   2> 11402 T1468 C52 P49868 oasc.ZkController.publish numShards not found on descriptor - reading it from system property
[junit4:junit4]   2> 11403 T1377 oass.SolrDispatchFilter.init user.dir=/usr/home/hudson/hudson-slave/workspace/Lucene-Solr-NightlyTests-4.x/solr/build/solr-core/test/J0
[junit4:junit4]   2> 11403 T1377 oass.SolrDispatchFilter.init SolrDispatchFilter.init() done
[junit4:junit4]   2> 11404 T1377 oascsi.HttpClientUtil.createClient Creating new http client, config:maxConnections=128&maxConnectionsPerHost=32&followRedirects=false
[junit4:junit4]   2> 11409 T1468 C52 P49868 oasc.RecoveryStrategy.doRecovery Attempting to PeerSync from http://127.0.0.1:21485/collection1/ core=collection1 - recoveringAfterStartup=true
[junit4:junit4]   2> 11409 T1468 C52 P49868 oasu.PeerSync.sync PeerSync: core=collection1 url=http://127.0.0.1:49868 START replicas=[http://127.0.0.1:21485/collection1/] nUpdates=100
[junit4:junit4]   2> 11409 T1468 C52 P49868 oasu.PeerSync.sync WARNING no frame of reference to tell of we've missed updates
[junit4:junit4]   2> 11410 T1468 C52 P49868 oasc.RecoveryStrategy.doRecovery PeerSync Recovery was not successful - trying replication. core=collection1
[junit4:junit4]   2> 11410 T1468 C52 P49868 oasc.RecoveryStrategy.doRecovery Starting Replication Recovery. core=collection1
[junit4:junit4]   2> 11410 T1468 C52 P49868 oascsi.HttpClientUtil.createClient Creating new http client, config:maxConnections=128&maxConnectionsPerHost=32&followRedirects=false
[junit4:junit4]   2> ASYNC  NEW_CORE C53 name=collection1 org.apache.solr.core.SolrCore@552f128b url=http://127.0.0.1:21485/collection1 node=127.0.0.1:21485_
[junit4:junit4]   2> 11419 T1423 C53 P21485 REQ /get {distrib=false&qt=/get&wt=javabin&version=2&getVersions=100} status=0 QTime=0 
[junit4:junit4]   2> 11422 T1377 oascc.ZkStateReader.updateClusterState Updating cloud state from ZooKeeper... 
[junit4:junit4]   2> 11423 T1377 oasc.AbstractDistribZkTestBase.waitForRecoveriesToFinish Wait for recoveries to finish - collection: collection1 failOnTimeout:true timeout (sec):1080
[junit4:junit4]   2> 11424 T1377 oascc.ZkStateReader.updateClusterState Updating cloud state from ZooKeeper... 
[junit4:junit4]   2> 11788 T1400 oascc.ZkStateReader.updateClusterState Updating cloud state from ZooKeeper... 
[junit4:junit4]   2> 11789 T1400 oasc.Overseer$ClusterStateUpdater.updateState Update state numShards=2 message={
[junit4:junit4]   2> 	  "operation":"state",
[junit4:junit4]   2> 	  "numShards":"2",
[junit4:junit4]   2> 	  "shard":"shard2",
[junit4:junit4]   2> 	  "roles":null,
[junit4:junit4]   2> 	  "state":"recovering",
[junit4:junit4]   2> 	  "core":"collection1",
[junit4:junit4]   2> 	  "collection":"collection1",
[junit4:junit4]   2> 	  "node_name":"127.0.0.1:49868_",
[junit4:junit4]   2> 	  "base_url":"http://127.0.0.1:49868"}
[junit4:junit4]   2> 11802 T1448 oascc.ZkStateReader$2.process A cluster state change: WatchedEvent state:SyncConnected type:NodeDataChanged path:/clusterstate.json, has occurred - updating... (live nodes size: 5)
[junit4:junit4]   2> 11802 T1405 oascc.ZkStateReader$2.process A cluster state change: WatchedEvent state:SyncConnected type:NodeDataChanged path:/clusterstate.json, has occurred - updating... (live nodes size: 5)
[junit4:junit4]   2> 11802 T1433 oascc.ZkStateReader$2.process A cluster state change: WatchedEvent state:SyncConnected type:NodeDataChanged path:/clusterstate.json, has occurred - updating... (live nodes size: 5)
[junit4:junit4]   2> 11802 T1399 oascc.ZkStateReader$2.process A cluster state change: WatchedEvent state:SyncConnected type:NodeDataChanged path:/clusterstate.json, has occurred - updating... (live nodes size: 5)
[junit4:junit4]   2> 11802 T1465 oascc.ZkStateReader$2.process A cluster state change: WatchedEvent state:SyncConnected type:NodeDataChanged path:/clusterstate.json, has occurred - updating... (live nodes size: 5)
[junit4:junit4]   2> 11802 T1418 oascc.ZkStateReader$2.process A cluster state change: WatchedEvent state:SyncConnected type:NodeDataChanged path:/clusterstate.json, has occurred - updating... (live nodes size: 5)
[junit4:junit4]   2> 12426 T1377 oascc.ZkStateReader.updateClusterState Updating cloud state from ZooKeeper... 
[junit4:junit4]   2>  C50_STATE=coll:collection1 core:collection1 props:{shard=shard1, roles=null, state=recovering, core=collection1, collection=collection1, node_name=127.0.0.1:29829_, base_url=http://127.0.0.1:29829}
[junit4:junit4]   2> 12486 T1451 C50 P29829 oasc.RecoveryStrategy.doRecovery Begin buffering updates. core=collection1
[junit4:junit4]   2> 12486 T1451 C50 P29829 oasu.UpdateLog.bufferUpdates Starting to buffer updates. FSUpdateLog{state=ACTIVE, tlog=null}
[junit4:junit4]   2> 12486 T1451 C50 P29829 oasc.RecoveryStrategy.replicate Attempting to replicate from http://127.0.0.1:47665/collection1/. core=collection1
[junit4:junit4]   2> 12486 T1451 C50 P29829 oascsi.HttpClientUtil.createClient Creating new http client, config:maxConnections=128&maxConnectionsPerHost=32&followRedirects=false
[junit4:junit4]   2> 12496 T1410 C51 P47665 oasu.DirectUpdateHandler2.commit start commit{flags=0,_version_=0,optimize=false,openSearcher=false,waitSearcher=true,expungeDeletes=false,softCommit=false}
[junit4:junit4]   2> 12498 T1410 C51 P47665 oasc.CachingDirectoryFactory.close Releasing directory:/usr/home/hudson/hudson-slave/workspace/Lucene-Solr-NightlyTests-4.x/solr/build/solr-core/test/J0/./org.apache.solr.cloud.BasicDistributedZkTest-1355729494208/jetty1
[junit4:junit4]   2> 12503 T1410 C51 P47665 oasc.SolrDeletionPolicy.onInit SolrDeletionPolicy.onInit: commits:num=1
[junit4:junit4]   2> 		commit{dir=RateLimitedDirectoryWrapper(NRTCachingDirectory(org.apache.lucene.store.NIOFSDirectory@/usr/home/hudson/hudson-slave/workspace/Lucene-Solr-NightlyTests-4.x/solr/build/solr-core/test/J0/org.apache.solr.cloud.BasicDistributedZkTest-1355729494208/jetty1/index lockFactory=org.apache.lucene.store.NativeFSLockFactory@1cd810d1; maxCacheMB=48.0 maxMergeSizeMB=4.0)),segFN=segments_1,generation=1,filenames=[segments_1]
[junit4:junit4]   2> 12504 T1410 C51 P47665 oasc.SolrDeletionPolicy.updateCommits newest commit = 1[segments_1]
[junit4:junit4]   2> 12509 T1410 C51 P47665 oasc.SolrDeletionPolicy.onCommit SolrDeletionPolicy.onCommit: commits:num=2
[junit4:junit4]   2> 		commit{dir=RateLimitedDirectoryWrapper(NRTCachingDirectory(org.apache.lucene.store.NIOFSDirectory@/usr/home/hudson/hudson-slave/workspace/Lucene-Solr-NightlyTests-4.x/solr/build/solr-core/test/J0/org.apache.solr.cloud.BasicDistributedZkTest-1355729494208/jetty1/index lockFactory=org.apache.lucene.store.NativeFSLockFactory@1cd810d1; maxCacheMB=48.0 maxMergeSizeMB=4.0)),segFN=segments_1,generation=1,filenames=[segments_1]
[junit4:junit4]   2> 		commit{dir=RateLimitedDirectoryWrapper(NRTCachingDirectory(org.apache.lucene.store.NIOFSDirectory@/usr/home/hudson/hudson-slave/workspace/Lucene-Solr-NightlyTests-4.x/solr/build/solr-core/test/J0/org.apache.solr.cloud.BasicDistributedZkTest-1355729494208/jetty1/index lockFactory=org.apache.lucene.store.NativeFSLockFactory@1cd810d1; maxCacheMB=48.0 maxMergeSizeMB=4.0)),segFN=segments_2,generation=2,filenames=[segments_2]
[junit4:junit4]   2> 12509 T1410 C51 P47665 oasc.SolrDeletionPolicy.updateCommits newest commit = 2[segments_2]
[junit4:junit4]   2> 12511 T1410 C51 P47665 oasc.CachingDirectoryFactory.close Releasing directory:/usr/home/hudson/hudson-slave/workspace/Lucene-Solr-NightlyTests-4.x/solr/build/solr-core/test/J0/./org.apache.solr.cloud.BasicDistributedZkTest-1355729494208/jetty1
[junit4:junit4]   2> 12511 T1410 C51 P47665 oass.SolrIndexSearcher.<init> Opening Searcher@3db56149 realtime
[junit4:junit4]   2> 12512 T1410 C51 P47665 oasu.DirectUpdateHandler2.commit end_commit_flush
[junit4:junit4]   2> 12512 T1410 C51 P47665 /update {waitSearcher=true&openSearcher=false&commit=true&commit_end_point=true&wt=javabin&softCommit=false&version=2} {commit=} 0 16
[junit4:junit4]   2> 12514 T1451 C50 P29829 oash.ReplicationHandler.inform Commits will be reserved for  10000
[junit4:junit4]   2> 12514 T1451 C50 P29829 oash.SnapPuller.<init>  No value set for 'pollInterval'. Timer Task not started.
[junit4:junit4]   2> 12516 T1411 C51 P47665 oash.ReplicationHandler.inform Commits will be reserved for  10000
[junit4:junit4]   2> 12517 T1411 C51 P47665 REQ /replication {command=indexversion&wt=javabin&qt=/replication&version=2} status=0 QTime=2 
[junit4:junit4]   2> 12517 T1451 C50 P29829 oash.SnapPuller.fetchLatestIndex Master's generation: 2
[junit4:junit4]   2> 12518 T1451 C50 P29829 oash.SnapPuller.fetchLatestIndex Slave's generation: 1
[junit4:junit4]   2> 12518 T1451 C50 P29829 oash.SnapPuller.fetchLatestIndex Starting replication process
[junit4:junit4]   2> 12520 T1411 C51 P47665 oasc.CachingDirectoryFactory.close Releasing directory:/usr/home/hudson/hudson-slave/workspace/Lucene-Solr-NightlyTests-4.x/solr/build/solr-core/test/J0/./org.apache.solr.cloud.BasicDistributedZkTest-1355729494208/jetty1
[junit4:junit4]   2> 12521 T1411 C51 P47665 oasc.CachingDirectoryFactory.close Releasing directory:/usr/home/hudson/hudson-slave/workspace/Lucene-Solr-NightlyTests-4.x/solr/build/solr-core/test/J0/./org.apache.solr.cloud.BasicDistributedZkTest-1355729494208/jetty1/index
[junit4:junit4]   2> 12521 T1411 C51 P47665 REQ /replication {command=filelist&generation=2&wt=javabin&qt=/replication&version=2} status=0 QTime=1 
[junit4:junit4]   2> 12522 T1451 C50 P29829 oash.SnapPuller.fetchLatestIndex Number of files in latest index in master: 1
[junit4:junit4]   2> 12524 T1451 C50 P29829 oasc.CachingDirectoryFactory.get return new directory for /usr/home/hudson/hudson-slave/workspace/Lucene-Solr-NightlyTests-4.x/solr/build/solr-core/test/J0/./org.apache.solr.cloud.BasicDistributedZkTest-1355729494208/jetty3/index.20121216233146724 forceNew:false
[junit4:junit4]   2> 12524 T1451 C50 P29829 oasc.CachingDirectoryFactory.close Releasing directory:/usr/home/hudson/hudson-slave/workspace/Lucene-Solr-NightlyTests-4.x/solr/build/solr-core/test/J0/./org.apache.solr.cloud.BasicDistributedZkTest-1355729494208/jetty3
[junit4:junit4]   2> 12525 T1451 C50 P29829 oash.SnapPuller.fetchLatestIndex Starting download to RateLimitedDirectoryWrapper(NRTCachingDirectory(org.apache.lucene.store.NIOFSDirectory@/usr/home/hudson/hudson-slave/workspace/Lucene-Solr-NightlyTests-4.x/solr/build/solr-core/test/J0/org.apache.solr.cloud.BasicDistributedZkTest-1355729494208/jetty3/index.20121216233146724 lockFactory=org.apache.lucene.store.NativeFSLockFactory@608519de; maxCacheMB=48.0 maxMergeSizeMB=4.0)) fullCopy=true
[junit4:junit4]   2> 12528 T1411 C51 P47665 REQ /replication {file=segments_2&command=filecontent&checksum=true&generation=2&qt=/replication&wt=filestream} status=0 QTime=0 
[junit4:junit4]   2> 12529 T1451 C50 P29829 oasc.CachingDirectoryFactory.close Releasing directory:/usr/home/hudson/hudson-slave/workspace/Lucene-Solr-NightlyTests-4.x/solr/build/solr-core/test/J0/./org.apache.solr.cloud.BasicDistributedZkTest-1355729494208/jetty3/index
[junit4:junit4]   2> 12530 T1451 C50 P29829 oash.SnapPuller.fetchLatestIndex Total time taken for download : 0 secs
[junit4:junit4]   2> 12530 T1451 C50 P29829 oash.SnapPuller.modifyIndexProps New index installed. Updating index properties... index=index.20121216233146724
[junit4:junit4]   2> 12531 T1451 C50 P29829 oasc.CachingDirectoryFactory.close Releasing directory:/usr/home/hudson/hudson-slave/workspace/Lucene-Solr-NightlyTests-4.x/solr/build/solr-core/test/J0/./org.apache.solr.cloud.BasicDistributedZkTest-1355729494208/jetty3
[junit4:junit4]   2> 12532 T1451 C50 P29829 oasc.CachingDirectoryFactory.close Releasing directory:/usr/home/hudson/hudson-slave/workspace/Lucene-Solr-NightlyTests-4.x/solr/build/solr-core/test/J0/./org.apache.solr.cloud.BasicDistributedZkTest-1355729494208/jetty3
[junit4:junit4]   2> 12532 T1451 C50 P29829 oasc.SolrCore.getNewIndexDir New index directory detected: old=./org.apache.solr.cloud.BasicDistributedZkTest-1355729494208/jetty3/index/ new=./org.apache.solr.cloud.BasicDistributedZkTest-1355729494208/jetty3/index.20121216233146724
[junit4:junit4]   2> 12536 T1451 C50 P29829 oasc.SolrDeletionPolicy.onInit SolrDeletionPolicy.onInit: commits:num=1
[junit4:junit4]   2> 		commit{dir=RateLimitedDirectoryWrapper(NRTCachingDirectory(org.apache.lucene.store.NIOFSDirectory@/usr/home/hudson/hudson-slave/workspace/Lucene-Solr-NightlyTests-4.x/solr/build/solr-core/test/J0/org.apache.solr.cloud.BasicDistributedZkTest-1355729494208/jetty3/index.20121216233146724 lockFactory=org.apache.lucene.store.NativeFSLockFactory@608519de; maxCacheMB=48.0 maxMergeSizeMB=4.0)),segFN=segments_2,generation=2,filenames=[segments_2]
[junit4:junit4]   2> 12536 T1451 C50 P29829 oasc.SolrDeletionPolicy.updateCommits newest commit = 2[segments_2]
[junit4:junit4]   2> 12538 T1451 C50 P29829 oasc.CachingDirectoryFactory.close Releasing directory:/usr/home/hudson/hudson-slave/workspace/Lucene-Solr-NightlyTests-4.x/solr/build/solr-core/test/J0/./org.apache.solr.cloud.BasicDistributedZkTest-1355729494208/jetty3
[junit4:junit4]   2> 12538 T1451 C50 P29829 oasu.DefaultSolrCoreState.newIndexWriter Creating new IndexWriter...
[junit4:junit4]   2> 12538 T1451 C50 P29829 oasu.DefaultSolrCoreState.newIndexWriter Waiting until IndexWriter is unused... core=collection1
[junit4:junit4]   2> 12538 T1451 C50 P29829 oasu.DefaultSolrCoreState.newIndexWriter Rollback old IndexWriter... core=collection1
[junit4:junit4]   2> 12539 T1451 C50 P29829 oasc.CachingDirectoryFactory.close Releasing directory:/usr/home/hudson/hudson-slave/workspace/Lucene-Solr-NightlyTests-4.x/solr/build/solr-core/test/J0/./org.apache.solr.cloud.BasicDistributedZkTest-1355729494208/jetty3/index.20121216233146724
[junit4:junit4]   2> 12540 T1451 C50 P29829 oasc.CachingDirectoryFactory.close Releasing directory:/usr/home/hudson/hudson-slave/workspace/Lucene-Solr-NightlyTests-4.x/solr/build/solr-core/test/J0/./org.apache.solr.cloud.BasicDistributedZkTest-1355729494208/jetty3
[junit4:junit4]   2> 12543 T1451 C50 P29829 oasc.SolrDeletionPolicy.onInit SolrDeletionPolicy.onInit: commits:num=1
[junit4:junit4]   2> 		commit{dir=RateLimitedDirectoryWrapper(NRTCachingDirectory(org.apache.lucene.store.NIOFSDirectory@/usr/home/hudson/hudson-slave/workspace/Lucene-Solr-NightlyTests-4.x/solr/build/solr-core/test/J0/org.apache.solr.cloud.BasicDistributedZkTest-1355729494208/jetty3/index.20121216233146724 lockFactory=org.apache.lucene.store.NativeFSLockFactory@608519de; maxCacheMB=48.0 maxMergeSizeMB=4.0)),segFN=segments_2,generation=2,filenames=[segments_2]
[junit4:junit4]   2> 12543 T1451 C50 P29829 oasc.SolrDeletionPolicy.updateCommits newest commit = 2[segments_2]
[junit4:junit4]   2> 12544 T1451 C50 P29829 oasu.DefaultSolrCoreState.newIndexWriter New IndexWriter is ready to be used.
[junit4:junit4]   2> 12544 T1451 C50 P29829 oasc.CachingDirectoryFactory.close Releasing directory:/usr/home/hudson/hudson-slave/workspace/Lucene-Solr-NightlyTests-4.x/solr/build/solr-core/test/J0/./org.apache.solr.cloud.BasicDistributedZkTest-1355729494208/jetty3
[junit4:junit4]   2> 12544 T1451 C50 P29829 oass.SolrIndexSearcher.<init> Opening Searcher@47ff07ce main
[junit4:junit4]   2> 12546 T1450 oasc.SolrCore.registerSearcher [collection1] Registered new searcher Searcher@47ff07ce main{StandardDirectoryReader(segments_2:1:nrt)}
[junit4:junit4]   2> 12547 T1450 oasc.CachingDirectoryFactory.close Releasing directory:/usr/home/hudson/hudson-slave/workspace/Lucene-Solr-NightlyTests-4.x/solr/build/solr-core/test/J0/./org.apache.solr.cloud.BasicDistributedZkTest-1355729494208/jetty3/index
[junit4:junit4]   2> 12547 T1451 C50 P29829 oasu.DirectUpdateHandler2.commit start commit{flags=0,_version_=0,optimize=false,openSearcher=false,waitSearcher=false,expungeDeletes=false,softCommit=false}
[junit4:junit4]   2> 12550 T1451 C50 P29829 oasc.SolrDeletionPolicy.onCommit SolrDeletionPolicy.onCommit: commits:num=2
[junit4:junit4]   2> 		commit{dir=RateLimitedDirectoryWrapper(NRTCachingDirectory(org.apache.lucene.store.NIOFSDirectory@/usr/home/hudson/hudson-slave/workspace/Lucene-Solr-NightlyTests-4.x/solr/build/solr-core/test/J0/org.apache.solr.cloud.BasicDistributedZkTest-1355729494208/jetty3/index.20121216233146724 lockFactory=org.apache.lucene.store.NativeFSLockFactory@608519de; maxCacheMB=48.0 maxMergeSizeMB=4.0)),segFN=segments_2,generation=2,filenames=[segments_2]
[junit4:junit4]   2> 		commit{dir=RateLimitedDirectoryWrapper(NRTCachingDirectory(org.apache.lucene.store.NIOFSDirectory@/usr/home/hudson/hudson-slave/workspace/Lucene-Solr-NightlyTests-4.x/solr/build/solr-core/test/J0/org.apache.solr.cloud.BasicDistributedZkTest-1355729494208/jetty3/index.20121216233146724 lockFactory=org.apache.lucene.store.NativeFSLockFactory@608519de; maxCacheMB=48.0 maxMergeSizeMB=4.0)),segFN=segments_3,generation=3,filenames=[segments_3]
[junit4:junit4]   2> 12550 T1451 C50 P29829 oasc.SolrDeletionPolicy.updateCommits newest commit = 3[segments_3]
[junit4:junit4]   2> 12551 T1451 C50 P29829 oasc.CachingDirectoryFactory.close Releasing directory:/usr/home/hudson/hudson-slave/workspace/Lucene-Solr-NightlyTests-4.x/solr/build/solr-core/test/J0/./org.apache.solr.cloud.BasicDistributedZkTest-1355729494208/jetty3
[junit4:junit4]   2> 12552 T1451 C50 P29829 oasu.DirectUpdateHandler2.commit end_commit_flush
[junit4:junit4]   2> 12552 T1451 C50 P29829 oasc.CachingDirectoryFactory.close Releasing directory:/usr/home/hudson/hudson-slave/workspace/Lucene-Solr-NightlyTests-4.x/solr/build/solr-core/test/J0/./org.apache.solr.cloud.BasicDistributedZkTest-1355729494208/jetty3/index.20121216233146724
[junit4:junit4]   2> 12552 T1451 C50 P29829 oasc.CachingDirectoryFactory.close Releasing directory:/usr/home/hudson/hudson-slave/workspace/Lucene-Solr-NightlyTests-4.x/solr/build/solr-core/test/J0/./org.apache.solr.cloud.BasicDistributedZkTest-1355729494208/jetty3/index
[junit4:junit4]   2> 12552 T1451 C50 P29829 oasc.RecoveryStrategy.replay No replay needed. core=collection1
[junit4:junit4]   2> 12552 T1451 C50 P29829 oasc.RecoveryStrategy.doRecovery Replication Recovery was successful - registering as Active. core=collection1
[junit4:junit4]   2> 12553 T1451 C50 P29829 oasc.ZkController.publish publishing core=collection1 state=active
[junit4:junit4]   2> 12553 T1451 C50 P29829 oasc.ZkController.publish numShards not found on descriptor - reading it from system property
[junit4:junit4]   2> 12559 T1451 C50 P29829 oasc.RecoveryStrategy.doRecovery Finished recovery process. core=collection1
[junit4:junit4]   2> 12811 T1400 oascc.ZkStateReader.updateClusterState Updating cloud state from ZooKeeper... 
[junit4:junit4]   2> 12812 T1400 oasc.Overseer$ClusterStateUpdater.updateState Update state numShards=2 message={
[junit4:junit4]   2> 	  "operation":"state",
[junit4:junit4]   2> 	  "numShards":"2",
[junit4:junit4]   2> 	  "shard":"shard1",
[junit4:junit4]   2> 	  "roles":null,
[junit4:junit4]   2> 	  "state":"active",
[junit4:junit4]   2> 	  "core":"collection1",
[junit4:junit4]   2> 	  "collection":"collection1",
[junit4:junit4]   2> 	  "node_name":"127.0.0.1:29829_",
[junit4:junit4]   2> 	  "base_url":"http://127.0.0.1:29829"}
[junit4:junit4]   2> 12826 T1448 oascc.ZkStateReader$2.process A cluster state change: WatchedEvent state:SyncConnected type:NodeDataChanged path:/clusterstate.json, has occurred - updating... (live nodes size: 5)
[junit4:junit4]   2> 12826 T1399 oascc.ZkStateReader$2.process A cluster state change: WatchedEvent state:SyncConnected type:NodeDataChanged path:/clusterstate.json, has occurred - updating... (live nodes size: 5)
[junit4:junit4]   2> 12826 T1418 oascc.ZkStateReader$2.process A cluster state change: WatchedEvent state:SyncConnected type:NodeDataChanged path:/clusterstate.json, has occurred - updating... (live nodes size: 5)
[junit4:junit4]   2> 12826 T1465 oascc.ZkStateReader$2.process A cluster state change: WatchedEvent state:SyncConnected type:NodeDataChanged path:/clusterstate.json, has occurred - updating... (live nodes size: 5)
[junit4:junit4]   2> 12826 T1405 oascc.ZkStateReader$2.process A cluster state change: WatchedEvent state:SyncConnected type:NodeDataChanged path:/clusterstate.json, has occurred - updating... (live nodes size: 5)
[junit4:junit4]   2> 12826 T1433 oascc.ZkStateReader$2.process A cluster state change: WatchedEvent state:SyncConnected type:NodeDataChanged path:/clusterstate.json, has occurred - updating... (live nodes size: 5)
[junit4:junit4]   2> 13429 T1377 oascc.ZkStateReader.updateClusterState Updating cloud state from ZooKeeper... 
[junit4:junit4]   2>  C52_STATE=coll:collection1 core:collection1 props:{shard=shard2, roles=null, state=recovering, core=collection1, collection=collection1, node_name=127.0.0.1:49868_, base_url=http://127.0.0.1:49868}
[junit4:junit4]   2> 14426 T1468 C52 P49868 oasc.RecoveryStrategy.doRecovery Begin buffering updates. core=collection1
[junit4:junit4]   2> 14426 T1468 C52 P49868 oasu.UpdateLog.bufferUpdates Starting to buffer updates. FSUpdateLog{state=ACTIVE, tlog=null}
[junit4:junit4]   2> 14426 T1468 C52 P49868 oasc.RecoveryStrategy.replicate Attempting to replicate from http://127.0.0.1:21485/collection1/. core=collection1
[junit4:junit4]   2> 14426 T1468 C52 P49868 oascsi.HttpClientUtil.createClient Creating new http client, config:maxConnections=128&maxConnectionsPerHost=32&followRedirects=false
[junit4:junit4]   2> 14432 T1377 oascc.ZkStateReader.updateClusterState Updating cloud state from ZooKeeper... 
[junit4:junit4]   2> 14441 T1425 C53 P21485 oasu.DirectUpdateHandler2.commit start commit{flags=0,_version_=0,optimize=false,openSearcher=false,waitSearcher=true,expungeDeletes=false,softCommit=false}
[junit4:junit4]   2> 14443 T1425 C53 P21485 oasc.CachingDirectoryFactory.close Releasing directory:/usr/home/hudson/hudson-slave/workspace/Lucene-Solr-NightlyTests-4.x/solr/build/solr-core/test/J0/./org.apache.solr.cloud.BasicDistributedZkTest-1355729494208/jetty2
[junit4:junit4]   2> 14447 T1425 C53 P21485 oasc.SolrDeletionPolicy.onInit SolrDeletionPolicy.onInit: commits:num=1
[junit4:junit4]   2> 		commit{dir=RateLimitedDirectoryWrapper(NRTCachingDirectory(org.apache.lucene.store.NIOFSDirectory@/usr/home/hudson/hudson-slave/workspace/Lucene-Solr-NightlyTests-4.x/solr/build/solr-core/test/J0/org.apache.solr.cloud.BasicDistributedZkTest-1355729494208/jetty2/index lockFactory=org.apache.lucene.store.NativeFSLockFactory@2e86563d; maxCacheMB=48.0 maxMergeSizeMB=4.0)),segFN=segments_1,generation=1,filenames=[segments_1]
[junit4:junit4]   2> 14447 T1425 C53 P21485 oasc.SolrDeletionPolicy.updateCommits newest commit = 1[segments_1]
[junit4:junit4]   2> 14451 T1425 C53 P21485 oasc.SolrDeletionPolicy.onCommit SolrDeletionPolicy.onCommit: commits:num=2
[junit4:junit4]   2> 		commit{dir=RateLimitedDirectoryWrapper(NRTCachingDirectory(org.apache.lucene.store.NIOFSDirectory@/usr/home/hudson/hudson-slave/workspace/Lucene-Solr-NightlyTests-4.x/solr/build/solr-core/test/J0/org.apache.solr.cloud.BasicDistributedZkTest-1355729494208/jetty2/index lockFactory=org.apache.lucene.store.NativeFSLockFactory@2e86563d; maxCacheMB=48.0 maxMergeSizeMB=4.0)),segFN=segments_1,generation=1,filenames=[segments_1]
[junit4:junit4]   2> 		commit{dir=RateLimitedDirectoryWrapper(NRTCachingDirectory(org.apache.lucene.store.NIOFSDirectory@/usr/home/hudson/hudson-slave/workspace/Lucene-Solr-NightlyTests-4.x/solr/build/solr-core/test/J0/org.apache.solr.cloud.BasicDistributedZkTest-1355729494208/jetty2/index lockFactory=org.apache.lucene.store.NativeFSLockFactory@2e86563d; maxCacheMB=48.0 maxMergeSizeMB=4.0)),segFN=segments_2,generation=2,filenames=[segments_2]
[junit4:junit4]   2> 14452 T1425 C53 P21485 oasc.SolrDeletionPolicy.updateCommits newest commit = 2[segments_2]
[junit4:junit4]   2> 14453 T1425 C53 P21485 oasc.CachingDirectoryFactory.close Releasing directory:/usr/home/hudson/hudson-slave/workspace/Lucene-Solr-NightlyTests-4.x/solr/build/solr-core/test/J0/./org.apache.solr.cloud.BasicDistributedZkTest-1355729494208/jetty2
[junit4:junit4]   2> 14454 T1425 C53 P21485 oass.SolrIndexSearcher.<init> Opening Searcher@779ffee6 realtime
[junit4:junit4]   2> 14454 T1425 C53 P21485 oasu.DirectUpdateHandler2.commit end_commit_flush
[junit4:junit4]   2> 14455 T1425 C53 P21485 /update {waitSearcher=true&openSearcher=false&commit=true&commit_end_point=true&wt=javabin&softCommit=false&version=2} {commit=} 0 14
[junit4:junit4]   2> 14456 T1468 C52 P49868 oash.ReplicationHandler.inform Commits will be reserved for  10000
[junit4:junit4]   2> 14457 T1468 C52 P49868 oash.SnapPuller.<init>  No value set for 'pollInterval'. Timer Task not started.
[junit4:junit4]   2> 14459 T1426 C53 P21485 oash.ReplicationHandler.inform Commits will be reserved for  10000
[junit4:junit4]   2> 14459 T1426 C53 P21485 REQ /replication {command=indexversion&wt=javabin&qt=/replication&version=2} status=0 QTime=1 
[junit4:junit4]   2> 14460 T1468 C52 P49868 oash.SnapPuller.fetchLatestIndex Master's generation: 2
[junit4:junit4]   2> 14460 T1468 C52 P49868 oash.SnapPuller.fetchLatestIndex Slave's generation: 1
[junit4:junit4]   2> 14460 T1468 C52 P49868 oash.SnapPuller.fetchLatestIndex Starting replication process
[junit4:junit4]   2> 14462 T1426 C53 P21485 oasc.CachingDirectoryFactory.close Releasing directory:/usr/home/hudson/hudson-slave/workspace/Lucene-Solr-NightlyTests-4.x/solr/build/solr-core/test/J0/./org.apache.solr.cloud.BasicDistributedZkTest-1355729494208/jetty2
[junit4:junit4]   2> 14463 T1426 C53 P21485 oasc.CachingDirectoryFactory.close Releasing directory:/usr/home/hudson/hudson-slave/workspace/Lucene-Solr-NightlyTests-4.x/solr/build/solr-core/test/J0/./org.apache.solr.cloud.BasicDistributedZkTest-1355729494208/jetty2/index
[junit4:junit4]   2> 14463 T1426 C53 P21485 REQ /replication {command=filelist&generation=2&wt=javabin&qt=/replication&version=2} status=0 QTime=1 
[junit4:junit4]   2> 14464 T1468 C52 P49868 oash.SnapPuller.fetchLatestIndex Number of files in latest index in master: 1
[junit4:junit4]   2> 14465 T1468 C52 P49868 oasc.CachingDirectoryFactory.get return new directory for /usr/home/hudson/hudson-slave/workspace/Lucene-Solr-NightlyTests-4.x/solr/build/solr-core/test/J0/./org.apache.solr.cloud.BasicDistributedZkTest-1355729494208/jetty4/index.20121216233148666 forceNew:false
[junit4:junit4]   2> 14466 T1468 C52 P49868 oasc.CachingDirectoryFactory.close Releasing directory:/usr/home/hudson/hudson-slave/workspace/Lucene-Solr-NightlyTests-4.x/solr/build/solr-core/test/J0/./org.apache.solr.cloud.BasicDistributedZkTest-1355729494208/jetty4
[junit4:junit4]   2> 14466 T1468 C52 P49868 oash.SnapPuller.fetchLatestIndex Starting download to RateLimitedDirectoryWrapper(NRTCachingDirectory(org.apache.lucene.store.NIOFSDirectory@/usr/home/hudson/hudson-slave/workspace/Lucene-Solr-NightlyTests-4.x/solr/build/solr-core/test/J0/org.apache.solr.cloud.BasicDistributedZkTest-1355729494208/jetty4/index.20121216233148666 lockFactory=org.apache.lucene.store.NativeFSLockFactory@21fc4640; maxCacheMB=48.0 maxMergeSizeMB=4.0)) fullCopy=true
[junit4:junit4]   2> 14470 T1426 C53 P21485 REQ /replication {file=segments_2&command=filecontent&checksum=true&generation=2&qt=/replication&wt=filestream} status=0 QTime=0 
[junit4:junit4]   2> 14471 T1468 C52 P49868 oasc.CachingDirectoryFactory.close Releasing directory:/usr/home/hudson/hudson-slave/workspace/Lucene-Solr-NightlyTests-4.x/solr/build/solr-core/test/J0/./org.apache.solr.cloud.BasicDistributedZkTest-1355729494208/jetty4/index
[junit4:junit4]   2> 14472 T1468 C52 P49868 oash.SnapPuller.fetchLatestIndex Total time taken for download : 0 secs
[junit4:junit4]   2> 14472 T1468 C52 P49868 oash.SnapPuller.modifyIndexProps New index installed. Updating index properties... index=index.20121216233148666
[junit4:junit4]   2> 14473 T1468 C52 P49868 oasc.CachingDirectoryFactory.close Releasing directory:/usr/home/hudson/hudson-slave/workspace/Lucene-Solr-NightlyTests-4.x/solr/build/solr-core/test/J0/./org.apache.solr.cloud.BasicDistributedZkTest-1355729494208/jetty4
[junit4:junit4]   2> 14474 T1468 C52 P49868 oasc.CachingDirectoryFactory.close Releasing directory:/usr/home/hudson/hudson-slave/workspace/Lucene-Solr-NightlyTests-4.x/solr/build/solr-core/test/J0/./org.apache.solr.cloud.BasicDistributedZkTest-1355729494208/jetty4
[junit4:junit4]   2> 14474 T1468 C52 P49868 oasc.SolrCore.getNewIndexDir New index directory detected: old=./org.apache.solr.cloud.BasicDistributedZkTest-1355729494208/jetty4/index/ new=./org.apache.solr.cloud.BasicDistributedZkTest-1355729494208/jetty4/index.20121216233148666
[junit4:junit4]   2> 14478 T1468 C52 P49868 oasc.SolrDeletionPolicy.onInit SolrDeletionPolicy.onInit: commits:num=1
[junit4:junit4]   2> 		commit{dir=RateLimitedDirectoryWrapper(NRTCachingDirectory(org.apache.lucene.store.NIOFSDirectory@/usr/home/hudson/hudson-slave/workspace/Lucene-Solr-NightlyTests-4.x/solr/build/solr-core/test/J0/org.apache.solr.cloud.BasicDistributedZkTest-1355729494208/jetty4/index.20121216233148666 lockFactory=org.apache.lucene.store.NativeFSLockFactory@21fc4640; maxCacheMB=48.0 maxMergeSizeMB=4.0)),segFN=segments_2,generation=2,filenames=[segments_2]
[junit4:junit4]   2> 14478 T1468 C52 P49868 oasc.SolrDeletionPolicy.updateCommits newest commit = 2[segments_2]
[junit4:junit4]   2> 14479 T1468 C52 P49868 oasc.CachingDirectoryFactory.close Releasing directory:/usr/home/hudson/hudson-slave/workspace/Lucene-Solr-NightlyTests-4.x/solr/build/solr-core/test/J0/./org.apache.solr.cloud.BasicDistributedZkTest-1355729494208/jetty4
[junit4:junit4]   2> 14480 T1468 C52 P49868 oasu.DefaultSolrCoreState.newIndexWriter Creating new IndexWriter...
[junit4:junit4]   2> 14480 T1468 C52 P49868 oasu.DefaultSolrCoreState.newIndexWriter Waiting until IndexWriter is unused... core=collection1
[junit4:junit4]   2> 14480 T1468 C52 P49868 oasu.DefaultSolrCoreState.newIndexWriter Rollback old IndexWriter... core=collection1
[junit4:junit4]   2> 14481 T1468 C52 P49868 oasc.CachingDirectoryFactory.close Releasing directory:/usr/home/hudson/hudson-slave/workspace/Lucene-Solr-NightlyTests-4.x/solr/build/solr-core/test/J0/./org.apache.solr.cloud.BasicDistributedZkTest-1355729494208/jetty4/index.20121216233148666
[junit4:junit4]   2> 14481 T1468 C52 P49868 oasc.CachingDirectoryFactory.close Releasing directory:/usr/home/hudson/hudson-slave/workspace/Lucene-Solr-NightlyTests-4.x/solr/build/solr-core/test/J0/./org.apache.solr.cloud.BasicDistributedZkTest-1355729494208/jetty4
[junit4:junit4]   2> 14485 T1468 C52 P49868 oasc.SolrDeletionPolicy.onInit SolrDeletionPolicy.onInit: commits:num=1
[junit4:junit4]   2> 		commit{dir=RateLimitedDirectoryWrapper(NRTCachingDirectory(org.apache.lucene.store.NIOFSDirectory@/usr/home/hudson/hudson-slave/workspace/Lucene-Solr-NightlyTests-4.x/solr/build/solr-core/test/J0/org.apache.solr.cloud.BasicDistributedZkTest-1355729494208/jetty4/index.20121216233148666 lockFactory=org.apache.lucene.store.NativeFSLockFactory@21fc4640; maxCacheMB=48.0 maxMergeSizeMB=4.0)),segFN=segments_2,generation=2,filenames=[segments_2]
[junit4:junit4]   2> 14485 T1468 C52 P49868 oasc.SolrDeletionPolicy.updateCommits newest commit = 2[segments_2]
[junit4:junit4]   2> 14485 T1468 C52 P49868 oasu.DefaultSolrCoreState.newIndexWriter New IndexWriter is ready to be used.
[junit4:junit4]   2> 14486 T1468 C52 P49868 oasc.CachingDirectoryFactory.close Releasing directory:/usr/home/hudson/hudson-slave/workspace/Lucene-Solr-NightlyTests-4.x/solr/build/solr-core/test/J0/./org.apache.solr.cloud.BasicDistributedZkTest-1355729494208/jetty4
[junit4:junit4]   2> 14486 T1468 C52 P49868 oass.SolrIndexSearcher.<init> Opening Searcher@1caea51e main
[junit4:junit4]   2> 14487 T1467 oasc.SolrCore.registerSearcher [collection1] Registered new searcher Searcher@1caea51e main{StandardDirectoryReader(segments_2:1:nrt)}
[junit4:junit4]   2> 14488 T1467 oasc.CachingDirectoryFactory.close Releasing directory:/usr/home/hudson/hudson-slave/workspace/Lucene-Solr-NightlyTests-4.x/solr/build/solr-core/test/J0/./org.apache.solr.cloud.BasicDistributedZkTest-1355729494208/jetty4/index
[junit4:junit4]   2> 14488 T1468 C52 P49868 oasu.DirectUpdateHandler2.commit start commit{flags=0,_version_=0,optimize=false,openSearcher=false,waitSearcher=false,expungeDeletes=false,softCommit=false}
[junit4:junit4]   2> 14491 T1468 C52 P49868 oasc.SolrDeletionPolicy.onCommit SolrDeletionPolicy.onCommit: commits:num=2
[junit4:junit4]   2> 		commit{dir=RateLimitedDirectoryWrapper(NRTCachingDirectory(org.apache.lucene.store.NIOFSDirectory@/usr/home/hudson/hudson-slave/workspace/Lucene-Solr-NightlyTests-4.x/solr/build/solr-core/test/J0/org.apache.solr.cloud.BasicDistributedZkTest-1355729494208/jetty4/index.20121216233148666 lockFactory=org.apache.lucene.store.NativeFSLockFactory@21fc4640; maxCacheMB=48.0 maxMergeSizeMB=4.0)),segFN=segments_2,generation=2,filenames=[segments_2]
[junit4:junit4]   2> 		commit{dir=RateLimitedDirectoryWrapper(NRTCachingDirectory(org.apache.lucene.store.NIOFSDirectory@/usr/home/hudson/hudson-slave/workspace/Lucene-Solr-NightlyTests-4.x/solr/build/solr-core/test/J0/org.apache.solr.cloud.BasicDistributedZkTest-1355729494208/jetty4/index.20121216233148666 lockFactory=org.apache.lucene.store.NativeFSLockFactory@21fc4640; maxCacheMB=48.0 maxMergeSizeMB=4.0)),segFN=segments_3,generation=3,filenames=[segments_3]
[junit4:junit4]   2> 14492 T1468 C52 P49868 oasc.SolrDeletionPolicy.updateCommits newest commit = 3[segments_3]
[junit4:junit4]   2> 14493 T1468 C52 P49868 oasc.CachingDirectoryFactory.close Releasing directory:/usr/home/hudson/hudson-slave/workspace/Lucene-Solr-NightlyTests-4.x/solr/build/solr-core/test/J0/./org.apache.solr.cloud.BasicDistributedZkTest-1355729494208/jetty4
[junit4:junit4]   2> 14493 T1468 C52 P49868 oasu.DirectUpdateHandler2.commit end_commit_flush
[junit4:junit4]   2> 14493 T1468 C52 P49868 oasc.CachingDirectoryFactory.close Releasing directory:/usr/home/hudson/hudson-slave/workspace/Lucene-Solr-NightlyTests-4.x/solr/build/solr-core/test/J0/./org.apache.solr.cloud.BasicDistributedZkTest-1355729494208/jetty4/index.20121216233148666
[junit4:junit4]   2> 14494 T1468 C52 P49868 oasc.CachingDirectoryFactory.close Releasing directory:/usr/home/hudson/hudson-slave/workspace/Lucene-Solr-NightlyTests-4.x/solr/build/solr-core/test/J0/./org.apache.solr.cloud.BasicDistributedZkTest-1355729494208/jetty4/index
[junit4:junit4]   2> 14494 T1468 C52 P49868 oasc.RecoveryStrategy.replay No replay needed. core=collection1
[junit4:junit4]   2> 14494 T1468 C52 P49868 oasc.RecoveryStrategy.doRecovery Replication Recovery was successful - registering as Active. core=collection1
[junit4:junit4]   2> 14494 T1468 C52 P49868 oasc.ZkController.publish publishing core=collection1 state=active
[junit4:junit4]   2> 14494 T1468 C52 P49868 oasc.ZkController.publish numShards not found on descriptor - reading it from system property
[junit4:junit4]   2> 14502 T1468 C52 P49868 oasc.RecoveryStrategy.doRecovery Finished recovery process. core=collection1
[junit4:junit4]   2> 14839 T1400 oascc.ZkStateReader.updateClusterState Updating cloud state from ZooKeeper... 
[junit4:junit4]   2> 14840 T1400 oasc.Overseer$ClusterStateUpdater.updateState Update state numShards=2 message={
[junit4:junit4]   2> 	  "operation":"state",
[junit4:junit4]   2> 	  "numShards":"2",
[junit4:junit4]   2> 	  "shard":"shard2",
[junit4:junit4]   2> 	  "roles":null,
[junit4:junit4]   2> 	  "state":"active",
[junit4:junit4]   2> 	  "core":"collection1",
[junit4:junit4]   2> 	  "collection":"collection1",
[junit4:junit4]   2> 	  "node_name":"127.0.0.1:49868_",
[junit4:junit4]   2> 	  "base_url":"http://127.0.0.1:49868"}
[junit4:junit4]   2> 14861 T1405 oascc.ZkStateReader$2.process A cluster state change: WatchedEvent state:SyncConnected type:NodeDataChanged path:/clusterstate.json, has occurred - updating... (live nodes size: 5)
[junit4:junit4]   2> 14861 T1399 oascc.ZkStateReader$2.process A cluster state change: WatchedEvent state:SyncConnected type:NodeDataChanged path:/clusterstate.json, has occurred - updating... (live nodes size: 5)
[junit4:junit4]   2> 14861 T1418 oascc.ZkStateReader$2.process A cluster state change: WatchedEvent state:SyncConnected type:NodeDataChanged path:/clusterstate.json, has occurred - updating... (live nodes size: 5)
[junit4:junit4]   2> 14861 T1465 oascc.ZkStateReader$2.process A cluster state change: WatchedEvent state:SyncConnected type:NodeDataChanged path:/clusterstate.json, has occurred - updating... (live nodes size: 5)
[junit4:junit4]   2> 14861 T1448 oascc.ZkStateReader$2.process A cluster state change: WatchedEvent state:SyncConnected type:NodeDataChanged path:/clusterstate.json, has occurred - updating... (live nodes size: 5)
[junit4:junit4]   2> 14861 T1433 oascc.ZkStateReader$2.process A cluster state change: WatchedEvent state:SyncConnected type:NodeDataChanged path:/clusterstate.json, has occurred - updating... (live nodes size: 5)
[junit4:junit4]   2> 15435 T1377 oascc.ZkStateReader.updateClusterState Updating cloud state from ZooKeeper... 
[junit4:junit4]   2> 15437 T1377 oasc.AbstractDistribZkTestBase.waitForRecoveriesToFinish Recoveries finished - collection: collection1
[junit4:junit4]   2> ASYNC  NEW_CORE C54 name=collection1 org.apache.solr.core.SolrCore@7e427737 url=http://127.0.0.1:54669/collection1 node=127.0.0.1:54669_
[junit4:junit4]   2> 15448 T1389 C54 P54669 oasc.CachingDirectoryFactory.close Releasing directory:/usr/home/hudson/hudson-slave/workspace/Lucene-Solr-NightlyTests-4.x/solr/build/solr-core/test/J0/./org.apache.solr.cloud.BasicDistributedZkTest-1355729494208/control/data
[junit4:junit4]   2> 15452 T1389 C54 P54669 oasc.SolrDeletionPolicy.onInit SolrDeletionPolicy.onInit: commits:num=1
[junit4:junit4]   2> 		commit{dir=RateLimitedDirectoryWrapper(NRTCachingDirectory(org.apache.lucene.store.NIOFSDirectory@/usr/home/hudson/hudson-slave/workspace/Lucene-Solr-NightlyTests-4.x/solr/build/solr-core/test/J0/org.apache.solr.cloud.BasicDistributedZkTest-1355729494208/control/data/index lockFactory=org.apache.lucene.store.NativeFSLockFactory@3841d54b; maxCacheMB=48.0 maxMergeSizeMB=4.0)),segFN=segments_1,generation=1,filenames=[segments_1]
[junit4:junit4]   2> 15453 T1389 C54 P54669 oasc.SolrDeletionPolicy.updateCommits newest commit = 1[segments_1]
[junit4:junit4]   2> 15455 T1389 C54 P54669 oasc.CachingDirectoryFactory.close Releasing directory:/usr/home/hudson/hudson-slave/workspace/Lucene-Solr-NightlyTests-4.x/solr/build/solr-core/test/J0/./org.apache.solr.cloud.BasicDistributedZkTest-1355729494208/control/data
[junit4:junit4]   2> 15455 T1389 C54 P54669 oass.SolrIndexSearcher.<init> Opening Searcher@334fc53b realtime
[junit4:junit4]   2> 15456 T1389 C54 P54669 /update {wt=javabin

[...truncated too long message...]

odecs/classes/java:/usr/home/hudson/hudson-slave/workspace/Lucene-Solr-NightlyTests-4.x/solr/build/solr-solrj/classes/java:/usr/home/hudson/hudson-slave/workspace/Lucene-Solr-NightlyTests-4.x/solr/build/solr-core/classes/java:/usr/home/hudson/hudson-slave/workspace/Lucene-Solr-NightlyTests-4.x/lucene/build/analysis/common/lucene-analyzers-common-4.1-SNAPSHOT.jar:/usr/home/hudson/hudson-slave/workspace/Lucene-Solr-NightlyTests-4.x/lucene/build/analysis/kuromoji/lucene-analyzers-kuromoji-4.1-SNAPSHOT.jar:/usr/home/hudson/hudson-slave/workspace/Lucene-Solr-NightlyTests-4.x/lucene/build/analysis/phonetic/lucene-analyzers-phonetic-4.1-SNAPSHOT.jar:/usr/home/hudson/hudson-slave/workspace/Lucene-Solr-NightlyTests-4.x/lucene/build/highlighter/lucene-highlighter-4.1-SNAPSHOT.jar:/usr/home/hudson/hudson-slave/workspace/Lucene-Solr-NightlyTests-4.x/lucene/build/memory/lucene-memory-4.1-SNAPSHOT.jar:/usr/home/hudson/hudson-slave/workspace/Lucene-Solr-NightlyTests-4.x/lucene/build/misc/lucene-misc-4.1-SNAPSHOT.jar:/usr/home/hudson/hudson-slave/workspace/Lucene-Solr-NightlyTests-4.x/lucene/build/spatial/lucene-spatial-4.1-SNAPSHOT.jar:/usr/home/hudson/hudson-slave/workspace/Lucene-Solr-NightlyTests-4.x/lucene/build/suggest/lucene-suggest-4.1-SNAPSHOT.jar:/usr/home/hudson/hudson-slave/workspace/Lucene-Solr-NightlyTests-4.x/lucene/build/grouping/lucene-grouping-4.1-SNAPSHOT.jar:/usr/home/hudson/hudson-slave/workspace/Lucene-Solr-NightlyTests-4.x/lucene/build/queries/lucene-queries-4.1-SNAPSHOT.jar:/usr/home/hudson/hudson-slave/workspace/Lucene-Solr-NightlyTests-4.x/lucene/build/queryparser/lucene-queryparser-4.1-SNAPSHOT.jar:/usr/home/hudson/hudson-slave/workspace/Lucene-Solr-NightlyTests-4.x/solr/core/lib/cglib-nodep-2.2.jar:/usr/home/hudson/hudson-slave/workspace/Lucene-Solr-NightlyTests-4.x/solr/core/lib/commons-cli-1.2.jar:/usr/home/hudson/hudson-slave/workspace/Lucene-Solr-NightlyTests-4.x/solr/core/lib/commons-codec-1.7.jar:/usr/home/hudson/hudson-slave/workspace/Lucene-Solr-NightlyTests-4.x/solr/core/lib/commons-fileupload-1.2.1.jar:/usr/home/hudson/hudson-slave/workspace/Lucene-Solr-NightlyTests-4.x/solr/core/lib/commons-lang-2.6.jar:/usr/home/hudson/hudson-slave/workspace/Lucene-Solr-NightlyTests-4.x/solr/core/lib/easymock-3.0.jar:/usr/home/hudson/hudson-slave/workspace/Lucene-Solr-NightlyTests-4.x/solr/core/lib/guava-13.0.1.jar:/usr/home/hudson/hudson-slave/workspace/Lucene-Solr-NightlyTests-4.x/solr/core/lib/javax.servlet-api-3.0.1.jar:/usr/home/hudson/hudson-slave/workspace/Lucene-Solr-NightlyTests-4.x/solr/core/lib/metrics-core-2.1.2.jar:/usr/home/hudson/hudson-slave/workspace/Lucene-Solr-NightlyTests-4.x/solr/core/lib/objenesis-1.2.jar:/usr/home/hudson/hudson-slave/workspace/Lucene-Solr-NightlyTests-4.x/solr/core/lib/spatial4j-0.3.jar:/usr/home/hudson/hudson-slave/workspace/Lucene-Solr-NightlyTests-4.x/solr/solrj/lib/commons-io-2.1.jar:/usr/home/hudson/hudson-slave/workspace/Lucene-Solr-NightlyTests-4.x/solr/solrj/lib/httpclient-4.1.3.jar:/usr/home/hudson/hudson-slave/workspace/Lucene-Solr-NightlyTests-4.x/solr/solrj/lib/httpcore-4.1.4.jar:/usr/home/hudson/hudson-slave/workspace/Lucene-Solr-NightlyTests-4.x/solr/solrj/lib/httpmime-4.1.3.jar:/usr/home/hudson/hudson-slave/workspace/Lucene-Solr-NightlyTests-4.x/solr/solrj/lib/jcl-over-slf4j-1.6.4.jar:/usr/home/hudson/hudson-slave/workspace/Lucene-Solr-NightlyTests-4.x/solr/solrj/lib/log4j-over-slf4j-1.6.4.jar:/usr/home/hudson/hudson-slave/workspace/Lucene-Solr-NightlyTests-4.x/solr/solrj/lib/slf4j-api-1.6.4.jar:/usr/home/hudson/hudson-slave/workspace/Lucene-Solr-NightlyTests-4.x/solr/solrj/lib/slf4j-jdk14-1.6.4.jar:/usr/home/hudson/hudson-slave/workspace/Lucene-Solr-NightlyTests-4.x/solr/solrj/lib/wstx-asl-3.2.7.jar:/usr/home/hudson/hudson-slave/workspace/Lucene-Solr-NightlyTests-4.x/solr/solrj/lib/zookeeper-3.4.5.jar:/usr/home/hudson/hudson-slave/workspace/Lucene-Solr-NightlyTests-4.x/solr/example/lib/jetty-continuation-8.1.8.v20121106.jar:/usr/home/hudson/hudson-slave/workspace/Lucene-Solr-NightlyTests-4.x/solr/example/lib/jetty-deploy-8.1.8.v20121106.jar:/usr/home/hudson/hudson-slave/workspace/Lucene-Solr-NightlyTests-4.x/solr/example/lib/jetty-http-8.1.8.v20121106.jar:/usr/home/hudson/hudson-slave/workspace/Lucene-Solr-NightlyTests-4.x/solr/example/lib/jetty-io-8.1.8.v20121106.jar:/usr/home/hudson/hudson-slave/workspace/Lucene-Solr-NightlyTests-4.x/solr/example/lib/jetty-jmx-8.1.8.v20121106.jar:/usr/home/hudson/hudson-slave/workspace/Lucene-Solr-NightlyTests-4.x/solr/example/lib/jetty-security-8.1.8.v20121106.jar:/usr/home/hudson/hudson-slave/workspace/Lucene-Solr-NightlyTests-4.x/solr/example/lib/jetty-server-8.1.8.v20121106.jar:/usr/home/hudson/hudson-slave/workspace/Lucene-Solr-NightlyTests-4.x/solr/example/lib/jetty-servlet-8.1.8.v20121106.jar:/usr/home/hudson/hudson-slave/workspace/Lucene-Solr-NightlyTests-4.x/solr/example/lib/jetty-util-8.1.8.v20121106.jar:/usr/home/hudson/hudson-slave/workspace/Lucene-Solr-NightlyTests-4.x/solr/example/lib/jetty-webapp-8.1.8.v20121106.jar:/usr/home/hudson/hudson-slave/workspace/Lucene-Solr-NightlyTests-4.x/solr/example/lib/jetty-xml-8.1.8.v20121106.jar:/usr/home/hudson/hudson-slave/workspace/Lucene-Solr-NightlyTests-4.x/solr/example/lib/servlet-api-3.0.jar:/usr/home/hudson/hudson-slave/workspace/Lucene-Solr-NightlyTests-4.x/solr/example/example-DIH/solr/db/lib/derby-10.9.1.0.jar:/usr/home/hudson/hudson-slave/workspace/Lucene-Solr-NightlyTests-4.x/solr/example/example-DIH/solr/db/lib/hsqldb-1.8.0.10.jar:/usr/home/hudson/hudson-slave/workspace/Lucene-Solr-NightlyTests-4.x/lucene/build/core/classes/java:/usr/home/hudson/hudson-slave/workspace/Lucene-Solr-NightlyTests-4.x/lucene/test-framework/lib/junit-4.10.jar:/usr/home/hudson/hudson-slave/workspace/Lucene-Solr-NightlyTests-4.x/lucene/test-framework/lib/randomizedtesting-runner-2.0.6.jar:/home/hudson/hudson-slave/tools/Ant/ant-1.8.2/lib/ant-launcher.jar:/home/hudson/.ant/lib/ivy-2.2.0.jar:/home/hudson/hudson-slave/tools/Ant/ant-1.8.2/lib/ant-apache-regexp.jar:/home/hudson/hudson-slave/tools/Ant/ant-1.8.2/lib/ant-junit.jar:/home/hudson/hudson-slave/tools/Ant/ant-1.8.2/lib/ant-apache-bsf.jar:/home/hudson/hudson-slave/tools/Ant/ant-1.8.2/lib/ant-commons-net.jar:/home/hudson/hudson-slave/tools/Ant/ant-1.8.2/lib/ant-antlr.jar:/home/hudson/hudson-slave/tools/Ant/ant-1.8.2/lib/ant-apache-log4j.jar:/home/hudson/hudson-slave/tools/Ant/ant-1.8.2/lib/ant-commons-logging.jar:/home/hudson/hudson-slave/tools/Ant/ant-1.8.2/lib/ant-apache-xalan2.jar:/home/hudson/hudson-slave/tools/Ant/ant-1.8.2/lib/ant-apache-oro.jar:/home/hudson/hudson-slave/tools/Ant/ant-1.8.2/lib/ant-junit4.jar:/home/hudson/hudson-slave/tools/Ant/ant-1.8.2/lib/ant-netrexx.jar:/home/hudson/hudson-slave/tools/Ant/ant-1.8.2/lib/ant-swing.jar:/home/hudson/hudson-slave/tools/Ant/ant-1.8.2/lib/ant-javamail.jar:/home/hudson/hudson-slave/tools/Ant/ant-1.8.2/lib/ant-jsch.jar:/home/hudson/hudson-slave/tools/Ant/ant-1.8.2/lib/ant-jmf.jar:/home/hudson/hudson-slave/tools/Ant/ant-1.8.2/lib/ant.jar:/home/hudson/hudson-slave/tools/Ant/ant-1.8.2/lib/ant-apache-bcel.jar:/home/hudson/hudson-slave/tools/Ant/ant-1.8.2/lib/ant-jai.jar:/home/hudson/hudson-slave/tools/Ant/ant-1.8.2/lib/ant-testutil.jar:/home/hudson/hudson-slave/tools/Ant/ant-1.8.2/lib/ant-apache-resolver.jar:/home/hudson/hudson-slave/tools/Ant/ant-1.8.2/lib/ant-jdepend.jar:/usr/local/openjdk6/lib/tools.jar:/home/hudson/.ivy2/cache/com.carrotsearch.randomizedtesting/junit4-ant/jars/junit4-ant-2.0.6.jar -ea:org.apache.lucene... -ea:org.apache.solr... com.carrotsearch.ant.tasks.junit4.slave.SlaveMainSafe -eventsfile /usr/home/hudson/hudson-slave/workspace/Lucene-Solr-NightlyTests-4.x/solr/build/solr-core/test/temp/junit4-J1-20121217_072414_829.events @/usr/home/hudson/hudson-slave/workspace/Lucene-Solr-NightlyTests-4.x/solr/build/solr-core/test/temp/junit4-J1-20121217_072414_829.suites
[junit4:junit4] ERROR: JVM J1 ended with an exception: Forked process returned with error code: 137 Very likely a JVM crash.  Process output piped in logs above.
[junit4:junit4] 	at com.carrotsearch.ant.tasks.junit4.JUnit4.executeSlave(JUnit4.java:1220)
[junit4:junit4] 	at com.carrotsearch.ant.tasks.junit4.JUnit4.access$000(JUnit4.java:66)
[junit4:junit4] 	at com.carrotsearch.ant.tasks.junit4.JUnit4$2.call(JUnit4.java:820)
[junit4:junit4] 	at com.carrotsearch.ant.tasks.junit4.JUnit4$2.call(JUnit4.java:817)
[junit4:junit4] 	at java.util.concurrent.FutureTask$Sync.innerRun(FutureTask.java:334)
[junit4:junit4] 	at java.util.concurrent.FutureTask.run(FutureTask.java:166)
[junit4:junit4] 	at java.util.concurrent.ThreadPoolExecutor.runWorker(ThreadPoolExecutor.java:1110)
[junit4:junit4] 	at java.util.concurrent.ThreadPoolExecutor$Worker.run(ThreadPoolExecutor.java:603)
[junit4:junit4] 	at java.lang.Thread.run(Thread.java:679)

BUILD FAILED
/usr/home/hudson/hudson-slave/workspace/Lucene-Solr-NightlyTests-4.x/build.xml:353: The following error occurred while executing this line:
/usr/home/hudson/hudson-slave/workspace/Lucene-Solr-NightlyTests-4.x/build.xml:39: The following error occurred while executing this line:
/usr/home/hudson/hudson-slave/workspace/Lucene-Solr-NightlyTests-4.x/solr/build.xml:178: The following error occurred while executing this line:
/usr/home/hudson/hudson-slave/workspace/Lucene-Solr-NightlyTests-4.x/solr/common-build.xml:438: The following error occurred while executing this line:
/usr/home/hudson/hudson-slave/workspace/Lucene-Solr-NightlyTests-4.x/lucene/common-build.xml:1175: The following error occurred while executing this line:
/usr/home/hudson/hudson-slave/workspace/Lucene-Solr-NightlyTests-4.x/lucene/common-build.xml:840: At least one slave process threw an exception, first: Forked process returned with error code: 137 Very likely a JVM crash.  Process output piped in logs above.

Total time: 521 minutes 9 seconds
Build step 'Invoke Ant' marked build as failure
Archiving artifacts
Recording test results
Email was triggered for: Failure
Sending email for trigger: Failure



Mime
View raw message