lucene-dev mailing list archives

Site index · List index
Message view « Date » · « Thread »
Top « Date » · « Thread »
From Apache Jenkins Server <jenk...@builds.apache.org>
Subject [JENKINS] Lucene-Solr-Tests-4.x-java7 - Build # 809 - Failure
Date Tue, 18 Dec 2012 23:07:27 GMT
Build: https://builds.apache.org/job/Lucene-Solr-Tests-4.x-java7/809/

1 tests failed.
REGRESSION:  org.apache.solr.cloud.SyncSliceTest.testDistribSearch

Error Message:


Stack Trace:
java.lang.AssertionError
	at __randomizedtesting.SeedInfo.seed([880D0194B5CCC042:9EB8F8CC293A07E]:0)
	at org.junit.Assert.fail(Assert.java:92)
	at org.junit.Assert.assertTrue(Assert.java:43)
	at org.junit.Assert.assertNotNull(Assert.java:526)
	at org.junit.Assert.assertNotNull(Assert.java:537)
	at org.apache.solr.cloud.SyncSliceTest.doTest(SyncSliceTest.java:211)
	at org.apache.solr.BaseDistributedSearchTestCase.testDistribSearch(BaseDistributedSearchTestCase.java:794)
	at sun.reflect.NativeMethodAccessorImpl.invoke0(Native Method)
	at sun.reflect.NativeMethodAccessorImpl.invoke(NativeMethodAccessorImpl.java:57)
	at sun.reflect.DelegatingMethodAccessorImpl.invoke(DelegatingMethodAccessorImpl.java:43)
	at java.lang.reflect.Method.invoke(Method.java:601)
	at com.carrotsearch.randomizedtesting.RandomizedRunner.invoke(RandomizedRunner.java:1559)
	at com.carrotsearch.randomizedtesting.RandomizedRunner.access$600(RandomizedRunner.java:79)
	at com.carrotsearch.randomizedtesting.RandomizedRunner$6.evaluate(RandomizedRunner.java:737)
	at com.carrotsearch.randomizedtesting.RandomizedRunner$7.evaluate(RandomizedRunner.java:773)
	at com.carrotsearch.randomizedtesting.RandomizedRunner$8.evaluate(RandomizedRunner.java:787)
	at com.carrotsearch.randomizedtesting.rules.SystemPropertiesRestoreRule$1.evaluate(SystemPropertiesRestoreRule.java:53)
	at org.apache.lucene.util.TestRuleSetupTeardownChained$1.evaluate(TestRuleSetupTeardownChained.java:50)
	at org.apache.lucene.util.TestRuleFieldCacheSanity$1.evaluate(TestRuleFieldCacheSanity.java:51)
	at org.apache.lucene.util.AbstractBeforeAfterRule$1.evaluate(AbstractBeforeAfterRule.java:46)
	at com.carrotsearch.randomizedtesting.rules.SystemPropertiesInvariantRule$1.evaluate(SystemPropertiesInvariantRule.java:55)
	at org.apache.lucene.util.TestRuleThreadAndTestName$1.evaluate(TestRuleThreadAndTestName.java:49)
	at org.apache.lucene.util.TestRuleIgnoreAfterMaxFailures$1.evaluate(TestRuleIgnoreAfterMaxFailures.java:70)
	at org.apache.lucene.util.TestRuleMarkFailure$1.evaluate(TestRuleMarkFailure.java:48)
	at com.carrotsearch.randomizedtesting.rules.StatementAdapter.evaluate(StatementAdapter.java:36)
	at com.carrotsearch.randomizedtesting.ThreadLeakControl$StatementRunner.run(ThreadLeakControl.java:358)
	at com.carrotsearch.randomizedtesting.ThreadLeakControl.forkTimeoutingTask(ThreadLeakControl.java:782)
	at com.carrotsearch.randomizedtesting.ThreadLeakControl$3.evaluate(ThreadLeakControl.java:442)
	at com.carrotsearch.randomizedtesting.RandomizedRunner.runSingleTest(RandomizedRunner.java:746)
	at com.carrotsearch.randomizedtesting.RandomizedRunner$3.evaluate(RandomizedRunner.java:648)
	at com.carrotsearch.randomizedtesting.RandomizedRunner$4.evaluate(RandomizedRunner.java:682)
	at com.carrotsearch.randomizedtesting.RandomizedRunner$5.evaluate(RandomizedRunner.java:693)
	at com.carrotsearch.randomizedtesting.rules.StatementAdapter.evaluate(StatementAdapter.java:36)
	at com.carrotsearch.randomizedtesting.rules.SystemPropertiesRestoreRule$1.evaluate(SystemPropertiesRestoreRule.java:53)
	at org.apache.lucene.util.AbstractBeforeAfterRule$1.evaluate(AbstractBeforeAfterRule.java:46)
	at org.apache.lucene.util.TestRuleStoreClassName$1.evaluate(TestRuleStoreClassName.java:42)
	at com.carrotsearch.randomizedtesting.rules.SystemPropertiesInvariantRule$1.evaluate(SystemPropertiesInvariantRule.java:55)
	at com.carrotsearch.randomizedtesting.rules.NoShadowingOrOverridesOnMethodsRule$1.evaluate(NoShadowingOrOverridesOnMethodsRule.java:39)
	at com.carrotsearch.randomizedtesting.rules.NoShadowingOrOverridesOnMethodsRule$1.evaluate(NoShadowingOrOverridesOnMethodsRule.java:39)
	at com.carrotsearch.randomizedtesting.rules.StatementAdapter.evaluate(StatementAdapter.java:36)
	at org.apache.lucene.util.TestRuleAssertionsRequired$1.evaluate(TestRuleAssertionsRequired.java:43)
	at org.apache.lucene.util.TestRuleMarkFailure$1.evaluate(TestRuleMarkFailure.java:48)
	at org.apache.lucene.util.TestRuleIgnoreAfterMaxFailures$1.evaluate(TestRuleIgnoreAfterMaxFailures.java:70)
	at org.apache.lucene.util.TestRuleIgnoreTestSuites$1.evaluate(TestRuleIgnoreTestSuites.java:55)
	at com.carrotsearch.randomizedtesting.rules.StatementAdapter.evaluate(StatementAdapter.java:36)
	at com.carrotsearch.randomizedtesting.ThreadLeakControl$StatementRunner.run(ThreadLeakControl.java:358)
	at java.lang.Thread.run(Thread.java:722)




Build Log:
[...truncated 9239 lines...]
[junit4:junit4] Suite: org.apache.solr.cloud.SyncSliceTest
[junit4:junit4]   2> 0 T2530 oas.BaseDistributedSearchTestCase.initHostContext Setting hostContext system property: /
[junit4:junit4]   2> 4 T2530 oas.SolrTestCaseJ4.setUp ###Starting testDistribSearch
[junit4:junit4]   2> Creating dataDir: /usr/home/hudson/hudson-slave/workspace/Lucene-Solr-Tests-4.x-java7/solr/build/solr-core/test/J0/./solrtest-SyncSliceTest-1355870822377
[junit4:junit4]   2> 5 T2530 oasc.ZkTestServer.run STARTING ZK TEST SERVER
[junit4:junit4]   2> 6 T2531 oasc.ZkTestServer$ZKServerMain.runFromConfig Starting server
[junit4:junit4]   2> 8 T2531 oazs.ZooKeeperServer.setTickTime tickTime set to 1000
[junit4:junit4]   2> 8 T2531 oazs.ZooKeeperServer.setMinSessionTimeout minSessionTimeout set to -1
[junit4:junit4]   2> 9 T2531 oazs.ZooKeeperServer.setMaxSessionTimeout maxSessionTimeout set to -1
[junit4:junit4]   2> 9 T2531 oazs.NIOServerCnxnFactory.configure binding to port 0.0.0.0/0.0.0.0:0
[junit4:junit4]   2> 10 T2531 oazsp.FileTxnSnapLog.save Snapshotting: 0x0 to /usr/home/hudson/hudson-slave/workspace/Lucene-Solr-Tests-4.x-java7/solr/build/solr-core/test/J0/./org.apache.solr.cloud.SyncSliceTest-1355870822377/zookeeper/server1/data/version-2/snapshot.0
[junit4:junit4]   2> 107 T2530 oasc.ZkTestServer.run start zk server on port:44952
[junit4:junit4]   2> 108 T2530 oaz.ZooKeeper.<init> Initiating client connection, connectString=127.0.0.1:44952 sessionTimeout=10000 watcher=org.apache.solr.common.cloud.ConnectionManager@79e01d55
[junit4:junit4]   2> 109 T2530 oascc.ConnectionManager.waitForConnected Waiting for client to connect to ZooKeeper
[junit4:junit4]   2> 109 T2536 oaz.ClientCnxn$SendThread.logStartConnect Opening socket connection to server localhost/127.0.0.1:44952. Will not attempt to authenticate using SASL (access denied ("javax.security.auth.AuthPermission" "getLoginConfiguration"))
[junit4:junit4]   2> 110 T2536 oaz.ClientCnxn$SendThread.primeConnection Socket connection established to localhost/127.0.0.1:44952, initiating session
[junit4:junit4]   2> 110 T2532 oazs.NIOServerCnxnFactory.run Accepted socket connection from /140.211.11.196:44953
[junit4:junit4]   2> 110 T2532 oazs.ZooKeeperServer.processConnectRequest Client attempting to establish new session at /140.211.11.196:44953
[junit4:junit4]   2> 111 T2534 oazsp.FileTxnLog.append Creating new log file: log.1
[junit4:junit4]   2> 113 T2534 oazs.ZooKeeperServer.finishSessionInit Established session 0x13bb032dfef0000 with negotiated timeout 10000 for client /140.211.11.196:44953
[junit4:junit4]   2> 113 T2536 oaz.ClientCnxn$SendThread.onConnected Session establishment complete on server localhost/127.0.0.1:44952, sessionid = 0x13bb032dfef0000, negotiated timeout = 10000
[junit4:junit4]   2> 113 T2537 oascc.ConnectionManager.process Watcher org.apache.solr.common.cloud.ConnectionManager@79e01d55 name:ZooKeeperConnection Watcher:127.0.0.1:44952 got event WatchedEvent state:SyncConnected type:None path:null path:null type:None
[junit4:junit4]   2> 114 T2530 oascc.ConnectionManager.waitForConnected Client is connected to ZooKeeper
[junit4:junit4]   2> 114 T2530 oascc.SolrZkClient.makePath makePath: /solr
[junit4:junit4]   2> 117 T2535 oazs.PrepRequestProcessor.pRequest2Txn Processed session termination for sessionid: 0x13bb032dfef0000
[junit4:junit4]   2> 131 T2537 oaz.ClientCnxn$EventThread.run EventThread shut down
[junit4:junit4]   2> 131 T2530 oaz.ZooKeeper.close Session: 0x13bb032dfef0000 closed
[junit4:junit4]   2> 131 T2532 oazs.NIOServerCnxn.closeSock Closed socket connection for client /140.211.11.196:44953 which had sessionid 0x13bb032dfef0000
[junit4:junit4]   2> 132 T2530 oaz.ZooKeeper.<init> Initiating client connection, connectString=127.0.0.1:44952/solr sessionTimeout=10000 watcher=org.apache.solr.common.cloud.ConnectionManager@904436a
[junit4:junit4]   2> 133 T2538 oaz.ClientCnxn$SendThread.logStartConnect Opening socket connection to server localhost/127.0.0.1:44952. Will not attempt to authenticate using SASL (access denied ("javax.security.auth.AuthPermission" "getLoginConfiguration"))
[junit4:junit4]   2> 133 T2530 oascc.ConnectionManager.waitForConnected Waiting for client to connect to ZooKeeper
[junit4:junit4]   2> 133 T2538 oaz.ClientCnxn$SendThread.primeConnection Socket connection established to localhost/127.0.0.1:44952, initiating session
[junit4:junit4]   2> 133 T2532 oazs.NIOServerCnxnFactory.run Accepted socket connection from /140.211.11.196:44954
[junit4:junit4]   2> 134 T2532 oazs.ZooKeeperServer.processConnectRequest Client attempting to establish new session at /140.211.11.196:44954
[junit4:junit4]   2> 138 T2534 oazs.ZooKeeperServer.finishSessionInit Established session 0x13bb032dfef0001 with negotiated timeout 10000 for client /140.211.11.196:44954
[junit4:junit4]   2> 138 T2538 oaz.ClientCnxn$SendThread.onConnected Session establishment complete on server localhost/127.0.0.1:44952, sessionid = 0x13bb032dfef0001, negotiated timeout = 10000
[junit4:junit4]   2> 138 T2539 oascc.ConnectionManager.process Watcher org.apache.solr.common.cloud.ConnectionManager@904436a name:ZooKeeperConnection Watcher:127.0.0.1:44952/solr got event WatchedEvent state:SyncConnected type:None path:null path:null type:None
[junit4:junit4]   2> 138 T2530 oascc.ConnectionManager.waitForConnected Client is connected to ZooKeeper
[junit4:junit4]   2> 139 T2530 oascc.SolrZkClient.makePath makePath: /collections/collection1
[junit4:junit4]   2> 153 T2530 oascc.SolrZkClient.makePath makePath: /collections/collection1/shards
[junit4:junit4]   2> 156 T2530 oascc.SolrZkClient.makePath makePath: /collections/control_collection
[junit4:junit4]   2> 159 T2530 oascc.SolrZkClient.makePath makePath: /collections/control_collection/shards
[junit4:junit4]   2> 167 T2530 oasc.AbstractZkTestCase.putConfig put /usr/home/hudson/hudson-slave/workspace/Lucene-Solr-Tests-4.x-java7/solr/build/solr-core/test-files/solr/collection1/conf/solrconfig.xml to /configs/conf1/solrconfig.xml
[junit4:junit4]   2> 168 T2530 oascc.SolrZkClient.makePath makePath: /configs/conf1/solrconfig.xml
[junit4:junit4]   2> 180 T2530 oasc.AbstractZkTestCase.putConfig put /usr/home/hudson/hudson-slave/workspace/Lucene-Solr-Tests-4.x-java7/solr/build/solr-core/test-files/solr/collection1/conf/schema.xml to /configs/conf1/schema.xml
[junit4:junit4]   2> 181 T2530 oascc.SolrZkClient.makePath makePath: /configs/conf1/schema.xml
[junit4:junit4]   2> 290 T2530 oasc.AbstractZkTestCase.putConfig put /usr/home/hudson/hudson-slave/workspace/Lucene-Solr-Tests-4.x-java7/solr/build/solr-core/test-files/solr/collection1/conf/stopwords.txt to /configs/conf1/stopwords.txt
[junit4:junit4]   2> 291 T2530 oascc.SolrZkClient.makePath makePath: /configs/conf1/stopwords.txt
[junit4:junit4]   2> 300 T2530 oasc.AbstractZkTestCase.putConfig put /usr/home/hudson/hudson-slave/workspace/Lucene-Solr-Tests-4.x-java7/solr/build/solr-core/test-files/solr/collection1/conf/protwords.txt to /configs/conf1/protwords.txt
[junit4:junit4]   2> 301 T2530 oascc.SolrZkClient.makePath makePath: /configs/conf1/protwords.txt
[junit4:junit4]   2> 304 T2530 oasc.AbstractZkTestCase.putConfig put /usr/home/hudson/hudson-slave/workspace/Lucene-Solr-Tests-4.x-java7/solr/build/solr-core/test-files/solr/collection1/conf/currency.xml to /configs/conf1/currency.xml
[junit4:junit4]   2> 305 T2530 oascc.SolrZkClient.makePath makePath: /configs/conf1/currency.xml
[junit4:junit4]   2> 337 T2530 oasc.AbstractZkTestCase.putConfig put /usr/home/hudson/hudson-slave/workspace/Lucene-Solr-Tests-4.x-java7/solr/build/solr-core/test-files/solr/collection1/conf/open-exchange-rates.json to /configs/conf1/open-exchange-rates.json
[junit4:junit4]   2> 338 T2530 oascc.SolrZkClient.makePath makePath: /configs/conf1/open-exchange-rates.json
[junit4:junit4]   2> 349 T2530 oasc.AbstractZkTestCase.putConfig put /usr/home/hudson/hudson-slave/workspace/Lucene-Solr-Tests-4.x-java7/solr/build/solr-core/test-files/solr/collection1/conf/mapping-ISOLatin1Accent.txt to /configs/conf1/mapping-ISOLatin1Accent.txt
[junit4:junit4]   2> 350 T2530 oascc.SolrZkClient.makePath makePath: /configs/conf1/mapping-ISOLatin1Accent.txt
[junit4:junit4]   2> 361 T2530 oasc.AbstractZkTestCase.putConfig put /usr/home/hudson/hudson-slave/workspace/Lucene-Solr-Tests-4.x-java7/solr/build/solr-core/test-files/solr/collection1/conf/old_synonyms.txt to /configs/conf1/old_synonyms.txt
[junit4:junit4]   2> 362 T2530 oascc.SolrZkClient.makePath makePath: /configs/conf1/old_synonyms.txt
[junit4:junit4]   2> 365 T2530 oasc.AbstractZkTestCase.putConfig put /usr/home/hudson/hudson-slave/workspace/Lucene-Solr-Tests-4.x-java7/solr/build/solr-core/test-files/solr/collection1/conf/synonyms.txt to /configs/conf1/synonyms.txt
[junit4:junit4]   2> 365 T2530 oascc.SolrZkClient.makePath makePath: /configs/conf1/synonyms.txt
[junit4:junit4]   2> 372 T2535 oazs.PrepRequestProcessor.pRequest2Txn Processed session termination for sessionid: 0x13bb032dfef0001
[junit4:junit4]   2> 402 T2539 oaz.ClientCnxn$EventThread.run EventThread shut down
[junit4:junit4]   2> 402 T2532 oazs.NIOServerCnxn.closeSock Closed socket connection for client /140.211.11.196:44954 which had sessionid 0x13bb032dfef0001
[junit4:junit4]   2> 402 T2530 oaz.ZooKeeper.close Session: 0x13bb032dfef0001 closed
[junit4:junit4]   2> 615 T2530 oejs.Server.doStart jetty-8.1.8.v20121106
[junit4:junit4]   2> 621 T2530 oejs.AbstractConnector.doStart Started SocketConnector@127.0.0.1:44955
[junit4:junit4]   2> 621 T2530 oasc.SolrResourceLoader.locateSolrHome JNDI not configured for solr (NoInitialContextEx)
[junit4:junit4]   2> 622 T2530 oasc.SolrResourceLoader.locateSolrHome using system property solr.solr.home: /usr/home/hudson/hudson-slave/workspace/Lucene-Solr-Tests-4.x-java7/solr/build/solr-core/test/J0/./org.apache.solr.cloud.SyncSliceTest-controljetty-1355870822775
[junit4:junit4]   2> 623 T2530 oasc.SolrResourceLoader.<init> new SolrResourceLoader for deduced Solr Home: '/usr/home/hudson/hudson-slave/workspace/Lucene-Solr-Tests-4.x-java7/solr/build/solr-core/test/J0/./org.apache.solr.cloud.SyncSliceTest-controljetty-1355870822775/'
[junit4:junit4]   2> 654 T2530 oass.SolrDispatchFilter.init SolrDispatchFilter.init()
[junit4:junit4]   2> 656 T2530 oasc.SolrResourceLoader.locateSolrHome JNDI not configured for solr (NoInitialContextEx)
[junit4:junit4]   2> 656 T2530 oasc.SolrResourceLoader.locateSolrHome using system property solr.solr.home: /usr/home/hudson/hudson-slave/workspace/Lucene-Solr-Tests-4.x-java7/solr/build/solr-core/test/J0/./org.apache.solr.cloud.SyncSliceTest-controljetty-1355870822775
[junit4:junit4]   2> 657 T2530 oasc.CoreContainer$Initializer.initialize looking for solr.xml: /usr/home/hudson/hudson-slave/workspace/Lucene-Solr-Tests-4.x-java7/solr/build/solr-core/test/J0/./org.apache.solr.cloud.SyncSliceTest-controljetty-1355870822775/solr.xml
[junit4:junit4]   2> 657 T2530 oasc.CoreContainer.<init> New CoreContainer 2061654785
[junit4:junit4]   2> 658 T2530 oasc.CoreContainer.load Loading CoreContainer using Solr Home: '/usr/home/hudson/hudson-slave/workspace/Lucene-Solr-Tests-4.x-java7/solr/build/solr-core/test/J0/./org.apache.solr.cloud.SyncSliceTest-controljetty-1355870822775/'
[junit4:junit4]   2> 658 T2530 oasc.SolrResourceLoader.<init> new SolrResourceLoader for directory: '/usr/home/hudson/hudson-slave/workspace/Lucene-Solr-Tests-4.x-java7/solr/build/solr-core/test/J0/./org.apache.solr.cloud.SyncSliceTest-controljetty-1355870822775/'
[junit4:junit4]   2> 680 T2530 oashc.HttpShardHandlerFactory.getParameter Setting socketTimeout to: 30000
[junit4:junit4]   2> 682 T2530 oashc.HttpShardHandlerFactory.getParameter Setting urlScheme to: http://
[junit4:junit4]   2> 682 T2530 oashc.HttpShardHandlerFactory.getParameter Setting connTimeout to: 15000
[junit4:junit4]   2> 683 T2530 oashc.HttpShardHandlerFactory.getParameter Setting maxConnectionsPerHost to: 20
[junit4:junit4]   2> 683 T2530 oashc.HttpShardHandlerFactory.getParameter Setting corePoolSize to: 0
[junit4:junit4]   2> 684 T2530 oashc.HttpShardHandlerFactory.getParameter Setting maximumPoolSize to: 2147483647
[junit4:junit4]   2> 684 T2530 oashc.HttpShardHandlerFactory.getParameter Setting maxThreadIdleTime to: 5
[junit4:junit4]   2> 685 T2530 oashc.HttpShardHandlerFactory.getParameter Setting sizeOfQueue to: -1
[junit4:junit4]   2> 686 T2530 oashc.HttpShardHandlerFactory.getParameter Setting fairnessPolicy to: false
[junit4:junit4]   2> 686 T2530 oascsi.HttpClientUtil.createClient Creating new http client, config:maxConnectionsPerHost=20&maxConnections=10000&socketTimeout=30000&connTimeout=15000&retry=false
[junit4:junit4]   2> 701 T2530 oasc.CoreContainer.load Registering Log Listener
[junit4:junit4]   2> 716 T2530 oasc.CoreContainer.initZooKeeper Zookeeper client=127.0.0.1:44952/solr
[junit4:junit4]   2> 718 T2530 oasc.ZkController.checkChrootPath zkHost includes chroot
[junit4:junit4]   2> 718 T2530 oaz.ZooKeeper.<init> Initiating client connection, connectString=127.0.0.1:44952 sessionTimeout=60000 watcher=org.apache.solr.common.cloud.ConnectionManager@3811782b
[junit4:junit4]   2> 725 T2530 oascc.ConnectionManager.waitForConnected Waiting for client to connect to ZooKeeper
[junit4:junit4]   2> 726 T2549 oaz.ClientCnxn$SendThread.logStartConnect Opening socket connection to server localhost/127.0.0.1:44952. Will not attempt to authenticate using SASL (access denied ("javax.security.auth.AuthPermission" "getLoginConfiguration"))
[junit4:junit4]   2> 727 T2532 oazs.NIOServerCnxnFactory.run Accepted socket connection from /140.211.11.196:44956
[junit4:junit4]   2> 741 T2549 oaz.ClientCnxn$SendThread.primeConnection Socket connection established to localhost/127.0.0.1:44952, initiating session
[junit4:junit4]   2> 741 T2532 oazs.ZooKeeperServer.processConnectRequest Client attempting to establish new session at /140.211.11.196:44956
[junit4:junit4]   2> 745 T2534 oazs.ZooKeeperServer.finishSessionInit Established session 0x13bb032dfef0002 with negotiated timeout 20000 for client /140.211.11.196:44956
[junit4:junit4]   2> 746 T2549 oaz.ClientCnxn$SendThread.onConnected Session establishment complete on server localhost/127.0.0.1:44952, sessionid = 0x13bb032dfef0002, negotiated timeout = 20000
[junit4:junit4]   2> 746 T2550 oascc.ConnectionManager.process Watcher org.apache.solr.common.cloud.ConnectionManager@3811782b name:ZooKeeperConnection Watcher:127.0.0.1:44952 got event WatchedEvent state:SyncConnected type:None path:null path:null type:None
[junit4:junit4]   2> 746 T2530 oascc.ConnectionManager.waitForConnected Client is connected to ZooKeeper
[junit4:junit4]   2> 748 T2535 oazs.PrepRequestProcessor.pRequest2Txn Processed session termination for sessionid: 0x13bb032dfef0002
[junit4:junit4]   2> 749 T2550 oaz.ClientCnxn$EventThread.run EventThread shut down
[junit4:junit4]   2> 749 T2532 oazs.NIOServerCnxn.closeSock Closed socket connection for client /140.211.11.196:44956 which had sessionid 0x13bb032dfef0002
[junit4:junit4]   2> 749 T2530 oaz.ZooKeeper.close Session: 0x13bb032dfef0002 closed
[junit4:junit4]   2> 749 T2530 oascsi.HttpClientUtil.createClient Creating new http client, config:maxConnections=500&maxConnectionsPerHost=16&socketTimeout=15000&connTimeout=30000
[junit4:junit4]   2> 757 T2530 oaz.ZooKeeper.<init> Initiating client connection, connectString=127.0.0.1:44952/solr sessionTimeout=30000 watcher=org.apache.solr.common.cloud.ConnectionManager@5015e6eb
[junit4:junit4]   2> 759 T2551 oaz.ClientCnxn$SendThread.logStartConnect Opening socket connection to server localhost/127.0.0.1:44952. Will not attempt to authenticate using SASL (access denied ("javax.security.auth.AuthPermission" "getLoginConfiguration"))
[junit4:junit4]   2> 759 T2530 oascc.ConnectionManager.waitForConnected Waiting for client to connect to ZooKeeper
[junit4:junit4]   2> 759 T2551 oaz.ClientCnxn$SendThread.primeConnection Socket connection established to localhost/127.0.0.1:44952, initiating session
[junit4:junit4]   2> 760 T2532 oazs.NIOServerCnxnFactory.run Accepted socket connection from /140.211.11.196:44957
[junit4:junit4]   2> 760 T2532 oazs.ZooKeeperServer.processConnectRequest Client attempting to establish new session at /140.211.11.196:44957
[junit4:junit4]   2> 761 T2534 oazs.ZooKeeperServer.finishSessionInit Established session 0x13bb032dfef0003 with negotiated timeout 20000 for client /140.211.11.196:44957
[junit4:junit4]   2> 761 T2551 oaz.ClientCnxn$SendThread.onConnected Session establishment complete on server localhost/127.0.0.1:44952, sessionid = 0x13bb032dfef0003, negotiated timeout = 20000
[junit4:junit4]   2> 761 T2552 oascc.ConnectionManager.process Watcher org.apache.solr.common.cloud.ConnectionManager@5015e6eb name:ZooKeeperConnection Watcher:127.0.0.1:44952/solr got event WatchedEvent state:SyncConnected type:None path:null path:null type:None
[junit4:junit4]   2> 762 T2530 oascc.ConnectionManager.waitForConnected Client is connected to ZooKeeper
[junit4:junit4]   2> 764 T2535 oazs.PrepRequestProcessor.pRequest Got user-level KeeperException when processing sessionid:0x13bb032dfef0003 type:create cxid:0x2 zxid:0x1a txntype:-1 reqpath:n/a Error Path:/solr/overseer Error:KeeperErrorCode = NodeExists for /solr/overseer
[junit4:junit4]   2> 772 T2530 oascc.SolrZkClient.makePath makePath: /live_nodes
[junit4:junit4]   2> 774 T2530 oasc.ZkController.createEphemeralLiveNode Register node as live in ZooKeeper:/live_nodes/127.0.0.1:44955_
[junit4:junit4]   2> 774 T2535 oazs.PrepRequestProcessor.pRequest Got user-level KeeperException when processing sessionid:0x13bb032dfef0003 type:delete cxid:0x7 zxid:0x1c txntype:-1 reqpath:n/a Error Path:/solr/live_nodes/127.0.0.1:44955_ Error:KeeperErrorCode = NoNode for /solr/live_nodes/127.0.0.1:44955_
[junit4:junit4]   2> 776 T2530 oascc.SolrZkClient.makePath makePath: /live_nodes/127.0.0.1:44955_
[junit4:junit4]   2> 778 T2530 oascc.SolrZkClient.makePath makePath: /overseer_elect/election
[junit4:junit4]   2> 801 T2535 oazs.PrepRequestProcessor.pRequest Got user-level KeeperException when processing sessionid:0x13bb032dfef0003 type:delete cxid:0x15 zxid:0x21 txntype:-1 reqpath:n/a Error Path:/solr/overseer_elect/leader Error:KeeperErrorCode = NoNode for /solr/overseer_elect/leader
[junit4:junit4]   2> 804 T2530 oascc.SolrZkClient.makePath makePath: /overseer_elect/leader
[junit4:junit4]   2> 817 T2530 oasc.Overseer.start Overseer (id=88858350215692291-127.0.0.1:44955_-n_0000000000) starting
[junit4:junit4]   2> 818 T2535 oazs.PrepRequestProcessor.pRequest Got user-level KeeperException when processing sessionid:0x13bb032dfef0003 type:create cxid:0x1a zxid:0x23 txntype:-1 reqpath:n/a Error Path:/solr/overseer Error:KeeperErrorCode = NodeExists for /solr/overseer
[junit4:junit4]   2> 819 T2535 oazs.PrepRequestProcessor.pRequest Got user-level KeeperException when processing sessionid:0x13bb032dfef0003 type:create cxid:0x1b zxid:0x24 txntype:-1 reqpath:n/a Error Path:/solr/overseer Error:KeeperErrorCode = NodeExists for /solr/overseer
[junit4:junit4]   2> 826 T2535 oazs.PrepRequestProcessor.pRequest Got user-level KeeperException when processing sessionid:0x13bb032dfef0003 type:create cxid:0x1c zxid:0x25 txntype:-1 reqpath:n/a Error Path:/solr/overseer Error:KeeperErrorCode = NodeExists for /solr/overseer
[junit4:junit4]   2> 828 T2535 oazs.PrepRequestProcessor.pRequest Got user-level KeeperException when processing sessionid:0x13bb032dfef0003 type:create cxid:0x1d zxid:0x26 txntype:-1 reqpath:n/a Error Path:/solr/overseer Error:KeeperErrorCode = NodeExists for /solr/overseer
[junit4:junit4]   2> 830 T2530 oascc.SolrZkClient.makePath makePath: /clusterstate.json
[junit4:junit4]   2> 833 T2530 oascc.ZkStateReader.createClusterStateWatchersAndUpdate Updating cluster state from ZooKeeper... 
[junit4:junit4]   2> 841 T2555 oasc.CoreContainer.create Creating SolrCore 'collection1' using instanceDir: /usr/home/hudson/hudson-slave/workspace/Lucene-Solr-Tests-4.x-java7/solr/build/solr-core/test/J0/./org.apache.solr.cloud.SyncSliceTest-controljetty-1355870822775/collection1
[junit4:junit4]   2> 841 T2554 oasc.OverseerCollectionProcessor.run Process current queue of collection messages
[junit4:junit4]   2> 841 T2555 oasc.ZkController.createCollectionZkNode Check for collection zkNode:control_collection
[junit4:junit4]   2> 842 T2553 oasc.Overseer$ClusterStateUpdater.run Starting to work on the main queue
[junit4:junit4]   2> 842 T2555 oasc.ZkController.createCollectionZkNode Collection zkNode exists
[junit4:junit4]   2> 843 T2555 oasc.ZkController.readConfigName Load collection config from:/collections/control_collection
[junit4:junit4]   2> 845 T2555 oasc.SolrResourceLoader.<init> new SolrResourceLoader for directory: '/usr/home/hudson/hudson-slave/workspace/Lucene-Solr-Tests-4.x-java7/solr/build/solr-core/test/J0/./org.apache.solr.cloud.SyncSliceTest-controljetty-1355870822775/collection1/'
[junit4:junit4]   2> 853 T2555 oasc.SolrResourceLoader.replaceClassLoader Adding 'file:/usr/home/hudson/hudson-slave/workspace/Lucene-Solr-Tests-4.x-java7/solr/build/solr-core/test/J0/org.apache.solr.cloud.SyncSliceTest-controljetty-1355870822775/collection1/lib/classes/' to classloader
[junit4:junit4]   2> 853 T2555 oasc.SolrResourceLoader.replaceClassLoader Adding 'file:/usr/home/hudson/hudson-slave/workspace/Lucene-Solr-Tests-4.x-java7/solr/build/solr-core/test/J0/org.apache.solr.cloud.SyncSliceTest-controljetty-1355870822775/collection1/lib/README' to classloader
[junit4:junit4]   2> 906 T2555 oasc.SolrConfig.<init> Using Lucene MatchVersion: LUCENE_41
[junit4:junit4]   2> 965 T2555 oasc.SolrConfig.<init> Loaded SolrConfig: solrconfig.xml
[junit4:junit4]   2> 1066 T2555 oass.IndexSchema.readSchema Reading Solr Schema
[junit4:junit4]   2> 1072 T2555 oass.IndexSchema.readSchema Schema name=test
[junit4:junit4]   2> 1757 T2555 oass.OpenExchangeRatesOrgProvider.init Initialized with rates=open-exchange-rates.json, refreshInterval=1440.
[junit4:junit4]   2> 1768 T2555 oass.IndexSchema.readSchema default search field in schema is text
[junit4:junit4]   2> 1773 T2555 oass.IndexSchema.readSchema unique key field: id
[junit4:junit4]   2> 1788 T2555 oass.FileExchangeRateProvider.reload Reloading exchange rates from file currency.xml
[junit4:junit4]   2> 1794 T2555 oass.FileExchangeRateProvider.reload Reloading exchange rates from file currency.xml
[junit4:junit4]   2> 1799 T2555 oass.OpenExchangeRatesOrgProvider.reload Reloading exchange rates from open-exchange-rates.json
[junit4:junit4]   2> 1800 T2555 oass.OpenExchangeRatesOrgProvider.reload Reloading exchange rates from open-exchange-rates.json
[junit4:junit4]   2> 1802 T2555 oasc.SolrCore.<init> [collection1] Opening new SolrCore at /usr/home/hudson/hudson-slave/workspace/Lucene-Solr-Tests-4.x-java7/solr/build/solr-core/test/J0/./org.apache.solr.cloud.SyncSliceTest-controljetty-1355870822775/collection1/, dataDir=./org.apache.solr.cloud.SyncSliceTest-1355870822377/control/data/
[junit4:junit4]   2> 1802 T2555 oasc.JmxMonitoredMap.<init> JMX monitoring is enabled. Adding Solr mbeans to JMX Server: com.sun.jmx.mbeanserver.JmxMBeanServer@4582c6dc
[junit4:junit4]   2> 1803 T2555 oasc.SolrCore.initDirectoryFactory solr.NRTCachingDirectoryFactory
[junit4:junit4]   2> 1804 T2555 oasc.CachingDirectoryFactory.get return new directory for /usr/home/hudson/hudson-slave/workspace/Lucene-Solr-Tests-4.x-java7/solr/build/solr-core/test/J0/./org.apache.solr.cloud.SyncSliceTest-1355870822377/control/data forceNew:false
[junit4:junit4]   2> 1805 T2555 oasc.CachingDirectoryFactory.close Releasing directory:/usr/home/hudson/hudson-slave/workspace/Lucene-Solr-Tests-4.x-java7/solr/build/solr-core/test/J0/./org.apache.solr.cloud.SyncSliceTest-1355870822377/control/data
[junit4:junit4]   2> 1805 T2555 oasc.SolrCore.getNewIndexDir New index directory detected: old=null new=./org.apache.solr.cloud.SyncSliceTest-1355870822377/control/data/index/
[junit4:junit4]   2> 1806 T2555 oasc.SolrCore.initIndex WARNING [collection1] Solr index directory './org.apache.solr.cloud.SyncSliceTest-1355870822377/control/data/index' doesn't exist. Creating new index...
[junit4:junit4]   2> 1807 T2555 oasc.CachingDirectoryFactory.get return new directory for /usr/home/hudson/hudson-slave/workspace/Lucene-Solr-Tests-4.x-java7/solr/build/solr-core/test/J0/./org.apache.solr.cloud.SyncSliceTest-1355870822377/control/data/index forceNew:false
[junit4:junit4]   2> 1814 T2555 oasc.SolrDeletionPolicy.onCommit SolrDeletionPolicy.onCommit: commits:num=1
[junit4:junit4]   2> 		commit{dir=RateLimitedDirectoryWrapper(NRTCachingDirectory(org.apache.lucene.store.NIOFSDirectory@/usr/home/hudson/hudson-slave/workspace/Lucene-Solr-Tests-4.x-java7/solr/build/solr-core/test/J0/org.apache.solr.cloud.SyncSliceTest-1355870822377/control/data/index lockFactory=org.apache.lucene.store.NativeFSLockFactory@de2d2a8; maxCacheMB=48.0 maxMergeSizeMB=4.0)),segFN=segments_1,generation=1,filenames=[segments_1]
[junit4:junit4]   2> 1815 T2555 oasc.SolrDeletionPolicy.updateCommits newest commit = 1[segments_1]
[junit4:junit4]   2> 1816 T2555 oasc.CachingDirectoryFactory.close Releasing directory:/usr/home/hudson/hudson-slave/workspace/Lucene-Solr-Tests-4.x-java7/solr/build/solr-core/test/J0/./org.apache.solr.cloud.SyncSliceTest-1355870822377/control/data/index
[junit4:junit4]   2> 1816 T2555 oasc.SolrCore.initWriters created xml: solr.XMLResponseWriter
[junit4:junit4]   2> 1818 T2555 oasup.UpdateRequestProcessorChain.init inserting DistributedUpdateProcessorFactory into updateRequestProcessorChain "dedupe"
[junit4:junit4]   2> 1819 T2555 oasup.UpdateRequestProcessorChain.init inserting DistributedUpdateProcessorFactory into updateRequestProcessorChain "dedupe-allfields"
[junit4:junit4]   2> 1819 T2555 oasup.UpdateRequestProcessorChain.init inserting DistributedUpdateProcessorFactory into updateRequestProcessorChain "stored_sig"
[junit4:junit4]   2> 1820 T2555 oasup.UpdateRequestProcessorChain.init inserting DistributedUpdateProcessorFactory into updateRequestProcessorChain "uniq-fields"
[junit4:junit4]   2> 1820 T2555 oasup.UpdateRequestProcessorChain.init inserting DistributedUpdateProcessorFactory into updateRequestProcessorChain "distrib-dup-test-chain-implicit"
[junit4:junit4]   2> 1821 T2555 oasc.RequestHandlers.initHandlersFromConfig adding lazy requestHandler: solr.ReplicationHandler
[junit4:junit4]   2> 1821 T2555 oasc.RequestHandlers.initHandlersFromConfig created /replication: solr.ReplicationHandler
[junit4:junit4]   2> 1822 T2555 oasc.RequestHandlers.initHandlersFromConfig created standard: solr.StandardRequestHandler
[junit4:junit4]   2> 1823 T2555 oasc.RequestHandlers.initHandlersFromConfig created /get: solr.RealTimeGetHandler
[junit4:junit4]   2> 1824 T2555 oasc.RequestHandlers.initHandlersFromConfig created dismax: solr.SearchHandler
[junit4:junit4]   2> 1825 T2555 oasc.RequestHandlers.initHandlersFromConfig created mock: org.apache.solr.core.MockQuerySenderListenerReqHandler
[junit4:junit4]   2> 1826 T2555 oasc.RequestHandlers.initHandlersFromConfig created /admin/: org.apache.solr.handler.admin.AdminHandlers
[junit4:junit4]   2> 1827 T2555 oasc.RequestHandlers.initHandlersFromConfig created defaults: solr.StandardRequestHandler
[junit4:junit4]   2> 1827 T2555 oasc.RequestHandlers.initHandlersFromConfig adding lazy requestHandler: solr.StandardRequestHandler
[junit4:junit4]   2> 1827 T2555 oasc.RequestHandlers.initHandlersFromConfig created lazy: solr.StandardRequestHandler
[junit4:junit4]   2> 1828 T2555 oasc.RequestHandlers.initHandlersFromConfig created /update: solr.UpdateRequestHandler
[junit4:junit4]   2> 1829 T2555 oasc.RequestHandlers.initHandlersFromConfig created /terms: org.apache.solr.handler.component.SearchHandler
[junit4:junit4]   2> 1830 T2555 oasc.RequestHandlers.initHandlersFromConfig created spellCheckCompRH: org.apache.solr.handler.component.SearchHandler
[junit4:junit4]   2> 1831 T2555 oasc.RequestHandlers.initHandlersFromConfig created spellCheckCompRH_Direct: org.apache.solr.handler.component.SearchHandler
[junit4:junit4]   2> 1832 T2555 oasc.RequestHandlers.initHandlersFromConfig created spellCheckWithWordbreak: org.apache.solr.handler.component.SearchHandler
[junit4:junit4]   2> 1833 T2555 oasc.RequestHandlers.initHandlersFromConfig created spellCheckWithWordbreak_Direct: org.apache.solr.handler.component.SearchHandler
[junit4:junit4]   2> 1834 T2555 oasc.RequestHandlers.initHandlersFromConfig created spellCheckCompRH1: org.apache.solr.handler.component.SearchHandler
[junit4:junit4]   2> 1835 T2555 oasc.RequestHandlers.initHandlersFromConfig created mltrh: org.apache.solr.handler.component.SearchHandler
[junit4:junit4]   2> 1836 T2555 oasc.RequestHandlers.initHandlersFromConfig created tvrh: org.apache.solr.handler.component.SearchHandler
[junit4:junit4]   2> 1837 T2555 oasc.RequestHandlers.initHandlersFromConfig created /mlt: solr.MoreLikeThisHandler
[junit4:junit4]   2> 1838 T2555 oasc.RequestHandlers.initHandlersFromConfig created /debug/dump: solr.DumpRequestHandler
[junit4:junit4]   2> 1851 T2555 oashl.XMLLoader.init xsltCacheLifetimeSeconds=60
[junit4:junit4]   2> 1856 T2555 oasc.SolrCore.initDeprecatedSupport WARNING solrconfig.xml uses deprecated <admin/gettableFiles>, Please update your config to use the ShowFileRequestHandler.
[junit4:junit4]   2> 1857 T2555 oasc.SolrCore.initDeprecatedSupport WARNING adding ShowFileRequestHandler with hidden files: [SCHEMA.XML, OLD_SYNONYMS.TXT, STOPWORDS.TXT, PROTWORDS.TXT, OPEN-EXCHANGE-RATES.JSON, SYNONYMS.TXT, CURRENCY.XML, MAPPING-ISOLATIN1ACCENT.TXT]
[junit4:junit4]   2> 1860 T2555 oasc.CachingDirectoryFactory.close Releasing directory:/usr/home/hudson/hudson-slave/workspace/Lucene-Solr-Tests-4.x-java7/solr/build/solr-core/test/J0/./org.apache.solr.cloud.SyncSliceTest-1355870822377/control/data
[junit4:junit4]   2> 1862 T2555 oass.SolrIndexSearcher.<init> Opening Searcher@6e839f74 main
[junit4:junit4]   2> 1863 T2555 oasu.CommitTracker.<init> Hard AutoCommit: disabled
[junit4:junit4]   2> 1864 T2555 oasu.CommitTracker.<init> Soft AutoCommit: disabled
[junit4:junit4]   2> 1864 T2555 oashc.SpellCheckComponent.inform Initializing spell checkers
[junit4:junit4]   2> 1872 T2555 oass.DirectSolrSpellChecker.init init: {name=direct,classname=DirectSolrSpellChecker,field=lowerfilt,minQueryLength=3}
[junit4:junit4]   2> 1928 T2556 oasc.SolrCore.registerSearcher [collection1] Registered new searcher Searcher@6e839f74 main{StandardDirectoryReader(segments_1:1)}
[junit4:junit4]   2> 1932 T2555 oasc.ZkController.publish publishing core=collection1 state=down
[junit4:junit4]   2> 1932 T2555 oasc.ZkController.publish numShards not found on descriptor - reading it from system property
[junit4:junit4]   2> 1933 T2535 oazs.PrepRequestProcessor.pRequest Got user-level KeeperException when processing sessionid:0x13bb032dfef0003 type:create cxid:0x56 zxid:0x29 txntype:-1 reqpath:n/a Error Path:/solr/overseer/queue Error:KeeperErrorCode = NoNode for /solr/overseer/queue
[junit4:junit4]   2> 2350 T2553 oascc.ZkStateReader.updateClusterState Updating cloud state from ZooKeeper... 
[junit4:junit4]   2> 2351 T2553 oasc.Overseer$ClusterStateUpdater.updateState Update state numShards=1 message={
[junit4:junit4]   2> 	  "operation":"state",
[junit4:junit4]   2> 	  "numShards":"1",
[junit4:junit4]   2> 	  "shard":null,
[junit4:junit4]   2> 	  "roles":null,
[junit4:junit4]   2> 	  "state":"down",
[junit4:junit4]   2> 	  "core":"collection1",
[junit4:junit4]   2> 	  "collection":"control_collection",
[junit4:junit4]   2> 	  "node_name":"127.0.0.1:44955_",
[junit4:junit4]   2> 	  "base_url":"http://127.0.0.1:44955"}
[junit4:junit4]   2> 2351 T2553 oasc.Overseer$ClusterStateUpdater.createCollection Create collection control_collection with numShards 1
[junit4:junit4]   2> 2352 T2553 oasc.Overseer$ClusterStateUpdater.updateState Assigning new node to shard shard=shard1
[junit4:junit4]   2> 2352 T2535 oazs.PrepRequestProcessor.pRequest Got user-level KeeperException when processing sessionid:0x13bb032dfef0003 type:create cxid:0x5e zxid:0x2c txntype:-1 reqpath:n/a Error Path:/solr/overseer/queue-work Error:KeeperErrorCode = NoNode for /solr/overseer/queue-work
[junit4:junit4]   2> 2369 T2552 oascc.ZkStateReader$2.process A cluster state change: WatchedEvent state:SyncConnected type:NodeDataChanged path:/clusterstate.json, has occurred - updating... (live nodes size: 1)
[junit4:junit4]   2> 2437 T2555 oasc.CoreContainer.registerCore registering core: collection1
[junit4:junit4]   2> 2437 T2555 oasc.ZkController.register Register replica - core:collection1 address:http://127.0.0.1:44955 collection:control_collection shard:shard1
[junit4:junit4]   2> 2438 T2555 oascc.SolrZkClient.makePath makePath: /collections/control_collection/leader_elect/shard1/election
[junit4:junit4]   2> 2454 T2535 oazs.PrepRequestProcessor.pRequest Got user-level KeeperException when processing sessionid:0x13bb032dfef0003 type:delete cxid:0x78 zxid:0x36 txntype:-1 reqpath:n/a Error Path:/solr/collections/control_collection/leaders Error:KeeperErrorCode = NoNode for /solr/collections/control_collection/leaders
[junit4:junit4]   2> 2455 T2555 oasc.ShardLeaderElectionContext.runLeaderProcess Running the leader process.
[junit4:junit4]   2> 2456 T2535 oazs.PrepRequestProcessor.pRequest Got user-level KeeperException when processing sessionid:0x13bb032dfef0003 type:create cxid:0x79 zxid:0x37 txntype:-1 reqpath:n/a Error Path:/solr/overseer Error:KeeperErrorCode = NodeExists for /solr/overseer
[junit4:junit4]   2> 2458 T2555 oasc.ShardLeaderElectionContext.waitForReplicasToComeUp Enough replicas found to continue.
[junit4:junit4]   2> 2458 T2555 oasc.ShardLeaderElectionContext.runLeaderProcess I may be the new leader - try and sync
[junit4:junit4]   2> 2458 T2555 oasc.SyncStrategy.sync Sync replicas to http://127.0.0.1:44955/collection1/
[junit4:junit4]   2> 2458 T2555 oasc.SyncStrategy.syncReplicas Sync Success - now sync replicas to me
[junit4:junit4]   2> 2459 T2555 oasc.SyncStrategy.syncToMe http://127.0.0.1:44955/collection1/ has no replicas
[junit4:junit4]   2> 2459 T2555 oasc.ShardLeaderElectionContext.runLeaderProcess I am the new leader: http://127.0.0.1:44955/collection1/
[junit4:junit4]   2> 2459 T2555 oascc.SolrZkClient.makePath makePath: /collections/control_collection/leaders/shard1
[junit4:junit4]   2> 2463 T2535 oazs.PrepRequestProcessor.pRequest Got user-level KeeperException when processing sessionid:0x13bb032dfef0003 type:create cxid:0x83 zxid:0x3b txntype:-1 reqpath:n/a Error Path:/solr/overseer Error:KeeperErrorCode = NodeExists for /solr/overseer
[junit4:junit4]   2> 2873 T2553 oascc.ZkStateReader.updateClusterState Updating cloud state from ZooKeeper... 
[junit4:junit4]   2> 2975 T2552 oascc.ZkStateReader$2.process A cluster state change: WatchedEvent state:SyncConnected type:NodeDataChanged path:/clusterstate.json, has occurred - updating... (live nodes size: 1)
[junit4:junit4]   2> 3026 T2555 oasc.ZkController.register We are http://127.0.0.1:44955/collection1/ and leader is http://127.0.0.1:44955/collection1/
[junit4:junit4]   2> 3026 T2555 oasc.ZkController.register No LogReplay needed for core=collection1 baseURL=http://127.0.0.1:44955
[junit4:junit4]   2> 3026 T2555 oasc.ZkController.checkRecovery I am the leader, no recovery necessary
[junit4:junit4]   2> 3027 T2555 oasc.ZkController.publish publishing core=collection1 state=active
[junit4:junit4]   2> 3027 T2555 oasc.ZkController.publish numShards not found on descriptor - reading it from system property
[junit4:junit4]   2> 3062 T2555 oascc.ZkStateReader.updateClusterState Updating cloud state from ZooKeeper... 
[junit4:junit4]   2> 3063 T2530 oass.SolrDispatchFilter.init user.dir=/usr/home/hudson/hudson-slave/workspace/Lucene-Solr-Tests-4.x-java7/solr/build/solr-core/test/J0
[junit4:junit4]   2> 3064 T2530 oass.SolrDispatchFilter.init SolrDispatchFilter.init() done
[junit4:junit4]   2> 3065 T2530 oascsi.HttpClientUtil.createClient Creating new http client, config:maxConnections=128&maxConnectionsPerHost=32&followRedirects=false
[junit4:junit4]   2> 3074 T2530 oascsi.HttpClientUtil.createClient Creating new http client, config:
[junit4:junit4]   2> 3080 T2530 oaz.ZooKeeper.<init> Initiating client connection, connectString=127.0.0.1:44952/solr sessionTimeout=10000 watcher=org.apache.solr.common.cloud.ConnectionManager@1635ad94
[junit4:junit4]   2> 3081 T2530 oascc.ConnectionManager.waitForConnected Waiting for client to connect to ZooKeeper
[junit4:junit4]   2> 3082 T2557 oaz.ClientCnxn$SendThread.logStartConnect Opening socket connection to server localhost/127.0.0.1:44952. Will not attempt to authenticate using SASL (access denied ("javax.security.auth.AuthPermission" "getLoginConfiguration"))
[junit4:junit4]   2> 3082 T2557 oaz.ClientCnxn$SendThread.primeConnection Socket connection established to localhost/127.0.0.1:44952, initiating session
[junit4:junit4]   2> 3083 T2532 oazs.NIOServerCnxnFactory.run Accepted socket connection from /140.211.11.196:44958
[junit4:junit4]   2> 3083 T2532 oazs.ZooKeeperServer.processConnectRequest Client attempting to establish new session at /140.211.11.196:44958
[junit4:junit4]   2> 3119 T2534 oazs.ZooKeeperServer.finishSessionInit Established session 0x13bb032dfef0004 with negotiated timeout 10000 for client /140.211.11.196:44958
[junit4:junit4]   2> 3119 T2557 oaz.ClientCnxn$SendThread.onConnected Session establishment complete on server localhost/127.0.0.1:44952, sessionid = 0x13bb032dfef0004, negotiated timeout = 10000
[junit4:junit4]   2> 3120 T2558 oascc.ConnectionManager.process Watcher org.apache.solr.common.cloud.ConnectionManager@1635ad94 name:ZooKeeperConnection Watcher:127.0.0.1:44952/solr got event WatchedEvent state:SyncConnected type:None path:null path:null type:None
[junit4:junit4]   2> 3120 T2530 oascc.ConnectionManager.waitForConnected Client is connected to ZooKeeper
[junit4:junit4]   2> 3121 T2530 oascc.ZkStateReader.createClusterStateWatchersAndUpdate Updating cluster state from ZooKeeper... 
[junit4:junit4]   2> 3123 T2530 oasc.ChaosMonkey.monkeyLog monkey: init - expire sessions:true cause connection loss:true
[junit4:junit4]   2> 3233 T2530 oejs.Server.doStart jetty-8.1.8.v20121106
[junit4:junit4]   2> 3236 T2530 oejs.AbstractConnector.doStart Started SocketConnector@127.0.0.1:44959
[junit4:junit4]   2> 3237 T2530 oasc.SolrResourceLoader.locateSolrHome JNDI not configured for solr (NoInitialContextEx)
[junit4:junit4]   2> 3238 T2530 oasc.SolrResourceLoader.locateSolrHome using system property solr.solr.home: /usr/home/hudson/hudson-slave/workspace/Lucene-Solr-Tests-4.x-java7/solr/build/solr-core/test/J0/./org.apache.solr.cloud.SyncSliceTest-jetty1-1355870825495
[junit4:junit4]   2> 3238 T2530 oasc.SolrResourceLoader.<init> new SolrResourceLoader for deduced Solr Home: '/usr/home/hudson/hudson-slave/workspace/Lucene-Solr-Tests-4.x-java7/solr/build/solr-core/test/J0/./org.apache.solr.cloud.SyncSliceTest-jetty1-1355870825495/'
[junit4:junit4]   2> 3266 T2530 oass.SolrDispatchFilter.init SolrDispatchFilter.init()
[junit4:junit4]   2> 3267 T2530 oasc.SolrResourceLoader.locateSolrHome JNDI not configured for solr (NoInitialContextEx)
[junit4:junit4]   2> 3268 T2530 oasc.SolrResourceLoader.locateSolrHome using system property solr.solr.home: /usr/home/hudson/hudson-slave/workspace/Lucene-Solr-Tests-4.x-java7/solr/build/solr-core/test/J0/./org.apache.solr.cloud.SyncSliceTest-jetty1-1355870825495
[junit4:junit4]   2> 3268 T2530 oasc.CoreContainer$Initializer.initialize looking for solr.xml: /usr/home/hudson/hudson-slave/workspace/Lucene-Solr-Tests-4.x-java7/solr/build/solr-core/test/J0/./org.apache.solr.cloud.SyncSliceTest-jetty1-1355870825495/solr.xml
[junit4:junit4]   2> 3269 T2530 oasc.CoreContainer.<init> New CoreContainer 228569965
[junit4:junit4]   2> 3270 T2530 oasc.CoreContainer.load Loading CoreContainer using Solr Home: '/usr/home/hudson/hudson-slave/workspace/Lucene-Solr-Tests-4.x-java7/solr/build/solr-core/test/J0/./org.apache.solr.cloud.SyncSliceTest-jetty1-1355870825495/'
[junit4:junit4]   2> 3270 T2530 oasc.SolrResourceLoader.<init> new SolrResourceLoader for directory: '/usr/home/hudson/hudson-slave/workspace/Lucene-Solr-Tests-4.x-java7/solr/build/solr-core/test/J0/./org.apache.solr.cloud.SyncSliceTest-jetty1-1355870825495/'
[junit4:junit4]   2> 3290 T2530 oashc.HttpShardHandlerFactory.getParameter Setting socketTimeout to: 30000
[junit4:junit4]   2> 3291 T2530 oashc.HttpShardHandlerFactory.getParameter Setting urlScheme to: http://
[junit4:junit4]   2> 3292 T2530 oashc.HttpShardHandlerFactory.getParameter Setting connTimeout to: 15000
[junit4:junit4]   2> 3293 T2530 oashc.HttpShardHandlerFactory.getParameter Setting maxConnectionsPerHost to: 20
[junit4:junit4]   2> 3293 T2530 oashc.HttpShardHandlerFactory.getParameter Setting corePoolSize to: 0
[junit4:junit4]   2> 3294 T2530 oashc.HttpShardHandlerFactory.getParameter Setting maximumPoolSize to: 2147483647
[junit4:junit4]   2> 3294 T2530 oashc.HttpShardHandlerFactory.getParameter Setting maxThreadIdleTime to: 5
[junit4:junit4]   2> 3295 T2530 oashc.HttpShardHandlerFactory.getParameter Setting sizeOfQueue to: -1
[junit4:junit4]   2> 3295 T2530 oashc.HttpShardHandlerFactory.getParameter Setting fairnessPolicy to: false
[junit4:junit4]   2> 3296 T2530 oascsi.HttpClientUtil.createClient Creating new http client, config:maxConnectionsPerHost=20&maxConnections=10000&socketTimeout=30000&connTimeout=15000&retry=false
[junit4:junit4]   2> 3309 T2530 oasc.CoreContainer.load Registering Log Listener
[junit4:junit4]   2> 3323 T2530 oasc.CoreContainer.initZooKeeper Zookeeper client=127.0.0.1:44952/solr
[junit4:junit4]   2> 3325 T2530 oasc.ZkController.checkChrootPath zkHost includes chroot
[junit4:junit4]   2> 3325 T2530 oaz.ZooKeeper.<init> Initiating client connection, connectString=127.0.0.1:44952 sessionTimeout=60000 watcher=org.apache.solr.common.cloud.ConnectionManager@13907093
[junit4:junit4]   2> 3326 T2530 oascc.ConnectionManager.waitForConnected Waiting for client to connect to ZooKeeper
[junit4:junit4]   2> 3327 T2568 oaz.ClientCnxn$SendThread.logStartConnect Opening socket connection to server localhost/127.0.0.1:44952. Will not attempt to authenticate using SASL (access denied ("javax.security.auth.AuthPermission" "getLoginConfiguration"))
[junit4:junit4]   2> 3328 T2568 oaz.ClientCnxn$SendThread.primeConnection Socket connection established to localhost/127.0.0.1:44952, initiating session
[junit4:junit4]   2> 3328 T2532 oazs.NIOServerCnxnFactory.run Accepted socket connection from /140.211.11.196:44960
[junit4:junit4]   2> 3328 T2532 oazs.ZooKeeperServer.processConnectRequest Client attempting to establish new session at /140.211.11.196:44960
[junit4:junit4]   2> 3333 T2534 oazs.ZooKeeperServer.finishSessionInit Established session 0x13bb032dfef0005 with negotiated timeout 20000 for client /140.211.11.196:44960
[junit4:junit4]   2> 3333 T2568 oaz.ClientCnxn$SendThread.onConnected Session establishment complete on server localhost/127.0.0.1:44952, sessionid = 0x13bb032dfef0005, negotiated timeout = 20000
[junit4:junit4]   2> 3334 T2569 oascc.ConnectionManager.process Watcher org.apache.solr.common.cloud.ConnectionManager@13907093 name:ZooKeeperConnection Watcher:127.0.0.1:44952 got event WatchedEvent state:SyncConnected type:None path:null path:null type:None
[junit4:junit4]   2> 3334 T2530 oascc.ConnectionManager.waitForConnected Client is connected to ZooKeeper
[junit4:junit4]   2> 3335 T2535 oazs.PrepRequestProcessor.pRequest2Txn Processed session termination for sessionid: 0x13bb032dfef0005
[junit4:junit4]   2> 3350 T2569 oaz.ClientCnxn$EventThread.run EventThread shut down
[junit4:junit4]   2> 3350 T2532 oazs.NIOServerCnxn.closeSock Closed socket connection for client /140.211.11.196:44960 which had sessionid 0x13bb032dfef0005
[junit4:junit4]   2> 3350 T2530 oaz.ZooKeeper.close Session: 0x13bb032dfef0005 closed
[junit4:junit4]   2> 3351 T2530 oascsi.HttpClientUtil.createClient Creating new http client, config:maxConnections=500&maxConnectionsPerHost=16&socketTimeout=15000&connTimeout=30000
[junit4:junit4]   2> 3358 T2530 oaz.ZooKeeper.<init> Initiating client connection, connectString=127.0.0.1:44952/solr sessionTimeout=30000 watcher=org.apache.solr.common.cloud.ConnectionManager@29a98298
[junit4:junit4]   2> 3359 T2530 oascc.ConnectionManager.waitForConnected Waiting for client to connect to ZooKeeper
[junit4:junit4]   2> 3359 T2570 oaz.ClientCnxn$SendThread.logStartConnect Opening socket connection to server localhost/127.0.0.1:44952. Will not attempt to authenticate using SASL (access denied ("javax.security.auth.AuthPermission" "getLoginConfiguration"))
[junit4:junit4]   2> 3360 T2570 oaz.ClientCnxn$SendThread.primeConnection Socket connection established to localhost/127.0.0.1:44952, initiating session
[junit4:junit4]   2> 3360 T2532 oazs.NIOServerCnxnFactory.run Accepted socket connection from /140.211.11.196:44961
[junit4:junit4]   2> 3361 T2532 oazs.ZooKeeperServer.processConnectRequest Client attempting to establish new session at /140.211.11.196:44961
[junit4:junit4]   2> 3362 T2534 oazs.ZooKeeperServer.finishSessionInit Established session 0x13bb032dfef0006 with negotiated timeout 20000 for client /140.211.11.196:44961
[junit4:junit4]   2> 3363 T2570 oaz.ClientCnxn$SendThread.onConnected Session establishment complete on server localhost/127.0.0.1:44952, sessionid = 0x13bb032dfef0006, negotiated timeout = 20000
[junit4:junit4]   2> 3363 T2571 oascc.ConnectionManager.process Watcher org.apache.solr.common.cloud.ConnectionManager@29a98298 name:ZooKeeperConnection Watcher:127.0.0.1:44952/solr got event WatchedEvent state:SyncConnected type:None path:null path:null type:None
[junit4:junit4]   2> 3363 T2530 oascc.ConnectionManager.waitForConnected Client is connected to ZooKeeper
[junit4:junit4]   2> 3364 T2535 oazs.PrepRequestProcessor.pRequest Got user-level KeeperException when processing sessionid:0x13bb032dfef0006 type:create cxid:0x1 zxid:0x49 txntype:-1 reqpath:n/a Error Path:/solr/overseer Error:KeeperErrorCode = NodeExists for /solr/overseer
[junit4:junit4]   2> 3371 T2535 oazs.PrepRequestProcessor.pRequest Got user-level KeeperException when processing sessionid:0x13bb032dfef0006 type:create cxid:0x2 zxid:0x4a txntype:-1 reqpath:n/a Error Path:/solr/overseer Error:KeeperErrorCode = NodeExists for /solr/overseer
[junit4:junit4]   2> 3374 T2530 oasc.ZkController.createEphemeralLiveNode Register node as live in ZooKeeper:/live_nodes/127.0.0.1:44959_
[junit4:junit4]   2> 3375 T2535 oazs.PrepRequestProcessor.pRequest Got user-level KeeperException when processing sessionid:0x13bb032dfef0006 type:delete cxid:0x4 zxid:0x4b txntype:-1 reqpath:n/a Error Path:/solr/live_nodes/127.0.0.1:44959_ Error:KeeperErrorCode = NoNode for /solr/live_nodes/127.0.0.1:44959_
[junit4:junit4]   2> 3376 T2530 oascc.SolrZkClient.makePath makePath: /live_nodes/127.0.0.1:44959_
[junit4:junit4]   2> 3384 T2552 oascc.ZkStateReader$3.process Updating live nodes... (2)
[junit4:junit4]   2> 3384 T2558 oascc.ZkStateReader$3.process Updating live nodes... (2)
[junit4:junit4]   2> 3385 T2552 oascc.ZkStateReader$2.process A cluster state change: WatchedEvent state:SyncConnected type:NodeChildrenChanged path:/live_nodes, has occurred - updating... (live nodes size: 2)
[junit4:junit4]   2> 3388 T2530 oascc.ZkStateReader.createClusterStateWatchersAndUpdate Updating cluster state from ZooKeeper... 
[junit4:junit4]   2> 3395 T2572 oasc.CoreContainer.create Creating SolrCore 'collection1' using instanceDir: /usr/home/hudson/hudson-slave/workspace/Lucene-Solr-Tests-4.x-java7/solr/build/solr-core/test/J0/./org.apache.solr.cloud.SyncSliceTest-jetty1-1355870825495/collection1
[junit4:junit4]   2> 3395 T2572 oasc.ZkController.createCollectionZkNode Check for collection zkNode:collection1
[junit4:junit4]   2> 3396 T2572 oasc.ZkController.createCollectionZkNode Collection zkNode exists
[junit4:junit4]   2> 3396 T2572 oasc.ZkController.readConfigName Load collection config from:/collections/collection1
[junit4:junit4]   2> 3398 T2572 oasc.SolrResourceLoader.<init> new SolrResourceLoader for directory: '/usr/home/hudson/hudson-slave/workspace/Lucene-Solr-Tests-4.x-java7/solr/build/solr-core/test/J0/./org.apache.solr.cloud.SyncSliceTest-jetty1-1355870825495/collection1/'
[junit4:junit4]   2> 3399 T2572 oasc.SolrResourceLoader.replaceClassLoader Adding 'file:/usr/home/hudson/hudson-slave/workspace/Lucene-Solr-Tests-4.x-java7/solr/build/solr-core/test/J0/org.apache.solr.cloud.SyncSliceTest-jetty1-1355870825495/collection1/lib/classes/' to classloader
[junit4:junit4]   2> 3399 T2572 oasc.SolrResourceLoader.replaceClassLoader Adding 'file:/usr/home/hudson/hudson-slave/workspace/Lucene-Solr-Tests-4.x-java7/solr/build/solr-core/test/J0/org.apache.solr.cloud.SyncSliceTest-jetty1-1355870825495/collection1/lib/README' to classloader
[junit4:junit4]   2> 3453 T2572 oasc.SolrConfig.<init> Using Lucene MatchVersion: LUCENE_41
[junit4:junit4]   2> 3522 T2553 oascc.ZkStateReader.updateClusterState Updating cloud state from ZooKeeper... 
[junit4:junit4]   2> 3523 T2553 oasc.Overseer$ClusterStateUpdater.updateState Update state numShards=1 message={
[junit4:junit4]   2> 	  "operation":"state",
[junit4:junit4]   2> 	  "numShards":"1",
[junit4:junit4]   2> 	  "shard":"shard1",
[junit4:junit4]   2> 	  "roles":null,
[junit4:junit4]   2> 	  "state":"active",
[junit4:junit4]   2> 	  "core":"collection1",
[junit4:junit4]   2> 	  "collection":"control_collection",
[junit4:junit4]   2> 	  "node_name":"127.0.0.1:44955_",
[junit4:junit4]   2> 	  "base_url":"http://127.0.0.1:44955"}
[junit4:junit4]   2> 3523 T2572 oasc.SolrConfig.<init> Loaded SolrConfig: solrconfig.xml
[junit4:junit4]   2> 3539 T2552 oascc.ZkStateReader$2.process A cluster state change: WatchedEvent state:SyncConnected type:NodeDataChanged path:/clusterstate.json, has occurred - updating... (live nodes size: 2)
[junit4:junit4]   2> 3539 T2558 oascc.ZkStateReader$2.process A cluster state change: WatchedEvent state:SyncConnected type:NodeDataChanged path:/clusterstate.json, has occurred - updating... (live nodes size: 2)
[junit4:junit4]   2> 3626 T2571 oascc.ZkStateReader$2.process A cluster state change: WatchedEvent state:SyncConnected type:NodeDataChanged path:/clusterstate.json, has occurred - updating... (live nodes size: 2)
[junit4:junit4]   2> 3626 T2572 oass.IndexSchema.readSchema Reading Solr Schema
[junit4:junit4]   2> 3635 T2572 oass.IndexSchema.readSchema Schema name=test
[junit4:junit4]   2> 4273 T2572 oass.OpenExchangeRatesOrgProvider.init Initialized with rates=open-exchange-rates.json, refreshInterval=1440.
[junit4:junit4]   2> 4284 T2572 oass.IndexSchema.readSchema default search field in schema is text
[junit4:junit4]   2> 4288 T2572 oass.IndexSchema.readSchema unique key field: id
[junit4:junit4]   2> 4300 T2572 oass.FileExchangeRateProvider.reload Reloading exchange rates from file currency.xml
[junit4:junit4]   2> 4306 T2572 oass.FileExchangeRateProvider.reload Reloading exchange rates from file currency.xml
[junit4:junit4]   2> 4310 T2572 oass.OpenExchangeRatesOrgProvider.reload Reloading exchange rates from open-exchange-rates.json
[junit4:junit4]   2> 4312 T2572 oass.OpenExchangeRatesOrgProvider.reload Reloading exchange rates from open-exchange-rates.json
[junit4:junit4]   2> 4313 T2572 oasc.SolrCore.<init> [collection1] Opening new SolrCore at /usr/home/hudson/hudson-slave/workspace/Lucene-Solr-Tests-4.x-java7/solr/build/solr-core/test/J0/./org.apache.solr.cloud.SyncSliceTest-jetty1-1355870825495/collection1/, dataDir=./org.apache.solr.cloud.SyncSliceTest-1355870822377/jetty1/
[junit4:junit4]   2> 4313 T2572 oasc.JmxMonitoredMap.<init> JMX monitoring is enabled. Adding Solr mbeans to JMX Server: com.sun.jmx.mbeanserver.JmxMBeanServer@4582c6dc
[junit4:junit4]   2> 4314 T2572 oasc.SolrCore.initDirectoryFactory solr.NRTCachingDirectoryFactory
[junit4:junit4]   2> 4315 T2572 oasc.CachingDirectoryFactory.get return new directory for /usr/home/hudson/hudson-slave/workspace/Lucene-Solr-Tests-4.x-java7/solr/build/solr-core/test/J0/./org.apache.solr.cloud.SyncSliceTest-1355870822377/jetty1 forceNew:false
[junit4:junit4]   2> 4316 T2572 oasc.CachingDirectoryFactory.close Releasing directory:/usr/home/hudson/hudson-slave/workspace/Lucene-Solr-Tests-4.x-java7/solr/build/solr-core/test/J0/./org.apache.solr.cloud.SyncSliceTest-1355870822377/jetty1
[junit4:junit4]   2> 4316 T2572 oasc.SolrCore.getNewIndexDir New index directory detected: old=null new=./org.apache.solr.cloud.SyncSliceTest-1355870822377/jetty1/index/
[junit4:junit4]   2> 4317 T2572 oasc.SolrCore.initIndex WARNING [collection1] Solr index directory './org.apache.solr.cloud.SyncSliceTest-1355870822377/jetty1/index' doesn't exist. Creating new index...
[junit4:junit4]   2> 4317 T2572 oasc.CachingDirectoryFactory.get return new directory for /usr/home/hudson/hudson-slave/workspace/Lucene-Solr-Tests-4.x-java7/solr/build/solr-core/test/J0/./org.apache.solr.cloud.SyncSliceTest-1355870822377/jetty1/index forceNew:false
[junit4:junit4]   2> 4326 T2572 oasc.SolrDeletionPolicy.onCommit SolrDeletionPolicy.onCommit: commits:num=1
[junit4:junit4]   2> 		commit{dir=RateLimitedDirectoryWrapper(NRTCachingDirectory(org.apache.lucene.store.NIOFSDirectory@/usr/home/hudson/hudson-slave/workspace/Lucene-Solr-Tests-4.x-java7/solr/build/solr-core/test/J0/org.apache.solr.cloud.SyncSliceTest-1355870822377/jetty1/index lockFactory=org.apache.lucene.store.NativeFSLockFactory@2e73e8bf; maxCacheMB=48.0 maxMergeSizeMB=4.0)),segFN=segments_1,generation=1,filenames=[segments_1]
[junit4:junit4]   2> 4326 T2572 oasc.SolrDeletionPolicy.updateCommits newest commit = 1[segments_1]
[junit4:junit4]   2> 4327 T2572 oasc.CachingDirectoryFactory.close Releasing directory:/usr/home/hudson/hudson-slave/workspace/Lucene-Solr-Tests-4.x-java7/solr/build/solr-core/test/J0/./org.apache.solr.cloud.SyncSliceTest-1355870822377/jetty1/index
[junit4:junit4]   2> 4328 T2572 oasc.SolrCore.initWriters created xml: solr.XMLResponseWriter
[junit4:junit4]   2> 4330 T2572 oasup.UpdateRequestProcessorChain.init inserting DistributedUpdateProcessorFactory into updateRequestProcessorChain "dedupe"
[junit4:junit4]   2> 4330 T2572 oasup.UpdateRequestProcessorChain.init inserting DistributedUpdateProcessorFactory into updateRequestProcessorChain "dedupe-allfields"
[junit4:junit4]   2> 4331 T2572 oasup.UpdateRequestProcessorChain.init inserting DistributedUpdateProcessorFactory into updateRequestProcessorChain "stored_sig"
[junit4:junit4]   2> 4331 T2572 oasup.UpdateRequestProcessorChain.init inserting DistributedUpdateProcessorFactory into updateRequestProcessorChain "uniq-fields"
[junit4:junit4]   2> 4332 T2572 oasup.UpdateRequestProcessorChain.init inserting DistributedUpdateProcessorFactory into updateRequestProcessorChain "distrib-dup-test-chain-implicit"
[junit4:junit4]   2> 4332 T2572 oasc.RequestHandlers.initHandlersFromConfig adding lazy requestHandler: solr.ReplicationHandler
[junit4:junit4]   2> 4332 T2572 oasc.RequestHandlers.initHandlersFromConfig created /replication: solr.ReplicationHandler
[junit4:junit4]   2> 4334 T2572 oasc.RequestHandlers.initHandlersFromConfig created standard: solr.StandardRequestHandler
[junit4:junit4]   2> 4335 T2572 oasc.RequestHandlers.initHandlersFromConfig created /get: solr.RealTimeGetHandler
[junit4:junit4]   2> 4336 T2572 oasc.RequestHandlers.initHandlersFromConfig created dismax: solr.SearchHandler
[junit4:junit4]   2> 4337 T2572 oasc.RequestHandlers.initHandlersFromConfig created mock: org.apache.solr.core.MockQuerySenderListenerReqHandler
[junit4:junit4]   2> 4337 T2572 oasc.RequestHandlers.initHandlersFromConfig created /admin/: org.apache.solr.handler.admin.AdminHandlers
[junit4:junit4]   2> 4338 T2572 oasc.RequestHandlers.initHandlersFromConfig created defaults: solr.StandardRequestHandler
[junit4:junit4]   2> 4338 T2572 oasc.RequestHandlers.initHandlersFromConfig adding lazy requestHandler: solr.StandardRequestHandler
[junit4:junit4]   2> 4339 T2572 oasc.RequestHandlers.initHandlersFromConfig created lazy: solr.StandardRequestHandler
[junit4:junit4]   2> 4340 T2572 oasc.RequestHandlers.initHandlersFromConfig created /update: solr.UpdateRequestHandler
[junit4:junit4]   2> 4341 T2572 oasc.RequestHandlers.initHandlersFromConfig created /terms: org.apache.solr.handler.component.SearchHandler
[junit4:junit4]   2> 4342 T2572 oasc.RequestHandlers.initHandlersFromConfig created spellCheckCompRH: org.apache.solr.handler.component.SearchHandler
[junit4:junit4]   2> 4343 T2572 oasc.RequestHandlers.initHandlersFromConfig created spellCheckCompRH_Direct: org.apache.solr.handler.component.SearchHandler
[junit4:junit4]   2> 4344 T2572 oasc.RequestHandlers.initHandlersFromConfig created spellCheckWithWordbreak: org.apache.solr.handler.component.SearchHandler
[junit4:junit4]   2> 4345 T2572 oasc.RequestHandlers.initHandlersFromConfig created spellCheckWithWordbreak_Direct: org.apache.solr.handler.component.SearchHandler
[junit4:junit4]   2> 4346 T2572 oasc.RequestHandlers.initHandlersFromConfig created spellCheckCompRH1: org.apache.solr.handler.component.SearchHandler
[junit4:junit4]   2> 4347 T2572 oasc.RequestHandlers.initHandlersFromConfig created mltrh: org.apache.solr.handler.component.SearchHandler
[junit4:junit4]   2> 4348 T2572 oasc.RequestHandlers.initHandlersFromConfig created tvrh: org.apache.solr.handler.component.SearchHandler
[junit4:junit4]   2> 4349 T2572 oasc.RequestHandlers.initHandlersFromConfig created /mlt: solr.MoreLikeThisHandler
[junit4:junit4]   2> 4350 T2572 oasc.RequestHandlers.initHandlersFromConfig created /debug/dump: solr.DumpRequestHandler
[junit4:junit4]   2> 4362 T2572 oashl.XMLLoader.init xsltCacheLifetimeSeconds=60
[junit4:junit4]   2> 4366 T2572 oasc.SolrCore.initDeprecatedSupport WARNING solrconfig.xml uses deprecated <admin/gettableFiles>, Please update your config to use the ShowFileRequestHandler.
[junit4:junit4]   2> 4368 T2572 oasc.SolrCore.initDeprecatedSupport WARNING adding ShowFileRequestHandler with hidden files: [SCHEMA.XML, OLD_SYNONYMS.TXT, STOPWORDS.TXT, PROTWORDS.TXT, OPEN-EXCHANGE-RATES.JSON, SYNONYMS.TXT, CURRENCY.XML, MAPPING-ISOLATIN1ACCENT.TXT]
[junit4:junit4]   2> 4371 T2572 oasc.CachingDirectoryFactory.close Releasing directory:/usr/home/hudson/hudson-slave/workspace/Lucene-Solr-Tests-4.x-java7/solr/build/solr-core/test/J0/./org.apache.solr.cloud.SyncSliceTest-1355870822377/jetty1
[junit4:junit4]   2> 4372 T2572 oass.SolrIndexSearcher.<init> Opening Searcher@26fb2a31 main
[junit4:junit4]   2> 4373 T2572 oasu.CommitTracker.<init> Hard AutoCommit: disabled
[junit4:junit4]   2> 4374 T2572 oasu.CommitTracker.<init> Soft AutoCommit: disabled
[junit4:junit4]   2> 4374 T2572 oashc.SpellCheckComponent.inform Initializing spell checkers
[junit4:junit4]   2> 4381 T2572 oass.DirectSolrSpellChecker.init init: {name=direct,classname=DirectSolrSpellChecker,field=lowerfilt,minQueryLength=3}
[junit4:junit4]   2> 4431 T2573 oasc.SolrCore.registerSearcher [collection1] Registered new searcher Searcher@26fb2a31 main{StandardDirectoryReader(segments_1:1)}
[junit4:junit4]   2> 4434 T2572 oasc.ZkController.publish publishing core=collection1 state=down
[junit4:junit4]   2> 4435 T2572 oasc.ZkController.publish numShards not found on descriptor - reading it from system property
[junit4:junit4]   2> 4545 T2553 oascc.ZkStateReader.updateClusterState Updating cloud state from ZooKeeper... 
[junit4:junit4]   2> 4546 T2553 oasc.Overseer$ClusterStateUpdater.updateState Update state numShards=1 message={
[junit4:junit4]   2> 	  "operation":"state",
[junit4:junit4]   2> 	  "numShards":"1",
[junit4:junit4]   2> 	  "shard":null,
[junit4:junit4]   2> 	  "roles":null,
[junit4:junit4]   2> 	  "state":"down",
[junit4:junit4]   2> 	  "core":"collection1",
[junit4:junit4]   2> 	  "collection":"collection1",
[junit4:junit4]   2> 	  "node_name":"127.0.0.1:44959_",
[junit4:junit4]   2> 	  "base_url":"http://127.0.0.1:44959"}
[junit4:junit4]   2> 4546 T2553 oasc.Overseer$ClusterStateUpdater.createCollection Create collection collection1 with numShards 1
[junit4:junit4]   2> 4547 T2553 oasc.Overseer$ClusterStateUpdater.updateState Assigning new node to shard shard=shard1
[junit4:junit4]   2> 4559 T2552 oascc.ZkStateReader$2.process A cluster state change: WatchedEvent state:SyncConnected type:NodeDataChanged path:/clusterstate.json, has occurred - updating... (live nodes size: 2)
[junit4:junit4]   2> 4559 T2558 oascc.ZkStateReader$2.process A cluster state change: WatchedEvent state:SyncConnected type:NodeDataChanged path:/clusterstate.json, has occurred - updating... (live nodes size: 2)
[junit4:junit4]   2> 4559 T2571 oascc.ZkStateReader$2.process A cluster state change: WatchedEvent state:SyncConnected type:NodeDataChanged path:/clusterstate.json, has occurred - updating... (live nodes size: 2)
[junit4:junit4]   2> 4937 T2572 oasc.CoreContainer.registerCore registering core: collection1
[junit4:junit4]   2> 4937 T2572 oasc.ZkController.register Register replica - core:collection1 address:http://127.0.0.1:44959 collection:collection1 shard:shard1
[junit4:junit4]   2> 4939 T2572 oascc.SolrZkClient.makePath makePath: /collections/collection1/leader_elect/shard1/election
[junit4:junit4]   2> 4964 T2535 oazs.PrepRequestProcessor.pRequest Got user-level KeeperException when processing sessionid:0x13bb032dfef0006 type:delete cxid:0x45 zxid:0x5b txntype:-1 reqpath:n/a Error Path:/solr/collections/collection1/leaders Error:KeeperErrorCode = NoNode for /solr/collections/collection1/leaders
[junit4:junit4]   2> 4973 T2572 oasc.ShardLeaderElectionContext.runLeaderProcess Running the leader process.
[junit4:junit4]   2> 4974 T2535 oazs.PrepRequestProcessor.pRequest Got user-level KeeperException when processing sessionid:0x13bb032dfef0006 type:create cxid:0x46 zxid:0x5c txntype:-1 reqpath:n/a Error Path:/solr/overseer Error:KeeperErrorCode = NodeExists for /solr/overseer
[junit4:junit4]   2> 4976 T2572 oasc.ShardLeaderElectionContext.waitForReplicasToComeUp Enough replicas found to continue.
[junit4:junit4]   2> 4976 T2572 oasc.ShardLeaderElectionContext.runLeaderProcess I may be the new leader - try and sync
[junit4:junit4]   2> 4976 T2572 oasc.SyncStrategy.sync Sync replicas to http://127.0.0.1:44959/collection1/
[junit4:junit4]   2> 4977 T2572 oasc.SyncStrategy.syncReplicas Sync Success - now sync replicas to me
[junit4:junit4]   2> 4977 T2572 oasc.SyncStrategy.syncToMe http://127.0.0.1:44959/collection1/ has no replicas
[junit4:junit4]   2> 4978 T2572 oasc.ShardLeaderElectionContext.runLeaderProcess I am the new leader: http://127.0.0.1:44959/collection1/
[junit4:junit4]   2> 4978 T2572 oascc.SolrZkClient.makePath makePath: /collections/collection1/leaders/shard1
[junit4:junit4]   2> 4987 T2535 oazs.PrepRequestProcessor.pRequest Got user-level KeeperException when processing sessionid:0x13bb032dfef0006 type:create cxid:0x50 zxid:0x60 txntype:-1 reqpath:n/a Error Path:/solr/overseer Error:KeeperErrorCode = NodeExists for /solr/overseer
[junit4:junit4]   2> 5062 T2553 oascc.ZkStateReader.updateClusterState Updating cloud state from ZooKeeper... 
[junit4:junit4]   2> 5077 T2552 oascc.ZkStateReader$2.process A cluster state change: WatchedEvent state:SyncConnected type:NodeDataChanged path:/clusterstate.json, has occurred - updating... (live nodes size: 2)
[junit4:junit4]   2> 5077 T2558 oascc.ZkStateReader$2.process A cluster state change: WatchedEvent state:SyncConnected type:NodeDataChanged path:/clusterstate.json, has occurred - updating... (live nodes size: 2)
[junit4:junit4]   2> 5077 T2571 oascc.ZkStateReader$2.process A cluster state change: WatchedEvent state:SyncConnected type:NodeDataChanged path:/clusterstate.json, has occurred - updating... (live nodes size: 2)
[junit4:junit4]   2> 5098 T2572 oasc.ZkController.register We are http://127.0.0.1:44959/collection1/ and leader is http://127.0.0.1:44959/collection1/
[junit4:junit4]   2> 5098 T2572 oasc.ZkController.register No LogReplay needed for core=collection1 baseURL=http://127.0.0.1:44959
[junit4:junit4]   2> 5099 T2572 oasc.ZkController.checkRecovery I am the leader, no recovery necessary
[junit4:junit4]   2> 5099 T2572 oasc.ZkController.publish publishing core=collection1 state=active
[junit4:junit4]   2> 5099 T2572 oasc.ZkController.publish numShards not found on descriptor - reading it from system property
[junit4:junit4]   2> 5101 T2572 oascc.ZkStateReader.updateClusterState Updating cloud state from ZooKeeper... 
[junit4:junit4]   2> 5102 T2530 oass.SolrDispatchFilter.init user.dir=/usr/home/hudson/hudson-slave/workspace/Lucene-Solr-Tests-4.x-java7/solr/build/solr-core/test/J0
[junit4:junit4]   2> 5103 T2530 oass.SolrDispatchFilter.init SolrDispatchFilter.init() done
[junit4:junit4]   2> 5104 T2530 oascsi.HttpClientUtil.createClient Creating new http client, config:maxConnections=128&maxConnectionsPerHost=32&followRedirects=false
[junit4:junit4]   2> 5223 T2530 oejs.Server.doStart jetty-8.1.8.v20121106
[junit4:junit4]   2> 5227 T2530 oejs.AbstractConnector.doStart Started SocketConnector@127.0.0.1:44966
[junit4:junit4]   2> 5229 T2530 oasc.SolrResourceLoader.locateSolrHome JNDI not configured for solr (NoInitialContextEx)
[junit4:junit4]   2> 5230 T2530 oasc.SolrResourceLoader.locateSolrHome using system property solr.solr.home: /usr/home/hudson/hudson-slave/workspace/Lucene-Solr-Tests-4.x-java7/solr/build/solr-core/test/J0/./org.apache.solr.cloud.SyncSliceTest-jetty2-1355870827485
[junit4:junit4]   2> 5231 T2530 oasc.SolrResourceLoader.<init> new SolrResourceLoader for deduced Solr Home: '/usr/home/hudson/hudson-slave/workspace/Lucene-Solr-Tests-4.x-java7/solr/build/solr-core/test/J0/./org.apache.solr.cloud.SyncSliceTest-jetty2-1355870827485/'
[junit4:junit4]   2> 5264 T2530 oass.SolrDispatchFilter.init SolrDispatchFilter.init()
[junit4:junit4]   2> 5265 T2530 oasc.SolrResourceLoader.locateSolrHome JNDI not configured for solr (NoInitialContextEx)
[junit4:junit4]   2> 5266 T2530 oasc.SolrResourceLoader.locateSolrHome using system property solr.solr.home: /usr/home/hudson/hudson-slave/workspace/Lucene-Solr-Tests-4.x-java7/solr/build/solr-core/test/J0/./org.apache.solr.cloud.SyncSliceTest-jetty2-1355870827485
[junit4:junit4]   2> 5266 T2530 oasc.CoreContainer$Initializer.initialize looking for solr.xml: /usr/home/hudson/hudson-slave/workspace/Lucene-Solr-Tests-4.x-java7/solr/build/solr-core/test/J0/./org.apache.solr.cloud.SyncSliceTest-jetty2-1355870827485/solr.xml
[junit4:junit4]   2> 5267 T2530 oasc.CoreContainer.<init> New CoreContainer 901425357
[junit4:junit4]   2> 5267 T2530 oasc.CoreContainer.load Loading CoreContainer using Solr Home: '/usr/home/hudson/hudson-slave/workspace/Lucene-Solr-Tests-4.x-java7/solr/build/solr-core/test/J0/./org.apache.solr.cloud.SyncSliceTest-jetty2-1355870827485/'
[junit4:junit4]   2> 5268 T2530 oasc.SolrResourceLoader.<init> new SolrResourceLoader for directory: '/usr/home/hudson/hudson-slave/workspace/Lucene-Solr-Tests-4.x-java7/solr/build/solr-core/test/J0/./org.apache.solr.cloud.SyncSliceTest-jetty2-1355870827485/'
[junit4:junit4]   2> 5289 T2530 oashc.HttpShardHandlerFactory.getParameter Setting socketTimeout to: 30000
[junit4:junit4]   2> 5289 T2530 oashc.HttpShardHandlerFactory.getParameter Setting urlScheme to: http://
[junit4:junit4]   2> 5290 T2530 oashc.HttpShardHandlerFactory.getParameter Setting connTimeout to: 15000
[junit4:junit4]   2> 5291 T2530 oashc.HttpShardHandlerFactory.getParameter Setting maxConnectionsPerHost to: 20
[junit4:junit4]   2> 5291 T2530 oashc.HttpShardHandlerFactory.getParameter Setting corePoolSize to: 0
[junit4:junit4]   2> 5292 T2530 oashc.HttpShardHandlerFactory.getParameter Setting maximumPoolSize to: 2147483647
[junit4:junit4]   2> 5292 T2530 oashc.HttpShardHandlerFactory.getParameter Setting maxThreadIdleTime to: 5
[junit4:junit4]   2> 5293 T2530 oashc.HttpShardHandlerFactory.getParameter Setting sizeOfQueue to: -1
[junit4:junit4]   2> 5293 T2530 oashc.HttpShardHandlerFactory.getParameter Setting fairnessPolicy to: false
[junit4:junit4]   2> 5294 T2530 oascsi.HttpClientUtil.createClient Creating new http client, config:maxConnectionsPerHost=20&maxConnections=10000&socketTimeout=30000&connTimeout=15000&retry=false
[junit4:junit4]   2> 5307 T2530 oasc.CoreContainer.load Registering Log Listener
[junit4:junit4]   2> 5321 T2530 oasc.CoreContainer.initZooKeeper Zookeeper client=127.0.0.1:44952/solr
[junit4:junit4]   2> 5322 T2530 oasc.ZkController.checkChrootPath zkHost includes chroot
[junit4:junit4]   2> 5323 T2530 oaz.ZooKeeper.<init> Initiating client connection, connectString=127.0.0.1:44952 sessionTimeout=60000 watcher=org.apache.solr.common.cloud.ConnectionManager@20772569
[junit4:junit4]   2> 5324 T2530 oascc.ConnectionManager.waitForConnected Waiting for client to connect to ZooKeeper
[junit4:junit4]   2> 5324 T2583 oaz.ClientCnxn$SendThread.logStartConnect Opening socket connection to server localhost/127.0.0.1:44952. Will not attempt to authenticate using SASL (access denied ("javax.security.auth.AuthPermission" "getLoginConfiguration"))
[junit4:junit4]   2> 5325 T2583 oaz.ClientCnxn$SendThread.primeConnection Socket connection established to localhost/127.0.0.1:44952, initiating session
[junit4:junit4]   2> 5325 T2532 oazs.NIOServerCnxnFactory.run Accepted socket connection from /140.211.11.196:44967
[junit4:junit4]   2> 5326 T2532 oazs.ZooKeeperServer.processConnectRequest Client attempting to establish new session at /140.211.11.196:44967
[junit4:junit4]   2> 5328 T2534 oazs.ZooKeeperServer.finishSessionInit Established session 0x13bb032dfef0007 with negotiated timeout 20000 for client /140.211.11.196:44967
[junit4:junit4]   2> 5328 T2583 oaz.ClientCnxn$SendThread.onConnected Session establishment complete on server localhost/127.0.0.1:44952, sessionid = 0x13bb032dfef0007, negotiated timeout = 20000
[junit4:junit4]   2> 5328 T2584 oascc.ConnectionManager.process Watcher org.apache.solr.common.cloud.ConnectionManager@20772569 name:ZooKeeperConnection Watcher:127.0.0.1:44952 got event WatchedEvent state:SyncConnected type:None path:null path:null type:None
[junit4:junit4]   2> 5329 T2530 oascc.ConnectionManager.waitForConnected Client is connected to ZooKeeper
[junit4:junit4]   2> 5330 T2535 oazs.PrepRequestProcessor.pRequest2Txn Processed session termination for sessionid: 0x13bb032dfef0007
[junit4:junit4]   2> 5341 T2584 oaz.ClientCnxn$EventThread.run EventThread shut down
[junit4:junit4]   2> 5341 T2530 oaz.ZooKeeper.close Session: 0x13bb032dfef0007 closed
[junit4:junit4]   2> 5342 T2532 oazs.NIOServerCnxn.closeSock Closed socket connection for client /140.211.11.196:44967 which had sessionid 0x13bb032dfef0007
[junit4:junit4]   2> 5342 T2530 oascsi.HttpClientUtil.createClient Creating new http client, config:maxConnections=500&maxConnectionsPerHost=16&socketTimeout=15000&connTimeout=30000
[junit4:junit4]   2> 5351 T2530 oaz.ZooKeeper.<init> Initiating client connection, connectString=127.0.0.1:44952/solr sessionTimeout=30000 watcher=org.apache.solr.common.cloud.ConnectionManager@508431c
[junit4:junit4]   2> 5353 T2530 oascc.ConnectionManager.waitForConnected Waiting for client to connect to ZooKeeper
[junit4:junit4]   2> 5354 T2585 oaz.ClientCnxn$SendThread.logStartConnect Opening socket connection to server localhost/127.0.0.1:44952. Will not attempt to authenticate using SASL (access denied ("javax.security.auth.AuthPermission" "getLoginConfiguration"))
[junit4:junit4]   2> 5355 T2585 oaz.ClientCnxn$SendThread.primeConnection Socket connection established to localhost/127.0.0.1:44952, initiating session
[junit4:junit4]   2> 5355 T2532 oazs.NIOServerCnxnFactory.run Accepted socket connection from /140.211.11.196:44968
[junit4:junit4]   2> 5356 T2532 oazs.ZooKeeperServer.processConnectRequest Client attempting to establish new session at /140.211.11.196:44968
[junit4:junit4]   2> 5357 T2534 oazs.ZooKeeperServer.finishSessionInit Established session 0x13bb032dfef0008 with negotiated timeout 20000 for client /140.211.11.196:44968
[junit4:junit4]   2> 5357 T2585 oaz.ClientCnxn$SendThread.onConnected Session establishment complete on server localhost/127.0.0.1:44952, sessionid = 0x13bb032dfef0008, negotiated timeout = 20000
[junit4:junit4]   2> 5358 T2586 oascc.ConnectionManager.process Watcher org.apache.solr.common.cloud.ConnectionManager@508431c name:ZooKeeperConnection Watcher:127.0.0.1:44952/solr got event WatchedEvent state:SyncConnected type:None path:null path:null type:None
[junit4:junit4]   2> 5358 T2530 oascc.ConnectionManager.waitForConnected Client is connected to ZooKeeper
[junit4:junit4]   2> 5359 T2535 oazs.PrepRequestProcessor.pRequest Got user-level KeeperException when processing sessionid:0x13bb032dfef0008 type:create cxid:0x1 zxid:0x6d txntype:-1 reqpath:n/a Error Path:/solr/overseer Error:KeeperErrorCode = NodeExists for /solr/overseer
[junit4:junit4]   2> 5361 T2535 oazs.PrepRequestProcessor.pRequest Got user-level KeeperException when processing sessionid:0x13bb032dfef0008 type:create cxid:0x2 zxid:0x6e txntype:-1 reqpath:n/a Error Path:/solr/overseer Error:KeeperErrorCode = NodeExists for /solr/overseer
[junit4:junit4]   2> 5368 T2530 oasc.ZkController.createEphemeralLiveNode Register node as live in ZooKeeper:/live_nodes/127.0.0.1:44966_
[junit4:junit4]   2> 5369 T2535 oazs.PrepRequestProcessor.pRequest Got user-level KeeperException when processing sessionid:0x13bb032dfef0008 type:delete cxid:0x4 zxid:0x6f txntype:-1 reqpath:n/a Error Path:/solr/live_nodes/127.0.0.1:44966_ Error:KeeperErrorCode = NoNode for /solr/live_nodes/127.0.0.1:44966_
[junit4:junit4]   2> 5370 T2530 oascc.SolrZkClient.makePath makePath: /live_nodes/127.0.0.1:44966_
[junit4:junit4]   2> 5372 T2571 oascc.ZkStateReader$2.process A cluster state change: WatchedEvent state:SyncConnected type:NodeChildrenChanged path:/live_nodes, has occurred - updating... (live nodes size: 2)
[junit4:junit4]   2> 5373 T2558 oascc.ZkStateReader$3.process Updating live nodes... (3)
[junit4:junit4]   2> 5373 T2552 oascc.ZkStateReader$3.process Updating live nodes... (3)
[junit4:junit4]   2> 5373 T2558 oascc.ZkStateReader$2.process A cluster state change: WatchedEvent state:SyncConnected type:NodeChildrenChanged path:/live_nodes, has occurred - updating... (live nodes size: 3)
[junit4:junit4]   2> 5374 T2552 oascc.ZkStateReader$2.process A cluster state change: WatchedEvent state:SyncConnected type:NodeChildrenChanged path:/live_nodes, has occurred - updating... (live nodes size: 3)
[junit4:junit4]   2> 5374 T2571 oascc.ZkStateReader$3.process Updating live nodes... (3)
[junit4:junit4]   2> 5382 T2530 oascc.ZkStateReader.createClusterStateWatchersAndUpdate Updating cluster state from ZooKeeper... 
[junit4:junit4]   2> 5389 T2587 oasc.CoreContainer.create Creating SolrCore 'collection1' using instanceDir: /usr/home/hudson/hudson-slave/workspace/Lucene-Solr-Tests-4.x-java7/solr/build/solr-core/test/J0/./org.apache.solr.cloud.SyncSliceTest-jetty2-1355870827485/collection1
[junit4:junit4]   2> 5389 T2587 oasc.ZkController.createCollectionZkNode Check for collection zkNode:collection1
[junit4:junit4]   2> 5390 T2587 oasc.ZkController.createCollectionZkNode Collection zkNode exists
[junit4:junit4]   2> 5390 T2587 oasc.ZkController.readConfigName Load collection config from:/collections/collection1
[junit4:junit4]   2> 5391 T2587 oasc.SolrResourceLoader.<init> new SolrResourceLoader for directory: '/usr/home/hudson/hudson-slave/workspace/Lucene-Solr-Tests-4.x-java7/solr/build/solr-core/test/J0/./org.apache.solr.cloud.SyncSliceTest-jetty2-1355870827485/collection1/'
[junit4:junit4]   2> 5392 T2587 oasc.SolrResourceLoader.replaceClassLoader Adding 'file:/usr/home/hudson/hudson-slave/workspace/Lucene-Solr-Tests-4.x-java7/solr/build/solr-core/test/J0/org.apache.solr.cloud.SyncSliceTest-jetty2-1355870827485/collection1/lib/README' to classloader
[junit4:junit4]   2> 5392 T2587 oasc.SolrResourceLoader.replaceClassLoader Adding 'file:/usr/home/hudson/hudson-slave/workspace/Lucene-Solr-Tests-4.x-java7/solr/build/solr-core/test/J0/org.apache.solr.cloud.SyncSliceTest-jetty2-1355870827485/collection1/lib/classes/' to classloader
[junit4:junit4]   2> 5429 T2587 oasc.SolrConfig.<init> Using Lucene MatchVersion: LUCENE_41
[junit4:junit4]   2> 5478 T2587 oasc.SolrConfig.<init> Loaded SolrConfig: solrconfig.xml
[junit4:junit4]   2> 5579 T2587 oass.IndexSchema.readSchema Reading Solr Schema
[junit4:junit4]   2> 5582 T2553 oascc.ZkStateReader.updateClusterState Updating cloud state from ZooKeeper... 
[junit4:junit4]   2> 5583 T2553 oasc.Overseer$ClusterStateUpdater.updateState Update state numShards=1 message={
[junit4:junit4]   2> 	  "operation":"state",
[junit4:junit4]   2> 	  "numShards":"1",
[junit4:junit4]   2> 	  "shard":"shard1",
[junit4:junit4]   2> 	  "roles":null,
[junit4:junit4]   2> 	  "state":"active",
[junit4:junit4]   2> 	  "core":"collection1",
[junit4:junit4]   2> 	  "collection":"collection1",
[junit4:junit4]   2> 	  "node_name":"127.0.0.1:44959_",
[junit4:junit4]   2> 	  "base_url":"http://127.0.0.1:44959"}
[junit4:junit4]   2> 5585 T2587 oass.IndexSchema.readSchema Schema name=test
[junit4:junit4]   2> 5597 T2552 oascc.ZkStateReader$2.process A cluster state change: WatchedEvent state:SyncConnected type:NodeDataChanged path:/clusterstate.json, has occurred - updating... (live nodes size: 3)
[junit4:junit4]   2> 5597 T2558 oascc.ZkStateReader$2.process A cluster state change: WatchedEvent state:SyncConnected type:NodeDataChanged path:/clusterstate.json, has occurred - updating... (live nodes size: 3)
[junit4:junit4]   2> 5597 T2571 oascc.ZkStateReader$2.process A cluster state change: WatchedEvent state:SyncConnected type:NodeDataChanged path:/clusterstate.json, has occurred - updating... (live nodes size: 3)
[junit4:junit4]   2> 5597 T2586 oascc.ZkStateReader$2.process A cluster state change: WatchedEvent state:SyncConnected type:NodeDataChanged path:/clusterstate.json, has occurred - updating... (live nodes size: 3)
[junit4:junit4]   2> 6027 T2587 oass.OpenExchangeRatesOrgProvider.init Initialized with rates=open-exchange-rates.json, refreshInterval=1440.
[junit4:junit4]   2> 6035 T2587 oass.IndexSchema.readSchema default search field in schema is text
[junit4:junit4]   2> 6038 T2587 oass.IndexSchema.readSchema unique key field: id
[junit4:junit4]   2> 6050 T2587 oass.FileExchangeRateProvider.reload Reloading exchange rates from file currency.xml
[junit4:junit4]   2> 6054 T2587 oass.FileExchangeRateProvider.reload Reloading exchange rates from file currency.xml
[junit4:junit4]   2> 6057 T2587 oass.OpenExchangeRatesOrgProvider.reload Reloading exchange rates from open-exchange-rates.json
[junit4:junit4]   2> 6058 T2587 oass.OpenExchangeRatesOrgProvider.reload Reloading exchange rates from open-exchange-rates.json
[junit4:junit4]   2> 6059 T2587 oasc.SolrCore.<init> [collection1] Opening new SolrCore at /usr/home/hudson/hudson-slave/workspace/Lucene-Solr-Tests-4.x-java7/solr/build/solr-core/test/J0/./org.apache.solr.cloud.SyncSliceTest-jetty2-1355870827485/collection1/, dataDir=./org.apache.solr.cloud.SyncSliceTest-1355870822377/jetty2/
[junit4:junit4]   2> 6059 T2587 oasc.JmxMonitoredMap.<init> JMX monitoring is enabled. Adding Solr mbeans to JMX Server: com.sun.jmx.mbeanserver.JmxMBeanServer@4582c6dc
[junit4:junit4]   2> 6060 T2587 oasc.SolrCore.initDirectoryFactory solr.NRTCachingDirectoryFactory
[junit4:junit4]   2> 6061 T2587 oasc.CachingDirectoryFactory.get return new directory for /usr/home/hudson/hudson-slave/workspace/Lucene-Solr-Tests-4.x-java7/solr/build/solr-core/test/J0/./org.apache.solr.cloud.SyncSliceTest-1355870822377/jetty2 forceNew:false
[junit4:junit4]   2> 6061 T2587 oasc.CachingDirectoryFactory.close Releasing directory:/usr/home/hudson/hudson-slave/workspace/Lucene-Solr-Tests-4.x-java7/solr/build/solr-core/test/J0/./org.apache.solr.cloud.SyncSliceTest-1355870822377/jetty2
[junit4:junit4]   2> 6062 T2587 oasc.SolrCore.getNewIndexDir New index directory detected: old=null new=./org.apache.solr.cloud.SyncSliceTest-1355870822377/jetty2/index/
[junit4:junit4]   2> 6062 T2587 oasc.SolrCore.initIndex WARNING [collection1] Solr index directory './org.apache.solr.cloud.SyncSliceTest-1355870822377/jetty2/index' doesn't exist. Creating new index...
[junit4:junit4]   2> 6063 T2587 oasc.CachingDirectoryFactory.get return new directory for /usr/home/hudson/hudson-slave/workspace/Lucene-Solr-Tests-4.x-java7/solr/build/solr-core/test/J0/./org.apache.solr.cloud.SyncSliceTest-1355870822377/jetty2/index forceNew:false
[junit4:junit4]   2> 6067 T2587 oasc.SolrDeletionPolicy.onCommit SolrDeletionPolicy.onCommit: commits:num=1
[junit4:junit4]   2> 		commit{dir=RateLimitedDirectoryWrapper(NRTCachingDirectory(org.apache.lucene.store.NIOFSDirectory@/usr/home/hudson/hudson-slave/workspace/Lucene-Solr-Tests-4.x-java7/solr/build/solr-core/test/J0/org.apache.solr.cloud.SyncSliceTest-1355870822377/jetty2/index lockFactory=org.apache.lucene.store.NativeFSLockFactory@2ba3493d; maxCacheMB=48.0 maxMergeSizeMB=4.0)),segFN=segments_1,generation=1,filenames=[segments_1]
[junit4:junit4]   2> 6068 T2587 oasc.SolrDeletionPolicy.updateCommits newest commit = 1[segments_1]
[junit4:junit4]   2> 6068 T2587 oasc.CachingDirectoryFactory.close Releasing directory:/usr/home/hudson/hudson-slave/workspace/Lucene-Solr-Tests-4.x-java7/solr/build/solr-core/test/J0/./org.apache.solr.cloud.SyncSliceTest-1355870822377/jetty2/index
[junit4:junit4]   2> 6069 T2587 oasc.SolrCore.initWriters created xml: solr.XMLResponseWriter
[junit4:junit4]   2> 6070 T2587 oasup.UpdateRequestProcessorChain.init inserting DistributedUpdateProcessorFactory into updateRequestProcessorChain "dedupe"
[junit4:junit4]   2> 6070 T2587 oasup.UpdateRequestProcessorChain.init inserting DistributedUpdateProcessorFactory into updateRequestProcessorChain "dedupe-allfields"
[junit4:junit4]   2> 6071 T2587 oasup.UpdateRequestProcessorChain.init inserting DistributedUpdateProcessorFactory into updateRequestProcessorChain "stored_sig"
[junit4:junit4]   2> 6071 T2587 oasup.UpdateRequestProcessorChain.init inserting DistributedUpdateProcessorFactory into updateRequestProcessorChain "uniq-fields"
[junit4:junit4]   2> 6072 T2587 oasup.UpdateRequestProcessorChain.init inserting DistributedUpdateProcessorFactory into updateRequestProcessorChain "distrib-dup-test-chain-implicit"
[junit4:junit4]   2> 6072 T2587 oasc.RequestHandlers.initHandlersFromConfig adding lazy requestHandler: solr.ReplicationHandler
[junit4:junit4]   2> 6072 T2587 oasc.RequestHandlers.initHandlersFromConfig created /replication: solr.ReplicationHandler
[junit4:junit4]   2> 6073 T2587 oasc.RequestHandlers.initHandlersFromConfig created standard: solr.StandardRequestHandler
[junit4:junit4]   2> 6074 T2587 oasc.RequestHandlers.initHandlersFromConfig created /get: solr.RealTimeGetHandler
[junit4:junit4]   2> 6075 T2587 oasc.RequestHandlers.initHandlersFromConfig created dismax: solr.SearchHandler
[junit4:junit4]   2> 6075 T2587 oasc.RequestHandlers.initHandlersFromConfig created mock: org.apache.solr.core.MockQuerySenderListenerReqHandler
[junit4:junit4]   2> 6076 T2587 oasc.RequestHandlers.initHandlersFromConfig created /admin/: org.apache.solr.handler.admin.AdminHandlers
[junit4:junit4]   2> 6076 T2587 oasc.RequestHandlers.initHandlersFromConfig created defaults: solr.StandardRequestHandler
[junit4:junit4]   2> 6077 T2587 oasc.RequestHandlers.initHandlersFromConfig adding lazy requestHandler: solr.StandardRequestHandler
[junit4:junit4]   2> 6077 T2587 oasc.RequestHandlers.initHandlersFromConfig created lazy: solr.StandardRequestHandler
[junit4:junit4]   2> 6078 T2587 oasc.RequestHandlers.initHandlersFromConfig created /update: solr.UpdateRequestHandler
[junit4:junit4]   2> 6078 T2587 oasc.RequestHandlers.initHandlersFromConfig created /terms: org.apache.solr.handler.component.SearchHandler
[junit4:junit4]   2> 6079 T2587 oasc.RequestHandlers.initHandlersFromConfig created spellCheckCompRH: org.apache.solr.handler.component.SearchHandler
[junit4:junit4]   2> 6080 T2587 oasc.RequestHandlers.initHandlersFromConfig created spellCheckCompRH_Direct: org.apache.solr.handler.component.SearchHandler
[junit4:junit4]   2> 6081 T2587 oasc.RequestHandlers.initHandlersFromConfig created spellCheckWithWordbreak: org.apache.solr.handler.component.SearchHandler
[junit4:junit4]   2> 6081 T2587 oasc.RequestHandlers.initHandlersFromConfig created spellCheckWithWordbreak_Direct: org.apache.solr.handler.component.SearchHandler
[junit4:junit4]   2> 6082 T2587 oasc.RequestHandlers.initHandlersFromConfig created spellCheckCompRH1: org.apache.solr.handler.component.SearchHandler
[junit4:junit4]   2> 6083 T2587 oasc.RequestHandlers.initHandlersFromConfig created mltrh: org.apache.solr.handler.component.SearchHandler
[junit4:junit4]   2> 6084 T2587 oasc.RequestHandlers.initHandlersFromConfig created tvrh: org.apache.solr.handler.component.SearchHandler
[junit4:junit4]   2> 6084 T2587 oasc.RequestHandlers.initHandlersFromConfig created /mlt: solr.MoreLikeThisHandler
[junit4:junit4]   2> 6085 T2587 oasc.RequestHandlers.initHandlersFromConfig created /debug/dump: solr.DumpRequestHandler
[junit4:junit4]   2> 6094 T2587 oashl.XMLLoader.init xsltCacheLifetimeSeconds=60
[junit4:junit4]   2> 6097 T2587 oasc.SolrCore.initDeprecatedSupport WARNING solrconfig.xml uses deprecated <admin/gettableFiles>, Please update your config to use the ShowFileRequestHandler.
[junit4:junit4]   2> 6098 T2587 oasc.SolrCore.initDeprecatedSupport WARNING adding ShowFileRequestHandler with hidden files: [SCHEMA.XML, OLD_SYNONYMS.TXT, STOPWORDS.TXT, PROTWORDS.TXT, OPEN-EXCHANGE-RATES.JSON, SYNONYMS.TXT, CURRENCY.XML, MAPPING-ISOLATIN1ACCENT.TXT]
[junit4:junit4]   2> 6100 T2587 oasc.CachingDirectoryFactory.close Releasing directory:/usr/home/hudson/hudson-slave/workspace/Lucene-Solr-Tests-4.x-java7/solr/build/solr-core/test/J0/./org.apache.solr.cloud.SyncSliceTest-1355870822377/jetty2
[junit4:junit4]   2> 6102 T2587 oass.SolrIndexSearcher.<init> Opening Searcher@41bb738 main
[junit4:junit4]   2> 6102 T2587 oasu.CommitTracker.<init> Hard AutoCommit: disabled
[junit4:junit4]   2> 6103 T2587 oasu.CommitTracker.<init> Soft AutoCommit: disabled
[junit4:junit4]   2> 6103 T2587 oashc.SpellCheckComponent.inform Initializing spell checkers
[junit4:junit4]   2> 6109 T2587 oass.DirectSolrSpellChecker.init init: {name=direct,classname=DirectSolrSpellChecker,field=lowerfilt,minQueryLength=3}
[junit4:junit4]   2> 6164 T2588 oasc.SolrCore.registerSearcher [collection1] Registered new searcher Searcher@41bb738 main{StandardDirectoryReader(segments_1:1)}
[junit4:junit4]   2> 6167 T2587 oasc.ZkController.publish publishing core=collection1 state=down
[junit4:junit4]   2> 6167 T2587 oasc.ZkController.publish numShards not found on descriptor - reading it from system property
[junit4:junit4]   2> 6604 T2553 oascc.ZkStateReader.updateClusterState Updating cloud state from ZooKeeper... 
[junit4:junit4]   2> 6605 T2553 oasc.Overseer$ClusterStateUpdater.updateState Update state numShards=1 message={
[junit4:junit4]   2> 	  "operation":"state",
[junit4:junit4]   2> 	  "numShards":"1",
[junit4:junit4]   2> 	  "shard":null,
[junit4:junit4]   2> 	  "roles":null,
[junit4:junit4]   2> 	  "state":"down",
[junit4:junit4]   2> 	  "core":"collection1",
[junit4:junit4]   2> 	  "collection":"collection1",
[junit4:junit4]   2> 	  "node_name":"127.0.0.1:44966_",
[junit4:junit4]   2> 	  "base_url":"http://127.0.0.1:44966"}
[junit4:junit4]   2> 6605 T2553 oasc.Overseer$ClusterStateUpdater.updateState Collection already exists with numShards=1
[junit4:junit4]   2> 6605 T2553 oasc.Overseer$ClusterStateUpdater.updateState Assigning new node to shard shard=shard1
[junit4:junit4]   2> 6618 T2558 oascc.ZkStateReader$2.process A cluster state change: WatchedEvent state:SyncConnected type:NodeDataChanged path:/clusterstate.json, has occurred - updating... (live nodes size: 3)
[junit4:junit4]   2> 6618 T2571 oascc.ZkStateReader$2.process A cluster state change: WatchedEvent state:SyncConnected type:NodeDataChanged path:/clusterstate.json, has occurred - updating... (live nodes size: 3)
[junit4:junit4]   2> 6618 T2552 oascc.ZkStateReader$2.process A cluster state change: WatchedEvent state:SyncConnected type:NodeDataChanged path:/clusterstate.json, has occurred - updating... (live nodes size: 3)
[junit4:junit4]   2> 6618 T2586 oascc.ZkStateReader$2.process A cluster state change: WatchedEvent state:SyncConnected type:NodeDataChanged path:/clusterstate.json, has occurred - updating... (live nodes size: 3)
[junit4:junit4]   2> 6670 T2587 oasc.CoreContainer.registerCore registering core: collection1
[junit4:junit4]   2> 6670 T2587 oasc.ZkController.register Register replica - core:collection1 address:http://127.0.0.1:44966 collection:collection1 shard:shard1
[junit4:junit4]   2> 6673 T2587 oasc.ZkController.register We are http://127.0.0.1:44966/collection1/ and leader is http://127.0.0.1:44959/collection1/
[junit4:junit4]   2> 6674 T2587 oasc.ZkController.register No LogReplay needed for core=collection1 baseURL=http://127.0.0.1:44966
[junit4:junit4]   2> 6674 T2587 oasc.ZkController.checkRecovery Core needs to recover:collection1
[junit4:junit4]   2> 6674 T2587 oasu.DefaultSolrCoreState.doRecovery Running recovery - first canceling any ongoing recovery
[junit4:junit4]   2> ASYNC  NEW_CORE C160 name=collection1 org.apache.solr.core.SolrCore@7f332e2c url=http://127.0.0.1:44966/collection1 node=127.0.0.1:44966_ C160_STATE=coll:collection1 core:collection1 props:{shard=null, roles=null, state=down, core=collection1, collection=collection1, node_name=127.0.0.1:44966_, base_url=http://127.0.0.1:44966}
[junit4:junit4]   2> 6675 T2589 C160 P44966 oasc.RecoveryStrategy.run Starting recovery process.  core=collection1 recoveringAfterStartup=true
[junit4:junit4]   2> 6675 T2587 oascc.ZkStateReader.updateClusterState Updating cloud state from ZooKeeper... 
[junit4:junit4]   2> 6676 T2589 C160 P44966 oasc.RecoveryStrategy.doRecovery ###### startupVersions=[]
[junit4:junit4]   2> 6676 T2589 C160 P44966 oasc.ZkController.publish publishing core=collection1 state=recovering
[junit4:junit4]   2> 6677 T2589 C160 P44966 oasc.ZkController.publish numShards not found on descriptor - reading it from system property
[junit4:junit4]   2> 6677 T2530 oass.SolrDispatchFilter.init user.dir=/usr/home/hudson/hudson-slave/workspace/Lucene-Solr-Tests-4.x-java7/solr/build/solr-core/test/J0
[junit4:junit4]   2> 6678 T2589 C160 P44966 oasc.RecoveryStrategy.doRecovery Attempting to PeerSync from http://127.0.0.1:44959/collection1/ core=collection1 - recoveringAfterStartup=true
[junit4:junit4]   2> 6678 T2530 oass.SolrDispatchFilter.init SolrDispatchFilter.init() done
[junit4:junit4]   2> 6678 T2589 C160 P44966 oasu.PeerSync.sync PeerSync: core=collection1 url=http://127.0.0.1:44966 START replicas=[http://127.0.0.1:44959/collection1/] nUpdates=100
[junit4:junit4]   2> 6678 T2530 oascsi.HttpClientUtil.createClient Creating new http client, config:maxConnections=128&maxConnectionsPerHost=32&followRedirects=false
[junit4:junit4]   2> 6679 T2589 C160 P44966 oasu.PeerSync.sync WARNING no frame of reference to tell of we've missed updates
[junit4:junit4]   2> 6679 T2589 C160 P44966 oasc.RecoveryStrategy.doRecovery PeerSync Recovery was not successful - trying replication. core=collection1
[junit4:junit4]   2> 6679 T2589 C160 P44966 oasc.RecoveryStrategy.doRecovery Starting Replication Recovery. core=collection1
[junit4:junit4]   2> 6680 T2589 C160 P44966 oascsi.HttpClientUtil.createClient Creating new http client, config:maxConnections=128&maxConnectionsPerHost=32&followRedirects=false
[junit4:junit4]   2> ASYNC  NEW_CORE C161 name=collection1 org.apache.solr.core.SolrCore@5999e28c url=http://127.0.0.1:44959/collection1 node=127.0.0.1:44959_ C161_STATE=coll:collection1 core:collection1 props:{shard=shard1, roles=null, state=active, core=collection1, collection=collection1, node_name=127.0.0.1:44959_, base_url=http://127.0.0.1:44959, leader=true}
[junit4:junit4]   2> 6689 T2561 C161 P44959 REQ /get {distrib=false&qt=/get&wt=javabin&version=2&getVersions=100} status=0 QTime=0 
[junit4:junit4]   2> 6800 T2530 oejs.Server.doStart jetty-8.1.8.v20121106
[junit4:junit4]   2> 6803 T2530 oejs.AbstractConnector.doStart Started SocketConnector@127.0.0.1:44971
[junit4:junit4]   2> 6803 T2530 oasc.SolrResourceLoader.locateSolrHome JNDI not configured for solr (NoInitialContextEx)
[junit4:junit4]   2> 6804 T2530 oasc.SolrResourceLoader.locateSolrHome using system property solr.solr.home: /usr/home/hudson/hudson-slave/workspace/Lucene-Solr-Tests-4.x-java7/solr/build/solr-core/test/J0/./org.apache.solr.cloud.SyncSliceTest-jetty3-1355870829063
[junit4:junit4]   2> 6805 T2530 oasc.SolrResourceLoader.<init> new SolrResourceLoader for deduced Solr Home: '/usr/home/hudson/hudson-slave/workspace/Lucene-Solr-Tests-4.x-java7/solr/build/solr-core/test/J0/./org.apache.solr.cloud.SyncSliceTest-jetty3-1355870829063/'
[junit4:junit4]   2> 6833 T2530 oass.SolrDispatchFilter.init SolrDispatchFilter.init()
[junit4:junit4]   2> 6834 T2530 oasc.SolrResourceLoader.locateSolrHome JNDI not configured for solr (NoInitialContextEx)
[junit4:junit4]   2> 6835 T2530 oasc.SolrResourceLoader.locateSolrHome using system property solr.solr.home: /usr/home/hudson/hudson-slave/workspace/Lucene-Solr-Tests-4.x-java7/solr/build/solr-core/test/J0/./org.apache.solr.cloud.SyncSliceTest-jetty3-1355870829063
[junit4:junit4]   2> 6835 T2530 oasc.CoreContainer$Initializer.initialize looking for solr.xml: /usr/home/hudson/hudson-slave/workspace/Lucene-Solr-Tests-4.x-java7/solr/build/solr-core/test/J0/./org.apache.solr.cloud.SyncSliceTest-jetty3-1355870829063/solr.xml
[junit4:junit4]   2> 6836 T2530 oasc.CoreContainer.<init> New CoreContainer 1855258178
[junit4:junit4]   2> 6836 T2530 oasc.CoreContainer.load Loading CoreContainer using Solr Home: '/usr/home/hudson/hudson-slave/workspace/Lucene-Solr-Tests-4.x-java7/solr/build/solr-core/test/J0/./org.apache.solr.cloud.SyncSliceTest-jetty3-1355870829063/'
[junit4:junit4]   2> 6837 T2530 oasc.SolrResourceLoader.<init> new SolrResourceLoader for directory: '/usr/home/hudson/hudson-slave/workspace/Lucene-Solr-Tests-4.x-java7/solr/build/solr-core/test/J0/./org.apache.solr.cloud.SyncSliceTest-jetty3-1355870829063/'
[junit4:junit4]   2> 6857 T2530 oashc.HttpShardHandlerFactory.getParameter Setting socketTimeout to: 30000
[junit4:junit4]   2> 6859 T2530 oashc.HttpShardHandlerFactory.getParameter Setting urlScheme to: http://
[junit4:junit4]   2> 6859 T2530 oashc.HttpShardHandlerFactory.getParameter Setting connTimeout to: 15000
[junit4:junit4]   2> 6860 T2530 oashc.HttpShardHandlerFactory.getParameter Setting maxConnectionsPerHost to: 20
[junit4:junit4]   2> 6860 T2530 oashc.HttpShardHandlerFactory.getParameter Setting corePoolSize to: 0
[junit4:junit4]   2> 6861 T2530 oashc.HttpShardHandlerFactory.getParameter Setting maximumPoolSize to: 2147483647
[junit4:junit4]   2> 6861 T2530 oashc.HttpShardHandlerFactory.getParameter Setting maxThreadIdleTime to: 5
[junit4:junit4]   2> 6862 T2530 oashc.HttpShardHandlerFactory.getParameter Setting sizeOfQueue to: -1
[junit4:junit4]   2> 6862 T2530 oashc.HttpShardHandlerFactory.getParameter Setting fairnessPolicy to: false
[junit4:junit4]   2> 6863 T2530 oascsi.HttpClientUtil.createClient Creating new http client, config:maxConnectionsPerHost=20&maxConnections=10000&socketTimeout=30000&connTimeout=15000&retry=false
[junit4:junit4]   2> 6876 T2530 oasc.CoreContainer.load Registering Log Listener
[junit4:junit4]   2> 6891 T2530 oasc.CoreContainer.initZooKeeper Zookeeper client=127.0.0.1:44952/solr
[junit4:junit4]   2> 6892 T2530 oasc.ZkController.checkChrootPath zkHost includes chroot
[junit4:junit4]   2> 6892 T2530 oaz.ZooKeeper.<init> Initiating client connection, connectString=127.0.0.1:44952 sessionTimeout=60000 watcher=org.apache.solr.common.cloud.ConnectionManager@764591ec
[junit4:junit4]   2> 6894 T2530 oascc.ConnectionManager.waitForConnected Waiting for client to connect to ZooKeeper
[junit4:junit4]   2> 6894 T2600 oaz.ClientCnxn$SendThread.logStartConnect Opening socket connection to server localhost/127.0.0.1:44952. Will not attempt to authenticate using SASL (access denied ("javax.security.auth.AuthPermission" "getLoginConfiguration"))
[junit4:junit4]   2> 6895 T2600 oaz.ClientCnxn$SendThread.primeConnection Socket connection established to localhost/127.0.0.1:44952, initiating session
[junit4:junit4]   2> 6895 T2532 oazs.NIOServerCnxnFactory.run Accepted socket connection from /140.211.11.196:44972
[junit4:junit4]   2> 6896 T2532 oazs.ZooKeeperServer.processConnectRequest Client attempting to establish new session at /140.211.11.196:44972
[junit4:junit4]   2> 6898 T2534 oazs.ZooKeeperServer.finishSessionInit Established session 0x13bb032dfef0009 with negotiated timeout 20000 for client /140.211.11.196:44972
[junit4:junit4]   2> 6898 T2600 oaz.ClientCnxn$SendThread.onConnected Session establishment complete on server localhost/127.0.0.1:44952, sessionid = 0x13bb032dfef0009, negotiated timeout = 20000
[junit4:junit4]   2> 6898 T2601 oascc.ConnectionManager.process Watcher org.apache.solr.common.cloud.ConnectionManager@764591ec name:ZooKeeperConnection Watcher:127.0.0.1:44952 got event WatchedEvent state:SyncConnected type:None path:null path:null type:None
[junit4:junit4]   2> 6899 T2530 oascc.ConnectionManager.waitForConnected Client is connected to ZooKeeper
[junit4:junit4]   2> 6900 T2535 oazs.PrepRequestProcessor.pRequest2Txn Processed session termination for sessionid: 0x13bb032dfef0009
[junit4:junit4]   2> 6936 T2601 oaz.ClientCnxn$EventThread.run EventThread shut down
[junit4:junit4]   2> 6936 T2532 oazs.NIOServerCnxn.closeSock Closed socket connection for client /140.211.11.196:44972 which had sessionid 0x13bb032dfef0009
[junit4:junit4]   2> 6936 T2530 oaz.ZooKeeper.close Session: 0x13bb032dfef0009 closed
[junit4:junit4]   2> 6937 T2530 oascsi.HttpClientUtil.createClient Creating new http client, config:maxConnections=500&maxConnectionsPerHost=16&socketTimeout=15000&connTimeout=30000
[junit4:junit4]   2> 6971 T2530 oaz.ZooKeeper.<init> Initiating client connection, connectString=127.0.0.1:44952/solr sessionTimeout=30000 watcher=org.apache.solr.common.cloud.ConnectionManager@3252a918
[junit4:junit4]   2> 6974 T2602 oaz.ClientCnxn$SendThread.logStartConnect Opening socket connection to server localhost/127.0.0.1:44952. Will not attempt to authenticate using SASL (access denied ("javax.security.auth.AuthPermission" "getLoginConfiguration"))
[junit4:junit4]   2> 6973 T2530 oascc.ConnectionManager.waitForConnected Waiting for client to connect to ZooKeeper
[junit4:junit4]   2> 6974 T2602 oaz.ClientCnxn$SendThread.primeConnection Socket connection established to localhost/127.0.0.1:44952, initiating session
[junit4:junit4]   2> 6975 T2532 oazs.NIOServerCnxnFactory.run Accepted socket connection from /140.211.11.196:44973
[junit4:junit4]   2> 6975 T2532 oazs.ZooKeeperServer.processConnectRequest Client attempting to establish new session at /140.211.11.196:44973
[junit4:junit4]   2> 6976 T2534 oazs.ZooKeeperServer.finishSessionInit Established session 0x13bb032dfef000a with negotiated timeout 20000 for client /140.211.11.196:44973
[junit4:junit4]   2> 6976 T2602 oaz.ClientCnxn$SendThread.onConnected Session establishment complete on server localhost/127.0.0.1:44952, sessionid = 0x13bb032dfef000a, negotiated timeout = 20000
[junit4:junit4]   2> 6977 T2603 oascc.ConnectionManager.process Watcher org.apache.solr.common.cloud.ConnectionManager@3252a918 name:ZooKeeperConnection Watcher:127.0.0.1:44952/solr got event WatchedEvent state:SyncConnected type:None path:null path:null type:None
[junit4:junit4]   2> 6977 T2530 oascc.ConnectionManager.waitForConnected Client is connected to ZooKeeper
[junit4:junit4]   2> 6979 T2535 oazs.PrepRequestProcessor.pRequest Got user-level KeeperException when processing sessionid:0x13bb032dfef000a type:create cxid:0x1 zxid:0x80 txntype:-1 reqpath:n/a Error Path:/solr/overseer Error:KeeperErrorCode = NodeExists for /solr/overseer
[junit4:junit4]   2> 6985 T2535 oazs.PrepRequestProcessor.pRequest Got user-level KeeperException when processing sessionid:0x13bb032dfef000a type:create cxid:0x2 zxid:0x81 txntype:-1 reqpath:n/a Error Path:/solr/overseer Error:KeeperErrorCode = NodeExists for /solr/overseer
[junit4:junit4]   2> 6987 T2530 oasc.ZkController.createEphemeralLiveNode Register node as live in ZooKeeper:/live_nodes/127.0.0.1:44971_
[junit4:junit4]   2> 6988 T2535 oazs.PrepRequestProcessor.pRequest Got user-level KeeperException when processing sessionid:0x13bb032dfef000a type:delete cxid:0x4 zxid:0x82 txntype:-1 reqpath:n/a Error Path:/solr/live_nodes/127.0.0.1:44971_ Error:KeeperErrorCode = NoNode for /solr/live_nodes/127.0.0.1:44971_
[junit4:junit4]   2> 6989 T2530 oascc.SolrZkClient.makePath makePath: /live_nodes/127.0.0.1:44971_
[junit4:junit4]   2> 6992 T2571 oascc.ZkStateReader$2.process A cluster state change: WatchedEvent state:SyncConnected type:NodeChildrenChanged path:/live_nodes, has occurred - updating... (live nodes size: 3)
[junit4:junit4]   2> 6992 T2552 oascc.ZkStateReader$3.process Updating live nodes... (4)
[junit4:junit4]   2> 6992 T2586 oascc.ZkStateReader$3.process Updating live nodes... (4)
[junit4:junit4]   2> 6992 T2558 oascc.ZkStateReader$3.process Updating live nodes... (4)
[junit4:junit4]   2> 6993 T2552 oascc.ZkStateReader$2.process A cluster state change: WatchedEvent state:SyncConnected type:NodeChildrenChanged path:/live_nodes, has occurred - updating... (live nodes size: 4)
[junit4:junit4]   2> 6993 T2558 oascc.ZkStateReader$2.process A cluster state change: WatchedEvent state:SyncConnected type:NodeChildrenChanged path:/live_nodes, has occurred - updating... (live nodes size: 4)
[junit4:junit4]   2> 6994 T2586 oascc.ZkStateReader$2.process A cluster state change: WatchedEvent state:SyncConnected type:NodeChildrenChanged path:/live_nodes, has occurred - updating... (live nodes size: 4)
[junit4:junit4]   2> 6994 T2571 oascc.ZkStateReader$3.process Updating live nodes... (4)
[junit4:junit4]   2> 6995 T2530 oascc.ZkStateReader.createClusterStateWatchersAndUpdate Updating cluster state from ZooKeeper... 
[junit4:junit4]   2> 7004 T2604 oasc.CoreContainer.create Creating SolrCore 'collection1' using instanceDir: /usr/home/hudson/hudson-slave/workspace/Lucene-Solr-Tests-4.x-java7/solr/build/solr-core/test/J0/./org.apache.solr.cloud.SyncSliceTest-jetty3-1355870829063/collection1
[junit4:junit4]   2> 7004 T2604 oasc.ZkController.createCollectionZkNode Check for collection zkNode:collection1
[junit4:junit4]   2> 7005 T2604 oasc.ZkController.createCollectionZkNode Collection zkNode exists
[junit4:junit4]   2> 7005 T2604 oasc.ZkController.readConfigName Load collection config from:/collections/collection1
[junit4:junit4]   2> 7006 T2604 oasc.SolrResourceLoader.<init> new SolrResourceLoader for directory: '/usr/home/hudson/hudson-slave/workspace/Lucene-Solr-Tests-4.x-java7/solr/build/solr-core/test/J0/./org.apache.solr.cloud.SyncSliceTest-jetty3-1355870829063/collection1/'
[junit4:junit4]   2> 7007 T2604 oasc.SolrResourceLoader.replaceClassLoader Adding 'file:/usr/home/hudson/hudson-slave/workspace/Lucene-Solr-Tests-4.x-java7/solr/build/solr-core/test/J0/org.apache.solr.cloud.SyncSliceTest-jetty3-1355870829063/collection1/lib/README' to classloader
[junit4:junit4]   2> 7007 T2604 oasc.SolrResourceLoader.replaceClassLoader Adding 'file:/usr/home/hudson/hudson-slave/workspace/Lucene-Solr-Tests-4.x-java7/solr/build/solr-core/test/J0/org.apache.solr.cloud.SyncSliceTest-jetty3-1355870829063/collection1/lib/classes/' to classloader
[junit4:junit4]   2> 7044 T2604 oasc.SolrConfig.<init> Using Lucene MatchVersion: LUCENE_41
[junit4:junit4]   2> 7093 T2604 oasc.SolrConfig.<init> Loaded SolrConfig: solrconfig.xml
[junit4:junit4]   2> 7122 T2553 oascc.ZkStateReader.updateClusterState Updating cloud state from ZooKeeper... 
[junit4:junit4]   2> 7123 T2553 oasc.Overseer$ClusterStateUpdater.updateState Update state numShards=1 message={
[junit4:junit4]   2> 	  "operation":"state",
[junit4:junit4]   2> 	  "numShards":"1",
[junit4:junit4]   2> 	  "shard":"shard1",
[junit4:junit4]   2> 	  "roles":null,
[junit4:junit4]   2> 	  "state":"recovering",
[junit4:junit4]   2> 	  "core":"collection1",
[junit4:junit4]   2> 	  "collection":"collection1",
[junit4:junit4]   2> 	  "node_name":"127.0.0.1:44966_",
[junit4:junit4]   2> 	  "base_url":"http://127.0.0.1:44966"}
[junit4:junit4]   2> 7128 T2586 oascc.ZkStateReader$2.process A cluster state change: WatchedEvent state:SyncConnected type:NodeDataChanged path:/clusterstate.json, has occurred - updating... (live nodes size: 4)
[junit4:junit4]   2> 7128 T2558 oascc.ZkStateReader$2.process A cluster state change: WatchedEvent state:SyncConnected type:NodeDataChanged path:/clusterstate.json, has occurred - updating... (live nodes size: 4)
[junit4:junit4]   2> 7128 T2571 oascc.ZkStateReader$2.process A cluster state change: WatchedEvent state:SyncConnected type:NodeDataChanged path:/clusterstate.json, has occurred - updating... (live nodes size: 4)
[junit4:junit4]   2> 7128 T2552 oascc.ZkStateReader$2.process A cluster state change: WatchedEvent state:SyncConnected type:NodeDataChanged path:/clusterstate.json, has occurred - updating... (live nodes size: 4)
[junit4:junit4]   2> 7194 T2604 oass.IndexSchema.readSchema Reading Solr Schema
[junit4:junit4]   2> 7194 T2603 oascc.ZkStateReader$2.process A cluster state change: WatchedEvent state:SyncConnected type:NodeDataChanged path:/clusterstate.json, has occurred - updating... (live nodes size: 4)
[junit4:junit4]   2> 7200 T2604 oass.IndexSchema.readSchema Schema name=test
[junit4:junit4]   2> 7639 T2604 oass.OpenExchangeRatesOrgProvider.init Initialized with rates=open-exchange-rates.json, refreshInterval=1440.
[junit4:junit4]   2> 7646 T2604 oass.IndexSchema.readSchema default search field in schema is text
[junit4:junit4]   2> 7649 T2604 oass.IndexSchema.readSchema unique key field: id
[junit4:junit4]   2> 7658 T2604 oass.FileExchangeRateProvider.reload Reloading exchange rates from file currency.xml
[junit4:junit4]   2> 7662 T2604 oass.FileExchangeRateProvider.reload Reloading exchange rates from file currency.xml
[junit4:junit4]   2> 7665 T2604 oass.OpenExchangeRatesOrgProvider.reload Reloading exchange rates from open-exchange-rates.json
[junit4:junit4]   2> 7666 T2604 oass.OpenExchangeRatesOrgProvider.reload Reloading exchange rates from open-exchange-rates.json
[junit4:junit4]   2> 7667 T2604 oasc.SolrCore.<init> [collection1] Opening new SolrCore at /usr/home/hudson/hudson-slave/workspace/Lucene-Solr-Tests-4.x-java7/solr/build/solr-core/test/J0/./org.apache.solr.cloud.SyncSliceTest-jetty3-1355870829063/collection1/, dataDir=./org.apache.solr.cloud.SyncSliceTest-1355870822377/jetty3/
[junit4:junit4]   2> 7667 T2604 oasc.JmxMonitoredMap.<init> JMX monitoring is enabled. Adding Solr mbeans to JMX Server: com.sun.jmx.mbeanserver.JmxMBeanServer@4582c6dc
[junit4:junit4]   2> 7667 T2604 oasc.SolrCore.initDirectoryFactory solr.NRTCachingDirectoryFactory
[junit4:junit4]   2> 7668 T2604 oasc.CachingDirectoryFactory.get return new directory for /usr/home/hudson/hudson-slave/workspace/Lucene-Solr-Tests-4.x-java7/solr/build/solr-core/test/J0/./org.apache.solr.cloud.SyncSliceTest-1355870822377/jetty3 forceNew:false
[junit4:junit4]   2> 7669 T2604 oasc.CachingDirectoryFactory.close Releasing directory:/usr/home/hudson/hudson-slave/workspace/Lucene-Solr-Tests-4.x-java7/solr/build/solr-core/test/J0/./org.apache.solr.cloud.SyncSliceTest-1355870822377/jetty3
[junit4:junit4]   2> 7669 T2604 oasc.SolrCore.getNewIndexDir New index directory detected: old=null new=./org.apache.solr.cloud.SyncSliceTest-1355870822377/jetty3/index/
[junit4:junit4]   2> 7670 T2604 oasc.SolrCore.initIndex WARNING [collection1] Solr index directory './org.apache.solr.cloud.SyncSliceTest-1355870822377/jetty3/index' doesn't exist. Creating new index...
[junit4:junit4]   2> 7670 T2604 oasc.CachingDirectoryFactory.get return new directory for /usr/home/hudson/hudson-slave/workspace/Lucene-Solr-Tests-4.x-java7/solr/build/solr-core/test/J0/./org.apache.solr.cloud.SyncSliceTest-1355870822377/jetty3/index forceNew:false
[junit4:junit4]   2> 7700 T2604 oasc.SolrDeletionPolicy.onCommit SolrDeletionPolicy.onCommit: commits:num=1
[junit4:junit4]   2> 		commit{dir=RateLimitedDirectoryWrapper(NRTCachingDirectory(org.apache.lucene.store.NIOFSDirectory@/usr/home/hudson/hudson-slave/workspace/Lucene-Solr-Tests-4.x-java7/solr/build/solr-core/test/J0/org.apache.solr.cloud.SyncSliceTest-1355870822377/jetty3/index lockFactory=org.apache.lucene.store.NativeFSLockFactory@5e51cc07; maxCacheMB=48.0 maxMergeSizeMB=4.0)),segFN=segments_1,generation=1,filenames=[segments_1]
[junit4:junit4]   2> 7700 T2604 oasc.SolrDeletionPolicy.updateCommits newest commit = 1[segments_1]
[junit4:junit4]   2> 7701 T2604 oasc.CachingDirectoryFactory.close Releasing directory:/usr/home/hudson/hudson-slave/workspace/Lucene-Solr-Tests-4.x-java7/solr/build/solr-core/test/J0/./org.apache.solr.cloud.SyncSliceTest-1355870822377/jetty3/index
[junit4:junit4]   2> 7701 T2604 oasc.SolrCore.initWriters created xml: solr.XMLResponseWriter
[junit4:junit4]   2> 7702 T2604 oasup.UpdateRequestProcessorChain.init inserting DistributedUpdateProcessorFactory into updateRequestProcessorChain "dedupe"
[junit4:junit4]   2> 7703 T2604 oasup.UpdateRequestProcessorChain.init inserting DistributedUpdateProcessorFactory into updateRequestProcessorChain "dedupe-allfields"
[junit4:junit4]   2> 7703 T2604 oasup.UpdateRequestProcessorChain.init inserting DistributedUpdateProcessorFactory into updateRequestProcessorChain "stored_sig"
[junit4:junit4]   2> 7703 T2604 oasup.UpdateRequestProcessorChain.init inserting DistributedUpdateProcessorFactory into updateRequestProcessorChain "uniq-fields"
[junit4:junit4]   2> 7704 T2604 oasup.UpdateRequestProcessorChain.init inserting DistributedUpdateProcessorFactory into updateRequestProcessorChain "distrib-dup-test-chain-implicit"
[junit4:junit4]   2> 7704 T2604 oasc.RequestHandlers.initHandlersFromConfig adding lazy requestHandler: solr.ReplicationHandler
[junit4:junit4]   2> 7704 T2604 oasc.RequestHandlers.initHandlersFromConfig created /replication: solr.ReplicationHandler
[junit4:junit4]   2> 7705 T2604 oasc.RequestHandlers.initHandlersFromConfig created standard: solr.StandardRequestHandler
[junit4:junit4]   2> 7706 T2604 oasc.RequestHandlers.initHandlersFromConfig created /get: solr.RealTimeGetHandler
[junit4:junit4]   2> 7707 T2604 oasc.RequestHandlers.initHandlersFromConfig created dismax: solr.SearchHandler
[junit4:junit4]   2> 7708 T2604 oasc.RequestHandlers.initHandlersFromConfig created mock: org.apache.solr.core.MockQuerySenderListenerReqHandler
[junit4:junit4]   2> 7708 T2604 oasc.RequestHandlers.initHandlersFromConfig created /admin/: org.apache.solr.handler.admin.AdminHandlers
[junit4:junit4]   2> 7709 T2604 oasc.RequestHandlers.initHandlersFromConfig created defaults: solr.StandardRequestHandler
[junit4:junit4]   2> 7709 T2604 oasc.RequestHandlers.initHandlersFromConfig adding lazy requestHandler: solr.StandardRequestHandler
[junit4:junit4]   2> 7709 T2604 oasc.RequestHandlers.initHandlersFromConfig created lazy: solr.StandardRequestHandler
[junit4:junit4]   2> 7710 T2604 oasc.RequestHandlers.initHandlersFromConfig created /update: solr.UpdateRequestHandler
[junit4:junit4]   2> 7711 T2604 oasc.RequestHandlers.initHandlersFromConfig created /terms: org.apache.solr.handler.component.SearchHandler
[junit4:junit4]   2> 7711 T2604 oasc.RequestHandlers.initHandlersFromConfig created spellCheckCompRH: org.apache.solr.handler.component.SearchHandler
[junit4:junit4]   2> 7712 T2604 oasc.RequestHandlers.initHandlersFromConfig created spellCheckCompRH_Direct: org.apache.solr.handler.component.SearchHandler
[junit4:junit4]   2> 7713 T2604 oasc.RequestHandlers.initHandlersFromConfig created spellCheckWithWordbreak: org.apache.solr.handler.component.SearchHandler
[junit4:junit4]   2> 7714 T2604 oasc.RequestHandlers.initHandlersFromConfig created spellCheckWithWordbreak_Direct: org.apache.solr.handler.component.SearchHandler
[junit4:junit4]   2> 7714 T2604 oasc.RequestHandlers.initHandlersFromConfig created spellCheckCompRH1: org.apache.solr.handler.component.SearchHandler
[junit4:junit4]   2> 7715 T2604 oasc.RequestHandlers.initHandlersFromConfig created mltrh: org.apache.solr.handler.component.SearchHandler
[junit4:junit4]   2> 7716 T2604 oasc.RequestHandlers.initHandlersFromConfig created tvrh: org.apache.solr.handler.component.SearchHandler
[junit4:junit4]   2> 7717 T2604 oasc.RequestHandlers.initHandlersFromConfig created /mlt: solr.MoreLikeThisHandler
[junit4:junit4]   2> 7717 T2604 oasc.RequestHandlers.initHandlersFromConfig created /debug/dump: solr.DumpRequestHandler
[junit4:junit4]   2> 7726 T2604 oashl.XMLLoader.init xsltCacheLifetimeSeconds=60
[junit4:junit4]   2> 7729 T2604 oasc.SolrCore.initDeprecatedSupport WARNING solrconfig.xml uses deprecated <admin/gettableFiles>, Please update your config to use the ShowFileRequestHandler.
[junit4:junit4]   2> 7730 T2604 oasc.SolrCore.initDeprecatedSupport WARNING adding ShowFileRequestHandler with hidden files: [SCHEMA.XML, OLD_SYNONYMS.TXT, STOPWORDS.TXT, PROTWORDS.TXT, OPEN-EXCHANGE-RATES.JSON, SYNONYMS.TXT, CURRENCY.XML, MAPPING-ISOLATIN1ACCENT.TXT]
[junit4:junit4]   2> 7732 T2604 oasc.CachingDirectoryFactory.close Releasing directory:/usr/home/hudson/hudson-slave/workspace/Lucene-Solr-Tests-4.x-java7/solr/build/solr-core/test/J0/./org.apache.solr.cloud.SyncSliceTest-1355870822377/jetty3
[junit4:junit4]   2> 7733 T2604 oass.SolrIndexSearcher.<init> Opening Searcher@7b0f5eb6 main
[junit4:junit4]   2> 7734 T2604 oasu.CommitTracker.<init> Hard AutoCommit: disabled
[junit4:junit4]   2> 7735 T2604 oasu.CommitTracker.<init> Soft AutoCommit: disabled
[junit4:junit4]   2> 7735 T2604 oashc.SpellCheckComponent.inform Initializing spell checkers
[junit4:junit4]   2> 7756 T2604 oass.DirectSolrSpellChecker.init init: {name=direct,classname=DirectSolrSpellChecker,field=lowerfilt,minQueryLength=3}
[junit4:junit4]   2> 7913 T2605 oasc.SolrCore.registerSearcher [collection1] Registered new searcher Searcher@7b0f5eb6 main{StandardDirectoryReader(segments_1:1)}
[junit4:junit4]   2> 7916 T2604 oasc.ZkController.publish publishing core=collection1 state=down
[junit4:junit4]   2> 7916 T2604 oasc.ZkController.publish numShards not found on descriptor - reading it from system property
[junit4:junit4]   2> 8141 T2553 oascc.ZkStateReader.updateClusterState Updating cloud state from ZooKeeper... 
[junit4:junit4]   2> 8142 T2553 oasc.Overseer$ClusterStateUpdater.updateState Update state numShards=1 message={
[junit4:junit4]   2> 	  "operation":"state",
[junit4:junit4]   2> 	  "numShards":"1",
[junit4:junit4]   2> 	  "shard":null,
[junit4:junit4]   2> 	  "roles":null,
[junit4:junit4]   2> 	  "state":"down",
[junit4:junit4]   2> 	  "core":"collection1",
[junit4:junit4]   2> 	  "collection":"collection1",
[junit4:junit4]   2> 	  "node_name":"127.0.0.1:44971_",
[junit4:junit4]   2> 	  "base_url":"http://127.0.0.1:44971"}
[junit4:junit4]   2> 8142 T2553 oasc.Overseer$ClusterStateUpdater.updateState Collection already exists with numShards=1
[junit4:junit4]   2> 8142 T2553 oasc.Overseer$ClusterStateUpdater.updateState Assigning new node to shard shard=shard1
[junit4:junit4]   2> 8164 T2558 oascc.ZkStateReader$2.process A cluster state change: WatchedEvent state:SyncConnected type:NodeDataChanged path:/clusterstate.json, has occurred - updating... (live nodes size: 4)
[junit4:junit4]   2> 8164 T2552 oascc.ZkStateReader$2.process A cluster state change: WatchedEvent state:SyncConnected type:NodeDataChanged path:/clusterstate.json, has occurred - updating... (live nodes size: 4)
[junit4:junit4]   2> 8164 T2603 oascc.ZkStateReader$2.process A cluster state change: WatchedEvent state:SyncConnected type:NodeDataChanged path:/clusterstate.json, has occurred - updating... (live nodes size: 4)
[junit4:junit4]   2> 8164 T2571 oascc.ZkStateReader$2.process A cluster state change: WatchedEvent state:SyncConnected type:NodeDataChanged path:/clusterstate.json, has occurred - updating... (live nodes size: 4)
[junit4:junit4]   2> 8164 T2586 oascc.ZkStateReader$2.process A cluster state change: WatchedEvent state:SyncConnected type:NodeDataChanged path:/clusterstate.json, has occurred - updating... (live nodes size: 4)
[junit4:junit4]   2> 8419 T2604 oasc.CoreContainer.registerCore registering core: collection1
[junit4:junit4]   2> 8419 T2604 oasc.ZkController.register Register replica - core:collection1 address:http://127.0.0.1:44971 collection:collection1 shard:shard1
[junit4:junit4]   2> 8422 T2604 oasc.ZkController.register We are http://127.0.0.1:44971/collection1/ and leader is http://127.0.0.1:44959/collection1/
[junit4:junit4]   2> 8422 T2604 oasc.ZkController.register No LogReplay needed for core=collection1 baseURL=http://127.0.0.1:44971
[junit4:junit4]   2> 8423 T2604 oasc.ZkController.checkRecovery Core needs to recover:collection1
[junit4:junit4]   2> 8423 T2604 oasu.DefaultSolrCoreState.doRecovery Running recovery - first canceling any ongoing recovery
[junit4:junit4]   2> ASYNC  NEW_CORE C162 name=collection1 org.apache.solr.core.SolrCore@6ad08296 url=http://127.0.0.1:44971/collection1 node=127.0.0.1:44971_ C162_STATE=coll:collection1 core:collection1 props:{shard=null, roles=null, state=down, core=collection1, collection=collection1, node_name=127.0.0.1:44971_, base_url=http://127.0.0.1:44971}
[junit4:junit4]   2> 8423 T2606 C162 P44971 oasc.RecoveryStrategy.run Starting recovery process.  core=collection1 recoveringAfterStartup=true
[junit4:junit4]   2> 8424 T2606 C162 P44971 oasc.RecoveryStrategy.doRecovery ###### startupVersions=[]
[junit4:junit4]   2> 8424 T2604 oascc.ZkStateReader.updateClusterState Updating cloud state from ZooKeeper... 
[junit4:junit4]   2> 8424 T2606 C162 P44971 oasc.ZkController.publish publishing core=collection1 state=recovering
[junit4:junit4]   2> 8425 T2606 C162 P44971 oasc.ZkController.publish numShards not found on descriptor - reading it from system property
[junit4:junit4]   2> 8425 T2530 oass.SolrDispatchFilter.init user.dir=/usr/home/hudson/hudson-slave/workspace/Lucene-Solr-Tests-4.x-java7/solr/build/solr-core/test/J0
[junit4:junit4]   2> 8427 T2606 C162 P44971 oasc.RecoveryStrategy.doRecovery Attempting to PeerSync from http://127.0.0.1:44959/collection1/ core=collection1 - recoveringAfterStartup=true
[junit4:junit4]   2> 8427 T2606 C162 P44971 oasu.PeerSync.sync PeerSync: core=collection1 url=http://127.0.0.1:44971 START replicas=[http://127.0.0.1:44959/collection1/] nUpdates=100
[junit4:junit4]   2> 8427 T2530 oass.SolrDispatchFilter.init SolrDispatchFilter.init() done
[junit4:junit4]   2> 8427 T2606 C162 P44971 oasu.PeerSync.sync WARNING no frame of reference to tell of we've missed updates
[junit4:junit4]   2> 8428 T2606 C162 P44971 oasc.RecoveryStrategy.doRecovery PeerSync Recovery was not successful - trying replication. core=collection1
[junit4:junit4]   2> 8427 T2530 oascsi.HttpClientUtil.createClient Creating new http client, config:maxConnections=128&maxConnectionsPerHost=32&followRedirects=false
[junit4:junit4]   2> 8428 T2606 C162 P44971 oasc.RecoveryStrategy.doRecovery Starting Replication Recovery. core=collection1
[junit4:junit4]   2> 8428 T2606 C162 P44971 oascsi.HttpClientUtil.createClient Creating new http client, config:maxConnections=128&maxConnectionsPerHost=32&followRedirects=false
[junit4:junit4]   2> 8429 T2561 C161 P44959 REQ /get {distrib=false&qt=/get&wt=javabin&version=2&getVersions=100} status=0 QTime=0 
[junit4:junit4]   2> 8551 T2530 oejs.Server.doStart jetty-8.1.8.v20121106
[junit4:junit4]   2> 8554 T2530 oejs.AbstractConnector.doStart Started SocketConnector@127.0.0.1:44976
[junit4:junit4]   2> 8555 T2530 oasc.SolrResourceLoader.locateSolrHome JNDI not configured for solr (NoInitialContextEx)
[junit4:junit4]   2> 8555 T2530 oasc.SolrResourceLoader.locateSolrHome using system property solr.solr.home: /usr/home/hudson/hudson-slave/workspace/Lucene-Solr-Tests-4.x-java7/solr/build/solr-core/test/J0/./org.apache.solr.cloud.SyncSliceTest-jetty4-1355870830812
[junit4:junit4]   2> 8556 T2530 oasc.SolrResourceLoader.<init> new SolrResourceLoader for deduced Solr Home: '/usr/home/hudson/hudson-slave/workspace/Lucene-Solr-Tests-4.x-java7/solr/build/solr-core/test/J0/./org.apache.solr.cloud.SyncSliceTest-jetty4-1355870830812/'
[junit4:junit4]   2> 8585 T2530 oass.SolrDispatchFilter.init SolrDispatchFilter.init()
[junit4:junit4]   2> 8586 T2530 oasc.SolrResourceLoader.locateSolrHome JNDI not configured for solr (NoInitialContextEx)
[junit4:junit4]   2> 8586 T2530 oasc.SolrResourceLoader.locateSolrHome using system property solr.solr.home: /usr/home/hudson/hudson-slave/workspace/Lucene-Solr-Tests-4.x-java7/solr/build/solr-core/test/J0/./org.apache.solr.cloud.SyncSliceTest-jetty4-1355870830812
[junit4:junit4]   2> 8587 T2530 oasc.CoreContainer$Initializer.initialize looking for solr.xml: /usr/home/hudson/hudson-slave/workspace/Lucene-Solr-Tests-4.x-java7/solr/build/solr-core/test/J0/./org.apache.solr.cloud.SyncSliceTest-jetty4-1355870830812/solr.xml
[junit4:junit4]   2> 8588 T2530 oasc.CoreContainer.<init> New CoreContainer 1722041211
[junit4:junit4]   2> 8588 T2530 oasc.CoreContainer.load Loading CoreContainer using Solr Home: '/usr/home/hudson/hudson-slave/workspace/Lucene-Solr-Tests-4.x-java7/solr/build/solr-core/test/J0/./org.apache.solr.cloud.SyncSliceTest-jetty4-1355870830812/'
[junit4:junit4]   2> 8589 T2530 oasc.SolrResourceLoader.<init> new SolrResourceLoader for directory: '/usr/home/hudson/hudson-slave/workspace/Lucene-Solr-Tests-4.x-java7/solr/build/solr-core/test/J0/./org.apache.solr.cloud.SyncSliceTest-jetty4-1355870830812/'
[junit4:junit4]   2> 8612 T2530 oashc.HttpShardHandlerFactory.getParameter Setting socketTimeout to: 30000
[junit4:junit4]   2> 8614 T2530 oashc.HttpShardHandlerFactory.getParameter Setting urlScheme to: http://
[junit4:junit4]   2> 8614 T2530 oashc.HttpShardHandlerFactory.getParameter Setting connTimeout to: 15000
[junit4:junit4]   2> 8615 T2530 oashc.HttpShardHandlerFactory.getParameter Setting maxConnectionsPerHost to: 20
[junit4:junit4]   2> 8615 T2530 oashc.HttpShardHandlerFactory.getParameter Setting corePoolSize to: 0
[junit4:junit4]   2> 8616 T2530 oashc.HttpShardHandlerFactory.getParameter Setting maximumPoolSize to: 2147483647
[junit4:junit4]   2> 8616 T2530 oashc.HttpShardHandlerFactory.getParameter Setting maxThreadIdleTime to: 5
[junit4:junit4]   2> 8617 T2530 oashc.HttpShardHandlerFactory.getParameter Setting sizeOfQueue to: -1
[junit4:junit4]   2> 8617 T2530 oashc.HttpShardHandlerFactory.getParameter Setting fairnessPolicy to: false
[junit4:junit4]   2> 8618 T2530 oascsi.HttpClientUtil.createClient Creating new http client, config:maxConnectionsPerHost=20&maxConnections=10000&socketTimeout=30000&connTimeout=15000&retry=false
[junit4:junit4]   2> 8631 T2530 oasc.CoreContainer.load Registering Log Listener
[junit4:junit4]   2> 8646 T2530 oasc.CoreContainer.initZooKeeper Zookeeper client=127.0.0.1:44952/solr
[junit4:junit4]   2> 8647 T2530 oasc.ZkController.checkChrootPath zkHost includes chroot
[junit4:junit4]   2> 8648 T2530 oaz.ZooKeeper.<init> Initiating client connection, connectString=127.0.0.1:44952 sessionTimeout=60000 watcher=org.apache.solr.common.cloud.ConnectionManager@73e8fdbc
[junit4:junit4]   2> 8649 T2530 oascc.ConnectionManager.waitForConnected Waiting for client to connect to ZooKeeper
[junit4:junit4]   2> 8649 T2617 oaz.ClientCnxn$SendThread.logStartConnect Opening socket connection to server localhost/127.0.0.1:44952. Will not attempt to authenticate using SASL (access denied ("javax.security.auth.AuthPermission" "getLoginConfiguration"))
[junit4:junit4]   2> 8650 T2617 oaz.ClientCnxn$SendThread.primeConnection Socket connection established to localhost/127.0.0.1:44952, initiating session
[junit4:junit4]   2> 8650 T2532 oazs.NIOServerCnxnFactory.run Accepted socket connection from /140.211.11.196:44977
[junit4:junit4]   2> 8650 T2532 oazs.ZooKeeperServer.processConnectRequest Client attempting to establish new session at /140.211.11.196:44977
[junit4:junit4]   2> 8653 T2617 oaz.ClientCnxn$SendThread.onConnected Session establishment complete on server localhost/127.0.0.1:44952, sessionid = 0x13bb032dfef000b, negotiated timeout = 20000
[junit4:junit4]   2> 8652 T2534 oazs.ZooKeeperServer.finishSessionInit Established session 0x13bb032dfef000b with negotiated timeout 20000 for client /140.211.11.196:44977
[junit4:junit4]   2> 8653 T2618 oascc.ConnectionManager.process Watcher org.apache.solr.common.cloud.ConnectionManager@73e8fdbc name:ZooKeeperConnection Watcher:127.0.0.1:44952 got event WatchedEvent state:SyncConnected type:None path:null path:null type:None
[junit4:junit4]   2> 8653 T2530 oascc.ConnectionManager.waitForConnected Client is connected to ZooKeeper
[junit4:junit4]   2> 8654 T2535 oazs.PrepRequestProcessor.pRequest2Txn Processed session termination for sessionid: 0x13bb032dfef000b
[junit4:junit4]   2> 8667 T2618 oaz.ClientCnxn$EventThread.run EventThread shut down
[junit4:junit4]   2> 8667 T2532 oazs.NIOServerCnxn.closeSock Closed socket connection for client /140.211.11.196:44977 which had sessionid 0x13bb032dfef000b
[junit4:junit4]   2> 8667 T2530 oaz.ZooKeeper.close Session: 0x13bb032dfef000b closed
[junit4:junit4]   2> 8667 T2530 oascsi.HttpClientUtil.createClient Creating new http client, config:maxConnections=500&maxConnectionsPerHost=16&socketTimeout=15000&connTimeout=30000
[junit4:junit4]   2> 8669 T2553 oascc.ZkStateReader.updateClusterState Updating cloud state from ZooKeeper... 
[junit4:junit4]   2> 8669 T2553 oasc.Overseer$ClusterStateUpdater.updateState Update state numShards=1 message={
[junit4:junit4]   2> 	  "operation":"state",
[junit4:junit4]   2> 	  "numShards":"1",
[junit4:junit4]   2> 	  "shard":"shard1",
[junit4:junit4]   2> 	  "roles":null,
[junit4:junit4]   2> 	  "state":"recovering",
[junit4:junit4]   2> 	  "core":"collection1",
[junit4:junit4]   2> 	  "collection":"collection1",
[junit4:junit4]   2> 	  "node_name":"127.0.0.1:44971_",
[junit4:junit4]   2> 	  "base_url":"http://127.0.0.1:44971"}
[junit4:junit4]   2> 8675 T2530 oaz.ZooKeeper.<init> Initiating client connection, connectString=127.0.0.1:44952/solr sessionTimeout=30000 watcher=org.apache.solr.common.cloud.ConnectionManager@5dd263db
[junit4:junit4]   2> 8676 T2530 oascc.ConnectionManager.waitForConnected Waiting for client to connect to ZooKeeper
[junit4:junit4]   2> 8676 T2619 oaz.ClientCnxn$SendThread.logStartConnect Opening socket connection to server localhost/127.0.0.1:44952. Will not attempt to authenticate using SASL (access denied ("javax.security.auth.AuthPermission" "getLoginConfiguration"))
[junit4:junit4]   2> 8677 T2619 oaz.ClientCnxn$SendThread.primeConnection Socket connection established to localhost/127.0.0.1:44952, initiating session
[junit4:junit4]   2> 8677 T2532 oazs.NIOServerCnxnFactory.run Accepted socket connection from /140.211.11.196:44978
[junit4:junit4]   2> 8678 T2532 oazs.ZooKeeperServer.processConnectRequest Client attempting to establish new session at /140.211.11.196:44978
[junit4:junit4]   2> 8681 T2552 oascc.ZkStateReader$2.process A cluster state change: WatchedEvent state:SyncConnected type:NodeDataChanged path:/clusterstate.json, has occurred - updating... (live nodes size: 4)
[junit4:junit4]   2> 8681 T2603 oascc.ZkStateReader$2.process A cluster state change: WatchedEvent state:SyncConnected type:NodeDataChanged path:/clusterstate.json, has occurred - updating... (live nodes size: 4)
[junit4:junit4]   2> 8681 T2586 oascc.ZkStateReader$2.process A cluster state change: WatchedEvent state:SyncConnected type:NodeDataChanged path:/clusterstate.json, has occurred - updating... (live nodes size: 4)
[junit4:junit4]   2> 8681 T2571 oascc.ZkStateReader$2.process A cluster state change: WatchedEvent state:SyncConnected type:NodeDataChanged path:/clusterstate.json, has occurred - updating... (live nodes size: 4)
[junit4:junit4]   2> 8681 T2558 oascc.ZkStateReader$2.process A cluster state change: WatchedEvent state:SyncConnected type:NodeDataChanged path:/clusterstate.json, has occurred - updating... (live nodes size: 4)
[junit4:junit4]   2> 8682 T2534 oazs.ZooKeeperServer.finishSessionInit Established session 0x13bb032dfef000c with negotiated timeout 20000 for client /140.211.11.196:44978
[junit4:junit4]   2> 8682 T2619 oaz.ClientCnxn$SendThread.onConnected Session establishment complete on server localhost/127.0.0.1:44952, sessionid = 0x13bb032dfef000c, negotiated timeout = 20000
[junit4:junit4]   2> 8683 T2620 oascc.ConnectionManager.process Watcher org.apache.solr.common.cloud.ConnectionManager@5dd263db name:ZooKeeperConnection Watcher:127.0.0.1:44952/solr got event WatchedEvent state:SyncConnected type:None path:null path:null type:None
[junit4:junit4]   2> 8683 T2530 oascc.ConnectionManager.waitForConnected Client is connected to ZooKeeper
[junit4:junit4]   2> 8685 T2535 oazs.PrepRequestProcessor.pRequest Got user-level KeeperException when processing sessionid:0x13bb032dfef000c type:create cxid:0x1 zxid:0x97 txntype:-1 reqpath:n/a Error Path:/solr/overseer Error:KeeperErrorCode = NodeExists for /solr/overseer
[junit4:junit4]   2> 8693 T2535 oazs.PrepRequestProcessor.pRequest Got user-level KeeperException when processing sessionid:0x13bb032dfef000c type:create cxid:0x2 zxid:0x98 txntype:-1 reqpath:n/a Error Path:/solr/overseer Error:KeeperErrorCode = NodeExists for /solr/overseer
[junit4:junit4]   2> 8695 T2530 oasc.ZkController.createEphemeralLiveNode Register node as live in ZooKeeper:/live_nodes/127.0.0.1:44976_
[junit4:junit4]   2> 8696 T2535 oazs.PrepRequestProcessor.pRequest Got user-level KeeperException when processing sessionid:0x13bb032dfef000c type:delete cxid:0x4 zxid:0x99 txntype:-1 reqpath:n/a Error Path:/solr/live_nodes/127.0.0.1:44976_ Error:KeeperErrorCode = NoNode for /solr/live_nodes/127.0.0.1:44976_
[junit4:junit4]   2> 8697 T2530 oascc.SolrZkClient.makePath makePath: /live_nodes/127.0.0.1:44976_
[junit4:junit4]   2> 8705 T2571 oascc.ZkStateReader$2.process A cluster state change: WatchedEvent state:SyncConnected type:NodeChildrenChanged path:/live_nodes, has occurred - updating... (live nodes size: 4)
[junit4:junit4]   2> 8705 T2558 oascc.ZkStateReader$3.process Updating live nodes... (5)
[junit4:junit4]   2> 8706 T2586 oascc.ZkStateReader$3.process Updating live nodes... (5)
[junit4:junit4]   2> 8706 T2558 oascc.ZkStateReader$2.process A cluster state change: WatchedEvent state:SyncConnected type:NodeChildrenChanged path:/live_nodes, has occurred - updating... (live nodes size: 5)
[junit4:junit4]   2> 8706 T2552 oascc.ZkStateReader$3.process Updating live nodes... (5)
[junit4:junit4]   2> 8706 T2603 oascc.ZkStateReader$3.process Updating live nodes... (5)
[junit4:junit4]   2> 8706 T2586 oascc.ZkStateReader$2.process A cluster state change: WatchedEvent state:SyncConnected type:NodeChildrenChanged path:/live_nodes, has occurred - updating... (live nodes size: 5)
[junit4:junit4]   2> 8706 T2552 oascc.ZkStateReader$2.process A cluster state change: WatchedEvent state:SyncConnected type:NodeChildrenChanged path:/live_nodes, has occurred - updating... (live nodes size: 5)
[junit4:junit4]   2> 8707 T2571 oascc.ZkStateReader$3.process Updating live nodes... (5)
[junit4:junit4]   2> 8707 T2603 oascc.ZkStateReader$2.process A cluster state change: WatchedEvent state:SyncConnected type:NodeChildrenChanged path:/live_nodes, has occurred - updating... (live nodes size: 5)
[junit4:junit4]   2> 8709 T2530 oascc.ZkStateReader.createClusterStateWatchersAndUpdate Updating cluster state from ZooKeeper... 
[junit4:junit4]   2> 8716 T2621 oasc.CoreContainer.create Creating SolrCore 'collection1' using instanceDir: /usr/home/hudson/hudson-slave/workspace/Lucene-Solr-Tests-4.x-java7/solr/build/solr-core/test/J0/./org.apache.solr.cloud.SyncSliceTest-jetty4-1355870830812/collection1
[junit4:junit4]   2> 8716 T2621 oasc.ZkController.createCollectionZkNode Check for collection zkNode:collection1
[junit4:junit4]   2> 8717 T2621 oasc.ZkController.createCollectionZkNode Collection zkNode exists
[junit4:junit4]   2> 8717 T2621 oasc.ZkController.readConfigName Load collection config from:/collections/collection1
[junit4:junit4]   2> 8719 T2621 oasc.SolrResourceLoader.<init> new SolrResourceLoader for directory: '/usr/home/hudson/hudson-slave/workspace/Lucene-Solr-Tests-4.x-java7/solr/build/solr-core/test/J0/./org.apache.solr.cloud.SyncSliceTest-jetty4-1355870830812/collection1/'
[junit4:junit4]   2> 8720 T2621 oasc.SolrResourceLoader.replaceClassLoader Adding 'file:/usr/home/hudson/hudson-slave/workspace/Lucene-Solr-Tests-4.x-java7/solr/build/solr-core/test/J0/org.apache.solr.cloud.SyncSliceTest-jetty4-1355870830812/collection1/lib/classes/' to classloader
[junit4:junit4]   2> 8720 T2621 oasc.SolrResourceLoader.replaceClassLoader Adding 'file:/usr/home/hudson/hudson-slave/workspace/Lucene-Solr-Tests-4.x-java7/solr/build/solr-core/test/J0/org.apache.solr.cloud.SyncSliceTest-jetty4-1355870830812/collection1/lib/README' to classloader
[junit4:junit4]   2> 8757 T2621 oasc.SolrConfig.<init> Using Lucene MatchVersion: LUCENE_41
[junit4:junit4]   2> 8806 T2621 oasc.SolrConfig.<init> Loaded SolrConfig: solrconfig.xml
[junit4:junit4]   2> 8907 T2621 oass.IndexSchema.readSchema Reading Solr Schema
[junit4:junit4]   2> 8913 T2621 oass.IndexSchema.readSchema Schema name=test
[junit4:junit4]   2> 9365 T2621 oass.OpenExchangeRatesOrgProvider.init Initialized with rates=open-exchange-rates.json, refreshInterval=1440.
[junit4:junit4]   2> 9372 T2621 oass.IndexSchema.readSchema default search field in schema is text
[junit4:junit4]   2> 9375 T2621 oass.IndexSchema.readSchema unique key field: id
[junit4:junit4]   2> 9386 T2621 oass.FileExchangeRateProvider.reload Reloading exchange rates from file currency.xml
[junit4:junit4]   2> 9390 T2621 oass.FileExchangeRateProvider.reload Reloading exchange rates from file currency.xml
[junit4:junit4]   2> 9393 T2621 oass.OpenExchangeRatesOrgProvider.reload Reloading exchange rates from open-exchange-rates.json
[junit4:junit4]   2> 9394 T2621 oass.OpenExchangeRatesOrgProvider.reload Reloading exchange rates from open-exchange-rates.json
[junit4:junit4]   2> 9395 T2621 oasc.SolrCore.<init> [collection1] Opening new SolrCore at /usr/home/hudson/hudson-slave/workspace/Lucene-Solr-Tests-4.x-java7/solr/build/solr-core/test/J0/./org.apache.solr.cloud.SyncSliceTest-jetty4-1355870830812/collection1/, dataDir=./org.apache.solr.cloud.SyncSliceTest-1355870822377/jetty4/
[junit4:junit4]   2> 9395 T2621 oasc.JmxMonitoredMap.<init> JMX monitoring is enabled. Adding Solr mbeans to JMX Server: com.sun.jmx.mbeanserver.JmxMBeanServer@4582c6dc
[junit4:junit4]   2> 9396 T2621 oasc.SolrCore.initDirectoryFactory solr.NRTCachingDirectoryFactory
[junit4:junit4]   2> 9396 T2621 oasc.CachingDirectoryFactory.get return new directory for /usr/home/hudson/hudson-slave/workspace/Lucene-Solr-Tests-4.x-java7/solr/build/solr-core/test/J0/./org.apache.solr.cloud.SyncSliceTest-1355870822377/jetty4 forceNew:false
[junit4:junit4]   2> 9397 T2621 oasc.CachingDirectoryFactory.close Releasing directory:/usr/home/hudson/hudson-slave/workspace/Lucene-Solr-Tests-4.x-java7/solr/build/solr-core/test/J0/./org.apache.solr.cloud.SyncSliceTest-1355870822377/jetty4
[junit4:junit4]   2> 9397 T2621 oasc.SolrCore.getNewIndexDir New index directory detected: old=null new=./org.apache.solr.cloud.SyncSliceTest-1355870822377/jetty4/index/
[junit4:junit4]   2> 9398 T2621 oasc.SolrCore.initIndex WARNING [collection1] Solr index directory './org.apache.solr.cloud.SyncSliceTest-1355870822377/jetty4/index' doesn't exist. Creating new index...
[junit4:junit4]   2> 9398 T2621 oasc.CachingDirectoryFactory.get return new directory for /usr/home/hudson/hudson-slave/workspace/Lucene-Solr-Tests-4.x-java7/solr/build/solr-core/test/J0/./org.apache.solr.cloud.SyncSliceTest-1355870822377/jetty4/index forceNew:false
[junit4:junit4]   2> 9429 T2621 oasc.SolrDeletionPolicy.onCommit SolrDeletionPolicy.onCommit: commits:num=1
[junit4:junit4]   2> 		commit{dir=RateLimitedDirectoryWrapper(NRTCachingDirectory(org.apache.lucene.store.NIOFSDirectory@/usr/home/hudson/hudson-slave/workspace/Lucene-Solr-Tests-4.x-java7/solr/build/solr-core/test/J0/org.apache.solr.cloud.SyncSliceTest-1355870822377/jetty4/index lockFactory=org.apache.lucene.store.NativeFSLockFactory@2d5bab9; maxCacheMB=48.0 maxMergeSizeMB=4.0)),segFN=segments_1,generation=1,filenames=[segments_1]
[junit4:junit4]   2> 9429 T2621 oasc.SolrDeletionPolicy.updateCommits newest commit = 1[segments_1]
[junit4:junit4]   2> 9430 T2621 oasc.CachingDirectoryFactory.close Releasing directory:/usr/home/hudson/hudson-slave/workspace/Lucene-Solr-Tests-4.x-java7/solr/build/solr-core/test/J0/./org.apache.solr.cloud.SyncSliceTest-1355870822377/jetty4/index
[junit4:junit4]   2> 9430 T2621 oasc.SolrCore.initWriters created xml: solr.XMLResponseWriter
[junit4:junit4]   2> 9432 T2621 oasup.UpdateRequestProcessorChain.init inserting DistributedUpdateProcessorFactory into updateRequestProcessorChain "dedupe"
[junit4:junit4]   2> 9432 T2621 oasup.UpdateRequestProcessorChain.init inserting DistributedUpdateProcessorFactory into updateRequestProcessorChain "dedupe-allfields"
[junit4:junit4]   2> 9432 T2621 oasup.UpdateRequestProcessorChain.init inserting DistributedUpdateProcessorFactory into updateRequestProcessorChain "stored_sig"
[junit4:junit4]   2> 9433 T2621 oasup.UpdateRequestProcessorChain.init inserting DistributedUpdateProcessorFactory into updateRequestProcessorChain "uniq-fields"
[junit4:junit4]   2> 9433 T2621 oasup.UpdateRequestProcessorChain.init inserting DistributedUpdateProcessorFactory into updateRequestProcessorChain "distrib-dup-test-chain-implicit"
[junit4:junit4]   2> 9433 T2621 oasc.RequestHandlers.initHandlersFromConfig adding lazy requestHandler: solr.ReplicationHandler
[junit4:junit4]   2> 9434 T2621 oasc.RequestHandlers.initHandlersFromConfig created /replication: solr.ReplicationHandler
[junit4:junit4]   2> 9435 T2621 oasc.RequestHandlers.initHandlersFromConfig created standard: solr.StandardRequestHandler
[junit4:junit4]   2> 9435 T2621 oasc.RequestHandlers.initHandlersFromConfig created /get: solr.RealTimeGetHandler
[junit4:junit4]   2> 9436 T2621 oasc.RequestHandlers.initHandlersFromConfig created dismax: solr.SearchHandler
[junit4:junit4]   2> 9437 T2621 oasc.RequestHandlers.initHandlersFromConfig created mock: org.apache.solr.core.MockQuerySenderListenerReqHandler
[junit4:junit4]   2> 9437 T2621 oasc.RequestHandlers.initHandlersFromConfig created /admin/: org.apache.solr.handler.admin.AdminHandlers
[junit4:junit4]   2> 9438 T2621 oasc.RequestHandlers.initHandlersFromConfig created defaults: solr.StandardRequestHandler
[junit4:junit4]   2> 9438 T2621 oasc.RequestHandlers.initHandlersFromConfig adding lazy requestHandler: solr.StandardRequestHandler
[junit4:junit4]   2> 9439 T2621 oasc.RequestHandlers.initHandlersFromConfig created lazy: solr.StandardRequestHandler
[junit4:junit4]   2> 9439 T2621 oasc.RequestHandlers.initHandlersFromConfig created /update: solr.UpdateRequestHandler
[junit4:junit4]   2> 9440 T2621 oasc.RequestHandlers.initHandlersFromConfig created /terms: org.apache.solr.handler.component.SearchHandler
[junit4:junit4]   2> 9441 T2621 oasc.RequestHandlers.initHandlersFromConfig created spellCheckCompRH: org.apache.solr.handler.component.SearchHandler
[junit4:junit4]   2> 9441 T2621 oasc.RequestHandlers.initHandlersFromConfig created spellCheckCompRH_Direct: org.apache.solr.handler.component.SearchHandler
[junit4:junit4]   2> 9442 T2621 oasc.RequestHandlers.initHandlersFromConfig created spellCheckWithWordbreak: org.apache.solr.handler.component.SearchHandler
[junit4:junit4]   2> 9443 T2621 oasc.RequestHandlers.initHandlersFromConfig created spellCheckWithWordbreak_Direct: org.apache.solr.handler.component.SearchHandler
[junit4:junit4]   2> 9444 T2621 oasc.RequestHandlers.initHandlersFromConfig created spellCheckCompRH1: org.apache.solr.handler.component.SearchHandler
[junit4:junit4]   2> 9444 T2621 oasc.RequestHandlers.initHandlersFromConfig created mltrh: org.apache.solr.handler.component.SearchHandler
[junit4:junit4]   2> 9445 T2621 oasc.RequestHandlers.initHandlersFromConfig created tvrh: org.apache.solr.handler.component.SearchHandler
[junit4:junit4]   2> 9446 T2621 oasc.RequestHandlers.initHandlersFromConfig created /mlt: solr.MoreLikeThisHandler
[junit4:junit4]   2> 9447 T2621 oasc.RequestHandlers.initHandlersFromConfig created /debug/dump: solr.DumpRequestHandler
[junit4:junit4]   2> 9455 T2621 oashl.XMLLoader.init xsltCacheLifetimeSeconds=60
[junit4:junit4]   2> 9458 T2621 oasc.SolrCore.initDeprecatedSupport WARNING solrconfig.xml uses deprecated <admin/gettableFiles>, Please update your config to use the ShowFileRequestHandler.
[junit4:junit4]   2> 9460 T2621 oasc.SolrCore.initDeprecatedSupport WARNING adding ShowFileRequestHandler with hidden files: [SCHEMA.XML, OLD_SYNONYMS.TXT, STOPWORDS.TXT, PROTWORDS.TXT, OPEN-EXCHANGE-RATES.JSON, SYNONYMS.TXT, CURRENCY.XML, MAPPING-ISOLATIN1ACCENT.TXT]
[junit4:junit4]   2> 9461 T2621 oasc.CachingDirectoryFactory.close Releasing directory:/usr/home/hudson/hudson-slave/workspace/Lucene-Solr-Tests-4.x-java7/solr/build/solr-core/test/J0/./org.apache.solr.cloud.SyncSliceTest-1355870822377/jetty4
[junit4:junit4]   2> 9463 T2621 oass.SolrIndexSearcher.<init> Opening Searcher@60c022e main
[junit4:junit4]   2> 9464 T2621 oasu.CommitTracker.<init> Hard AutoCommit: disabled
[junit4:junit4]   2> 9464 T2621 oasu.CommitTracker.<init> Soft AutoCommit: disabled
[junit4:junit4]   2> 9464 T2621 oashc.SpellCheckComponent.inform Initializing spell checkers
[junit4:junit4]   2> 9470 T2621 oass.DirectSolrSpellChecker.init init: {name=direct,classname=DirectSolrSpellChecker,field=lowerfilt,minQueryLength=3}
[junit4:junit4]   2> 9522 T2622 oasc.SolrCore.registerSearcher [collection1] Registered new searcher Searcher@60c022e main{StandardDirectoryReader(segments_1:1)}
[junit4:junit4]   2> 9527 T2621 oasc.ZkController.publish publishing core=collection1 state=down
[junit4:junit4]   2> 9527 T2621 oasc.ZkController.publish numShards not found on descriptor - reading it from system property
[junit4:junit4]   2>  C160_STATE=coll:collection1 core:collection1 props:{shard=shard1, roles=null, state=recovering, core=collection1, collection=collection1, node_name=127.0.0.1:44966_, base_url=http://127.0.0.1:44966}
[junit4:junit4]   2> 9696 T2589 C160 P44966 oasc.RecoveryStrategy.doRecovery Begin buffering updates. core=collection1
[junit4:junit4]   2> 9696 T2589 C160 P44966 oasu.UpdateLog.bufferUpdates Starting to buffer updates. FSUpdateLog{state=ACTIVE, tlog=null}
[junit4:junit4]   2> 9696 T2589 C160 P44966 oasc.RecoveryStrategy.replicate Attempting to replicate from http://127.0.0.1:44959/collection1/. core=collection1
[junit4:junit4]   2> 9697 T2589 C160 P44966 oascsi.HttpClientUtil.createClient Creating new http client, config:maxConnections=128&maxConnectionsPerHost=32&followRedirects=false
[junit4:junit4]   2> 9697 T2553 oascc.ZkStateReader.updateClusterState Updating cloud state from ZooKeeper... 
[junit4:junit4]   2> 9698 T2553 oasc.Overseer$ClusterStateUpdater.updateState Update state numShards=1 message={
[junit4:junit4]   2> 	  "operation":"state",
[junit4:junit4]   2> 	  "numShards":"1",
[junit4:junit4]   2> 	  "shard":null,
[junit4:junit4]   2> 	  "roles":null,
[junit4:junit4]   2> 	  "state":"down",
[junit4:junit4]   2> 	  "core":"collection1",
[junit4:junit4]   2> 	  "collection":"collection1",
[junit4:junit4]   2> 	  "node_name":"127.0.0.1:44976_",
[junit4:junit4]   2> 	  "base_url":"http://127.0.0.1:44976"}
[junit4:junit4]   2> 9699 T2553 oasc.Overseer$ClusterStateUpdater.updateState Collection already exists with numShards=1
[junit4:junit4]   2> 9699 T2553 oasc.Overseer$ClusterStateUpdater.updateState Assigning new node to shard shard=shard1
[junit4:junit4]   2> 9711 T2564 C161 P44959 oasu.DirectUpdateHandler2.commit start commit{flags=0,_version_=0,optimize=false,openSearcher=false,waitSearcher=true,expungeDeletes=false,softCommit=false}
[junit4:junit4]   2> 9712 T2571 oascc.ZkStateReader$2.process A cluster state change: WatchedEvent state:SyncConnected type:NodeDataChanged path:/clusterstate.json, has occurred - updating... (live nodes size: 5)
[junit4:junit4]   2> 9713 T2558 oascc.ZkStateReader$2.process A cluster state change: WatchedEvent state:SyncConnected type:NodeDataChanged path:/clusterstate.json, has occurred - updating... (live nodes size: 5)
[junit4:junit4]   2> 9713 T2620 oascc.ZkStateReader$2.process A cluster state change: WatchedEvent state:SyncConnected type:NodeDataChanged path:/clusterstate.json, has occurred - updating... (live nodes size: 5)
[junit4:junit4]   2> 9712 T2586 oascc.ZkStateReader$2.process A cluster state change: WatchedEvent state:SyncConnected type:NodeDataChanged path:/clusterstate.json, has occurred - updating... (live nodes size: 5)
[junit4:junit4]   2> 9713 T2603 oascc.ZkStateReader$2.process A cluster state change: WatchedEvent state:SyncConnected type:NodeDataChanged path:/clusterstate.json, has occurred - updating... (live nodes size: 5)
[junit4:junit4]   2> 9712 T2552 oascc.ZkStateReader$2.process A cluster state change: WatchedEvent state:SyncConnected type:NodeDataChanged path:/clusterstate.json, has occurred - updating... (live nodes size: 5)
[junit4:junit4]   2> 9713 T2564 C161 P44959 oasc.CachingDirectoryFactory.close Releasing directory:/usr/home/hudson/hudson-slave/workspace/Lucene-Solr-Tests-4.x-java7/solr/build/solr-core/test/J0/./org.apache.solr.cloud.SyncSliceTest-1355870822377/jetty1
[junit4:junit4]   2> 9719 T2564 C161 P44959 oasc.SolrDeletionPolicy.onInit SolrDeletionPolicy.onInit: commits:num=1
[junit4:junit4]   2> 		commit{dir=RateLimitedDirectoryWrapper(NRTCachingDirectory(org.apache.lucene.store.NIOFSDirectory@/usr/home/hudson/hudson-slave/workspace/Lucene-Solr-Tests-4.x-java7/solr/build/solr-core/test/J0/org.apache.solr.cloud.SyncSliceTest-1355870822377/jetty1/index lockFactory=org.apache.lucene.store.NativeFSLockFactory@2e73e8bf; maxCacheMB=48.0 maxMergeSizeMB=4.0)),segFN=segments_1,generation=1,filenames=[segments_1]
[junit4:junit4]   2> 9720 T2564 C161 P44959 oasc.SolrDeletionPolicy.updateCommits newest commit = 1[segments_1]
[junit4:junit4]   2> 9724 T2564 C161 P44959 oasc.SolrDeletionPolicy.onCommit SolrDeletionPolicy.onCommit: commits:num=2
[junit4:junit4]   2> 		commit{dir=RateLimitedDirectoryWrapper(NRTCachingDirectory(org.apache.lucene.store.NIOFSDirectory@/usr/home/hudson/hudson-slave/workspace/Lucene-Solr-Tests-4.x-java7/solr/build/solr-core/test/J0/org.apache.solr.cloud.SyncSliceTest-1355870822377/jetty1/index lockFactory=org.apache.lucene.store.NativeFSLockFactory@2e73e8bf; maxCacheMB=48.0 maxMergeSizeMB=4.0)),segFN=segments_1,generation=1,filenames=[segments_1]
[junit4:junit4]   2> 		commit{dir=RateLimitedDirectoryWrapper(NRTCachingDirectory(org.apache.lucene.store.NIOFSDirectory@/usr/home/hudson/hudson-slave/workspace/Lucene-Solr-Tests-4.x-java7/solr/build/solr-core/test/J0/org.apache.solr.cloud.SyncSliceTest-1355870822377/jetty1/index lockFactory=org.apache.lucene.store.NativeFSLockFactory@2e73e8bf; maxCacheMB=48.0 maxMergeSizeMB=4.0)),segFN=segments_2,generation=2,filenames=[segments_2]
[junit4:junit4]   2> 9725 T2564 C161 P44959 oasc.SolrDeletionPolicy.updateCommits newest commit = 2[segments_2]
[junit4:junit4]   2> 9726 T2564 C161 P44959 oasc.CachingDirectoryFactory.close Releasing directory:/usr/home/hudson/hudson-slave/workspace/Lucene-Solr-Tests-4.x-java7/solr/build/solr-core/test/J0/./org.apache.solr.cloud.SyncSliceTest-1355870822377/jetty1
[junit4:junit4]   2> 9727 T2564 C161 P44959 oass.SolrIndexSearcher.<init> Opening Searcher@713b4aa5 realtime
[junit4:junit4]   2> 9727 T2564 C161 P44959 oasu.DirectUpdateHandler2.commit end_commit_flush
[junit4:junit4]   2> 9728 T2564 C161 P44959 /update {waitSearcher=true&openSearcher=false&commit=true&commit_end_point=true&wt=javabin&softCommit=false&version=2} {commit=} 0 18
[junit4:junit4]   2> 9729 T2589 C160 P44966 oash.ReplicationHandler.inform Commits will be reserved for  10000
[junit4:junit4]   2> 9729 T2589 C160 P44966 oash.SnapPuller.<init>  No value set for 'pollInterval'. Timer Task not started.
[junit4:junit4]   2> 9732 T2565 C161 P44959 oash.ReplicationHandler.inform Commits will be reserved for  10000
[junit4:junit4]   2> 9733 T2565 C161 P44959 REQ /replication {command=indexversion&wt=javabin&qt=/replication&version=2} status=0 QTime=2 
[junit4:junit4]   2> 9733 T2589 C160 P44966 oash.SnapPuller.fetchLatestIndex Master's generation: 2
[junit4:junit4]   2> 9734 T2589 C160 P44966 oash.SnapPuller.fetchLatestIndex Slave's generation: 1
[junit4:junit4]   2> 9734 T2589 C160 P44966 oash.SnapPuller.fetchLatestIndex Starting replication process
[junit4:junit4]   2> 9736 T2565 C161 P44959 oasc.CachingDirectoryFactory.close Releasing directory:/usr/home/hudson/hudson-slave/workspace/Lucene-Solr-Tests-4.x-java7/solr/build/solr-core/test/J0/./org.apache.solr.cloud.SyncSliceTest-1355870822377/jetty1
[junit4:junit4]   2> 9737 T2565 C161 P44959 oasc.CachingDirectoryFactory.close Releasing directory:/usr/home/hudson/hudson-slave/workspace/Lucene-Solr-Tests-4.x-java7/solr/build/solr-core/test/J0/./org.apache.solr.cloud.SyncSliceTest-1355870822377/jetty1/index
[junit4:junit4]   2> 9738 T2565 C161 P44959 REQ /replication {command=filelist&generation=2&wt=javabin&qt=/replication&version=2} status=0 QTime=2 
[junit4:junit4]   2> 9738 T2589 C160 P44966 oash.SnapPuller.fetchLatestIndex Number of files in latest index in master: 1
[junit4:junit4]   2> 9739 T2589 C160 P44966 oasc.CachingDirectoryFactory.get return new directory for /usr/home/hudson/hudson-slave/workspace/Lucene-Solr-Tests-4.x-java7/solr/build/solr-core/test/J0/./org.apache.solr.cloud.SyncSliceTest-1355870822377/jetty2/index.20121218174712111 forceNew:false
[junit4:junit4]   2> 9740 T2589 C160 P44966 oasc.CachingDirectoryFactory.close Releasing directory:/usr/home/hudson/hudson-slave/workspace/Lucene-Solr-Tests-4.x-java7/solr/build/solr-core/test/J0/./org.apache.solr.cloud.SyncSliceTest-1355870822377/jetty2
[junit4:junit4]   2> 9741 T2589 C160 P44966 oash.SnapPuller.fetchLatestIndex Starting download to RateLimitedDirectoryWrapper(NRTCachingDirectory(org.apache.lucene.store.NIOFSDirectory@/usr/home/hudson/hudson-slave/workspace/Lucene-Solr-Tests-4.x-java7/solr/build/solr-core/test/J0/org.apache.solr.cloud.SyncSliceTest-1355870822377/jetty2/index.20121218174712111 lockFactory=org.apache.lucene.store.NativeFSLockFactory@6aeaee15; maxCacheMB=48.0 maxMergeSizeMB=4.0)) fullCopy=true
[junit4:junit4]   2> 9752 T2565 C161 P44959 REQ /replication {file=segments_2&command=filecontent&checksum=true&generation=2&qt=/replication&wt=filestream} status=0 QTime=1 
[junit4:junit4]   2> 9755 T2589 C160 P44966 oasc.CachingDirectoryFactory.close Releasing directory:/usr/home/hudson/hudson-slave/workspace/Lucene-Solr-Tests-4.x-java7/solr/build/solr-core/test/J0/./org.apache.solr.cloud.SyncSliceTest-1355870822377/jetty2/index
[junit4:junit4]   2> 9755 T2589 C160 P44966 oash.SnapPuller.fetchLatestIndex Total time taken for download : 0 secs
[junit4:junit4]   2> 9757 T2589 C160 P44966 oash.SnapPuller.modifyIndexProps New index installed. Updating index properties... index=index.20121218174712111
[junit4:junit4]   2> 9758 T2589 C160 P44966 oasc.CachingDirectoryFactory.close Releasing directory:/usr/home/hudson/hudson-slave/workspace/Lucene-Solr-Tests-4.x-java7/solr/build/solr-core/test/J0/./org.apache.solr.cloud.SyncSliceTest-1355870822377/jetty2
[junit4:junit4]   2> 9758 T2589 C160 P44966 oasc.CachingDirectoryFactory.close Releasing directory:/usr/home/hudson/hudson-slave/workspace/Lucene-Solr-Tests-4.x-java7/solr/build/solr-core/test/J0/./org.apache.solr.cloud.SyncSliceTest-1355870822377/jetty2
[junit4:junit4]   2> 9758 T2589 C160 P44966 oasc.SolrCore.getNewIndexDir New index directory detected: old=./org.apache.solr.cloud.SyncSliceTest-1355870822377/jetty2/index/ new=./org.apache.solr.cloud.SyncSliceTest-1355870822377/jetty2/index.20121218174712111
[junit4:junit4]   2> 9761 T2589 C160 P44966 oasc.SolrDeletionPolicy.onInit SolrDeletionPolicy.onInit: commits:num=1
[junit4:junit4]   2> 		commit{dir=RateLimitedDirectoryWrapper(NRTCachingDirectory(org.apache.lucene.store.NIOFSDirectory@/usr/home/hudson/hudson-slave/workspace/Lucene-Solr-Tests-4.x-java7/solr/build/solr-core/test/J0/org.apache.solr.cloud.SyncSliceTest-1355870822377/jetty2/index.20121218174712111 lockFactory=org.apache.lucene.store.NativeFSLockFactory@6aeaee15; maxCacheMB=48.0 maxMergeSizeMB=4.0)),segFN=segments_2,generation=2,filenames=[segments_2]
[junit4:junit4]   2> 9762 T2589 C160 P44966 oasc.SolrDeletionPolicy.updateCommits newest commit = 2[segments_2]
[junit4:junit4]   2> 9763 T2589 C160 P44966 oasc.CachingDirectoryFactory.close Releasing directory:/usr/home/hudson/hudson-slave/workspace/Lucene-Solr-Tests-4.x-java7/solr/build/solr-core/test/J0/./org.apache.solr.cloud.SyncSliceTest-1355870822377/jetty2
[junit4:junit4]   2> 9763 T2589 C160 P44966 oasu.DefaultSolrCoreState.newIndexWriter Creating new IndexWriter...
[junit4:junit4]   2> 9764 T2589 C160 P44966 oasu.DefaultSolrCoreState.newIndexWriter Waiting until IndexWriter is unused... core=collection1
[junit4:junit4]   2> 9764 T2589 C160 P44966 oasu.DefaultSolrCoreState.newIndexWriter Rollback old IndexWriter... core=collection1
[junit4:junit4]   2> 9764 T2589 C160 P44966 oasc.CachingDirectoryFactory.close Releasing directory:/usr/home/hudson/hudson-slave/workspace/Lucene-Solr-Tests-4.x-java7/solr/build/solr-core/test/J0/./org.apache.solr.cloud.SyncSliceTest-1355870822377/jetty2/index.20121218174712111
[junit4:junit4]   2> 9765 T2589 C160 P44966 oasc.CachingDirectoryFactory.close Releasing directory:/usr/home/hudson/hudson-slave/workspace/Lucene-Solr-Tests-4.x-java7/solr/build/solr-core/test/J0/./org.apache.solr.cloud.SyncSliceTest-1355870822377/jetty2
[junit4:junit4]   2> 9767 T2589 C160 P44966 oasc.SolrDeletionPolicy.onInit SolrDeletionPolicy.onInit: commits:num=1
[junit4:junit4]   2> 		commit{dir=RateLimitedDirectoryWrapper(NRTCachingDirectory(org.apache.lucene.store.NIOFSDirectory@/usr/home/hudson/hudson-slave/workspace/Lucene-Solr-Tests-4.x-java7/solr/build/solr-core/test/J0/org.apache.solr.cloud.SyncSliceTest-1355870822377/jetty2/index.20121218174712111 lockFactory=org.apache.lucene.store.NativeFSLockFactory@6aeaee15; maxCacheMB=48.0 maxMergeSizeMB=4.0)),segFN=segments_2,generation=2,filenames=[segments_2]
[junit4:junit4]   2> 9768 T2589 C160 P44966 oasc.SolrDeletionPolicy.updateCommits newest commit = 2[segments_2]
[junit4:junit4]   2> 9768 T2589 C160 P44966 oasu.DefaultSolrCoreState.newIndexWriter New IndexWriter is ready to be used.
[junit4:junit4]   2> 9768 T2589 C160 P44966 oasc.CachingDirectoryFactory.close Releasing directory:/usr/home/hudson/hudson-slave/workspace/Lucene-Solr-Tests-4.x-java7/solr/build/solr-core/test/J0/./org.apache.solr.cloud.SyncSliceTest-1355870822377/jetty2
[junit4:junit4]   2> 9768 T2589 C160 P44966 oass.SolrIndexSearcher.<init> Opening Searcher@1a793f5d main
[junit4:junit4]   2> 9770 T2588 oasc.SolrCore.registerSearcher [collection1] Registered new searcher Searcher@1a793f5d main{StandardDirectoryReader(segments_2:1:nrt)}
[junit4:junit4]   2> 9771 T2588 oasc.CachingDirectoryFactory.close Releasing directory:/usr/home/hudson/hudson-slave/workspace/Lucene-Solr-Tests-4.x-java7/solr/build/solr-core/test/J0/./org.apache.solr.cloud.SyncSliceTest-1355870822377/jetty2/index
[junit4:junit4]   2> 9771 T2589 C160 P44966 oasu.DirectUpdateHandler2.commit start commit{flags=0,_version_=0,optimize=false,openSearcher=false,waitSearcher=false,expungeDeletes=false,softCommit=false}
[junit4:junit4]   2> 9773 T2589 C160 P44966 oasc.SolrDeletionPolicy.onCommit SolrDeletionPolicy.onCommit: commits:num=2
[junit4:junit4]   2> 		commit{dir=RateLimitedDirectoryWrapper(NRTCachingDirectory(org.apache.lucene.store.NIOFSDirectory@/usr/home/hudson/hudson-slave/workspace/Lucene-Solr-Tests-4.x-java7/solr/build/solr-core/test/J0/org.apache.solr.cloud.SyncSliceTest-1355870822377/jetty2/index.20121218174712111 lockFactory=org.apache.lucene.store.NativeFSLockFactory@6aeaee15; maxCacheMB=48.0 maxMergeSizeMB=4.0)),segFN=segments_2,generation=2,filenames=[segments_2]
[junit4:junit4]   2> 		commit{dir=RateLimitedDirectoryWrapper(NRTCachingDirectory(org.apache.lucene.store.NIOFSDirectory@/usr/home/hudson/hudson-slave/workspace/Lucene-Solr-Tests-4.x-java7/solr/build/solr-core/test/J0/org.apache.solr.cloud.SyncSliceTest-1355870822377/jetty2/index.20121218174712111 lockFactory=org.apache.lucene.store.NativeFSLockFactory@6aeaee15; maxCacheMB=48.0 maxMergeSizeMB=4.0)),segFN=segments_3,generation=3,filenames=[segments_3]
[junit4:junit4]   2> 9774 T2589 C160 P44966 oasc.SolrDeletionPolicy.updateCommits newest commit = 3[segments_3]
[junit4:junit4]   2> 9775 T2589 C160 P44966 oasc.CachingDirectoryFactory.close Releasing directory:/usr/home/hudson/hudson-slave/workspace/Lucene-Solr-Tests-4.x-java7/solr/build/solr-core/test/J0/./org.apache.solr.cloud.SyncSliceTest-1355870822377/jetty2
[junit4:junit4]   2> 9775 T2589 C160 P44966 oasu.DirectUpdateHandler2.commit end_commit_flush
[junit4:junit4]   2> 9775 T2589 C160 P44966 oasc.CachingDirectoryFactory.close Releasing directory:/usr/home/hudson/hudson-slave/workspace/Lucene-Solr-Tests-4.x-java7/solr/build/solr-core/test/J0/./org.apache.solr.cloud.SyncSliceTest-1355870822377/jetty2/index.20121218174712111
[junit4:junit4]   2> 9775 T2589 C160 P44966 oasc.CachingDirectoryFactory.close Releasing directory:/usr/home/hudson/hudson-slave/workspace/Lucene-Solr-Tests-4.x-java7/solr/build/solr-core/test/J0/./org.apache.solr.cloud.SyncSliceTest-1355870822377/jetty2/index
[junit4:junit4]   2> 9775 T2589 C160 P44966 oasc.RecoveryStrategy.replay No replay needed. core=collection1
[junit4:junit4]   2> 9776 T2589 C160 P44966 oasc.RecoveryStrategy.doRecovery Replication Recovery was successful - registering as Active. core=collection1
[junit4:junit4]   2> 9776 T2589 C160 P44966 oasc.ZkController.publish publishing core=collection1 state=active
[junit4:junit4]   2> 9776 T2589 C160 P44966 oasc.ZkController.publish numShards not found on descriptor - reading it from system property
[junit4:junit4]   2> 9784 T2589 C160 P44966 oasc.RecoveryStrategy.doRecovery Finished recovery process. core=collection1
[junit4:junit4]   2> 10030 T2621 oasc.CoreContainer.registerCore registering core: collection1
[junit4:junit4]   2> 10030 T2621 oasc.ZkController.register Register replica - core:collection1 address:http://127.0.0.1:44976 collection:collection1 shard:shard1
[junit4:junit4]   2> 10034 T2621 oasc.ZkController.register We are http://127.0.0.1:44976/collection1/ and leader is http://127.0.0.1:44959/collection1/
[junit4:junit4]   2> 10034 T2621 oasc.ZkController.register No LogReplay needed for core=collection1 baseURL=http://127.0.0.1:44976
[junit4:junit4]   2> 10034 T2621 oasc.ZkController.checkRecovery Core needs to recover:collection1
[junit4:junit4]   2> 10035 T2621 oasu.DefaultSolrCoreState.doRecovery Running recovery - first canceling any ongoing recovery
[junit4:junit4]   2> ASYNC  NEW_CORE C163 name=collection1 org.apache.solr.core.SolrCore@20b9fea0 url=http://127.0.0.1:44976/collection1 node=127.0.0.1:44976_ C163_STATE=coll:collection1 core:collection1 props:{shard=null, roles=null, state=down, core=collection1, collection=collection1, node_name=127.0.0.1:44976_, base_url=http://127.0.0.1:44976}
[junit4:junit4]   2> 10035 T2624 C163 P44976 oasc.RecoveryStrategy.run Starting recovery process.  core=collection1 recoveringAfterStartup=true
[junit4:junit4]   2> 10036 T2621 oascc.ZkStateReader.updateClusterState Updating cloud state from ZooKeeper... 
[junit4:junit4]   2> 10036 T2624 C163 P44976 oasc.RecoveryStrategy.doRecovery ###### startupVersions=[]
[junit4:junit4]   2> 10037 T2624 C163 P44976 oasc.ZkController.publish publishing core=collection1 state=recovering
[junit4:junit4]   2> 10037 T2624 C163 P44976 oasc.ZkController.publish numShards not found on descriptor - reading it from system property
[junit4:junit4]   2> 10037 T2530 oass.SolrDispatchFilter.init user.dir=/usr/home/hudson/hudson-slave/workspace/Lucene-Solr-Tests-4.x-java7/solr/build/solr-core/test/J0
[junit4:junit4]   2> 10038 T2624 C163 P44976 oasc.RecoveryStrategy.doRecovery Attempting to PeerSync from http://127.0.0.1:44959/collection1/ core=collection1 - recoveringAfterStartup=true
[junit4:junit4]   2> 10039 T2624 C163 P44976 oasu.PeerSync.sync PeerSync: core=collection1 url=http://127.0.0.1:44976 START replicas=[http://127.0.0.1:44959/collection1/] nUpdates=100
[junit4:junit4]   2> 10038 T2530 oass.SolrDispatchFilter.init SolrDispatchFilter.init() done
[junit4:junit4]   2> 10039 T2624 C163 P44976 oasu.PeerSync.sync WARNING no frame of reference to tell of we've missed updates
[junit4:junit4]   2> 10039 T2530 oascsi.HttpClientUtil.createClient Creating new http client, config:maxConnections=128&maxConnectionsPerHost=32&followRedirects=false
[junit4:junit4]   2> 10040 T2624 C163 P44976 oasc.RecoveryStrategy.doRecovery PeerSync Recovery was not successful - trying replication. core=collection1
[junit4:junit4]   2> 10040 T2624 C163 P44976 oasc.RecoveryStrategy.doRecovery Starting Replication Recovery. core=collection1
[junit4:junit4]   2> 10040 T2624 C163 P44976 oascsi.HttpClientUtil.createClient Creating new http client, config:maxConnections=128&maxConnectionsPerHost=32&followRedirects=false
[junit4:junit4]   2> 10041 T2561 C161 P44959 REQ /get {distrib=false&qt=/get&wt=javabin&version=2&getVersions=100} status=0 QTime=0 
[junit4:junit4]   2> 10053 T2530 oascc.ZkStateReader.updateClusterState Updating cloud state from ZooKeeper... 
[junit4:junit4]   2> 10055 T2530 oasc.AbstractFullDistribZkTestBase.waitForThingsToLevelOut Wait for recoveries to finish - wait 15 for each attempt
[junit4:junit4]   2> 10055 T2530 oasc.AbstractDistribZkTestBase.waitForRecoveriesToFinish Wait for recoveries to finish - collection: collection1 failOnTimeout:true timeout (sec):15
[junit4:junit4]   2> 10056 T2530 oascc.ZkStateReader.updateClusterState Updating cloud state from ZooKeeper... 
[junit4:junit4]   2> 10218 T2553 oascc.ZkStateReader.updateClusterState Updating cloud state from ZooKeeper... 
[junit4:junit4]   2> 10219 T2553 oasc.Overseer$ClusterStateUpdater.updateState Update state numShards=1 message={
[junit4:junit4]   2> 	  "operation":"state",
[junit4:junit4]   2> 	  "numShards":"1",
[junit4:junit4]   2> 	  "shard":"shard1",
[junit4:junit4]   2> 	  "roles":null,
[junit4:junit4]   2> 	  "state":"active",
[junit4:junit4]   2> 	  "core":"collection1",
[junit4:junit4]   2> 	  "collection":"collection1",
[junit4:junit4]   2> 	  "node_name":"127.0.0.1:44966_",
[junit4:junit4]   2> 	  "base_url":"http://127.0.0.1:44966"}
[junit4:junit4]   2> 10225 T2553 oasc.Overseer$ClusterStateUpdater.updateState Update state numShards=1 message={
[junit4:junit4]   2> 	  "operation":"state",
[junit4:junit4]   2> 	  "numShards":"1",
[junit4:junit4]   2> 	  "shard":"shard1",
[junit4:junit4]   2> 	  "roles":null,
[junit4:junit4]   2> 	  "state":"recovering",
[junit4:junit4]   2> 	  "core":"collection1",
[junit4:junit4]   2> 	  "collection":"collection1",
[junit4:junit4]   2> 	  "node_name":"127.0.0.1:44976_",
[junit4:junit4]   2> 	  "base_url":"http://127.0.0.1:44976"}
[junit4:junit4]   2> 10239 T2552 oascc.ZkStateReader$2.process A cluster state change: WatchedEvent state:SyncConnected type:NodeDataChanged path:/clusterstate.json, has occurred - updating... (live nodes size: 5)
[junit4:junit4]   2> 10239 T2558 oascc.ZkStateReader$2.process A cluster state change: WatchedEvent state:SyncConnected type:NodeDataChanged path:/clusterstate.json, has occurred - updating... (live nodes size: 5)
[junit4:junit4]   2> 10239 T2586 oascc.ZkStateReader$2.process A cluster state change: WatchedEvent state:SyncConnected type:NodeDataChanged path:/clusterstate.json, has occurred - updating... (live nodes size: 5)
[junit4:junit4]   2> 10239 T2620 oascc.ZkStateReader$2.process A cluster state change: WatchedEvent state:SyncConnected type:NodeDataChanged path:/clusterstate.json, has occurred - updating... (live nodes size: 5)
[junit4:junit4]   2> 10239 T2603 oascc.ZkStateReader$2.process A cluster state change: WatchedEvent state:SyncConnected type:NodeDataChanged path:/clusterstate.json, has occurred - updating... (live nodes size: 5)
[junit4:junit4]   2> 10239 T2571 oascc.ZkStateReader$2.process A cluster state change: WatchedEvent state:SyncConnected type:NodeDataChanged path:/clusterstate.json, has occurred - updating... (live nodes size: 5)
[junit4:junit4]   2> 11058 T2530 oascc.ZkStateReader.updateClusterState Updating cloud state from ZooKeeper... 
[junit4:junit4]   2>  C162_STATE=coll:collection1 core:collection1 props:{shard=shard1, roles=null, state=recovering, core=collection1, collection=collection1, node_name=127.0.0.1:44971_, base_url=http://127.0.0.1:44971}
[junit4:junit4]   2> 11443 T2606 C162 P44971 oasc.RecoveryStrategy.doRecovery Begin buffering updates. core=collection1
[junit4:junit4]   2> 11443 T2606 C162 P44971 oasu.UpdateLog.bufferUpdates Starting to buffer updates. FSUpdateLog{state=ACTIVE, tlog=null}
[junit4:junit4]   2> 11443 T2606 C162 P44971 oasc.RecoveryStrategy.replicate Attempting to replicate from http://127.0.0.1:44959/collection1/. core=collection1
[junit4:junit4]   2> 11444 T2606 C162 P44971 oascsi.HttpClientUtil.createClient Creating new http client, config:maxConnections=128&maxConnectionsPerHost=32&followRedirects=false
[junit4:junit4]   2> 11454 T2567 C161 P44959 oasu.DirectUpdateHandler2.commit start commit{flags=0,_version_=0,optimize=false,openSearcher=false,waitSearcher=true,expungeDeletes=false,softCommit=false}
[junit4:junit4]   2> 11464 T2567 C161 P44959 oasc.SolrDeletionPolicy.onCommit SolrDeletionPolicy.onCommit: commits:num=2
[junit4:junit4]   2> 		commit{dir=RateLimitedDirectoryWrapper(NRTCachingDirectory(org.apache.lucene.store.NIOFSDirectory@/usr/home/hudson/hudson-slave/workspace/Lucene-Solr-Tests-4.x-java7/solr/build/solr-core/test/J0/org.apache.solr.cloud.SyncSliceTest-1355870822377/jetty1/index lockFactory=org.apache.lucene.store.NativeFSLockFactory@2e73e8bf; maxCacheMB=48.0 maxMergeSizeMB=4.0)),segFN=segments_2,generation=2,filenames=[segments_2]
[junit4:junit4]   2> 		commit{dir=RateLimitedDirectoryWrapper(NRTCachingDirectory(org.apache.lucene.store.NIOFSDirectory@/usr/home/hudson/hudson-slave/workspace/Lucene-Solr-Tests-4.x-java7/solr/build/solr-core/test/J0/org.apache.solr.cloud.SyncSliceTest-1355870822377/jetty1/index lockFactory=org.apache.lucene.store.NativeFSLockFactory@2e73e8bf; maxCacheMB=48.0 maxMergeSizeMB=4.0)),segFN=segments_3,generation=3,filenames=[segments_3]
[junit4:junit4]   2> 11465 T2567 C161 P44959 oasc.SolrDeletionPolicy.updateCommits newest commit = 3[segments_3]
[junit4:junit4]   2> 11465 T2567 C161 P44959 oasc.CachingDirectoryFactory.close Releasing directory:/usr/home/hudson/hudson-slave/workspace/Lucene-Solr-Tests-4.x-java7/solr/build/solr-core/test/J0/./org.apache.solr.cloud.SyncSliceTest-1355870822377/jetty1
[junit4:junit4]   2> 11466 T2567 C161 P44959 oasu.DirectUpdateHandler2.commit end_commit_flush
[junit4:junit4]   2> 11466 T2567 C161 P44959 /update {waitSearcher=true&openSearcher=false&commit=true&commit_end_point=true&wt=javabin&softCommit=false&version=2} {commit=} 0 13
[junit4:junit4]   2> 11468 T2606 C162 P44971 oash.ReplicationHandler.inform Commits will be reserved for  10000
[junit4:junit4]   2> 11468 T2606 C162 P44971 oash.SnapPuller.<init>  No value set for 'pollInterval'. Timer Task not started.
[junit4:junit4]   2> 11471 T2565 C161 P44959 REQ /replication {command=indexversion&wt=javabin&qt=/replication&version=2} status=0 QTime=0 
[junit4:junit4]   2> 11472 T2606 C162 P44971 oash.SnapPuller.fetchLatestIndex Master's generation: 3
[junit4:junit4]   2> 11472 T2606 C162 P44971 oash.SnapPuller.fetchLatestIndex Slave's generation: 1
[junit4:junit4]   2> 11473 T2606 C162 P44971 oash.SnapPuller.fetchLatestIndex Starting replication process
[junit4:junit4]   2> 11475 T2565 C161 P44959 oasc.CachingDirectoryFactory.close Releasing directory:/usr/home/hudson/hudson-slave/workspace/Lucene-Solr-Tests-4.x-java7/solr/build/solr-core/test/J0/./org.apache.solr.cloud.SyncSliceTest-1355870822377/jetty1
[junit4:junit4]   2> 11476 T2565 C161 P44959 oasc.CachingDirectoryFactory.close Releasing directory:/usr/home/hudson/hudson-slave/workspace/Lucene-Solr-Tests-4.x-java7/solr/build/solr-core/test/J0/./org.apache.solr.cloud.SyncSliceTest-1355870822377/jetty1/index
[junit4:junit4]   2> 11476 T2565 C161 P44959 REQ /replication {command=filelist&generation=3&wt=javabin&qt=/replication&version=2} status=0 QTime=1 
[junit4:junit4]   2> 11477 T2606 C162 P44971 oash.SnapPuller.fetchLatestIndex Number of files in latest index in master: 1
[junit4:junit4]   2> 11478 T2606 C162 P44971 oasc.CachingDirectoryFactory.get return new directory for /usr/home/hudson/hudson-slave/workspace/Lucene-Solr-Tests-4.x-java7/solr/build/solr-core/test/J0/./org.apache.solr.cloud.SyncSliceTest-1355870822377/jetty3/index.20121218174713849 forceNew:false
[junit4:junit4]   2> 11479 T2606 C162 P44971 oasc.CachingDirectoryFactory.close Releasing directory:/usr/home/hudson/hudson-slave/workspace/Lucene-Solr-Tests-4.x-java7/solr/build/solr-core/test/J0/./org.apache.solr.cloud.SyncSliceTest-1355870822377/jetty3
[junit4:junit4]   2> 11479 T2606 C162 P44971 oash.SnapPuller.fetchLatestIndex Starting download to RateLimitedDirectoryWrapper(NRTCachingDirectory(org.apache.lucene.store.NIOFSDirectory@/usr/home/hudson/hudson-slave/workspace/Lucene-Solr-Tests-4.x-java7/solr/build/solr-core/test/J0/org.apache.solr.cloud.SyncSliceTest-1355870822377/jetty3/index.20121218174713849 lockFactory=org.apache.lucene.store.NativeFSLockFactory@56a1aacb; maxCacheMB=48.0 maxMergeSizeMB=4.0)) fullCopy=true
[junit4:junit4]   2> 11483 T2565 C161 P44959 REQ /replication {file=segments_3&command=filecontent&checksum=true&generation=3&qt=/replication&wt=filestream} status=0 QTime=0 
[junit4:junit4]   2> 11485 T2606 C162 P44971 oasc.CachingDirectoryFactory.close Releasing directory:/usr/home/hudson/hudson-slave/workspace/Lucene-Solr-Tests-4.x-java7/solr/build/solr-core/test/J0/./org.apache.solr.cloud.SyncSliceTest-1355870822377/jetty3/index
[junit4:junit4]   2> 11485 T2606 C162 P44971 oash.SnapPuller.fetchLatestIndex Total time taken for download : 0 secs
[junit4:junit4]   2> 11485 T2606 C162 P44971 oash.SnapPuller.modifyIndexProps New index installed. Updating index properties... index=index.20121218174713849
[junit4:junit4]   2> 11486 T2606 C162 P44971 oasc.CachingDirectoryFactory.close Releasing directory:/usr/home/hudson/hudson-slave/workspace/Lucene-Solr-Tests-4.x-java7/solr/build/solr-core/test/J0/./org.apache.solr.cloud.SyncSliceTest-1355870822377/jetty3
[junit4:junit4]   2> 11487 T2606 C162 P44971 oasc.CachingDirectoryFactory.close Releasing directory:/usr/home/hudson/hudson-slave/workspace/Lucene-Solr-Tests-4.x-java7/solr/build/solr-core/test/J0/./org.apache.solr.cloud.SyncSliceTest-1355870822377/jetty3
[junit4:junit4]   2> 11487 T2606 C162 P44971 oasc.SolrCore.getNewIndexDir New index directory detected: old=./org.apache.solr.cloud.SyncSliceTest-1355870822377/jetty3/index/ new=./org.apache.solr.cloud.SyncSliceTest-1355870822377/jetty3/index.20121218174713849
[junit4:junit4]   2> 11490 T2606 C162 P44971 oasc.SolrDeletionPolicy.onInit SolrDeletionPolicy.onInit: commits:num=1
[junit4:junit4]   2> 		commit{dir=RateLimitedDirectoryWrapper(NRTCachingDirectory(org.apache.lucene.store.NIOFSDirectory@/usr/home/hudson/hudson-slave/workspace/Lucene-Solr-Tests-4.x-java7/solr/build/solr-core/test/J0/org.apache.solr.cloud.SyncSliceTest-1355870822377/jetty3/index.20121218174713849 lockFactory=org.apache.lucene.store.NativeFSLockFactory@56a1aacb; maxCacheMB=48.0 maxMergeSizeMB=4.0)),segFN=segments_3,generation=3,filenames=[segments_3]
[junit4:junit4]   2> 11491 T2606 C162 P44971 oasc.SolrDeletionPolicy.updateCommits newest commit = 3[segments_3]
[junit4:junit4]   2> 11492 T2606 C162 P44971 oasc.CachingDirectoryFactory.close Releasing directory:/usr/home/hudson/hudson-slave/workspace/Lucene-Solr-Tests-4.x-java7/solr/build/solr-core/test/J0/./org.apache.solr.cloud.SyncSliceTest-1355870822377/jetty3
[junit4:junit4]   2> 11492 T2606 C162 P44971 oasu.DefaultSolrCoreState.newIndexWriter Creating new IndexWriter...
[junit4:junit4]   2> 11493 T2606 C162 P44971 oasu.DefaultSolrCoreState.newIndexWriter Waiting until IndexWriter is unused... core=collection1
[junit4:junit4]   2> 11493 T2606 C162 P44971 oasu.DefaultSolrCoreState.newIndexWriter Rollback old IndexWriter... core=collection1
[junit4:junit4]   2> 11494 T2606 C162 P44971 oasc.CachingDirectoryFactory.close Releasing directory:/usr/home/hudson/hudson-slave/workspace/Lucene-Solr-Tests-4.x-java7/solr/build/solr-core/test/J0/./org.apache.solr.cloud.SyncSliceTest-1355870822377/jetty3/index.20121218174713849
[junit4:junit4]   2> 11494 T2606 C162 P44971 oasc.CachingDirectoryFactory.close Releasing directory:/usr/home/hudson/hudson-slave/workspace/Lucene-Solr-Tests-4.x-java7/solr/build/solr-core/test/J0/./org.apache.solr.cloud.SyncSliceTest-1355870822377/jetty3
[junit4:junit4]   2> 11497 T2606 C162 P44971 oasc.SolrDeletionPolicy.onInit SolrDeletionPolicy.onInit: commits:num=1
[junit4:junit4]   2> 		commit{dir=RateLimitedDirectoryWrapper(NRTCachingDirectory(org.apache.lucene.store.NIOFSDirectory@/usr/home/hudson/hudson-slave/workspace/Lucene-Solr-Tests-4.x-java7/solr/build/solr-core/test/J0/org.apache.solr.cloud.SyncSliceTest-1355870822377/jetty3/index.20121218174713849 lockFactory=org.apache.lucene.store.NativeFSLockFactory@56a1aacb; maxCacheMB=48.0 maxMergeSizeMB=4.0)),segFN=segments_3,generation=3,filenames=[segments_3]
[junit4:junit4]   2> 11498 T2606 C162 P44971 oasc.SolrDeletionPolicy.updateCommits newest commit = 3[segments_3]
[junit4:junit4]   2> 11498 T2606 C162 P44971 oasu.DefaultSolrCoreState.newIndexWriter New IndexWriter is ready to be used.
[junit4:junit4]   2> 11498 T2606 C162 P44971 oasc.CachingDirectoryFactory.close Releasing directory:/usr/home/hudson/hudson-slave/workspace/Lucene-Solr-Tests-4.x-java7/solr/build/solr-core/test/J0/./org.apache.solr.cloud.SyncSliceTest-1355870822377/jetty3
[junit4:junit4]   2> 11499 T2606 C162 P44971 oass.SolrIndexSearcher.<init> Opening Searcher@31ca5389 main
[junit4:junit4]   2> 11500 T2605 oasc.SolrCore.registerSearcher [collection1] Registered new searcher Searcher@31ca5389 main{StandardDirectoryReader(segments_3:1:nrt)}
[junit4:junit4]   2> 11501 T2605 oasc.CachingDirectoryFactory.close Releasing directory:/usr/home/hudson/hudson-slave/workspace/Lucene-Solr-Tests-4.x-java7/solr/build/solr-core/test/J0/./org.apache.solr.cloud.SyncSliceTest-1355870822377/jetty3/index
[junit4:junit4]   2> 11501 T2606 C162 P44971 oasu.DirectUpdateHandler2.commit start commit{flags=0,_version_=0,optimize=false,openSearcher=false,waitSearcher=false,expungeDeletes=false,softCommit=false}
[junit4:junit4]   2> 11504 T2606 C162 P44971 oasc.SolrDeletionPolicy.onCommit SolrDeletionPolicy.onCommit: commits:num=2
[junit4:junit4]   2> 		commit{dir=RateLimitedDirectoryWrapper(NRTCachingDirectory(org.apache.lucene.store.NIOFSDirectory@/usr/home/hudson/hudson-slave/workspace/Lucene-Solr-Tests-4.x-java7/solr/build/solr-core/test/J0/org.apache.solr.cloud.SyncSliceTest-1355870822377/jetty3/index.20121218174713849 lockFactory=org.apache.lucene.store.NativeFSLockFactory@56a1aacb; maxCacheMB=48.0 maxMergeSizeMB=4.0)),segFN=segments_3,generation=3,filenames=[segments_3]
[junit4:junit4]   2> 		commit{dir=RateLimitedDirectoryWrapper(NRTCachingDirectory(org.apache.lucene.store.NIOFSDirectory@/usr/home/hudson/hudson-slave/workspace/Lucene-Solr-Tests-4.x-java7/solr/build/solr-core/test/J0/org.apache.solr.cloud.SyncSliceTest-1355870822377/jetty3/index.20121218174713849 lockFactory=org.apache.lucene.store.NativeFSLockFactory@56a1aacb; maxCacheMB=48.0 maxMergeSizeMB=4.0)),segFN=segments_4,generation=4,filenames=[segments_4]
[junit4:junit4]   2> 11504 T2606 C162 P44971 oasc.SolrDeletionPolicy.updateCommits newest commit = 4[segments_4]
[junit4:junit4]   2> 11505 T2606 C162 P44971 oasc.CachingDirectoryFactory.close Releasing directory:/usr/home/hudson/hudson-slave/workspace/Lucene-Solr-Tests-4.x-java7/solr/build/solr-core/test/J0/./org.apache.solr.cloud.SyncSliceTest-1355870822377/jetty3
[junit4:junit4]   2> 11506 T2606 C162 P44971 oasu.DirectUpdateHandler2.commit end_commit_flush
[junit4:junit4]   2> 11506 T2606 C162 P44971 oasc.CachingDirectoryFactory.close Releasing directory:/usr/home/hudson/hudson-slave/workspace/Lucene-Solr-Tests-4.x-java7/solr/build/solr-core/test/J0/./org.apache.solr.cloud.SyncSliceTest-1355870822377/jetty3/index.20121218174713849
[junit4:junit4]   2> 11506 T2606 C162 P44971 oasc.CachingDirectoryFactory.close Releasing directory:/usr/home/hudson/hudson-slave/workspace/Lucene-Solr-Tests-4.x-java7/solr/build/solr-core/test/J0/./org.apache.solr.cloud.SyncSliceTest-1355870822377/jetty3/index
[junit4:junit4]   2> 11507 T2606 C162 P44971 oasc.RecoveryStrategy.replay No replay needed. core=collection1
[junit4:junit4]   2> 11507 T2606 C162 P44971 oasc.RecoveryStrategy.doRecovery Replication Recovery was successful - registering as Active. core=collection1
[junit4:junit4]   2> 11507 T2606 C162 P44971 oasc.ZkController.publish publishing core=collection1 state=active
[junit4:junit4]   2> 11507 T2606 C162 P44971 oasc.ZkController.publish numShards not found on descriptor - reading it from system property
[junit4:junit4]   2> 11514 T2606 C162 P44971 oasc.RecoveryStrategy.doRecovery Finished recovery process. core=collection1
[junit4:junit4]   2> 11756 T2553 oascc.ZkStateReader.updateClusterState Updating cloud state from ZooKeeper... 
[junit4:junit4]   2> 11758 T2553 oasc.Overseer$ClusterStateUpdater.updateState Update state numShards=1 message={
[junit4:junit4]   2> 	  "operation":"state",
[junit4:junit4]   2> 	  "numShards":"1",
[junit4:junit4]   2> 	  "shard":"shard1",
[junit4:junit4]   2> 	  "roles":null,
[junit4:junit4]   2> 	  "state":"active",
[junit4:junit4]   2> 	  "core":"collection1",
[junit4:junit4]   2> 	  "collection":"collection1",
[junit4:junit4]   2> 	  "node_name":"127.0.0.1:44971_",
[junit4:junit4]   2> 	  "base_url":"http://127.0.0.1:44971"}
[junit4:junit4]   2> 11772 T2552 oascc.ZkStateReader$2.process A cluster state change: WatchedEvent state:SyncConnected type:NodeDataChanged path:/clusterstate.json, has occurred - updating... (live nodes size: 5)
[junit4:junit4]   2> 11772 T2558 oascc.ZkStateReader$2.process A cluster state change: WatchedEvent state:SyncConnected type:NodeDataChanged path:/clusterstate.json, has occurred - updating... (live nodes size: 5)
[junit4:junit4]   2> 11772 T2620 oascc.ZkStateReader$2.process A cluster state change: WatchedEvent state:SyncConnected type:NodeDataChanged path:/clusterstate.json, has occurred - updating... (live nodes size: 5)
[junit4:junit4]   2> 11772 T2586 oascc.ZkStateReader$2.process A cluster state change: WatchedEvent state:SyncConnected type:NodeDataChanged path:/clusterstate.json, has occurred - updating... (live nodes size: 5)
[junit4:junit4]   2> 11772 T2603 oascc.ZkStateReader$2.process A cluster state change: WatchedEvent state:SyncConnected type:NodeDataChanged path:/clusterstate.json, has occurred - updating... (live nodes size: 5)
[junit4:junit4]   2> 11772 T2571 oascc.ZkStateReader$2.process A cluster state change: WatchedEvent state:SyncConnected type:NodeDataChanged path:/clusterstate.json, has occurred - updating... (live nodes size: 5)
[junit4:junit4]   2> 12061 T2530 oascc.ZkStateReader.updateClusterState Updating cloud state from ZooKeeper... 
[junit4:junit4]   2>  C163_STATE=coll:collection1 core:collection1 props:{shard=shard1, roles=null, state=recovering, core=collection1, collection=collection1, node_name=127.0.0.1:44976_, base_url=http://127.0.0.1:44976}
[junit4:junit4]   2> 13056 T2624 C163 P44976 oasc.RecoveryStrategy.doRecovery Begin buffering updates. core=collection1
[junit4:junit4]   2> 13056 T2624 C163 P44976 oasu.UpdateLog.bufferUpdates Starting to buffer updates. FSUpdateLog{state=ACTIVE, tlog=null}
[junit4:junit4]   2> 13056 T2624 C163 P44976 oasc.RecoveryStrategy.replicate Attempting to replicate from http://127.0.0.1:44959/collection1/. core=collection1
[junit4:junit4]   2> 13057 T2624 C163 P44976 oascsi.HttpClientUtil.createClient Creating new http client, config:maxConnections=128&maxConnectionsPerHost=32&followRedirects=false
[junit4:junit4]   2> 13064 T2530 oascc.ZkStateReader.updateClusterState Updating cloud state from ZooKeeper... 
[junit4:junit4]   2> 13067 T2562 C161 P44959 oasu.DirectUpdateHandler2.commit start commit{flags=0,_version_=0,optimize=false,openSearcher=false,waitSearcher=true,expungeDeletes=false,softCommit=false}
[junit4:junit4]   2> 13072 T2562 C161 P44959 oasc.SolrDeletionPolicy.onCommit SolrDeletionPolicy.onCommit: commits:num=3
[junit4:junit4]   2> 		commit{dir=RateLimitedDirectoryWrapper(NRTCachingDirectory(org.apache.lucene.store.NIOFSDirectory@/usr/home/hudson/hudson-slave/workspace/Lucene-Solr-Tests-4.x-java7/solr/build/solr-core/test/J0/org.apache.solr.cloud.SyncSliceTest-1355870822377/jetty1/index lockFactory=org.apache.lucene.store.NativeFSLockFactory@2e73e8bf; maxCacheMB=48.0 maxMergeSizeMB=4.0)),segFN=segments_2,generation=2,filenames=[segments_2]
[junit4:junit4]   2> 		commit{dir=RateLimitedDirectoryWrapper(NRTCachingDirectory(org.apache.lucene.store.NIOFSDirectory@/usr/home/hudson/hudson-slave/workspace/Lucene-Solr-Tests-4.x-java7/solr/build/solr-core/test/J0/org.apache.solr.cloud.SyncSliceTest-1355870822377/jetty1/index lockFactory=org.apache.lucene.store.NativeFSLockFactory@2e73e8bf; maxCacheMB=48.0 maxMergeSizeMB=4.0)),segFN=segments_3,generation=3,filenames=[segments_3]
[junit4:junit4]   2> 		commit{dir=RateLimitedDirectoryWrapper(NRTCachingDirectory(org.apache.lucene.store.NIOFSDirectory@/usr/home/hudson/hudson-slave/workspace/Lucene-Solr-Tests-4.x-java7/solr/build/solr-core/test/J0/org.apache.solr.cloud.SyncSliceTest-1355870822377/jetty1/index lockFactory=org.apache.lucene.store.NativeFSLockFactory@2e73e8bf; maxCacheMB=48.0 maxMergeSizeMB=4.0)),segFN=segments_4,generation=4,filenames=[segments_4]
[junit4:junit4]   2> 13073 T2562 C161 P44959 oasc.SolrDeletionPolicy.updateCommits newest commit = 4[segments_4]
[junit4:junit4]   2> 13073 T2562 C161 P44959 oasc.CachingDirectoryFactory.close Releasing directory:/usr/home/hudson/hudson-slave/workspace/Lucene-Solr-Tests-4.x-java7/solr/build/solr-core/test/J0/./org.apache.solr.cloud.SyncSliceTest-1355870822377/jetty1
[junit4:junit4]   2> 13074 T2562 C161 P44959 oasu.DirectUpdateHandler2.commit end_commit_flush
[junit4:junit4]   2> 13074 T2562 C161 P44959 /update {waitSearcher=true&openSearcher=false&commit=true&commit_end_point=true&wt=javabin&softCommit=false&version=2} {commit=} 0 7
[junit4:junit4]   2> 13076 T2624 C163 P44976 oash.ReplicationHandler.inform Commits will be reserved for  10000
[junit4:junit4]   2> 13076 T2624 C163 P44976 oash.SnapPuller.<init>  No value set for 'pollInterval'. Timer Task not started.
[junit4:junit4]   2> 13078 T2565 C161 P44959 REQ /replication {command=indexversion&wt=javabin&qt=/replication&version=2} status=0 QTime=0 
[junit4:junit4]   2> 13079 T2624 C163 P44976 oash.SnapPuller.fetchLatestIndex Master's generation: 4
[junit4:junit4]   2> 13079 T2624 C163 P44976 oash.SnapPuller.fetchLatestIndex Slave's generation: 1
[junit4:junit4]   2> 13080 T2624 C163 P44976 oash.SnapPuller.fetchLatestIndex Starting replication process
[junit4:junit4]   2> 13082 T2565 C161 P44959 oasc.CachingDirectoryFactory.close Releasing directory:/usr/home/hudson/hudson-slave/workspace/Lucene-Solr-Tests-4.x-java7/solr/build/solr-core/test/J0/./org.apache.solr.cloud.SyncSliceTest-1355870822377/jetty1
[junit4:junit4]   2> 13083 T2565 C161 P44959 oasc.CachingDirectoryFactory.close Releasing directory:/usr/home/hudson/hudson-slave/workspace/Lucene-Solr-Tests-4.x-java7/solr/build/solr-core/test/J0/./org.apache.solr.cloud.SyncSliceTest-1355870822377/jetty1/index
[junit4:junit4]   2> 13083 T2565 C161 P44959 REQ /replication {command=filelist&generation=4&wt=javabin&qt=/replication&version=2} status=0 QTime=1 
[junit4:junit4]   2> 13084 T2624 C163 P44976 oash.SnapPuller.fetchLatestIndex Number of files in latest index in master: 1
[junit4:junit4]   2> 13085 T2624 C163 P44976 oasc.CachingDirectoryFactory.get return new directory for /usr/home/hudson/hudson-slave/workspace/Lucene-Solr-Tests-4.x-java7/solr/build/solr-core/test/J0/./org.apache.solr.cloud.SyncSliceTest-1355870822377/jetty4/index.20121218174715456 forceNew:false
[junit4:junit4]   2> 13085 T2624 C163 P44

[...truncated too long message...]

g.apache.solr.cloud.SyncSliceTest.doTest(SyncSliceTest.java:211)
[junit4:junit4]    > 	at org.apache.solr.BaseDistributedSearchTestCase.testDistribSearch(BaseDistributedSearchTestCase.java:794)
[junit4:junit4]    > 	at sun.reflect.NativeMethodAccessorImpl.invoke0(Native Method)
[junit4:junit4]    > 	at sun.reflect.NativeMethodAccessorImpl.invoke(NativeMethodAccessorImpl.java:57)
[junit4:junit4]    > 	at sun.reflect.DelegatingMethodAccessorImpl.invoke(DelegatingMethodAccessorImpl.java:43)
[junit4:junit4]    > 	at java.lang.reflect.Method.invoke(Method.java:601)
[junit4:junit4]    > 	at com.carrotsearch.randomizedtesting.RandomizedRunner.invoke(RandomizedRunner.java:1559)
[junit4:junit4]    > 	at com.carrotsearch.randomizedtesting.RandomizedRunner.access$600(RandomizedRunner.java:79)
[junit4:junit4]    > 	at com.carrotsearch.randomizedtesting.RandomizedRunner$6.evaluate(RandomizedRunner.java:737)
[junit4:junit4]    > 	at com.carrotsearch.randomizedtesting.RandomizedRunner$7.evaluate(RandomizedRunner.java:773)
[junit4:junit4]    > 	at com.carrotsearch.randomizedtesting.RandomizedRunner$8.evaluate(RandomizedRunner.java:787)
[junit4:junit4]    > 	at com.carrotsearch.randomizedtesting.rules.SystemPropertiesRestoreRule$1.evaluate(SystemPropertiesRestoreRule.java:53)
[junit4:junit4]    > 	at org.apache.lucene.util.TestRuleSetupTeardownChained$1.evaluate(TestRuleSetupTeardownChained.java:50)
[junit4:junit4]    > 	at org.apache.lucene.util.TestRuleFieldCacheSanity$1.evaluate(TestRuleFieldCacheSanity.java:51)
[junit4:junit4]    > 	at org.apache.lucene.util.AbstractBeforeAfterRule$1.evaluate(AbstractBeforeAfterRule.java:46)
[junit4:junit4]    > 	at com.carrotsearch.randomizedtesting.rules.SystemPropertiesInvariantRule$1.evaluate(SystemPropertiesInvariantRule.java:55)
[junit4:junit4]    > 	at org.apache.lucene.util.TestRuleThreadAndTestName$1.evaluate(TestRuleThreadAndTestName.java:49)
[junit4:junit4]    > 	at org.apache.lucene.util.TestRuleIgnoreAfterMaxFailures$1.evaluate(TestRuleIgnoreAfterMaxFailures.java:70)
[junit4:junit4]    > 	at org.apache.lucene.util.TestRuleMarkFailure$1.evaluate(TestRuleMarkFailure.java:48)
[junit4:junit4]    > 	at com.carrotsearch.randomizedtesting.rules.StatementAdapter.evaluate(StatementAdapter.java:36)
[junit4:junit4]    > 	at com.carrotsearch.randomizedtesting.ThreadLeakControl$StatementRunner.run(ThreadLeakControl.java:358)
[junit4:junit4]    > 	at com.carrotsearch.randomizedtesting.ThreadLeakControl.forkTimeoutingTask(ThreadLeakControl.java:782)
[junit4:junit4]    > 	at com.carrotsearch.randomizedtesting.ThreadLeakControl$3.evaluate(ThreadLeakControl.java:442)
[junit4:junit4]    > 	at com.carrotsearch.randomizedtesting.RandomizedRunner.runSingleTest(RandomizedRunner.java:746)
[junit4:junit4]    > 	at com.carrotsearch.randomizedtesting.RandomizedRunner$3.evaluate(RandomizedRunner.java:648)
[junit4:junit4]    > 	at com.carrotsearch.randomizedtesting.RandomizedRunner$4.evaluate(RandomizedRunner.java:682)
[junit4:junit4]    > 	at com.carrotsearch.randomizedtesting.RandomizedRunner$5.evaluate(RandomizedRunner.java:693)
[junit4:junit4]    > 	at com.carrotsearch.randomizedtesting.rules.StatementAdapter.evaluate(StatementAdapter.java:36)
[junit4:junit4]    > 	at com.carrotsearch.randomizedtesting.rules.SystemPropertiesRestoreRule$1.evaluate(SystemPropertiesRestoreRule.java:53)
[junit4:junit4]    > 	at org.apache.lucene.util.AbstractBeforeAfterRule$1.evaluate(AbstractBeforeAfterRule.java:46)
[junit4:junit4]    > 	at org.apache.lucene.util.TestRuleStoreClassName$1.evaluate(TestRuleStoreClassName.java:42)
[junit4:junit4]    > 	at com.carrotsearch.randomizedtesting.rules.SystemPropertiesInvariantRule$1.evaluate(SystemPropertiesInvariantRule.java:55)
[junit4:junit4]    > 	at com.carrotsearch.randomizedtesting.rules.NoShadowingOrOverridesOnMethodsRule$1.evaluate(NoShadowingOrOverridesOnMethodsRule.java:39)
[junit4:junit4]    > 	at com.carrotsearch.randomizedtesting.rules.NoShadowingOrOverridesOnMethodsRule$1.evaluate(NoShadowingOrOverridesOnMethodsRule.java:39)
[junit4:junit4]    > 	at com.carrotsearch.randomizedtesting.rules.StatementAdapter.evaluate(StatementAdapter.java:36)
[junit4:junit4]    > 	at org.apache.lucene.util.TestRuleAssertionsRequired$1.evaluate(TestRuleAssertionsRequired.java:43)
[junit4:junit4]    > 	at org.apache.lucene.util.TestRuleMarkFailure$1.evaluate(TestRuleMarkFailure.java:48)
[junit4:junit4]    > 	at org.apache.lucene.util.TestRuleIgnoreAfterMaxFailures$1.evaluate(TestRuleIgnoreAfterMaxFailures.java:70)
[junit4:junit4]    > 	at org.apache.lucene.util.TestRuleIgnoreTestSuites$1.evaluate(TestRuleIgnoreTestSuites.java:55)
[junit4:junit4]    > 	at com.carrotsearch.randomizedtesting.rules.StatementAdapter.evaluate(StatementAdapter.java:36)
[junit4:junit4]    > 	at com.carrotsearch.randomizedtesting.ThreadLeakControl$StatementRunner.run(ThreadLeakControl.java:358)
[junit4:junit4]    > 	at java.lang.Thread.run(Thread.java:722)
[junit4:junit4]   2> 115531 T2530 oas.SolrTestCaseJ4.deleteCore ###deleteCore
[junit4:junit4]   2> NOTE: test params are: codec=Asserting, sim=RandomSimilarityProvider(queryNorm=false,coord=no): {}, locale=da_DK, timezone=America/Detroit
[junit4:junit4]   2> NOTE: FreeBSD 9.0-RELEASE amd64/Oracle Corporation 1.7.0_09 (64-bit)/cpus=16,threads=2,free=207229680,total=536870912
[junit4:junit4]   2> NOTE: All tests run in this JVM: [FieldAnalysisRequestHandlerTest, AutoCommitTest, AlternateDirectoryTest, BasicDistributedZk2Test, TestFuzzyAnalyzedSuggestions, ClusterStateTest, TestLMDirichletSimilarityFactory, TestCollationField, CopyFieldTest, TestPseudoReturnFields, TestQuerySenderNoQuery, PathHierarchyTokenizerFactoryTest, TestAnalyzedSuggestions, FileBasedSpellCheckerTest, DateMathParserTest, SearchHandlerTest, TermsComponentTest, TestBinaryResponseWriter, CacheHeaderTest, DirectSolrConnectionTest, TestRandomFaceting, TestLuceneMatchVersion, BadComponentTest, TestWordDelimiterFilterFactory, SampleTest, TestPHPSerializedResponseWriter, PreAnalyzedFieldTest, MBeansHandlerTest, TestRTGBase, TestConfig, CollectionsAPIDistributedZkTest, TestRangeQuery, TestIBSimilarityFactory, TestJmxMonitoredMap, TestGroupingSearch, SortByFunctionTest, SuggesterWFSTTest, ZkControllerTest, TestLazyCores, TestZkChroot, TestDefaultSimilarityFactory, TestStressReorder, NumericFieldsTest, HighlighterConfigTest, UpdateRequestProcessorFactoryTest, NoCacheHeaderTest, QueryElevationComponentTest, TestLFUCache, DateFieldTest, TestSearchPerf, DistributedTermsComponentTest, WordBreakSolrSpellCheckerTest, CSVRequestHandlerTest, TestQueryTypes, SystemInfoHandlerTest, TestIndexingPerformance, TestCharFilters, SuggesterFSTTest, LeaderElectionIntegrationTest, RecoveryZkTest, DistributedSpellCheckComponentTest, SpellCheckCollatorTest, TestExtendedDismaxParser, BasicZkTest, TestFaceting, TestJoin, PeerSyncTest, BasicFunctionalityTest, SignatureUpdateProcessorFactoryTest, TestJmxIntegration, TestIndexSearcher, CoreAdminHandlerTest, TestFunctionQuery, TestTrie, SolrRequestParserTest, QueryEqualityTest, TestCSVLoader, SpatialFilterTest, TestCSVResponseWriter, MoreLikeThisHandlerTest, DistributedQueryElevationComponentTest, CurrencyFieldTest, DisMaxRequestHandlerTest, IndexSchemaTest, BinaryUpdateRequestHandlerTest, DistanceFunctionTest, MinimalSchemaTest, StandardRequestHandlerTest, PingRequestHandlerTest, TermVectorComponentTest, JsonLoaderTest, TestSurroundQueryParser, DocumentAnalysisRequestHandlerTest, DirectUpdateHandlerOptimizeTest, IndexSchemaRuntimeFieldTest, TestSolrQueryParser, SolrPluginUtilsTest, FastVectorHighlighterTest, TestReversedWildcardFilterFactory, DebugComponentTest, JSONWriterTest, RequestHandlersTest, RequiredFieldsTest, TestArbitraryIndexDir, TestQueryUtils, LoggingHandlerTest, SolrCmdDistributorTest, UniqFieldsUpdateProcessorFactoryTest, NotRequiredUniqueKeyTest, SolrCoreCheckLockOnStartupTest, TestSolrDeletionPolicy1, TestPropInject, TestWriterPerf, FieldMutatingUpdateProcessorTest, SOLR749Test, DefaultValueUpdateProcessorTest, TestMergePolicyConfig, TestXIncludeConfig, TestQuerySenderListener, OutputWriterTest, TestNumberUtils, TestSolrCoreProperties, SpellPossibilityIteratorTest, TestBM25SimilarityFactory, TestPhraseSuggestions, TestPerFieldSimilarity, TestPluginEnable, TestLMJelinekMercerSimilarityFactory, TestDFRSimilarityFactory, TimeZoneUtilsTest, TestFastLRUCache, URLClassifyProcessorTest, PluginInfoTest, OpenExchangeRatesOrgProviderTest, ResourceLoaderTest, FileUtilsTest, TestSystemIdResolver, TestSolrXMLSerializer, TestSuggestSpellingConverter, TestBadConfig, DOMUtilTest, TestLRUCache, UUIDFieldTest, RAMDirectoryFactoryTest, TestUtils, CircularListTest, AnalysisAfterCoreReloadTest, TestCollationKeyRangeQueries, ClusterStateUpdateTest, ShardRoutingTest, SyncSliceTest]
[junit4:junit4] Completed on J0 in 115.55s, 1 test, 1 failure <<< FAILURES!

[...truncated 66 lines...]
BUILD FAILED
/usr/home/hudson/hudson-slave/workspace/Lucene-Solr-Tests-4.x-java7/build.xml:353: The following error occurred while executing this line:
/usr/home/hudson/hudson-slave/workspace/Lucene-Solr-Tests-4.x-java7/build.xml:39: The following error occurred while executing this line:
/usr/home/hudson/hudson-slave/workspace/Lucene-Solr-Tests-4.x-java7/solr/build.xml:178: The following error occurred while executing this line:
/usr/home/hudson/hudson-slave/workspace/Lucene-Solr-Tests-4.x-java7/solr/common-build.xml:438: The following error occurred while executing this line:
/usr/home/hudson/hudson-slave/workspace/Lucene-Solr-Tests-4.x-java7/lucene/common-build.xml:1175: The following error occurred while executing this line:
/usr/home/hudson/hudson-slave/workspace/Lucene-Solr-Tests-4.x-java7/lucene/common-build.xml:840: There were test failures: 243 suites, 1010 tests, 1 failure, 21 ignored (3 assumptions)

Total time: 54 minutes 14 seconds
Build step 'Invoke Ant' marked build as failure
Archiving artifacts
Recording test results
Email was triggered for: Failure
Sending email for trigger: Failure



Mime
View raw message