lucene-dev mailing list archives

Site index · List index
Message view « Date » · « Thread »
Top « Date » · « Thread »
From Apache Jenkins Server <jenk...@builds.apache.org>
Subject [JENKINS] Lucene-Solr-Tests-trunk-java7 - Build # 3593 - Still Failing
Date Mon, 31 Dec 2012 02:55:43 GMT
Build: https://builds.apache.org/job/Lucene-Solr-Tests-trunk-java7/3593/

2 tests failed.
FAILED:  junit.framework.TestSuite.org.apache.solr.cloud.BasicDistributedZkTest

Error Message:
Suite timeout exceeded (>= 7200000 msec).

Stack Trace:
java.lang.Exception: Suite timeout exceeded (>= 7200000 msec).
	at __randomizedtesting.SeedInfo.seed([509AB02FD0A9ED9B]:0)


FAILED:  org.apache.solr.cloud.BasicDistributedZkTest.testDistribSearch

Error Message:
Test abandoned because suite timeout was reached.

Stack Trace:
java.lang.Exception: Test abandoned because suite timeout was reached.
	at __randomizedtesting.SeedInfo.seed([509AB02FD0A9ED9B]:0)




Build Log:
[...truncated 9363 lines...]
[junit4:junit4] Suite: org.apache.solr.cloud.BasicDistributedZkTest
[junit4:junit4]   2> 1 T178 oas.BaseDistributedSearchTestCase.initHostContext Setting hostContext system property: /j
[junit4:junit4]   2> 6 T178 oas.SolrTestCaseJ4.setUp ###Starting testDistribSearch
[junit4:junit4]   2> Creating dataDir: /usr/home/hudson/hudson-slave/workspace/Lucene-Solr-Tests-trunk-java7/solr/build/solr-core/test/J0/./solrtest-BasicDistributedZkTest-1356915299763
[junit4:junit4]   2> 13 T178 oasc.ZkTestServer.run STARTING ZK TEST SERVER
[junit4:junit4]   2> 18 T179 oasc.ZkTestServer$ZKServerMain.runFromConfig Starting server
[junit4:junit4]   2> 83 T179 oaz.Environment.logEnv Server environment:zookeeper.version=3.4.5-1392090, built on 09/30/2012 17:52 GMT
[junit4:junit4]   2> 84 T179 oaz.Environment.logEnv Server environment:host.name=lucene.zones.apache.org
[junit4:junit4]   2> 84 T179 oaz.Environment.logEnv Server environment:java.version=1.7.0_09
[junit4:junit4]   2> 84 T179 oaz.Environment.logEnv Server environment:java.vendor=Oracle Corporation
[junit4:junit4]   2> 85 T179 oaz.Environment.logEnv Server environment:java.home=/usr/local/openjdk7/jre
[junit4:junit4]   2> 85 T179 oaz.Environment.logEnv Server environment:java.class.path=/usr/home/hudson/hudson-slave/workspace/Lucene-Solr-Tests-trunk-java7/solr/build/solr-core/classes/test:/usr/home/hudson/hudson-slave/workspace/Lucene-Solr-Tests-trunk-java7/solr/build/solr-test-framework/classes/java:/usr/home/hudson/hudson-slave/workspace/Lucene-Solr-Tests-trunk-java7/solr/build/solr-core/test-files:/usr/home/hudson/hudson-slave/workspace/Lucene-Solr-Tests-trunk-java7/lucene/build/test-framework/classes/java:/usr/home/hudson/hudson-slave/workspace/Lucene-Solr-Tests-trunk-java7/lucene/build/codecs/classes/java:/usr/home/hudson/hudson-slave/workspace/Lucene-Solr-Tests-trunk-java7/solr/build/solr-solrj/classes/java:/usr/home/hudson/hudson-slave/workspace/Lucene-Solr-Tests-trunk-java7/solr/build/solr-core/classes/java:/usr/home/hudson/hudson-slave/workspace/Lucene-Solr-Tests-trunk-java7/lucene/build/analysis/common/lucene-analyzers-common-5.0-SNAPSHOT.jar:/usr/home/hudson/hudson-slave/workspace/Lucene-Solr-Tests-trunk-java7/lucene/build/analysis/kuromoji/lucene-analyzers-kuromoji-5.0-SNAPSHOT.jar:/usr/home/hudson/hudson-slave/workspace/Lucene-Solr-Tests-trunk-java7/lucene/build/analysis/phonetic/lucene-analyzers-phonetic-5.0-SNAPSHOT.jar:/usr/home/hudson/hudson-slave/workspace/Lucene-Solr-Tests-trunk-java7/lucene/build/highlighter/lucene-highlighter-5.0-SNAPSHOT.jar:/usr/home/hudson/hudson-slave/workspace/Lucene-Solr-Tests-trunk-java7/lucene/build/memory/lucene-memory-5.0-SNAPSHOT.jar:/usr/home/hudson/hudson-slave/workspace/Lucene-Solr-Tests-trunk-java7/lucene/build/misc/lucene-misc-5.0-SNAPSHOT.jar:/usr/home/hudson/hudson-slave/workspace/Lucene-Solr-Tests-trunk-java7/lucene/build/spatial/lucene-spatial-5.0-SNAPSHOT.jar:/usr/home/hudson/hudson-slave/workspace/Lucene-Solr-Tests-trunk-java7/lucene/build/suggest/lucene-suggest-5.0-SNAPSHOT.jar:/usr/home/hudson/hudson-slave/workspace/Lucene-Solr-Tests-trunk-java7/lucene/build/grouping/lucene-grouping-5.0-SNAPSHOT.jar:/usr/home/hudson/hudson-slave/workspace/Lucene-Solr-Tests-trunk-java7/lucene/build/queries/lucene-queries-5.0-SNAPSHOT.jar:/usr/home/hudson/hudson-slave/workspace/Lucene-Solr-Tests-trunk-java7/lucene/build/queryparser/lucene-queryparser-5.0-SNAPSHOT.jar:/usr/home/hudson/hudson-slave/workspace/Lucene-Solr-Tests-trunk-java7/solr/core/lib/cglib-nodep-2.2.jar:/usr/home/hudson/hudson-slave/workspace/Lucene-Solr-Tests-trunk-java7/solr/core/lib/commons-cli-1.2.jar:/usr/home/hudson/hudson-slave/workspace/Lucene-Solr-Tests-trunk-java7/solr/core/lib/commons-codec-1.7.jar:/usr/home/hudson/hudson-slave/workspace/Lucene-Solr-Tests-trunk-java7/solr/core/lib/commons-fileupload-1.2.1.jar:/usr/home/hudson/hudson-slave/workspace/Lucene-Solr-Tests-trunk-java7/solr/core/lib/commons-lang-2.6.jar:/usr/home/hudson/hudson-slave/workspace/Lucene-Solr-Tests-trunk-java7/solr/core/lib/easymock-3.0.jar:/usr/home/hudson/hudson-slave/workspace/Lucene-Solr-Tests-trunk-java7/solr/core/lib/guava-13.0.1.jar:/usr/home/hudson/hudson-slave/workspace/Lucene-Solr-Tests-trunk-java7/solr/core/lib/javax.servlet-api-3.0.1.jar:/usr/home/hudson/hudson-slave/workspace/Lucene-Solr-Tests-trunk-java7/solr/core/lib/objenesis-1.2.jar:/usr/home/hudson/hudson-slave/workspace/Lucene-Solr-Tests-trunk-java7/solr/core/lib/spatial4j-0.3.jar:/usr/home/hudson/hudson-slave/workspace/Lucene-Solr-Tests-trunk-java7/solr/solrj/lib/commons-io-2.1.jar:/usr/home/hudson/hudson-slave/workspace/Lucene-Solr-Tests-trunk-java7/solr/solrj/lib/httpclient-4.1.3.jar:/usr/home/hudson/hudson-slave/workspace/Lucene-Solr-Tests-trunk-java7/solr/solrj/lib/httpcore-4.1.4.jar:/usr/home/hudson/hudson-slave/workspace/Lucene-Solr-Tests-trunk-java7/solr/solrj/lib/httpmime-4.1.3.jar:/usr/home/hudson/hudson-slave/workspace/Lucene-Solr-Tests-trunk-java7/solr/solrj/lib/jcl-over-slf4j-1.6.4.jar:/usr/home/hudson/hudson-slave/workspace/Lucene-Solr-Tests-trunk-java7/solr/solrj/lib/log4j-over-slf4j-1.6.4.jar:/usr/home/hudson/hudson-slave/workspace/Lucene-Solr-Tests-trunk-java7/solr/solrj/lib/slf4j-api-1.6.4.jar:/usr/home/hudson/hudson-slave/workspace/Lucene-Solr-Tests-trunk-java7/solr/solrj/lib/slf4j-jdk14-1.6.4.jar:/usr/home/hudson/hudson-slave/workspace/Lucene-Solr-Tests-trunk-java7/solr/solrj/lib/wstx-asl-3.2.7.jar:/usr/home/hudson/hudson-slave/workspace/Lucene-Solr-Tests-trunk-java7/solr/solrj/lib/zookeeper-3.4.5.jar:/usr/home/hudson/hudson-slave/workspace/Lucene-Solr-Tests-trunk-java7/solr/example/lib/jetty-continuation-8.1.8.v20121106.jar:/usr/home/hudson/hudson-slave/workspace/Lucene-Solr-Tests-trunk-java7/solr/example/lib/jetty-deploy-8.1.8.v20121106.jar:/usr/home/hudson/hudson-slave/workspace/Lucene-Solr-Tests-trunk-java7/solr/example/lib/jetty-http-8.1.8.v20121106.jar:/usr/home/hudson/hudson-slave/workspace/Lucene-Solr-Tests-trunk-java7/solr/example/lib/jetty-io-8.1.8.v20121106.jar:/usr/home/hudson/hudson-slave/workspace/Lucene-Solr-Tests-trunk-java7/solr/example/lib/jetty-jmx-8.1.8.v20121106.jar:/usr/home/hudson/hudson-slave/workspace/Lucene-Solr-Tests-trunk-java7/solr/example/lib/jetty-security-8.1.8.v20121106.jar:/usr/home/hudson/hudson-slave/workspace/Lucene-Solr-Tests-trunk-java7/solr/example/lib/jetty-server-8.1.8.v20121106.jar:/usr/home/hudson/hudson-slave/workspace/Lucene-Solr-Tests-trunk-java7/solr/example/lib/jetty-servlet-8.1.8.v20121106.jar:/usr/home/hudson/hudson-slave/workspace/Lucene-Solr-Tests-trunk-java7/solr/example/lib/jetty-util-8.1.8.v20121106.jar:/usr/home/hudson/hudson-slave/workspace/Lucene-Solr-Tests-trunk-java7/solr/example/lib/jetty-webapp-8.1.8.v20121106.jar:/usr/home/hudson/hudson-slave/workspace/Lucene-Solr-Tests-trunk-java7/solr/example/lib/jetty-xml-8.1.8.v20121106.jar:/usr/home/hudson/hudson-slave/workspace/Lucene-Solr-Tests-trunk-java7/solr/example/lib/servlet-api-3.0.jar:/usr/home/hudson/hudson-slave/workspace/Lucene-Solr-Tests-trunk-java7/solr/example/example-DIH/solr/db/lib/derby-10.9.1.0.jar:/usr/home/hudson/hudson-slave/workspace/Lucene-Solr-Tests-trunk-java7/solr/example/example-DIH/solr/db/lib/hsqldb-1.8.0.10.jar:/usr/home/hudson/hudson-slave/workspace/Lucene-Solr-Tests-trunk-java7/lucene/build/core/classes/java:/usr/home/hudson/hudson-slave/workspace/Lucene-Solr-Tests-trunk-java7/lucene/test-framework/lib/junit-4.10.jar:/usr/home/hudson/hudson-slave/workspace/Lucene-Solr-Tests-trunk-java7/lucene/test-framework/lib/randomizedtesting-runner-2.0.7.jar:/home/hudson/hudson-slave/tools/Ant/ant-1.8.2/lib/ant-launcher.jar:/home/hudson/.ant/lib/ivy-2.2.0.jar:/home/hudson/hudson-slave/tools/Ant/ant-1.8.2/lib/ant-apache-regexp.jar:/home/hudson/hudson-slave/tools/Ant/ant-1.8.2/lib/ant-junit.jar:/home/hudson/hudson-slave/tools/Ant/ant-1.8.2/lib/ant-apache-bsf.jar:/home/hudson/hudson-slave/tools/Ant/ant-1.8.2/lib/ant-commons-net.jar:/home/hudson/hudson-slave/tools/Ant/ant-1.8.2/lib/ant-antlr.jar:/home/hudson/hudson-slave/tools/Ant/ant-1.8.2/lib/ant-apache-log4j.jar:/home/hudson/hudson-slave/tools/Ant/ant-1.8.2/lib/ant-commons-logging.jar:/home/hudson/hudson-slave/tools/Ant/ant-1.8.2/lib/ant-apache-xalan2.jar:/home/hudson/hudson-slave/tools/Ant/ant-1.8.2/lib/ant-apache-oro.jar:/home/hudson/hudson-slave/tools/Ant/ant-1.8.2/lib/ant-junit4.jar:/home/hudson/hudson-slave/tools/Ant/ant-1.8.2/lib/ant-netrexx.jar:/home/hudson/hudson-slave/tools/Ant/ant-1.8.2/lib/ant-swing.jar:/home/hudson/hudson-slave/tools/Ant/ant-1.8.2/lib/ant-javamail.jar:/home/hudson/hudson-slave/tools/Ant/ant-1.8.2/lib/ant-jsch.jar:/home/hudson/hudson-slave/tools/Ant/ant-1.8.2/lib/ant-jmf.jar:/home/hudson/hudson-slave/tools/Ant/ant-1.8.2/lib/ant.jar:/home/hudson/hudson-slave/tools/Ant/ant-1.8.2/lib/ant-apache-bcel.jar:/home/hudson/hudson-slave/tools/Ant/ant-1.8.2/lib/ant-jai.jar:/home/hudson/hudson-slave/tools/Ant/ant-1.8.2/lib/ant-testutil.jar:/home/hudson/hudson-slave/tools/Ant/ant-1.8.2/lib/ant-apache-resolver.jar:/home/hudson/hudson-slave/tools/Ant/ant-1.8.2/lib/ant-jdepend.jar:/usr/local/openjdk7/lib/tools.jar:/home/hudson/.ivy2/cache/com.carrotsearch.randomizedtesting/junit4-ant/jars/junit4-ant-2.0.7.jar
[junit4:junit4]   2> 86 T179 oaz.Environment.logEnv Server environment:java.library.path=/usr/local/openjdk7/jre/lib/amd64/server:/usr/local/openjdk7/jre/lib/amd64:/usr/local/openjdk7/jre/../lib/amd64:/usr/local/openjdk6/jre/lib/amd64/server:/usr/local/openjdk6/jre/lib/amd64:/usr/local/openjdk6/jre/../lib/amd64:/usr/java/packages/lib/amd64:/lib:/usr/lib:/usr/local/lib
[junit4:junit4]   2> 87 T179 oaz.Environment.logEnv Server environment:java.io.tmpdir=.
[junit4:junit4]   2> 87 T179 oaz.Environment.logEnv Server environment:java.compiler=<NA>
[junit4:junit4]   2> 87 T179 oaz.Environment.logEnv Server environment:os.name=FreeBSD
[junit4:junit4]   2> 88 T179 oaz.Environment.logEnv Server environment:os.arch=amd64
[junit4:junit4]   2> 88 T179 oaz.Environment.logEnv Server environment:os.version=9.0-RELEASE
[junit4:junit4]   2> 88 T179 oaz.Environment.logEnv Server environment:user.name=hudson
[junit4:junit4]   2> 89 T179 oaz.Environment.logEnv Server environment:user.home=/home/hudson
[junit4:junit4]   2> 89 T179 oaz.Environment.logEnv Server environment:user.dir=/usr/home/hudson/hudson-slave/workspace/Lucene-Solr-Tests-trunk-java7/solr/build/solr-core/test/J0
[junit4:junit4]   2> 143 T179 oazs.ZooKeeperServer.setTickTime tickTime set to 1000
[junit4:junit4]   2> 144 T179 oazs.ZooKeeperServer.setMinSessionTimeout minSessionTimeout set to -1
[junit4:junit4]   2> 144 T179 oazs.ZooKeeperServer.setMaxSessionTimeout maxSessionTimeout set to -1
[junit4:junit4]   2> 151 T179 oazs.NIOServerCnxnFactory.configure binding to port 0.0.0.0/0.0.0.0:0
[junit4:junit4]   2> 220 T178 oasc.ZkTestServer.run start zk server on port:18695
[junit4:junit4]   2> 221 T179 oazsp.FileTxnSnapLog.save Snapshotting: 0x0 to /usr/home/hudson/hudson-slave/workspace/Lucene-Solr-Tests-trunk-java7/solr/build/solr-core/test/J0/./org.apache.solr.cloud.BasicDistributedZkTest-1356915299762/zookeeper/server1/data/version-2/snapshot.0
[junit4:junit4]   2> 287 T178 oaz.Environment.logEnv Client environment:zookeeper.version=3.4.5-1392090, built on 09/30/2012 17:52 GMT
[junit4:junit4]   2> 288 T178 oaz.Environment.logEnv Client environment:host.name=lucene.zones.apache.org
[junit4:junit4]   2> 288 T178 oaz.Environment.logEnv Client environment:java.version=1.7.0_09
[junit4:junit4]   2> 288 T178 oaz.Environment.logEnv Client environment:java.vendor=Oracle Corporation
[junit4:junit4]   2> 289 T178 oaz.Environment.logEnv Client environment:java.home=/usr/local/openjdk7/jre
[junit4:junit4]   2> 289 T178 oaz.Environment.logEnv Client environment:java.class.path=/usr/home/hudson/hudson-slave/workspace/Lucene-Solr-Tests-trunk-java7/solr/build/solr-core/classes/test:/usr/home/hudson/hudson-slave/workspace/Lucene-Solr-Tests-trunk-java7/solr/build/solr-test-framework/classes/java:/usr/home/hudson/hudson-slave/workspace/Lucene-Solr-Tests-trunk-java7/solr/build/solr-core/test-files:/usr/home/hudson/hudson-slave/workspace/Lucene-Solr-Tests-trunk-java7/lucene/build/test-framework/classes/java:/usr/home/hudson/hudson-slave/workspace/Lucene-Solr-Tests-trunk-java7/lucene/build/codecs/classes/java:/usr/home/hudson/hudson-slave/workspace/Lucene-Solr-Tests-trunk-java7/solr/build/solr-solrj/classes/java:/usr/home/hudson/hudson-slave/workspace/Lucene-Solr-Tests-trunk-java7/solr/build/solr-core/classes/java:/usr/home/hudson/hudson-slave/workspace/Lucene-Solr-Tests-trunk-java7/lucene/build/analysis/common/lucene-analyzers-common-5.0-SNAPSHOT.jar:/usr/home/hudson/hudson-slave/workspace/Lucene-Solr-Tests-trunk-java7/lucene/build/analysis/kuromoji/lucene-analyzers-kuromoji-5.0-SNAPSHOT.jar:/usr/home/hudson/hudson-slave/workspace/Lucene-Solr-Tests-trunk-java7/lucene/build/analysis/phonetic/lucene-analyzers-phonetic-5.0-SNAPSHOT.jar:/usr/home/hudson/hudson-slave/workspace/Lucene-Solr-Tests-trunk-java7/lucene/build/highlighter/lucene-highlighter-5.0-SNAPSHOT.jar:/usr/home/hudson/hudson-slave/workspace/Lucene-Solr-Tests-trunk-java7/lucene/build/memory/lucene-memory-5.0-SNAPSHOT.jar:/usr/home/hudson/hudson-slave/workspace/Lucene-Solr-Tests-trunk-java7/lucene/build/misc/lucene-misc-5.0-SNAPSHOT.jar:/usr/home/hudson/hudson-slave/workspace/Lucene-Solr-Tests-trunk-java7/lucene/build/spatial/lucene-spatial-5.0-SNAPSHOT.jar:/usr/home/hudson/hudson-slave/workspace/Lucene-Solr-Tests-trunk-java7/lucene/build/suggest/lucene-suggest-5.0-SNAPSHOT.jar:/usr/home/hudson/hudson-slave/workspace/Lucene-Solr-Tests-trunk-java7/lucene/build/grouping/lucene-grouping-5.0-SNAPSHOT.jar:/usr/home/hudson/hudson-slave/workspace/Lucene-Solr-Tests-trunk-java7/lucene/build/queries/lucene-queries-5.0-SNAPSHOT.jar:/usr/home/hudson/hudson-slave/workspace/Lucene-Solr-Tests-trunk-java7/lucene/build/queryparser/lucene-queryparser-5.0-SNAPSHOT.jar:/usr/home/hudson/hudson-slave/workspace/Lucene-Solr-Tests-trunk-java7/solr/core/lib/cglib-nodep-2.2.jar:/usr/home/hudson/hudson-slave/workspace/Lucene-Solr-Tests-trunk-java7/solr/core/lib/commons-cli-1.2.jar:/usr/home/hudson/hudson-slave/workspace/Lucene-Solr-Tests-trunk-java7/solr/core/lib/commons-codec-1.7.jar:/usr/home/hudson/hudson-slave/workspace/Lucene-Solr-Tests-trunk-java7/solr/core/lib/commons-fileupload-1.2.1.jar:/usr/home/hudson/hudson-slave/workspace/Lucene-Solr-Tests-trunk-java7/solr/core/lib/commons-lang-2.6.jar:/usr/home/hudson/hudson-slave/workspace/Lucene-Solr-Tests-trunk-java7/solr/core/lib/easymock-3.0.jar:/usr/home/hudson/hudson-slave/workspace/Lucene-Solr-Tests-trunk-java7/solr/core/lib/guava-13.0.1.jar:/usr/home/hudson/hudson-slave/workspace/Lucene-Solr-Tests-trunk-java7/solr/core/lib/javax.servlet-api-3.0.1.jar:/usr/home/hudson/hudson-slave/workspace/Lucene-Solr-Tests-trunk-java7/solr/core/lib/objenesis-1.2.jar:/usr/home/hudson/hudson-slave/workspace/Lucene-Solr-Tests-trunk-java7/solr/core/lib/spatial4j-0.3.jar:/usr/home/hudson/hudson-slave/workspace/Lucene-Solr-Tests-trunk-java7/solr/solrj/lib/commons-io-2.1.jar:/usr/home/hudson/hudson-slave/workspace/Lucene-Solr-Tests-trunk-java7/solr/solrj/lib/httpclient-4.1.3.jar:/usr/home/hudson/hudson-slave/workspace/Lucene-Solr-Tests-trunk-java7/solr/solrj/lib/httpcore-4.1.4.jar:/usr/home/hudson/hudson-slave/workspace/Lucene-Solr-Tests-trunk-java7/solr/solrj/lib/httpmime-4.1.3.jar:/usr/home/hudson/hudson-slave/workspace/Lucene-Solr-Tests-trunk-java7/solr/solrj/lib/jcl-over-slf4j-1.6.4.jar:/usr/home/hudson/hudson-slave/workspace/Lucene-Solr-Tests-trunk-java7/solr/solrj/lib/log4j-over-slf4j-1.6.4.jar:/usr/home/hudson/hudson-slave/workspace/Lucene-Solr-Tests-trunk-java7/solr/solrj/lib/slf4j-api-1.6.4.jar:/usr/home/hudson/hudson-slave/workspace/Lucene-Solr-Tests-trunk-java7/solr/solrj/lib/slf4j-jdk14-1.6.4.jar:/usr/home/hudson/hudson-slave/workspace/Lucene-Solr-Tests-trunk-java7/solr/solrj/lib/wstx-asl-3.2.7.jar:/usr/home/hudson/hudson-slave/workspace/Lucene-Solr-Tests-trunk-java7/solr/solrj/lib/zookeeper-3.4.5.jar:/usr/home/hudson/hudson-slave/workspace/Lucene-Solr-Tests-trunk-java7/solr/example/lib/jetty-continuation-8.1.8.v20121106.jar:/usr/home/hudson/hudson-slave/workspace/Lucene-Solr-Tests-trunk-java7/solr/example/lib/jetty-deploy-8.1.8.v20121106.jar:/usr/home/hudson/hudson-slave/workspace/Lucene-Solr-Tests-trunk-java7/solr/example/lib/jetty-http-8.1.8.v20121106.jar:/usr/home/hudson/hudson-slave/workspace/Lucene-Solr-Tests-trunk-java7/solr/example/lib/jetty-io-8.1.8.v20121106.jar:/usr/home/hudson/hudson-slave/workspace/Lucene-Solr-Tests-trunk-java7/solr/example/lib/jetty-jmx-8.1.8.v20121106.jar:/usr/home/hudson/hudson-slave/workspace/Lucene-Solr-Tests-trunk-java7/solr/example/lib/jetty-security-8.1.8.v20121106.jar:/usr/home/hudson/hudson-slave/workspace/Lucene-Solr-Tests-trunk-java7/solr/example/lib/jetty-server-8.1.8.v20121106.jar:/usr/home/hudson/hudson-slave/workspace/Lucene-Solr-Tests-trunk-java7/solr/example/lib/jetty-servlet-8.1.8.v20121106.jar:/usr/home/hudson/hudson-slave/workspace/Lucene-Solr-Tests-trunk-java7/solr/example/lib/jetty-util-8.1.8.v20121106.jar:/usr/home/hudson/hudson-slave/workspace/Lucene-Solr-Tests-trunk-java7/solr/example/lib/jetty-webapp-8.1.8.v20121106.jar:/usr/home/hudson/hudson-slave/workspace/Lucene-Solr-Tests-trunk-java7/solr/example/lib/jetty-xml-8.1.8.v20121106.jar:/usr/home/hudson/hudson-slave/workspace/Lucene-Solr-Tests-trunk-java7/solr/example/lib/servlet-api-3.0.jar:/usr/home/hudson/hudson-slave/workspace/Lucene-Solr-Tests-trunk-java7/solr/example/example-DIH/solr/db/lib/derby-10.9.1.0.jar:/usr/home/hudson/hudson-slave/workspace/Lucene-Solr-Tests-trunk-java7/solr/example/example-DIH/solr/db/lib/hsqldb-1.8.0.10.jar:/usr/home/hudson/hudson-slave/workspace/Lucene-Solr-Tests-trunk-java7/lucene/build/core/classes/java:/usr/home/hudson/hudson-slave/workspace/Lucene-Solr-Tests-trunk-java7/lucene/test-framework/lib/junit-4.10.jar:/usr/home/hudson/hudson-slave/workspace/Lucene-Solr-Tests-trunk-java7/lucene/test-framework/lib/randomizedtesting-runner-2.0.7.jar:/home/hudson/hudson-slave/tools/Ant/ant-1.8.2/lib/ant-launcher.jar:/home/hudson/.ant/lib/ivy-2.2.0.jar:/home/hudson/hudson-slave/tools/Ant/ant-1.8.2/lib/ant-apache-regexp.jar:/home/hudson/hudson-slave/tools/Ant/ant-1.8.2/lib/ant-junit.jar:/home/hudson/hudson-slave/tools/Ant/ant-1.8.2/lib/ant-apache-bsf.jar:/home/hudson/hudson-slave/tools/Ant/ant-1.8.2/lib/ant-commons-net.jar:/home/hudson/hudson-slave/tools/Ant/ant-1.8.2/lib/ant-antlr.jar:/home/hudson/hudson-slave/tools/Ant/ant-1.8.2/lib/ant-apache-log4j.jar:/home/hudson/hudson-slave/tools/Ant/ant-1.8.2/lib/ant-commons-logging.jar:/home/hudson/hudson-slave/tools/Ant/ant-1.8.2/lib/ant-apache-xalan2.jar:/home/hudson/hudson-slave/tools/Ant/ant-1.8.2/lib/ant-apache-oro.jar:/home/hudson/hudson-slave/tools/Ant/ant-1.8.2/lib/ant-junit4.jar:/home/hudson/hudson-slave/tools/Ant/ant-1.8.2/lib/ant-netrexx.jar:/home/hudson/hudson-slave/tools/Ant/ant-1.8.2/lib/ant-swing.jar:/home/hudson/hudson-slave/tools/Ant/ant-1.8.2/lib/ant-javamail.jar:/home/hudson/hudson-slave/tools/Ant/ant-1.8.2/lib/ant-jsch.jar:/home/hudson/hudson-slave/tools/Ant/ant-1.8.2/lib/ant-jmf.jar:/home/hudson/hudson-slave/tools/Ant/ant-1.8.2/lib/ant.jar:/home/hudson/hudson-slave/tools/Ant/ant-1.8.2/lib/ant-apache-bcel.jar:/home/hudson/hudson-slave/tools/Ant/ant-1.8.2/lib/ant-jai.jar:/home/hudson/hudson-slave/tools/Ant/ant-1.8.2/lib/ant-testutil.jar:/home/hudson/hudson-slave/tools/Ant/ant-1.8.2/lib/ant-apache-resolver.jar:/home/hudson/hudson-slave/tools/Ant/ant-1.8.2/lib/ant-jdepend.jar:/usr/local/openjdk7/lib/tools.jar:/home/hudson/.ivy2/cache/com.carrotsearch.randomizedtesting/junit4-ant/jars/junit4-ant-2.0.7.jar
[junit4:junit4]   2> 290 T178 oaz.Environment.logEnv Client environment:java.library.path=/usr/local/openjdk7/jre/lib/amd64/server:/usr/local/openjdk7/jre/lib/amd64:/usr/local/openjdk7/jre/../lib/amd64:/usr/local/openjdk6/jre/lib/amd64/server:/usr/local/openjdk6/jre/lib/amd64:/usr/local/openjdk6/jre/../lib/amd64:/usr/java/packages/lib/amd64:/lib:/usr/lib:/usr/local/lib
[junit4:junit4]   2> 291 T178 oaz.Environment.logEnv Client environment:java.io.tmpdir=.
[junit4:junit4]   2> 291 T178 oaz.Environment.logEnv Client environment:java.compiler=<NA>
[junit4:junit4]   2> 292 T178 oaz.Environment.logEnv Client environment:os.name=FreeBSD
[junit4:junit4]   2> 292 T178 oaz.Environment.logEnv Client environment:os.arch=amd64
[junit4:junit4]   2> 292 T178 oaz.Environment.logEnv Client environment:os.version=9.0-RELEASE
[junit4:junit4]   2> 293 T178 oaz.Environment.logEnv Client environment:user.name=hudson
[junit4:junit4]   2> 293 T178 oaz.Environment.logEnv Client environment:user.home=/home/hudson
[junit4:junit4]   2> 294 T178 oaz.Environment.logEnv Client environment:user.dir=/usr/home/hudson/hudson-slave/workspace/Lucene-Solr-Tests-trunk-java7/solr/build/solr-core/test/J0
[junit4:junit4]   2> 297 T178 oaz.ZooKeeper.<init> Initiating client connection, connectString=127.0.0.1:18695 sessionTimeout=10000 watcher=org.apache.solr.common.cloud.ConnectionManager@2ab937ac
[junit4:junit4]   2> 355 T178 oascc.ConnectionManager.waitForConnected Waiting for client to connect to ZooKeeper
[junit4:junit4]   2> 367 T184 oaz.ClientCnxn$SendThread.logStartConnect Opening socket connection to server localhost/127.0.0.1:18695. Will not attempt to authenticate using SASL (access denied ("javax.security.auth.AuthPermission" "getLoginConfiguration"))
[junit4:junit4]   2> 370 T184 oaz.ClientCnxn$SendThread.primeConnection Socket connection established to localhost/127.0.0.1:18695, initiating session
[junit4:junit4]   2> 371 T180 oazs.NIOServerCnxnFactory.run Accepted socket connection from /140.211.11.196:18696
[junit4:junit4]   2> 395 T180 oazs.ZooKeeperServer.processConnectRequest Client attempting to establish new session at /140.211.11.196:18696
[junit4:junit4]   2> 412 T182 oazsp.FileTxnLog.append Creating new log file: log.1
[junit4:junit4]   2> 443 T182 oazs.ZooKeeperServer.finishSessionInit Established session 0x13bee7456a60000 with negotiated timeout 10000 for client /140.211.11.196:18696
[junit4:junit4]   2> 444 T184 oaz.ClientCnxn$SendThread.onConnected Session establishment complete on server localhost/127.0.0.1:18695, sessionid = 0x13bee7456a60000, negotiated timeout = 10000
[junit4:junit4]   2> 453 T185 oascc.ConnectionManager.process Watcher org.apache.solr.common.cloud.ConnectionManager@2ab937ac name:ZooKeeperConnection Watcher:127.0.0.1:18695 got event WatchedEvent state:SyncConnected type:None path:null path:null type:None
[junit4:junit4]   2> 453 T178 oascc.ConnectionManager.waitForConnected Client is connected to ZooKeeper
[junit4:junit4]   2> 457 T178 oascc.SolrZkClient.makePath makePath: /solr
[junit4:junit4]   2> 516 T183 oazs.PrepRequestProcessor.pRequest2Txn Processed session termination for sessionid: 0x13bee7456a60000
[junit4:junit4]   2> 517 T185 oaz.ClientCnxn$EventThread.run EventThread shut down
[junit4:junit4]   2> 517 T178 oaz.ZooKeeper.close Session: 0x13bee7456a60000 closed
[junit4:junit4]   2> 518 T180 oazs.NIOServerCnxn.closeSock Closed socket connection for client /140.211.11.196:18696 which had sessionid 0x13bee7456a60000
[junit4:junit4]   2> 519 T178 oaz.ZooKeeper.<init> Initiating client connection, connectString=127.0.0.1:18695/solr sessionTimeout=10000 watcher=org.apache.solr.common.cloud.ConnectionManager@1182aa34
[junit4:junit4]   2> 519 T178 oascc.ConnectionManager.waitForConnected Waiting for client to connect to ZooKeeper
[junit4:junit4]   2> 520 T186 oaz.ClientCnxn$SendThread.logStartConnect Opening socket connection to server localhost/127.0.0.1:18695. Will not attempt to authenticate using SASL (access denied ("javax.security.auth.AuthPermission" "getLoginConfiguration"))
[junit4:junit4]   2> 520 T186 oaz.ClientCnxn$SendThread.primeConnection Socket connection established to localhost/127.0.0.1:18695, initiating session
[junit4:junit4]   2> 520 T180 oazs.NIOServerCnxnFactory.run Accepted socket connection from /140.211.11.196:18697
[junit4:junit4]   2> 521 T180 oazs.ZooKeeperServer.processConnectRequest Client attempting to establish new session at /140.211.11.196:18697
[junit4:junit4]   2> 522 T182 oazs.ZooKeeperServer.finishSessionInit Established session 0x13bee7456a60001 with negotiated timeout 10000 for client /140.211.11.196:18697
[junit4:junit4]   2> 523 T186 oaz.ClientCnxn$SendThread.onConnected Session establishment complete on server localhost/127.0.0.1:18695, sessionid = 0x13bee7456a60001, negotiated timeout = 10000
[junit4:junit4]   2> 523 T187 oascc.ConnectionManager.process Watcher org.apache.solr.common.cloud.ConnectionManager@1182aa34 name:ZooKeeperConnection Watcher:127.0.0.1:18695/solr got event WatchedEvent state:SyncConnected type:None path:null path:null type:None
[junit4:junit4]   2> 523 T178 oascc.ConnectionManager.waitForConnected Client is connected to ZooKeeper
[junit4:junit4]   2> 533 T178 oascc.SolrZkClient.makePath makePath: /collections/collection1
[junit4:junit4]   2> 538 T178 oascc.SolrZkClient.makePath makePath: /collections/collection1/shards
[junit4:junit4]   2> 547 T178 oascc.SolrZkClient.makePath makePath: /collections/control_collection
[junit4:junit4]   2> 550 T178 oascc.SolrZkClient.makePath makePath: /collections/control_collection/shards
[junit4:junit4]   2> 554 T178 oasc.AbstractZkTestCase.putConfig put /usr/home/hudson/hudson-slave/workspace/Lucene-Solr-Tests-trunk-java7/solr/build/solr-core/test-files/solr/collection1/conf/solrconfig.xml to /configs/conf1/solrconfig.xml
[junit4:junit4]   2> 575 T178 oascc.SolrZkClient.makePath makePath: /configs/conf1/solrconfig.xml
[junit4:junit4]   2> 589 T178 oasc.AbstractZkTestCase.putConfig put /usr/home/hudson/hudson-slave/workspace/Lucene-Solr-Tests-trunk-java7/solr/build/solr-core/test-files/solr/collection1/conf/schema.xml to /configs/conf1/schema.xml
[junit4:junit4]   2> 590 T178 oascc.SolrZkClient.makePath makePath: /configs/conf1/schema.xml
[junit4:junit4]   2> 696 T178 oasc.AbstractZkTestCase.putConfig put /usr/home/hudson/hudson-slave/workspace/Lucene-Solr-Tests-trunk-java7/solr/build/solr-core/test-files/solr/collection1/conf/stopwords.txt to /configs/conf1/stopwords.txt
[junit4:junit4]   2> 697 T178 oascc.SolrZkClient.makePath makePath: /configs/conf1/stopwords.txt
[junit4:junit4]   2> 702 T178 oasc.AbstractZkTestCase.putConfig put /usr/home/hudson/hudson-slave/workspace/Lucene-Solr-Tests-trunk-java7/solr/build/solr-core/test-files/solr/collection1/conf/protwords.txt to /configs/conf1/protwords.txt
[junit4:junit4]   2> 702 T178 oascc.SolrZkClient.makePath makePath: /configs/conf1/protwords.txt
[junit4:junit4]   2> 707 T178 oasc.AbstractZkTestCase.putConfig put /usr/home/hudson/hudson-slave/workspace/Lucene-Solr-Tests-trunk-java7/solr/build/solr-core/test-files/solr/collection1/conf/currency.xml to /configs/conf1/currency.xml
[junit4:junit4]   2> 707 T178 oascc.SolrZkClient.makePath makePath: /configs/conf1/currency.xml
[junit4:junit4]   2> 712 T178 oasc.AbstractZkTestCase.putConfig put /usr/home/hudson/hudson-slave/workspace/Lucene-Solr-Tests-trunk-java7/solr/build/solr-core/test-files/solr/collection1/conf/open-exchange-rates.json to /configs/conf1/open-exchange-rates.json
[junit4:junit4]   2> 713 T178 oascc.SolrZkClient.makePath makePath: /configs/conf1/open-exchange-rates.json
[junit4:junit4]   2> 717 T178 oasc.AbstractZkTestCase.putConfig put /usr/home/hudson/hudson-slave/workspace/Lucene-Solr-Tests-trunk-java7/solr/build/solr-core/test-files/solr/collection1/conf/mapping-ISOLatin1Accent.txt to /configs/conf1/mapping-ISOLatin1Accent.txt
[junit4:junit4]   2> 718 T178 oascc.SolrZkClient.makePath makePath: /configs/conf1/mapping-ISOLatin1Accent.txt
[junit4:junit4]   2> 723 T178 oasc.AbstractZkTestCase.putConfig put /usr/home/hudson/hudson-slave/workspace/Lucene-Solr-Tests-trunk-java7/solr/build/solr-core/test-files/solr/collection1/conf/old_synonyms.txt to /configs/conf1/old_synonyms.txt
[junit4:junit4]   2> 723 T178 oascc.SolrZkClient.makePath makePath: /configs/conf1/old_synonyms.txt
[junit4:junit4]   2> 728 T178 oasc.AbstractZkTestCase.putConfig put /usr/home/hudson/hudson-slave/workspace/Lucene-Solr-Tests-trunk-java7/solr/build/solr-core/test-files/solr/collection1/conf/synonyms.txt to /configs/conf1/synonyms.txt
[junit4:junit4]   2> 729 T178 oascc.SolrZkClient.makePath makePath: /configs/conf1/synonyms.txt
[junit4:junit4]   2> 733 T183 oazs.PrepRequestProcessor.pRequest2Txn Processed session termination for sessionid: 0x13bee7456a60001
[junit4:junit4]   2> 734 T187 oaz.ClientCnxn$EventThread.run EventThread shut down
[junit4:junit4]   2> 734 T178 oaz.ZooKeeper.close Session: 0x13bee7456a60001 closed
[junit4:junit4]   2> 735 T180 oazs.NIOServerCnxn.closeSock Closed socket connection for client /140.211.11.196:18697 which had sessionid 0x13bee7456a60001
[junit4:junit4]   2> 863 T178 oejs.Server.doStart jetty-8.1.8.v20121106
[junit4:junit4]   2> 866 T178 oejs.AbstractConnector.doStart Started SocketConnector@127.0.0.1:18698
[junit4:junit4]   2> 867 T178 oasc.SolrResourceLoader.locateSolrHome JNDI not configured for solr (NoInitialContextEx)
[junit4:junit4]   2> 868 T178 oasc.SolrResourceLoader.locateSolrHome using system property solr.solr.home: /usr/home/hudson/hudson-slave/workspace/Lucene-Solr-Tests-trunk-java7/solr/build/solr-core/test/J0/./org.apache.solr.cloud.BasicDistributedZkTest-controljetty-1356915300491
[junit4:junit4]   2> 868 T178 oasc.SolrResourceLoader.<init> new SolrResourceLoader for deduced Solr Home: '/usr/home/hudson/hudson-slave/workspace/Lucene-Solr-Tests-trunk-java7/solr/build/solr-core/test/J0/./org.apache.solr.cloud.BasicDistributedZkTest-controljetty-1356915300491/'
[junit4:junit4]   2> 899 T178 oass.SolrDispatchFilter.init SolrDispatchFilter.init()
[junit4:junit4]   2> 900 T178 oasc.SolrResourceLoader.locateSolrHome JNDI not configured for solr (NoInitialContextEx)
[junit4:junit4]   2> 900 T178 oasc.SolrResourceLoader.locateSolrHome using system property solr.solr.home: /usr/home/hudson/hudson-slave/workspace/Lucene-Solr-Tests-trunk-java7/solr/build/solr-core/test/J0/./org.apache.solr.cloud.BasicDistributedZkTest-controljetty-1356915300491
[junit4:junit4]   2> 901 T178 oasc.CoreContainer$Initializer.initialize looking for solr.xml: /usr/home/hudson/hudson-slave/workspace/Lucene-Solr-Tests-trunk-java7/solr/build/solr-core/test/J0/./org.apache.solr.cloud.BasicDistributedZkTest-controljetty-1356915300491/solr.xml
[junit4:junit4]   2> 901 T178 oasc.CoreContainer.<init> New CoreContainer 1924255652
[junit4:junit4]   2> 902 T178 oasc.CoreContainer.load Loading CoreContainer using Solr Home: '/usr/home/hudson/hudson-slave/workspace/Lucene-Solr-Tests-trunk-java7/solr/build/solr-core/test/J0/./org.apache.solr.cloud.BasicDistributedZkTest-controljetty-1356915300491/'
[junit4:junit4]   2> 902 T178 oasc.SolrResourceLoader.<init> new SolrResourceLoader for directory: '/usr/home/hudson/hudson-slave/workspace/Lucene-Solr-Tests-trunk-java7/solr/build/solr-core/test/J0/./org.apache.solr.cloud.BasicDistributedZkTest-controljetty-1356915300491/'
[junit4:junit4]   2> 925 T178 oashc.HttpShardHandlerFactory.getParameter Setting socketTimeout to: 30000
[junit4:junit4]   2> 925 T178 oashc.HttpShardHandlerFactory.getParameter Setting urlScheme to: http://
[junit4:junit4]   2> 926 T178 oashc.HttpShardHandlerFactory.getParameter Setting connTimeout to: 15000
[junit4:junit4]   2> 926 T178 oashc.HttpShardHandlerFactory.getParameter Setting maxConnectionsPerHost to: 20
[junit4:junit4]   2> 927 T178 oashc.HttpShardHandlerFactory.getParameter Setting corePoolSize to: 0
[junit4:junit4]   2> 927 T178 oashc.HttpShardHandlerFactory.getParameter Setting maximumPoolSize to: 2147483647
[junit4:junit4]   2> 927 T178 oashc.HttpShardHandlerFactory.getParameter Setting maxThreadIdleTime to: 5
[junit4:junit4]   2> 928 T178 oashc.HttpShardHandlerFactory.getParameter Setting sizeOfQueue to: -1
[junit4:junit4]   2> 928 T178 oashc.HttpShardHandlerFactory.getParameter Setting fairnessPolicy to: false
[junit4:junit4]   2> 929 T178 oascsi.HttpClientUtil.createClient Creating new http client, config:maxConnectionsPerHost=20&maxConnections=10000&socketTimeout=30000&connTimeout=15000&retry=false
[junit4:junit4]   2> 947 T178 oasc.CoreContainer.load Registering Log Listener
[junit4:junit4]   2> 964 T178 oasc.CoreContainer.initZooKeeper Zookeeper client=127.0.0.1:18695/solr
[junit4:junit4]   2> 984 T178 oasc.ZkController.checkChrootPath zkHost includes chroot
[junit4:junit4]   2> 984 T178 oaz.ZooKeeper.<init> Initiating client connection, connectString=127.0.0.1:18695 sessionTimeout=60000 watcher=org.apache.solr.common.cloud.ConnectionManager@76f6896b
[junit4:junit4]   2> 985 T178 oascc.ConnectionManager.waitForConnected Waiting for client to connect to ZooKeeper
[junit4:junit4]   2> 986 T197 oaz.ClientCnxn$SendThread.logStartConnect Opening socket connection to server localhost/127.0.0.1:18695. Will not attempt to authenticate using SASL (access denied ("javax.security.auth.AuthPermission" "getLoginConfiguration"))
[junit4:junit4]   2> 987 T197 oaz.ClientCnxn$SendThread.primeConnection Socket connection established to localhost/127.0.0.1:18695, initiating session
[junit4:junit4]   2> 987 T180 oazs.NIOServerCnxnFactory.run Accepted socket connection from /140.211.11.196:18699
[junit4:junit4]   2> 988 T180 oazs.ZooKeeperServer.processConnectRequest Client attempting to establish new session at /140.211.11.196:18699
[junit4:junit4]   2> 990 T182 oazs.ZooKeeperServer.finishSessionInit Established session 0x13bee7456a60002 with negotiated timeout 20000 for client /140.211.11.196:18699
[junit4:junit4]   2> 990 T197 oaz.ClientCnxn$SendThread.onConnected Session establishment complete on server localhost/127.0.0.1:18695, sessionid = 0x13bee7456a60002, negotiated timeout = 20000
[junit4:junit4]   2> 990 T198 oascc.ConnectionManager.process Watcher org.apache.solr.common.cloud.ConnectionManager@76f6896b name:ZooKeeperConnection Watcher:127.0.0.1:18695 got event WatchedEvent state:SyncConnected type:None path:null path:null type:None
[junit4:junit4]   2> 990 T178 oascc.ConnectionManager.waitForConnected Client is connected to ZooKeeper
[junit4:junit4]   2> 992 T183 oazs.PrepRequestProcessor.pRequest2Txn Processed session termination for sessionid: 0x13bee7456a60002
[junit4:junit4]   2> 994 T198 oaz.ClientCnxn$EventThread.run EventThread shut down
[junit4:junit4]   2> 994 T180 oazs.NIOServerCnxn.closeSock Closed socket connection for client /140.211.11.196:18699 which had sessionid 0x13bee7456a60002
[junit4:junit4]   2> 994 T178 oaz.ZooKeeper.close Session: 0x13bee7456a60002 closed
[junit4:junit4]   2> 997 T178 oascsi.HttpClientUtil.createClient Creating new http client, config:maxConnections=500&maxConnectionsPerHost=16&socketTimeout=15000&connTimeout=30000
[junit4:junit4]   2> 1010 T178 oaz.ZooKeeper.<init> Initiating client connection, connectString=127.0.0.1:18695/solr sessionTimeout=30000 watcher=org.apache.solr.common.cloud.ConnectionManager@71f7162
[junit4:junit4]   2> 1011 T178 oascc.ConnectionManager.waitForConnected Waiting for client to connect to ZooKeeper
[junit4:junit4]   2> 1012 T199 oaz.ClientCnxn$SendThread.logStartConnect Opening socket connection to server localhost/127.0.0.1:18695. Will not attempt to authenticate using SASL (access denied ("javax.security.auth.AuthPermission" "getLoginConfiguration"))
[junit4:junit4]   2> 1012 T199 oaz.ClientCnxn$SendThread.primeConnection Socket connection established to localhost/127.0.0.1:18695, initiating session
[junit4:junit4]   2> 1013 T180 oazs.NIOServerCnxnFactory.run Accepted socket connection from /140.211.11.196:18700
[junit4:junit4]   2> 1013 T180 oazs.ZooKeeperServer.processConnectRequest Client attempting to establish new session at /140.211.11.196:18700
[junit4:junit4]   2> 1015 T182 oazs.ZooKeeperServer.finishSessionInit Established session 0x13bee7456a60003 with negotiated timeout 20000 for client /140.211.11.196:18700
[junit4:junit4]   2> 1015 T199 oaz.ClientCnxn$SendThread.onConnected Session establishment complete on server localhost/127.0.0.1:18695, sessionid = 0x13bee7456a60003, negotiated timeout = 20000
[junit4:junit4]   2> 1015 T200 oascc.ConnectionManager.process Watcher org.apache.solr.common.cloud.ConnectionManager@71f7162 name:ZooKeeperConnection Watcher:127.0.0.1:18695/solr got event WatchedEvent state:SyncConnected type:None path:null path:null type:None
[junit4:junit4]   2> 1016 T178 oascc.ConnectionManager.waitForConnected Client is connected to ZooKeeper
[junit4:junit4]   2> 1031 T183 oazs.PrepRequestProcessor.pRequest Got user-level KeeperException when processing sessionid:0x13bee7456a60003 type:create cxid:0x2 zxid:0x1a txntype:-1 reqpath:n/a Error Path:/solr/overseer Error:KeeperErrorCode = NodeExists for /solr/overseer
[junit4:junit4]   2> 1039 T178 oascc.SolrZkClient.makePath makePath: /live_nodes
[junit4:junit4]   2> 1043 T178 oasc.ZkController.createEphemeralLiveNode Register node as live in ZooKeeper:/live_nodes/127.0.0.1:18698_j
[junit4:junit4]   2> 1048 T183 oazs.PrepRequestProcessor.pRequest Got user-level KeeperException when processing sessionid:0x13bee7456a60003 type:delete cxid:0x7 zxid:0x1c txntype:-1 reqpath:n/a Error Path:/solr/live_nodes/127.0.0.1:18698_j Error:KeeperErrorCode = NoNode for /solr/live_nodes/127.0.0.1:18698_j
[junit4:junit4]   2> 1049 T178 oascc.SolrZkClient.makePath makePath: /live_nodes/127.0.0.1:18698_j
[junit4:junit4]   2> 1058 T178 oascc.SolrZkClient.makePath makePath: /overseer_elect/election
[junit4:junit4]   2> 1083 T183 oazs.PrepRequestProcessor.pRequest Got user-level KeeperException when processing sessionid:0x13bee7456a60003 type:delete cxid:0x15 zxid:0x21 txntype:-1 reqpath:n/a Error Path:/solr/overseer_elect/leader Error:KeeperErrorCode = NoNode for /solr/overseer_elect/leader
[junit4:junit4]   2> 1085 T178 oascc.SolrZkClient.makePath makePath: /overseer_elect/leader
[junit4:junit4]   2> 1090 T178 oasc.Overseer.start Overseer (id=88926801101193219-127.0.0.1:18698_j-n_0000000000) starting
[junit4:junit4]   2> 1091 T183 oazs.PrepRequestProcessor.pRequest Got user-level KeeperException when processing sessionid:0x13bee7456a60003 type:create cxid:0x1a zxid:0x23 txntype:-1 reqpath:n/a Error Path:/solr/overseer Error:KeeperErrorCode = NodeExists for /solr/overseer
[junit4:junit4]   2> 1109 T183 oazs.PrepRequestProcessor.pRequest Got user-level KeeperException when processing sessionid:0x13bee7456a60003 type:create cxid:0x1b zxid:0x24 txntype:-1 reqpath:n/a Error Path:/solr/overseer Error:KeeperErrorCode = NodeExists for /solr/overseer
[junit4:junit4]   2> 1111 T183 oazs.PrepRequestProcessor.pRequest Got user-level KeeperException when processing sessionid:0x13bee7456a60003 type:create cxid:0x1c zxid:0x25 txntype:-1 reqpath:n/a Error Path:/solr/overseer Error:KeeperErrorCode = NodeExists for /solr/overseer
[junit4:junit4]   2> 1117 T183 oazs.PrepRequestProcessor.pRequest Got user-level KeeperException when processing sessionid:0x13bee7456a60003 type:create cxid:0x1d zxid:0x26 txntype:-1 reqpath:n/a Error Path:/solr/overseer Error:KeeperErrorCode = NodeExists for /solr/overseer
[junit4:junit4]   2> 1119 T202 oasc.OverseerCollectionProcessor.run Process current queue of collection messages
[junit4:junit4]   2> 1120 T178 oascc.SolrZkClient.makePath makePath: /clusterstate.json
[junit4:junit4]   2> 1124 T178 oascc.ZkStateReader.createClusterStateWatchersAndUpdate Updating cluster state from ZooKeeper... 
[junit4:junit4]   2> 1140 T201 oasc.Overseer$ClusterStateUpdater.run Starting to work on the main queue
[junit4:junit4]   2> 1148 T203 oasc.CoreContainer.create Creating SolrCore 'collection1' using instanceDir: /usr/home/hudson/hudson-slave/workspace/Lucene-Solr-Tests-trunk-java7/solr/build/solr-core/test/J0/./org.apache.solr.cloud.BasicDistributedZkTest-controljetty-1356915300491/collection1
[junit4:junit4]   2> 1149 T203 oasc.ZkController.createCollectionZkNode Check for collection zkNode:control_collection
[junit4:junit4]   2> 1150 T203 oasc.ZkController.createCollectionZkNode Collection zkNode exists
[junit4:junit4]   2> 1150 T203 oasc.ZkController.readConfigName Load collection config from:/collections/control_collection
[junit4:junit4]   2> 1153 T203 oasc.SolrResourceLoader.<init> new SolrResourceLoader for directory: '/usr/home/hudson/hudson-slave/workspace/Lucene-Solr-Tests-trunk-java7/solr/build/solr-core/test/J0/./org.apache.solr.cloud.BasicDistributedZkTest-controljetty-1356915300491/collection1/'
[junit4:junit4]   2> 1154 T203 oasc.SolrResourceLoader.replaceClassLoader Adding 'file:/usr/home/hudson/hudson-slave/workspace/Lucene-Solr-Tests-trunk-java7/solr/build/solr-core/test/J0/org.apache.solr.cloud.BasicDistributedZkTest-controljetty-1356915300491/collection1/lib/classes/' to classloader
[junit4:junit4]   2> 1155 T203 oasc.SolrResourceLoader.replaceClassLoader Adding 'file:/usr/home/hudson/hudson-slave/workspace/Lucene-Solr-Tests-trunk-java7/solr/build/solr-core/test/J0/org.apache.solr.cloud.BasicDistributedZkTest-controljetty-1356915300491/collection1/lib/README' to classloader
[junit4:junit4]   2> 1248 T203 oasc.SolrConfig.<init> Using Lucene MatchVersion: LUCENE_50
[junit4:junit4]   2> 1329 T203 oasc.SolrConfig.<init> Loaded SolrConfig: solrconfig.xml
[junit4:junit4]   2> 1431 T203 oass.IndexSchema.readSchema Reading Solr Schema
[junit4:junit4]   2> 1439 T203 oass.IndexSchema.readSchema Schema name=test
[junit4:junit4]   2> 2131 T203 oass.OpenExchangeRatesOrgProvider.init Initialized with rates=open-exchange-rates.json, refreshInterval=1440.
[junit4:junit4]   2> 2144 T203 oass.IndexSchema.readSchema default search field in schema is text
[junit4:junit4]   2> 2149 T203 oass.IndexSchema.readSchema unique key field: id
[junit4:junit4]   2> 2187 T203 oass.FileExchangeRateProvider.reload Reloading exchange rates from file currency.xml
[junit4:junit4]   2> 2193 T203 oass.FileExchangeRateProvider.reload Reloading exchange rates from file currency.xml
[junit4:junit4]   2> 2199 T203 oass.OpenExchangeRatesOrgProvider.reload Reloading exchange rates from open-exchange-rates.json
[junit4:junit4]   2> 2202 T203 oass.OpenExchangeRatesOrgProvider.reload Reloading exchange rates from open-exchange-rates.json
[junit4:junit4]   2> 2206 T203 oasc.SolrCore.<init> [collection1] Opening new SolrCore at /usr/home/hudson/hudson-slave/workspace/Lucene-Solr-Tests-trunk-java7/solr/build/solr-core/test/J0/./org.apache.solr.cloud.BasicDistributedZkTest-controljetty-1356915300491/collection1/, dataDir=./org.apache.solr.cloud.BasicDistributedZkTest-1356915299762/control/data/
[junit4:junit4]   2> 2211 T203 oasc.JmxMonitoredMap.<init> JMX monitoring is enabled. Adding Solr mbeans to JMX Server: com.sun.jmx.mbeanserver.JmxMBeanServer@1fb77bbb
[junit4:junit4]   2> 2212 T203 oasc.SolrCore.initDirectoryFactory solr.NRTCachingDirectoryFactory
[junit4:junit4]   2> 2247 T203 oasc.CachingDirectoryFactory.get return new directory for /usr/home/hudson/hudson-slave/workspace/Lucene-Solr-Tests-trunk-java7/solr/build/solr-core/test/J0/./org.apache.solr.cloud.BasicDistributedZkTest-1356915299762/control/data forceNew:false
[junit4:junit4]   2> 2248 T203 oasc.CachingDirectoryFactory.close Releasing directory:/usr/home/hudson/hudson-slave/workspace/Lucene-Solr-Tests-trunk-java7/solr/build/solr-core/test/J0/./org.apache.solr.cloud.BasicDistributedZkTest-1356915299762/control/data
[junit4:junit4]   2> 2249 T203 oasc.SolrCore.getNewIndexDir New index directory detected: old=null new=./org.apache.solr.cloud.BasicDistributedZkTest-1356915299762/control/data/index/
[junit4:junit4]   2> 2250 T203 oasc.SolrCore.initIndex WARNING [collection1] Solr index directory './org.apache.solr.cloud.BasicDistributedZkTest-1356915299762/control/data/index' doesn't exist. Creating new index...
[junit4:junit4]   2> 2251 T203 oasc.CachingDirectoryFactory.get return new directory for /usr/home/hudson/hudson-slave/workspace/Lucene-Solr-Tests-trunk-java7/solr/build/solr-core/test/J0/./org.apache.solr.cloud.BasicDistributedZkTest-1356915299762/control/data/index forceNew:false
[junit4:junit4]   2> 2272 T203 oasc.SolrDeletionPolicy.onCommit SolrDeletionPolicy.onCommit: commits:num=1
[junit4:junit4]   2> 		commit{dir=RateLimitedDirectoryWrapper(NRTCachingDirectory(org.apache.lucene.store.NIOFSDirectory@/usr/home/hudson/hudson-slave/workspace/Lucene-Solr-Tests-trunk-java7/solr/build/solr-core/test/J0/org.apache.solr.cloud.BasicDistributedZkTest-1356915299762/control/data/index lockFactory=org.apache.lucene.store.NativeFSLockFactory@2dd52fd4; maxCacheMB=48.0 maxMergeSizeMB=4.0)),segFN=segments_1,generation=1,filenames=[segments_1]
[junit4:junit4]   2> 2273 T203 oasc.SolrDeletionPolicy.updateCommits newest commit = 1[segments_1]
[junit4:junit4]   2> 2274 T203 oasc.CachingDirectoryFactory.close Releasing directory:/usr/home/hudson/hudson-slave/workspace/Lucene-Solr-Tests-trunk-java7/solr/build/solr-core/test/J0/./org.apache.solr.cloud.BasicDistributedZkTest-1356915299762/control/data/index
[junit4:junit4]   2> 2274 T203 oasc.SolrCore.initWriters created xml: solr.XMLResponseWriter
[junit4:junit4]   2> 2277 T203 oasup.UpdateRequestProcessorChain.init inserting DistributedUpdateProcessorFactory into updateRequestProcessorChain "dedupe"
[junit4:junit4]   2> 2277 T203 oasup.UpdateRequestProcessorChain.init inserting DistributedUpdateProcessorFactory into updateRequestProcessorChain "dedupe-allfields"
[junit4:junit4]   2> 2278 T203 oasup.UpdateRequestProcessorChain.init inserting DistributedUpdateProcessorFactory into updateRequestProcessorChain "stored_sig"
[junit4:junit4]   2> 2278 T203 oasup.UpdateRequestProcessorChain.init inserting DistributedUpdateProcessorFactory into updateRequestProcessorChain "uniq-fields"
[junit4:junit4]   2> 2279 T203 oasup.UpdateRequestProcessorChain.init inserting DistributedUpdateProcessorFactory into updateRequestProcessorChain "distrib-dup-test-chain-implicit"
[junit4:junit4]   2> 2280 T203 oasc.RequestHandlers.initHandlersFromConfig adding lazy requestHandler: solr.ReplicationHandler
[junit4:junit4]   2> 2280 T203 oasc.RequestHandlers.initHandlersFromConfig created /replication: solr.ReplicationHandler
[junit4:junit4]   2> 2281 T203 oasc.RequestHandlers.initHandlersFromConfig created standard: solr.StandardRequestHandler
[junit4:junit4]   2> 2281 T203 oasc.RequestHandlers.initHandlersFromConfig created /get: solr.RealTimeGetHandler
[junit4:junit4]   2> 2282 T203 oasc.RequestHandlers.initHandlersFromConfig created dismax: solr.SearchHandler
[junit4:junit4]   2> 2282 T203 oasc.RequestHandlers.initHandlersFromConfig created mock: org.apache.solr.core.MockQuerySenderListenerReqHandler
[junit4:junit4]   2> 2283 T203 oasc.RequestHandlers.initHandlersFromConfig created /admin/: org.apache.solr.handler.admin.AdminHandlers
[junit4:junit4]   2> 2284 T203 oasc.RequestHandlers.initHandlersFromConfig created defaults: solr.StandardRequestHandler
[junit4:junit4]   2> 2284 T203 oasc.RequestHandlers.initHandlersFromConfig adding lazy requestHandler: solr.StandardRequestHandler
[junit4:junit4]   2> 2284 T203 oasc.RequestHandlers.initHandlersFromConfig created lazy: solr.StandardRequestHandler
[junit4:junit4]   2> 2285 T203 oasc.RequestHandlers.initHandlersFromConfig created /update: solr.UpdateRequestHandler
[junit4:junit4]   2> 2286 T203 oasc.RequestHandlers.initHandlersFromConfig created /terms: org.apache.solr.handler.component.SearchHandler
[junit4:junit4]   2> 2286 T203 oasc.RequestHandlers.initHandlersFromConfig created spellCheckCompRH: org.apache.solr.handler.component.SearchHandler
[junit4:junit4]   2> 2287 T203 oasc.RequestHandlers.initHandlersFromConfig created spellCheckCompRH_Direct: org.apache.solr.handler.component.SearchHandler
[junit4:junit4]   2> 2287 T203 oasc.RequestHandlers.initHandlersFromConfig created spellCheckWithWordbreak: org.apache.solr.handler.component.SearchHandler
[junit4:junit4]   2> 2288 T203 oasc.RequestHandlers.initHandlersFromConfig created spellCheckWithWordbreak_Direct: org.apache.solr.handler.component.SearchHandler
[junit4:junit4]   2> 2288 T203 oasc.RequestHandlers.initHandlersFromConfig created spellCheckCompRH1: org.apache.solr.handler.component.SearchHandler
[junit4:junit4]   2> 2289 T203 oasc.RequestHandlers.initHandlersFromConfig created mltrh: org.apache.solr.handler.component.SearchHandler
[junit4:junit4]   2> 2289 T203 oasc.RequestHandlers.initHandlersFromConfig created tvrh: org.apache.solr.handler.component.SearchHandler
[junit4:junit4]   2> 2290 T203 oasc.RequestHandlers.initHandlersFromConfig created /mlt: solr.MoreLikeThisHandler
[junit4:junit4]   2> 2291 T203 oasc.RequestHandlers.initHandlersFromConfig created /debug/dump: solr.DumpRequestHandler
[junit4:junit4]   2> 2303 T203 oashl.XMLLoader.init xsltCacheLifetimeSeconds=60
[junit4:junit4]   2> 2308 T203 oasc.SolrCore.initDeprecatedSupport WARNING solrconfig.xml uses deprecated <admin/gettableFiles>, Please update your config to use the ShowFileRequestHandler.
[junit4:junit4]   2> 2310 T203 oasc.SolrCore.initDeprecatedSupport WARNING adding ShowFileRequestHandler with hidden files: [SCHEMA.XML, OLD_SYNONYMS.TXT, STOPWORDS.TXT, PROTWORDS.TXT, OPEN-EXCHANGE-RATES.JSON, SYNONYMS.TXT, CURRENCY.XML, MAPPING-ISOLATIN1ACCENT.TXT]
[junit4:junit4]   2> 2313 T203 oasc.CachingDirectoryFactory.close Releasing directory:/usr/home/hudson/hudson-slave/workspace/Lucene-Solr-Tests-trunk-java7/solr/build/solr-core/test/J0/./org.apache.solr.cloud.BasicDistributedZkTest-1356915299762/control/data
[junit4:junit4]   2> 2315 T203 oass.SolrIndexSearcher.<init> Opening Searcher@38fdc2b main
[junit4:junit4]   2> 2340 T203 oasu.CommitTracker.<init> Hard AutoCommit: disabled
[junit4:junit4]   2> 2340 T203 oasu.CommitTracker.<init> Soft AutoCommit: disabled
[junit4:junit4]   2> 2341 T203 oashc.SpellCheckComponent.inform Initializing spell checkers
[junit4:junit4]   2> 2355 T203 oass.DirectSolrSpellChecker.init init: {name=direct,classname=DirectSolrSpellChecker,field=lowerfilt,minQueryLength=3}
[junit4:junit4]   2> 2407 T204 oasc.SolrCore.registerSearcher [collection1] Registered new searcher Searcher@38fdc2b main{StandardDirectoryReader(segments_1:1)}
[junit4:junit4]   2> 2413 T203 oasc.ZkController.publish publishing core=collection1 state=down
[junit4:junit4]   2> 2413 T203 oasc.ZkController.publish numShards not found on descriptor - reading it from system property
[junit4:junit4]   2> 2419 T183 oazs.PrepRequestProcessor.pRequest Got user-level KeeperException when processing sessionid:0x13bee7456a60003 type:create cxid:0x50 zxid:0x29 txntype:-1 reqpath:n/a Error Path:/solr/overseer/queue Error:KeeperErrorCode = NoNode for /solr/overseer/queue
[junit4:junit4]   2> 2647 T201 oascc.ZkStateReader.updateClusterState Updating cloud state from ZooKeeper... 
[junit4:junit4]   2> 2649 T201 oasc.Overseer$ClusterStateUpdater.updateState Update state numShards=1 message={
[junit4:junit4]   2> 	  "operation":"state",
[junit4:junit4]   2> 	  "numShards":"1",
[junit4:junit4]   2> 	  "shard":null,
[junit4:junit4]   2> 	  "roles":null,
[junit4:junit4]   2> 	  "state":"down",
[junit4:junit4]   2> 	  "core":"collection1",
[junit4:junit4]   2> 	  "collection":"control_collection",
[junit4:junit4]   2> 	  "node_name":"127.0.0.1:18698_j",
[junit4:junit4]   2> 	  "base_url":"http://127.0.0.1:18698/j"}
[junit4:junit4]   2> 2649 T201 oasc.Overseer$ClusterStateUpdater.createCollection Create collection control_collection with numShards 1
[junit4:junit4]   2> 2689 T201 oasc.Overseer$ClusterStateUpdater.updateState Assigning new node to shard shard=shard1
[junit4:junit4]   2> 2690 T183 oazs.PrepRequestProcessor.pRequest Got user-level KeeperException when processing sessionid:0x13bee7456a60003 type:create cxid:0x58 zxid:0x2c txntype:-1 reqpath:n/a Error Path:/solr/overseer/queue-work Error:KeeperErrorCode = NoNode for /solr/overseer/queue-work
[junit4:junit4]   2> 2728 T200 oascc.ZkStateReader$2.process A cluster state change: WatchedEvent state:SyncConnected type:NodeDataChanged path:/clusterstate.json, has occurred - updating... (live nodes size: 1)
[junit4:junit4]   2> 3433 T203 oasc.CoreContainer.registerCore registering core: collection1
[junit4:junit4]   2> 3433 T203 oasc.ZkController.register Register replica - core:collection1 address:http://127.0.0.1:18698/j collection:control_collection shard:shard1
[junit4:junit4]   2> 3444 T203 oascsi.HttpClientUtil.createClient Creating new http client, config:maxConnections=10000&maxConnectionsPerHost=20&connTimeout=30000&socketTimeout=30000&retry=false
[junit4:junit4]   2> 3462 T203 oascc.SolrZkClient.makePath makePath: /collections/control_collection/leader_elect/shard1/election
[junit4:junit4]   2> 3495 T183 oazs.PrepRequestProcessor.pRequest Got user-level KeeperException when processing sessionid:0x13bee7456a60003 type:delete cxid:0x72 zxid:0x36 txntype:-1 reqpath:n/a Error Path:/solr/collections/control_collection/leaders Error:KeeperErrorCode = NoNode for /solr/collections/control_collection/leaders
[junit4:junit4]   2> 3497 T203 oasc.ShardLeaderElectionContext.runLeaderProcess Running the leader process.
[junit4:junit4]   2> 3498 T183 oazs.PrepRequestProcessor.pRequest Got user-level KeeperException when processing sessionid:0x13bee7456a60003 type:create cxid:0x73 zxid:0x37 txntype:-1 reqpath:n/a Error Path:/solr/overseer Error:KeeperErrorCode = NodeExists for /solr/overseer
[junit4:junit4]   2> 3501 T203 oasc.ShardLeaderElectionContext.waitForReplicasToComeUp Enough replicas found to continue.
[junit4:junit4]   2> 3502 T203 oasc.ShardLeaderElectionContext.runLeaderProcess I may be the new leader - try and sync
[junit4:junit4]   2> 3502 T203 oasc.SyncStrategy.sync Sync replicas to http://127.0.0.1:18698/j/collection1/
[junit4:junit4]   2> 3503 T203 oasc.SyncStrategy.syncReplicas Sync Success - now sync replicas to me
[junit4:junit4]   2> 3503 T203 oasc.SyncStrategy.syncToMe http://127.0.0.1:18698/j/collection1/ has no replicas
[junit4:junit4]   2> 3504 T203 oasc.ShardLeaderElectionContext.runLeaderProcess I am the new leader: http://127.0.0.1:18698/j/collection1/
[junit4:junit4]   2> 3504 T203 oascc.SolrZkClient.makePath makePath: /collections/control_collection/leaders/shard1
[junit4:junit4]   2> 3526 T183 oazs.PrepRequestProcessor.pRequest Got user-level KeeperException when processing sessionid:0x13bee7456a60003 type:create cxid:0x7d zxid:0x3b txntype:-1 reqpath:n/a Error Path:/solr/overseer Error:KeeperErrorCode = NodeExists for /solr/overseer
[junit4:junit4]   2> 4236 T201 oascc.ZkStateReader.updateClusterState Updating cloud state from ZooKeeper... 
[junit4:junit4]   2> 4259 T200 oascc.ZkStateReader$2.process A cluster state change: WatchedEvent state:SyncConnected type:NodeDataChanged path:/clusterstate.json, has occurred - updating... (live nodes size: 1)
[junit4:junit4]   2> 4295 T203 oasc.ZkController.register We are http://127.0.0.1:18698/j/collection1/ and leader is http://127.0.0.1:18698/j/collection1/
[junit4:junit4]   2> 4299 T203 oasc.ZkController.register No LogReplay needed for core=collection1 baseURL=http://127.0.0.1:18698/j
[junit4:junit4]   2> 4299 T203 oasc.ZkController.checkRecovery I am the leader, no recovery necessary
[junit4:junit4]   2> 4300 T203 oasc.ZkController.publish publishing core=collection1 state=active
[junit4:junit4]   2> 4300 T203 oasc.ZkController.publish numShards not found on descriptor - reading it from system property
[junit4:junit4]   2> 4303 T203 oascc.ZkStateReader.updateClusterState Updating cloud state from ZooKeeper... 
[junit4:junit4]   2> 4304 T178 oass.SolrDispatchFilter.init user.dir=/usr/home/hudson/hudson-slave/workspace/Lucene-Solr-Tests-trunk-java7/solr/build/solr-core/test/J0
[junit4:junit4]   2> 4305 T178 oass.SolrDispatchFilter.init SolrDispatchFilter.init() done
[junit4:junit4]   2> 4306 T178 oascsi.HttpClientUtil.createClient Creating new http client, config:maxConnections=128&maxConnectionsPerHost=32&followRedirects=false
[junit4:junit4]   2> 4319 T178 oascsi.HttpClientUtil.createClient Creating new http client, config:
[junit4:junit4]   2> 4335 T178 oaz.ZooKeeper.<init> Initiating client connection, connectString=127.0.0.1:18695/solr sessionTimeout=10000 watcher=org.apache.solr.common.cloud.ConnectionManager@c9bf1a5
[junit4:junit4]   2> 4337 T178 oascc.ConnectionManager.waitForConnected Waiting for client to connect to ZooKeeper
[junit4:junit4]   2> 4337 T205 oaz.ClientCnxn$SendThread.logStartConnect Opening socket connection to server localhost/127.0.0.1:18695. Will not attempt to authenticate using SASL (access denied ("javax.security.auth.AuthPermission" "getLoginConfiguration"))
[junit4:junit4]   2> 4338 T205 oaz.ClientCnxn$SendThread.primeConnection Socket connection established to localhost/127.0.0.1:18695, initiating session
[junit4:junit4]   2> 4338 T180 oazs.NIOServerCnxnFactory.run Accepted socket connection from /140.211.11.196:18704
[junit4:junit4]   2> 4339 T180 oazs.ZooKeeperServer.processConnectRequest Client attempting to establish new session at /140.211.11.196:18704
[junit4:junit4]   2> 4340 T182 oazs.ZooKeeperServer.finishSessionInit Established session 0x13bee7456a60004 with negotiated timeout 10000 for client /140.211.11.196:18704
[junit4:junit4]   2> 4340 T205 oaz.ClientCnxn$SendThread.onConnected Session establishment complete on server localhost/127.0.0.1:18695, sessionid = 0x13bee7456a60004, negotiated timeout = 10000
[junit4:junit4]   2> 4341 T206 oascc.ConnectionManager.process Watcher org.apache.solr.common.cloud.ConnectionManager@c9bf1a5 name:ZooKeeperConnection Watcher:127.0.0.1:18695/solr got event WatchedEvent state:SyncConnected type:None path:null path:null type:None
[junit4:junit4]   2> 4341 T178 oascc.ConnectionManager.waitForConnected Client is connected to ZooKeeper
[junit4:junit4]   2> 4343 T178 oascc.ZkStateReader.createClusterStateWatchersAndUpdate Updating cluster state from ZooKeeper... 
[junit4:junit4]   2> 4348 T178 oasc.ChaosMonkey.monkeyLog monkey: init - expire sessions:true cause connection loss:true
[junit4:junit4]   2> 4518 T178 oejs.Server.doStart jetty-8.1.8.v20121106
[junit4:junit4]   2> 4521 T178 oejs.AbstractConnector.doStart Started SocketConnector@127.0.0.1:18705
[junit4:junit4]   2> 4522 T178 oasc.SolrResourceLoader.locateSolrHome JNDI not configured for solr (NoInitialContextEx)
[junit4:junit4]   2> 4523 T178 oasc.SolrResourceLoader.locateSolrHome using system property solr.solr.home: /usr/home/hudson/hudson-slave/workspace/Lucene-Solr-Tests-trunk-java7/solr/build/solr-core/test/J0/./org.apache.solr.cloud.BasicDistributedZkTest-jetty1-1356915304105
[junit4:junit4]   2> 4524 T178 oasc.SolrResourceLoader.<init> new SolrResourceLoader for deduced Solr Home: '/usr/home/hudson/hudson-slave/workspace/Lucene-Solr-Tests-trunk-java7/solr/build/solr-core/test/J0/./org.apache.solr.cloud.BasicDistributedZkTest-jetty1-1356915304105/'
[junit4:junit4]   2> 4567 T178 oass.SolrDispatchFilter.init SolrDispatchFilter.init()
[junit4:junit4]   2> 4567 T178 oasc.SolrResourceLoader.locateSolrHome JNDI not configured for solr (NoInitialContextEx)
[junit4:junit4]   2> 4568 T178 oasc.SolrResourceLoader.locateSolrHome using system property solr.solr.home: /usr/home/hudson/hudson-slave/workspace/Lucene-Solr-Tests-trunk-java7/solr/build/solr-core/test/J0/./org.apache.solr.cloud.BasicDistributedZkTest-jetty1-1356915304105
[junit4:junit4]   2> 4569 T178 oasc.CoreContainer$Initializer.initialize looking for solr.xml: /usr/home/hudson/hudson-slave/workspace/Lucene-Solr-Tests-trunk-java7/solr/build/solr-core/test/J0/./org.apache.solr.cloud.BasicDistributedZkTest-jetty1-1356915304105/solr.xml
[junit4:junit4]   2> 4569 T178 oasc.CoreContainer.<init> New CoreContainer 1765900669
[junit4:junit4]   2> 4570 T178 oasc.CoreContainer.load Loading CoreContainer using Solr Home: '/usr/home/hudson/hudson-slave/workspace/Lucene-Solr-Tests-trunk-java7/solr/build/solr-core/test/J0/./org.apache.solr.cloud.BasicDistributedZkTest-jetty1-1356915304105/'
[junit4:junit4]   2> 4571 T178 oasc.SolrResourceLoader.<init> new SolrResourceLoader for directory: '/usr/home/hudson/hudson-slave/workspace/Lucene-Solr-Tests-trunk-java7/solr/build/solr-core/test/J0/./org.apache.solr.cloud.BasicDistributedZkTest-jetty1-1356915304105/'
[junit4:junit4]   2> 4601 T178 oashc.HttpShardHandlerFactory.getParameter Setting socketTimeout to: 30000
[junit4:junit4]   2> 4602 T178 oashc.HttpShardHandlerFactory.getParameter Setting urlScheme to: http://
[junit4:junit4]   2> 4602 T178 oashc.HttpShardHandlerFactory.getParameter Setting connTimeout to: 15000
[junit4:junit4]   2> 4603 T178 oashc.HttpShardHandlerFactory.getParameter Setting maxConnectionsPerHost to: 20
[junit4:junit4]   2> 4604 T178 oashc.HttpShardHandlerFactory.getParameter Setting corePoolSize to: 0
[junit4:junit4]   2> 4604 T178 oashc.HttpShardHandlerFactory.getParameter Setting maximumPoolSize to: 2147483647
[junit4:junit4]   2> 4605 T178 oashc.HttpShardHandlerFactory.getParameter Setting maxThreadIdleTime to: 5
[junit4:junit4]   2> 4605 T178 oashc.HttpShardHandlerFactory.getParameter Setting sizeOfQueue to: -1
[junit4:junit4]   2> 4606 T178 oashc.HttpShardHandlerFactory.getParameter Setting fairnessPolicy to: false
[junit4:junit4]   2> 4607 T178 oascsi.HttpClientUtil.createClient Creating new http client, config:maxConnectionsPerHost=20&maxConnections=10000&socketTimeout=30000&connTimeout=15000&retry=false
[junit4:junit4]   2> 4629 T178 oasc.CoreContainer.load Registering Log Listener
[junit4:junit4]   2> 4649 T178 oasc.CoreContainer.initZooKeeper Zookeeper client=127.0.0.1:18695/solr
[junit4:junit4]   2> 4650 T178 oasc.ZkController.checkChrootPath zkHost includes chroot
[junit4:junit4]   2> 4651 T178 oaz.ZooKeeper.<init> Initiating client connection, connectString=127.0.0.1:18695 sessionTimeout=60000 watcher=org.apache.solr.common.cloud.ConnectionManager@1715c4c5
[junit4:junit4]   2> 4652 T178 oascc.ConnectionManager.waitForConnected Waiting for client to connect to ZooKeeper
[junit4:junit4]   2> 4652 T216 oaz.ClientCnxn$SendThread.logStartConnect Opening socket connection to server localhost/127.0.0.1:18695. Will not attempt to authenticate using SASL (access denied ("javax.security.auth.AuthPermission" "getLoginConfiguration"))
[junit4:junit4]   2> 4653 T216 oaz.ClientCnxn$SendThread.primeConnection Socket connection established to localhost/127.0.0.1:18695, initiating session
[junit4:junit4]   2> 4654 T180 oazs.NIOServerCnxnFactory.run Accepted socket connection from /140.211.11.196:18706
[junit4:junit4]   2> 4654 T180 oazs.ZooKeeperServer.processConnectRequest Client attempting to establish new session at /140.211.11.196:18706
[junit4:junit4]   2> 4657 T182 oazs.ZooKeeperServer.finishSessionInit Established session 0x13bee7456a60005 with negotiated timeout 20000 for client /140.211.11.196:18706
[junit4:junit4]   2> 4657 T216 oaz.ClientCnxn$SendThread.onConnected Session establishment complete on server localhost/127.0.0.1:18695, sessionid = 0x13bee7456a60005, negotiated timeout = 20000
[junit4:junit4]   2> 4657 T217 oascc.ConnectionManager.process Watcher org.apache.solr.common.cloud.ConnectionManager@1715c4c5 name:ZooKeeperConnection Watcher:127.0.0.1:18695 got event WatchedEvent state:SyncConnected type:None path:null path:null type:None
[junit4:junit4]   2> 4658 T178 oascc.ConnectionManager.waitForConnected Client is connected to ZooKeeper
[junit4:junit4]   2> 4660 T183 oazs.PrepRequestProcessor.pRequest2Txn Processed session termination for sessionid: 0x13bee7456a60005
[junit4:junit4]   2> 4670 T217 oaz.ClientCnxn$EventThread.run EventThread shut down
[junit4:junit4]   2> 4670 T178 oaz.ZooKeeper.close Session: 0x13bee7456a60005 closed
[junit4:junit4]   2> 4670 T180 oazs.NIOServerCnxn.closeSock Closed socket connection for client /140.211.11.196:18706 which had sessionid 0x13bee7456a60005
[junit4:junit4]   2> 4671 T178 oascsi.HttpClientUtil.createClient Creating new http client, config:maxConnections=500&maxConnectionsPerHost=16&socketTimeout=15000&connTimeout=30000
[junit4:junit4]   2> 4684 T178 oaz.ZooKeeper.<init> Initiating client connection, connectString=127.0.0.1:18695/solr sessionTimeout=30000 watcher=org.apache.solr.common.cloud.ConnectionManager@18748d16
[junit4:junit4]   2> 4685 T178 oascc.ConnectionManager.waitForConnected Waiting for client to connect to ZooKeeper
[junit4:junit4]   2> 4685 T218 oaz.ClientCnxn$SendThread.logStartConnect Opening socket connection to server localhost/127.0.0.1:18695. Will not attempt to authenticate using SASL (access denied ("javax.security.auth.AuthPermission" "getLoginConfiguration"))
[junit4:junit4]   2> 4686 T218 oaz.ClientCnxn$SendThread.primeConnection Socket connection established to localhost/127.0.0.1:18695, initiating session
[junit4:junit4]   2> 4686 T180 oazs.NIOServerCnxnFactory.run Accepted socket connection from /140.211.11.196:18707
[junit4:junit4]   2> 4687 T180 oazs.ZooKeeperServer.processConnectRequest Client attempting to establish new session at /140.211.11.196:18707
[junit4:junit4]   2> 4688 T182 oazs.ZooKeeperServer.finishSessionInit Established session 0x13bee7456a60006 with negotiated timeout 20000 for client /140.211.11.196:18707
[junit4:junit4]   2> 4689 T218 oaz.ClientCnxn$SendThread.onConnected Session establishment complete on server localhost/127.0.0.1:18695, sessionid = 0x13bee7456a60006, negotiated timeout = 20000
[junit4:junit4]   2> 4689 T219 oascc.ConnectionManager.process Watcher org.apache.solr.common.cloud.ConnectionManager@18748d16 name:ZooKeeperConnection Watcher:127.0.0.1:18695/solr got event WatchedEvent state:SyncConnected type:None path:null path:null type:None
[junit4:junit4]   2> 4690 T178 oascc.ConnectionManager.waitForConnected Client is connected to ZooKeeper
[junit4:junit4]   2> 4691 T183 oazs.PrepRequestProcessor.pRequest Got user-level KeeperException when processing sessionid:0x13bee7456a60006 type:create cxid:0x1 zxid:0x49 txntype:-1 reqpath:n/a Error Path:/solr/overseer Error:KeeperErrorCode = NodeExists for /solr/overseer
[junit4:junit4]   2> 4693 T183 oazs.PrepRequestProcessor.pRequest Got user-level KeeperException when processing sessionid:0x13bee7456a60006 type:create cxid:0x2 zxid:0x4a txntype:-1 reqpath:n/a Error Path:/solr/overseer Error:KeeperErrorCode = NodeExists for /solr/overseer
[junit4:junit4]   2> 4695 T178 oasc.ZkController.createEphemeralLiveNode Register node as live in ZooKeeper:/live_nodes/127.0.0.1:18705_j
[junit4:junit4]   2> 4696 T183 oazs.PrepRequestProcessor.pRequest Got user-level KeeperException when processing sessionid:0x13bee7456a60006 type:delete cxid:0x4 zxid:0x4b txntype:-1 reqpath:n/a Error Path:/solr/live_nodes/127.0.0.1:18705_j Error:KeeperErrorCode = NoNode for /solr/live_nodes/127.0.0.1:18705_j
[junit4:junit4]   2> 4703 T178 oascc.SolrZkClient.makePath makePath: /live_nodes/127.0.0.1:18705_j
[junit4:junit4]   2> 4707 T200 oascc.ZkStateReader$2.process A cluster state change: WatchedEvent state:SyncConnected type:NodeChildrenChanged path:/live_nodes, has occurred - updating... (live nodes size: 1)
[junit4:junit4]   2> 4708 T206 oascc.ZkStateReader$3.process Updating live nodes... (2)
[junit4:junit4]   2> 4710 T200 oascc.ZkStateReader$3.process Updating live nodes... (2)
[junit4:junit4]   2> 4718 T178 oascc.ZkStateReader.createClusterStateWatchersAndUpdate Updating cluster state from ZooKeeper... 
[junit4:junit4]   2> 4726 T220 oasc.CoreContainer.create Creating SolrCore 'collection1' using instanceDir: /usr/home/hudson/hudson-slave/workspace/Lucene-Solr-Tests-trunk-java7/solr/build/solr-core/test/J0/./org.apache.solr.cloud.BasicDistributedZkTest-jetty1-1356915304105/collection1
[junit4:junit4]   2> 4727 T220 oasc.ZkController.createCollectionZkNode Check for collection zkNode:collection1
[junit4:junit4]   2> 4728 T220 oasc.ZkController.createCollectionZkNode Collection zkNode exists
[junit4:junit4]   2> 4728 T220 oasc.ZkController.readConfigName Load collection config from:/collections/collection1
[junit4:junit4]   2> 4731 T220 oasc.SolrResourceLoader.<init> new SolrResourceLoader for directory: '/usr/home/hudson/hudson-slave/workspace/Lucene-Solr-Tests-trunk-java7/solr/build/solr-core/test/J0/./org.apache.solr.cloud.BasicDistributedZkTest-jetty1-1356915304105/collection1/'
[junit4:junit4]   2> 4732 T220 oasc.SolrResourceLoader.replaceClassLoader Adding 'file:/usr/home/hudson/hudson-slave/workspace/Lucene-Solr-Tests-trunk-java7/solr/build/solr-core/test/J0/org.apache.solr.cloud.BasicDistributedZkTest-jetty1-1356915304105/collection1/lib/README' to classloader
[junit4:junit4]   2> 4733 T220 oasc.SolrResourceLoader.replaceClassLoader Adding 'file:/usr/home/hudson/hudson-slave/workspace/Lucene-Solr-Tests-trunk-java7/solr/build/solr-core/test/J0/org.apache.solr.cloud.BasicDistributedZkTest-jetty1-1356915304105/collection1/lib/classes/' to classloader
[junit4:junit4]   2> 4788 T220 oasc.SolrConfig.<init> Using Lucene MatchVersion: LUCENE_50
[junit4:junit4]   2> 4864 T220 oasc.SolrConfig.<init> Loaded SolrConfig: solrconfig.xml
[junit4:junit4]   2> 4966 T220 oass.IndexSchema.readSchema Reading Solr Schema
[junit4:junit4]   2> 4974 T220 oass.IndexSchema.readSchema Schema name=test
[junit4:junit4]   2> 5645 T220 oass.OpenExchangeRatesOrgProvider.init Initialized with rates=open-exchange-rates.json, refreshInterval=1440.
[junit4:junit4]   2> 5661 T220 oass.IndexSchema.readSchema default search field in schema is text
[junit4:junit4]   2> 5666 T220 oass.IndexSchema.readSchema unique key field: id
[junit4:junit4]   2> 5700 T220 oass.FileExchangeRateProvider.reload Reloading exchange rates from file currency.xml
[junit4:junit4]   2> 5707 T220 oass.FileExchangeRateProvider.reload Reloading exchange rates from file currency.xml
[junit4:junit4]   2> 5714 T220 oass.OpenExchangeRatesOrgProvider.reload Reloading exchange rates from open-exchange-rates.json
[junit4:junit4]   2> 5717 T220 oass.OpenExchangeRatesOrgProvider.reload Reloading exchange rates from open-exchange-rates.json
[junit4:junit4]   2> 5720 T220 oasc.SolrCore.<init> [collection1] Opening new SolrCore at /usr/home/hudson/hudson-slave/workspace/Lucene-Solr-Tests-trunk-java7/solr/build/solr-core/test/J0/./org.apache.solr.cloud.BasicDistributedZkTest-jetty1-1356915304105/collection1/, dataDir=./org.apache.solr.cloud.BasicDistributedZkTest-1356915299762/jetty1/
[junit4:junit4]   2> 5720 T220 oasc.JmxMonitoredMap.<init> JMX monitoring is enabled. Adding Solr mbeans to JMX Server: com.sun.jmx.mbeanserver.JmxMBeanServer@1fb77bbb
[junit4:junit4]   2> 5721 T220 oasc.SolrCore.initDirectoryFactory solr.NRTCachingDirectoryFactory
[junit4:junit4]   2> 5722 T220 oasc.CachingDirectoryFactory.get return new directory for /usr/home/hudson/hudson-slave/workspace/Lucene-Solr-Tests-trunk-java7/solr/build/solr-core/test/J0/./org.apache.solr.cloud.BasicDistributedZkTest-1356915299762/jetty1 forceNew:false
[junit4:junit4]   2> 5723 T220 oasc.CachingDirectoryFactory.close Releasing directory:/usr/home/hudson/hudson-slave/workspace/Lucene-Solr-Tests-trunk-java7/solr/build/solr-core/test/J0/./org.apache.solr.cloud.BasicDistributedZkTest-1356915299762/jetty1
[junit4:junit4]   2> 5723 T220 oasc.SolrCore.getNewIndexDir New index directory detected: old=null new=./org.apache.solr.cloud.BasicDistributedZkTest-1356915299762/jetty1/index/
[junit4:junit4]   2> 5724 T220 oasc.SolrCore.initIndex WARNING [collection1] Solr index directory './org.apache.solr.cloud.BasicDistributedZkTest-1356915299762/jetty1/index' doesn't exist. Creating new index...
[junit4:junit4]   2> 5726 T220 oasc.CachingDirectoryFactory.get return new directory for /usr/home/hudson/hudson-slave/workspace/Lucene-Solr-Tests-trunk-java7/solr/build/solr-core/test/J0/./org.apache.solr.cloud.BasicDistributedZkTest-1356915299762/jetty1/index forceNew:false
[junit4:junit4]   2> 5734 T220 oasc.SolrDeletionPolicy.onCommit SolrDeletionPolicy.onCommit: commits:num=1
[junit4:junit4]   2> 		commit{dir=RateLimitedDirectoryWrapper(NRTCachingDirectory(org.apache.lucene.store.NIOFSDirectory@/usr/home/hudson/hudson-slave/workspace/Lucene-Solr-Tests-trunk-java7/solr/build/solr-core/test/J0/org.apache.solr.cloud.BasicDistributedZkTest-1356915299762/jetty1/index lockFactory=org.apache.lucene.store.NativeFSLockFactory@16c4df4b; maxCacheMB=48.0 maxMergeSizeMB=4.0)),segFN=segments_1,generation=1,filenames=[segments_1]
[junit4:junit4]   2> 5734 T220 oasc.SolrDeletionPolicy.updateCommits newest commit = 1[segments_1]
[junit4:junit4]   2> 5736 T220 oasc.CachingDirectoryFactory.close Releasing directory:/usr/home/hudson/hudson-slave/workspace/Lucene-Solr-Tests-trunk-java7/solr/build/solr-core/test/J0/./org.apache.solr.cloud.BasicDistributedZkTest-1356915299762/jetty1/index
[junit4:junit4]   2> 5736 T220 oasc.SolrCore.initWriters created xml: solr.XMLResponseWriter
[junit4:junit4]   2> 5739 T220 oasup.UpdateRequestProcessorChain.init inserting DistributedUpdateProcessorFactory into updateRequestProcessorChain "dedupe"
[junit4:junit4]   2> 5740 T220 oasup.UpdateRequestProcessorChain.init inserting DistributedUpdateProcessorFactory into updateRequestProcessorChain "dedupe-allfields"
[junit4:junit4]   2> 5740 T220 oasup.UpdateRequestProcessorChain.init inserting DistributedUpdateProcessorFactory into updateRequestProcessorChain "stored_sig"
[junit4:junit4]   2> 5741 T220 oasup.UpdateRequestProcessorChain.init inserting DistributedUpdateProcessorFactory into updateRequestProcessorChain "uniq-fields"
[junit4:junit4]   2> 5741 T220 oasup.UpdateRequestProcessorChain.init inserting DistributedUpdateProcessorFactory into updateRequestProcessorChain "distrib-dup-test-chain-implicit"
[junit4:junit4]   2> 5742 T220 oasc.RequestHandlers.initHandlersFromConfig adding lazy requestHandler: solr.ReplicationHandler
[junit4:junit4]   2> 5742 T220 oasc.RequestHandlers.initHandlersFromConfig created /replication: solr.ReplicationHandler
[junit4:junit4]   2> 5743 T220 oasc.RequestHandlers.initHandlersFromConfig created standard: solr.StandardRequestHandler
[junit4:junit4]   2> 5744 T220 oasc.RequestHandlers.initHandlersFromConfig created /get: solr.RealTimeGetHandler
[junit4:junit4]   2> 5744 T220 oasc.RequestHandlers.initHandlersFromConfig created dismax: solr.SearchHandler
[junit4:junit4]   2> 5745 T220 oasc.RequestHandlers.initHandlersFromConfig created mock: org.apache.solr.core.MockQuerySenderListenerReqHandler
[junit4:junit4]   2> 5746 T220 oasc.RequestHandlers.initHandlersFromConfig created /admin/: org.apache.solr.handler.admin.AdminHandlers
[junit4:junit4]   2> 5746 T220 oasc.RequestHandlers.initHandlersFromConfig created defaults: solr.StandardRequestHandler
[junit4:junit4]   2> 5747 T220 oasc.RequestHandlers.initHandlersFromConfig adding lazy requestHandler: solr.StandardRequestHandler
[junit4:junit4]   2> 5747 T220 oasc.RequestHandlers.initHandlersFromConfig created lazy: solr.StandardRequestHandler
[junit4:junit4]   2> 5748 T220 oasc.RequestHandlers.initHandlersFromConfig created /update: solr.UpdateRequestHandler
[junit4:junit4]   2> 5749 T220 oasc.RequestHandlers.initHandlersFromConfig created /terms: org.apache.solr.handler.component.SearchHandler
[junit4:junit4]   2> 5749 T220 oasc.RequestHandlers.initHandlersFromConfig created spellCheckCompRH: org.apache.solr.handler.component.SearchHandler
[junit4:junit4]   2> 5750 T220 oasc.RequestHandlers.initHandlersFromConfig created spellCheckCompRH_Direct: org.apache.solr.handler.component.SearchHandler
[junit4:junit4]   2> 5750 T220 oasc.RequestHandlers.initHandlersFromConfig created spellCheckWithWordbreak: org.apache.solr.handler.component.SearchHandler
[junit4:junit4]   2> 5751 T220 oasc.RequestHandlers.initHandlersFromConfig created spellCheckWithWordbreak_Direct: org.apache.solr.handler.component.SearchHandler
[junit4:junit4]   2> 5752 T220 oasc.RequestHandlers.initHandlersFromConfig created spellCheckCompRH1: org.apache.solr.handler.component.SearchHandler
[junit4:junit4]   2> 5753 T220 oasc.RequestHandlers.initHandlersFromConfig created mltrh: org.apache.solr.handler.component.SearchHandler
[junit4:junit4]   2> 5753 T220 oasc.RequestHandlers.initHandlersFromConfig created tvrh: org.apache.solr.handler.component.SearchHandler
[junit4:junit4]   2> 5754 T220 oasc.RequestHandlers.initHandlersFromConfig created /mlt: solr.MoreLikeThisHandler
[junit4:junit4]   2> 5755 T220 oasc.RequestHandlers.initHandlersFromConfig created /debug/dump: solr.DumpRequestHandler
[junit4:junit4]   2> 5774 T201 oascc.ZkStateReader.updateClusterState Updating cloud state from ZooKeeper... 
[junit4:junit4]   2> 5776 T201 oasc.Overseer$ClusterStateUpdater.updateState Update state numShards=1 message={
[junit4:junit4]   2> 	  "operation":"state",
[junit4:junit4]   2> 	  "numShards":"1",
[junit4:junit4]   2> 	  "shard":"shard1",
[junit4:junit4]   2> 	  "roles":null,
[junit4:junit4]   2> 	  "state":"active",
[junit4:junit4]   2> 	  "core":"collection1",
[junit4:junit4]   2> 	  "collection":"control_collection",
[junit4:junit4]   2> 	  "node_name":"127.0.0.1:18698_j",
[junit4:junit4]   2> 	  "base_url":"http://127.0.0.1:18698/j"}
[junit4:junit4]   2> 5776 T220 oashl.XMLLoader.init xsltCacheLifetimeSeconds=60
[junit4:junit4]   2> 5782 T220 oasc.SolrCore.initDeprecatedSupport WARNING solrconfig.xml uses deprecated <admin/gettableFiles>, Please update your config to use the ShowFileRequestHandler.
[junit4:junit4]   2> 5789 T219 oascc.ZkStateReader$2.process A cluster state change: WatchedEvent state:SyncConnected type:NodeDataChanged path:/clusterstate.json, has occurred - updating... (live nodes size: 2)
[junit4:junit4]   2> 5789 T200 oascc.ZkStateReader$2.process A cluster state change: WatchedEvent state:SyncConnected type:NodeDataChanged path:/clusterstate.json, has occurred - updating... (live nodes size: 2)
[junit4:junit4]   2> 5789 T206 oascc.ZkStateReader$2.process A cluster state change: WatchedEvent state:SyncConnected type:NodeDataChanged path:/clusterstate.json, has occurred - updating... (live nodes size: 2)
[junit4:junit4]   2> 5790 T220 oasc.SolrCore.initDeprecatedSupport WARNING adding ShowFileRequestHandler with hidden files: [SCHEMA.XML, OLD_SYNONYMS.TXT, STOPWORDS.TXT, PROTWORDS.TXT, OPEN-EXCHANGE-RATES.JSON, SYNONYMS.TXT, CURRENCY.XML, MAPPING-ISOLATIN1ACCENT.TXT]
[junit4:junit4]   2> 5795 T220 oasc.CachingDirectoryFactory.close Releasing directory:/usr/home/hudson/hudson-slave/workspace/Lucene-Solr-Tests-trunk-java7/solr/build/solr-core/test/J0/./org.apache.solr.cloud.BasicDistributedZkTest-1356915299762/jetty1
[junit4:junit4]   2> 5798 T220 oass.SolrIndexSearcher.<init> Opening Searcher@dd3c0f3 main
[junit4:junit4]   2> 5800 T220 oasu.CommitTracker.<init> Hard AutoCommit: disabled
[junit4:junit4]   2> 5800 T220 oasu.CommitTracker.<init> Soft AutoCommit: disabled
[junit4:junit4]   2> 5801 T220 oashc.SpellCheckComponent.inform Initializing spell checkers
[junit4:junit4]   2> 5811 T220 oass.DirectSolrSpellChecker.init init: {name=direct,classname=DirectSolrSpellChecker,field=lowerfilt,minQueryLength=3}
[junit4:junit4]   2> 5862 T221 oasc.SolrCore.registerSearcher [collection1] Registered new searcher Searcher@dd3c0f3 main{StandardDirectoryReader(segments_1:1)}
[junit4:junit4]   2> 5869 T220 oasc.ZkController.publish publishing core=collection1 state=down
[junit4:junit4]   2> 5869 T220 oasc.ZkController.publish numShards not found on descriptor - reading it from system property
[junit4:junit4]   2> 7298 T201 oascc.ZkStateReader.updateClusterState Updating cloud state from ZooKeeper... 
[junit4:junit4]   2> 7299 T201 oasc.Overseer$ClusterStateUpdater.updateState Update state numShards=2 message={
[junit4:junit4]   2> 	  "operation":"state",
[junit4:junit4]   2> 	  "numShards":"2",
[junit4:junit4]   2> 	  "shard":null,
[junit4:junit4]   2> 	  "roles":null,
[junit4:junit4]   2> 	  "state":"down",
[junit4:junit4]   2> 	  "core":"collection1",
[junit4:junit4]   2> 	  "collection":"collection1",
[junit4:junit4]   2> 	  "node_name":"127.0.0.1:18705_j",
[junit4:junit4]   2> 	  "base_url":"http://127.0.0.1:18705/j"}
[junit4:junit4]   2> 7300 T201 oasc.Overseer$ClusterStateUpdater.createCollection Create collection collection1 with numShards 2
[junit4:junit4]   2> 7300 T201 oasc.Overseer$ClusterStateUpdater.updateState Assigning new node to shard shard=shard1
[junit4:junit4]   2> 7313 T200 oascc.ZkStateReader$2.process A cluster state change: WatchedEvent state:SyncConnected type:NodeDataChanged path:/clusterstate.json, has occurred - updating... (live nodes size: 2)
[junit4:junit4]   2> 7313 T219 oascc.ZkStateReader$2.process A cluster state change: WatchedEvent state:SyncConnected type:NodeDataChanged path:/clusterstate.json, has occurred - updating... (live nodes size: 2)
[junit4:junit4]   2> 7313 T206 oascc.ZkStateReader$2.process A cluster state change: WatchedEvent state:SyncConnected type:NodeDataChanged path:/clusterstate.json, has occurred - updating... (live nodes size: 2)
[junit4:junit4]   2> 7873 T220 oasc.CoreContainer.registerCore registering core: collection1
[junit4:junit4]   2> 7873 T220 oasc.ZkController.register Register replica - core:collection1 address:http://127.0.0.1:18705/j collection:collection1 shard:shard1
[junit4:junit4]   2> 7874 T220 oascc.SolrZkClient.makePath makePath: /collections/collection1/leader_elect/shard1/election
[junit4:junit4]   2> 7919 T183 oazs.PrepRequestProcessor.pRequest Got user-level KeeperException when processing sessionid:0x13bee7456a60006 type:delete cxid:0x45 zxid:0x5b txntype:-1 reqpath:n/a Error Path:/solr/collections/collection1/leaders Error:KeeperErrorCode = NoNode for /solr/collections/collection1/leaders
[junit4:junit4]   2> 7920 T220 oasc.ShardLeaderElectionContext.runLeaderProcess Running the leader process.
[junit4:junit4]   2> 7921 T183 oazs.PrepRequestProcessor.pRequest Got user-level KeeperException when processing sessionid:0x13bee7456a60006 type:create cxid:0x46 zxid:0x5c txntype:-1 reqpath:n/a Error Path:/solr/overseer Error:KeeperErrorCode = NodeExists for /solr/overseer
[junit4:junit4]   2> 7930 T220 oasc.ShardLeaderElectionContext.waitForReplicasToComeUp Enough replicas found to continue.
[junit4:junit4]   2> 7931 T220 oasc.ShardLeaderElectionContext.runLeaderProcess I may be the new leader - try and sync
[junit4:junit4]   2> 7931 T220 oasc.SyncStrategy.sync Sync replicas to http://127.0.0.1:18705/j/collection1/
[junit4:junit4]   2> 7931 T220 oasc.SyncStrategy.syncReplicas Sync Success - now sync replicas to me
[junit4:junit4]   2> 7932 T220 oasc.SyncStrategy.syncToMe http://127.0.0.1:18705/j/collection1/ has no replicas
[junit4:junit4]   2> 7932 T220 oasc.ShardLeaderElectionContext.runLeaderProcess I am the new leader: http://127.0.0.1:18705/j/collection1/
[junit4:junit4]   2> 7933 T220 oascc.SolrZkClient.makePath makePath: /collections/collection1/leaders/shard1
[junit4:junit4]   2> 7939 T183 oazs.PrepRequestProcessor.pRequest Got user-level KeeperException when processing sessionid:0x13bee7456a60006 type:create cxid:0x50 zxid:0x60 txntype:-1 reqpath:n/a Error Path:/solr/overseer Error:KeeperErrorCode = NodeExists for /solr/overseer
[junit4:junit4]   2> 8821 T201 oascc.ZkStateReader.updateClusterState Updating cloud state from ZooKeeper... 
[junit4:junit4]   2> 8841 T206 oascc.ZkStateReader$2.process A cluster state change: WatchedEvent state:SyncConnected type:NodeDataChanged path:/clusterstate.json, has occurred - updating... (live nodes size: 2)
[junit4:junit4]   2> 8841 T200 oascc.ZkStateReader$2.process A cluster state change: WatchedEvent state:SyncConnected type:NodeDataChanged path:/clusterstate.json, has occurred - updating... (live nodes size: 2)
[junit4:junit4]   2> 8842 T219 oascc.ZkStateReader$2.process A cluster state change: WatchedEvent state:SyncConnected type:NodeDataChanged path:/clusterstate.json, has occurred - updating... (live nodes size: 2)
[junit4:junit4]   2> 8871 T220 oasc.ZkController.register We are http://127.0.0.1:18705/j/collection1/ and leader is http://127.0.0.1:18705/j/collection1/
[junit4:junit4]   2> 8871 T220 oasc.ZkController.register No LogReplay needed for core=collection1 baseURL=http://127.0.0.1:18705/j
[junit4:junit4]   2> 8871 T220 oasc.ZkController.checkRecovery I am the leader, no recovery necessary
[junit4:junit4]   2> 8872 T220 oasc.ZkController.publish publishing core=collection1 state=active
[junit4:junit4]   2> 8872 T220 oasc.ZkController.publish numShards not found on descriptor - reading it from system property
[junit4:junit4]   2> 8875 T220 oascc.ZkStateReader.updateClusterState Updating cloud state from ZooKeeper... 
[junit4:junit4]   2> 8876 T178 oass.SolrDispatchFilter.init user.dir=/usr/home/hudson/hudson-slave/workspace/Lucene-Solr-Tests-trunk-java7/solr/build/solr-core/test/J0
[junit4:junit4]   2> 8877 T178 oass.SolrDispatchFilter.init SolrDispatchFilter.init() done
[junit4:junit4]   2> 8878 T178 oascsi.HttpClientUtil.createClient Creating new http client, config:maxConnections=128&maxConnectionsPerHost=32&followRedirects=false
[junit4:junit4]   2> 9080 T178 oejs.Server.doStart jetty-8.1.8.v20121106
[junit4:junit4]   2> 9084 T178 oejs.AbstractConnector.doStart Started SocketConnector@127.0.0.1:18713
[junit4:junit4]   2> 9086 T178 oasc.SolrResourceLoader.locateSolrHome JNDI not configured for solr (NoInitialContextEx)
[junit4:junit4]   2> 9087 T178 oasc.SolrResourceLoader.locateSolrHome using system property solr.solr.home: /usr/home/hudson/hudson-slave/workspace/Lucene-Solr-Tests-trunk-java7/solr/build/solr-core/test/J0/./org.apache.solr.cloud.BasicDistributedZkTest-jetty2-1356915308650
[junit4:junit4]   2> 9088 T178 oasc.SolrResourceLoader.<init> new SolrResourceLoader for deduced Solr Home: '/usr/home/hudson/hudson-slave/workspace/Lucene-Solr-Tests-trunk-java7/solr/build/solr-core/test/J0/./org.apache.solr.cloud.BasicDistributedZkTest-jetty2-1356915308650/'
[junit4:junit4]   2> 9174 T178 oass.SolrDispatchFilter.init SolrDispatchFilter.init()
[junit4:junit4]   2> 9175 T178 oasc.SolrResourceLoader.locateSolrHome JNDI not configured for solr (NoInitialContextEx)
[junit4:junit4]   2> 9176 T178 oasc.SolrResourceLoader.locateSolrHome using system property solr.solr.home: /usr/home/hudson/hudson-slave/workspace/Lucene-Solr-Tests-trunk-java7/solr/build/solr-core/test/J0/./org.apache.solr.cloud.BasicDistributedZkTest-jetty2-1356915308650
[junit4:junit4]   2> 9177 T178 oasc.CoreContainer$Initializer.initialize looking for solr.xml: /usr/home/hudson/hudson-slave/workspace/Lucene-Solr-Tests-trunk-java7/solr/build/solr-core/test/J0/./org.apache.solr.cloud.BasicDistributedZkTest-jetty2-1356915308650/solr.xml
[junit4:junit4]   2> 9178 T178 oasc.CoreContainer.<init> New CoreContainer 445952464
[junit4:junit4]   2> 9179 T178 oasc.CoreContainer.load Loading CoreContainer using Solr Home: '/usr/home/hudson/hudson-slave/workspace/Lucene-Solr-Tests-trunk-java7/solr/build/solr-core/test/J0/./org.apache.solr.cloud.BasicDistributedZkTest-jetty2-1356915308650/'
[junit4:junit4]   2> 9180 T178 oasc.SolrResourceLoader.<init> new SolrResourceLoader for directory: '/usr/home/hudson/hudson-slave/workspace/Lucene-Solr-Tests-trunk-java7/solr/build/solr-core/test/J0/./org.apache.solr.cloud.BasicDistributedZkTest-jetty2-1356915308650/'
[junit4:junit4]   2> 9232 T178 oashc.HttpShardHandlerFactory.getParameter Setting socketTimeout to: 30000
[junit4:junit4]   2> 9233 T178 oashc.HttpShardHandlerFactory.getParameter Setting urlScheme to: http://
[junit4:junit4]   2> 9234 T178 oashc.HttpShardHandlerFactory.getParameter Setting connTimeout to: 15000
[junit4:junit4]   2> 9234 T178 oashc.HttpShardHandlerFactory.getParameter Setting maxConnectionsPerHost to: 20
[junit4:junit4]   2> 9235 T178 oashc.HttpShardHandlerFactory.getParameter Setting corePoolSize to: 0
[junit4:junit4]   2> 9235 T178 oashc.HttpShardHandlerFactory.getParameter Setting maximumPoolSize to: 2147483647
[junit4:junit4]   2> 9236 T178 oashc.HttpShardHandlerFactory.getParameter Setting maxThreadIdleTime to: 5
[junit4:junit4]   2> 9237 T178 oashc.HttpShardHandlerFactory.getParameter Setting sizeOfQueue to: -1
[junit4:junit4]   2> 9237 T178 oashc.HttpShardHandlerFactory.getParameter Setting fairnessPolicy to: false
[junit4:junit4]   2> 9238 T178 oascsi.HttpClientUtil.createClient Creating new http client, config:maxConnectionsPerHost=20&maxConnections=10000&socketTimeout=30000&connTimeout=15000&retry=false
[junit4:junit4]   2> 9264 T178 oasc.CoreContainer.load Registering Log Listener
[junit4:junit4]   2> 9287 T178 oasc.CoreContainer.initZooKeeper Zookeeper client=127.0.0.1:18695/solr
[junit4:junit4]   2> 9288 T178 oasc.ZkController.checkChrootPath zkHost includes chroot
[junit4:junit4]   2> 9289 T178 oaz.ZooKeeper.<init> Initiating client connection, connectString=127.0.0.1:18695 sessionTimeout=60000 watcher=org.apache.solr.common.cloud.ConnectionManager@dfa0111
[junit4:junit4]   2> 9290 T178 oascc.ConnectionManager.waitForConnected Waiting for client to connect to ZooKeeper
[junit4:junit4]   2> 9290 T231 oaz.ClientCnxn$SendThread.logStartConnect Opening socket connection to server localhost/127.0.0.1:18695. Will not attempt to authenticate using SASL (access denied ("javax.security.auth.AuthPermission" "getLoginConfiguration"))
[junit4:junit4]   2> 9291 T231 oaz.ClientCnxn$SendThread.primeConnection Socket connection established to localhost/127.0.0.1:18695, initiating session
[junit4:junit4]   2> 9292 T180 oazs.NIOServerCnxnFactory.run Accepted socket connection from /140.211.11.196:18716
[junit4:junit4]   2> 9292 T180 oazs.ZooKeeperServer.processConnectRequest Client attempting to establish new session at /140.211.11.196:18716
[junit4:junit4]   2> 9294 T182 oazs.ZooKeeperServer.finishSessionInit Established session 0x13bee7456a60007 with negotiated timeout 20000 for client /140.211.11.196:18716
[junit4:junit4]   2> 9294 T231 oaz.ClientCnxn$SendThread.onConnected Session establishment complete on server localhost/127.0.0.1:18695, sessionid = 0x13bee7456a60007, negotiated timeout = 20000
[junit4:junit4]   2> 9295 T232 oascc.ConnectionManager.process Watcher org.apache.solr.common.cloud.ConnectionManager@dfa0111 name:ZooKeeperConnection Watcher:127.0.0.1:18695 got event WatchedEvent state:SyncConnected type:None path:null path:null type:None
[junit4:junit4]   2> 9295 T178 oascc.ConnectionManager.waitForConnected Client is connected to ZooKeeper
[junit4:junit4]   2> 9298 T183 oazs.PrepRequestProcessor.pRequest2Txn Processed session termination for sessionid: 0x13bee7456a60007
[junit4:junit4]   2> 9299 T232 oaz.ClientCnxn$EventThread.run EventThread shut down
[junit4:junit4]   2> 9299 T180 oazs.NIOServerCnxn.closeSock Closed socket connection for client /140.211.11.196:18716 which had sessionid 0x13bee7456a60007
[junit4:junit4]   2> 9299 T178 oaz.ZooKeeper.close Session: 0x13bee7456a60007 closed
[junit4:junit4]   2> 9300 T178 oascsi.HttpClientUtil.createClient Creating new http client, config:maxConnections=500&maxConnectionsPerHost=16&socketTimeout=15000&connTimeout=30000
[junit4:junit4]   2> 9312 T178 oaz.ZooKeeper.<init> Initiating client connection, connectString=127.0.0.1:18695/solr sessionTimeout=30000 watcher=org.apache.solr.common.cloud.ConnectionManager@6d462efd
[junit4:junit4]   2> 9314 T178 oascc.ConnectionManager.waitForConnected Waiting for client to connect to ZooKeeper
[junit4:junit4]   2> 9314 T233 oaz.ClientCnxn$SendThread.logStartConnect Opening socket connection to server localhost/127.0.0.1:18695. Will not attempt to authenticate using SASL (access denied ("javax.security.auth.AuthPermission" "getLoginConfiguration"))
[junit4:junit4]   2> 9315 T233 oaz.ClientCnxn$SendThread.primeConnection Socket connection established to localhost/127.0.0.1:18695, initiating session
[junit4:junit4]   2> 9315 T180 oazs.NIOServerCnxnFactory.run Accepted socket connection from /140.211.11.196:18717
[junit4:junit4]   2> 9316 T180 oazs.ZooKeeperServer.processConnectRequest Client attempting to establish new session at /140.211.11.196:18717
[junit4:junit4]   2> 9318 T182 oazs.ZooKeeperServer.finishSessionInit Established session 0x13bee7456a60008 with negotiated timeout 20000 for client /140.211.11.196:18717
[junit4:junit4]   2> 9318 T233 oaz.ClientCnxn$SendThread.onConnected Session establishment complete on server localhost/127.0.0.1:18695, sessionid = 0x13bee7456a60008, negotiated timeout = 20000
[junit4:junit4]   2> 9318 T234 oascc.ConnectionManager.process Watcher org.apache.solr.common.cloud.ConnectionManager@6d462efd name:ZooKeeperConnection Watcher:127.0.0.1:18695/solr got event WatchedEvent state:SyncConnected type:None path:null path:null type:None
[junit4:junit4]   2> 9319 T178 oascc.ConnectionManager.waitForConnected Client is connected to ZooKeeper
[junit4:junit4]   2> 9320 T183 oazs.PrepRequestProcessor.pRequest Got user-level KeeperException when processing sessionid:0x13bee7456a60008 type:create cxid:0x1 zxid:0x6d txntype:-1 reqpath:n/a Error Path:/solr/overseer Error:KeeperErrorCode = NodeExists for /solr/overseer
[junit4:junit4]   2> 9322 T183 oazs.PrepRequestProcessor.pRequest Got user-level KeeperException when processing sessionid:0x13bee7456a60008 type:create cxid:0x2 zxid:0x6e txntype:-1 reqpath:n/a Error Path:/solr/overseer Error:KeeperErrorCode = NodeExists for /solr/overseer
[junit4:junit4]   2> 9325 T178 oasc.ZkController.createEphemeralLiveNode Register node as live in ZooKeeper:/live_nodes/127.0.0.1:18713_j
[junit4:junit4]   2> 9326 T183 oazs.PrepRequestProcessor.pRequest Got user-level KeeperException when processing sessionid:0x13bee7456a60008 type:delete cxid:0x4 zxid:0x6f txntype:-1 reqpath:n/a Error Path:/solr/live_nodes/127.0.0.1:18713_j Error:KeeperErrorCode = NoNode for /solr/live_nodes/127.0.0.1:18713_j
[junit4:junit4]   2> 9332 T178 oascc.SolrZkClient.makePath makePath: /live_nodes/127.0.0.1:18713_j
[junit4:junit4]   2> 9336 T200 oascc.ZkStateReader$2.process A cluster state change: WatchedEvent state:SyncConnected type:NodeChildrenChanged path:/live_nodes, has occurred - updating... (live nodes size: 2)
[junit4:junit4]   2> 9336 T219 oascc.ZkStateReader$2.process A cluster state change: WatchedEvent state:SyncConnected type:NodeChildrenChanged path:/live_nodes, has occurred - updating... (live nodes size: 2)
[junit4:junit4]   2> 9336 T206 oascc.ZkStateReader$2.process A cluster state change: WatchedEvent state:SyncConnected type:NodeChildrenChanged path:/live_nodes, has occurred - updating... (live nodes size: 2)
[junit4:junit4]   2> 9339 T200 oascc.ZkStateReader$3.process Updating live nodes... (3)
[junit4:junit4]   2> 9341 T219 oascc.ZkStateReader$3.process Updating live nodes... (3)
[junit4:junit4]   2> 9341 T206 oascc.ZkStateReader$3.process Updating live nodes... (3)
[junit4:junit4]   2> 9343 T178 oascc.ZkStateReader.createClusterStateWatchersAndUpdate Updating cluster state from ZooKeeper... 
[junit4:junit4]   2> 9353 T235 oasc.CoreContainer.create Creating SolrCore 'collection1' using instanceDir: /usr/home/hudson/hudson-slave/workspace/Lucene-Solr-Tests-trunk-java7/solr/build/solr-core/test/J0/./org.apache.solr.cloud.BasicDistributedZkTest-jetty2-1356915308650/collection1
[junit4:junit4]   2> 9353 T235 oasc.ZkController.createCollectionZkNode Check for collection zkNode:collection1
[junit4:junit4]   2> 9355 T235 oasc.ZkController.createCollectionZkNode Collection zkNode exists
[junit4:junit4]   2> 9355 T235 oasc.ZkController.readConfigName Load collection config from:/collections/collection1
[junit4:junit4]   2> 9357 T235 oasc.SolrResourceLoader.<init> new SolrResourceLoader for directory: '/usr/home/hudson/hudson-slave/workspace/Lucene-Solr-Tests-trunk-java7/solr/build/solr-core/test/J0/./org.apache.solr.cloud.BasicDistributedZkTest-jetty2-1356915308650/collection1/'
[junit4:junit4]   2> 9359 T235 oasc.SolrResourceLoader.replaceClassLoader Adding 'file:/usr/home/hudson/hudson-slave/workspace/Lucene-Solr-Tests-trunk-java7/solr/build/solr-core/test/J0/org.apache.solr.cloud.BasicDistributedZkTest-jetty2-1356915308650/collection1/lib/classes/' to classloader
[junit4:junit4]   2> 9360 T235 oasc.SolrResourceLoader.replaceClassLoader Adding 'file:/usr/home/hudson/hudson-slave/workspace/Lucene-Solr-Tests-trunk-java7/solr/build/solr-core/test/J0/org.apache.solr.cloud.BasicDistributedZkTest-jetty2-1356915308650/collection1/lib/README' to classloader
[junit4:junit4]   2> 9447 T235 oasc.SolrConfig.<init> Using Lucene MatchVersion: LUCENE_50
[junit4:junit4]   2> 9529 T235 oasc.SolrConfig.<init> Loaded SolrConfig: solrconfig.xml
[junit4:junit4]   2> 9631 T235 oass.IndexSchema.readSchema Reading Solr Schema
[junit4:junit4]   2> 9640 T235 oass.IndexSchema.readSchema Schema name=test
[junit4:junit4]   2> 10343 T235 oass.OpenExchangeRatesOrgProvider.init Initialized with rates=open-exchange-rates.json, refreshInterval=1440.
[junit4:junit4]   2> 10353 T235 oass.IndexSchema.readSchema default search field in schema is text
[junit4:junit4]   2> 10356 T235 oass.IndexSchema.readSchema unique key field: id
[junit4:junit4]   2> 10357 T201 oascc.ZkStateReader.updateClusterState Updating cloud state from ZooKeeper... 
[junit4:junit4]   2> 10359 T201 oasc.Overseer$ClusterStateUpdater.updateState Update state numShards=2 message={
[junit4:junit4]   2> 	  "operation":"state",
[junit4:junit4]   2> 	  "numShards":"2",
[junit4:junit4]   2> 	  "shard":"shard1",
[junit4:junit4]   2> 	  "roles":null,
[junit4:junit4]   2> 	  "state":"active",
[junit4:junit4]   2> 	  "core":"collection1",
[junit4:junit4]   2> 	  "collection":"collection1",
[junit4:junit4]   2> 	  "node_name":"127.0.0.1:18705_j",
[junit4:junit4]   2> 	  "base_url":"http://127.0.0.1:18705/j"}
[junit4:junit4]   2> 10374 T219 oascc.ZkStateReader$2.process A cluster state change: WatchedEvent state:SyncConnected type:NodeDataChanged path:/clusterstate.json, has occurred - updating... (live nodes size: 3)
[junit4:junit4]   2> 10374 T234 oascc.ZkStateReader$2.process A cluster state change: WatchedEvent state:SyncConnected type:NodeDataChanged path:/clusterstate.json, has occurred - updating... (live nodes size: 3)
[junit4:junit4]   2> 10374 T200 oascc.ZkStateReader$2.process A cluster state change: WatchedEvent state:SyncConnected type:NodeDataChanged path:/clusterstate.json, has occurred - updating... (live nodes size: 3)
[junit4:junit4]   2> 10374 T206 oascc.ZkStateReader$2.process A cluster state change: WatchedEvent state:SyncConnected type:NodeDataChanged path:/clusterstate.json, has occurred - updating... (live nodes size: 3)
[junit4:junit4]   2> 10390 T235 oass.FileExchangeRateProvider.reload Reloading exchange rates from file currency.xml
[junit4:junit4]   2> 10397 T235 oass.FileExchangeRateProvider.reload Reloading exchange rates from file currency.xml
[junit4:junit4]   2> 10405 T235 oass.OpenExchangeRatesOrgProvider.reload Reloading exchange rates from open-exchange-rates.json
[junit4:junit4]   2> 10407 T235 oass.OpenExchangeRatesOrgProvider.reload Reloading exchange rates from open-exchange-rates.json
[junit4:junit4]   2> 10409 T235 oasc.SolrCore.<init> [collection1] Opening new SolrCore at /usr/home/hudson/hudson-slave/workspace/Lucene-Solr-Tests-trunk-java7/solr/build/solr-core/test/J0/./org.apache.solr.cloud.BasicDistributedZkTest-jetty2-1356915308650/collection1/, dataDir=./org.apache.solr.cloud.BasicDistributedZkTest-1356915299762/jetty2/
[junit4:junit4]   2> 10410 T235 oasc.JmxMonitoredMap.<init> JMX monitoring is enabled. Adding Solr mbeans to JMX Server: com.sun.jmx.mbeanserver.JmxMBeanServer@1fb77bbb
[junit4:junit4]   2> 10411 T235 oasc.SolrCore.initDirectoryFactory solr.NRTCachingDirectoryFactory
[junit4:junit4]   2> 10412 T235 oasc.CachingDirectoryFactory.get return new directory for /usr/home/hudson/hudson-slave/workspace/Lucene-Solr-Tests-trunk-java7/solr/build/solr-core/test/J0/./org.apache.solr.cloud.BasicDistributedZkTest-1356915299762/jetty2 forceNew:false
[junit4:junit4]   2> 10413 T235 oasc.CachingDirectoryFactory.close Releasing directory:/usr/home/hudson/hudson-slave/workspace/Lucene-Solr-Tests-trunk-java7/solr/build/solr-core/test/J0/./org.apache.solr.cloud.BasicDistributedZkTest-1356915299762/jetty2
[junit4:junit4]   2> 10413 T235 oasc.SolrCore.getNewIndexDir New index directory detected: old=null new=./org.apache.solr.cloud.BasicDistributedZkTest-1356915299762/jetty2/index/
[junit4:junit4]   2> 10414 T235 oasc.SolrCore.initIndex WARNING [collection1] Solr index directory './org.apache.solr.cloud.BasicDistributedZkTest-1356915299762/jetty2/index' doesn't exist. Creating new index...
[junit4:junit4]   2> 10415 T235 oasc.CachingDirectoryFactory.get return new directory for /usr/home/hudson/hudson-slave/workspace/Lucene-Solr-Tests-trunk-java7/solr/build/solr-core/test/J0/./org.apache.solr.cloud.BasicDistributedZkTest-1356915299762/jetty2/index forceNew:false
[junit4:junit4]   2> 10421 T235 oasc.SolrDeletionPolicy.onCommit SolrDeletionPolicy.onCommit: commits:num=1
[junit4:junit4]   2> 		commit{dir=RateLimitedDirectoryWrapper(NRTCachingDirectory(org.apache.lucene.store.NIOFSDirectory@/usr/home/hudson/hudson-slave/workspace/Lucene-Solr-Tests-trunk-java7/solr/build/solr-core/test/J0/org.apache.solr.cloud.BasicDistributedZkTest-1356915299762/jetty2/index lockFactory=org.apache.lucene.store.NativeFSLockFactory@40ce2eb0; maxCacheMB=48.0 maxMergeSizeMB=4.0)),segFN=segments_1,generation=1,filenames=[segments_1]
[junit4:junit4]   2> 10422 T235 oasc.SolrDeletionPolicy.updateCommits newest commit = 1[segments_1]
[junit4:junit4]   2> 10423 T235 oasc.CachingDirectoryFactory.close Releasing directory:/usr/home/hudson/hudson-slave/workspace/Lucene-Solr-Tests-trunk-java7/solr/build/solr-core/test/J0/./org.apache.solr.cloud.BasicDistributedZkTest-1356915299762/jetty2/index
[junit4:junit4]   2> 10423 T235 oasc.SolrCore.initWriters created xml: solr.XMLResponseWriter
[junit4:junit4]   2> 10426 T235 oasup.UpdateRequestProcessorChain.init inserting DistributedUpdateProcessorFactory into updateRequestProcessorChain "dedupe"
[junit4:junit4]   2> 10427 T235 oasup.UpdateRequestProcessorChain.init inserting DistributedUpdateProcessorFactory into updateRequestProcessorChain "dedupe-allfields"
[junit4:junit4]   2> 10427 T235 oasup.UpdateRequestProcessorChain.init inserting DistributedUpdateProcessorFactory into updateRequestProcessorChain "stored_sig"
[junit4:junit4]   2> 10428 T235 oasup.UpdateRequestProcessorChain.init inserting DistributedUpdateProcessorFactory into updateRequestProcessorChain "uniq-fields"
[junit4:junit4]   2> 10429 T235 oasup.UpdateRequestProcessorChain.init inserting DistributedUpdateProcessorFactory into updateRequestProcessorChain "distrib-dup-test-chain-implicit"
[junit4:junit4]   2> 10429 T235 oasc.RequestHandlers.initHandlersFromConfig adding lazy requestHandler: solr.ReplicationHandler
[junit4:junit4]   2> 10430 T235 oasc.RequestHandlers.initHandlersFromConfig created /replication: solr.ReplicationHandler
[junit4:junit4]   2> 10430 T235 oasc.RequestHandlers.initHandlersFromConfig created standard: solr.StandardRequestHandler
[junit4:junit4]   2> 10431 T235 oasc.RequestHandlers.initHandlersFromConfig created /get: solr.RealTimeGetHandler
[junit4:junit4]   2> 10432 T235 oasc.RequestHandlers.initHandlersFromConfig created dismax: solr.SearchHandler
[junit4:junit4]   2> 10432 T235 oasc.RequestHandlers.initHandlersFromConfig created mock: org.apache.solr.core.MockQuerySenderListenerReqHandler
[junit4:junit4]   2> 10433 T235 oasc.RequestHandlers.initHandlersFromConfig created /admin/: org.apache.solr.handler.admin.AdminHandlers
[junit4:junit4]   2> 10434 T235 oasc.RequestHandlers.initHandlersFromConfig created defaults: solr.StandardRequestHandler
[junit4:junit4]   2> 10434 T235 oasc.RequestHandlers.initHandlersFromConfig adding lazy requestHandler: solr.StandardRequestHandler
[junit4:junit4]   2> 10435 T235 oasc.RequestHandlers.initHandlersFromConfig created lazy: solr.StandardRequestHandler
[junit4:junit4]   2> 10435 T235 oasc.RequestHandlers.initHandlersFromConfig created /update: solr.UpdateRequestHandler
[junit4:junit4]   2> 10436 T235 oasc.RequestHandlers.initHandlersFromConfig created /terms: org.apache.solr.handler.component.SearchHandler
[junit4:junit4]   2> 10437 T235 oasc.RequestHandlers.initHandlersFromConfig created spellCheckCompRH: org.apache.solr.handler.component.SearchHandler
[junit4:junit4]   2> 10437 T235 oasc.RequestHandlers.initHandlersFromConfig created spellCheckCompRH_Direct: org.apache.solr.handler.component.SearchHandler
[junit4:junit4]   2> 10438 T235 oasc.RequestHandlers.initHandlersFromConfig created spellCheckWithWordbreak: org.apache.solr.handler.component.SearchHandler
[junit4:junit4]   2> 10439 T235 oasc.RequestHandlers.initHandlersFromConfig created spellCheckWithWordbreak_Direct: org.apache.solr.handler.component.SearchHandler
[junit4:junit4]   2> 10439 T235 oasc.RequestHandlers.initHandlersFromConfig created spellCheckCompRH1: org.apache.solr.handler.component.SearchHandler
[junit4:junit4]   2> 10440 T235 oasc.RequestHandlers.initHandlersFromConfig created mltrh: org.apache.solr.handler.component.SearchHandler
[junit4:junit4]   2> 10441 T235 oasc.RequestHandlers.initHandlersFromConfig created tvrh: org.apache.solr.handler.component.SearchHandler
[junit4:junit4]   2> 10441 T235 oasc.RequestHandlers.initHandlersFromConfig created /mlt: solr.MoreLikeThisHandler
[junit4:junit4]   2> 10442 T235 oasc.RequestHandlers.initHandlersFromConfig created /debug/dump: solr.DumpRequestHandler
[junit4:junit4]   2> 10456 T235 oashl.XMLLoader.init xsltCacheLifetimeSeconds=60
[junit4:junit4]   2> 10461 T235 oasc.SolrCore.initDeprecatedSupport WARNING solrconfig.xml uses deprecated <admin/gettableFiles>, Please update your config to use the ShowFileRequestHandler.
[junit4:junit4]   2> 10463 T235 oasc.SolrCore.initDeprecatedSupport WARNING adding ShowFileRequestHandler with hidden files: [SCHEMA.XML, OLD_SYNONYMS.TXT, STOPWORDS.TXT, PROTWORDS.TXT, OPEN-EXCHANGE-RATES.JSON, SYNONYMS.TXT, CURRENCY.XML, MAPPING-ISOLATIN1ACCENT.TXT]
[junit4:junit4]   2> 10466 T235 oasc.CachingDirectoryFactory.close Releasing directory:/usr/home/hudson/hudson-slave/workspace/Lucene-Solr-Tests-trunk-java7/solr/build/solr-core/test/J0/./org.apache.solr.cloud.BasicDistributedZkTest-1356915299762/jetty2
[junit4:junit4]   2> 10468 T235 oass.SolrIndexSearcher.<init> Opening Searcher@7f19ea6c main
[junit4:junit4]   2> 10469 T235 oasu.CommitTracker.<init> Hard AutoCommit: disabled
[junit4:junit4]   2> 10470 T235 oasu.CommitTracker.<init> Soft AutoCommit: disabled
[junit4:junit4]   2> 10470 T235 oashc.SpellCheckComponent.inform Initializing spell checkers
[junit4:junit4]   2> 10478 T235 oass.DirectSolrSpellChecker.init init: {name=direct,classname=DirectSolrSpellChecker,field=lowerfilt,minQueryLength=3}
[junit4:junit4]   2> 10515 T236 oasc.SolrCore.registerSearcher [collection1] Registered new searcher Searcher@7f19ea6c main{StandardDirectoryReader(segments_1:1)}
[junit4:junit4]   2> 10519 T235 oasc.ZkController.publish publishing core=collection1 state=down
[junit4:junit4]   2> 10519 T235 oasc.ZkController.publish numShards not found on descriptor - reading it from system property
[junit4:junit4]   2> 11884 T201 oascc.ZkStateReader.updateClusterState Updating cloud state from ZooKeeper... 
[junit4:junit4]   2> 11886 T201 oasc.Overseer$ClusterStateUpdater.updateState Update state numShards=2 message={
[junit4:junit4]   2> 	  "operation":"state",
[junit4:junit4]   2> 	  "numShards":"2",
[junit4:junit4]   2> 	  "shard":null,
[junit4:junit4]   2> 	  "roles":null,
[junit4:junit4]   2> 	  "state":"down",
[junit4:junit4]   2> 	  "core":"collection1",
[junit4:junit4]   2> 	  "collection":"collection1",
[junit4:junit4]   2> 	  "node_name":"127.0.0.1:18713_j",
[junit4:junit4]   2> 	  "base_url":"http://127.0.0.1:18713/j"}
[junit4:junit4]   2> 11886 T201 oasc.Overseer$ClusterStateUpdater.updateState Collection already exists with numShards=2
[junit4:junit4]   2> 11887 T201 oasc.Overseer$ClusterStateUpdater.updateState Assigning new node to shard shard=shard2
[junit4:junit4]   2> 11902 T219 oascc.ZkStateReader$2.process A cluster state change: WatchedEvent state:SyncConnected type:NodeDataChanged path:/clusterstate.json, has occurred - updating... (live nodes size: 3)
[junit4:junit4]   2> 11902 T200 oascc.ZkStateReader$2.process A cluster state change: WatchedEvent state:SyncConnected type:NodeDataChanged path:/clusterstate.json, has occurred - updating... (live nodes size: 3)
[junit4:junit4]   2> 11902 T206 oascc.ZkStateReader$2.process A cluster state change: WatchedEvent state:SyncConnected type:NodeDataChanged path:/clusterstate.json, has occurred - updating... (live nodes size: 3)
[junit4:junit4]   2> 11902 T234 oascc.ZkStateReader$2.process A cluster state change: WatchedEvent state:SyncConnected type:NodeDataChanged path:/clusterstate.json, has occurred - updating... (live nodes size: 3)
[junit4:junit4]   2> 12523 T235 oasc.CoreContainer.registerCore registering core: collection1
[junit4:junit4]   2> 12523 T235 oasc.ZkController.register Register replica - core:collection1 address:http://127.0.0.1:18713/j collection:collection1 shard:shard2
[junit4:junit4]   2> 12525 T235 oascc.SolrZkClient.makePath makePath: /collections/collection1/leader_elect/shard2/election
[junit4:junit4]   2> 12542 T183 oazs.PrepRequestProcessor.pRequest Got user-level KeeperException when processing sessionid:0x13bee7456a60008 type:delete cxid:0x44 zxid:0x7e txntype:-1 reqpath:n/a Error Path:/solr/collections/collection1/leaders/shard2 Error:KeeperErrorCode = NoNode for /solr/collections/collection1/leaders/shard2
[junit4:junit4]   2> 12544 T235 oasc.ShardLeaderElectionContext.runLeaderProcess Running the leader process.
[junit4:junit4]   2> 12545 T183 oazs.PrepRequestProcessor.pRequest Got user-level KeeperException when processing sessionid:0x13bee7456a60008 type:create cxid:0x45 zxid:0x7f txntype:-1 reqpath:n/a Error Path:/solr/overseer Error:KeeperErrorCode = NodeExists for /solr/overseer
[junit4:junit4]   2> 12553 T235 oasc.ShardLeaderElectionContext.waitForReplicasToComeUp Enough replicas found to continue.
[junit4:junit4]   2> 12553 T235 oasc.ShardLeaderElectionContext.runLeaderProcess I may be the new leader - try and sync
[junit4:junit4]   2> 12554 T235 oasc.SyncStrategy.sync Sync replicas to http://127.0.0.1:18713/j/collection1/
[junit4:junit4]   2> 12554 T235 oasc.SyncStrategy.syncReplicas Sync Success - now sync replicas to me
[junit4:junit4]   2> 12554 T235 oasc.SyncStrategy.syncToMe http://127.0.0.1:18713/j/collection1/ has no replicas
[junit4:junit4]   2> 12555 T235 oasc.ShardLeaderElectionContext.runLeaderProcess I am the new leader: http://127.0.0.1:18713/j/collection1/
[junit4:junit4]   2> 12555 T235 oascc.SolrZkClient.makePath makePath: /collections/collection1/leaders/shard2
[junit4:junit4]   2> 12561 T183 oazs.PrepRequestProcessor.pRequest Got user-level KeeperException when processing sessionid:0x13bee7456a60008 type:create cxid:0x4e zxid:0x82 txntype:-1 reqpath:n/a Error Path:/solr/overseer Error:KeeperErrorCode = NodeExists for /solr/overseer
[junit4:junit4]   2> 13412 T201 oascc.ZkStateReader.updateClusterState Updating cloud state from ZooKeeper... 
[junit4:junit4]   2> 13442 T200 oascc.ZkStateReader$2.process A cluster state change: WatchedEvent state:SyncConnected type:NodeDataChanged path:/clusterstate.json, has occurred - updating... (live nodes size: 3)
[junit4:junit4]   2> 13442 T206 oascc.ZkStateReader$2.process A cluster state change: WatchedEvent state:SyncConnected type:NodeDataChanged path:/clusterstate.json, has occurred - updating... (live nodes size: 3)
[junit4:junit4]   2> 13442 T234 oascc.ZkStateReader$2.process A cluster state change: WatchedEvent state:SyncConnected type:NodeDataChanged path:/clusterstate.json, has occurred - updating... (live nodes size: 3)
[junit4:junit4]   2> 13442 T219 oascc.ZkStateReader$2.process A cluster state change: WatchedEvent state:SyncConnected type:NodeDataChanged path:/clusterstate.json, has occurred - updating... (live nodes size: 3)
[junit4:junit4]   2> 13489 T235 oasc.ZkController.register We are http://127.0.0.1:18713/j/collection1/ and leader is http://127.0.0.1:18713/j/collection1/
[junit4:junit4]   2> 13489 T235 oasc.ZkController.register No LogReplay needed for core=collection1 baseURL=http://127.0.0.1:18713/j
[junit4:junit4]   2> 13489 T235 oasc.ZkController.checkRecovery I am the leader, no recovery necessary
[junit4:junit4]   2> 13490 T235 oasc.ZkController.publish publishing core=collection1 state=active
[junit4:junit4]   2> 13490 T235 oasc.ZkController.publish numShards not found on descriptor - reading it from system property
[junit4:junit4]   2> 13493 T235 oascc.ZkStateReader.updateClusterState Updating cloud state from ZooKeeper... 
[junit4:junit4]   2> 13494 T178 oass.SolrDispatchFilter.init user.dir=/usr/home/hudson/hudson-slave/workspace/Lucene-Solr-Tests-trunk-java7/solr/build/solr-core/test/J0
[junit4:junit4]   2> 13495 T178 oass.SolrDispatchFilter.init SolrDispatchFilter.init() done
[junit4:junit4]   2> 13496 T178 oascsi.HttpClientUtil.createClient Creating new http client, config:maxConnections=128&maxConnectionsPerHost=32&followRedirects=false
[junit4:junit4]   2> 13669 T178 oejs.Server.doStart jetty-8.1.8.v20121106
[junit4:junit4]   2> 13672 T178 oejs.AbstractConnector.doStart Started SocketConnector@127.0.0.1:18729
[junit4:junit4]   2> 13673 T178 oasc.SolrResourceLoader.locateSolrHome JNDI not configured for solr (NoInitialContextEx)
[junit4:junit4]   2> 13674 T178 oasc.SolrResourceLoader.locateSolrHome using system property solr.solr.home: /usr/home/hudson/hudson-slave/workspace/Lucene-Solr-Tests-trunk-java7/solr/build/solr-core/test/J0/./org.apache.solr.cloud.BasicDistributedZkTest-jetty3-1356915313268
[junit4:junit4]   2> 13675 T178 oasc.SolrResourceLoader.<init> new SolrResourceLoader for deduced Solr Home: '/usr/home/hudson/hudson-slave/workspace/Lucene-Solr-Tests-trunk-java7/solr/build/solr-core/test/J0/./org.apache.solr.cloud.BasicDistributedZkTest-jetty3-1356915313268/'
[junit4:junit4]   2> 13716 T178 oass.SolrDispatchFilter.init SolrDispatchFilter.init()
[junit4:junit4]   2> 13716 T178 oasc.SolrResourceLoader.locateSolrHome JNDI not configured for solr (NoInitialContextEx)
[junit4:junit4]   2> 13717 T178 oasc.SolrResourceLoader.locateSolrHome using system property solr.solr.home: /usr/home/hudson/hudson-slave/workspace/Lucene-Solr-Tests-trunk-java7/solr/build/solr-core/test/J0/./org.apache.solr.cloud.BasicDistributedZkTest-jetty3-1356915313268
[junit4:junit4]   2> 13718 T178 oasc.CoreContainer$Initializer.initialize looking for solr.xml: /usr/home/hudson/hudson-slave/workspace/Lucene-Solr-Tests-trunk-java7/solr/build/solr-core/test/J0/./org.apache.solr.cloud.BasicDistributedZkTest-jetty3-1356915313268/solr.xml
[junit4:junit4]   2> 13718 T178 oasc.CoreContainer.<init> New CoreContainer 985306153
[junit4:junit4]   2> 13719 T178 oasc.CoreContainer.load Loading CoreContainer using Solr Home: '/usr/home/hudson/hudson-slave/workspace/Lucene-Solr-Tests-trunk-java7/solr/build/solr-core/test/J0/./org.apache.solr.cloud.BasicDistributedZkTest-jetty3-1356915313268/'
[junit4:junit4]   2> 13720 T178 oasc.SolrResourceLoader.<init> new SolrResourceLoader for directory: '/usr/home/hudson/hudson-slave/workspace/Lucene-Solr-Tests-trunk-java7/solr/build/solr-core/test/J0/./org.apache.solr.cloud.BasicDistributedZkTest-jetty3-1356915313268/'
[junit4:junit4]   2> 13750 T178 oashc.HttpShardHandlerFactory.getParameter Setting socketTimeout to: 30000
[junit4:junit4]   2> 13750 T178 oashc.HttpShardHandlerFactory.getParameter Setting urlScheme to: http://
[junit4:junit4]   2> 13751 T178 oashc.HttpShardHandlerFactory.getParameter Setting connTimeout to: 15000
[junit4:junit4]   2> 13752 T178 oashc.HttpShardHandlerFactory.getParameter Setting maxConnectionsPerHost to: 20
[junit4:junit4]   2> 13752 T178 oashc.HttpShardHandlerFactory.getParameter Setting corePoolSize to: 0
[junit4:junit4]   2> 13753 T178 oashc.HttpShardHandlerFactory.getParameter Setting maximumPoolSize to: 2147483647
[junit4:junit4]   2> 13753 T178 oashc.HttpShardHandlerFactory.getParameter Setting maxThreadIdleTime to: 5
[junit4:junit4]   2> 13754 T178 oashc.HttpShardHandlerFactory.getParameter Setting sizeOfQueue to: -1
[junit4:junit4]   2> 13754 T178 oashc.HttpShardHandlerFactory.getParameter Setting fairnessPolicy to: false
[junit4:junit4]   2> 13755 T178 oascsi.HttpClientUtil.createClient Creating new http client, config:maxConnectionsPerHost=20&maxConnections=10000&socketTimeout=30000&connTimeout=15000&retry=false
[junit4:junit4]   2> 13779 T178 oasc.CoreContainer.load Registering Log Listener
[junit4:junit4]   2> 13799 T178 oasc.CoreContainer.initZooKeeper Zookeeper client=127.0.0.1:18695/solr
[junit4:junit4]   2> 13800 T178 oasc.ZkController.checkChrootPath zkHost includes chroot
[junit4:junit4]   2> 13801 T178 oaz.ZooKeeper.<init> Initiating client connection, connectString=127.0.0.1:18695 sessionTimeout=60000 watcher=org.apache.solr.common.cloud.ConnectionManager@1ed1fce7
[junit4:junit4]   2> 13802 T178 oascc.ConnectionManager.waitForConnected Waiting for client to connect to ZooKeeper
[junit4:junit4]   2> 13802 T246 oaz.ClientCnxn$SendThread.logStartConnect Opening socket connection to server localhost/127.0.0.1:18695. Will not attempt to authenticate using SASL (access denied ("javax.security.auth.AuthPermission" "getLoginConfiguration"))
[junit4:junit4]   2> 13803 T246 oaz.ClientCnxn$SendThread.primeConnection Socket connection established to localhost/127.0.0.1:18695, initiating session
[junit4:junit4]   2> 13804 T180 oazs.NIOServerCnxnFactory.run Accepted socket connection from /140.211.11.196:18730
[junit4:junit4]   2> 13804 T180 oazs.ZooKeeperServer.processConnectRequest Client attempting to establish new session at /140.211.11.196:18730
[junit4:junit4]   2> 13809 T182 oazs.ZooKeeperServer.finishSessionInit Established session 0x13bee7456a60009 with negotiated timeout 20000 for client /140.211.11.196:18730
[junit4:junit4]   2> 13810 T246 oaz.ClientCnxn$SendThread.onConnected Session establishment complete on server localhost/127.0.0.1:18695, sessionid = 0x13bee7456a60009, negotiated timeout = 20000
[junit4:junit4]   2> 13810 T247 oascc.ConnectionManager.process Watcher org.apache.solr.common.cloud.ConnectionManager@1ed1fce7 name:ZooKeeperConnection Watcher:127.0.0.1:18695 got event WatchedEvent state:SyncConnected type:None path:null path:null type:None
[junit4:junit4]   2> 13811 T178 oascc.ConnectionManager.waitForConnected Client is connected to ZooKeeper
[junit4:junit4]   2> 13812 T183 oazs.PrepRequestProcessor.pRequest2Txn Processed session termination for sessionid: 0x13bee7456a60009
[junit4:junit4]   2> 13827 T247 oaz.ClientCnxn$EventThread.run EventThread shut down
[junit4:junit4]   2> 13827 T178 oaz.ZooKeeper.close Session: 0x13bee7456a60009 closed
[junit4:junit4]   2> 13827 T180 oazs.NIOServerCnxn.closeSock Closed socket connection for client /140.211.11.196:18730 which had sessionid 0x13bee7456a60009
[junit4:junit4]   2> 13828 T178 oascsi.HttpClientUtil.createClient Creating new http client, config:maxConnections=500&maxConnectionsPerHost=16&socketTimeout=15000&connTimeout=30000
[junit4:junit4]   2> 13842 T178 oaz.ZooKeeper.<init> Initiating client connection, connectString=127.0.0.1:18695/solr sessionTimeout=30000 watcher=org.apache.solr.common.cloud.ConnectionManager@273fa6f4
[junit4:junit4]   2> 13843 T178 oascc.ConnectionManager.waitForConnected Waiting for client to connect to ZooKeeper
[junit4:junit4]   2> 13843 T248 oaz.ClientCnxn$SendThread.logStartConnect Opening socket connection to server localhost/127.0.0.1:18695. Will not attempt to authenticate using SASL (access denied ("javax.security.auth.AuthPermission" "getLoginConfiguration"))
[junit4:junit4]   2> 13844 T248 oaz.ClientCnxn$SendThread.primeConnection Socket connection established to localhost/127.0.0.1:18695, initiating session
[junit4:junit4]   2> 13844 T180 oazs.NIOServerCnxnFactory.run Accepted socket connection from /140.211.11.196:18731
[junit4:junit4]   2> 13845 T180 oazs.ZooKeeperServer.processConnectRequest Client attempting to establish new session at /140.211.11.196:18731
[junit4:junit4]   2> 13847 T182 oazs.ZooKeeperServer.finishSessionInit Established session 0x13bee7456a6000a with negotiated timeout 20000 for client /140.211.11.196:18731
[junit4:junit4]   2> 13847 T248 oaz.ClientCnxn$SendThread.onConnected Session establishment complete on server localhost/127.0.0.1:18695, sessionid = 0x13bee7456a6000a, negotiated timeout = 20000
[junit4:junit4]   2> 13847 T249 oascc.ConnectionManager.process Watcher org.apache.solr.common.cloud.ConnectionManager@273fa6f4 name:ZooKeeperConnection Watcher:127.0.0.1:18695/solr got event WatchedEvent state:SyncConnected type:None path:null path:null type:None
[junit4:junit4]   2> 13848 T178 oascc.ConnectionManager.waitForConnected Client is connected to ZooKeeper
[junit4:junit4]   2> 13849 T183 oazs.PrepRequestProcessor.pRequest Got user-level KeeperException when processing sessionid:0x13bee7456a6000a type:create cxid:0x1 zxid:0x8f txntype:-1 reqpath:n/a Error Path:/solr/overseer Error:KeeperErrorCode = NodeExists for /solr/overseer
[junit4:junit4]   2> 13851 T183 oazs.PrepRequestProcessor.pRequest Got user-level KeeperException when processing sessionid:0x13bee7456a6000a type:create cxid:0x2 zxid:0x90 txntype:-1 reqpath:n/a Error Path:/solr/overseer Error:KeeperErrorCode = NodeExists for /solr/overseer
[junit4:junit4]   2> 13859 T178 oasc.ZkController.createEphemeralLiveNode Register node as live in ZooKeeper:/live_nodes/127.0.0.1:18729_j
[junit4:junit4]   2> 13860 T183 oazs.PrepRequestProcessor.pRequest Got user-level KeeperException when processing sessionid:0x13bee7456a6000a type:delete cxid:0x4 zxid:0x91 txntype:-1 reqpath:n/a Error Path:/solr/live_nodes/127.0.0.1:18729_j Error:KeeperErrorCode = NoNode for /solr/live_nodes/127.0.0.1:18729_j
[junit4:junit4]   2> 13861 T178 oascc.SolrZkClient.makePath makePath: /live_nodes/127.0.0.1:18729_j
[junit4:junit4]   2> 13866 T219 oascc.ZkStateReader$2.process A cluster state change: WatchedEvent state:SyncConnected type:NodeChildrenChanged path:/live_nodes, has occurred - updating... (live nodes size: 3)
[junit4:junit4]   2> 13866 T200 oascc.ZkStateReader$2.process A cluster state change: WatchedEvent state:SyncConnected type:NodeChildrenChanged path:/live_nodes, has occurred - updating... (live nodes size: 3)
[junit4:junit4]   2> 13866 T206 oascc.ZkStateReader$2.process A cluster state change: WatchedEvent state:SyncConnected type:NodeChildrenChanged path:/live_nodes, has occurred - updating... (live nodes size: 3)
[junit4:junit4]   2> 13867 T234 oascc.ZkStateReader$3.process Updating live nodes... (4)
[junit4:junit4]   2> 13867 T234 oascc.ZkStateReader$2.process A cluster state change: WatchedEvent state:SyncConnected type:NodeChildrenChanged path:/live_nodes, has occurred - updating... (live nodes size: 4)
[junit4:junit4]   2> 13869 T219 oascc.ZkStateReader$3.process Updating live nodes... (4)
[junit4:junit4]   2> 13870 T200 oascc.ZkStateReader$3.process Updating live nodes... (4)
[junit4:junit4]   2> 13870 T206 oascc.ZkStateReader$3.process Updating live nodes... (4)
[junit4:junit4]   2> 13874 T178 oascc.ZkStateReader.createClusterStateWatchersAndUpdate Updating cluster state from ZooKeeper... 
[junit4:junit4]   2> 13882 T250 oasc.CoreContainer.create Creating SolrCore 'collection1' using instanceDir: /usr/home/hudson/hudson-slave/workspace/Lucene-Solr-Tests-trunk-java7/solr/build/solr-core/test/J0/./org.apache.solr.cloud.BasicDistributedZkTest-jetty3-1356915313268/collection1
[junit4:junit4]   2> 13882 T250 oasc.ZkController.createCollectionZkNode Check for collection zkNode:collection1
[junit4:junit4]   2> 13884 T250 oasc.ZkController.createCollectionZkNode Collection zkNode exists
[junit4:junit4]   2> 13884 T250 oasc.ZkController.readConfigName Load collection config from:/collections/collection1
[junit4:junit4]   2> 13886 T250 oasc.SolrResourceLoader.<init> new SolrResourceLoader for directory: '/usr/home/hudson/hudson-slave/workspace/Lucene-Solr-Tests-trunk-java7/solr/build/solr-core/test/J0/./org.apache.solr.cloud.BasicDistributedZkTest-jetty3-1356915313268/collection1/'
[junit4:junit4]   2> 13888 T250 oasc.SolrResourceLoader.replaceClassLoader Adding 'file:/usr/home/hudson/hudson-slave/workspace/Lucene-Solr-Tests-trunk-java7/solr/build/solr-core/test/J0/org.apache.solr.cloud.BasicDistributedZkTest-jetty3-1356915313268/collection1/lib/classes/' to classloader
[junit4:junit4]   2> 13888 T250 oasc.SolrResourceLoader.replaceClassLoader Adding 'file:/usr/home/hudson/hudson-slave/workspace/Lucene-Solr-Tests-trunk-java7/solr/build/solr-core/test/J0/org.apache.solr.cloud.BasicDistributedZkTest-jetty3-1356915313268/collection1/lib/README' to classloader
[junit4:junit4]   2> 13943 T250 oasc.SolrConfig.<init> Using Lucene MatchVersion: LUCENE_50
[junit4:junit4]   2> 14024 T250 oasc.SolrConfig.<init> Loaded SolrConfig: solrconfig.xml
[junit4:junit4]   2> 14126 T250 oass.IndexSchema.readSchema Reading Solr Schema
[junit4:junit4]   2> 14133 T250 oass.IndexSchema.readSchema Schema name=test
[junit4:junit4]   2> 14746 T250 oass.OpenExchangeRatesOrgProvider.init Initialized with rates=open-exchange-rates.json, refreshInterval=1440.
[junit4:junit4]   2> 14754 T250 oass.IndexSchema.readSchema default search field in schema is text
[junit4:junit4]   2> 14757 T250 oass.IndexSchema.readSchema unique key field: id
[junit4:junit4]   2> 14776 T250 oass.FileExchangeRateProvider.reload Reloading exchange rates from file currency.xml
[junit4:junit4]   2> 14780 T250 oass.FileExchangeRateProvider.reload Reloading exchange rates from file currency.xml
[junit4:junit4]   2> 14784 T250 oass.OpenExchangeRatesOrgProvider.reload Reloading exchange rates from open-exchange-rates.json
[junit4:junit4]   2> 14786 T250 oass.OpenExchangeRatesOrgProvider.reload Reloading exchange rates from open-exchange-rates.json
[junit4:junit4]   2> 14788 T250 oasc.SolrCore.<init> [collection1] Opening new SolrCore at /usr/home/hudson/hudson-slave/workspace/Lucene-Solr-Tests-trunk-java7/solr/build/solr-core/test/J0/./org.apache.solr.cloud.BasicDistributedZkTest-jetty3-1356915313268/collection1/, dataDir=./org.apache.solr.cloud.BasicDistributedZkTest-1356915299762/jetty3/
[junit4:junit4]   2> 14788 T250 oasc.JmxMonitoredMap.<init> JMX monitoring is enabled. Adding Solr mbeans to JMX Server: com.sun.jmx.mbeanserver.JmxMBeanServer@1fb77bbb
[junit4:junit4]   2> 14788 T250 oasc.SolrCore.initDirectoryFactory solr.NRTCachingDirectoryFactory
[junit4:junit4]   2> 14789 T250 oasc.CachingDirectoryFactory.get return new directory for /usr/home/hudson/hudson-slave/workspace/Lucene-Solr-Tests-trunk-java7/solr/build/solr-core/test/J0/./org.apache.solr.cloud.BasicDistributedZkTest-1356915299762/jetty3 forceNew:false
[junit4:junit4]   2> 14790 T250 oasc.CachingDirectoryFactory.close Releasing directory:/usr/home/hudson/hudson-slave/workspace/Lucene-Solr-Tests-trunk-java7/solr/build/solr-core/test/J0/./org.apache.solr.cloud.BasicDistributedZkTest-1356915299762/jetty3
[junit4:junit4]   2> 14790 T250 oasc.SolrCore.getNewIndexDir New index directory detected: old=null new=./org.apache.solr.cloud.BasicDistributedZkTest-1356915299762/jetty3/index/
[junit4:junit4]   2> 14790 T250 oasc.SolrCore.initIndex WARNING [collection1] Solr index directory './org.apache.solr.cloud.BasicDistributedZkTest-1356915299762/jetty3/index' doesn't exist. Creating new index...
[junit4:junit4]   2> 14791 T250 oasc.CachingDirectoryFactory.get return new directory for /usr/home/hudson/hudson-slave/workspace/Lucene-Solr-Tests-trunk-java7/solr/build/solr-core/test/J0/./org.apache.solr.cloud.BasicDistributedZkTest-1356915299762/jetty3/index forceNew:false
[junit4:junit4]   2> 14796 T250 oasc.SolrDeletionPolicy.onCommit SolrDeletionPolicy.onCommit: commits:num=1
[junit4:junit4]   2> 		commit{dir=RateLimitedDirectoryWrapper(NRTCachingDirectory(org.apache.lucene.store.NIOFSDirectory@/usr/home/hudson/hudson-slave/workspace/Lucene-Solr-Tests-trunk-java7/solr/build/solr-core/test/J0/org.apache.solr.cloud.BasicDistributedZkTest-1356915299762/jetty3/index lockFactory=org.apache.lucene.store.NativeFSLockFactory@3606bc8d; maxCacheMB=48.0 maxMergeSizeMB=4.0)),segFN=segments_1,generation=1,filenames=[segments_1]
[junit4:junit4]   2> 14797 T250 oasc.SolrDeletionPolicy.updateCommits newest commit = 1[segments_1]
[junit4:junit4]   2> 14797 T250 oasc.CachingDirectoryFactory.close Releasing directory:/usr/home/hudson/hudson-slave/workspace/Lucene-Solr-Tests-trunk-java7/solr/build/solr-core/test/J0/./org.apache.solr.cloud.BasicDistributedZkTest-1356915299762/jetty3/index
[junit4:junit4]   2> 14798 T250 oasc.SolrCore.initWriters created xml: solr.XMLResponseWriter
[junit4:junit4]   2> 14800 T250 oasup.UpdateRequestProcessorChain.init inserting DistributedUpdateProcessorFactory into updateRequestProcessorChain "dedupe"
[junit4:junit4]   2> 14800 T250 oasup.UpdateRequestProcessorChain.init inserting DistributedUpdateProcessorFactory into updateRequestProcessorChain "dedupe-allfields"
[junit4:junit4]   2> 14800 T250 oasup.UpdateRequestProcessorChain.init inserting DistributedUpdateProcessorFactory into updateRequestProcessorChain "stored_sig"
[junit4:junit4]   2> 14801 T250 oasup.UpdateRequestProcessorChain.init inserting DistributedUpdateProcessorFactory into updateRequestProcessorChain "uniq-fields"
[junit4:junit4]   2> 14801 T250 oasup.UpdateRequestProcessorChain.init inserting DistributedUpdateProcessorFactory into updateRequestProcessorChain "distrib-dup-test-chain-implicit"
[junit4:junit4]   2> 14802 T250 oasc.RequestHandlers.initHandlersFromConfig adding lazy requestHandler: solr.ReplicationHandler
[junit4:junit4]   2> 14802 T250 oasc.RequestHandlers.initHandlersFromConfig created /replication: solr.ReplicationHandler
[junit4:junit4]   2> 14802 T250 oasc.RequestHandlers.initHandlersFromConfig created standard: solr.StandardRequestHandler
[junit4:junit4]   2> 14803 T250 oasc.RequestHandlers.initHandlersFromConfig created /get: solr.RealTimeGetHandler
[junit4:junit4]   2> 14803 T250 oasc.RequestHandlers.initHandlersFromConfig created dismax: solr.SearchHandler
[junit4:junit4]   2> 14804 T250 oasc.RequestHandlers.initHandlersFromConfig created mock: org.apache.solr.core.MockQuerySenderListenerReqHandler
[junit4:junit4]   2> 14804 T250 oasc.RequestHandlers.initHandlersFromConfig created /admin/: org.apache.solr.handler.admin.AdminHandlers
[junit4:junit4]   2> 14805 T250 oasc.RequestHandlers.initHandlersFromConfig created defaults: solr.StandardRequestHandler
[junit4:junit4]   2> 14805 T250 oasc.RequestHandlers.initHandlersFromConfig adding lazy requestHandler: solr.StandardRequestHandler
[junit4:junit4]   2> 14805 T250 oasc.RequestHandlers.initHandlersFromConfig created lazy: solr.StandardRequestHandler
[junit4:junit4]   2> 14806 T250 oasc.RequestHandlers.initHandlersFromConfig created /update: solr.UpdateRequestHandler
[junit4:junit4]   2> 14806 T250 oasc.RequestHandlers.initHandlersFromConfig created /terms: org.apache.solr.handler.component.SearchHandler
[junit4:junit4]   2> 14807 T250 oasc.RequestHandlers.initHandlersFromConfig created spellCheckCompRH: org.apache.solr.handler.component.SearchHandler
[junit4:junit4]   2> 14807 T250 oasc.RequestHandlers.initHandlersFromConfig created spellCheckCompRH_Direct: org.apache.solr.handler.component.SearchHandler
[junit4:junit4]   2> 14808 T250 oasc.RequestHandlers.initHandlersFromConfig created spellCheckWithWordbreak: org.apache.solr.handler.component.SearchHandler
[junit4:junit4]   2> 14808 T250 oasc.RequestHandlers.initHandlersFromConfig created spellCheckWithWordbreak_Direct: org.apache.solr.handler.component.SearchHandler
[junit4:junit4]   2> 14809 T250 oasc.RequestHandlers.initHandlersFromConfig created spellCheckCompRH1: org.apache.solr.handler.component.SearchHandler
[junit4:junit4]   2> 14809 T250 oasc.RequestHandlers.initHandlersFromConfig created mltrh: org.apache.solr.handler.component.SearchHandler
[junit4:junit4]   2> 14810 T250 oasc.RequestHandlers.initHandlersFromConfig created tvrh: org.apache.solr.handler.component.SearchHandler
[junit4:junit4]   2> 14810 T250 oasc.RequestHandlers.initHandlersFromConfig created /mlt: solr.MoreLikeThisHandler
[junit4:junit4]   2> 14810 T250 oasc.RequestHandlers.initHandlersFromConfig created /debug/dump: solr.DumpRequestHandler
[junit4:junit4]   2> 14819 T250 oashl.XMLLoader.init xsltCacheLifetimeSeconds=60
[junit4:junit4]   2> 14822 T250 oasc.SolrCore.initDeprecatedSupport WARNING solrconfig.xml uses deprecated <admin/gettableFiles>, Please update your config to use the ShowFileRequestHandler.
[junit4:junit4]   2> 14823 T250 oasc.SolrCore.initDeprecatedSupport WARNING adding ShowFileRequestHandler with hidden files: [SCHEMA.XML, OLD_SYNONYMS.TXT, STOPWORDS.TXT, PROTWORDS.TXT, OPEN-EXCHANGE-RATES.JSON, SYNONYMS.TXT, CURRENCY.XML, MAPPING-ISOLATIN1ACCENT.TXT]
[junit4:junit4]   2> 14825 T250 oasc.CachingDirectoryFactory.close Releasing directory:/usr/home/hudson/hudson-slave/workspace/Lucene-Solr-Tests-trunk-java7/solr/build/solr-core/test/J0/./org.apache.solr.cloud.BasicDistributedZkTest-1356915299762/jetty3
[junit4:junit4]   2> 14826 T250 oass.SolrIndexSearcher.<init> Opening Searcher@264ccd21 main
[junit4:junit4]   2> 14827 T250 oasu.CommitTracker.<init> Hard AutoCommit: disabled
[junit4:junit4]   2> 14828 T250 oasu.CommitTracker.<init> Soft AutoCommit: disabled
[junit4:junit4]   2> 14828 T250 oashc.SpellCheckComponent.inform Initializing spell checkers
[junit4:junit4]   2> 14834 T250 oass.DirectSolrSpellChecker.init init: {name=direct,classname=DirectSolrSpellChecker,field=lowerfilt,minQueryLength=3}
[junit4:junit4]   2> 14874 T251 oasc.SolrCore.registerSearcher [collection1] Registered new searcher Searcher@264ccd21 main{StandardDirectoryReader(segments_1:1)}
[junit4:junit4]   2> 14878 T250 oasc.ZkController.publish publishing core=collection1 state=down
[junit4:junit4]   2> 14879 T250 oasc.ZkController.publish numShards not found on descriptor - reading it from system property
[junit4:junit4]   2> 14983 T201 oascc.ZkStateReader.updateClusterState Updating cloud state from ZooKeeper... 
[junit4:junit4]   2> 14984 T201 oasc.Overseer$ClusterStateUpdater.updateState Update state numShards=2 message={
[junit4:junit4]   2> 	  "operation":"state",
[junit4:junit4]   2> 	  "numShards":"2",
[junit4:junit4]   2> 	  "shard":"shard2",
[junit4:junit4]   2> 	  "roles":null,
[junit4:junit4]   2> 	  "state":"active",
[junit4:junit4]   2> 	  "core":"collection1",
[junit4:junit4]   2> 	  "collection":"collection1",
[junit4:junit4]   2> 	  "node_name":"127.0.0.1:18713_j",
[junit4:junit4]   2> 	  "base_url":"http://127.0.0.1:18713/j"}
[junit4:junit4]   2> 14989 T201 oasc.Overseer$ClusterStateUpdater.updateState Update state numShards=2 message={
[junit4:junit4]   2> 	  "operation":"state",
[junit4:junit4]   2> 	  "numShards":"2",
[junit4:junit4]   2> 	  "shard":null,
[junit4:junit4]   2> 	  "roles":null,
[junit4:junit4]   2> 	  "state":"down",
[junit4:junit4]   2> 	  "core":"collection1",
[junit4:junit4]   2> 	  "collection":"collection1",
[junit4:junit4]   2> 	  "node_name":"127.0.0.1:18729_j",
[junit4:junit4]   2> 	  "base_url":"http://127.0.0.1:18729/j"}
[junit4:junit4]   2> 14990 T201 oasc.Overseer$ClusterStateUpdater.updateState Collection already exists with numShards=2
[junit4:junit4]   2> 14990 T201 oasc.Overseer$ClusterStateUpdater.updateState Assigning new node to shard shard=shard1
[junit4:junit4]   2> 15001 T200 oascc.ZkStateReader$2.process A cluster state change: WatchedEvent state:SyncConnected type:NodeDataChanged path:/clusterstate.json, has occurred - updating... (live nodes size: 4)
[junit4:junit4]   2> 15001 T219 oascc.ZkStateReader$2.process A cluster state change: WatchedEvent state:SyncConnected type:NodeDataChanged path:/clusterstate.json, has occurred - updating... (live nodes size: 4)
[junit4:junit4]   2> 15001 T206 oascc.ZkStateReader$2.process A cluster state change: WatchedEvent state:SyncConnected type:NodeDataChanged path:/clusterstate.json, has occurred - updating... (live nodes size: 4)
[junit4:junit4]   2> 15001 T249 oascc.ZkStateReader$2.process A cluster state change: WatchedEvent state:SyncConnected type:NodeDataChanged path:/clusterstate.json, has occurred - updating... (live nodes size: 4)
[junit4:junit4]   2> 15001 T234 oascc.ZkStateReader$2.process A cluster state change: WatchedEvent state:SyncConnected type:NodeDataChanged path:/clusterstate.json, has occurred - updating... (live nodes size: 4)
[junit4:junit4]   2> 15881 T250 oasc.CoreContainer.registerCore registering core: collection1
[junit4:junit4]   2> 15881 T250 oasc.ZkController.register Register replica - core:collection1 address:http://127.0.0.1:18729/j collection:collection1 shard:shard1
[junit4:junit4]   2> 15887 T250 oasc.ZkController.register We are http://127.0.0.1:18729/j/collection1/ and leader is http://127.0.0.1:18705/j/collection1/
[junit4:junit4]   2> 15887 T250 oasc.ZkController.register No LogReplay needed for core=collection1 baseURL=http://127.0.0.1:18729/j
[junit4:junit4]   2> 15888 T250 oasc.ZkController.checkRecovery Core needs to recover:collection1
[junit4:junit4]   2> 15888 T250 oasu.DefaultSolrCoreState.doRecovery Running recovery - first canceling any ongoing recovery
[junit4:junit4]   2> ASYNC  NEW_CORE C21 name=collection1 org.apache.solr.core.SolrCore@62b3d4ff url=http://127.0.0.1:18729/j/collection1 node=127.0.0.1:18729_j C21_STATE=coll:collection1 core:collection1 props:{shard=null, roles=null, state=down, core=collection1, collection=collection1, node_name=127.0.0.1:18729_j, base_url=http://127.0.0.1:18729/j}
[junit4:junit4]   2> 15895 T252 C21 P18729 oasc.RecoveryStrategy.run Starting recovery process.  core=collection1 recoveringAfterStartup=true
[junit4:junit4]   2> 15896 T250 oascc.ZkStateReader.updateClusterState Updating cloud state from ZooKeeper... 
[junit4:junit4]   2> 15896 T252 C21 P18729 oasc.RecoveryStrategy.doRecovery ###### startupVersions=[]
[junit4:junit4]   2> 15897 T252 C21 P18729 oasc.ZkController.publish publishing core=collection1 state=recovering
[junit4:junit4]   2> 15897 T252 C21 P18729 oasc.ZkController.publish numShards not found on descriptor - reading it from system property
[junit4:junit4]   2> 15898 T178 oass.SolrDispatchFilter.init user.dir=/usr/home/hudson/hudson-slave/workspace/Lucene-Solr-Tests-trunk-java7/solr/build/solr-core/test/J0
[junit4:junit4]   2> 15898 T178 oass.SolrDispatchFilter.init SolrDispatchFilter.init() done
[junit4:junit4]   2> 15899 T252 C21 P18729 oascsi.HttpClientUtil.createClient Creating new http client, config:maxConnections=128&maxConnectionsPerHost=32&followRedirects=false
[junit4:junit4]   2> 15899 T178 oascsi.HttpClientUtil.createClient Creating new http client, config:maxConnections=128&maxConnectionsPerHost=32&followRedirects=false
[junit4:junit4]   2> 16099 T178 oejs.Server.doStart jetty-8.1.8.v20121106
[junit4:junit4]   2> 16102 T178 oejs.AbstractConnector.doStart Started SocketConnector@127.0.0.1:18737
[junit4:junit4]   2> 16103 T178 oasc.SolrResourceLoader.locateSolrHome JNDI not configured for solr (NoInitialContextEx)
[junit4:junit4]   2> 16104 T178 oasc.SolrResourceLoader.locateSolrHome using system property solr.solr.home: /usr/home/hudson/hudson-slave/workspace/Lucene-Solr-Tests-trunk-java7/solr/build/solr-core/test/J0/./org.apache.solr.cloud.BasicDistributedZkTest-jetty4-1356915315678
[junit4:junit4]   2> 16104 T178 oasc.SolrResourceLoader.<init> new SolrResourceLoader for deduced Solr Home: '/usr/home/hudson/hudson-slave/workspace/Lucene-Solr-Tests-trunk-java7/solr/build/solr-core/test/J0/./org.apache.solr.cloud.BasicDistributedZkTest-jetty4-1356915315678/'
[junit4:junit4]   2> 16158 T178 oass.SolrDispatchFilter.init SolrDispatchFilter.init()
[junit4:junit4]   2> 16159 T178 oasc.SolrResourceLoader.locateSolrHome JNDI not configured for solr (NoInitialContextEx)
[junit4:junit4]   2> 16160 T178 oasc.SolrResourceLoader.locateSolrHome using system property solr.solr.home: /usr/home/hudson/hudson-slave/workspace/Lucene-Solr-Tests-trunk-java7/solr/build/solr-core/test/J0/./org.apache.solr.cloud.BasicDistributedZkTest-jetty4-1356915315678
[junit4:junit4]   2> 16160 T178 oasc.CoreContainer$Initializer.initialize looking for solr.xml: /usr/home/hudson/hudson-slave/workspace/Lucene-Solr-Tests-trunk-java7/solr/build/solr-core/test/J0/./org.apache.solr.cloud.BasicDistributedZkTest-jetty4-1356915315678/solr.xml
[junit4:junit4]   2> 16161 T178 oasc.CoreContainer.<init> New CoreContainer 1875616778
[junit4:junit4]   2> 16162 T178 oasc.CoreContainer.load Loading CoreContainer using Solr Home: '/usr/home/hudson/hudson-slave/workspace/Lucene-Solr-Tests-trunk-java7/solr/build/solr-core/test/J0/./org.apache.solr.cloud.BasicDistributedZkTest-jetty4-1356915315678/'
[junit4:junit4]   2> 16162 T178 oasc.SolrResourceLoader.<init> new SolrResourceLoader for directory: '/usr/home/hudson/hudson-slave/workspace/Lucene-Solr-Tests-trunk-java7/solr/build/solr-core/test/J0/./org.apache.solr.cloud.BasicDistributedZkTest-jetty4-1356915315678/'
[junit4:junit4]   2> 16193 T178 oashc.HttpShardHandlerFactory.getParameter Setting socketTimeout to: 30000
[junit4:junit4]   2> 16194 T178 oashc.HttpShardHandlerFactory.getParameter Setting urlScheme to: http://
[junit4:junit4]   2> 16194 T178 oashc.HttpShardHandlerFactory.getParameter Setting connTimeout to: 15000
[junit4:junit4]   2> 16195 T178 oashc.HttpShardHandlerFactory.getParameter Setting maxConnectionsPerHost to: 20
[junit4:junit4]   2> 16195 T178 oashc.HttpShardHandlerFactory.getParameter Setting corePoolSize to: 0
[junit4:junit4]   2> 16196 T178 oashc.HttpShardHandlerFactory.getParameter Setting maximumPoolSize to: 2147483647
[junit4:junit4]   2> 16197 T178 oashc.HttpShardHandlerFactory.getParameter Setting maxThreadIdleTime to: 5
[junit4:junit4]   2> 16197 T178 oashc.HttpShardHandlerFactory.getParameter Setting sizeOfQueue to: -1
[junit4:junit4]   2> 16198 T178 oashc.HttpShardHandlerFactory.getParameter Setting fairnessPolicy to: false
[junit4:junit4]   2> 16198 T178 oascsi.HttpClientUtil.createClient Creating new http client, config:maxConnectionsPerHost=20&maxConnections=10000&socketTimeout=30000&connTimeout=15000&retry=false
[junit4:junit4]   2> 16221 T178 oasc.CoreContainer.load Registering Log Listener
[junit4:junit4]   2> 16242 T178 oasc.CoreContainer.initZooKeeper Zookeeper client=127.0.0.1:18695/solr
[junit4:junit4]   2> 16242 T178 oasc.ZkController.checkChrootPath zkHost includes chroot
[junit4:junit4]   2> 16243 T178 oaz.ZooKeeper.<init> Initiating client connection, connectString=127.0.0.1:18695 sessionTimeout=60000 watcher=org.apache.solr.common.cloud.ConnectionManager@1be0c069
[junit4:junit4]   2> 16244 T178 oascc.ConnectionManager.waitForConnected Waiting for client to connect to ZooKeeper
[junit4:junit4]   2> 16245 T262 oaz.ClientCnxn$SendThread.logStartConnect Opening socket connection to server localhost/127.0.0.1:18695. Will not attempt to authenticate using SASL (access denied ("javax.security.auth.AuthPermission" "getLoginConfiguration"))
[junit4:junit4]   2> 16246 T262 oaz.ClientCnxn$SendThread.primeConnection Socket connection established to localhost/127.0.0.1:18695, initiating session
[junit4:junit4]   2> 16246 T180 oazs.NIOServerCnxnFactory.run Accepted socket connection from /140.211.11.196:18738
[junit4:junit4]   2> 16247 T180 oazs.ZooKeeperServer.processConnectRequest Client attempting to establish new session at /140.211.11.196:18738
[junit4:junit4]   2> 16249 T182 oazs.ZooKeeperServer.finishSessionInit Established session 0x13bee7456a6000b with negotiated timeout 20000 for client /140.211.11.196:18738
[junit4:junit4]   2> 16250 T262 oaz.ClientCnxn$SendThread.onConnected Session establishment complete on server localhost/127.0.0.1:18695, sessionid = 0x13bee7456a6000b, negotiated timeout = 20000
[junit4:junit4]   2> 16250 T263 oascc.ConnectionManager.process Watcher org.apache.solr.common.cloud.ConnectionManager@1be0c069 name:ZooKeeperConnection Watcher:127.0.0.1:18695 got event WatchedEvent state:SyncConnected type:None path:null path:null type:None
[junit4:junit4]   2> 16251 T178 oascc.ConnectionManager.waitForConnected Client is connected to ZooKeeper
[junit4:junit4]   2> 16253 T183 oazs.PrepRequestProcessor.pRequest2Txn Processed session termination for sessionid: 0x13bee7456a6000b
[junit4:junit4]   2> 16254 T263 oaz.ClientCnxn$EventThread.run EventThread shut down
[junit4:junit4]   2> 16254 T180 oazs.NIOServerCnxn.closeSock Closed socket connection for client /140.211.11.196:18738 which had sessionid 0x13bee7456a6000b
[junit4:junit4]   2> 16254 T178 oaz.ZooKeeper.close Session: 0x13bee7456a6000b closed
[junit4:junit4]   2> 16255 T178 oascsi.HttpClientUtil.createClient Creating new http client, config:maxConnections=500&maxConnectionsPerHost=16&socketTimeout=15000&connTimeout=30000
[junit4:junit4]   2> 16267 T178 oaz.ZooKeeper.<init> Initiating client connection, connectString=127.0.0.1:18695/solr sessionTimeout=30000 watcher=org.apache.solr.common.cloud.ConnectionManager@32466b3b
[junit4:junit4]   2> 16269 T178 oascc.ConnectionManager.waitForConnected Waiting for client to connect to ZooKeeper
[junit4:junit4]   2> 16269 T264 oaz.ClientCnxn$SendThread.logStartConnect Opening socket connection to server localhost/127.0.0.1:18695. Will not attempt to authenticate using SASL (access denied ("javax.security.auth.AuthPermission" "getLoginConfiguration"))
[junit4:junit4]   2> 16270 T264 oaz.ClientCnxn$SendThread.primeConnection Socket connection established to localhost/127.0.0.1:18695, initiating session
[junit4:junit4]   2> 16270 T180 oazs.NIOServerCnxnFactory.run Accepted socket connection from /140.211.11.196:18739
[junit4:junit4]   2> 16271 T180 oazs.ZooKeeperServer.processConnectRequest Client attempting to establish new session at /140.211.11.196:18739
[junit4:junit4]   2> 16272 T182 oazs.ZooKeeperServer.finishSessionInit Established session 0x13bee7456a6000c with negotiated timeout 20000 for client /140.211.11.196:18739
[junit4:junit4]   2> 16272 T264 oaz.ClientCnxn$SendThread.onConnected Session establishment complete on server localhost/127.0.0.1:18695, sessionid = 0x13bee7456a6000c, negotiated timeout = 20000
[junit4:junit4]   2> 16273 T265 oascc.ConnectionManager.process Watcher org.apache.solr.common.cloud.ConnectionManager@32466b3b name:ZooKeeperConnection Watcher:127.0.0.1:18695/solr got event WatchedEvent state:SyncConnected type:None path:null path:null type:None
[junit4:junit4]   2> 16273 T178 oascc.ConnectionManager.waitForConnected Client is connected to ZooKeeper
[junit4:junit4]   2> 16275 T183 oazs.PrepRequestProcessor.pRequest Got user-level KeeperException when processing sessionid:0x13bee7456a6000c type:create cxid:0x1 zxid:0xa1 txntype:-1 reqpath:n/a Error Path:/solr/overseer Error:KeeperErrorCode = NodeExists for /solr/overseer
[junit4:junit4]   2> 16277 T183 oazs.PrepRequestProcessor.pRequest Got user-level KeeperException when processing sessionid:0x13bee7456a6000c type:create cxid:0x2 zxid:0xa2 txntype:-1 reqpath:n/a Error Path:/solr/overseer Error:KeeperErrorCode = NodeExists for /solr/overseer
[junit4:junit4]   2> 16279 T178 oasc.ZkController.createEphemeralLiveNode Register node as live in ZooKeeper:/live_nodes/127.0.0.1:18737_j
[junit4:junit4]   2> 16280 T183 oazs.PrepRequestProcessor.pRequest Got user-level KeeperException when processing sessionid:0x13bee7456a6000c type:delete cxid:0x4 zxid:0xa3 txntype:-1 reqpath:n/a Error Path:/solr/live_nodes/127.0.0.1:18737_j Error:KeeperErrorCode = NoNode for /solr/live_nodes/127.0.0.1:18737_j
[junit4:junit4]   2> 16287 T178 oascc.SolrZkClient.makePath makePath: /live_nodes/127.0.0.1:18737_j
[junit4:junit4]   2> 16290 T249 oascc.ZkStateReader$2.process A cluster state change: WatchedEvent state:SyncConnected type:NodeChildrenChanged path:/live_nodes, has occurred - updating... (live nodes size: 4)
[junit4:junit4]   2> 16290 T206 oascc.ZkStateReader$2.process A cluster state change: WatchedEvent state:SyncConnected type:NodeChildrenChanged path:/live_nodes, has occurred - updating... (live nodes size: 4)
[junit4:junit4]   2> 16290 T200 oascc.ZkStateReader$2.process A cluster state change: WatchedEvent state:SyncConnected type:NodeChildrenChanged path:/live_nodes, has occurred - updating... (live nodes size: 4)
[junit4:junit4]   2> 16290 T219 oascc.ZkStateReader$2.process A cluster state change: WatchedEvent state:SyncConnected type:NodeChildrenChanged path:/live_nodes, has occurred - updating... (live nodes size: 4)
[junit4:junit4]   2> 16291 T234 oascc.ZkStateReader$3.process Updating live nodes... (5)
[junit4:junit4]   2> 16292 T234 oascc.ZkStateReader$2.process A cluster state change: WatchedEvent state:SyncConnected type:NodeChildrenChanged path:/live_nodes, has occurred - updating... (live nodes size: 5)
[junit4:junit4]   2> 16294 T206 oascc.ZkStateReader$3.process Updating live nodes... (5)
[junit4:junit4]   2> 16294 T200 oascc.ZkStateReader$3.process Updating live nodes... (5)
[junit4:junit4]   2> 16294 T249 oascc.ZkStateReader$3.process Updating live nodes... (5)
[junit4:junit4]   2> 16304 T219 oascc.ZkStateReader$3.process Updating live nodes... (5)
[junit4:junit4]   2> 16306 T178 oascc.ZkStateReader.createClusterStateWatchersAndUpdate Updating cluster state from ZooKeeper... 
[junit4:junit4]   2> 16315 T266 oasc.CoreContainer.create Creating SolrCore 'collection1' using instanceDir: /usr/home/hudson/hudson-slave/workspace/Lucene-Solr-Tests-trunk-java7/solr/build/solr-core/test/J0/./org.apache.solr.cloud.BasicDistributedZkTest-jetty4-1356915315678/collection1
[junit4:junit4]   2> 16315 T266 oasc.ZkController.createCollectionZkNode Check for collection zkNode:collection1
[junit4:junit4]   2> 16317 T266 oasc.ZkController.createCollectionZkNode Collection zkNode exists
[junit4:junit4]   2> 16317 T266 oasc.ZkController.readConfigName Load collection config from:/collections/collection1
[junit4:junit4]   2> 16319 T266 oasc.SolrResourceLoader.<init> new SolrResourceLoader for directory: '/usr/home/hudson/hudson-slave/workspace/Lucene-Solr-Tests-trunk-java7/solr/build/solr-core/test/J0/./org.apache.solr.cloud.BasicDistributedZkTest-jetty4-1356915315678/collection1/'
[junit4:junit4]   2> 16320 T266 oasc.SolrResourceLoader.replaceClassLoader Adding 'file:/usr/home/hudson/hudson-slave/workspace/Lucene-Solr-Tests-trunk-java7/solr/build/solr-core/test/J0/org.apache.solr.cloud.BasicDistributedZkTest-jetty4-1356915315678/collection1/lib/classes/' to classloader
[junit4:junit4]   2> 16321 T266 oasc.SolrResourceLoader.replaceClassLoader Adding 'file:/usr/home/hudson/hudson-slave/workspace/Lucene-Solr-Tests-trunk-java7/solr/build/solr-core/test/J0/org.apache.solr.cloud.BasicDistributedZkTest-jetty4-1356915315678/collection1/lib/README' to classloader
[junit4:junit4]   2> 16376 T266 oasc.SolrConfig.<init> Using Lucene MatchVersion: LUCENE_50
[junit4:junit4]   2> 16450 T266 oasc.SolrConfig.<init> Loaded SolrConfig: solrconfig.xml
[junit4:junit4]   2> 16510 T201 oascc.ZkStateReader.updateClusterState Updating cloud state from ZooKeeper... 
[junit4:junit4]   2> 16511 T201 oasc.Overseer$ClusterStateUpdater.updateState Update state numShards=2 message={
[junit4:junit4]   2> 	  "operation":"state",
[junit4:junit4]   2> 	  "numShards":"2",
[junit4:junit4]   2> 	  "shard":"shard1",
[junit4:junit4]   2> 	  "roles":null,
[junit4:junit4]   2> 	  "state":"recovering",
[junit4:junit4]   2> 	  "core":"collection1",
[junit4:junit4]   2> 	  "collection":"collection1",
[junit4:junit4]   2> 	  "node_name":"127.0.0.1:18729_j",
[junit4:junit4]   2> 	  "base_url":"http://127.0.0.1:18729/j"}
[junit4:junit4]   2> 16524 T249 oascc.ZkStateReader$2.process A cluster state change: WatchedEvent state:SyncConnected type:NodeDataChanged path:/clusterstate.json, has occurred - updating... (live nodes size: 5)
[junit4:junit4]   2> 16525 T206 oascc.ZkStateReader$2.process A cluster state change: WatchedEvent state:SyncConnected type:NodeDataChanged path:/clusterstate.json, has occurred - updating... (live nodes size: 5)
[junit4:junit4]   2> 16524 T200 oascc.ZkStateReader$2.process A cluster state change: WatchedEvent state:SyncConnected type:NodeDataChanged path:/clusterstate.json, has occurred - updating... (live nodes size: 5)
[junit4:junit4]   2> 16524 T234 oascc.ZkStateReader$2.process A cluster state change: WatchedEvent state:SyncConnected type:NodeDataChanged path:/clusterstate.json, has occurred - updating... (live nodes size: 5)
[junit4:junit4]   2> 16524 T219 oascc.ZkStateReader$2.process A cluster state change: WatchedEvent state:SyncConnected type:NodeDataChanged path:/clusterstate.json, has occurred - updating... (live nodes size: 5)
[junit4:junit4]   2> 16551 T266 oass.IndexSchema.readSchema Reading Solr Schema
[junit4:junit4]   2> 16551 T265 oascc.ZkStateReader$2.process A cluster state change: WatchedEvent state:SyncConnected type:NodeDataChanged path:/clusterstate.json, has occurred - updating... (live nodes size: 5)
[junit4:junit4]   2> 16559 T266 oass.IndexSchema.readSchema Schema name=test
[junit4:junit4]   2> 17216 T266 oass.OpenExchangeRatesOrgProvider.init Initialized with rates=open-exchange-rates.json, refreshInterval=1440.
[junit4:junit4]   2> 17228 T266 oass.IndexSchema.readSchema default search field in schema is text
[junit4:junit4]   2> 17232 T266 oass.IndexSchema.readSchema unique key field: id
[junit4:junit4]   2> 17257 T266 oass.FileExchangeRateProvider.reload Reloading exchange rates from file currency.xml
[junit4:junit4]   2> 17262 T266 oass.FileExchangeRateProvider.reload Reloading exchange rates from file currency.xml
[junit4:junit4]   2> 17268 T266 oass.OpenExchangeRatesOrgProvider.reload Reloading exchange rates from open-exchange-rates.json
[junit4:junit4]   2> 17270 T266 oass.OpenExchangeRatesOrgProvider.reload Reloading exchange rates from open-exchange-rates.json
[junit4:junit4]   2> 17272 T266 oasc.SolrCore.<init> [collection1] Opening new SolrCore at /usr/home/hudson/hudson-slave/workspace/Lucene-Solr-Tests-trunk-java7/solr/build/solr-core/test/J0/./org.apache.solr.cloud.BasicDistributedZkTest-jetty4-1356915315678/collection1/, dataDir=./org.apache.solr.cloud.BasicDistributedZkTest-1356915299762/jetty4/
[junit4:junit4]   2> 17273 T266 oasc.JmxMonitoredMap.<init> JMX monitoring is enabled. Adding Solr mbeans to JMX Server: com.sun.jmx.mbeanserver.JmxMBeanServer@1fb77bbb
[junit4:junit4]   2> 17273 T266 oasc.SolrCore.initDirectoryFactory solr.NRTCachingDirectoryFactory
[junit4:junit4]   2> 17274 T266 oasc.CachingDirectoryFactory.get return new directory for /usr/home/hudson/hudson-slave/workspace/Lucene-Solr-Tests-trunk-java7/solr/build/solr-core/test/J0/./org.apache.solr.cloud.BasicDistributedZkTest-1356915299762/jetty4 forceNew:false
[junit4:junit4]   2> 17275 T266 oasc.CachingDirectoryFactory.close Releasing directory:/usr/home/hudson/hudson-slave/workspace/Lucene-Solr-Tests-trunk-java7/solr/build/solr-core/test/J0/./org.apache.solr.cloud.BasicDistributedZkTest-1356915299762/jetty4
[junit4:junit4]   2> 17275 T266 oasc.SolrCore.getNewIndexDir New index directory detected: old=null new=./org.apache.solr.cloud.BasicDistributedZkTest-1356915299762/jetty4/index/
[junit4:junit4]   2> 17276 T266 oasc.SolrCore.initIndex WARNING [collection1] Solr index directory './org.apache.solr.cloud.BasicDistributedZkTest-1356915299762/jetty4/index' doesn't exist. Creating new index...
[junit4:junit4]   2> 17277 T266 oasc.CachingDirectoryFactory.get return new directory for /usr/home/hudson/hudson-slave/workspace/Lucene-Solr-Tests-trunk-java7/solr/build/solr-core/test/J0/./org.apache.solr.cloud.BasicDistributedZkTest-1356915299762/jetty4/index forceNew:false
[junit4:junit4]   2> 17308 T266 oasc.SolrDeletionPolicy.onCommit SolrDeletionPolicy.onCommit: commits:num=1
[junit4:junit4]   2> 		commit{dir=RateLimitedDirectoryWrapper(NRTCachingDirectory(org.apache.lucene.store.NIOFSDirectory@/usr/home/hudson/hudson-slave/workspace/Lucene-Solr-Tests-trunk-java7/solr/build/solr-core/test/J0/org.apache.solr.cloud.BasicDistributedZkTest-1356915299762/jetty4/index lockFactory=org.apache.lucene.store.NativeFSLockFactory@547f7d2d; maxCacheMB=48.0 maxMergeSizeMB=4.0)),segFN=segments_1,generation=1,filenames=[segments_1]
[junit4:junit4]   2> 17309 T266 oasc.SolrDeletionPolicy.updateCommits newest commit = 1[segments_1]
[junit4:junit4]   2> 17310 T266 oasc.CachingDirectoryFactory.close Releasing directory:/usr/home/hudson/hudson-slave/workspace/Lucene-Solr-Tests-trunk-java7/solr/build/solr-core/test/J0/./org.apache.solr.cloud.BasicDistributedZkTest-1356915299762/jetty4/index
[junit4:junit4]   2> 17310 T266 oasc.SolrCore.initWriters created xml: solr.XMLResponseWriter
[junit4:junit4]   2> 17313 T266 oasup.UpdateRequestProcessorChain.init inserting DistributedUpdateProcessorFactory into updateRequestProcessorChain "dedupe"
[junit4:junit4]   2> 17313 T266 oasup.UpdateRequestProcessorChain.init inserting DistributedUpdateProcessorFactory into updateRequestProcessorChain "dedupe-allfields"
[junit4:junit4]   2> 17314 T266 oasup.UpdateRequestProcessorChain.init inserting DistributedUpdateProcessorFactory into updateRequestProcessorChain "stored_sig"
[junit4:junit4]   2> 17314 T266 oasup.UpdateRequestProcessorChain.init inserting DistributedUpdateProcessorFactory into updateRequestProcessorChain "uniq-fields"
[junit4:junit4]   2> 17315 T266 oasup.UpdateRequestProcessorChain.init inserting DistributedUpdateProcessorFactory into updateRequestProcessorChain "distrib-dup-test-chain-implicit"
[junit4:junit4]   2> 17316 T266 oasc.RequestHandlers.initHandlersFromConfig adding lazy requestHandler: solr.ReplicationHandler
[junit4:junit4]   2> 17316 T266 oasc.RequestHandlers.initHandlersFromConfig created /replication: solr.ReplicationHandler
[junit4:junit4]   2> 17317 T266 oasc.RequestHandlers.initHandlersFromConfig created standard: solr.StandardRequestHandler
[junit4:junit4]   2> 17317 T266 oasc.RequestHandlers.initHandlersFromConfig created /get: solr.RealTimeGetHandler
[junit4:junit4]   2> 17318 T266 oasc.RequestHandlers.initHandlersFromConfig created dismax: solr.SearchHandler
[junit4:junit4]   2> 17319 T266 oasc.RequestHandlers.initHandlersFromConfig created mock: org.apache.solr.core.MockQuerySenderListenerReqHandler
[junit4:junit4]   2> 17319 T266 oasc.RequestHandlers.initHandlersFromConfig created /admin/: org.apache.solr.handler.admin.AdminHandlers
[junit4:junit4]   2> 17320 T266 oasc.RequestHandlers.initHandlersFromConfig created defaults: solr.StandardRequestHandler
[junit4:junit4]   2> 17320 T266 oasc.RequestHandlers.initHandlersFromConfig adding lazy requestHandler: solr.StandardRequestHandler
[junit4:junit4]   2> 17321 T266 oasc.RequestHandlers.initHandlersFromConfig created lazy: solr.StandardRequestHandler
[junit4:junit4]   2> 17321 T266 oasc.RequestHandlers.initHandlersFromConfig created /update: solr.UpdateRequestHandler
[junit4:junit4]   2> 17322 T266 oasc.RequestHandlers.initHandlersFromConfig created /terms: org.apache.solr.handler.component.SearchHandler
[junit4:junit4]   2> 17323 T266 oasc.RequestHandlers.initHandlersFromConfig created spellCheckCompRH: org.apache.solr.handler.component.SearchHandler
[junit4:junit4]   2> 17323 T266 oasc.RequestHandlers.initHandlersFromConfig created spellCheckCompRH_Direct: org.apache.solr.handler.component.SearchHandler
[junit4:junit4]   2> 17324 T266 oasc.RequestHandlers.initHandlersFromConfig created spellCheckWithWordbreak: org.apache.solr.handler.component.SearchHandler
[junit4:junit4]   2> 17325 T266 oasc.RequestHandlers.initHandlersFromConfig created spellCheckWithWordbreak_Direct: org.apache.solr.handler.component.SearchHandler
[junit4:junit4]   2> 17325 T266 oasc.RequestHandlers.initHandlersFromConfig created spellCheckCompRH1: org.apache.solr.handler.component.SearchHandler
[junit4:junit4]   2> 17326 T266 oasc.RequestHandlers.initHandlersFromConfig created mltrh: org.apache.solr.handler.component.SearchHandler
[junit4:junit4]   2> 17327 T266 oasc.RequestHandlers.initHandlersFromConfig created tvrh: org.apache.solr.handler.component.SearchHandler
[junit4:junit4]   2> 17327 T266 oasc.RequestHandlers.initHandlersFromConfig created /mlt: solr.MoreLikeThisHandler
[junit4:junit4]   2> 17328 T266 oasc.RequestHandlers.initHandlersFromConfig created /debug/dump: solr.DumpRequestHandler
[junit4:junit4]   2> 17340 T266 oashl.XMLLoader.init xsltCacheLifetimeSeconds=60
[junit4:junit4]   2> 17344 T266 oasc.SolrCore.initDeprecatedSupport WARNING solrconfig.xml uses deprecated <admin/gettableFiles>, Please update your config to use the ShowFileRequestHandler.
[junit4:junit4]   2> 17346 T266 oasc.SolrCore.initDeprecatedSupport WARNING adding ShowFileRequestHandler with hidden files: [SCHEMA.XML, OLD_SYNONYMS.TXT, STOPWORDS.TXT, PROTWORDS.TXT, OPEN-EXCHANGE-RATES.JSON, SYNONYMS.TXT, CURRENCY.XML, MAPPING-ISOLATIN1ACCENT.TXT]
[junit4:junit4]   2> 17349 T266 oasc.CachingDirectoryFactory.close Releasing directory:/usr/home/hudson/hudson-slave/workspace/Lucene-Solr-Tests-trunk-java7/solr/build/solr-core/test/J0/./org.apache.solr.cloud.BasicDistributedZkTest-1356915299762/jetty4
[junit4:junit4]   2> 17351 T266 oass.SolrIndexSearcher.<init> Opening Searcher@59c35536 main
[junit4:junit4]   2> 17352 T266 oasu.CommitTracker.<init> Hard AutoCommit: disabled
[junit4:junit4]   2> 17352 T266 oasu.CommitTracker.<init> Soft AutoCommit: disabled
[junit4:junit4]   2> 17353 T266 oashc.SpellCheckComponent.inform Initializing spell checkers
[junit4:junit4]   2> 17360 T266 oass.DirectSolrSpellChecker.init init: {name=direct,classname=DirectSolrSpellChecker,field=lowerfilt,minQueryLength=3}
[junit4:junit4]   2> 17415 T267 oasc.SolrCore.registerSearcher [collection1] Registered new searcher Searcher@59c35536 main{StandardDirectoryReader(segments_1:1)}
[junit4:junit4]   2> 17422 T266 oasc.ZkController.publish publishing core=collection1 state=down
[junit4:junit4]   2> 17422 T266 oasc.ZkController.publish numShards not found on descriptor - reading it from system property
[junit4:junit4]   2> 18034 T201 oascc.ZkStateReader.updateClusterState Updating cloud state from ZooKeeper... 
[junit4:junit4]   2> 18036 T201 oasc.Overseer$ClusterStateUpdater.updateState Update state numShards=2 message={
[junit4:junit4]   2> 	  "operation":"state",
[junit4:junit4]   2> 	  "numShards":"2",
[junit4:junit4]   2> 	  "shard":null,
[junit4:junit4]   2> 	  "roles":null,
[junit4:junit4]   2> 	  "state":"down",
[junit4:junit4]   2> 	  "core":"collection1",
[junit4:junit4]   2> 	  "collection":"collection1",
[junit4:junit4]   2> 	  "node_name":"127.0.0.1:18737_j",
[junit4:junit4]   2> 	  "base_url":"http://127.0.0.1:18737/j"}
[junit4:junit4]   2> 18036 T201 oasc.Overseer$ClusterStateUpdater.updateState Collection already exists with numShards=2
[junit4:junit4]   2> 18036 T201 oasc.Overseer$ClusterStateUpdater.updateState Assigning new node to shard shard=shard2
[junit4:junit4]   2> 18193 T234 oascc.ZkStateReader$2.process A cluster state change: WatchedEvent state:SyncConnected type:NodeDataChanged path:/clusterstate.json, has occurred - updating... (live nodes size: 5)
[junit4:junit4]   2> 18193 T200 oascc.ZkStateReader$2.process A cluster state change: WatchedEvent state:SyncConnected type:NodeDataChanged path:/clusterstate.json, has occurred - updating... (live nodes size: 5)
[junit4:junit4]   2> 18193 T249 oascc.ZkStateReader$2.process A cluster state change: WatchedEvent state:SyncConnected type:NodeDataChanged path:/clusterstate.json, has occurred - updating... (live nodes size: 5)
[junit4:junit4]   2> 18193 T265 oascc.ZkStateReader$2.process A cluster state change: WatchedEvent state:SyncConnected type:NodeDataChanged path:/clusterstate.json, has occurred - updating... (live nodes size: 5)
[junit4:junit4]   2> 18193 T206 oascc.ZkStateReader$2.process A cluster state change: WatchedEvent state:SyncConnected type:NodeDataChanged path:/clusterstate.json, has occurred - updating... (live nodes size: 5)
[junit4:junit4]   2> 18193 T219 oascc.ZkStateReader$2.process A cluster state change: WatchedEvent state:SyncConnected type:NodeDataChanged path:/clusterstate.json, has occurred - updating... (live nodes size: 5)
[junit4:junit4]   2> 18425 T266 oasc.CoreContainer.registerCore registering core: collection1
[junit4:junit4]   2> 18425 T266 oasc.ZkController.register Register replica - core:collection1 address:http://127.0.0.1:18737/j collection:collection1 shard:shard2
[junit4:junit4]   2> 18434 T266 oasc.ZkController.register We are http://127.0.0.1:18737/j/collection1/ and leader is http://127.0.0.1:18713/j/collection1/
[junit4:junit4]   2> 18434 T266 oasc.ZkController.register No LogReplay needed for core=collection1 baseURL=http://127.0.0.1:18737/j
[junit4:junit4]   2> 18434 T266 oasc.ZkController.checkRecovery Core needs to recover:collection1
[junit4:junit4]   2> 18435 T266 oasu.DefaultSolrCoreState.doRecovery Running recovery - first canceling any ongoing recovery
[junit4:junit4]   2> ASYNC  NEW_CORE C22 name=collection1 org.apache.solr.core.SolrCore@483af9f5 url=http://127.0.0.1:18737/j/collection1 node=127.0.0.1:18737_j C22_STATE=coll:collection1 core:collection1 props:{shard=null, roles=null, state=down, core=collection1, collection=collection1, node_name=127.0.0.1:18737_j, base_url=http://127.0.0.1:18737/j}
[junit4:junit4]   2> 18436 T268 C22 P18737 oasc.RecoveryStrategy.run Starting recovery process.  core=collection1 recoveringAfterStartup=true
[junit4:junit4]   2> 18436 T268 C22 P18737 oasc.RecoveryStrategy.doRecovery ###### startupVersions=[]
[junit4:junit4]   2> 18436 T266 oascc.ZkStateReader.updateClusterState Updating cloud state from ZooKeeper... 
[junit4:junit4]   2> 18437 T268 C22 P18737 oasc.ZkController.publish publishing core=collection1 state=recovering
[junit4:junit4]   2> 18437 T268 C22 P18737 oasc.ZkController.publish numShards not found on descriptor - reading it from system property
[junit4:junit4]   2> 18438 T178 oass.SolrDispatchFilter.init user.dir=/usr/home/hudson/hudson-slave/workspace/Lucene-Solr-Tests-trunk-java7/solr/build/solr-core/test/J0
[junit4:junit4]   2> 18439 T178 oass.SolrDispatchFilter.init SolrDispatchFilter.init() done
[junit4:junit4]   2> 18439 T268 C22 P18737 oascsi.HttpClientUtil.createClient Creating new http client, config:maxConnections=128&maxConnectionsPerHost=32&followRedirects=false
[junit4:junit4]   2> 18440 T178 oascsi.HttpClientUtil.createClient Creating new http client, config:maxConnections=128&maxConnectionsPerHost=32&followRedirects=false
[junit4:junit4]   2> 18464 T178 oascc.ZkStateReader.updateClusterState Updating cloud state from ZooKeeper... 
[junit4:junit4]   2> 18467 T178 oasc.AbstractDistribZkTestBase.waitForRecoveriesToFinish Wait for recoveries to finish - collection: collection1 failOnTimeout:true timeout (sec):230
[junit4:junit4]   2> 18468 T178 oascc.ZkStateReader.updateClusterState Updating cloud state from ZooKeeper... 
[junit4:junit4]   2>  C21_STATE=coll:collection1 core:collection1 props:{shard=shard1, roles=null, state=recovering, core=collection1, collection=collection1, node_name=127.0.0.1:18729_j, base_url=http://127.0.0.1:18729/j}
[junit4:junit4]   2> 18947 T252 C21 P18729 oasc.RecoveryStrategy.doRecovery Attempting to PeerSync from http://127.0.0.1:18705/j/collection1/ core=collection1 - recoveringAfterStartup=true
[junit4:junit4]   2> 18957 T252 C21 P18729 oascsi.HttpClientUtil.createClient Creating new http client, config:maxConnectionsPerHost=20&maxConnections=10000&connTimeout=30000&socketTimeout=30000&retry=false
[junit4:junit4]   2> 18975 T252 C21 P18729 oasu.PeerSync.sync PeerSync: core=collection1 url=http://127.0.0.1:18729/j START replicas=[http://127.0.0.1:18705/j/collection1/] nUpdates=100
[junit4:junit4]   2> 18976 T252 C21 P18729 oasu.PeerSync.sync WARNING no frame of reference to tell of we've missed updates
[junit4:junit4]   2> 18977 T252 C21 P18729 oasc.RecoveryStrategy.doRecovery PeerSync Recovery was not successful - trying replication. core=collection1
[junit4:junit4]   2> 18978 T252 C21 P18729 oasc.RecoveryStrategy.doRecovery Starting Replication Recovery. core=collection1
[junit4:junit4]   2> 18978 T252 C21 P18729 oasc.RecoveryStrategy.doRecovery Begin buffering updates. core=collection1
[junit4:junit4]   2> 18979 T252 C21 P18729 oasu.UpdateLog.bufferUpdates Starting to buffer updates. FSUpdateLog{state=ACTIVE, tlog=null}
[junit4:junit4]   2> 18979 T252 C21 P18729 oasc.RecoveryStrategy.replicate Attempting to replicate from http://127.0.0.1:18705/j/collection1/. core=collection1
[junit4:junit4]   2> 18979 T252 C21 P18729 oascsi.HttpClientUtil.createClient Creating new http client, config:maxConnections=128&maxConnectionsPerHost=32&followRedirects=false
[junit4:junit4]   2> ASYNC  NEW_CORE C23 name=collection1 org.apache.solr.core.SolrCore@7efcc8f0 url=http://127.0.0.1:18705/j/collection1 node=127.0.0.1:18705_j C23_STATE=coll:collection1 core:collection1 props:{shard=shard1, roles=null, state=active, core=collection1, collection=collection1, node_name=127.0.0.1:18705_j, base_url=http://127.0.0.1:18705/j, leader=true}
[junit4:junit4]   2> 18988 T210 C23 P18705 REQ /get {distrib=false&qt=/get&wt=javabin&version=2&getVersions=100} status=0 QTime=0 
[junit4:junit4]   2> 19018 T211 C23 P18705 oasu.DirectUpdateHandler2.commit start commit{flags=0,_version_=0,optimize=false,openSearcher=false,waitSearcher=true,expungeDeletes=false,softCommit=false}
[junit4:junit4]   2> 19019 T211 C23 P18705 oasc.CachingDirectoryFactory.close Releasing directory:/usr/home/hudson/hudson-slave/workspace/Lucene-Solr-Tests-trunk-java7/solr/build/solr-core/test/J0/./org.apache.solr.cloud.BasicDistributedZkTest-1356915299762/jetty1
[junit4:junit4]   2> 19026 T211 C23 P18705 oasc.SolrDeletionPolicy.onInit SolrDeletionPolicy.onInit: commits:num=1
[junit4:junit4]   2> 		commit{dir=RateLimitedDirectoryWrapper(NRTCachingDirectory(org.apache.lucene.store.NIOFSDirectory@/usr/home/hudson/hudson-slave/workspace/Lucene-Solr-Tests-trunk-java7/solr/build/solr-core/test/J0/org.apache.solr.cloud.BasicDistributedZkTest-1356915299762/jetty1/index lockFactory=org.apache.lucene.store.NativeFSLockFactory@16c4df4b; maxCacheMB=48.0 maxMergeSizeMB=4.0)),segFN=segments_1,generation=1,filenames=[segments_1]
[junit4:junit4]   2> 19027 T211 C23 P18705 oasc.SolrDeletionPolicy.updateCommits newest commit = 1[segments_1]
[junit4:junit4]   2> 19033 T211 C23 P18705 oasc.SolrDeletionPolicy.onCommit SolrDeletionPolicy.onCommit: commits:num=2
[junit4:junit4]   2> 		commit{dir=RateLimitedDirectoryWrapper(NRTCachingDirectory(org.apache.lucene.store.NIOFSDirectory@/usr/home/hudson/hudson-slave/workspace/Lucene-Solr-Tests-trunk-java7/solr/build/solr-core/test/J0/org.apache.solr.cloud.BasicDistributedZkTest-1356915299762/jetty1/index lockFactory=org.apache.lucene.store.NativeFSLockFactory@16c4df4b; maxCacheMB=48.0 maxMergeSizeMB=4.0)),segFN=segments_1,generation=1,filenames=[segments_1]
[junit4:junit4]   2> 		commit{dir=RateLimitedDirectoryWrapper(NRTCachingDirectory(org.apache.lucene.store.NIOFSDirectory@/usr/home/hudson/hudson-slave/workspace/Lucene-Solr-Tests-trunk-java7/solr/build/solr-core/test/J0/org.apache.solr.cloud.BasicDistributedZkTest-1356915299762/jetty1/index lockFactory=org.apache.lucene.store.NativeFSLockFactory@16c4df4b; maxCacheMB=48.0 maxMergeSizeMB=4.0)),segFN=segments_2,generation=2,filenames=[segments_2]
[junit4:junit4]   2> 19034 T211 C23 P18705 oasc.SolrDeletionPolicy.updateCommits newest commit = 2[segments_2]
[junit4:junit4]   2> 19035 T211 C23 P18705 oasc.CachingDirectoryFactory.close Releasing directory:/usr/home/hudson/hudson-slave/workspace/Lucene-Solr-Tests-trunk-java7/solr/build/solr-core/test/J0/./org.apache.solr.cloud.BasicDistributedZkTest-1356915299762/jetty1
[junit4:junit4]   2> 19036 T211 C23 P18705 oass.SolrIndexSearcher.<init> Opening Searcher@4b0172d1 realtime
[junit4:junit4]   2> 19037 T211 C23 P18705 oasu.DirectUpdateHandler2.commit end_commit_flush
[junit4:junit4]   2> 19037 T211 C23 P18705 /update {waitSearcher=true&openSearcher=false&commit=true&commit_end_point=true&wt=javabin&softCommit=false&version=2} {commit=} 0 43
[junit4:junit4]   2> 19119 T252 C21 P18729 oash.ReplicationHandler.inform Commits will be reserved for  10000
[junit4:junit4]   2> 19120 T252 C21 P18729 oascsi.HttpClientUtil.createClient Creating new http client, config:connTimeout=5000&socketTimeout=20000&allowCompression=false&maxConnections=10000&maxConnectionsPerHost=10000
[junit4:junit4]   2> 19153 T252 C21 P18729 oash.SnapPuller.<init>  No value set for 'pollInterval'. Timer Task not started.
[junit4:junit4]   2> 19157 T212 C23 P18705 oash.ReplicationHandler.inform Commits will be reserved for  10000
[junit4:junit4]   2> 19158 T212 C23 P18705 REQ /replication {command=indexversion&wt=javabin&qt=/replication&version=2} status=0 QTime=2 
[junit4:junit4]   2> 19159 T252 C21 P18729 oash.SnapPuller.fetchLatestIndex Master's generation: 2
[junit4:junit4]   2> 19160 T252 C21 P18729 oash.SnapPuller.fetchLatestIndex Slave's generation: 1
[junit4:junit4]   2> 19160 T252 C21 P18729 oash.SnapPuller.fetchLatestIndex Starting replication process
[junit4:junit4]   2> 19164 T212 C23 P18705 oasc.CachingDirectoryFactory.close Releasing directory:/usr/home/hudson/hudson-slave/workspace/Lucene-Solr-Tests-trunk-java7/solr/build/solr-core/test/J0/./org.apache.solr.cloud.BasicDistributedZkTest-1356915299762/jetty1
[junit4:junit4]   2> 19165 T212 C23 P18705 oasc.CachingDirectoryFactory.close Releasing directory:/usr/home/hudson/hudson-slave/workspace/Lucene-Solr-Tests-trunk-java7/solr/build/solr-core/test/J0/./org.apache.solr.cloud.BasicDistributedZkTest-1356915299762/jetty1/index
[junit4:junit4]   2> 19165 T212 C23 P18705 REQ /replication {command=filelist&generation=2&wt=javabin&qt=/replication&version=2} status=0 QTime=2 
[junit4:junit4]   2> 19166 T252 C21 P18729 oash.SnapPuller.fetchLatestIndex Number of files in latest index in master: 1
[junit4:junit4]   2> 19168 T252 C21 P18729 oasc.CachingDirectoryFactory.get return new directory for /usr/home/hudson/hudson-slave/workspace/Lucene-Solr-Tests-trunk-java7/solr/build/solr-core/test/J0/./org.apache.solr.cloud.BasicDistributedZkTest-1356915299762/jetty3/index.20121231035518923 forceNew:false
[junit4:junit4]   2> 19169 T252 C21 P18729 oasc.CachingDirectoryFactory.close Releasing directory:/usr/home/hudson/hudson-slave/workspace/Lucene-Solr-Tests-trunk-java7/solr/build/solr-core/test/J0/./org.apache.solr.cloud.BasicDistributedZkTest-1356915299762/jetty3
[junit4:junit4]   2> 19170 T252 C21 P18729 oash.SnapPuller.fetchLatestIndex Starting download to RateLimitedDirectoryWrapper(NRTCachingDirectory(org.apache.lucene.store.NIOFSDirectory@/usr/home/hudson/hudson-slave/workspace/Lucene-Solr-Tests-trunk-java7/solr/build/solr-core/test/J0/org.apache.solr.cloud.BasicDistributedZkTest-1356915299762/jetty3/index.20121231035518923 lockFactory=org.apache.lucene.store.NativeFSLockFactory@43c0b942; maxCacheMB=48.0 maxMergeSizeMB=4.0)) fullCopy=true
[junit4:junit4]   2> 19189 T212 C23 P18705 REQ /replication {file=segments_2&command=filecontent&checksum=true&generation=2&qt=/replication&wt=filestream} status=0 QTime=8 
[junit4:junit4]   2> 19209 T252 C21 P18729 oasc.CachingDirectoryFactory.close Releasing directory:/usr/home/hudson/hudson-slave/workspace/Lucene-Solr-Tests-trunk-java7/solr/build/solr-core/test/J0/./org.apache.solr.cloud.BasicDistributedZkTest-1356915299762/jetty3/index
[junit4:junit4]   2> 19210 T252 C21 P18729 oash.SnapPuller.fetchLatestIndex Total time taken for download : 0 secs
[junit4:junit4]   2> 19210 T252 C21 P18729 oash.SnapPuller.modifyIndexProps New index installed. Updating index properties... index=index.20121231035518923
[junit4:junit4]   2> 19212 T252 C21 P18729 oasc.CachingDirectoryFactory.close Releasing directory:/usr/home/hudson/hudson-slave/workspace/Lucene-Solr-Tests-trunk-java7/solr/build/solr-core/test/J0/./org.apache.solr.cloud.BasicDistributedZkTest-1356915299762/jetty3
[junit4:junit4]   2> 19213 T252 C21 P18729 oasc.CachingDirectoryFactory.close Releasing directory:/usr/home/hudson/hudson-slave/workspace/Lucene-Solr-Tests-trunk-java7/solr/build/solr-core/test/J0/./org.apache.solr.cloud.BasicDistributedZkTest-1356915299762/jetty3
[junit4:junit4]   2> 19214 T252 C21 P18729 oasc.SolrCore.getNewIndexDir New index directory detected: old=./org.apache.solr.cloud.BasicDistributedZkTest-1356915299762/jetty3/index/ new=./org.apache.solr.cloud.BasicDistributedZkTest-1356915299762/jetty3/index.20121231035518923
[junit4:junit4]   2> 19218 T252 C21 P18729 oasc.SolrDeletionPolicy.onInit SolrDeletionPolicy.onInit: commits:num=1
[junit4:junit4]   2> 		commit{dir=RateLimitedDirectoryWrapper(NRTCachingDirectory(org.apache.lucene.store.NIOFSDirectory@/usr/home/hudson/hudson-slave/workspace/Lucene-Solr-Tests-trunk-java7/solr/build/solr-core/test/J0/org.apache.solr.cloud.BasicDistributedZkTest-1356915299762/jetty3/index.20121231035518923 lockFactory=org.apache.lucene.store.NativeFSLockFactory@43c0b942; maxCacheMB=48.0 maxMergeSizeMB=4.0)),segFN=segments_2,generation=2,filenames=[segments_2]
[junit4:junit4]   2> 19218 T252 C21 P18729 oasc.SolrDeletionPolicy.updateCommits newest commit = 2[segments_2]
[junit4:junit4]   2> 19220 T252 C21 P18729 oasc.CachingDirectoryFactory.close Releasing directory:/usr/home/hudson/hudson-slave/workspace/Lucene-Solr-Tests-trunk-java7/solr/build/solr-core/test/J0/./org.apache.solr.cloud.BasicDistributedZkTest-1356915299762/jetty3
[junit4:junit4]   2> 19225 T252 C21 P18729 oasu.DefaultSolrCoreState.newIndexWriter Creating new IndexWriter...
[junit4:junit4]   2> 19226 T252 C21 P18729 oasu.DefaultSolrCoreState.newIndexWriter Waiting until IndexWriter is unused... core=collection1
[junit4:junit4]   2> 19226 T252 C21 P18729 oasu.DefaultSolrCoreState.newIndexWriter Rollback old IndexWriter... core=collection1
[junit4:junit4]   2> 19228 T252 C21 P18729 oasc.CachingDirectoryFactory.close Releasing directory:/usr/home/hudson/hudson-slave/workspace/Lucene-Solr-Tests-trunk-java7/solr/build/solr-core/test/J0/./org.apache.solr.cloud.BasicDistributedZkTest-1356915299762/jetty3/index.20121231035518923
[junit4:junit4]   2> 19229 T252 C21 P18729 oasc.CachingDirectoryFactory.close Releasing directory:/usr/home/hudson/hudson-slave/workspace/Lucene-Solr-Tests-trunk-java7/solr/build/solr-core/test/J0/./org.apache.solr.cloud.BasicDistributedZkTest-1356915299762/jetty3
[junit4:junit4]   2> 19235 T252 C21 P18729 oasc.SolrDeletionPolicy.onInit SolrDeletionPolicy.onInit: commits:num=1
[junit4:junit4]   2> 		commit{dir=RateLimitedDirectoryWrapper(NRTCachingDirectory(org.apache.lucene.store.NIOFSDirectory@/usr/home/hudson/hudson-slave/workspace/Lucene-Solr-Tests-trunk-java7/solr/build/solr-core/test/J0/org.apache.solr.cloud.BasicDistributedZkTest-1356915299762/jetty3/index.20121231035518923 lockFactory=org.apache.lucene.store.NativeFSLockFactory@43c0b942; maxCacheMB=48.0 maxMergeSizeMB=4.0)),segFN=segments_2,generation=2,filenames=[segments_2]
[junit4:junit4]   2> 19236 T252 C21 P18729 oasc.SolrDeletionPolicy.updateCommits newest commit = 2[segments_2]
[junit4:junit4]   2> 19236 T252 C21 P18729 oasu.DefaultSolrCoreState.newIndexWriter New IndexWriter is ready to be used.
[junit4:junit4]   2> 19237 T252 C21 P18729 oasc.CachingDirectoryFactory.close Releasing directory:/usr/home/hudson/hudson-slave/workspace/Lucene-Solr-Tests-trunk-java7/solr/build/solr-core/test/J0/./org.apache.solr.cloud.BasicDistributedZkTest-1356915299762/jetty3
[junit4:junit4]   2> 19238 T252 C21 P18729 oass.SolrIndexSearcher.<init> Opening Searcher@6f83b365 main
[junit4:junit4]   2> 19241 T251 oasc.SolrCore.registerSearcher [collection1] Registered new searcher Searcher@6f83b365 main{StandardDirectoryReader(segments_2:1:nrt)}
[junit4:junit4]   2> 19241 T251 oasc.CachingDirectoryFactory.close Releasing directory:/usr/home/hudson/hudson-slave/workspace/Lucene-Solr-Tests-trunk-java7/solr/build/solr-core/test/J0/./org.apache.solr.cloud.BasicDistributedZkTest-1356915299762/jetty3/index
[junit4:junit4]   2> 19242 T252 C21 P18729 oasu.DirectUpdateHandler2.commit start commit{flags=0,_version_=0,optimize=false,openSearcher=false,waitSearcher=false,expungeDeletes=false,softCommit=false}
[junit4:junit4]   2> 19245 T252 C21 P18729 oasc.SolrDeletionPolicy.onCommit SolrDeletionPolicy.onCommit: commits:num=2
[junit4:junit4]   2> 		commit{dir=RateLimitedDirectoryWrapper(NRTCachingDirectory(org.apache.lucene.store.NIOFSDirectory@/usr/home/hudson/hudson-slave/workspace/Lucene-Solr-Tests-trunk-java7/solr/build/solr-core/test/J0/org.apache.solr.cloud.BasicDistributedZkTest-1356915299762/jetty3/index.20121231035518923 lockFactory=org.apache.lucene.store.NativeFSLockFactory@43c0b942; maxCacheMB=48.0 maxMergeSizeMB=4.0)),segFN=segments_2,generation=2,filenames=[segments_2]
[junit4:junit4]   2> 		commit{dir=RateLimitedDirectoryWrapper(NRTCachingDirectory(org.apache.lucene.store.NIOFSDirectory@/usr/home/hudson/hudson-slave/workspace/Lucene-Solr-Tests-trunk-java7/solr/build/solr-core/test/J0/org.apache.solr.cloud.BasicDistributedZkTest-1356915299762/jetty3/index.20121231035518923 lockFactory=org.apache.lucene.store.NativeFSLockFactory@43c0b942; maxCacheMB=48.0 maxMergeSizeMB=4.0)),segFN=segments_3,generation=3,filenames=[segments_3]
[junit4:junit4]   2> 19246 T252 C21 P18729 oasc.SolrDeletionPolicy.updateCommits newest commit = 3[segments_3]
[junit4:junit4]   2> 19248 T252 C21 P18729 oasc.CachingDirectoryFactory.close Releasing directory:/usr/home/hudson/hudson-slave/workspace/Lucene-Solr-Tests-trunk-java7/solr/build/solr-core/test/J0/./org.apache.solr.cloud.BasicDistributedZkTest-1356915299762/jetty3
[junit4:junit4]   2> 19249 T252 C21 P18729 oasu.DirectUpdateHandler2.commit end_commit_flush
[junit4:junit4]   2> 19249 T252 C21 P18729 oasc.CachingDirectoryFactory.close Releasing directory:/usr/home/hudson/hudson-slave/workspace/Lucene-Solr-Tests-trunk-java7/solr/build/solr-core/test/J0/./org.apache.solr.cloud.BasicDistributedZkTest-1356915299762/jetty3/index.20121231035518923
[junit4:junit4]   2> 19250 T252 C21 P18729 oasc.CachingDirectoryFactory.close Releasing directory:/usr/home/hudson/hudson-slave/workspace/Lucene-Solr-Tests-trunk-java7/solr/build/solr-core/test/J0/./org.apache.solr.cloud.BasicDistributedZkTest-1356915299762/jetty3/index
[junit4:junit4]   2> 19250 T252 C21 P18729 oasc.RecoveryStrategy.replay No replay needed. core=collection1
[junit4:junit4]   2> 19250 T252 C21 P18729 oasc.RecoveryStrategy.doRecovery Replication Recovery was successful - registering as Active. core=collection1
[junit4:junit4]   2> 19251 T252 C21 P18729 oasc.ZkController.publish publishing core=collection1 state=active
[junit4:junit4]   2> 19251 T252 C21 P18729 oasc.ZkController.publish numShards not found on descriptor - reading it from system property
[junit4:junit4]   2> 19253 T252 C21 P18729 oasc.RecoveryStrategy.doRecovery Finished recovery process. core=collection1
[junit4:junit4]   2> 19472 T178 oascc.ZkStateReader.updateClusterState Updating cloud state from ZooKeeper... 
[junit4:junit4]   2> 19732 T201 oascc.ZkStateReader.updateClusterState Updating cloud state from ZooKeeper... 
[junit4:junit4]   2> 19734 T201 oasc.Overseer$ClusterStateUpdater.updateState Update state numShards=2 message={
[junit4:junit4]   2> 	  "operation":"state",
[junit4:junit4]   2> 	  "numShards":"2",
[junit4:junit4]   2> 	  "shard":"shard2",
[junit4:junit4]   2> 	  "roles":null,
[junit4:junit4]   2> 	  "state":"recovering",
[junit4:junit4]   2> 	  "core":"collection1",
[junit4:junit4]   2> 	  "collection":"collection1",
[junit4:junit4]   2> 	  "node_name":"127.0.0.1:18737_j",
[junit4:junit4]   2> 	  "base_url":"http://127.0.0.1:18737/j"}
[junit4:junit4]   2> 19741 T201 oasc.Overseer$ClusterStateUpdater.updateState Update state numShards=2 message={
[junit4:junit4]   2> 	  "operation":"state",
[junit4:junit4]   2> 	  "numShards":"2",
[junit4:junit4]   2> 	  "shard":"shard1",
[junit4:junit4]   2> 	  "roles":null,
[junit4:junit4]   2> 	  "state":"active",
[junit4:junit4]   2> 	  "core":"collection1",
[junit4:junit4]   2> 	  "collection":"collection1",
[junit4:junit4]   2> 	  "node_name":"127.0.0.1:18729_j",
[junit4:junit4]   2> 	  "base_url":"http://127.0.0.1:18729/j"}
[junit4:junit4]   2> 19756 T249 oascc.ZkStateReader$2.process A cluster state change: WatchedEvent state:SyncConnected type:NodeDataChanged path:/clusterstate.json, has occurred - updating... (live nodes size: 5)
[junit4:junit4]   2> 19756 T200 oascc.ZkStateReader$2.process A cluster state change: WatchedEvent state:SyncConnected type:NodeDataChanged path:/clusterstate.json, has occurred - updating... (live nodes size: 5)
[junit4:junit4]   2> 19756 T219 oascc.ZkStateReader$2.process A cluster state change: WatchedEvent state:SyncConnected type:NodeDataChanged path:/clusterstate.json, has occurred - updating... (live nodes size: 5)
[junit4:junit4]   2> 19756 T206 oascc.ZkStateReader$2.process A cluster state change: WatchedEvent state:SyncConnected type:NodeDataChanged path:/clusterstate.json, has occurred - updating... (live nodes size: 5)
[junit4:junit4]   2> 19756 T234 oascc.ZkStateReader$2.process A cluster state change: WatchedEvent state:SyncConnected type:NodeDataChanged path:/clusterstate.json, has occurred - updating... (live nodes size: 5)
[junit4:junit4]   2> 19756 T265 oascc.ZkStateReader$2.process A cluster state change: WatchedEvent state:SyncConnected type:NodeDataChanged path:/clusterstate.json, has occurred - updating... (live nodes size: 5)
[junit4:junit4]   2> 20476 T178 oascc.ZkStateReader.updateClusterState Updating cloud state from ZooKeeper... 
[junit4:junit4]   2> 21480 T178 oascc.ZkStateReader.updateClusterState Updating cloud state from ZooKeeper... 
[junit4:junit4]   2>  C22_STATE=coll:collection1 core:collection1 props:{shard=shard2, roles=null, state=recovering, core=collection1, collection=collection1, node_name=127.0.0.1:18737_j, base_url=http://127.0.0.1:18737/j}
[junit4:junit4]   2> 22467 T268 C22 P18737 oasc.RecoveryStrategy.doRecovery Attempting to PeerSync from http://127.0.0.1:18713/j/collection1/ core=collection1 - recoveringAfterStartup=true
[junit4:junit4]   2> 22467 T268 C22 P18737 oasu.PeerSync.sync PeerSync: core=collection1 url=http://127.0.0.1:18737/j START replicas=[http://127.0.0.1:18713/j/collection1/] nUpdates=100
[junit4:junit4]   2> 22468 T268 C22 P18737 oasu.PeerSync.sync WARNING no frame of reference to tell of we've missed updates
[junit4:junit4]   2> 22468 T268 C22 P18737 oasc.RecoveryStrategy.doRecovery PeerSync Recovery was not successful - trying replication. core=collection1
[junit4:junit4]   2> 22469 T268 C22 P18737 oasc.RecoveryStrategy.doRecovery Starting Replication Recovery. core=collection1
[junit4:junit4]   2> 22469 T268 C22 P18737 oasc.RecoveryStrategy.doRecovery Begin buffering updates. core=collection1
[junit4:junit4]   2> 22470 T268 C22 P18737 oasu.UpdateLog.bufferUpdates Starting to buffer updates. FSUpdateLog{state=ACTIVE, tlog=null}
[junit4:junit4]   2> 22470 T268 C22 P18737 oasc.RecoveryStrategy.replicate Attempting to replicate from http://127.0.0.1:18713/j/collection1/. core=collection1
[junit4:junit4]   2> 22471 T268 C22 P18737 oascsi.HttpClientUtil.createClient Creating new http client, config:maxConnections=128&maxConnectionsPerHost=32&followRedirects=false
[junit4:junit4]   2> ASYNC  NEW_CORE C24 name=collection1 org.apache.solr.core.SolrCore@20e9df17 url=http://127.0.0.1:18713/j/collection1 node=127.0.0.1:18713_j C24_STATE=coll:collection1 core:collection1 props:{shard=shard2, roles=null, state=active, core=collection1, collection=collection1, node_name=127.0.0.1:18713_j, base_url=http://127.0.0.1:18713/j, leader=true}
[junit4:junit4]   2> 22479 T225 C24 P18713 REQ /get {distrib=false&qt=/get&wt=javabin&version=2&getVersions=100} status=0 QTime=0 
[junit4:junit4]   2> 22484 T178 oascc.ZkStateReader.updateClusterState Updating cloud state from ZooKeeper... 
[junit4:junit4]   2> 22492 T226 C24 P18713 oasu.DirectUpdateHandler2.commit start commit{flags=0,_version_=0,optimize=false,openSearcher=false,waitSearcher=true,expungeDeletes=false,softCommit=false}
[junit4:junit4]   2> 22494 T226 C24 P18713 oasc.CachingDirectoryFactory.close Releasing directory:/usr/home/hudson/hudson-slave/workspace/Lucene-Solr-Tests-trunk-java7/solr/build/solr-core/test/J0/./org.apache.solr.cloud.BasicDistributedZkTest-1356915299762/jetty2
[junit4:junit4]   2> 22501 T226 C24 P18713 oasc.SolrDeletionPolicy.onInit SolrDeletionPolicy.onInit: commits:num=1
[junit4:junit4]   2> 		commit{dir=RateLimitedDirectoryWrapper(NRTCachingDirectory(org.apache.lucene.store.NIOFSDirectory@/usr/home/hudson/hudson-slave/workspace/Lucene-Solr-Tests-trunk-java7/solr/build/solr-core/test/J0/org.apache.solr.cloud.BasicDistributedZkTest-1356915299762/jetty2/index lockFactory=org.apache.lucene.store.NativeFSLockFactory@40ce2eb0; maxCacheMB=48.0 maxMergeSizeMB=4.0)),segFN=segments_1,generation=1,filenames=[segments_1]
[junit4:junit4]   2> 22502 T226 C24 P18713 oasc.SolrDeletionPolicy.updateCommits newest commit = 1[segments_1]
[junit4:junit4]   2> 22507 T226 C24 P18713 oasc.SolrDeletionPolicy.onCommit SolrDeletionPolicy.onCommit: commits:num=2
[junit4:junit4]   2> 		commit{dir=RateLimitedDirectoryWrapper(NRTCachingDirectory(org.apache.lucene.store.NIOFSDirecto

[...truncated too long message...]

asicDistributedZkTest]
[junit4:junit4]   2> 	        at sun.misc.Unsafe.park(Native Method)
[junit4:junit4]   2> 	        at java.util.concurrent.locks.LockSupport.park(LockSupport.java:186)
[junit4:junit4]   2> 	        at java.util.concurrent.locks.AbstractQueuedSynchronizer$ConditionObject.await(AbstractQueuedSynchronizer.java:2043)
[junit4:junit4]   2> 	        at java.util.concurrent.LinkedBlockingQueue.take(LinkedBlockingQueue.java:442)
[junit4:junit4]   2> 	        at java.util.concurrent.ThreadPoolExecutor.getTask(ThreadPoolExecutor.java:1043)
[junit4:junit4]   2> 	        at java.util.concurrent.ThreadPoolExecutor.runWorker(ThreadPoolExecutor.java:1103)
[junit4:junit4]   2> 	        at java.util.concurrent.ThreadPoolExecutor$Worker.run(ThreadPoolExecutor.java:603)
[junit4:junit4]   2> 	        at java.lang.Thread.run(Thread.java:722)
[junit4:junit4]   2> 	  25) Thread[id=238, name=qtp289966798-238 Acceptor0 SocketConnector@127.0.0.1:18729, state=RUNNABLE, group=TGRP-BasicDistributedZkTest]
[junit4:junit4]   2> 	        at java.net.PlainSocketImpl.socketAccept(Native Method)
[junit4:junit4]   2> 	        at java.net.AbstractPlainSocketImpl.accept(AbstractPlainSocketImpl.java:398)
[junit4:junit4]   2> 	        at java.net.ServerSocket.implAccept(ServerSocket.java:522)
[junit4:junit4]   2> 	        at java.net.ServerSocket.accept(ServerSocket.java:490)
[junit4:junit4]   2> 	        at org.eclipse.jetty.server.bio.SocketConnector.accept(SocketConnector.java:117)
[junit4:junit4]   2> 	        at org.eclipse.jetty.server.AbstractConnector$Acceptor.run(AbstractConnector.java:938)
[junit4:junit4]   2> 	        at org.eclipse.jetty.util.thread.QueuedThreadPool.runJob(QueuedThreadPool.java:608)
[junit4:junit4]   2> 	        at org.eclipse.jetty.util.thread.QueuedThreadPool$3.run(QueuedThreadPool.java:543)
[junit4:junit4]   2> 	        at java.lang.Thread.run(Thread.java:722)
[junit4:junit4]   2> 	  26) Thread[id=264, name=TEST-BasicDistributedZkTest.testDistribSearch-seed#[509AB02FD0A9ED9B]-SendThread(localhost:18695), state=RUNNABLE, group=TGRP-BasicDistributedZkTest]
[junit4:junit4]   2> 	        at sun.nio.ch.SelectorImpl.lockAndDoSelect(SelectorImpl.java:82)
[junit4:junit4]   2> 	        at sun.nio.ch.SelectorImpl.select(SelectorImpl.java:98)
[junit4:junit4]   2> 	        at org.apache.zookeeper.ClientCnxnSocketNIO.doTransport(ClientCnxnSocketNIO.java:338)
[junit4:junit4]   2> 	        at org.apache.zookeeper.ClientCnxn$SendThread.run(ClientCnxn.java:1068)
[junit4:junit4]   2> 	  27) Thread[id=656, name=searcherExecutor-299-thread-1, state=WAITING, group=TGRP-BasicDistributedZkTest]
[junit4:junit4]   2> 	        at sun.misc.Unsafe.park(Native Method)
[junit4:junit4]   2> 	        at java.util.concurrent.locks.LockSupport.park(LockSupport.java:186)
[junit4:junit4]   2> 	        at java.util.concurrent.locks.AbstractQueuedSynchronizer$ConditionObject.await(AbstractQueuedSynchronizer.java:2043)
[junit4:junit4]   2> 	        at java.util.concurrent.LinkedBlockingQueue.take(LinkedBlockingQueue.java:442)
[junit4:junit4]   2> 	        at java.util.concurrent.ThreadPoolExecutor.getTask(ThreadPoolExecutor.java:1043)
[junit4:junit4]   2> 	        at java.util.concurrent.ThreadPoolExecutor.runWorker(ThreadPoolExecutor.java:1103)
[junit4:junit4]   2> 	        at java.util.concurrent.ThreadPoolExecutor$Worker.run(ThreadPoolExecutor.java:603)
[junit4:junit4]   2> 	        at java.lang.Thread.run(Thread.java:722)
[junit4:junit4]   2> 	  28) Thread[id=253, name=HashSessionScavenger-13, state=TIMED_WAITING, group=TGRP-BasicDistributedZkTest]
[junit4:junit4]   2> 	        at java.lang.Object.wait(Native Method)
[junit4:junit4]   2> 	        at java.util.TimerThread.mainLoop(Timer.java:552)
[junit4:junit4]   2> 	        at java.util.TimerThread.run(Timer.java:505)
[junit4:junit4]   2> 	  29) Thread[id=251, name=searcherExecutor-147-thread-1, state=WAITING, group=TGRP-BasicDistributedZkTest]
[junit4:junit4]   2> 	        at sun.misc.Unsafe.park(Native Method)
[junit4:junit4]   2> 	        at java.util.concurrent.locks.LockSupport.park(LockSupport.java:186)
[junit4:junit4]   2> 	        at java.util.concurrent.locks.AbstractQueuedSynchronizer$ConditionObject.await(AbstractQueuedSynchronizer.java:2043)
[junit4:junit4]   2> 	        at java.util.concurrent.LinkedBlockingQueue.take(LinkedBlockingQueue.java:442)
[junit4:junit4]   2> 	        at java.util.concurrent.ThreadPoolExecutor.getTask(ThreadPoolExecutor.java:1043)
[junit4:junit4]   2> 	        at java.util.concurrent.ThreadPoolExecutor.runWorker(ThreadPoolExecutor.java:1103)
[junit4:junit4]   2> 	        at java.util.concurrent.ThreadPoolExecutor$Worker.run(ThreadPoolExecutor.java:603)
[junit4:junit4]   2> 	        at java.lang.Thread.run(Thread.java:722)
[junit4:junit4]   2> 	  30) Thread[id=329, name=searcherExecutor-214-thread-1, state=WAITING, group=TGRP-BasicDistributedZkTest]
[junit4:junit4]   2> 	        at sun.misc.Unsafe.park(Native Method)
[junit4:junit4]   2> 	        at java.util.concurrent.locks.LockSupport.park(LockSupport.java:186)
[junit4:junit4]   2> 	        at java.util.concurrent.locks.AbstractQueuedSynchronizer$ConditionObject.await(AbstractQueuedSynchronizer.java:2043)
[junit4:junit4]   2> 	        at java.util.concurrent.LinkedBlockingQueue.take(LinkedBlockingQueue.java:442)
[junit4:junit4]   2> 	        at java.util.concurrent.ThreadPoolExecutor.getTask(ThreadPoolExecutor.java:1043)
[junit4:junit4]   2> 	        at java.util.concurrent.ThreadPoolExecutor.runWorker(ThreadPoolExecutor.java:1103)
[junit4:junit4]   2> 	        at java.util.concurrent.ThreadPoolExecutor$Worker.run(ThreadPoolExecutor.java:603)
[junit4:junit4]   2> 	        at java.lang.Thread.run(Thread.java:722)
[junit4:junit4]   2> NOTE: test params are: codec=Lucene41: {n_f1=Lucene41(blocksize=128), foo_b=Pulsing41(freqCutoff=19 minBlockSize=25 maxBlockSize=103), cat=PostingsFormat(name=TestBloomFilteredLucene41Postings), foo_d=PostingsFormat(name=MockRandom), foo_f=Pulsing41(freqCutoff=19 minBlockSize=25 maxBlockSize=103), n_tl1=Lucene41(blocksize=128), n_d1=PostingsFormat(name=TestBloomFilteredLucene41Postings), rnd_b=PostingsFormat(name=MockRandom), intDefault=Lucene41(blocksize=128), n_td1=Lucene41(blocksize=128), timestamp=PostingsFormat(name=TestBloomFilteredLucene41Postings), id=PostingsFormat(name=MockRandom), range_facet_sl=PostingsFormat(name=MockRandom), range_facet_si=PostingsFormat(name=TestBloomFilteredLucene41Postings), oddField_s=PostingsFormat(name=MockRandom), sequence_i=PostingsFormat(name=MockRandom), name=PostingsFormat(name=MockRandom), foo_i=Lucene41(blocksize=128), regex_dup_B_s=PostingsFormat(name=TestBloomFilteredLucene41Postings), multiDefault=PostingsFormat(name=TestBloomFilteredLucene41Postings), n_tf1=PostingsFormat(name=TestBloomFilteredLucene41Postings), n_dt1=Lucene41(blocksize=128), genre_s=PostingsFormat(name=MockRandom), author_t=Lucene41(blocksize=128), n_ti1=PostingsFormat(name=MockRandom), range_facet_l=PostingsFormat(name=TestBloomFilteredLucene41Postings), text=Pulsing41(freqCutoff=19 minBlockSize=25 maxBlockSize=103), _version_=Lucene41(blocksize=128), val_i=PostingsFormat(name=MockRandom), SubjectTerms_mfacet=Lucene41(blocksize=128), series_t=Lucene41(blocksize=128), a_t=PostingsFormat(name=TestBloomFilteredLucene41Postings), n_tdt1=Lucene41(blocksize=128), regex_dup_A_s=Pulsing41(freqCutoff=19 minBlockSize=25 maxBlockSize=103), price=Pulsing41(freqCutoff=19 minBlockSize=25 maxBlockSize=103), other_tl1=Lucene41(blocksize=128), n_l1=PostingsFormat(name=TestBloomFilteredLucene41Postings), a_si=Lucene41(blocksize=128), inStock=Pulsing41(freqCutoff=19 minBlockSize=25 maxBlockSize=103)}, sim=DefaultSimilarity, locale=tr, timezone=Asia/Kuwait
[junit4:junit4]   2> NOTE: FreeBSD 9.0-RELEASE amd64/Oracle Corporation 1.7.0_09 (64-bit)/cpus=16,threads=31,free=188931208,total=402653184
[junit4:junit4]   2> NOTE: All tests run in this JVM: [MoreLikeThisHandlerTest, MBeansHandlerTest, SuggesterFSTTest, AutoCommitTest, SpellPossibilityIteratorTest, TestQueryTypes, DirectSolrConnectionTest, TestLFUCache, TestXIncludeConfig, DistributedTermsComponentTest, TestExtendedDismaxParser, TestQuerySenderNoQuery, DateFieldTest, TestConfig, BasicDistributedZkTest]
[junit4:junit4]   2> NOTE: reproduce with: ant test  -Dtestcase=BasicDistributedZkTest -Dtests.seed=509AB02FD0A9ED9B -Dtests.multiplier=3 -Dtests.slow=true -Dtests.locale=tr -Dtests.timezone=Asia/Kuwait -Dtests.file.encoding=US-ASCII
[junit4:junit4] ERROR   0.00s J0 | BasicDistributedZkTest (suite) <<<
[junit4:junit4]    > Throwable #1: java.lang.Exception: Suite timeout exceeded (>= 7200000 msec).
[junit4:junit4]    > 	at __randomizedtesting.SeedInfo.seed([509AB02FD0A9ED9B]:0)
[junit4:junit4] Completed on J0 in 7223.75s, 1 test, 2 errors <<< FAILURES!

[...truncated 146 lines...]
BUILD FAILED
/usr/home/hudson/hudson-slave/workspace/Lucene-Solr-Tests-trunk-java7/build.xml:353: The following error occurred while executing this line:
/usr/home/hudson/hudson-slave/workspace/Lucene-Solr-Tests-trunk-java7/build.xml:39: The following error occurred while executing this line:
/usr/home/hudson/hudson-slave/workspace/Lucene-Solr-Tests-trunk-java7/solr/build.xml:178: The following error occurred while executing this line:
/usr/home/hudson/hudson-slave/workspace/Lucene-Solr-Tests-trunk-java7/solr/common-build.xml:438: The following error occurred while executing this line:
/usr/home/hudson/hudson-slave/workspace/Lucene-Solr-Tests-trunk-java7/lucene/common-build.xml:1176: The following error occurred while executing this line:
/usr/home/hudson/hudson-slave/workspace/Lucene-Solr-Tests-trunk-java7/lucene/common-build.xml:841: There were test failures: 244 suites, 1010 tests, 1 suite-level error, 1 error, 187 ignored (4 assumptions)

Total time: 141 minutes 11 seconds
Build step 'Invoke Ant' marked build as failure
Archiving artifacts
Recording test results
Email was triggered for: Failure
Sending email for trigger: Failure



Mime
View raw message