lucene-dev mailing list archives

Site index · List index
Message view « Date » · « Thread »
Top « Date » · « Thread »
From Apache Jenkins Server <jenk...@builds.apache.org>
Subject [JENKINS] Lucene-Solr-Tests-trunk-Java6 - Build # 15720 - Failure
Date Sun, 16 Dec 2012 02:48:07 GMT
Build: https://builds.apache.org/job/Lucene-Solr-Tests-trunk-Java6/15720/

2 tests failed.
REGRESSION:  org.apache.solr.cloud.BasicDistributedZk2Test.testDistribSearch

Error Message:
Shard still reported as live in zk - 0 jetty

Stack Trace:
java.lang.AssertionError: Shard still reported as live in zk - 0 jetty
	at __randomizedtesting.SeedInfo.seed([845430D5FF9206A:89A3CD1528A64056]:0)
	at org.junit.Assert.fail(Assert.java:93)
	at org.apache.solr.cloud.AbstractFullDistribZkTestBase.waitToSeeNotLive(AbstractFullDistribZkTestBase.java:1239)
	at org.apache.solr.cloud.BasicDistributedZk2Test.brindDownShardIndexSomeDocsAndRecover(BasicDistributedZk2Test.java:217)
	at org.apache.solr.cloud.BasicDistributedZk2Test.doTest(BasicDistributedZk2Test.java:92)
	at org.apache.solr.BaseDistributedSearchTestCase.testDistribSearch(BaseDistributedSearchTestCase.java:793)
	at sun.reflect.NativeMethodAccessorImpl.invoke0(Native Method)
	at sun.reflect.NativeMethodAccessorImpl.invoke(NativeMethodAccessorImpl.java:57)
	at sun.reflect.DelegatingMethodAccessorImpl.invoke(DelegatingMethodAccessorImpl.java:43)
	at java.lang.reflect.Method.invoke(Method.java:616)
	at com.carrotsearch.randomizedtesting.RandomizedRunner.invoke(RandomizedRunner.java:1559)
	at com.carrotsearch.randomizedtesting.RandomizedRunner.access$600(RandomizedRunner.java:79)
	at com.carrotsearch.randomizedtesting.RandomizedRunner$6.evaluate(RandomizedRunner.java:737)
	at com.carrotsearch.randomizedtesting.RandomizedRunner$7.evaluate(RandomizedRunner.java:773)
	at com.carrotsearch.randomizedtesting.RandomizedRunner$8.evaluate(RandomizedRunner.java:787)
	at com.carrotsearch.randomizedtesting.rules.SystemPropertiesRestoreRule$1.evaluate(SystemPropertiesRestoreRule.java:53)
	at org.apache.lucene.util.TestRuleSetupTeardownChained$1.evaluate(TestRuleSetupTeardownChained.java:50)
	at org.apache.lucene.util.TestRuleFieldCacheSanity$1.evaluate(TestRuleFieldCacheSanity.java:51)
	at org.apache.lucene.util.AbstractBeforeAfterRule$1.evaluate(AbstractBeforeAfterRule.java:46)
	at com.carrotsearch.randomizedtesting.rules.SystemPropertiesInvariantRule$1.evaluate(SystemPropertiesInvariantRule.java:55)
	at org.apache.lucene.util.TestRuleThreadAndTestName$1.evaluate(TestRuleThreadAndTestName.java:49)
	at org.apache.lucene.util.TestRuleIgnoreAfterMaxFailures$1.evaluate(TestRuleIgnoreAfterMaxFailures.java:70)
	at org.apache.lucene.util.TestRuleMarkFailure$1.evaluate(TestRuleMarkFailure.java:48)
	at com.carrotsearch.randomizedtesting.rules.StatementAdapter.evaluate(StatementAdapter.java:36)
	at com.carrotsearch.randomizedtesting.ThreadLeakControl$StatementRunner.run(ThreadLeakControl.java:358)
	at com.carrotsearch.randomizedtesting.ThreadLeakControl.forkTimeoutingTask(ThreadLeakControl.java:782)
	at com.carrotsearch.randomizedtesting.ThreadLeakControl$3.evaluate(ThreadLeakControl.java:442)
	at com.carrotsearch.randomizedtesting.RandomizedRunner.runSingleTest(RandomizedRunner.java:746)
	at com.carrotsearch.randomizedtesting.RandomizedRunner$3.evaluate(RandomizedRunner.java:648)
	at com.carrotsearch.randomizedtesting.RandomizedRunner$4.evaluate(RandomizedRunner.java:682)
	at com.carrotsearch.randomizedtesting.RandomizedRunner$5.evaluate(RandomizedRunner.java:693)
	at com.carrotsearch.randomizedtesting.rules.StatementAdapter.evaluate(StatementAdapter.java:36)
	at com.carrotsearch.randomizedtesting.rules.SystemPropertiesRestoreRule$1.evaluate(SystemPropertiesRestoreRule.java:53)
	at org.apache.lucene.util.AbstractBeforeAfterRule$1.evaluate(AbstractBeforeAfterRule.java:46)
	at org.apache.lucene.util.TestRuleStoreClassName$1.evaluate(TestRuleStoreClassName.java:42)
	at com.carrotsearch.randomizedtesting.rules.SystemPropertiesInvariantRule$1.evaluate(SystemPropertiesInvariantRule.java:55)
	at com.carrotsearch.randomizedtesting.rules.NoShadowingOrOverridesOnMethodsRule$1.evaluate(NoShadowingOrOverridesOnMethodsRule.java:39)
	at com.carrotsearch.randomizedtesting.rules.NoShadowingOrOverridesOnMethodsRule$1.evaluate(NoShadowingOrOverridesOnMethodsRule.java:39)
	at com.carrotsearch.randomizedtesting.rules.StatementAdapter.evaluate(StatementAdapter.java:36)
	at org.apache.lucene.util.TestRuleAssertionsRequired$1.evaluate(TestRuleAssertionsRequired.java:43)
	at org.apache.lucene.util.TestRuleMarkFailure$1.evaluate(TestRuleMarkFailure.java:48)
	at org.apache.lucene.util.TestRuleIgnoreAfterMaxFailures$1.evaluate(TestRuleIgnoreAfterMaxFailures.java:70)
	at org.apache.lucene.util.TestRuleIgnoreTestSuites$1.evaluate(TestRuleIgnoreTestSuites.java:55)
	at com.carrotsearch.randomizedtesting.rules.StatementAdapter.evaluate(StatementAdapter.java:36)
	at com.carrotsearch.randomizedtesting.ThreadLeakControl$StatementRunner.run(ThreadLeakControl.java:358)
	at java.lang.Thread.run(Thread.java:679)


REGRESSION:  org.apache.solr.cloud.SyncSliceTest.testDistribSearch

Error Message:
Shard still reported as live in zk - 0 jetty

Stack Trace:
java.lang.AssertionError: Shard still reported as live in zk - 0 jetty
	at __randomizedtesting.SeedInfo.seed([845430D5FF9206A:89A3CD1528A64056]:0)
	at org.junit.Assert.fail(Assert.java:93)
	at org.apache.solr.cloud.AbstractFullDistribZkTestBase.waitToSeeNotLive(AbstractFullDistribZkTestBase.java:1239)
	at org.apache.solr.cloud.AbstractFullDistribZkTestBase.waitToSeeNotLive(AbstractFullDistribZkTestBase.java:1224)
	at org.apache.solr.cloud.SyncSliceTest.waitToSeeDownInClusterState(SyncSliceTest.java:259)
	at org.apache.solr.cloud.SyncSliceTest.doTest(SyncSliceTest.java:163)
	at org.apache.solr.BaseDistributedSearchTestCase.testDistribSearch(BaseDistributedSearchTestCase.java:793)
	at sun.reflect.NativeMethodAccessorImpl.invoke0(Native Method)
	at sun.reflect.NativeMethodAccessorImpl.invoke(NativeMethodAccessorImpl.java:57)
	at sun.reflect.DelegatingMethodAccessorImpl.invoke(DelegatingMethodAccessorImpl.java:43)
	at java.lang.reflect.Method.invoke(Method.java:616)
	at com.carrotsearch.randomizedtesting.RandomizedRunner.invoke(RandomizedRunner.java:1559)
	at com.carrotsearch.randomizedtesting.RandomizedRunner.access$600(RandomizedRunner.java:79)
	at com.carrotsearch.randomizedtesting.RandomizedRunner$6.evaluate(RandomizedRunner.java:737)
	at com.carrotsearch.randomizedtesting.RandomizedRunner$7.evaluate(RandomizedRunner.java:773)
	at com.carrotsearch.randomizedtesting.RandomizedRunner$8.evaluate(RandomizedRunner.java:787)
	at com.carrotsearch.randomizedtesting.rules.SystemPropertiesRestoreRule$1.evaluate(SystemPropertiesRestoreRule.java:53)
	at org.apache.lucene.util.TestRuleSetupTeardownChained$1.evaluate(TestRuleSetupTeardownChained.java:50)
	at org.apache.lucene.util.TestRuleFieldCacheSanity$1.evaluate(TestRuleFieldCacheSanity.java:51)
	at org.apache.lucene.util.AbstractBeforeAfterRule$1.evaluate(AbstractBeforeAfterRule.java:46)
	at com.carrotsearch.randomizedtesting.rules.SystemPropertiesInvariantRule$1.evaluate(SystemPropertiesInvariantRule.java:55)
	at org.apache.lucene.util.TestRuleThreadAndTestName$1.evaluate(TestRuleThreadAndTestName.java:49)
	at org.apache.lucene.util.TestRuleIgnoreAfterMaxFailures$1.evaluate(TestRuleIgnoreAfterMaxFailures.java:70)
	at org.apache.lucene.util.TestRuleMarkFailure$1.evaluate(TestRuleMarkFailure.java:48)
	at com.carrotsearch.randomizedtesting.rules.StatementAdapter.evaluate(StatementAdapter.java:36)
	at com.carrotsearch.randomizedtesting.ThreadLeakControl$StatementRunner.run(ThreadLeakControl.java:358)
	at com.carrotsearch.randomizedtesting.ThreadLeakControl.forkTimeoutingTask(ThreadLeakControl.java:782)
	at com.carrotsearch.randomizedtesting.ThreadLeakControl$3.evaluate(ThreadLeakControl.java:442)
	at com.carrotsearch.randomizedtesting.RandomizedRunner.runSingleTest(RandomizedRunner.java:746)
	at com.carrotsearch.randomizedtesting.RandomizedRunner$3.evaluate(RandomizedRunner.java:648)
	at com.carrotsearch.randomizedtesting.RandomizedRunner$4.evaluate(RandomizedRunner.java:682)
	at com.carrotsearch.randomizedtesting.RandomizedRunner$5.evaluate(RandomizedRunner.java:693)
	at com.carrotsearch.randomizedtesting.rules.StatementAdapter.evaluate(StatementAdapter.java:36)
	at com.carrotsearch.randomizedtesting.rules.SystemPropertiesRestoreRule$1.evaluate(SystemPropertiesRestoreRule.java:53)
	at org.apache.lucene.util.AbstractBeforeAfterRule$1.evaluate(AbstractBeforeAfterRule.java:46)
	at org.apache.lucene.util.TestRuleStoreClassName$1.evaluate(TestRuleStoreClassName.java:42)
	at com.carrotsearch.randomizedtesting.rules.SystemPropertiesInvariantRule$1.evaluate(SystemPropertiesInvariantRule.java:55)
	at com.carrotsearch.randomizedtesting.rules.NoShadowingOrOverridesOnMethodsRule$1.evaluate(NoShadowingOrOverridesOnMethodsRule.java:39)
	at com.carrotsearch.randomizedtesting.rules.NoShadowingOrOverridesOnMethodsRule$1.evaluate(NoShadowingOrOverridesOnMethodsRule.java:39)
	at com.carrotsearch.randomizedtesting.rules.StatementAdapter.evaluate(StatementAdapter.java:36)
	at org.apache.lucene.util.TestRuleAssertionsRequired$1.evaluate(TestRuleAssertionsRequired.java:43)
	at org.apache.lucene.util.TestRuleMarkFailure$1.evaluate(TestRuleMarkFailure.java:48)
	at org.apache.lucene.util.TestRuleIgnoreAfterMaxFailures$1.evaluate(TestRuleIgnoreAfterMaxFailures.java:70)
	at org.apache.lucene.util.TestRuleIgnoreTestSuites$1.evaluate(TestRuleIgnoreTestSuites.java:55)
	at com.carrotsearch.randomizedtesting.rules.StatementAdapter.evaluate(StatementAdapter.java:36)
	at com.carrotsearch.randomizedtesting.ThreadLeakControl$StatementRunner.run(ThreadLeakControl.java:358)
	at java.lang.Thread.run(Thread.java:679)




Build Log:
[...truncated 8275 lines...]
[junit4:junit4] Suite: org.apache.solr.cloud.SyncSliceTest
[junit4:junit4]   2> 1 T318 oas.BaseDistributedSearchTestCase.initHostContext Setting hostContext system property: /zmed/
[junit4:junit4]   2> 6 T318 oas.SolrTestCaseJ4.setUp ###Starting testDistribSearch
[junit4:junit4]   2> Creating dataDir: /usr/home/hudson/hudson-slave/workspace/Lucene-Solr-Tests-trunk-Java6/solr/build/solr-core/test/J0/./solrtest-SyncSliceTest-1355625313165
[junit4:junit4]   2> 16 T318 oasc.ZkTestServer.run STARTING ZK TEST SERVER
[junit4:junit4]   2> 24 T319 oasc.ZkTestServer$ZKServerMain.runFromConfig Starting server
[junit4:junit4]   2> 122 T319 oaz.Environment.logEnv Server environment:zookeeper.version=3.4.5-1392090, built on 09/30/2012 17:52 GMT
[junit4:junit4]   2> 122 T319 oaz.Environment.logEnv Server environment:host.name=lucene.zones.apache.org
[junit4:junit4]   2> 122 T319 oaz.Environment.logEnv Server environment:java.version=1.6.0_32
[junit4:junit4]   2> 122 T319 oaz.Environment.logEnv Server environment:java.vendor=Sun Microsystems Inc.
[junit4:junit4]   2> 123 T319 oaz.Environment.logEnv Server environment:java.home=/usr/local/openjdk6/jre
[junit4:junit4]   2> 123 T319 oaz.Environment.logEnv Server environment:java.class.path=/usr/home/hudson/hudson-slave/workspace/Lucene-Solr-Tests-trunk-Java6/solr/build/solr-core/classes/test:/usr/home/hudson/hudson-slave/workspace/Lucene-Solr-Tests-trunk-Java6/solr/build/solr-test-framework/classes/java:/usr/home/hudson/hudson-slave/workspace/Lucene-Solr-Tests-trunk-Java6/solr/build/solr-core/test-files:/usr/home/hudson/hudson-slave/workspace/Lucene-Solr-Tests-trunk-Java6/lucene/build/test-framework/classes/java:/usr/home/hudson/hudson-slave/workspace/Lucene-Solr-Tests-trunk-Java6/lucene/build/codecs/classes/java:/usr/home/hudson/hudson-slave/workspace/Lucene-Solr-Tests-trunk-Java6/solr/build/solr-solrj/classes/java:/usr/home/hudson/hudson-slave/workspace/Lucene-Solr-Tests-trunk-Java6/solr/build/solr-core/classes/java:/usr/home/hudson/hudson-slave/workspace/Lucene-Solr-Tests-trunk-Java6/lucene/build/analysis/common/lucene-analyzers-common-5.0-SNAPSHOT.jar:/usr/home/hudson/hudson-slave/workspace/Lucene-Solr-Tests-trunk-Java6/lucene/build/analysis/kuromoji/lucene-analyzers-kuromoji-5.0-SNAPSHOT.jar:/usr/home/hudson/hudson-slave/workspace/Lucene-Solr-Tests-trunk-Java6/lucene/build/analysis/phonetic/lucene-analyzers-phonetic-5.0-SNAPSHOT.jar:/usr/home/hudson/hudson-slave/workspace/Lucene-Solr-Tests-trunk-Java6/lucene/build/highlighter/lucene-highlighter-5.0-SNAPSHOT.jar:/usr/home/hudson/hudson-slave/workspace/Lucene-Solr-Tests-trunk-Java6/lucene/build/memory/lucene-memory-5.0-SNAPSHOT.jar:/usr/home/hudson/hudson-slave/workspace/Lucene-Solr-Tests-trunk-Java6/lucene/build/misc/lucene-misc-5.0-SNAPSHOT.jar:/usr/home/hudson/hudson-slave/workspace/Lucene-Solr-Tests-trunk-Java6/lucene/build/spatial/lucene-spatial-5.0-SNAPSHOT.jar:/usr/home/hudson/hudson-slave/workspace/Lucene-Solr-Tests-trunk-Java6/lucene/build/suggest/lucene-suggest-5.0-SNAPSHOT.jar:/usr/home/hudson/hudson-slave/workspace/Lucene-Solr-Tests-trunk-Java6/lucene/build/grouping/lucene-grouping-5.0-SNAPSHOT.jar:/usr/home/hudson/hudson-slave/workspace/Lucene-Solr-Tests-trunk-Java6/lucene/build/queries/lucene-queries-5.0-SNAPSHOT.jar:/usr/home/hudson/hudson-slave/workspace/Lucene-Solr-Tests-trunk-Java6/lucene/build/queryparser/lucene-queryparser-5.0-SNAPSHOT.jar:/usr/home/hudson/hudson-slave/workspace/Lucene-Solr-Tests-trunk-Java6/solr/core/lib/cglib-nodep-2.2.jar:/usr/home/hudson/hudson-slave/workspace/Lucene-Solr-Tests-trunk-Java6/solr/core/lib/commons-cli-1.2.jar:/usr/home/hudson/hudson-slave/workspace/Lucene-Solr-Tests-trunk-Java6/solr/core/lib/commons-codec-1.7.jar:/usr/home/hudson/hudson-slave/workspace/Lucene-Solr-Tests-trunk-Java6/solr/core/lib/commons-fileupload-1.2.1.jar:/usr/home/hudson/hudson-slave/workspace/Lucene-Solr-Tests-trunk-Java6/solr/core/lib/commons-lang-2.6.jar:/usr/home/hudson/hudson-slave/workspace/Lucene-Solr-Tests-trunk-Java6/solr/core/lib/easymock-3.0.jar:/usr/home/hudson/hudson-slave/workspace/Lucene-Solr-Tests-trunk-Java6/solr/core/lib/guava-13.0.1.jar:/usr/home/hudson/hudson-slave/workspace/Lucene-Solr-Tests-trunk-Java6/solr/core/lib/javax.servlet-api-3.0.1.jar:/usr/home/hudson/hudson-slave/workspace/Lucene-Solr-Tests-trunk-Java6/solr/core/lib/metrics-core-2.1.2.jar:/usr/home/hudson/hudson-slave/workspace/Lucene-Solr-Tests-trunk-Java6/solr/core/lib/objenesis-1.2.jar:/usr/home/hudson/hudson-slave/workspace/Lucene-Solr-Tests-trunk-Java6/solr/core/lib/spatial4j-0.3.jar:/usr/home/hudson/hudson-slave/workspace/Lucene-Solr-Tests-trunk-Java6/solr/solrj/lib/commons-io-2.1.jar:/usr/home/hudson/hudson-slave/workspace/Lucene-Solr-Tests-trunk-Java6/solr/solrj/lib/httpclient-4.1.3.jar:/usr/home/hudson/hudson-slave/workspace/Lucene-Solr-Tests-trunk-Java6/solr/solrj/lib/httpcore-4.1.4.jar:/usr/home/hudson/hudson-slave/workspace/Lucene-Solr-Tests-trunk-Java6/solr/solrj/lib/httpmime-4.1.3.jar:/usr/home/hudson/hudson-slave/workspace/Lucene-Solr-Tests-trunk-Java6/solr/solrj/lib/jcl-over-slf4j-1.6.4.jar:/usr/home/hudson/hudson-slave/workspace/Lucene-Solr-Tests-trunk-Java6/solr/solrj/lib/log4j-over-slf4j-1.6.4.jar:/usr/home/hudson/hudson-slave/workspace/Lucene-Solr-Tests-trunk-Java6/solr/solrj/lib/slf4j-api-1.6.4.jar:/usr/home/hudson/hudson-slave/workspace/Lucene-Solr-Tests-trunk-Java6/solr/solrj/lib/slf4j-jdk14-1.6.4.jar:/usr/home/hudson/hudson-slave/workspace/Lucene-Solr-Tests-trunk-Java6/solr/solrj/lib/wstx-asl-3.2.7.jar:/usr/home/hudson/hudson-slave/workspace/Lucene-Solr-Tests-trunk-Java6/solr/solrj/lib/zookeeper-3.4.5.jar:/usr/home/hudson/hudson-slave/workspace/Lucene-Solr-Tests-trunk-Java6/solr/example/lib/jetty-continuation-8.1.8.v20121106.jar:/usr/home/hudson/hudson-slave/workspace/Lucene-Solr-Tests-trunk-Java6/solr/example/lib/jetty-deploy-8.1.8.v20121106.jar:/usr/home/hudson/hudson-slave/workspace/Lucene-Solr-Tests-trunk-Java6/solr/example/lib/jetty-http-8.1.8.v20121106.jar:/usr/home/hudson/hudson-slave/workspace/Lucene-Solr-Tests-trunk-Java6/solr/example/lib/jetty-io-8.1.8.v20121106.jar:/usr/home/hudson/hudson-slave/workspace/Lucene-Solr-Tests-trunk-Java6/solr/example/lib/jetty-jmx-8.1.8.v20121106.jar:/usr/home/hudson/hudson-slave/workspace/Lucene-Solr-Tests-trunk-Java6/solr/example/lib/jetty-security-8.1.8.v20121106.jar:/usr/home/hudson/hudson-slave/workspace/Lucene-Solr-Tests-trunk-Java6/solr/example/lib/jetty-server-8.1.8.v20121106.jar:/usr/home/hudson/hudson-slave/workspace/Lucene-Solr-Tests-trunk-Java6/solr/example/lib/jetty-servlet-8.1.8.v20121106.jar:/usr/home/hudson/hudson-slave/workspace/Lucene-Solr-Tests-trunk-Java6/solr/example/lib/jetty-util-8.1.8.v20121106.jar:/usr/home/hudson/hudson-slave/workspace/Lucene-Solr-Tests-trunk-Java6/solr/example/lib/jetty-webapp-8.1.8.v20121106.jar:/usr/home/hudson/hudson-slave/workspace/Lucene-Solr-Tests-trunk-Java6/solr/example/lib/jetty-xml-8.1.8.v20121106.jar:/usr/home/hudson/hudson-slave/workspace/Lucene-Solr-Tests-trunk-Java6/solr/example/lib/servlet-api-3.0.jar:/usr/home/hudson/hudson-slave/workspace/Lucene-Solr-Tests-trunk-Java6/solr/example/example-DIH/solr/db/lib/derby-10.9.1.0.jar:/usr/home/hudson/hudson-slave/workspace/Lucene-Solr-Tests-trunk-Java6/solr/example/example-DIH/solr/db/lib/hsqldb-1.8.0.10.jar:/usr/home/hudson/hudson-slave/workspace/Lucene-Solr-Tests-trunk-Java6/lucene/build/core/classes/java:/usr/home/hudson/hudson-slave/workspace/Lucene-Solr-Tests-trunk-Java6/lucene/test-framework/lib/junit-4.10.jar:/usr/home/hudson/hudson-slave/workspace/Lucene-Solr-Tests-trunk-Java6/lucene/test-framework/lib/randomizedtesting-runner-2.0.6.jar:/home/hudson/hudson-slave/tools/Ant/ant-1.8.2/lib/ant-launcher.jar:/home/hudson/.ant/lib/ivy-2.2.0.jar:/home/hudson/hudson-slave/tools/Ant/ant-1.8.2/lib/ant-apache-regexp.jar:/home/hudson/hudson-slave/tools/Ant/ant-1.8.2/lib/ant-junit.jar:/home/hudson/hudson-slave/tools/Ant/ant-1.8.2/lib/ant-apache-bsf.jar:/home/hudson/hudson-slave/tools/Ant/ant-1.8.2/lib/ant-commons-net.jar:/home/hudson/hudson-slave/tools/Ant/ant-1.8.2/lib/ant-antlr.jar:/home/hudson/hudson-slave/tools/Ant/ant-1.8.2/lib/ant-apache-log4j.jar:/home/hudson/hudson-slave/tools/Ant/ant-1.8.2/lib/ant-commons-logging.jar:/home/hudson/hudson-slave/tools/Ant/ant-1.8.2/lib/ant-apache-xalan2.jar:/home/hudson/hudson-slave/tools/Ant/ant-1.8.2/lib/ant-apache-oro.jar:/home/hudson/hudson-slave/tools/Ant/ant-1.8.2/lib/ant-junit4.jar:/home/hudson/hudson-slave/tools/Ant/ant-1.8.2/lib/ant-netrexx.jar:/home/hudson/hudson-slave/tools/Ant/ant-1.8.2/lib/ant-swing.jar:/home/hudson/hudson-slave/tools/Ant/ant-1.8.2/lib/ant-javamail.jar:/home/hudson/hudson-slave/tools/Ant/ant-1.8.2/lib/ant-jsch.jar:/home/hudson/hudson-slave/tools/Ant/ant-1.8.2/lib/ant-jmf.jar:/home/hudson/hudson-slave/tools/Ant/ant-1.8.2/lib/ant.jar:/home/hudson/hudson-slave/tools/Ant/ant-1.8.2/lib/ant-apache-bcel.jar:/home/hudson/hudson-slave/tools/Ant/ant-1.8.2/lib/ant-jai.jar:/home/hudson/hudson-slave/tools/Ant/ant-1.8.2/lib/ant-testutil.jar:/home/hudson/hudson-slave/tools/Ant/ant-1.8.2/lib/ant-apache-resolver.jar:/home/hudson/hudson-slave/tools/Ant/ant-1.8.2/lib/ant-jdepend.jar:/usr/local/openjdk6/lib/tools.jar:/home/hudson/.ivy2/cache/com.carrotsearch.randomizedtesting/junit4-ant/jars/junit4-ant-2.0.6.jar
[junit4:junit4]   2> 124 T319 oaz.Environment.logEnv Server environment:java.library.path=/usr/local/openjdk6/jre/lib/amd64/server:/usr/local/openjdk6/jre/lib/amd64:/usr/local/openjdk6/jre/../lib/amd64:/usr/java/packages/lib/amd64:/lib:/usr/lib:/usr/local/lib
[junit4:junit4]   2> 124 T319 oaz.Environment.logEnv Server environment:java.io.tmpdir=.
[junit4:junit4]   2> 124 T319 oaz.Environment.logEnv Server environment:java.compiler=<NA>
[junit4:junit4]   2> 125 T319 oaz.Environment.logEnv Server environment:os.name=FreeBSD
[junit4:junit4]   2> 125 T319 oaz.Environment.logEnv Server environment:os.arch=amd64
[junit4:junit4]   2> 125 T319 oaz.Environment.logEnv Server environment:os.version=9.0-RELEASE
[junit4:junit4]   2> 125 T319 oaz.Environment.logEnv Server environment:user.name=hudson
[junit4:junit4]   2> 125 T319 oaz.Environment.logEnv Server environment:user.home=/home/hudson
[junit4:junit4]   2> 125 T319 oaz.Environment.logEnv Server environment:user.dir=/usr/home/hudson/hudson-slave/workspace/Lucene-Solr-Tests-trunk-Java6/solr/build/solr-core/test/J0
[junit4:junit4]   2> 178 T319 oazs.ZooKeeperServer.setTickTime tickTime set to 1000
[junit4:junit4]   2> 178 T319 oazs.ZooKeeperServer.setMinSessionTimeout minSessionTimeout set to -1
[junit4:junit4]   2> 178 T319 oazs.ZooKeeperServer.setMaxSessionTimeout maxSessionTimeout set to -1
[junit4:junit4]   2> 184 T319 oazs.NIOServerCnxnFactory.configure binding to port 0.0.0.0/0.0.0.0:0
[junit4:junit4]   2> 225 T318 oasc.ZkTestServer.run start zk server on port:58185
[junit4:junit4]   2> 314 T319 oazsp.FileTxnSnapLog.save Snapshotting: 0x0 to /usr/home/hudson/hudson-slave/workspace/Lucene-Solr-Tests-trunk-Java6/solr/build/solr-core/test/J0/./org.apache.solr.cloud.SyncSliceTest-1355625313165/zookeeper/server1/data/version-2/snapshot.0
[junit4:junit4]   2> 393 T318 oaz.Environment.logEnv Client environment:zookeeper.version=3.4.5-1392090, built on 09/30/2012 17:52 GMT
[junit4:junit4]   2> 394 T318 oaz.Environment.logEnv Client environment:host.name=lucene.zones.apache.org
[junit4:junit4]   2> 395 T318 oaz.Environment.logEnv Client environment:java.version=1.6.0_32
[junit4:junit4]   2> 395 T318 oaz.Environment.logEnv Client environment:java.vendor=Sun Microsystems Inc.
[junit4:junit4]   2> 395 T318 oaz.Environment.logEnv Client environment:java.home=/usr/local/openjdk6/jre
[junit4:junit4]   2> 396 T318 oaz.Environment.logEnv Client environment:java.class.path=/usr/home/hudson/hudson-slave/workspace/Lucene-Solr-Tests-trunk-Java6/solr/build/solr-core/classes/test:/usr/home/hudson/hudson-slave/workspace/Lucene-Solr-Tests-trunk-Java6/solr/build/solr-test-framework/classes/java:/usr/home/hudson/hudson-slave/workspace/Lucene-Solr-Tests-trunk-Java6/solr/build/solr-core/test-files:/usr/home/hudson/hudson-slave/workspace/Lucene-Solr-Tests-trunk-Java6/lucene/build/test-framework/classes/java:/usr/home/hudson/hudson-slave/workspace/Lucene-Solr-Tests-trunk-Java6/lucene/build/codecs/classes/java:/usr/home/hudson/hudson-slave/workspace/Lucene-Solr-Tests-trunk-Java6/solr/build/solr-solrj/classes/java:/usr/home/hudson/hudson-slave/workspace/Lucene-Solr-Tests-trunk-Java6/solr/build/solr-core/classes/java:/usr/home/hudson/hudson-slave/workspace/Lucene-Solr-Tests-trunk-Java6/lucene/build/analysis/common/lucene-analyzers-common-5.0-SNAPSHOT.jar:/usr/home/hudson/hudson-slave/workspace/Lucene-Solr-Tests-trunk-Java6/lucene/build/analysis/kuromoji/lucene-analyzers-kuromoji-5.0-SNAPSHOT.jar:/usr/home/hudson/hudson-slave/workspace/Lucene-Solr-Tests-trunk-Java6/lucene/build/analysis/phonetic/lucene-analyzers-phonetic-5.0-SNAPSHOT.jar:/usr/home/hudson/hudson-slave/workspace/Lucene-Solr-Tests-trunk-Java6/lucene/build/highlighter/lucene-highlighter-5.0-SNAPSHOT.jar:/usr/home/hudson/hudson-slave/workspace/Lucene-Solr-Tests-trunk-Java6/lucene/build/memory/lucene-memory-5.0-SNAPSHOT.jar:/usr/home/hudson/hudson-slave/workspace/Lucene-Solr-Tests-trunk-Java6/lucene/build/misc/lucene-misc-5.0-SNAPSHOT.jar:/usr/home/hudson/hudson-slave/workspace/Lucene-Solr-Tests-trunk-Java6/lucene/build/spatial/lucene-spatial-5.0-SNAPSHOT.jar:/usr/home/hudson/hudson-slave/workspace/Lucene-Solr-Tests-trunk-Java6/lucene/build/suggest/lucene-suggest-5.0-SNAPSHOT.jar:/usr/home/hudson/hudson-slave/workspace/Lucene-Solr-Tests-trunk-Java6/lucene/build/grouping/lucene-grouping-5.0-SNAPSHOT.jar:/usr/home/hudson/hudson-slave/workspace/Lucene-Solr-Tests-trunk-Java6/lucene/build/queries/lucene-queries-5.0-SNAPSHOT.jar:/usr/home/hudson/hudson-slave/workspace/Lucene-Solr-Tests-trunk-Java6/lucene/build/queryparser/lucene-queryparser-5.0-SNAPSHOT.jar:/usr/home/hudson/hudson-slave/workspace/Lucene-Solr-Tests-trunk-Java6/solr/core/lib/cglib-nodep-2.2.jar:/usr/home/hudson/hudson-slave/workspace/Lucene-Solr-Tests-trunk-Java6/solr/core/lib/commons-cli-1.2.jar:/usr/home/hudson/hudson-slave/workspace/Lucene-Solr-Tests-trunk-Java6/solr/core/lib/commons-codec-1.7.jar:/usr/home/hudson/hudson-slave/workspace/Lucene-Solr-Tests-trunk-Java6/solr/core/lib/commons-fileupload-1.2.1.jar:/usr/home/hudson/hudson-slave/workspace/Lucene-Solr-Tests-trunk-Java6/solr/core/lib/commons-lang-2.6.jar:/usr/home/hudson/hudson-slave/workspace/Lucene-Solr-Tests-trunk-Java6/solr/core/lib/easymock-3.0.jar:/usr/home/hudson/hudson-slave/workspace/Lucene-Solr-Tests-trunk-Java6/solr/core/lib/guava-13.0.1.jar:/usr/home/hudson/hudson-slave/workspace/Lucene-Solr-Tests-trunk-Java6/solr/core/lib/javax.servlet-api-3.0.1.jar:/usr/home/hudson/hudson-slave/workspace/Lucene-Solr-Tests-trunk-Java6/solr/core/lib/metrics-core-2.1.2.jar:/usr/home/hudson/hudson-slave/workspace/Lucene-Solr-Tests-trunk-Java6/solr/core/lib/objenesis-1.2.jar:/usr/home/hudson/hudson-slave/workspace/Lucene-Solr-Tests-trunk-Java6/solr/core/lib/spatial4j-0.3.jar:/usr/home/hudson/hudson-slave/workspace/Lucene-Solr-Tests-trunk-Java6/solr/solrj/lib/commons-io-2.1.jar:/usr/home/hudson/hudson-slave/workspace/Lucene-Solr-Tests-trunk-Java6/solr/solrj/lib/httpclient-4.1.3.jar:/usr/home/hudson/hudson-slave/workspace/Lucene-Solr-Tests-trunk-Java6/solr/solrj/lib/httpcore-4.1.4.jar:/usr/home/hudson/hudson-slave/workspace/Lucene-Solr-Tests-trunk-Java6/solr/solrj/lib/httpmime-4.1.3.jar:/usr/home/hudson/hudson-slave/workspace/Lucene-Solr-Tests-trunk-Java6/solr/solrj/lib/jcl-over-slf4j-1.6.4.jar:/usr/home/hudson/hudson-slave/workspace/Lucene-Solr-Tests-trunk-Java6/solr/solrj/lib/log4j-over-slf4j-1.6.4.jar:/usr/home/hudson/hudson-slave/workspace/Lucene-Solr-Tests-trunk-Java6/solr/solrj/lib/slf4j-api-1.6.4.jar:/usr/home/hudson/hudson-slave/workspace/Lucene-Solr-Tests-trunk-Java6/solr/solrj/lib/slf4j-jdk14-1.6.4.jar:/usr/home/hudson/hudson-slave/workspace/Lucene-Solr-Tests-trunk-Java6/solr/solrj/lib/wstx-asl-3.2.7.jar:/usr/home/hudson/hudson-slave/workspace/Lucene-Solr-Tests-trunk-Java6/solr/solrj/lib/zookeeper-3.4.5.jar:/usr/home/hudson/hudson-slave/workspace/Lucene-Solr-Tests-trunk-Java6/solr/example/lib/jetty-continuation-8.1.8.v20121106.jar:/usr/home/hudson/hudson-slave/workspace/Lucene-Solr-Tests-trunk-Java6/solr/example/lib/jetty-deploy-8.1.8.v20121106.jar:/usr/home/hudson/hudson-slave/workspace/Lucene-Solr-Tests-trunk-Java6/solr/example/lib/jetty-http-8.1.8.v20121106.jar:/usr/home/hudson/hudson-slave/workspace/Lucene-Solr-Tests-trunk-Java6/solr/example/lib/jetty-io-8.1.8.v20121106.jar:/usr/home/hudson/hudson-slave/workspace/Lucene-Solr-Tests-trunk-Java6/solr/example/lib/jetty-jmx-8.1.8.v20121106.jar:/usr/home/hudson/hudson-slave/workspace/Lucene-Solr-Tests-trunk-Java6/solr/example/lib/jetty-security-8.1.8.v20121106.jar:/usr/home/hudson/hudson-slave/workspace/Lucene-Solr-Tests-trunk-Java6/solr/example/lib/jetty-server-8.1.8.v20121106.jar:/usr/home/hudson/hudson-slave/workspace/Lucene-Solr-Tests-trunk-Java6/solr/example/lib/jetty-servlet-8.1.8.v20121106.jar:/usr/home/hudson/hudson-slave/workspace/Lucene-Solr-Tests-trunk-Java6/solr/example/lib/jetty-util-8.1.8.v20121106.jar:/usr/home/hudson/hudson-slave/workspace/Lucene-Solr-Tests-trunk-Java6/solr/example/lib/jetty-webapp-8.1.8.v20121106.jar:/usr/home/hudson/hudson-slave/workspace/Lucene-Solr-Tests-trunk-Java6/solr/example/lib/jetty-xml-8.1.8.v20121106.jar:/usr/home/hudson/hudson-slave/workspace/Lucene-Solr-Tests-trunk-Java6/solr/example/lib/servlet-api-3.0.jar:/usr/home/hudson/hudson-slave/workspace/Lucene-Solr-Tests-trunk-Java6/solr/example/example-DIH/solr/db/lib/derby-10.9.1.0.jar:/usr/home/hudson/hudson-slave/workspace/Lucene-Solr-Tests-trunk-Java6/solr/example/example-DIH/solr/db/lib/hsqldb-1.8.0.10.jar:/usr/home/hudson/hudson-slave/workspace/Lucene-Solr-Tests-trunk-Java6/lucene/build/core/classes/java:/usr/home/hudson/hudson-slave/workspace/Lucene-Solr-Tests-trunk-Java6/lucene/test-framework/lib/junit-4.10.jar:/usr/home/hudson/hudson-slave/workspace/Lucene-Solr-Tests-trunk-Java6/lucene/test-framework/lib/randomizedtesting-runner-2.0.6.jar:/home/hudson/hudson-slave/tools/Ant/ant-1.8.2/lib/ant-launcher.jar:/home/hudson/.ant/lib/ivy-2.2.0.jar:/home/hudson/hudson-slave/tools/Ant/ant-1.8.2/lib/ant-apache-regexp.jar:/home/hudson/hudson-slave/tools/Ant/ant-1.8.2/lib/ant-junit.jar:/home/hudson/hudson-slave/tools/Ant/ant-1.8.2/lib/ant-apache-bsf.jar:/home/hudson/hudson-slave/tools/Ant/ant-1.8.2/lib/ant-commons-net.jar:/home/hudson/hudson-slave/tools/Ant/ant-1.8.2/lib/ant-antlr.jar:/home/hudson/hudson-slave/tools/Ant/ant-1.8.2/lib/ant-apache-log4j.jar:/home/hudson/hudson-slave/tools/Ant/ant-1.8.2/lib/ant-commons-logging.jar:/home/hudson/hudson-slave/tools/Ant/ant-1.8.2/lib/ant-apache-xalan2.jar:/home/hudson/hudson-slave/tools/Ant/ant-1.8.2/lib/ant-apache-oro.jar:/home/hudson/hudson-slave/tools/Ant/ant-1.8.2/lib/ant-junit4.jar:/home/hudson/hudson-slave/tools/Ant/ant-1.8.2/lib/ant-netrexx.jar:/home/hudson/hudson-slave/tools/Ant/ant-1.8.2/lib/ant-swing.jar:/home/hudson/hudson-slave/tools/Ant/ant-1.8.2/lib/ant-javamail.jar:/home/hudson/hudson-slave/tools/Ant/ant-1.8.2/lib/ant-jsch.jar:/home/hudson/hudson-slave/tools/Ant/ant-1.8.2/lib/ant-jmf.jar:/home/hudson/hudson-slave/tools/Ant/ant-1.8.2/lib/ant.jar:/home/hudson/hudson-slave/tools/Ant/ant-1.8.2/lib/ant-apache-bcel.jar:/home/hudson/hudson-slave/tools/Ant/ant-1.8.2/lib/ant-jai.jar:/home/hudson/hudson-slave/tools/Ant/ant-1.8.2/lib/ant-testutil.jar:/home/hudson/hudson-slave/tools/Ant/ant-1.8.2/lib/ant-apache-resolver.jar:/home/hudson/hudson-slave/tools/Ant/ant-1.8.2/lib/ant-jdepend.jar:/usr/local/openjdk6/lib/tools.jar:/home/hudson/.ivy2/cache/com.carrotsearch.randomizedtesting/junit4-ant/jars/junit4-ant-2.0.6.jar
[junit4:junit4]   2> 397 T318 oaz.Environment.logEnv Client environment:java.library.path=/usr/local/openjdk6/jre/lib/amd64/server:/usr/local/openjdk6/jre/lib/amd64:/usr/local/openjdk6/jre/../lib/amd64:/usr/java/packages/lib/amd64:/lib:/usr/lib:/usr/local/lib
[junit4:junit4]   2> 398 T318 oaz.Environment.logEnv Client environment:java.io.tmpdir=.
[junit4:junit4]   2> 398 T318 oaz.Environment.logEnv Client environment:java.compiler=<NA>
[junit4:junit4]   2> 399 T318 oaz.Environment.logEnv Client environment:os.name=FreeBSD
[junit4:junit4]   2> 399 T318 oaz.Environment.logEnv Client environment:os.arch=amd64
[junit4:junit4]   2> 400 T318 oaz.Environment.logEnv Client environment:os.version=9.0-RELEASE
[junit4:junit4]   2> 400 T318 oaz.Environment.logEnv Client environment:user.name=hudson
[junit4:junit4]   2> 401 T318 oaz.Environment.logEnv Client environment:user.home=/home/hudson
[junit4:junit4]   2> 401 T318 oaz.Environment.logEnv Client environment:user.dir=/usr/home/hudson/hudson-slave/workspace/Lucene-Solr-Tests-trunk-Java6/solr/build/solr-core/test/J0
[junit4:junit4]   2> 415 T318 oaz.ZooKeeper.<init> Initiating client connection, connectString=127.0.0.1:58185 sessionTimeout=10000 watcher=org.apache.solr.common.cloud.ConnectionManager@6f557daf
[junit4:junit4]   2> 581 T318 oascc.ConnectionManager.waitForConnected Waiting for client to connect to ZooKeeper
[junit4:junit4]   2> 606 T324 oaz.ClientCnxn$SendThread.logStartConnect Opening socket connection to server localhost/127.0.0.1:58185. Will not attempt to authenticate using SASL (access denied (javax.security.auth.AuthPermission getLoginConfiguration))
[junit4:junit4]   2> 610 T324 oaz.ClientCnxn$SendThread.primeConnection Socket connection established to localhost/127.0.0.1:58185, initiating session
[junit4:junit4]   2> 610 T320 oazs.NIOServerCnxnFactory.run Accepted socket connection from /140.211.11.196:58186
[junit4:junit4]   2> 645 T320 oazs.ZooKeeperServer.processConnectRequest Client attempting to establish new session at /140.211.11.196:58186
[junit4:junit4]   2> 662 T322 oazsp.FileTxnLog.append Creating new log file: log.1
[junit4:junit4]   2> 748 T322 oazs.ZooKeeperServer.finishSessionInit Established session 0x13ba190b50e0000 with negotiated timeout 10000 for client /140.211.11.196:58186
[junit4:junit4]   2> 748 T324 oaz.ClientCnxn$SendThread.onConnected Session establishment complete on server localhost/127.0.0.1:58185, sessionid = 0x13ba190b50e0000, negotiated timeout = 10000
[junit4:junit4]   2> 757 T325 oascc.ConnectionManager.process Watcher org.apache.solr.common.cloud.ConnectionManager@6f557daf name:ZooKeeperConnection Watcher:127.0.0.1:58185 got event WatchedEvent state:SyncConnected type:None path:null path:null type:None
[junit4:junit4]   2> 757 T318 oascc.ConnectionManager.waitForConnected Client is connected to ZooKeeper
[junit4:junit4]   2> 762 T318 oascc.SolrZkClient.makePath makePath: /solr
[junit4:junit4]   2> 851 T323 oazs.PrepRequestProcessor.pRequest2Txn Processed session termination for sessionid: 0x13ba190b50e0000
[junit4:junit4]   2> 852 T325 oaz.ClientCnxn$EventThread.run EventThread shut down
[junit4:junit4]   2> 852 T318 oaz.ZooKeeper.close Session: 0x13ba190b50e0000 closed
[junit4:junit4]   2> 853 T320 oazs.NIOServerCnxn.closeSock Closed socket connection for client /140.211.11.196:58186 which had sessionid 0x13ba190b50e0000
[junit4:junit4]   2> 853 T318 oaz.ZooKeeper.<init> Initiating client connection, connectString=127.0.0.1:58185/solr sessionTimeout=10000 watcher=org.apache.solr.common.cloud.ConnectionManager@175f15a7
[junit4:junit4]   2> 855 T318 oascc.ConnectionManager.waitForConnected Waiting for client to connect to ZooKeeper
[junit4:junit4]   2> 855 T326 oaz.ClientCnxn$SendThread.logStartConnect Opening socket connection to server localhost/127.0.0.1:58185. Will not attempt to authenticate using SASL (access denied (javax.security.auth.AuthPermission getLoginConfiguration))
[junit4:junit4]   2> 856 T326 oaz.ClientCnxn$SendThread.primeConnection Socket connection established to localhost/127.0.0.1:58185, initiating session
[junit4:junit4]   2> 856 T320 oazs.NIOServerCnxnFactory.run Accepted socket connection from /140.211.11.196:58187
[junit4:junit4]   2> 856 T320 oazs.ZooKeeperServer.processConnectRequest Client attempting to establish new session at /140.211.11.196:58187
[junit4:junit4]   2> 858 T322 oazs.ZooKeeperServer.finishSessionInit Established session 0x13ba190b50e0001 with negotiated timeout 10000 for client /140.211.11.196:58187
[junit4:junit4]   2> 858 T326 oaz.ClientCnxn$SendThread.onConnected Session establishment complete on server localhost/127.0.0.1:58185, sessionid = 0x13ba190b50e0001, negotiated timeout = 10000
[junit4:junit4]   2> 858 T327 oascc.ConnectionManager.process Watcher org.apache.solr.common.cloud.ConnectionManager@175f15a7 name:ZooKeeperConnection Watcher:127.0.0.1:58185/solr got event WatchedEvent state:SyncConnected type:None path:null path:null type:None
[junit4:junit4]   2> 859 T318 oascc.ConnectionManager.waitForConnected Client is connected to ZooKeeper
[junit4:junit4]   2> 865 T318 oascc.SolrZkClient.makePath makePath: /collections/collection1
[junit4:junit4]   2> 872 T318 oascc.SolrZkClient.makePath makePath: /collections/collection1/shards
[junit4:junit4]   2> 877 T318 oascc.SolrZkClient.makePath makePath: /collections/control_collection
[junit4:junit4]   2> 882 T318 oascc.SolrZkClient.makePath makePath: /collections/control_collection/shards
[junit4:junit4]   2> 887 T318 oasc.AbstractZkTestCase.putConfig put /usr/home/hudson/hudson-slave/workspace/Lucene-Solr-Tests-trunk-Java6/solr/build/solr-core/test-files/solr/collection1/conf/solrconfig.xml to /configs/conf1/solrconfig.xml
[junit4:junit4]   2> 918 T318 oascc.SolrZkClient.makePath makePath: /configs/conf1/solrconfig.xml
[junit4:junit4]   2> 933 T318 oasc.AbstractZkTestCase.putConfig put /usr/home/hudson/hudson-slave/workspace/Lucene-Solr-Tests-trunk-Java6/solr/build/solr-core/test-files/solr/collection1/conf/schema.xml to /configs/conf1/schema.xml
[junit4:junit4]   2> 935 T318 oascc.SolrZkClient.makePath makePath: /configs/conf1/schema.xml
[junit4:junit4]   2> 1042 T318 oasc.AbstractZkTestCase.putConfig put /usr/home/hudson/hudson-slave/workspace/Lucene-Solr-Tests-trunk-Java6/solr/build/solr-core/test-files/solr/collection1/conf/stopwords.txt to /configs/conf1/stopwords.txt
[junit4:junit4]   2> 1043 T318 oascc.SolrZkClient.makePath makePath: /configs/conf1/stopwords.txt
[junit4:junit4]   2> 1048 T318 oasc.AbstractZkTestCase.putConfig put /usr/home/hudson/hudson-slave/workspace/Lucene-Solr-Tests-trunk-Java6/solr/build/solr-core/test-files/solr/collection1/conf/protwords.txt to /configs/conf1/protwords.txt
[junit4:junit4]   2> 1049 T318 oascc.SolrZkClient.makePath makePath: /configs/conf1/protwords.txt
[junit4:junit4]   2> 1054 T318 oasc.AbstractZkTestCase.putConfig put /usr/home/hudson/hudson-slave/workspace/Lucene-Solr-Tests-trunk-Java6/solr/build/solr-core/test-files/solr/collection1/conf/currency.xml to /configs/conf1/currency.xml
[junit4:junit4]   2> 1054 T318 oascc.SolrZkClient.makePath makePath: /configs/conf1/currency.xml
[junit4:junit4]   2> 1059 T318 oasc.AbstractZkTestCase.putConfig put /usr/home/hudson/hudson-slave/workspace/Lucene-Solr-Tests-trunk-Java6/solr/build/solr-core/test-files/solr/collection1/conf/open-exchange-rates.json to /configs/conf1/open-exchange-rates.json
[junit4:junit4]   2> 1060 T318 oascc.SolrZkClient.makePath makePath: /configs/conf1/open-exchange-rates.json
[junit4:junit4]   2> 1065 T318 oasc.AbstractZkTestCase.putConfig put /usr/home/hudson/hudson-slave/workspace/Lucene-Solr-Tests-trunk-Java6/solr/build/solr-core/test-files/solr/collection1/conf/mapping-ISOLatin1Accent.txt to /configs/conf1/mapping-ISOLatin1Accent.txt
[junit4:junit4]   2> 1066 T318 oascc.SolrZkClient.makePath makePath: /configs/conf1/mapping-ISOLatin1Accent.txt
[junit4:junit4]   2> 1072 T318 oasc.AbstractZkTestCase.putConfig put /usr/home/hudson/hudson-slave/workspace/Lucene-Solr-Tests-trunk-Java6/solr/build/solr-core/test-files/solr/collection1/conf/old_synonyms.txt to /configs/conf1/old_synonyms.txt
[junit4:junit4]   2> 1073 T318 oascc.SolrZkClient.makePath makePath: /configs/conf1/old_synonyms.txt
[junit4:junit4]   2> 1077 T318 oasc.AbstractZkTestCase.putConfig put /usr/home/hudson/hudson-slave/workspace/Lucene-Solr-Tests-trunk-Java6/solr/build/solr-core/test-files/solr/collection1/conf/synonyms.txt to /configs/conf1/synonyms.txt
[junit4:junit4]   2> 1078 T318 oascc.SolrZkClient.makePath makePath: /configs/conf1/synonyms.txt
[junit4:junit4]   2> 1083 T323 oazs.PrepRequestProcessor.pRequest2Txn Processed session termination for sessionid: 0x13ba190b50e0001
[junit4:junit4]   2> 1084 T327 oaz.ClientCnxn$EventThread.run EventThread shut down
[junit4:junit4]   2> 1085 T320 oazs.NIOServerCnxn.closeSock Closed socket connection for client /140.211.11.196:58187 which had sessionid 0x13ba190b50e0001
[junit4:junit4]   2> 1084 T318 oaz.ZooKeeper.close Session: 0x13ba190b50e0001 closed
[junit4:junit4]   2> 1265 T318 oejs.Server.doStart jetty-8.1.8.v20121106
[junit4:junit4]   2> 1269 T318 oejs.AbstractConnector.doStart Started SocketConnector@127.0.0.1:58188
[junit4:junit4]   2> 1270 T318 oasc.SolrResourceLoader.locateSolrHome JNDI not configured for solr (NoInitialContextEx)
[junit4:junit4]   2> 1270 T318 oasc.SolrResourceLoader.locateSolrHome using system property solr.solr.home: /usr/home/hudson/hudson-slave/workspace/Lucene-Solr-Tests-trunk-Java6/solr/build/solr-core/test/J0/./org.apache.solr.cloud.SyncSliceTest-controljetty-1355625314243
[junit4:junit4]   2> 1271 T318 oasc.SolrResourceLoader.<init> new SolrResourceLoader for deduced Solr Home: '/usr/home/hudson/hudson-slave/workspace/Lucene-Solr-Tests-trunk-Java6/solr/build/solr-core/test/J0/./org.apache.solr.cloud.SyncSliceTest-controljetty-1355625314243/'
[junit4:junit4]   2> 1309 T318 oass.SolrDispatchFilter.init SolrDispatchFilter.init()
[junit4:junit4]   2> 1309 T318 oasc.SolrResourceLoader.locateSolrHome JNDI not configured for solr (NoInitialContextEx)
[junit4:junit4]   2> 1310 T318 oasc.SolrResourceLoader.locateSolrHome using system property solr.solr.home: /usr/home/hudson/hudson-slave/workspace/Lucene-Solr-Tests-trunk-Java6/solr/build/solr-core/test/J0/./org.apache.solr.cloud.SyncSliceTest-controljetty-1355625314243
[junit4:junit4]   2> 1310 T318 oasc.CoreContainer$Initializer.initialize looking for solr.xml: /usr/home/hudson/hudson-slave/workspace/Lucene-Solr-Tests-trunk-Java6/solr/build/solr-core/test/J0/./org.apache.solr.cloud.SyncSliceTest-controljetty-1355625314243/solr.xml
[junit4:junit4]   2> 1311 T318 oasc.CoreContainer.<init> New CoreContainer 4129454
[junit4:junit4]   2> 1312 T318 oasc.CoreContainer.load Loading CoreContainer using Solr Home: '/usr/home/hudson/hudson-slave/workspace/Lucene-Solr-Tests-trunk-Java6/solr/build/solr-core/test/J0/./org.apache.solr.cloud.SyncSliceTest-controljetty-1355625314243/'
[junit4:junit4]   2> 1312 T318 oasc.SolrResourceLoader.<init> new SolrResourceLoader for directory: '/usr/home/hudson/hudson-slave/workspace/Lucene-Solr-Tests-trunk-Java6/solr/build/solr-core/test/J0/./org.apache.solr.cloud.SyncSliceTest-controljetty-1355625314243/'
[junit4:junit4]   2> 1340 T318 oasc.CoreContainer.load Registering Log Listener
[junit4:junit4]   2> 1358 T318 oasc.CoreContainer.initZooKeeper Zookeeper client=127.0.0.1:58185/solr
[junit4:junit4]   2> 1396 T318 oasc.ZkController.checkChrootPath zkHost includes chroot
[junit4:junit4]   2> 1397 T318 oaz.ZooKeeper.<init> Initiating client connection, connectString=127.0.0.1:58185 sessionTimeout=60000 watcher=org.apache.solr.common.cloud.ConnectionManager@16100f31
[junit4:junit4]   2> 1399 T318 oascc.ConnectionManager.waitForConnected Waiting for client to connect to ZooKeeper
[junit4:junit4]   2> 1399 T337 oaz.ClientCnxn$SendThread.logStartConnect Opening socket connection to server localhost/127.0.0.1:58185. Will not attempt to authenticate using SASL (access denied (javax.security.auth.AuthPermission getLoginConfiguration))
[junit4:junit4]   2> 1400 T337 oaz.ClientCnxn$SendThread.primeConnection Socket connection established to localhost/127.0.0.1:58185, initiating session
[junit4:junit4]   2> 1401 T320 oazs.NIOServerCnxnFactory.run Accepted socket connection from /140.211.11.196:58189
[junit4:junit4]   2> 1401 T320 oazs.ZooKeeperServer.processConnectRequest Client attempting to establish new session at /140.211.11.196:58189
[junit4:junit4]   2> 1405 T322 oazs.ZooKeeperServer.finishSessionInit Established session 0x13ba190b50e0002 with negotiated timeout 20000 for client /140.211.11.196:58189
[junit4:junit4]   2> 1406 T337 oaz.ClientCnxn$SendThread.onConnected Session establishment complete on server localhost/127.0.0.1:58185, sessionid = 0x13ba190b50e0002, negotiated timeout = 20000
[junit4:junit4]   2> 1406 T338 oascc.ConnectionManager.process Watcher org.apache.solr.common.cloud.ConnectionManager@16100f31 name:ZooKeeperConnection Watcher:127.0.0.1:58185 got event WatchedEvent state:SyncConnected type:None path:null path:null type:None
[junit4:junit4]   2> 1406 T318 oascc.ConnectionManager.waitForConnected Client is connected to ZooKeeper
[junit4:junit4]   2> 1408 T323 oazs.PrepRequestProcessor.pRequest2Txn Processed session termination for sessionid: 0x13ba190b50e0002
[junit4:junit4]   2> 1409 T338 oaz.ClientCnxn$EventThread.run EventThread shut down
[junit4:junit4]   2> 1409 T320 oazs.NIOServerCnxn.closeSock Closed socket connection for client /140.211.11.196:58189 which had sessionid 0x13ba190b50e0002
[junit4:junit4]   2> 1409 T318 oaz.ZooKeeper.close Session: 0x13ba190b50e0002 closed
[junit4:junit4]   2> 1414 T318 oaz.ZooKeeper.<init> Initiating client connection, connectString=127.0.0.1:58185/solr sessionTimeout=8000 watcher=org.apache.solr.common.cloud.ConnectionManager@12fc183e
[junit4:junit4]   2> 1415 T318 oascc.ConnectionManager.waitForConnected Waiting for client to connect to ZooKeeper
[junit4:junit4]   2> 1416 T339 oaz.ClientCnxn$SendThread.logStartConnect Opening socket connection to server localhost/127.0.0.1:58185. Will not attempt to authenticate using SASL (access denied (javax.security.auth.AuthPermission getLoginConfiguration))
[junit4:junit4]   2> 1416 T339 oaz.ClientCnxn$SendThread.primeConnection Socket connection established to localhost/127.0.0.1:58185, initiating session
[junit4:junit4]   2> 1416 T320 oazs.NIOServerCnxnFactory.run Accepted socket connection from /140.211.11.196:58190
[junit4:junit4]   2> 1417 T320 oazs.ZooKeeperServer.processConnectRequest Client attempting to establish new session at /140.211.11.196:58190
[junit4:junit4]   2> 1418 T322 oazs.ZooKeeperServer.finishSessionInit Established session 0x13ba190b50e0003 with negotiated timeout 8000 for client /140.211.11.196:58190
[junit4:junit4]   2> 1418 T339 oaz.ClientCnxn$SendThread.onConnected Session establishment complete on server localhost/127.0.0.1:58185, sessionid = 0x13ba190b50e0003, negotiated timeout = 8000
[junit4:junit4]   2> 1419 T340 oascc.ConnectionManager.process Watcher org.apache.solr.common.cloud.ConnectionManager@12fc183e name:ZooKeeperConnection Watcher:127.0.0.1:58185/solr got event WatchedEvent state:SyncConnected type:None path:null path:null type:None
[junit4:junit4]   2> 1419 T318 oascc.ConnectionManager.waitForConnected Client is connected to ZooKeeper
[junit4:junit4]   2> 1439 T323 oazs.PrepRequestProcessor.pRequest Got user-level KeeperException when processing sessionid:0x13ba190b50e0003 type:create cxid:0x2 zxid:0x1a txntype:-1 reqpath:n/a Error Path:/solr/overseer Error:KeeperErrorCode = NodeExists for /solr/overseer
[junit4:junit4]   2> 1450 T318 oascc.SolrZkClient.makePath makePath: /live_nodes
[junit4:junit4]   2> 1454 T318 oasc.ZkController.createEphemeralLiveNode Register node as live in ZooKeeper:/live_nodes/127.0.0.1:58188_zmed
[junit4:junit4]   2> 1461 T323 oazs.PrepRequestProcessor.pRequest Got user-level KeeperException when processing sessionid:0x13ba190b50e0003 type:delete cxid:0x7 zxid:0x1c txntype:-1 reqpath:n/a Error Path:/solr/live_nodes/127.0.0.1:58188_zmed Error:KeeperErrorCode = NoNode for /solr/live_nodes/127.0.0.1:58188_zmed
[junit4:junit4]   2> 1462 T318 oascc.SolrZkClient.makePath makePath: /live_nodes/127.0.0.1:58188_zmed
[junit4:junit4]   2> 1467 T318 oashc.HttpShardHandlerFactory.getParameter Setting socketTimeout to: 0
[junit4:junit4]   2> 1467 T318 oashc.HttpShardHandlerFactory.getParameter Setting urlScheme to: http://
[junit4:junit4]   2> 1468 T318 oashc.HttpShardHandlerFactory.getParameter Setting connTimeout to: 0
[junit4:junit4]   2> 1468 T318 oashc.HttpShardHandlerFactory.getParameter Setting maxConnectionsPerHost to: 20
[junit4:junit4]   2> 1469 T318 oashc.HttpShardHandlerFactory.getParameter Setting corePoolSize to: 0
[junit4:junit4]   2> 1469 T318 oashc.HttpShardHandlerFactory.getParameter Setting maximumPoolSize to: 2147483647
[junit4:junit4]   2> 1469 T318 oashc.HttpShardHandlerFactory.getParameter Setting maxThreadIdleTime to: 5
[junit4:junit4]   2> 1470 T318 oashc.HttpShardHandlerFactory.getParameter Setting sizeOfQueue to: -1
[junit4:junit4]   2> 1470 T318 oashc.HttpShardHandlerFactory.getParameter Setting fairnessPolicy to: false
[junit4:junit4]   2> 1471 T318 oascsi.HttpClientUtil.createClient Creating new http client, config:maxConnectionsPerHost=20&maxConnections=10000&socketTimeout=0&connTimeout=0&retry=false
[junit4:junit4]   2> 1488 T318 oascc.SolrZkClient.makePath makePath: /overseer_elect/election
[junit4:junit4]   2> 1516 T323 oazs.PrepRequestProcessor.pRequest Got user-level KeeperException when processing sessionid:0x13ba190b50e0003 type:delete cxid:0x15 zxid:0x21 txntype:-1 reqpath:n/a Error Path:/solr/overseer_elect/leader Error:KeeperErrorCode = NoNode for /solr/overseer_elect/leader
[junit4:junit4]   2> 1517 T318 oascc.SolrZkClient.makePath makePath: /overseer_elect/leader
[junit4:junit4]   2> 1521 T318 oasc.Overseer.start Overseer (id=88842260548812803-127.0.0.1:58188_zmed-n_0000000000) starting
[junit4:junit4]   2> 1521 T323 oazs.PrepRequestProcessor.pRequest Got user-level KeeperException when processing sessionid:0x13ba190b50e0003 type:create cxid:0x1a zxid:0x23 txntype:-1 reqpath:n/a Error Path:/solr/overseer Error:KeeperErrorCode = NodeExists for /solr/overseer
[junit4:junit4]   2> 1548 T323 oazs.PrepRequestProcessor.pRequest Got user-level KeeperException when processing sessionid:0x13ba190b50e0003 type:create cxid:0x1b zxid:0x24 txntype:-1 reqpath:n/a Error Path:/solr/overseer Error:KeeperErrorCode = NodeExists for /solr/overseer
[junit4:junit4]   2> 1550 T323 oazs.PrepRequestProcessor.pRequest Got user-level KeeperException when processing sessionid:0x13ba190b50e0003 type:create cxid:0x1c zxid:0x25 txntype:-1 reqpath:n/a Error Path:/solr/overseer Error:KeeperErrorCode = NodeExists for /solr/overseer
[junit4:junit4]   2> 1556 T323 oazs.PrepRequestProcessor.pRequest Got user-level KeeperException when processing sessionid:0x13ba190b50e0003 type:create cxid:0x1d zxid:0x26 txntype:-1 reqpath:n/a Error Path:/solr/overseer Error:KeeperErrorCode = NodeExists for /solr/overseer
[junit4:junit4]   2> 1557 T342 oasc.OverseerCollectionProcessor.run Process current queue of collection messages
[junit4:junit4]   2> 1563 T318 oascc.SolrZkClient.makePath makePath: /clusterstate.json
[junit4:junit4]   2> 1566 T318 oascc.ZkStateReader.createClusterStateWatchersAndUpdate Updating cluster state from ZooKeeper... 
[junit4:junit4]   2> 1590 T341 oasc.Overseer$ClusterStateUpdater.run Starting to work on the main queue
[junit4:junit4]   2> 1602 T343 oasc.CoreContainer.create Creating SolrCore 'collection1' using instanceDir: /usr/home/hudson/hudson-slave/workspace/Lucene-Solr-Tests-trunk-Java6/solr/build/solr-core/test/J0/./org.apache.solr.cloud.SyncSliceTest-controljetty-1355625314243/collection1
[junit4:junit4]   2> 1602 T343 oasc.ZkController.createCollectionZkNode Check for collection zkNode:control_collection
[junit4:junit4]   2> 1603 T343 oasc.ZkController.createCollectionZkNode Collection zkNode exists
[junit4:junit4]   2> 1604 T343 oasc.ZkController.readConfigName Load collection config from:/collections/control_collection
[junit4:junit4]   2> 1606 T343 oasc.SolrResourceLoader.<init> new SolrResourceLoader for directory: '/usr/home/hudson/hudson-slave/workspace/Lucene-Solr-Tests-trunk-Java6/solr/build/solr-core/test/J0/./org.apache.solr.cloud.SyncSliceTest-controljetty-1355625314243/collection1/'
[junit4:junit4]   2> 1607 T343 oasc.SolrResourceLoader.replaceClassLoader Adding 'file:/usr/home/hudson/hudson-slave/workspace/Lucene-Solr-Tests-trunk-Java6/solr/build/solr-core/test/J0/org.apache.solr.cloud.SyncSliceTest-controljetty-1355625314243/collection1/lib/classes/' to classloader
[junit4:junit4]   2> 1608 T343 oasc.SolrResourceLoader.replaceClassLoader Adding 'file:/usr/home/hudson/hudson-slave/workspace/Lucene-Solr-Tests-trunk-Java6/solr/build/solr-core/test/J0/org.apache.solr.cloud.SyncSliceTest-controljetty-1355625314243/collection1/lib/README' to classloader
[junit4:junit4]   2> 1676 T343 oasc.SolrConfig.<init> Using Lucene MatchVersion: LUCENE_50
[junit4:junit4]   2> 1755 T343 oasc.SolrConfig.<init> Loaded SolrConfig: solrconfig.xml
[junit4:junit4]   2> 1856 T343 oass.IndexSchema.readSchema Reading Solr Schema
[junit4:junit4]   2> 1865 T343 oass.IndexSchema.readSchema Schema name=test
[junit4:junit4]   2> 2532 T343 oass.OpenExchangeRatesOrgProvider.init Initialized with rates=open-exchange-rates.json, refreshInterval=1440.
[junit4:junit4]   2> 2546 T343 oass.IndexSchema.readSchema default search field in schema is text
[junit4:junit4]   2> 2551 T343 oass.IndexSchema.readSchema unique key field: id
[junit4:junit4]   2> 2578 T343 oass.FileExchangeRateProvider.reload Reloading exchange rates from file currency.xml
[junit4:junit4]   2> 2585 T343 oass.FileExchangeRateProvider.reload Reloading exchange rates from file currency.xml
[junit4:junit4]   2> 2592 T343 oass.OpenExchangeRatesOrgProvider.reload Reloading exchange rates from open-exchange-rates.json
[junit4:junit4]   2> 2594 T343 oass.OpenExchangeRatesOrgProvider.reload Reloading exchange rates from open-exchange-rates.json
[junit4:junit4]   2> 2596 T343 oasc.SolrCore.<init> [collection1] Opening new SolrCore at /usr/home/hudson/hudson-slave/workspace/Lucene-Solr-Tests-trunk-Java6/solr/build/solr-core/test/J0/./org.apache.solr.cloud.SyncSliceTest-controljetty-1355625314243/collection1/, dataDir=./org.apache.solr.cloud.SyncSliceTest-1355625313165/control/data/
[junit4:junit4]   2> 2602 T343 oasc.JmxMonitoredMap.<init> JMX monitoring is enabled. Adding Solr mbeans to JMX Server: com.sun.jmx.mbeanserver.JmxMBeanServer@37e55794
[junit4:junit4]   2> 2602 T343 oasc.SolrCore.initDirectoryFactory solr.NRTCachingDirectoryFactory
[junit4:junit4]   2> 2604 T343 oasc.CachingDirectoryFactory.get return new directory for /usr/home/hudson/hudson-slave/workspace/Lucene-Solr-Tests-trunk-Java6/solr/build/solr-core/test/J0/./org.apache.solr.cloud.SyncSliceTest-1355625313165/control/data forceNew:false
[junit4:junit4]   2> 2605 T343 oasc.CachingDirectoryFactory.close Releasing directory:/usr/home/hudson/hudson-slave/workspace/Lucene-Solr-Tests-trunk-Java6/solr/build/solr-core/test/J0/./org.apache.solr.cloud.SyncSliceTest-1355625313165/control/data
[junit4:junit4]   2> 2605 T343 oasc.SolrCore.getNewIndexDir New index directory detected: old=null new=./org.apache.solr.cloud.SyncSliceTest-1355625313165/control/data/index/
[junit4:junit4]   2> 2606 T343 oasc.SolrCore.initIndex WARNING [collection1] Solr index directory './org.apache.solr.cloud.SyncSliceTest-1355625313165/control/data/index' doesn't exist. Creating new index...
[junit4:junit4]   2> 2608 T343 oasc.CachingDirectoryFactory.get return new directory for /usr/home/hudson/hudson-slave/workspace/Lucene-Solr-Tests-trunk-Java6/solr/build/solr-core/test/J0/./org.apache.solr.cloud.SyncSliceTest-1355625313165/control/data/index forceNew:false
[junit4:junit4]   2> 2625 T343 oasc.SolrDeletionPolicy.onCommit SolrDeletionPolicy.onCommit: commits:num=1
[junit4:junit4]   2> 		commit{dir=RateLimitedDirectoryWrapper(NRTCachingDirectory(org.apache.lucene.store.NIOFSDirectory@/usr/home/hudson/hudson-slave/workspace/Lucene-Solr-Tests-trunk-Java6/solr/build/solr-core/test/J0/org.apache.solr.cloud.SyncSliceTest-1355625313165/control/data/index lockFactory=org.apache.lucene.store.NativeFSLockFactory@5b69c34e; maxCacheMB=48.0 maxMergeSizeMB=4.0)),segFN=segments_1,generation=1,filenames=[segments_1]
[junit4:junit4]   2> 2625 T343 oasc.SolrDeletionPolicy.updateCommits newest commit = 1[segments_1]
[junit4:junit4]   2> 2626 T343 oasc.CachingDirectoryFactory.close Releasing directory:/usr/home/hudson/hudson-slave/workspace/Lucene-Solr-Tests-trunk-Java6/solr/build/solr-core/test/J0/./org.apache.solr.cloud.SyncSliceTest-1355625313165/control/data/index
[junit4:junit4]   2> 2627 T343 oasc.SolrCore.initWriters created xml: solr.XMLResponseWriter
[junit4:junit4]   2> 2630 T343 oasup.UpdateRequestProcessorChain.init inserting DistributedUpdateProcessorFactory into updateRequestProcessorChain "dedupe"
[junit4:junit4]   2> 2631 T343 oasup.UpdateRequestProcessorChain.init inserting DistributedUpdateProcessorFactory into updateRequestProcessorChain "dedupe-allfields"
[junit4:junit4]   2> 2631 T343 oasup.UpdateRequestProcessorChain.init inserting DistributedUpdateProcessorFactory into updateRequestProcessorChain "stored_sig"
[junit4:junit4]   2> 2632 T343 oasup.UpdateRequestProcessorChain.init inserting DistributedUpdateProcessorFactory into updateRequestProcessorChain "uniq-fields"
[junit4:junit4]   2> 2633 T343 oasup.UpdateRequestProcessorChain.init inserting DistributedUpdateProcessorFactory into updateRequestProcessorChain "distrib-dup-test-chain-implicit"
[junit4:junit4]   2> 2633 T343 oasc.RequestHandlers.initHandlersFromConfig adding lazy requestHandler: solr.ReplicationHandler
[junit4:junit4]   2> 2634 T343 oasc.RequestHandlers.initHandlersFromConfig created /replication: solr.ReplicationHandler
[junit4:junit4]   2> 2635 T343 oasc.RequestHandlers.initHandlersFromConfig created standard: solr.StandardRequestHandler
[junit4:junit4]   2> 2636 T343 oasc.RequestHandlers.initHandlersFromConfig created /get: solr.RealTimeGetHandler
[junit4:junit4]   2> 2637 T343 oasc.RequestHandlers.initHandlersFromConfig created dismax: solr.SearchHandler
[junit4:junit4]   2> 2639 T343 oasc.RequestHandlers.initHandlersFromConfig created mock: org.apache.solr.core.MockQuerySenderListenerReqHandler
[junit4:junit4]   2> 2639 T343 oasc.RequestHandlers.initHandlersFromConfig created /admin/: org.apache.solr.handler.admin.AdminHandlers
[junit4:junit4]   2> 2640 T343 oasc.RequestHandlers.initHandlersFromConfig created defaults: solr.StandardRequestHandler
[junit4:junit4]   2> 2641 T343 oasc.RequestHandlers.initHandlersFromConfig adding lazy requestHandler: solr.StandardRequestHandler
[junit4:junit4]   2> 2641 T343 oasc.RequestHandlers.initHandlersFromConfig created lazy: solr.StandardRequestHandler
[junit4:junit4]   2> 2642 T343 oasc.RequestHandlers.initHandlersFromConfig created /update: solr.UpdateRequestHandler
[junit4:junit4]   2> 2643 T343 oasc.RequestHandlers.initHandlersFromConfig created /terms: org.apache.solr.handler.component.SearchHandler
[junit4:junit4]   2> 2644 T343 oasc.RequestHandlers.initHandlersFromConfig created spellCheckCompRH: org.apache.solr.handler.component.SearchHandler
[junit4:junit4]   2> 2645 T343 oasc.RequestHandlers.initHandlersFromConfig created spellCheckCompRH_Direct: org.apache.solr.handler.component.SearchHandler
[junit4:junit4]   2> 2646 T343 oasc.RequestHandlers.initHandlersFromConfig created spellCheckWithWordbreak: org.apache.solr.handler.component.SearchHandler
[junit4:junit4]   2> 2647 T343 oasc.RequestHandlers.initHandlersFromConfig created spellCheckWithWordbreak_Direct: org.apache.solr.handler.component.SearchHandler
[junit4:junit4]   2> 2649 T343 oasc.RequestHandlers.initHandlersFromConfig created spellCheckCompRH1: org.apache.solr.handler.component.SearchHandler
[junit4:junit4]   2> 2650 T343 oasc.RequestHandlers.initHandlersFromConfig created mltrh: org.apache.solr.handler.component.SearchHandler
[junit4:junit4]   2> 2652 T343 oasc.RequestHandlers.initHandlersFromConfig created tvrh: org.apache.solr.handler.component.SearchHandler
[junit4:junit4]   2> 2654 T343 oasc.RequestHandlers.initHandlersFromConfig created /mlt: solr.MoreLikeThisHandler
[junit4:junit4]   2> 2655 T343 oasc.RequestHandlers.initHandlersFromConfig created /debug/dump: solr.DumpRequestHandler
[junit4:junit4]   2> 2664 T343 oashl.XMLLoader.init xsltCacheLifetimeSeconds=60
[junit4:junit4]   2> 2669 T343 oasc.SolrCore.initDeprecatedSupport WARNING solrconfig.xml uses deprecated <admin/gettableFiles>, Please update your config to use the ShowFileRequestHandler.
[junit4:junit4]   2> 2671 T343 oasc.SolrCore.initDeprecatedSupport WARNING adding ShowFileRequestHandler with hidden files: [SCHEMA.XML, OLD_SYNONYMS.TXT, STOPWORDS.TXT, PROTWORDS.TXT, OPEN-EXCHANGE-RATES.JSON, SYNONYMS.TXT, CURRENCY.XML, MAPPING-ISOLATIN1ACCENT.TXT]
[junit4:junit4]   2> 2673 T343 oasc.CachingDirectoryFactory.close Releasing directory:/usr/home/hudson/hudson-slave/workspace/Lucene-Solr-Tests-trunk-Java6/solr/build/solr-core/test/J0/./org.apache.solr.cloud.SyncSliceTest-1355625313165/control/data
[junit4:junit4]   2> 2675 T343 oass.SolrIndexSearcher.<init> Opening Searcher@1ab8e978 main
[junit4:junit4]   2> 2702 T343 oasu.CommitTracker.<init> Hard AutoCommit: disabled
[junit4:junit4]   2> 2703 T343 oasu.CommitTracker.<init> Soft AutoCommit: disabled
[junit4:junit4]   2> 2703 T343 oashc.SpellCheckComponent.inform Initializing spell checkers
[junit4:junit4]   2> 2713 T343 oass.DirectSolrSpellChecker.init init: {name=direct,classname=DirectSolrSpellChecker,field=lowerfilt,minQueryLength=3}
[junit4:junit4]   2> 2840 T344 oasc.SolrCore.registerSearcher [collection1] Registered new searcher Searcher@1ab8e978 main{StandardDirectoryReader(segments_1:1)}
[junit4:junit4]   2> 2847 T343 oasc.ZkController.publish publishing core=collection1 state=down
[junit4:junit4]   2> 2847 T343 oasc.ZkController.publish numShards not found on descriptor - reading it from system property
[junit4:junit4]   2> 2848 T323 oazs.PrepRequestProcessor.pRequest Got user-level KeeperException when processing sessionid:0x13ba190b50e0003 type:create cxid:0x56 zxid:0x29 txntype:-1 reqpath:n/a Error Path:/solr/overseer/queue Error:KeeperErrorCode = NoNode for /solr/overseer/queue
[junit4:junit4]   2> 3103 T341 oascc.ZkStateReader.updateClusterState Updating cloud state from ZooKeeper... 
[junit4:junit4]   2> 3104 T341 oasc.Overseer$ClusterStateUpdater.updateState Update state numShards=1 message={
[junit4:junit4]   2> 	  "operation":"state",
[junit4:junit4]   2> 	  "numShards":"1",
[junit4:junit4]   2> 	  "shard":null,
[junit4:junit4]   2> 	  "roles":null,
[junit4:junit4]   2> 	  "state":"down",
[junit4:junit4]   2> 	  "core":"collection1",
[junit4:junit4]   2> 	  "collection":"control_collection",
[junit4:junit4]   2> 	  "node_name":"127.0.0.1:58188_zmed",
[junit4:junit4]   2> 	  "base_url":"http://127.0.0.1:58188/zmed"}
[junit4:junit4]   2> 3104 T341 oasc.Overseer$ClusterStateUpdater.createCollection Create collection control_collection with numShards 1
[junit4:junit4]   2> 3142 T341 oasc.Overseer$ClusterStateUpdater.updateState Assigning new node to shard shard=shard1
[junit4:junit4]   2> 3143 T323 oazs.PrepRequestProcessor.pRequest Got user-level KeeperException when processing sessionid:0x13ba190b50e0003 type:create cxid:0x5e zxid:0x2c txntype:-1 reqpath:n/a Error Path:/solr/overseer/queue-work Error:KeeperErrorCode = NoNode for /solr/overseer/queue-work
[junit4:junit4]   2> 3178 T340 oascc.ZkStateReader$2.process A cluster state change: WatchedEvent state:SyncConnected type:NodeDataChanged path:/clusterstate.json, has occurred - updating... (live nodes size: 1)
[junit4:junit4]   2> 3361 T343 oasc.CoreContainer.registerCore registering core: collection1
[junit4:junit4]   2> 3361 T343 oasc.ZkController.register Register shard - core:collection1 address:http://127.0.0.1:58188/zmed shardId:shard1
[junit4:junit4]   2> 3372 T343 oascsi.HttpClientUtil.createClient Creating new http client, config:maxConnections=10000&maxConnectionsPerHost=20&connTimeout=30000&socketTimeout=30000&retry=false
[junit4:junit4]   2> 3390 T343 oascc.SolrZkClient.makePath makePath: /collections/control_collection/leader_elect/shard1/election
[junit4:junit4]   2> 3417 T323 oazs.PrepRequestProcessor.pRequest Got user-level KeeperException when processing sessionid:0x13ba190b50e0003 type:delete cxid:0x78 zxid:0x36 txntype:-1 reqpath:n/a Error Path:/solr/collections/control_collection/leaders Error:KeeperErrorCode = NoNode for /solr/collections/control_collection/leaders
[junit4:junit4]   2> 3418 T343 oasc.ShardLeaderElectionContext.runLeaderProcess Running the leader process.
[junit4:junit4]   2> 3419 T323 oazs.PrepRequestProcessor.pRequest Got user-level KeeperException when processing sessionid:0x13ba190b50e0003 type:create cxid:0x79 zxid:0x37 txntype:-1 reqpath:n/a Error Path:/solr/overseer Error:KeeperErrorCode = NodeExists for /solr/overseer
[junit4:junit4]   2> 3422 T343 oasc.ShardLeaderElectionContext.waitForReplicasToComeUp Enough replicas found to continue.
[junit4:junit4]   2> 3423 T343 oasc.ShardLeaderElectionContext.runLeaderProcess I may be the new leader - try and sync
[junit4:junit4]   2> 3426 T343 oasc.SyncStrategy.sync Sync replicas to http://127.0.0.1:58188/zmed/collection1/
[junit4:junit4]   2> 3427 T343 oasc.SyncStrategy.syncReplicas Sync Success - now sync replicas to me
[junit4:junit4]   2> 3427 T343 oasc.SyncStrategy.syncToMe http://127.0.0.1:58188/zmed/collection1/ has no replicas
[junit4:junit4]   2> 3427 T343 oasc.ShardLeaderElectionContext.runLeaderProcess I am the new leader: http://127.0.0.1:58188/zmed/collection1/
[junit4:junit4]   2> 3427 T343 oascc.SolrZkClient.makePath makePath: /collections/control_collection/leaders/shard1
[junit4:junit4]   2> 3436 T323 oazs.PrepRequestProcessor.pRequest Got user-level KeeperException when processing sessionid:0x13ba190b50e0003 type:create cxid:0x83 zxid:0x3b txntype:-1 reqpath:n/a Error Path:/solr/overseer Error:KeeperErrorCode = NodeExists for /solr/overseer
[junit4:junit4]   2> 3686 T341 oascc.ZkStateReader.updateClusterState Updating cloud state from ZooKeeper... 
[junit4:junit4]   2> 3702 T340 oascc.ZkStateReader$2.process A cluster state change: WatchedEvent state:SyncConnected type:NodeDataChanged path:/clusterstate.json, has occurred - updating... (live nodes size: 1)
[junit4:junit4]   2> 3745 T343 oasc.ZkController.register We are http://127.0.0.1:58188/zmed/collection1/ and leader is http://127.0.0.1:58188/zmed/collection1/
[junit4:junit4]   2> 3748 T343 oasc.ZkController.register No LogReplay needed for core=collection1 baseURL=http://127.0.0.1:58188/zmed
[junit4:junit4]   2> 3748 T343 oasc.ZkController.checkRecovery I am the leader, no recovery necessary
[junit4:junit4]   2> 3748 T343 oasc.ZkController.publish publishing core=collection1 state=active
[junit4:junit4]   2> 3748 T343 oasc.ZkController.publish numShards not found on descriptor - reading it from system property
[junit4:junit4]   2> 3750 T343 oascc.ZkStateReader.updateClusterState Updating cloud state from ZooKeeper... 
[junit4:junit4]   2> 3752 T318 oass.SolrDispatchFilter.init user.dir=/usr/home/hudson/hudson-slave/workspace/Lucene-Solr-Tests-trunk-Java6/solr/build/solr-core/test/J0
[junit4:junit4]   2> 3752 T318 oass.SolrDispatchFilter.init SolrDispatchFilter.init() done
[junit4:junit4]   2> 3753 T318 oascsi.HttpClientUtil.createClient Creating new http client, config:maxConnections=128&maxConnectionsPerHost=32&followRedirects=false
[junit4:junit4]   2> 3761 T318 oascsi.HttpClientUtil.createClient Creating new http client, config:
[junit4:junit4]   2> 3773 T318 oaz.ZooKeeper.<init> Initiating client connection, connectString=127.0.0.1:58185/solr sessionTimeout=10000 watcher=org.apache.solr.common.cloud.ConnectionManager@5f701cd1
[junit4:junit4]   2> 3774 T318 oascc.ConnectionManager.waitForConnected Waiting for client to connect to ZooKeeper
[junit4:junit4]   2> 3775 T345 oaz.ClientCnxn$SendThread.logStartConnect Opening socket connection to server localhost/127.0.0.1:58185. Will not attempt to authenticate using SASL (access denied (javax.security.auth.AuthPermission getLoginConfiguration))
[junit4:junit4]   2> 3775 T345 oaz.ClientCnxn$SendThread.primeConnection Socket connection established to localhost/127.0.0.1:58185, initiating session
[junit4:junit4]   2> 3775 T320 oazs.NIOServerCnxnFactory.run Accepted socket connection from /140.211.11.196:58199
[junit4:junit4]   2> 3776 T320 oazs.ZooKeeperServer.processConnectRequest Client attempting to establish new session at /140.211.11.196:58199
[junit4:junit4]   2> 3777 T322 oazs.ZooKeeperServer.finishSessionInit Established session 0x13ba190b50e0004 with negotiated timeout 10000 for client /140.211.11.196:58199
[junit4:junit4]   2> 3777 T345 oaz.ClientCnxn$SendThread.onConnected Session establishment complete on server localhost/127.0.0.1:58185, sessionid = 0x13ba190b50e0004, negotiated timeout = 10000
[junit4:junit4]   2> 3777 T346 oascc.ConnectionManager.process Watcher org.apache.solr.common.cloud.ConnectionManager@5f701cd1 name:ZooKeeperConnection Watcher:127.0.0.1:58185/solr got event WatchedEvent state:SyncConnected type:None path:null path:null type:None
[junit4:junit4]   2> 3777 T318 oascc.ConnectionManager.waitForConnected Client is connected to ZooKeeper
[junit4:junit4]   2> 3779 T318 oascc.ZkStateReader.createClusterStateWatchersAndUpdate Updating cluster state from ZooKeeper... 
[junit4:junit4]   2> 3782 T318 oasc.ChaosMonkey.monkeyLog monkey: init - expire sessions:true cause connection loss:true
[junit4:junit4]   2> 3884 T318 oejs.Server.doStart jetty-8.1.8.v20121106
[junit4:junit4]   2> 3886 T318 oejs.AbstractConnector.doStart Started SocketConnector@127.0.0.1:58200
[junit4:junit4]   2> 3887 T318 oasc.SolrResourceLoader.locateSolrHome JNDI not configured for solr (NoInitialContextEx)
[junit4:junit4]   2> 3887 T318 oasc.SolrResourceLoader.locateSolrHome using system property solr.solr.home: /usr/home/hudson/hudson-slave/workspace/Lucene-Solr-Tests-trunk-Java6/solr/build/solr-core/test/J0/./org.apache.solr.cloud.SyncSliceTest-jetty1-1355625316940
[junit4:junit4]   2> 3888 T318 oasc.SolrResourceLoader.<init> new SolrResourceLoader for deduced Solr Home: '/usr/home/hudson/hudson-slave/workspace/Lucene-Solr-Tests-trunk-Java6/solr/build/solr-core/test/J0/./org.apache.solr.cloud.SyncSliceTest-jetty1-1355625316940/'
[junit4:junit4]   2> 3911 T318 oass.SolrDispatchFilter.init SolrDispatchFilter.init()
[junit4:junit4]   2> 3911 T318 oasc.SolrResourceLoader.locateSolrHome JNDI not configured for solr (NoInitialContextEx)
[junit4:junit4]   2> 3912 T318 oasc.SolrResourceLoader.locateSolrHome using system property solr.solr.home: /usr/home/hudson/hudson-slave/workspace/Lucene-Solr-Tests-trunk-Java6/solr/build/solr-core/test/J0/./org.apache.solr.cloud.SyncSliceTest-jetty1-1355625316940
[junit4:junit4]   2> 3912 T318 oasc.CoreContainer$Initializer.initialize looking for solr.xml: /usr/home/hudson/hudson-slave/workspace/Lucene-Solr-Tests-trunk-Java6/solr/build/solr-core/test/J0/./org.apache.solr.cloud.SyncSliceTest-jetty1-1355625316940/solr.xml
[junit4:junit4]   2> 3912 T318 oasc.CoreContainer.<init> New CoreContainer 1718126592
[junit4:junit4]   2> 3913 T318 oasc.CoreContainer.load Loading CoreContainer using Solr Home: '/usr/home/hudson/hudson-slave/workspace/Lucene-Solr-Tests-trunk-Java6/solr/build/solr-core/test/J0/./org.apache.solr.cloud.SyncSliceTest-jetty1-1355625316940/'
[junit4:junit4]   2> 3913 T318 oasc.SolrResourceLoader.<init> new SolrResourceLoader for directory: '/usr/home/hudson/hudson-slave/workspace/Lucene-Solr-Tests-trunk-Java6/solr/build/solr-core/test/J0/./org.apache.solr.cloud.SyncSliceTest-jetty1-1355625316940/'
[junit4:junit4]   2> 3938 T318 oasc.CoreContainer.load Registering Log Listener
[junit4:junit4]   2> 3956 T318 oasc.CoreContainer.initZooKeeper Zookeeper client=127.0.0.1:58185/solr
[junit4:junit4]   2> 3957 T318 oasc.ZkController.checkChrootPath zkHost includes chroot
[junit4:junit4]   2> 3957 T318 oaz.ZooKeeper.<init> Initiating client connection, connectString=127.0.0.1:58185 sessionTimeout=60000 watcher=org.apache.solr.common.cloud.ConnectionManager@f5ca1bd
[junit4:junit4]   2> 3959 T318 oascc.ConnectionManager.waitForConnected Waiting for client to connect to ZooKeeper
[junit4:junit4]   2> 3959 T356 oaz.ClientCnxn$SendThread.logStartConnect Opening socket connection to server localhost/127.0.0.1:58185. Will not attempt to authenticate using SASL (access denied (javax.security.auth.AuthPermission getLoginConfiguration))
[junit4:junit4]   2> 3960 T356 oaz.ClientCnxn$SendThread.primeConnection Socket connection established to localhost/127.0.0.1:58185, initiating session
[junit4:junit4]   2> 3960 T320 oazs.NIOServerCnxnFactory.run Accepted socket connection from /140.211.11.196:58201
[junit4:junit4]   2> 3960 T320 oazs.ZooKeeperServer.processConnectRequest Client attempting to establish new session at /140.211.11.196:58201
[junit4:junit4]   2> 3962 T322 oazs.ZooKeeperServer.finishSessionInit Established session 0x13ba190b50e0005 with negotiated timeout 20000 for client /140.211.11.196:58201
[junit4:junit4]   2> 3962 T356 oaz.ClientCnxn$SendThread.onConnected Session establishment complete on server localhost/127.0.0.1:58185, sessionid = 0x13ba190b50e0005, negotiated timeout = 20000
[junit4:junit4]   2> 3962 T357 oascc.ConnectionManager.process Watcher org.apache.solr.common.cloud.ConnectionManager@f5ca1bd name:ZooKeeperConnection Watcher:127.0.0.1:58185 got event WatchedEvent state:SyncConnected type:None path:null path:null type:None
[junit4:junit4]   2> 3963 T318 oascc.ConnectionManager.waitForConnected Client is connected to ZooKeeper
[junit4:junit4]   2> 3964 T323 oazs.PrepRequestProcessor.pRequest2Txn Processed session termination for sessionid: 0x13ba190b50e0005
[junit4:junit4]   2> 3975 T357 oaz.ClientCnxn$EventThread.run EventThread shut down
[junit4:junit4]   2> 3975 T320 oazs.NIOServerCnxn.closeSock Closed socket connection for client /140.211.11.196:58201 which had sessionid 0x13ba190b50e0005
[junit4:junit4]   2> 3975 T318 oaz.ZooKeeper.close Session: 0x13ba190b50e0005 closed
[junit4:junit4]   2> 3976 T318 oaz.ZooKeeper.<init> Initiating client connection, connectString=127.0.0.1:58185/solr sessionTimeout=8000 watcher=org.apache.solr.common.cloud.ConnectionManager@6930ac20
[junit4:junit4]   2> 3977 T318 oascc.ConnectionManager.waitForConnected Waiting for client to connect to ZooKeeper
[junit4:junit4]   2> 3977 T358 oaz.ClientCnxn$SendThread.logStartConnect Opening socket connection to server localhost/127.0.0.1:58185. Will not attempt to authenticate using SASL (access denied (javax.security.auth.AuthPermission getLoginConfiguration))
[junit4:junit4]   2> 3978 T358 oaz.ClientCnxn$SendThread.primeConnection Socket connection established to localhost/127.0.0.1:58185, initiating session
[junit4:junit4]   2> 3978 T320 oazs.NIOServerCnxnFactory.run Accepted socket connection from /140.211.11.196:58202
[junit4:junit4]   2> 3978 T320 oazs.ZooKeeperServer.processConnectRequest Client attempting to establish new session at /140.211.11.196:58202
[junit4:junit4]   2> 3979 T322 oazs.ZooKeeperServer.finishSessionInit Established session 0x13ba190b50e0006 with negotiated timeout 8000 for client /140.211.11.196:58202
[junit4:junit4]   2> 3979 T358 oaz.ClientCnxn$SendThread.onConnected Session establishment complete on server localhost/127.0.0.1:58185, sessionid = 0x13ba190b50e0006, negotiated timeout = 8000
[junit4:junit4]   2> 3980 T359 oascc.ConnectionManager.process Watcher org.apache.solr.common.cloud.ConnectionManager@6930ac20 name:ZooKeeperConnection Watcher:127.0.0.1:58185/solr got event WatchedEvent state:SyncConnected type:None path:null path:null type:None
[junit4:junit4]   2> 3980 T318 oascc.ConnectionManager.waitForConnected Client is connected to ZooKeeper
[junit4:junit4]   2> 3981 T323 oazs.PrepRequestProcessor.pRequest Got user-level KeeperException when processing sessionid:0x13ba190b50e0006 type:create cxid:0x1 zxid:0x49 txntype:-1 reqpath:n/a Error Path:/solr/overseer Error:KeeperErrorCode = NodeExists for /solr/overseer
[junit4:junit4]   2> 3987 T323 oazs.PrepRequestProcessor.pRequest Got user-level KeeperException when processing sessionid:0x13ba190b50e0006 type:create cxid:0x2 zxid:0x4a txntype:-1 reqpath:n/a Error Path:/solr/overseer Error:KeeperErrorCode = NodeExists for /solr/overseer
[junit4:junit4]   2> 3988 T318 oasc.ZkController.createEphemeralLiveNode Register node as live in ZooKeeper:/live_nodes/127.0.0.1:58200_zmed
[junit4:junit4]   2> 3989 T323 oazs.PrepRequestProcessor.pRequest Got user-level KeeperException when processing sessionid:0x13ba190b50e0006 type:delete cxid:0x4 zxid:0x4b txntype:-1 reqpath:n/a Error Path:/solr/live_nodes/127.0.0.1:58200_zmed Error:KeeperErrorCode = NoNode for /solr/live_nodes/127.0.0.1:58200_zmed
[junit4:junit4]   2> 3990 T318 oascc.SolrZkClient.makePath makePath: /live_nodes/127.0.0.1:58200_zmed
[junit4:junit4]   2> 3999 T340 oascc.ZkStateReader$3.process Updating live nodes... (2)
[junit4:junit4]   2> 3999 T346 oascc.ZkStateReader$3.process Updating live nodes... (2)
[junit4:junit4]   2> 3999 T340 oascc.ZkStateReader$2.process A cluster state change: WatchedEvent state:SyncConnected type:NodeChildrenChanged path:/live_nodes, has occurred - updating... (live nodes size: 2)
[junit4:junit4]   2> 3999 T318 oashc.HttpShardHandlerFactory.getParameter Setting socketTimeout to: 0
[junit4:junit4]   2> 4000 T318 oashc.HttpShardHandlerFactory.getParameter Setting urlScheme to: http://
[junit4:junit4]   2> 4000 T318 oashc.HttpShardHandlerFactory.getParameter Setting connTimeout to: 0
[junit4:junit4]   2> 4000 T318 oashc.HttpShardHandlerFactory.getParameter Setting maxConnectionsPerHost to: 20
[junit4:junit4]   2> 4001 T318 oashc.HttpShardHandlerFactory.getParameter Setting corePoolSize to: 0
[junit4:junit4]   2> 4001 T318 oashc.HttpShardHandlerFactory.getParameter Setting maximumPoolSize to: 2147483647
[junit4:junit4]   2> 4002 T318 oashc.HttpShardHandlerFactory.getParameter Setting maxThreadIdleTime to: 5
[junit4:junit4]   2> 4002 T318 oashc.HttpShardHandlerFactory.getParameter Setting sizeOfQueue to: -1
[junit4:junit4]   2> 4002 T318 oashc.HttpShardHandlerFactory.getParameter Setting fairnessPolicy to: false
[junit4:junit4]   2> 4003 T318 oascsi.HttpClientUtil.createClient Creating new http client, config:maxConnectionsPerHost=20&maxConnections=10000&socketTimeout=0&connTimeout=0&retry=false
[junit4:junit4]   2> 4019 T318 oascc.ZkStateReader.createClusterStateWatchersAndUpdate Updating cluster state from ZooKeeper... 
[junit4:junit4]   2> 4026 T360 oasc.CoreContainer.create Creating SolrCore 'collection1' using instanceDir: /usr/home/hudson/hudson-slave/workspace/Lucene-Solr-Tests-trunk-Java6/solr/build/solr-core/test/J0/./org.apache.solr.cloud.SyncSliceTest-jetty1-1355625316940/collection1
[junit4:junit4]   2> 4026 T360 oasc.ZkController.createCollectionZkNode Check for collection zkNode:collection1
[junit4:junit4]   2> 4027 T360 oasc.ZkController.createCollectionZkNode Collection zkNode exists
[junit4:junit4]   2> 4027 T360 oasc.ZkController.readConfigName Load collection config from:/collections/collection1
[junit4:junit4]   2> 4028 T360 oasc.SolrResourceLoader.<init> new SolrResourceLoader for directory: '/usr/home/hudson/hudson-slave/workspace/Lucene-Solr-Tests-trunk-Java6/solr/build/solr-core/test/J0/./org.apache.solr.cloud.SyncSliceTest-jetty1-1355625316940/collection1/'
[junit4:junit4]   2> 4029 T360 oasc.SolrResourceLoader.replaceClassLoader Adding 'file:/usr/home/hudson/hudson-slave/workspace/Lucene-Solr-Tests-trunk-Java6/solr/build/solr-core/test/J0/org.apache.solr.cloud.SyncSliceTest-jetty1-1355625316940/collection1/lib/README' to classloader
[junit4:junit4]   2> 4030 T360 oasc.SolrResourceLoader.replaceClassLoader Adding 'file:/usr/home/hudson/hudson-slave/workspace/Lucene-Solr-Tests-trunk-Java6/solr/build/solr-core/test/J0/org.apache.solr.cloud.SyncSliceTest-jetty1-1355625316940/collection1/lib/classes/' to classloader
[junit4:junit4]   2> 4065 T360 oasc.SolrConfig.<init> Using Lucene MatchVersion: LUCENE_50
[junit4:junit4]   2> 4113 T360 oasc.SolrConfig.<init> Loaded SolrConfig: solrconfig.xml
[junit4:junit4]   2> 4214 T360 oass.IndexSchema.readSchema Reading Solr Schema
[junit4:junit4]   2> 4218 T341 oascc.ZkStateReader.updateClusterState Updating cloud state from ZooKeeper... 
[junit4:junit4]   2> 4218 T341 oasc.Overseer$ClusterStateUpdater.updateState Update state numShards=1 message={
[junit4:junit4]   2> 	  "operation":"state",
[junit4:junit4]   2> 	  "numShards":"1",
[junit4:junit4]   2> 	  "shard":"shard1",
[junit4:junit4]   2> 	  "roles":null,
[junit4:junit4]   2> 	  "state":"active",
[junit4:junit4]   2> 	  "core":"collection1",
[junit4:junit4]   2> 	  "collection":"control_collection",
[junit4:junit4]   2> 	  "node_name":"127.0.0.1:58188_zmed",
[junit4:junit4]   2> 	  "base_url":"http://127.0.0.1:58188/zmed"}
[junit4:junit4]   2> 4219 T360 oass.IndexSchema.readSchema Schema name=test
[junit4:junit4]   2> 4231 T346 oascc.ZkStateReader$2.process A cluster state change: WatchedEvent state:SyncConnected type:NodeDataChanged path:/clusterstate.json, has occurred - updating... (live nodes size: 2)
[junit4:junit4]   2> 4231 T359 oascc.ZkStateReader$2.process A cluster state change: WatchedEvent state:SyncConnected type:NodeDataChanged path:/clusterstate.json, has occurred - updating... (live nodes size: 2)
[junit4:junit4]   2> 4231 T340 oascc.ZkStateReader$2.process A cluster state change: WatchedEvent state:SyncConnected type:NodeDataChanged path:/clusterstate.json, has occurred - updating... (live nodes size: 2)
[junit4:junit4]   2> 4759 T360 oass.OpenExchangeRatesOrgProvider.init Initialized with rates=open-exchange-rates.json, refreshInterval=1440.
[junit4:junit4]   2> 4772 T360 oass.IndexSchema.readSchema default search field in schema is text
[junit4:junit4]   2> 4776 T360 oass.IndexSchema.readSchema unique key field: id
[junit4:junit4]   2> 4798 T360 oass.FileExchangeRateProvider.reload Reloading exchange rates from file currency.xml
[junit4:junit4]   2> 4803 T360 oass.FileExchangeRateProvider.reload Reloading exchange rates from file currency.xml
[junit4:junit4]   2> 4808 T360 oass.OpenExchangeRatesOrgProvider.reload Reloading exchange rates from open-exchange-rates.json
[junit4:junit4]   2> 4810 T360 oass.OpenExchangeRatesOrgProvider.reload Reloading exchange rates from open-exchange-rates.json
[junit4:junit4]   2> 4812 T360 oasc.SolrCore.<init> [collection1] Opening new SolrCore at /usr/home/hudson/hudson-slave/workspace/Lucene-Solr-Tests-trunk-Java6/solr/build/solr-core/test/J0/./org.apache.solr.cloud.SyncSliceTest-jetty1-1355625316940/collection1/, dataDir=./org.apache.solr.cloud.SyncSliceTest-1355625313165/jetty1/
[junit4:junit4]   2> 4812 T360 oasc.JmxMonitoredMap.<init> JMX monitoring is enabled. Adding Solr mbeans to JMX Server: com.sun.jmx.mbeanserver.JmxMBeanServer@37e55794
[junit4:junit4]   2> 4813 T360 oasc.SolrCore.initDirectoryFactory solr.NRTCachingDirectoryFactory
[junit4:junit4]   2> 4814 T360 oasc.CachingDirectoryFactory.get return new directory for /usr/home/hudson/hudson-slave/workspace/Lucene-Solr-Tests-trunk-Java6/solr/build/solr-core/test/J0/./org.apache.solr.cloud.SyncSliceTest-1355625313165/jetty1 forceNew:false
[junit4:junit4]   2> 4815 T360 oasc.CachingDirectoryFactory.close Releasing directory:/usr/home/hudson/hudson-slave/workspace/Lucene-Solr-Tests-trunk-Java6/solr/build/solr-core/test/J0/./org.apache.solr.cloud.SyncSliceTest-1355625313165/jetty1
[junit4:junit4]   2> 4815 T360 oasc.SolrCore.getNewIndexDir New index directory detected: old=null new=./org.apache.solr.cloud.SyncSliceTest-1355625313165/jetty1/index/
[junit4:junit4]   2> 4816 T360 oasc.SolrCore.initIndex WARNING [collection1] Solr index directory './org.apache.solr.cloud.SyncSliceTest-1355625313165/jetty1/index' doesn't exist. Creating new index...
[junit4:junit4]   2> 4816 T360 oasc.CachingDirectoryFactory.get return new directory for /usr/home/hudson/hudson-slave/workspace/Lucene-Solr-Tests-trunk-Java6/solr/build/solr-core/test/J0/./org.apache.solr.cloud.SyncSliceTest-1355625313165/jetty1/index forceNew:false
[junit4:junit4]   2> 4829 T360 oasc.SolrDeletionPolicy.onCommit SolrDeletionPolicy.onCommit: commits:num=1
[junit4:junit4]   2> 		commit{dir=RateLimitedDirectoryWrapper(NRTCachingDirectory(org.apache.lucene.store.NIOFSDirectory@/usr/home/hudson/hudson-slave/workspace/Lucene-Solr-Tests-trunk-Java6/solr/build/solr-core/test/J0/org.apache.solr.cloud.SyncSliceTest-1355625313165/jetty1/index lockFactory=org.apache.lucene.store.NativeFSLockFactory@638a2b99; maxCacheMB=48.0 maxMergeSizeMB=4.0)),segFN=segments_1,generation=1,filenames=[segments_1]
[junit4:junit4]   2> 4829 T360 oasc.SolrDeletionPolicy.updateCommits newest commit = 1[segments_1]
[junit4:junit4]   2> 4830 T360 oasc.CachingDirectoryFactory.close Releasing directory:/usr/home/hudson/hudson-slave/workspace/Lucene-Solr-Tests-trunk-Java6/solr/build/solr-core/test/J0/./org.apache.solr.cloud.SyncSliceTest-1355625313165/jetty1/index
[junit4:junit4]   2> 4831 T360 oasc.SolrCore.initWriters created xml: solr.XMLResponseWriter
[junit4:junit4]   2> 4833 T360 oasup.UpdateRequestProcessorChain.init inserting DistributedUpdateProcessorFactory into updateRequestProcessorChain "dedupe"
[junit4:junit4]   2> 4833 T360 oasup.UpdateRequestProcessorChain.init inserting DistributedUpdateProcessorFactory into updateRequestProcessorChain "dedupe-allfields"
[junit4:junit4]   2> 4833 T360 oasup.UpdateRequestProcessorChain.init inserting DistributedUpdateProcessorFactory into updateRequestProcessorChain "stored_sig"
[junit4:junit4]   2> 4834 T360 oasup.UpdateRequestProcessorChain.init inserting DistributedUpdateProcessorFactory into updateRequestProcessorChain "uniq-fields"
[junit4:junit4]   2> 4834 T360 oasup.UpdateRequestProcessorChain.init inserting DistributedUpdateProcessorFactory into updateRequestProcessorChain "distrib-dup-test-chain-implicit"
[junit4:junit4]   2> 4835 T360 oasc.RequestHandlers.initHandlersFromConfig adding lazy requestHandler: solr.ReplicationHandler
[junit4:junit4]   2> 4835 T360 oasc.RequestHandlers.initHandlersFromConfig created /replication: solr.ReplicationHandler
[junit4:junit4]   2> 4836 T360 oasc.RequestHandlers.initHandlersFromConfig created standard: solr.StandardRequestHandler
[junit4:junit4]   2> 4837 T360 oasc.RequestHandlers.initHandlersFromConfig created /get: solr.RealTimeGetHandler
[junit4:junit4]   2> 4838 T360 oasc.RequestHandlers.initHandlersFromConfig created dismax: solr.SearchHandler
[junit4:junit4]   2> 4839 T360 oasc.RequestHandlers.initHandlersFromConfig created mock: org.apache.solr.core.MockQuerySenderListenerReqHandler
[junit4:junit4]   2> 4840 T360 oasc.RequestHandlers.initHandlersFromConfig created /admin/: org.apache.solr.handler.admin.AdminHandlers
[junit4:junit4]   2> 4841 T360 oasc.RequestHandlers.initHandlersFromConfig created defaults: solr.StandardRequestHandler
[junit4:junit4]   2> 4841 T360 oasc.RequestHandlers.initHandlersFromConfig adding lazy requestHandler: solr.StandardRequestHandler
[junit4:junit4]   2> 4841 T360 oasc.RequestHandlers.initHandlersFromConfig created lazy: solr.StandardRequestHandler
[junit4:junit4]   2> 4842 T360 oasc.RequestHandlers.initHandlersFromConfig created /update: solr.UpdateRequestHandler
[junit4:junit4]   2> 4843 T360 oasc.RequestHandlers.initHandlersFromConfig created /terms: org.apache.solr.handler.component.SearchHandler
[junit4:junit4]   2> 4844 T360 oasc.RequestHandlers.initHandlersFromConfig created spellCheckCompRH: org.apache.solr.handler.component.SearchHandler
[junit4:junit4]   2> 4845 T360 oasc.RequestHandlers.initHandlersFromConfig created spellCheckCompRH_Direct: org.apache.solr.handler.component.SearchHandler
[junit4:junit4]   2> 4846 T360 oasc.RequestHandlers.initHandlersFromConfig created spellCheckWithWordbreak: org.apache.solr.handler.component.SearchHandler
[junit4:junit4]   2> 4847 T360 oasc.RequestHandlers.initHandlersFromConfig created spellCheckWithWordbreak_Direct: org.apache.solr.handler.component.SearchHandler
[junit4:junit4]   2> 4848 T360 oasc.RequestHandlers.initHandlersFromConfig created spellCheckCompRH1: org.apache.solr.handler.component.SearchHandler
[junit4:junit4]   2> 4849 T360 oasc.RequestHandlers.initHandlersFromConfig created mltrh: org.apache.solr.handler.component.SearchHandler
[junit4:junit4]   2> 4850 T360 oasc.RequestHandlers.initHandlersFromConfig created tvrh: org.apache.solr.handler.component.SearchHandler
[junit4:junit4]   2> 4851 T360 oasc.RequestHandlers.initHandlersFromConfig created /mlt: solr.MoreLikeThisHandler
[junit4:junit4]   2> 4852 T360 oasc.RequestHandlers.initHandlersFromConfig created /debug/dump: solr.DumpRequestHandler
[junit4:junit4]   2> 4860 T360 oashl.XMLLoader.init xsltCacheLifetimeSeconds=60
[junit4:junit4]   2> 4864 T360 oasc.SolrCore.initDeprecatedSupport WARNING solrconfig.xml uses deprecated <admin/gettableFiles>, Please update your config to use the ShowFileRequestHandler.
[junit4:junit4]   2> 4866 T360 oasc.SolrCore.initDeprecatedSupport WARNING adding ShowFileRequestHandler with hidden files: [SCHEMA.XML, OLD_SYNONYMS.TXT, STOPWORDS.TXT, PROTWORDS.TXT, OPEN-EXCHANGE-RATES.JSON, SYNONYMS.TXT, CURRENCY.XML, MAPPING-ISOLATIN1ACCENT.TXT]
[junit4:junit4]   2> 4869 T360 oasc.CachingDirectoryFactory.close Releasing directory:/usr/home/hudson/hudson-slave/workspace/Lucene-Solr-Tests-trunk-Java6/solr/build/solr-core/test/J0/./org.apache.solr.cloud.SyncSliceTest-1355625313165/jetty1
[junit4:junit4]   2> 4870 T360 oass.SolrIndexSearcher.<init> Opening Searcher@87409cf main
[junit4:junit4]   2> 4872 T360 oasu.CommitTracker.<init> Hard AutoCommit: disabled
[junit4:junit4]   2> 4872 T360 oasu.CommitTracker.<init> Soft AutoCommit: disabled
[junit4:junit4]   2> 4872 T360 oashc.SpellCheckComponent.inform Initializing spell checkers
[junit4:junit4]   2> 4879 T360 oass.DirectSolrSpellChecker.init init: {name=direct,classname=DirectSolrSpellChecker,field=lowerfilt,minQueryLength=3}
[junit4:junit4]   2> 4928 T361 oasc.SolrCore.registerSearcher [collection1] Registered new searcher Searcher@87409cf main{StandardDirectoryReader(segments_1:1)}
[junit4:junit4]   2> 4934 T360 oasc.ZkController.publish publishing core=collection1 state=down
[junit4:junit4]   2> 4934 T360 oasc.ZkController.publish numShards not found on descriptor - reading it from system property
[junit4:junit4]   2> 5240 T341 oascc.ZkStateReader.updateClusterState Updating cloud state from ZooKeeper... 
[junit4:junit4]   2> 5241 T341 oasc.Overseer$ClusterStateUpdater.updateState Update state numShards=1 message={
[junit4:junit4]   2> 	  "operation":"state",
[junit4:junit4]   2> 	  "numShards":"1",
[junit4:junit4]   2> 	  "shard":null,
[junit4:junit4]   2> 	  "roles":null,
[junit4:junit4]   2> 	  "state":"down",
[junit4:junit4]   2> 	  "core":"collection1",
[junit4:junit4]   2> 	  "collection":"collection1",
[junit4:junit4]   2> 	  "node_name":"127.0.0.1:58200_zmed",
[junit4:junit4]   2> 	  "base_url":"http://127.0.0.1:58200/zmed"}
[junit4:junit4]   2> 5242 T341 oasc.Overseer$ClusterStateUpdater.createCollection Create collection collection1 with numShards 1
[junit4:junit4]   2> 5242 T341 oasc.Overseer$ClusterStateUpdater.updateState Assigning new node to shard shard=shard1
[junit4:junit4]   2> 5259 T346 oascc.ZkStateReader$2.process A cluster state change: WatchedEvent state:SyncConnected type:NodeDataChanged path:/clusterstate.json, has occurred - updating... (live nodes size: 2)
[junit4:junit4]   2> 5259 T359 oascc.ZkStateReader$2.process A cluster state change: WatchedEvent state:SyncConnected type:NodeDataChanged path:/clusterstate.json, has occurred - updating... (live nodes size: 2)
[junit4:junit4]   2> 5259 T340 oascc.ZkStateReader$2.process A cluster state change: WatchedEvent state:SyncConnected type:NodeDataChanged path:/clusterstate.json, has occurred - updating... (live nodes size: 2)
[junit4:junit4]   2> 5437 T360 oasc.CoreContainer.registerCore registering core: collection1
[junit4:junit4]   2> 5437 T360 oasc.ZkController.register Register shard - core:collection1 address:http://127.0.0.1:58200/zmed shardId:shard1
[junit4:junit4]   2> 5438 T360 oascc.SolrZkClient.makePath makePath: /collections/collection1/leader_elect/shard1/election
[junit4:junit4]   2> 5456 T323 oazs.PrepRequestProcessor.pRequest Got user-level KeeperException when processing sessionid:0x13ba190b50e0006 type:delete cxid:0x45 zxid:0x5b txntype:-1 reqpath:n/a Error Path:/solr/collections/collection1/leaders Error:KeeperErrorCode = NoNode for /solr/collections/collection1/leaders
[junit4:junit4]   2> 5457 T360 oasc.ShardLeaderElectionContext.runLeaderProcess Running the leader process.
[junit4:junit4]   2> 5457 T323 oazs.PrepRequestProcessor.pRequest Got user-level KeeperException when processing sessionid:0x13ba190b50e0006 type:create cxid:0x46 zxid:0x5c txntype:-1 reqpath:n/a Error Path:/solr/overseer Error:KeeperErrorCode = NodeExists for /solr/overseer
[junit4:junit4]   2> 5467 T360 oasc.ShardLeaderElectionContext.waitForReplicasToComeUp Enough replicas found to continue.
[junit4:junit4]   2> 5468 T360 oasc.ShardLeaderElectionContext.runLeaderProcess I may be the new leader - try and sync
[junit4:junit4]   2> 5468 T360 oasc.SyncStrategy.sync Sync replicas to http://127.0.0.1:58200/zmed/collection1/
[junit4:junit4]   2> 5468 T360 oasc.SyncStrategy.syncReplicas Sync Success - now sync replicas to me
[junit4:junit4]   2> 5469 T360 oasc.SyncStrategy.syncToMe http://127.0.0.1:58200/zmed/collection1/ has no replicas
[junit4:junit4]   2> 5469 T360 oasc.ShardLeaderElectionContext.runLeaderProcess I am the new leader: http://127.0.0.1:58200/zmed/collection1/
[junit4:junit4]   2> 5469 T360 oascc.SolrZkClient.makePath makePath: /collections/collection1/leaders/shard1
[junit4:junit4]   2> 5481 T323 oazs.PrepRequestProcessor.pRequest Got user-level KeeperException when processing sessionid:0x13ba190b50e0006 type:create cxid:0x50 zxid:0x60 txntype:-1 reqpath:n/a Error Path:/solr/overseer Error:KeeperErrorCode = NodeExists for /solr/overseer
[junit4:junit4]   2> 5766 T341 oascc.ZkStateReader.updateClusterState Updating cloud state from ZooKeeper... 
[junit4:junit4]   2> 5838 T346 oascc.ZkStateReader$2.process A cluster state change: WatchedEvent state:SyncConnected type:NodeDataChanged path:/clusterstate.json, has occurred - updating... (live nodes size: 2)
[junit4:junit4]   2> 5838 T359 oascc.ZkStateReader$2.process A cluster state change: WatchedEvent state:SyncConnected type:NodeDataChanged path:/clusterstate.json, has occurred - updating... (live nodes size: 2)
[junit4:junit4]   2> 5838 T340 oascc.ZkStateReader$2.process A cluster state change: WatchedEvent state:SyncConnected type:NodeDataChanged path:/clusterstate.json, has occurred - updating... (live nodes size: 2)
[junit4:junit4]   2> 5854 T360 oasc.ZkController.register We are http://127.0.0.1:58200/zmed/collection1/ and leader is http://127.0.0.1:58200/zmed/collection1/
[junit4:junit4]   2> 5854 T360 oasc.ZkController.register No LogReplay needed for core=collection1 baseURL=http://127.0.0.1:58200/zmed
[junit4:junit4]   2> 5854 T360 oasc.ZkController.checkRecovery I am the leader, no recovery necessary
[junit4:junit4]   2> 5854 T360 oasc.ZkController.publish publishing core=collection1 state=active
[junit4:junit4]   2> 5855 T360 oasc.ZkController.publish numShards not found on descriptor - reading it from system property
[junit4:junit4]   2> 5857 T360 oascc.ZkStateReader.updateClusterState Updating cloud state from ZooKeeper... 
[junit4:junit4]   2> 5858 T318 oass.SolrDispatchFilter.init user.dir=/usr/home/hudson/hudson-slave/workspace/Lucene-Solr-Tests-trunk-Java6/solr/build/solr-core/test/J0
[junit4:junit4]   2> 5859 T318 oass.SolrDispatchFilter.init SolrDispatchFilter.init() done
[junit4:junit4]   2> 5859 T318 oascsi.HttpClientUtil.createClient Creating new http client, config:maxConnections=128&maxConnectionsPerHost=32&followRedirects=false
[junit4:junit4]   2> 6031 T318 oejs.Server.doStart jetty-8.1.8.v20121106
[junit4:junit4]   2> 6034 T318 oejs.AbstractConnector.doStart Started SocketConnector@127.0.0.1:58203
[junit4:junit4]   2> 6035 T318 oasc.SolrResourceLoader.locateSolrHome JNDI not configured for solr (NoInitialContextEx)
[junit4:junit4]   2> 6035 T318 oasc.SolrResourceLoader.locateSolrHome using system property solr.solr.home: /usr/home/hudson/hudson-slave/workspace/Lucene-Solr-Tests-trunk-Java6/solr/build/solr-core/test/J0/./org.apache.solr.cloud.SyncSliceTest-jetty2-1355625319032
[junit4:junit4]   2> 6036 T318 oasc.SolrResourceLoader.<init> new SolrResourceLoader for deduced Solr Home: '/usr/home/hudson/hudson-slave/workspace/Lucene-Solr-Tests-trunk-Java6/solr/build/solr-core/test/J0/./org.apache.solr.cloud.SyncSliceTest-jetty2-1355625319032/'
[junit4:junit4]   2> 6071 T318 oass.SolrDispatchFilter.init SolrDispatchFilter.init()
[junit4:junit4]   2> 6072 T318 oasc.SolrResourceLoader.locateSolrHome JNDI not configured for solr (NoInitialContextEx)
[junit4:junit4]   2> 6072 T318 oasc.SolrResourceLoader.locateSolrHome using system property solr.solr.home: /usr/home/hudson/hudson-slave/workspace/Lucene-Solr-Tests-trunk-Java6/solr/build/solr-core/test/J0/./org.apache.solr.cloud.SyncSliceTest-jetty2-1355625319032
[junit4:junit4]   2> 6073 T318 oasc.CoreContainer$Initializer.initialize looking for solr.xml: /usr/home/hudson/hudson-slave/workspace/Lucene-Solr-Tests-trunk-Java6/solr/build/solr-core/test/J0/./org.apache.solr.cloud.SyncSliceTest-jetty2-1355625319032/solr.xml
[junit4:junit4]   2> 6073 T318 oasc.CoreContainer.<init> New CoreContainer 2129977463
[junit4:junit4]   2> 6074 T318 oasc.CoreContainer.load Loading CoreContainer using Solr Home: '/usr/home/hudson/hudson-slave/workspace/Lucene-Solr-Tests-trunk-Java6/solr/build/solr-core/test/J0/./org.apache.solr.cloud.SyncSliceTest-jetty2-1355625319032/'
[junit4:junit4]   2> 6075 T318 oasc.SolrResourceLoader.<init> new SolrResourceLoader for directory: '/usr/home/hudson/hudson-slave/workspace/Lucene-Solr-Tests-trunk-Java6/solr/build/solr-core/test/J0/./org.apache.solr.cloud.SyncSliceTest-jetty2-1355625319032/'
[junit4:junit4]   2> 6101 T318 oasc.CoreContainer.load Registering Log Listener
[junit4:junit4]   2> 6118 T318 oasc.CoreContainer.initZooKeeper Zookeeper client=127.0.0.1:58185/solr
[junit4:junit4]   2> 6119 T318 oasc.ZkController.checkChrootPath zkHost includes chroot
[junit4:junit4]   2> 6119 T318 oaz.ZooKeeper.<init> Initiating client connection, connectString=127.0.0.1:58185 sessionTimeout=60000 watcher=org.apache.solr.common.cloud.ConnectionManager@238f5df3
[junit4:junit4]   2> 6120 T318 oascc.ConnectionManager.waitForConnected Waiting for client to connect to ZooKeeper
[junit4:junit4]   2> 6121 T371 oaz.ClientCnxn$SendThread.logStartConnect Opening socket connection to server localhost/127.0.0.1:58185. Will not attempt to authenticate using SASL (access denied (javax.security.auth.AuthPermission getLoginConfiguration))
[junit4:junit4]   2> 6122 T371 oaz.ClientCnxn$SendThread.primeConnection Socket connection established to localhost/127.0.0.1:58185, initiating session
[junit4:junit4]   2> 6122 T320 oazs.NIOServerCnxnFactory.run Accepted socket connection from /140.211.11.196:58204
[junit4:junit4]   2> 6122 T320 oazs.ZooKeeperServer.processConnectRequest Client attempting to establish new session at /140.211.11.196:58204
[junit4:junit4]   2> 6129 T322 oazs.ZooKeeperServer.finishSessionInit Established session 0x13ba190b50e0007 with negotiated timeout 20000 for client /140.211.11.196:58204
[junit4:junit4]   2> 6130 T371 oaz.ClientCnxn$SendThread.onConnected Session establishment complete on server localhost/127.0.0.1:58185, sessionid = 0x13ba190b50e0007, negotiated timeout = 20000
[junit4:junit4]   2> 6130 T372 oascc.ConnectionManager.process Watcher org.apache.solr.common.cloud.ConnectionManager@238f5df3 name:ZooKeeperConnection Watcher:127.0.0.1:58185 got event WatchedEvent state:SyncConnected type:None path:null path:null type:None
[junit4:junit4]   2> 6130 T318 oascc.ConnectionManager.waitForConnected Client is connected to ZooKeeper
[junit4:junit4]   2> 6132 T323 oazs.PrepRequestProcessor.pRequest2Txn Processed session termination for sessionid: 0x13ba190b50e0007
[junit4:junit4]   2> 6143 T320 oazs.NIOServerCnxn.closeSock Closed socket connection for client /140.211.11.196:58204 which had sessionid 0x13ba190b50e0007
[junit4:junit4]   2> 6143 T372 oaz.ClientCnxn$EventThread.run EventThread shut down
[junit4:junit4]   2> 6143 T318 oaz.ZooKeeper.close Session: 0x13ba190b50e0007 closed
[junit4:junit4]   2> 6144 T318 oaz.ZooKeeper.<init> Initiating client connection, connectString=127.0.0.1:58185/solr sessionTimeout=8000 watcher=org.apache.solr.common.cloud.ConnectionManager@22cb95c6
[junit4:junit4]   2> 6145 T318 oascc.ConnectionManager.waitForConnected Waiting for client to connect to ZooKeeper
[junit4:junit4]   2> 6145 T373 oaz.ClientCnxn$SendThread.logStartConnect Opening socket connection to server localhost/127.0.0.1:58185. Will not attempt to authenticate using SASL (access denied (javax.security.auth.AuthPermission getLoginConfiguration))
[junit4:junit4]   2> 6146 T373 oaz.ClientCnxn$SendThread.primeConnection Socket connection established to localhost/127.0.0.1:58185, initiating session
[junit4:junit4]   2> 6146 T320 oazs.NIOServerCnxnFactory.run Accepted socket connection from /140.211.11.196:58205
[junit4:junit4]   2> 6146 T320 oazs.ZooKeeperServer.processConnectRequest Client attempting to establish new session at /140.211.11.196:58205
[junit4:junit4]   2> 6147 T322 oazs.ZooKeeperServer.finishSessionInit Established session 0x13ba190b50e0008 with negotiated timeout 8000 for client /140.211.11.196:58205
[junit4:junit4]   2> 6148 T373 oaz.ClientCnxn$SendThread.onConnected Session establishment complete on server localhost/127.0.0.1:58185, sessionid = 0x13ba190b50e0008, negotiated timeout = 8000
[junit4:junit4]   2> 6148 T374 oascc.ConnectionManager.process Watcher org.apache.solr.common.cloud.ConnectionManager@22cb95c6 name:ZooKeeperConnection Watcher:127.0.0.1:58185/solr got event WatchedEvent state:SyncConnected type:None path:null path:null type:None
[junit4:junit4]   2> 6148 T318 oascc.ConnectionManager.waitForConnected Client is connected to ZooKeeper
[junit4:junit4]   2> 6149 T323 oazs.PrepRequestProcessor.pRequest Got user-level KeeperException when processing sessionid:0x13ba190b50e0008 type:create cxid:0x1 zxid:0x6d txntype:-1 reqpath:n/a Error Path:/solr/overseer Error:KeeperErrorCode = NodeExists for /solr/overseer
[junit4:junit4]   2> 6151 T323 oazs.PrepRequestProcessor.pRequest Got user-level KeeperException when processing sessionid:0x13ba190b50e0008 type:create cxid:0x2 zxid:0x6e txntype:-1 reqpath:n/a Error Path:/solr/overseer Error:KeeperErrorCode = NodeExists for /solr/overseer
[junit4:junit4]   2> 6160 T318 oasc.ZkController.createEphemeralLiveNode Register node as live in ZooKeeper:/live_nodes/127.0.0.1:58203_zmed
[junit4:junit4]   2> 6161 T323 oazs.PrepRequestProcessor.pRequest Got user-level KeeperException when processing sessionid:0x13ba190b50e0008 type:delete cxid:0x4 zxid:0x6f txntype:-1 reqpath:n/a Error Path:/solr/live_nodes/127.0.0.1:58203_zmed Error:KeeperErrorCode = NoNode for /solr/live_nodes/127.0.0.1:58203_zmed
[junit4:junit4]   2> 6162 T318 oascc.SolrZkClient.makePath makePath: /live_nodes/127.0.0.1:58203_zmed
[junit4:junit4]   2> 6165 T346 oascc.ZkStateReader$2.process A cluster state change: WatchedEvent state:SyncConnected type:NodeChildrenChanged path:/live_nodes, has occurred - updating... (live nodes size: 2)
[junit4:junit4]   2> 6165 T359 oascc.ZkStateReader$2.process A cluster state change: WatchedEvent state:SyncConnected type:NodeChildrenChanged path:/live_nodes, has occurred - updating... (live nodes size: 2)
[junit4:junit4]   2> 6166 T340 oascc.ZkStateReader$3.process Updating live nodes... (3)
[junit4:junit4]   2> 6167 T340 oascc.ZkStateReader$2.process A cluster state change: WatchedEvent state:SyncConnected type:NodeChildrenChanged path:/live_nodes, has occurred - updating... (live nodes size: 3)
[junit4:junit4]   2> 6167 T318 oashc.HttpShardHandlerFactory.getParameter Setting socketTimeout to: 0
[junit4:junit4]   2> 6167 T346 oascc.ZkStateReader$3.process Updating live nodes... (3)
[junit4:junit4]   2> 6167 T318 oashc.HttpShardHandlerFactory.getParameter Setting urlScheme to: http://
[junit4:junit4]   2> 6168 T359 oascc.ZkStateReader$3.process Updating live nodes... (3)
[junit4:junit4]   2> 6168 T318 oashc.HttpShardHandlerFactory.getParameter Setting connTimeout to: 0
[junit4:junit4]   2> 6169 T318 oashc.HttpShardHandlerFactory.getParameter Setting maxConnectionsPerHost to: 20
[junit4:junit4]   2> 6169 T318 oashc.HttpShardHandlerFactory.getParameter Setting corePoolSize to: 0
[junit4:junit4]   2> 6170 T318 oashc.HttpShardHandlerFactory.getParameter Setting maximumPoolSize to: 2147483647
[junit4:junit4]   2> 6170 T318 oashc.HttpShardHandlerFactory.getParameter Setting maxThreadIdleTime to: 5
[junit4:junit4]   2> 6171 T318 oashc.HttpShardHandlerFactory.getParameter Setting sizeOfQueue to: -1
[junit4:junit4]   2> 6171 T318 oashc.HttpShardHandlerFactory.getParameter Setting fairnessPolicy to: false
[junit4:junit4]   2> 6172 T318 oascsi.HttpClientUtil.createClient Creating new http client, config:maxConnectionsPerHost=20&maxConnections=10000&socketTimeout=0&connTimeout=0&retry=false
[junit4:junit4]   2> 6191 T318 oascc.ZkStateReader.createClusterStateWatchersAndUpdate Updating cluster state from ZooKeeper... 
[junit4:junit4]   2> 6203 T375 oasc.CoreContainer.create Creating SolrCore 'collection1' using instanceDir: /usr/home/hudson/hudson-slave/workspace/Lucene-Solr-Tests-trunk-Java6/solr/build/solr-core/test/J0/./org.apache.solr.cloud.SyncSliceTest-jetty2-1355625319032/collection1
[junit4:junit4]   2> 6203 T375 oasc.ZkController.createCollectionZkNode Check for collection zkNode:collection1
[junit4:junit4]   2> 6204 T375 oasc.ZkController.createCollectionZkNode Collection zkNode exists
[junit4:junit4]   2> 6205 T375 oasc.ZkController.readConfigName Load collection config from:/collections/collection1
[junit4:junit4]   2> 6206 T375 oasc.SolrResourceLoader.<init> new SolrResourceLoader for directory: '/usr/home/hudson/hudson-slave/workspace/Lucene-Solr-Tests-trunk-Java6/solr/build/solr-core/test/J0/./org.apache.solr.cloud.SyncSliceTest-jetty2-1355625319032/collection1/'
[junit4:junit4]   2> 6208 T375 oasc.SolrResourceLoader.replaceClassLoader Adding 'file:/usr/home/hudson/hudson-slave/workspace/Lucene-Solr-Tests-trunk-Java6/solr/build/solr-core/test/J0/org.apache.solr.cloud.SyncSliceTest-jetty2-1355625319032/collection1/lib/classes/' to classloader
[junit4:junit4]   2> 6208 T375 oasc.SolrResourceLoader.replaceClassLoader Adding 'file:/usr/home/hudson/hudson-slave/workspace/Lucene-Solr-Tests-trunk-Java6/solr/build/solr-core/test/J0/org.apache.solr.cloud.SyncSliceTest-jetty2-1355625319032/collection1/lib/README' to classloader
[junit4:junit4]   2> 6262 T375 oasc.SolrConfig.<init> Using Lucene MatchVersion: LUCENE_50
[junit4:junit4]   2> 6341 T375 oasc.SolrConfig.<init> Loaded SolrConfig: solrconfig.xml
[junit4:junit4]   2> 6348 T341 oascc.ZkStateReader.updateClusterState Updating cloud state from ZooKeeper... 
[junit4:junit4]   2> 6349 T341 oasc.Overseer$ClusterStateUpdater.updateState Update state numShards=1 message={
[junit4:junit4]   2> 	  "operation":"state",
[junit4:junit4]   2> 	  "numShards":"1",
[junit4:junit4]   2> 	  "shard":"shard1",
[junit4:junit4]   2> 	  "roles":null,
[junit4:junit4]   2> 	  "state":"active",
[junit4:junit4]   2> 	  "core":"collection1",
[junit4:junit4]   2> 	  "collection":"collection1",
[junit4:junit4]   2> 	  "node_name":"127.0.0.1:58200_zmed",
[junit4:junit4]   2> 	  "base_url":"http://127.0.0.1:58200/zmed"}
[junit4:junit4]   2> 6357 T340 oascc.ZkStateReader$2.process A cluster state change: WatchedEvent state:SyncConnected type:NodeDataChanged path:/clusterstate.json, has occurred - updating... (live nodes size: 3)
[junit4:junit4]   2> 6357 T359 oascc.ZkStateReader$2.process A cluster state change: WatchedEvent state:SyncConnected type:NodeDataChanged path:/clusterstate.json, has occurred - updating... (live nodes size: 3)
[junit4:junit4]   2> 6357 T346 oascc.ZkStateReader$2.process A cluster state change: WatchedEvent state:SyncConnected type:NodeDataChanged path:/clusterstate.json, has occurred - updating... (live nodes size: 3)
[junit4:junit4]   2> 6442 T375 oass.IndexSchema.readSchema Reading Solr Schema
[junit4:junit4]   2> 6442 T374 oascc.ZkStateReader$2.process A cluster state change: WatchedEvent state:SyncConnected type:NodeDataChanged path:/clusterstate.json, has occurred - updating... (live nodes size: 3)
[junit4:junit4]   2> 6448 T375 oass.IndexSchema.readSchema Schema name=test
[junit4:junit4]   2> 6878 T375 oass.OpenExchangeRatesOrgProvider.init Initialized with rates=open-exchange-rates.json, refreshInterval=1440.
[junit4:junit4]   2> 6886 T375 oass.IndexSchema.readSchema default search field in schema is text
[junit4:junit4]   2> 6889 T375 oass.IndexSchema.readSchema unique key field: id
[junit4:junit4]   2> 6906 T375 oass.FileExchangeRateProvider.reload Reloading exchange rates from file currency.xml
[junit4:junit4]   2> 6910 T375 oass.FileExchangeRateProvider.reload Reloading exchange rates from file currency.xml
[junit4:junit4]   2> 6914 T375 oass.OpenExchangeRatesOrgProvider.reload Reloading exchange rates from open-exchange-rates.json
[junit4:junit4]   2> 6915 T375 oass.OpenExchangeRatesOrgProvider.reload Reloading exchange rates from open-exchange-rates.json
[junit4:junit4]   2> 6917 T375 oasc.SolrCore.<init> [collection1] Opening new SolrCore at /usr/home/hudson/hudson-slave/workspace/Lucene-Solr-Tests-trunk-Java6/solr/build/solr-core/test/J0/./org.apache.solr.cloud.SyncSliceTest-jetty2-1355625319032/collection1/, dataDir=./org.apache.solr.cloud.SyncSliceTest-1355625313165/jetty2/
[junit4:junit4]   2> 6917 T375 oasc.JmxMonitoredMap.<init> JMX monitoring is enabled. Adding Solr mbeans to JMX Server: com.sun.jmx.mbeanserver.JmxMBeanServer@37e55794
[junit4:junit4]   2> 6918 T375 oasc.SolrCore.initDirectoryFactory solr.NRTCachingDirectoryFactory
[junit4:junit4]   2> 6918 T375 oasc.CachingDirectoryFactory.get return new directory for /usr/home/hudson/hudson-slave/workspace/Lucene-Solr-Tests-trunk-Java6/solr/build/solr-core/test/J0/./org.apache.solr.cloud.SyncSliceTest-1355625313165/jetty2 forceNew:false
[junit4:junit4]   2> 6919 T375 oasc.CachingDirectoryFactory.close Releasing directory:/usr/home/hudson/hudson-slave/workspace/Lucene-Solr-Tests-trunk-Java6/solr/build/solr-core/test/J0/./org.apache.solr.cloud.SyncSliceTest-1355625313165/jetty2
[junit4:junit4]   2> 6919 T375 oasc.SolrCore.getNewIndexDir New index directory detected: old=null new=./org.apache.solr.cloud.SyncSliceTest-1355625313165/jetty2/index/
[junit4:junit4]   2> 6919 T375 oasc.SolrCore.initIndex WARNING [collection1] Solr index directory './org.apache.solr.cloud.SyncSliceTest-1355625313165/jetty2/index' doesn't exist. Creating new index...
[junit4:junit4]   2> 6920 T375 oasc.CachingDirectoryFactory.get return new directory for /usr/home/hudson/hudson-slave/workspace/Lucene-Solr-Tests-trunk-Java6/solr/build/solr-core/test/J0/./org.apache.solr.cloud.SyncSliceTest-1355625313165/jetty2/index forceNew:false
[junit4:junit4]   2> 6944 T375 oasc.SolrDeletionPolicy.onCommit SolrDeletionPolicy.onCommit: commits:num=1
[junit4:junit4]   2> 		commit{dir=RateLimitedDirectoryWrapper(NRTCachingDirectory(org.apache.lucene.store.NIOFSDirectory@/usr/home/hudson/hudson-slave/workspace/Lucene-Solr-Tests-trunk-Java6/solr/build/solr-core/test/J0/org.apache.solr.cloud.SyncSliceTest-1355625313165/jetty2/index lockFactory=org.apache.lucene.store.NativeFSLockFactory@59a73c61; maxCacheMB=48.0 maxMergeSizeMB=4.0)),segFN=segments_1,generation=1,filenames=[segments_1]
[junit4:junit4]   2> 6944 T375 oasc.SolrDeletionPolicy.updateCommits newest commit = 1[segments_1]
[junit4:junit4]   2> 6945 T375 oasc.CachingDirectoryFactory.close Releasing directory:/usr/home/hudson/hudson-slave/workspace/Lucene-Solr-Tests-trunk-Java6/solr/build/solr-core/test/J0/./org.apache.solr.cloud.SyncSliceTest-1355625313165/jetty2/index
[junit4:junit4]   2> 6945 T375 oasc.SolrCore.initWriters created xml: solr.XMLResponseWriter
[junit4:junit4]   2> 6947 T375 oasup.UpdateRequestProcessorChain.init inserting DistributedUpdateProcessorFactory into updateRequestProcessorChain "dedupe"
[junit4:junit4]   2> 6947 T375 oasup.UpdateRequestProcessorChain.init inserting DistributedUpdateProcessorFactory into updateRequestProcessorChain "dedupe-allfields"
[junit4:junit4]   2> 6947 T375 oasup.UpdateRequestProcessorChain.init inserting DistributedUpdateProcessorFactory into updateRequestProcessorChain "stored_sig"
[junit4:junit4]   2> 6948 T375 oasup.UpdateRequestProcessorChain.init inserting DistributedUpdateProcessorFactory into updateRequestProcessorChain "uniq-fields"
[junit4:junit4]   2> 6948 T375 oasup.UpdateRequestProcessorChain.init inserting DistributedUpdateProcessorFactory into updateRequestProcessorChain "distrib-dup-test-chain-implicit"
[junit4:junit4]   2> 6948 T375 oasc.RequestHandlers.initHandlersFromConfig adding lazy requestHandler: solr.ReplicationHandler
[junit4:junit4]   2> 6949 T375 oasc.RequestHandlers.initHandlersFromConfig created /replication: solr.ReplicationHandler
[junit4:junit4]   2> 6949 T375 oasc.RequestHandlers.initHandlersFromConfig created standard: solr.StandardRequestHandler
[junit4:junit4]   2> 6950 T375 oasc.RequestHandlers.initHandlersFromConfig created /get: solr.RealTimeGetHandler
[junit4:junit4]   2> 6951 T375 oasc.RequestHandlers.initHandlersFromConfig created dismax: solr.SearchHandler
[junit4:junit4]   2> 6951 T375 oasc.RequestHandlers.initHandlersFromConfig created mock: org.apache.solr.core.MockQuerySenderListenerReqHandler
[junit4:junit4]   2> 6952 T375 oasc.RequestHandlers.initHandlersFromConfig created /admin/: org.apache.solr.handler.admin.AdminHandlers
[junit4:junit4]   2> 6952 T375 oasc.RequestHandlers.initHandlersFromConfig created defaults: solr.StandardRequestHandler
[junit4:junit4]   2> 6953 T375 oasc.RequestHandlers.initHandlersFromConfig adding lazy requestHandler: solr.StandardRequestHandler
[junit4:junit4]   2> 6953 T375 oasc.RequestHandlers.initHandlersFromConfig created lazy: solr.StandardRequestHandler
[junit4:junit4]   2> 6954 T375 oasc.RequestHandlers.initHandlersFromConfig created /update: solr.UpdateRequestHandler
[junit4:junit4]   2> 6955 T375 oasc.RequestHandlers.initHandlersFromConfig created /terms: org.apache.solr.handler.component.SearchHandler
[junit4:junit4]   2> 6955 T375 oasc.RequestHandlers.initHandlersFromConfig created spellCheckCompRH: org.apache.solr.handler.component.SearchHandler
[junit4:junit4]   2> 6956 T375 oasc.RequestHandlers.initHandlersFromConfig created spellCheckCompRH_Direct: org.apache.solr.handler.component.SearchHandler
[junit4:junit4]   2> 6957 T375 oasc.RequestHandlers.initHandlersFromConfig created spellCheckWithWordbreak: org.apache.solr.handler.component.SearchHandler
[junit4:junit4]   2> 6957 T375 oasc.RequestHandlers.initHandlersFromConfig created spellCheckWithWordbreak_Direct: org.apache.solr.handler.component.SearchHandler
[junit4:junit4]   2> 6958 T375 oasc.RequestHandlers.initHandlersFromConfig created spellCheckCompRH1: org.apache.solr.handler.component.SearchHandler
[junit4:junit4]   2> 6959 T375 oasc.RequestHandlers.initHandlersFromConfig created mltrh: org.apache.solr.handler.component.SearchHandler
[junit4:junit4]   2> 6959 T375 oasc.RequestHandlers.initHandlersFromConfig created tvrh: org.apache.solr.handler.component.SearchHandler
[junit4:junit4]   2> 6960 T375 oasc.RequestHandlers.initHandlersFromConfig created /mlt: solr.MoreLikeThisHandler
[junit4:junit4]   2> 6961 T375 oasc.RequestHandlers.initHandlersFromConfig created /debug/dump: solr.DumpRequestHandler
[junit4:junit4]   2> 6965 T375 oashl.XMLLoader.init xsltCacheLifetimeSeconds=60
[junit4:junit4]   2> 6969 T375 oasc.SolrCore.initDeprecatedSupport WARNING solrconfig.xml uses deprecated <admin/gettableFiles>, Please update your config to use the ShowFileRequestHandler.
[junit4:junit4]   2> 6970 T375 oasc.SolrCore.initDeprecatedSupport WARNING adding ShowFileRequestHandler with hidden files: [SCHEMA.XML, OLD_SYNONYMS.TXT, STOPWORDS.TXT, PROTWORDS.TXT, OPEN-EXCHANGE-RATES.JSON, SYNONYMS.TXT, CURRENCY.XML, MAPPING-ISOLATIN1ACCENT.TXT]
[junit4:junit4]   2> 6972 T375 oasc.CachingDirectoryFactory.close Releasing directory:/usr/home/hudson/hudson-slave/workspace/Lucene-Solr-Tests-trunk-Java6/solr/build/solr-core/test/J0/./org.apache.solr.cloud.SyncSliceTest-1355625313165/jetty2
[junit4:junit4]   2> 6973 T375 oass.SolrIndexSearcher.<init> Opening Searcher@551346c4 main
[junit4:junit4]   2> 6974 T375 oasu.CommitTracker.<init> Hard AutoCommit: disabled
[junit4:junit4]   2> 6974 T375 oasu.CommitTracker.<init> Soft AutoCommit: disabled
[junit4:junit4]   2> 6974 T375 oashc.SpellCheckComponent.inform Initializing spell checkers
[junit4:junit4]   2> 6979 T375 oass.DirectSolrSpellChecker.init init: {name=direct,classname=DirectSolrSpellChecker,field=lowerfilt,minQueryLength=3}
[junit4:junit4]   2> 7028 T376 oasc.SolrCore.registerSearcher [collection1] Registered new searcher Searcher@551346c4 main{StandardDirectoryReader(segments_1:1)}
[junit4:junit4]   2> 7032 T375 oasc.ZkController.publish publishing core=collection1 state=down
[junit4:junit4]   2> 7032 T375 oasc.ZkController.publish numShards not found on descriptor - reading it from system property
[junit4:junit4]   2> 7368 T341 oascc.ZkStateReader.updateClusterState Updating cloud state from ZooKeeper... 
[junit4:junit4]   2> 7369 T341 oasc.Overseer$ClusterStateUpdater.updateState Update state numShards=1 message={
[junit4:junit4]   2> 	  "operation":"state",
[junit4:junit4]   2> 	  "numShards":"1",
[junit4:junit4]   2> 	  "shard":null,
[junit4:junit4]   2> 	  "roles":null,
[junit4:junit4]   2> 	  "state":"down",
[junit4:junit4]   2> 	  "core":"collection1",
[junit4:junit4]   2> 	  "collection":"collection1",
[junit4:junit4]   2> 	  "node_name":"127.0.0.1:58203_zmed",
[junit4:junit4]   2> 	  "base_url":"http://127.0.0.1:58203/zmed"}
[junit4:junit4]   2> 7369 T341 oasc.Overseer$ClusterStateUpdater.updateState Collection already exists with numShards=1
[junit4:junit4]   2> 7369 T341 oasc.Overseer$ClusterStateUpdater.updateState Assigning new node to shard shard=shard1
[junit4:junit4]   2> 7383 T374 oascc.ZkStateReader$2.process A cluster state change: WatchedEvent state:SyncConnected type:NodeDataChanged path:/clusterstate.json, has occurred - updating... (live nodes size: 3)
[junit4:junit4]   2> 7383 T340 oascc.ZkStateReader$2.process A cluster state change: WatchedEvent state:SyncConnected type:NodeDataChanged path:/clusterstate.json, has occurred - updating... (live nodes size: 3)
[junit4:junit4]   2> 7383 T346 oascc.ZkStateReader$2.process A cluster state change: WatchedEvent state:SyncConnected type:NodeDataChanged path:/clusterstate.json, has occurred - updating... (live nodes size: 3)
[junit4:junit4]   2> 7383 T359 oascc.ZkStateReader$2.process A cluster state change: WatchedEvent state:SyncConnected type:NodeDataChanged path:/clusterstate.json, has occurred - updating... (live nodes size: 3)
[junit4:junit4]   2> 7535 T375 oasc.CoreContainer.registerCore registering core: collection1
[junit4:junit4]   2> 7535 T375 oasc.ZkController.register Register shard - core:collection1 address:http://127.0.0.1:58203/zmed shardId:shard1
[junit4:junit4]   2> 7538 T375 oasc.ZkController.register We are http://127.0.0.1:58203/zmed/collection1/ and leader is http://127.0.0.1:58200/zmed/collection1/
[junit4:junit4]   2> 7539 T375 oasc.ZkController.register No LogReplay needed for core=collection1 baseURL=http://127.0.0.1:58203/zmed
[junit4:junit4]   2> 7539 T375 oasc.ZkController.checkRecovery Core needs to recover:collection1
[junit4:junit4]   2> 7539 T375 oasu.DefaultSolrCoreState.doRecovery Running recovery - first canceling any ongoing recovery
[junit4:junit4]   2> ASYNC  NEW_CORE C16 name=collection1 org.apache.solr.core.SolrCore@238be9f2 url=http://127.0.0.1:58203/zmed/collection1 node=127.0.0.1:58203_zmed
[junit4:junit4]   2> 7543 T377 C16 P58203 oasc.RecoveryStrategy.run Starting recovery process.  core=collection1 recoveringAfterStartup=true
[junit4:junit4]   2> 7544 T375 oascc.ZkStateReader.updateClusterState Updating cloud state from ZooKeeper... 
[junit4:junit4]   2> 7544 T377 C16 P58203 oasc.RecoveryStrategy.doRecovery ###### startupVersions=[]
[junit4:junit4]   2> 7545 T377 C16 P58203 oasc.ZkController.publish publishing core=collection1 state=recovering
[junit4:junit4]   2> 7545 T377 C16 P58203 oasc.ZkController.publish numShards not found on descriptor - reading it from system property
[junit4:junit4]   2> 7545 T318 oass.SolrDispatchFilter.init user.dir=/usr/home/hudson/hudson-slave/workspace/Lucene-Solr-Tests-trunk-Java6/solr/build/solr-core/test/J0
[junit4:junit4]   2> 7546 T318 oass.SolrDispatchFilter.init SolrDispatchFilter.init() done
[junit4:junit4]   2> 7546 T377 C16 P58203 oasc.RecoveryStrategy.doRecovery Attempting to PeerSync from http://127.0.0.1:58200/zmed/collection1/ core=collection1 - recoveringAfterStartup=true
[junit4:junit4]   2> 7546 T318 oascsi.HttpClientUtil.createClient Creating new http client, config:maxConnections=128&maxConnectionsPerHost=32&followRedirects=false
[junit4:junit4]   2> 7556 T377 C16 P58203 oascsi.HttpClientUtil.createClient Creating new http client, config:maxConnectionsPerHost=20&maxConnections=10000&connTimeout=30000&socketTimeout=30000&retry=false
[junit4:junit4]   2> 7575 T377 C16 P58203 oasu.PeerSync.sync PeerSync: core=collection1 url=http://127.0.0.1:58203/zmed START replicas=[http://127.0.0.1:58200/zmed/collection1/] nUpdates=100
[junit4:junit4]   2> 7576 T377 C16 P58203 oasu.PeerSync.sync WARNING no frame of reference to tell of we've missed updates
[junit4:junit4]   2> 7576 T377 C16 P58203 oasc.RecoveryStrategy.doRecovery PeerSync Recovery was not successful - trying replication. core=collection1
[junit4:junit4]   2> 7576 T377 C16 P58203 oasc.RecoveryStrategy.doRecovery Starting Replication Recovery. core=collection1
[junit4:junit4]   2> 7577 T377 C16 P58203 oascsi.HttpClientUtil.createClient Creating new http client, config:maxConnections=128&maxConnectionsPerHost=32&followRedirects=false
[junit4:junit4]   2> ASYNC  NEW_CORE C17 name=collection1 org.apache.solr.core.SolrCore@2e80f606 url=http://127.0.0.1:58200/zmed/collection1 node=127.0.0.1:58200_zmed
[junit4:junit4]   2> 7584 T349 C17 P58200 REQ /get {distrib=false&qt=/get&wt=javabin&version=2&getVersions=100} status=0 QTime=0 
[junit4:junit4]   2> 7686 T318 oejs.Server.doStart jetty-8.1.8.v20121106
[junit4:junit4]   2> 7688 T318 oejs.AbstractConnector.doStart Started SocketConnector@127.0.0.1:58208
[junit4:junit4]   2> 7689 T318 oasc.SolrResourceLoader.locateSolrHome JNDI not configured for solr (NoInitialContextEx)
[junit4:junit4]   2> 7689 T318 oasc.SolrResourceLoader.locateSolrHome using system property solr.solr.home: /usr/home/hudson/hudson-slave/workspace/Lucene-Solr-Tests-trunk-Java6/solr/build/solr-core/test/J0/./org.apache.solr.cloud.SyncSliceTest-jetty3-1355625320720
[junit4:junit4]   2> 7690 T318 oasc.SolrResourceLoader.<init> new SolrResourceLoader for deduced Solr Home: '/usr/home/hudson/hudson-slave/workspace/Lucene-Solr-Tests-trunk-Java6/solr/build/solr-core/test/J0/./org.apache.solr.cloud.SyncSliceTest-jetty3-1355625320720/'
[junit4:junit4]   2> 7714 T318 oass.SolrDispatchFilter.init SolrDispatchFilter.init()
[junit4:junit4]   2> 7714 T318 oasc.SolrResourceLoader.locateSolrHome JNDI not configured for solr (NoInitialContextEx)
[junit4:junit4]   2> 7715 T318 oasc.SolrResourceLoader.locateSolrHome using system property solr.solr.home: /usr/home/hudson/hudson-slave/workspace/Lucene-Solr-Tests-trunk-Java6/solr/build/solr-core/test/J0/./org.apache.solr.cloud.SyncSliceTest-jetty3-1355625320720
[junit4:junit4]   2> 7715 T318 oasc.CoreContainer$Initializer.initialize looking for solr.xml: /usr/home/hudson/hudson-slave/workspace/Lucene-Solr-Tests-trunk-Java6/solr/build/solr-core/test/J0/./org.apache.solr.cloud.SyncSliceTest-jetty3-1355625320720/solr.xml
[junit4:junit4]   2> 7715 T318 oasc.CoreContainer.<init> New CoreContainer 563330706
[junit4:junit4]   2> 7716 T318 oasc.CoreContainer.load Loading CoreContainer using Solr Home: '/usr/home/hudson/hudson-slave/workspace/Lucene-Solr-Tests-trunk-Java6/solr/build/solr-core/test/J0/./org.apache.solr.cloud.SyncSliceTest-jetty3-1355625320720/'
[junit4:junit4]   2> 7716 T318 oasc.SolrResourceLoader.<init> new SolrResourceLoader for directory: '/usr/home/hudson/hudson-slave/workspace/Lucene-Solr-Tests-trunk-Java6/solr/build/solr-core/test/J0/./org.apache.solr.cloud.SyncSliceTest-jetty3-1355625320720/'
[junit4:junit4]   2> 7735 T318 oasc.CoreContainer.load Registering Log Listener
[junit4:junit4]   2> 7746 T318 oasc.CoreContainer.initZooKeeper Zookeeper client=127.0.0.1:58185/solr
[junit4:junit4]   2> 7747 T318 oasc.ZkController.checkChrootPath zkHost includes chroot
[junit4:junit4]   2> 7748 T318 oaz.ZooKeeper.<init> Initiating client connection, connectString=127.0.0.1:58185 sessionTimeout=60000 watcher=org.apache.solr.common.cloud.ConnectionManager@7ba25bd
[junit4:junit4]   2> 7748 T318 oascc.ConnectionManager.waitForConnected Waiting for client to connect to ZooKeeper
[junit4:junit4]   2> 7749 T388 oaz.ClientCnxn$SendThread.logStartConnect Opening socket connection to server localhost/127.0.0.1:58185. Will not attempt to authenticate using SASL (access denied (javax.security.auth.AuthPermission getLoginConfiguration))
[junit4:junit4]   2> 7750 T388 oaz.ClientCnxn$SendThread.primeConnection Socket connection established to localhost/127.0.0.1:58185, initiating session
[junit4:junit4]   2> 7750 T320 oazs.NIOServerCnxnFactory.run Accepted socket connection from /140.211.11.196:58209
[junit4:junit4]   2> 7750 T320 oazs.ZooKeeperServer.processConnectRequest Client attempting to establish new session at /140.211.11.196:58209
[junit4:junit4]   2> 7752 T322 oazs.ZooKeeperServer.finishSessionInit Established session 0x13ba190b50e0009 with negotiated timeout 20000 for client /140.211.11.196:58209
[junit4:junit4]   2> 7752 T388 oaz.ClientCnxn$SendThread.onConnected Session establishment complete on server localhost/127.0.0.1:58185, sessionid = 0x13ba190b50e0009, negotiated timeout = 20000
[junit4:junit4]   2> 7753 T389 oascc.ConnectionManager.process Watcher org.apache.solr.common.cloud.ConnectionManager@7ba25bd name:ZooKeeperConnection Watcher:127.0.0.1:58185 got event WatchedEvent state:SyncConnected type:None path:null path:null type:None
[junit4:junit4]   2> 7753 T318 oascc.ConnectionManager.waitForConnected Client is connected to ZooKeeper
[junit4:junit4]   2> 7755 T323 oazs.PrepRequestProcessor.pRequest2Txn Processed session termination for sessionid: 0x13ba190b50e0009
[junit4:junit4]   2> 7767 T389 oaz.ClientCnxn$EventThread.run EventThread shut down
[junit4:junit4]   2> 7767 T320 oazs.NIOServerCnxn.closeSock Closed socket connection for client /140.211.11.196:58209 which had sessionid 0x13ba190b50e0009
[junit4:junit4]   2> 7767 T318 oaz.ZooKeeper.close Session: 0x13ba190b50e0009 closed
[junit4:junit4]   2> 7768 T318 oaz.ZooKeeper.<init> Initiating client connection, connectString=127.0.0.1:58185/solr sessionTimeout=8000 watcher=org.apache.solr.common.cloud.ConnectionManager@4e88b2fa
[junit4:junit4]   2> 7769 T318 oascc.ConnectionManager.waitForConnected Waiting for client to connect to ZooKeeper
[junit4:junit4]   2> 7769 T390 oaz.ClientCnxn$SendThread.logStartConnect Opening socket connection to server localhost/127.0.0.1:58185. Will not attempt to authenticate using SASL (access denied (javax.security.auth.AuthPermission getLoginConfiguration))
[junit4:junit4]   2> 7770 T390 oaz.ClientCnxn$SendThread.primeConnection Socket connection established to localhost/127.0.0.1:58185, initiating session
[junit4:junit4]   2> 7770 T320 oazs.NIOServerCnxnFactory.run Accepted socket connection from /140.211.11.196:58210
[junit4:junit4]   2> 7770 T320 oazs.ZooKeeperServer.processConnectRequest Client attempting to establish new session at /140.211.11.196:58210
[junit4:junit4]   2> 7771 T322 oazs.ZooKeeperServer.finishSessionInit Established session 0x13ba190b50e000a with negotiated timeout 8000 for client /140.211.11.196:58210
[junit4:junit4]   2> 7771 T390 oaz.ClientCnxn$SendThread.onConnected Session establishment complete on server localhost/127.0.0.1:58185, sessionid = 0x13ba190b50e000a, negotiated timeout = 8000
[junit4:junit4]   2> 7772 T391 oascc.ConnectionManager.process Watcher org.apache.solr.common.cloud.ConnectionManager@4e88b2fa name:ZooKeeperConnection Watcher:127.0.0.1:58185/solr got event WatchedEvent state:SyncConnected type:None path:null path:null type:None
[junit4:junit4]   2> 7772 T318 oascc.ConnectionManager.waitForConnected Client is connected to ZooKeeper
[junit4:junit4]   2> 7775 T323 oazs.PrepRequestProcessor.pRequest Got user-level KeeperException when processing sessionid:0x13ba190b50e000a type:create cxid:0x1 zxid:0x80 txntype:-1 reqpath:n/a Error Path:/solr/overseer Error:KeeperErrorCode = NodeExists for /solr/overseer
[junit4:junit4]   2> 7777 T323 oazs.PrepRequestProcessor.pRequest Got user-level KeeperException when processing sessionid:0x13ba190b50e000a type:create cxid:0x2 zxid:0x81 txntype:-1 reqpath:n/a Error Path:/solr/overseer Error:KeeperErrorCode = NodeExists for /solr/overseer
[junit4:junit4]   2> 7778 T318 oasc.ZkController.createEphemeralLiveNode Register node as live in ZooKeeper:/live_nodes/127.0.0.1:58208_zmed
[junit4:junit4]   2> 7779 T323 oazs.PrepRequestProcessor.pRequest Got user-level KeeperException when processing sessionid:0x13ba190b50e000a type:delete cxid:0x4 zxid:0x82 txntype:-1 reqpath:n/a Error Path:/solr/live_nodes/127.0.0.1:58208_zmed Error:KeeperErrorCode = NoNode for /solr/live_nodes/127.0.0.1:58208_zmed
[junit4:junit4]   2> 7787 T318 oascc.SolrZkClient.makePath makePath: /live_nodes/127.0.0.1:58208_zmed
[junit4:junit4]   2> 7790 T359 oascc.ZkStateReader$2.process A cluster state change: WatchedEvent state:SyncConnected type:NodeChildrenChanged path:/live_nodes, has occurred - updating... (live nodes size: 3)
[junit4:junit4]   2> 7790 T346 oascc.ZkStateReader$2.process A cluster state change: WatchedEvent state:SyncConnected type:NodeChildrenChanged path:/live_nodes, has occurred - updating... (live nodes size: 3)
[junit4:junit4]   2> 7791 T374 oascc.ZkStateReader$3.process Updating live nodes... (4)
[junit4:junit4]   2> 7791 T374 oascc.ZkStateReader$2.process A cluster state change: WatchedEvent state:SyncConnected type:NodeChildrenChanged path:/live_nodes, has occurred - updating... (live nodes size: 4)
[junit4:junit4]   2> 7791 T340 oascc.ZkStateReader$3.process Updating live nodes... (4)
[junit4:junit4]   2> 7791 T340 oascc.ZkStateReader$2.process A cluster state change: WatchedEvent state:SyncConnected type:NodeChildrenChanged path:/live_nodes, has occurred - updating... (live nodes size: 4)
[junit4:junit4]   2> 7791 T318 oashc.HttpShardHandlerFactory.getParameter Setting socketTimeout to: 0
[junit4:junit4]   2> 7792 T318 oashc.HttpShardHandlerFactory.getParameter Setting urlScheme to: http://
[junit4:junit4]   2> 7792 T359 oascc.ZkStateReader$3.process Updating live nodes... (4)
[junit4:junit4]   2> 7792 T346 oascc.ZkStateReader$3.process Updating live nodes... (4)
[junit4:junit4]   2> 7792 T318 oashc.HttpShardHandlerFactory.getParameter Setting connTimeout to: 0
[junit4:junit4]   2> 7793 T318 oashc.HttpShardHandlerFactory.getParameter Setting maxConnectionsPerHost to: 20
[junit4:junit4]   2> 7793 T318 oashc.HttpShardHandlerFactory.getParameter Setting corePoolSize to: 0
[junit4:junit4]   2> 7793 T318 oashc.HttpShardHandlerFactory.getParameter Setting maximumPoolSize to: 2147483647
[junit4:junit4]   2> 7794 T318 oashc.HttpShardHandlerFactory.getParameter Setting maxThreadIdleTime to: 5
[junit4:junit4]   2> 7794 T318 oashc.HttpShardHandlerFactory.getParameter Setting sizeOfQueue to: -1
[junit4:junit4]   2> 7795 T318 oashc.HttpShardHandlerFactory.getParameter Setting fairnessPolicy to: false
[junit4:junit4]   2> 7795 T318 oascsi.HttpClientUtil.createClient Creating new http client, config:maxConnectionsPerHost=20&maxConnections=10000&socketTimeout=0&connTimeout=0&retry=false
[junit4:junit4]   2> 7809 T318 oascc.ZkStateReader.createClusterStateWatchersAndUpdate Updating cluster state from ZooKeeper... 
[junit4:junit4]   2> 7816 T392 oasc.CoreContainer.create Creating SolrCore 'collection1' using instanceDir: /usr/home/hudson/hudson-slave/workspace/Lucene-Solr-Tests-trunk-Java6/solr/build/solr-core/test/J0/./org.apache.solr.cloud.SyncSliceTest-jetty3-1355625320720/collection1
[junit4:junit4]   2> 7816 T392 oasc.ZkController.createCollectionZkNode Check for collection zkNode:collection1
[junit4:junit4]   2> 7817 T392 oasc.ZkController.createCollectionZkNode Collection zkNode exists
[junit4:junit4]   2> 7817 T392 oasc.ZkController.readConfigName Load collection config from:/collections/collection1
[junit4:junit4]   2> 7818 T392 oasc.SolrResourceLoader.<init> new SolrResourceLoader for directory: '/usr/home/hudson/hudson-slave/workspace/Lucene-Solr-Tests-trunk-Java6/solr/build/solr-core/test/J0/./org.apache.solr.cloud.SyncSliceTest-jetty3-1355625320720/collection1/'
[junit4:junit4]   2> 7819 T392 oasc.SolrResourceLoader.replaceClassLoader Adding 'file:/usr/home/hudson/hudson-slave/workspace/Lucene-Solr-Tests-trunk-Java6/solr/build/solr-core/test/J0/org.apache.solr.cloud.SyncSliceTest-jetty3-1355625320720/collection1/lib/README' to classloader
[junit4:junit4]   2> 7819 T392 oasc.SolrResourceLoader.replaceClassLoader Adding 'file:/usr/home/hudson/hudson-slave/workspace/Lucene-Solr-Tests-trunk-Java6/solr/build/solr-core/test/J0/org.apache.solr.cloud.SyncSliceTest-jetty3-1355625320720/collection1/lib/classes/' to classloader
[junit4:junit4]   2> 7855 T392 oasc.SolrConfig.<init> Using Lucene MatchVersion: LUCENE_50
[junit4:junit4]   2> 7889 T341 oascc.ZkStateReader.updateClusterState Updating cloud state from ZooKeeper... 
[junit4:junit4]   2> 7890 T341 oasc.Overseer$ClusterStateUpdater.updateState Update state numShards=1 message={
[junit4:junit4]   2> 	  "operation":"state",
[junit4:junit4]   2> 	  "numShards":"1",
[junit4:junit4]   2> 	  "shard":"shard1",
[junit4:junit4]   2> 	  "roles":null,
[junit4:junit4]   2> 	  "state":"recovering",
[junit4:junit4]   2> 	  "core":"collection1",
[junit4:junit4]   2> 	  "collection":"collection1",
[junit4:junit4]   2> 	  "node_name":"127.0.0.1:58203_zmed",
[junit4:junit4]   2> 	  "base_url":"http://127.0.0.1:58203/zmed"}
[junit4:junit4]   2> 7903 T359 oascc.ZkStateReader$2.process A cluster state change: WatchedEvent state:SyncConnected type:NodeDataChanged path:/clusterstate.json, has occurred - updating... (live nodes size: 4)
[junit4:junit4]   2> 7903 T374 oascc.ZkStateReader$2.process A cluster state change: WatchedEvent state:SyncConnected type:NodeDataChanged path:/clusterstate.json, has occurred - updating... (live nodes size: 4)
[junit4:junit4]   2> 7903 T391 oascc.ZkStateReader$2.process A cluster state change: WatchedEvent state:SyncConnected type:NodeDataChanged path:/clusterstate.json, has occurred - updating... (live nodes size: 4)
[junit4:junit4]   2> 7903 T340 oascc.ZkStateReader$2.process A cluster state change: WatchedEvent state:SyncConnected type:NodeDataChanged path:/clusterstate.json, has occurred - updating... (live nodes size: 4)
[junit4:junit4]   2> 7903 T346 oascc.ZkStateReader$2.process A cluster state change: WatchedEvent state:SyncConnected type:NodeDataChanged path:/clusterstate.json, has occurred - updating... (live nodes size: 4)
[junit4:junit4]   2> 7906 T392 oasc.SolrConfig.<init> Loaded SolrConfig: solrconfig.xml
[junit4:junit4]   2> 8007 T392 oass.IndexSchema.readSchema Reading Solr Schema
[junit4:junit4]   2> 8014 T392 oass.IndexSchema.readSchema Schema name=test
[junit4:junit4]   2> 8632 T392 oass.OpenExchangeRatesOrgProvider.init Initialized with rates=open-exchange-rates.json, refreshInterval=1440.
[junit4:junit4]   2> 8644 T392 oass.IndexSchema.readSchema default search field in schema is text
[junit4:junit4]   2> 8648 T392 oass.IndexSchema.readSchema unique key field: id
[junit4:junit4]   2> 8669 T392 oass.FileExchangeRateProvider.reload Reloading exchange rates from file currency.xml
[junit4:junit4]   2> 8674 T392 oass.FileExchangeRateProvider.reload Reloading exchange rates from file currency.xml
[junit4:junit4]   2> 8679 T392 oass.OpenExchangeRatesOrgProvider.reload Reloading exchange rates from open-exchange-rates.json
[junit4:junit4]   2> 8681 T392 oass.OpenExchangeRatesOrgProvider.reload Reloading exchange rates from open-exchange-rates.json
[junit4:junit4]   2> 8682 T392 oasc.SolrCore.<init> [collection1] Opening new SolrCore at /usr/home/hudson/hudson-slave/workspace/Lucene-Solr-Tests-trunk-Java6/solr/build/solr-core/test/J0/./org.apache.solr.cloud.SyncSliceTest-jetty3-1355625320720/collection1/, dataDir=./org.apache.solr.cloud.SyncSliceTest-1355625313165/jetty3/
[junit4:junit4]   2> 8683 T392 oasc.JmxMonitoredMap.<init> JMX monitoring is enabled. Adding Solr mbeans to JMX Server: com.sun.jmx.mbeanserver.JmxMBeanServer@37e55794
[junit4:junit4]   2> 8683 T392 oasc.SolrCore.initDirectoryFactory solr.NRTCachingDirectoryFactory
[junit4:junit4]   2> 8684 T392 oasc.CachingDirectoryFactory.get return new directory for /usr/home/hudson/hudson-slave/workspace/Lucene-Solr-Tests-trunk-Java6/solr/build/solr-core/test/J0/./org.apache.solr.cloud.SyncSliceTest-1355625313165/jetty3 forceNew:false
[junit4:junit4]   2> 8685 T392 oasc.CachingDirectoryFactory.close Releasing directory:/usr/home/hudson/hudson-slave/workspace/Lucene-Solr-Tests-trunk-Java6/solr/build/solr-core/test/J0/./org.apache.solr.cloud.SyncSliceTest-1355625313165/jetty3
[junit4:junit4]   2> 8685 T392 oasc.SolrCore.getNewIndexDir New index directory detected: old=null new=./org.apache.solr.cloud.SyncSliceTest-1355625313165/jetty3/index/
[junit4:junit4]   2> 8686 T392 oasc.SolrCore.initIndex WARNING [collection1] Solr index directory './org.apache.solr.cloud.SyncSliceTest-1355625313165/jetty3/index' doesn't exist. Creating new index...
[junit4:junit4]   2> 8686 T392 oasc.CachingDirectoryFactory.get return new directory for /usr/home/hudson/hudson-slave/workspace/Lucene-Solr-Tests-trunk-Java6/solr/build/solr-core/test/J0/./org.apache.solr.cloud.SyncSliceTest-1355625313165/jetty3/index forceNew:false
[junit4:junit4]   2> 8719 T392 oasc.SolrDeletionPolicy.onCommit SolrDeletionPolicy.onCommit: commits:num=1
[junit4:junit4]   2> 		commit{dir=RateLimitedDirectoryWrapper(NRTCachingDirectory(org.apache.lucene.store.NIOFSDirectory@/usr/home/hudson/hudson-slave/workspace/Lucene-Solr-Tests-trunk-Java6/solr/build/solr-core/test/J0/org.apache.solr.cloud.SyncSliceTest-1355625313165/jetty3/index lockFactory=org.apache.lucene.store.NativeFSLockFactory@1cd886cd; maxCacheMB=48.0 maxMergeSizeMB=4.0)),segFN=segments_1,generation=1,filenames=[segments_1]
[junit4:junit4]   2> 8719 T392 oasc.SolrDeletionPolicy.updateCommits newest commit = 1[segments_1]
[junit4:junit4]   2> 8720 T392 oasc.CachingDirectoryFactory.close Releasing directory:/usr/home/hudson/hudson-slave/workspace/Lucene-Solr-Tests-trunk-Java6/solr/build/solr-core/test/J0/./org.apache.solr.cloud.SyncSliceTest-1355625313165/jetty3/index
[junit4:junit4]   2> 8720 T392 oasc.SolrCore.initWriters created xml: solr.XMLResponseWriter
[junit4:junit4]   2> 8722 T392 oasup.UpdateRequestProcessorChain.init inserting DistributedUpdateProcessorFactory into updateRequestProcessorChain "dedupe"
[junit4:junit4]   2> 8722 T392 oasup.UpdateRequestProcessorChain.init inserting DistributedUpdateProcessorFactory into updateRequestProcessorChain "dedupe-allfields"
[junit4:junit4]   2> 8723 T392 oasup.UpdateRequestProcessorChain.init inserting DistributedUpdateProcessorFactory into updateRequestProcessorChain "stored_sig"
[junit4:junit4]   2> 8723 T392 oasup.UpdateRequestProcessorChain.init inserting DistributedUpdateProcessorFactory into updateRequestProcessorChain "uniq-fields"
[junit4:junit4]   2> 8724 T392 oasup.UpdateRequestProcessorChain.init inserting DistributedUpdateProcessorFactory into updateRequestProcessorChain "distrib-dup-test-chain-implicit"
[junit4:junit4]   2> 8724 T392 oasc.RequestHandlers.initHandlersFromConfig adding lazy requestHandler: solr.ReplicationHandler
[junit4:junit4]   2> 8725 T392 oasc.RequestHandlers.initHandlersFromConfig created /replication: solr.ReplicationHandler
[junit4:junit4]   2> 8726 T392 oasc.RequestHandlers.initHandlersFromConfig created standard: solr.StandardRequestHandler
[junit4:junit4]   2> 8727 T392 oasc.RequestHandlers.initHandlersFromConfig created /get: solr.RealTimeGetHandler
[junit4:junit4]   2> 8728 T392 oasc.RequestHandlers.initHandlersFromConfig created dismax: solr.SearchHandler
[junit4:junit4]   2> 8729 T392 oasc.RequestHandlers.initHandlersFromConfig created mock: org.apache.solr.core.MockQuerySenderListenerReqHandler
[junit4:junit4]   2> 8729 T392 oasc.RequestHandlers.initHandlersFromConfig created /admin/: org.apache.solr.handler.admin.AdminHandlers
[junit4:junit4]   2> 8730 T392 oasc.RequestHandlers.initHandlersFromConfig created defaults: solr.StandardRequestHandler
[junit4:junit4]   2> 8730 T392 oasc.RequestHandlers.initHandlersFromConfig adding lazy requestHandler: solr.StandardRequestHandler
[junit4:junit4]   2> 8731 T392 oasc.RequestHandlers.initHandlersFromConfig created lazy: solr.StandardRequestHandler
[junit4:junit4]   2> 8732 T392 oasc.RequestHandlers.initHandlersFromConfig created /update: solr.UpdateRequestHandler
[junit4:junit4]   2> 8733 T392 oasc.RequestHandlers.initHandlersFromConfig created /terms: org.apache.solr.handler.component.SearchHandler
[junit4:junit4]   2> 8734 T392 oasc.RequestHandlers.initHandlersFromConfig created spellCheckCompRH: org.apache.solr.handler.component.SearchHandler
[junit4:junit4]   2> 8734 T392 oasc.RequestHandlers.initHandlersFromConfig created spellCheckCompRH_Direct: org.apache.solr.handler.component.SearchHandler
[junit4:junit4]   2> 8735 T392 oasc.RequestHandlers.initHandlersFromConfig created spellCheckWithWordbreak: org.apache.solr.handler.component.SearchHandler
[junit4:junit4]   2> 8736 T392 oasc.RequestHandlers.initHandlersFromConfig created spellCheckWithWordbreak_Direct: org.apache.solr.handler.component.SearchHandler
[junit4:junit4]   2> 8737 T392 oasc.RequestHandlers.initHandlersFromConfig created spellCheckCompRH1: org.apache.solr.handler.component.SearchHandler
[junit4:junit4]   2> 8738 T392 oasc.RequestHandlers.initHandlersFromConfig created mltrh: org.apache.solr.handler.component.SearchHandler
[junit4:junit4]   2> 8739 T392 oasc.RequestHandlers.initHandlersFromConfig created tvrh: org.apache.solr.handler.component.SearchHandler
[junit4:junit4]   2> 8740 T392 oasc.RequestHandlers.initHandlersFromConfig created /mlt: solr.MoreLikeThisHandler
[junit4:junit4]   2> 8741 T392 oasc.RequestHandlers.initHandlersFromConfig created /debug/dump: solr.DumpRequestHandler
[junit4:junit4]   2> 8748 T392 oashl.XMLLoader.init xsltCacheLifetimeSeconds=60
[junit4:junit4]   2> 8753 T392 oasc.SolrCore.initDeprecatedSupport WARNING solrconfig.xml uses deprecated <admin/gettableFiles>, Please update your config to use the ShowFileRequestHandler.
[junit4:junit4]   2> 8755 T392 oasc.SolrCore.initDeprecatedSupport WARNING adding ShowFileRequestHandler with hidden files: [SCHEMA.XML, OLD_SYNONYMS.TXT, STOPWORDS.TXT, PROTWORDS.TXT, OPEN-EXCHANGE-RATES.JSON, SYNONYMS.TXT, CURRENCY.XML, MAPPING-ISOLATIN1ACCENT.TXT]
[junit4:junit4]   2> 8757 T392 oasc.CachingDirectoryFactory.close Releasing directory:/usr/home/hudson/hudson-slave/workspace/Lucene-Solr-Tests-trunk-Java6/solr/build/solr-core/test/J0/./org.apache.solr.cloud.SyncSliceTest-1355625313165/jetty3
[junit4:junit4]   2> 8759 T392 oass.SolrIndexSearcher.<init> Opening Searcher@626deb30 main
[junit4:junit4]   2> 8760 T392 oasu.CommitTracker.<init> Hard AutoCommit: disabled
[junit4:junit4]   2> 8761 T392 oasu.CommitTracker.<init> Soft AutoCommit: disabled
[junit4:junit4]   2> 8761 T392 oashc.SpellCheckComponent.inform Initializing spell checkers
[junit4:junit4]   2> 8768 T392 oass.DirectSolrSpellChecker.init init: {name=direct,classname=DirectSolrSpellChecker,field=lowerfilt,minQueryLength=3}
[junit4:junit4]   2> 8825 T393 oasc.SolrCore.registerSearcher [collection1] Registered new searcher Searcher@626deb30 main{StandardDirectoryReader(segments_1:1)}
[junit4:junit4]   2> 8829 T392 oasc.ZkController.publish publishing core=collection1 state=down
[junit4:junit4]   2> 8829 T392 oasc.ZkController.publish numShards not found on descriptor - reading it from system property
[junit4:junit4]   2> 8916 T341 oascc.ZkStateReader.updateClusterState Updating cloud state from ZooKeeper... 
[junit4:junit4]   2> 8917 T341 oasc.Overseer$ClusterStateUpdater.updateState Update state numShards=1 message={
[junit4:junit4]   2> 	  "operation":"state",
[junit4:junit4]   2> 	  "numShards":"1",
[junit4:junit4]   2> 	  "shard":null,
[junit4:junit4]   2> 	  "roles":null,
[junit4:junit4]   2> 	  "state":"down",
[junit4:junit4]   2> 	  "core":"collection1",
[junit4:junit4]   2> 	  "collection":"collection1",
[junit4:junit4]   2> 	  "node_name":"127.0.0.1:58208_zmed",
[junit4:junit4]   2> 	  "base_url":"http://127.0.0.1:58208/zmed"}
[junit4:junit4]   2> 8918 T341 oasc.Overseer$ClusterStateUpdater.updateState Collection already exists with numShards=1
[junit4:junit4]   2> 8918 T341 oasc.Overseer$ClusterStateUpdater.updateState Assigning new node to shard shard=shard1
[junit4:junit4]   2> 8931 T340 oascc.ZkStateReader$2.process A cluster state change: WatchedEvent state:SyncConnected type:NodeDataChanged path:/clusterstate.json, has occurred - updating... (live nodes size: 4)
[junit4:junit4]   2> 8931 T359 oascc.ZkStateReader$2.process A cluster state change: WatchedEvent state:SyncConnected type:NodeDataChanged path:/clusterstate.json, has occurred - updating... (live nodes size: 4)
[junit4:junit4]   2> 8931 T391 oascc.ZkStateReader$2.process A cluster state change: WatchedEvent state:SyncConnected type:NodeDataChanged path:/clusterstate.json, has occurred - updating... (live nodes size: 4)
[junit4:junit4]   2> 8931 T346 oascc.ZkStateReader$2.process A cluster state change: WatchedEvent state:SyncConnected type:NodeDataChanged path:/clusterstate.json, has occurred - updating... (live nodes size: 4)
[junit4:junit4]   2> 8931 T374 oascc.ZkStateReader$2.process A cluster state change: WatchedEvent state:SyncConnected type:NodeDataChanged path:/clusterstate.json, has occurred - updating... (live nodes size: 4)
[junit4:junit4]   2> 9332 T392 oasc.CoreContainer.registerCore registering core: collection1
[junit4:junit4]   2> 9332 T392 oasc.ZkController.register Register shard - core:collection1 address:http://127.0.0.1:58208/zmed shardId:shard1
[junit4:junit4]   2> 9336 T392 oasc.ZkController.register We are http://127.0.0.1:58208/zmed/collection1/ and leader is http://127.0.0.1:58200/zmed/collection1/
[junit4:junit4]   2> 9337 T392 oasc.ZkController.register No LogReplay needed for core=collection1 baseURL=http://127.0.0.1:58208/zmed
[junit4:junit4]   2> 9337 T392 oasc.ZkController.checkRecovery Core needs to recover:collection1
[junit4:junit4]   2> 9337 T392 oasu.DefaultSolrCoreState.doRecovery Running recovery - first canceling any ongoing recovery
[junit4:junit4]   2> ASYNC  NEW_CORE C18 name=collection1 org.apache.solr.core.SolrCore@187d3b0e url=http://127.0.0.1:58208/zmed/collection1 node=127.0.0.1:58208_zmed
[junit4:junit4]   2> 9338 T394 C18 P58208 oasc.RecoveryStrategy.run Starting recovery process.  core=collection1 recoveringAfterStartup=true
[junit4:junit4]   2> 9338 T392 oascc.ZkStateReader.updateClusterState Updating cloud state from ZooKeeper... 
[junit4:junit4]   2> 9339 T394 C18 P58208 oasc.RecoveryStrategy.doRecovery ###### startupVersions=[]
[junit4:junit4]   2> 9339 T394 C18 P58208 oasc.ZkController.publish publishing core=collection1 state=recovering
[junit4:junit4]   2> 9339 T394 C18 P58208 oasc.ZkController.publish numShards not found on descriptor - reading it from system property
[junit4:junit4]   2> 9340 T318 oass.SolrDispatchFilter.init user.dir=/usr/home/hudson/hudson-slave/workspace/Lucene-Solr-Tests-trunk-Java6/solr/build/solr-core/test/J0
[junit4:junit4]   2> 9340 T318 oass.SolrDispatchFilter.init SolrDispatchFilter.init() done
[junit4:junit4]   2> 9341 T318 oascsi.HttpClientUtil.createClient Creating new http client, config:maxConnections=128&maxConnectionsPerHost=32&followRedirects=false
[junit4:junit4]   2> 9341 T394 C18 P58208 oasc.RecoveryStrategy.doRecovery Attempting to PeerSync from http://127.0.0.1:58200/zmed/collection1/ core=collection1 - recoveringAfterStartup=true
[junit4:junit4]   2> 9341 T394 C18 P58208 oasu.PeerSync.sync PeerSync: core=collection1 url=http://127.0.0.1:58208/zmed START replicas=[http://127.0.0.1:58200/zmed/collection1/] nUpdates=100
[junit4:junit4]   2> 9342 T394 C18 P58208 oasu.PeerSync.sync WARNING no frame of reference to tell of we've missed updates
[junit4:junit4]   2> 9343 T394 C18 P58208 oasc.RecoveryStrategy.doRecovery PeerSync Recovery was not successful - trying replication. core=collection1
[junit4:junit4]   2> 9343 T394 C18 P58208 oasc.RecoveryStrategy.doRecovery Starting Replication Recovery. core=collection1
[junit4:junit4]   2> 9343 T394 C18 P58208 oascsi.HttpClientUtil.createClient Creating new http client, config:maxConnections=128&maxConnectionsPerHost=32&followRedirects=false
[junit4:junit4]   2> 9346 T349 C17 P58200 REQ /get {distrib=false&qt=/get&wt=javabin&version=2&getVersions=100} status=0 QTime=0 
[junit4:junit4]   2> 9438 T341 oascc.ZkStateReader.updateClusterState Updating cloud state from ZooKeeper... 
[junit4:junit4]   2> 9439 T341 oasc.Overseer$ClusterStateUpdater.updateState Update state numShards=1 message={
[junit4:junit4]   2> 	  "operation":"state",
[junit4:junit4]   2> 	  "numShards":"1",
[junit4:junit4]   2> 	  "shard":"shard1",
[junit4:junit4]   2> 	  "roles":null,
[junit4:junit4]   2> 	  "state":"recovering",
[junit4:junit4]   2> 	  "core":"collection1",
[junit4:junit4]   2> 	  "collection":"collection1",
[junit4:junit4]   2> 	  "node_name":"127.0.0.1:58208_zmed",
[junit4:junit4]   2> 	  "base_url":"http://127.0.0.1:58208/zmed"}
[junit4:junit4]   2> 9453 T340 oascc.ZkStateReader$2.process A cluster state change: WatchedEvent state:SyncConnected type:NodeDataChanged path:/clusterstate.json, has occurred - updating... (live nodes size: 4)
[junit4:junit4]   2> 9454 T346 oascc.ZkStateReader$2.process A cluster state change: WatchedEvent state:SyncConnected type:NodeDataChanged path:/clusterstate.json, has occurred - updating... (live nodes size: 4)
[junit4:junit4]   2> 9454 T374 oascc.ZkStateReader$2.process A cluster state change: WatchedEvent state:SyncConnected type:NodeDataChanged path:/clusterstate.json, has occurred - updating... (live nodes size: 4)
[junit4:junit4]   2> 9454 T359 oascc.ZkStateReader$2.process A cluster state change: WatchedEvent state:SyncConnected type:NodeDataChanged path:/clusterstate.json, has occurred - updating... (live nodes size: 4)
[junit4:junit4]   2> 9454 T391 oascc.ZkStateReader$2.process A cluster state change: WatchedEvent state:SyncConnected type:NodeDataChanged path:/clusterstate.json, has occurred - updating... (live nodes size: 4)
[junit4:junit4]   2> 9459 T318 oejs.Server.doStart jetty-8.1.8.v20121106
[junit4:junit4]   2> 9462 T318 oejs.AbstractConnector.doStart Started SocketConnector@127.0.0.1:58213
[junit4:junit4]   2> 9462 T318 oasc.SolrResourceLoader.locateSolrHome JNDI not configured for solr (NoInitialContextEx)
[junit4:junit4]   2> 9463 T318 oasc.SolrResourceLoader.locateSolrHome using system property solr.solr.home: /usr/home/hudson/hudson-slave/workspace/Lucene-Solr-Tests-trunk-Java6/solr/build/solr-core/test/J0/./org.apache.solr.cloud.SyncSliceTest-jetty4-1355625322512
[junit4:junit4]   2> 9463 T318 oasc.SolrResourceLoader.<init> new SolrResourceLoader for deduced Solr Home: '/usr/home/hudson/hudson-slave/workspace/Lucene-Solr-Tests-trunk-Java6/solr/build/solr-core/test/J0/./org.apache.solr.cloud.SyncSliceTest-jetty4-1355625322512/'
[junit4:junit4]   2> 9487 T318 oass.SolrDispatchFilter.init SolrDispatchFilter.init()
[junit4:junit4]   2> 9487 T318 oasc.SolrResourceLoader.locateSolrHome JNDI not configured for solr (NoInitialContextEx)
[junit4:junit4]   2> 9488 T318 oasc.SolrResourceLoader.locateSolrHome using system property solr.solr.home: /usr/home/hudson/hudson-slave/workspace/Lucene-Solr-Tests-trunk-Java6/solr/build/solr-core/test/J0/./org.apache.solr.cloud.SyncSliceTest-jetty4-1355625322512
[junit4:junit4]   2> 9488 T318 oasc.CoreContainer$Initializer.initialize looking for solr.xml: /usr/home/hudson/hudson-slave/workspace/Lucene-Solr-Tests-trunk-Java6/solr/build/solr-core/test/J0/./org.apache.solr.cloud.SyncSliceTest-jetty4-1355625322512/solr.xml
[junit4:junit4]   2> 9488 T318 oasc.CoreContainer.<init> New CoreContainer 2144934647
[junit4:junit4]   2> 9489 T318 oasc.CoreContainer.load Loading CoreContainer using Solr Home: '/usr/home/hudson/hudson-slave/workspace/Lucene-Solr-Tests-trunk-Java6/solr/build/solr-core/test/J0/./org.apache.solr.cloud.SyncSliceTest-jetty4-1355625322512/'
[junit4:junit4]   2> 9489 T318 oasc.SolrResourceLoader.<init> new SolrResourceLoader for directory: '/usr/home/hudson/hudson-slave/workspace/Lucene-Solr-Tests-trunk-Java6/solr/build/solr-core/test/J0/./org.apache.solr.cloud.SyncSliceTest-jetty4-1355625322512/'
[junit4:junit4]   2> 9508 T318 oasc.CoreContainer.load Registering Log Listener
[junit4:junit4]   2> 9520 T318 oasc.CoreContainer.initZooKeeper Zookeeper client=127.0.0.1:58185/solr
[junit4:junit4]   2> 9520 T318 oasc.ZkController.checkChrootPath zkHost includes chroot
[junit4:junit4]   2> 9521 T318 oaz.ZooKeeper.<init> Initiating client connection, connectString=127.0.0.1:58185 sessionTimeout=60000 watcher=org.apache.solr.common.cloud.ConnectionManager@16c975be
[junit4:junit4]   2> 9522 T318 oascc.ConnectionManager.waitForConnected Waiting for client to connect to ZooKeeper
[junit4:junit4]   2> 9522 T405 oaz.ClientCnxn$SendThread.logStartConnect Opening socket connection to server localhost/127.0.0.1:58185. Will not attempt to authenticate using SASL (access denied (javax.security.auth.AuthPermission getLoginConfiguration))
[junit4:junit4]   2> 9523 T405 oaz.ClientCnxn$SendThread.primeConnection Socket connection established to localhost/127.0.0.1:58185, initiating session
[junit4:junit4]   2> 9523 T320 oazs.NIOServerCnxnFactory.run Accepted socket connection from /140.211.11.196:58214
[junit4:junit4]   2> 9524 T320 oazs.ZooKeeperServer.processConnectRequest Client attempting to establish new session at /140.211.11.196:58214
[junit4:junit4]   2> 9525 T322 oazs.ZooKeeperServer.finishSessionInit Established session 0x13ba190b50e000b with negotiated timeout 20000 for client /140.211.11.196:58214
[junit4:junit4]   2> 9525 T405 oaz.ClientCnxn$SendThread.onConnected Session establishment complete on server localhost/127.0.0.1:58185, sessionid = 0x13ba190b50e000b, negotiated timeout = 20000
[junit4:junit4]   2> 9526 T406 oascc.ConnectionManager.process Watcher org.apache.solr.common.cloud.ConnectionManager@16c975be name:ZooKeeperConnection Watcher:127.0.0.1:58185 got event WatchedEvent state:SyncConnected type:None path:null path:null type:None
[junit4:junit4]   2> 9526 T318 oascc.ConnectionManager.waitForConnected Client is connected to ZooKeeper
[junit4:junit4]   2> 9528 T323 oazs.PrepRequestProcessor.pRequest2Txn Processed session termination for sessionid: 0x13ba190b50e000b
[junit4:junit4]   2> 9529 T406 oaz.ClientCnxn$EventThread.run EventThread shut down
[junit4:junit4]   2> 9529 T320 oazs.NIOServerCnxn.closeSock Closed socket connection for client /140.211.11.196:58214 which had sessionid 0x13ba190b50e000b
[junit4:junit4]   2> 9529 T318 oaz.ZooKeeper.close Session: 0x13ba190b50e000b closed
[junit4:junit4]   2> 9530 T318 oaz.ZooKeeper.<init> Initiating client connection, connectString=127.0.0.1:58185/solr sessionTimeout=8000 watcher=org.apache.solr.common.cloud.ConnectionManager@585a9eb3
[junit4:junit4]   2> 9531 T318 oascc.ConnectionManager.waitForConnected Waiting for client to connect to ZooKeeper
[junit4:junit4]   2> 9531 T407 oaz.ClientCnxn$SendThread.logStartConnect Opening socket connection to server localhost/127.0.0.1:58185. Will not attempt to authenticate using SASL (access denied (javax.security.auth.AuthPermission getLoginConfiguration))
[junit4:junit4]   2> 9532 T407 oaz.ClientCnxn$SendThread.primeConnection Socket connection established to localhost/127.0.0.1:58185, initiating session
[junit4:junit4]   2> 9532 T320 oazs.NIOServerCnxnFactory.run Accepted socket connection from /140.211.11.196:58215
[junit4:junit4]   2> 9532 T320 oazs.ZooKeeperServer.processConnectRequest Client attempting to establish new session at /140.211.11.196:58215
[junit4:junit4]   2> 9534 T322 oazs.ZooKeeperServer.finishSessionInit Established session 0x13ba190b50e000c with negotiated timeout 8000 for client /140.211.11.196:58215
[junit4:junit4]   2> 9534 T407 oaz.ClientCnxn$SendThread.onConnected Session establishment complete on server localhost/127.0.0.1:58185, sessionid = 0x13ba190b50e000c, negotiated timeout = 8000
[junit4:junit4]   2> 9534 T408 oascc.ConnectionManager.process Watcher org.apache.solr.common.cloud.ConnectionManager@585a9eb3 name:ZooKeeperConnection Watcher:127.0.0.1:58185/solr got event WatchedEvent state:SyncConnected type:None path:null path:null type:None
[junit4:junit4]   2> 9535 T318 oascc.ConnectionManager.waitForConnected Client is connected to ZooKeeper
[junit4:junit4]   2> 9536 T323 oazs.PrepRequestProcessor.pRequest Got user-level KeeperException when processing sessionid:0x13ba190b50e000c type:create cxid:0x1 zxid:0x97 txntype:-1 reqpath:n/a Error Path:/solr/overseer Error:KeeperErrorCode = NodeExists for /solr/overseer
[junit4:junit4]   2> 9539 T323 oazs.PrepRequestProcessor.pRequest Got user-level KeeperException when processing sessionid:0x13ba190b50e000c type:create cxid:0x2 zxid:0x98 txntype:-1 reqpath:n/a Error Path:/solr/overseer Error:KeeperErrorCode = NodeExists for /solr/overseer
[junit4:junit4]   2> 9546 T318 oasc.ZkController.createEphemeralLiveNode Register node as live in ZooKeeper:/live_nodes/127.0.0.1:58213_zmed
[junit4:junit4]   2> 9547 T323 oazs.PrepRequestProcessor.pRequest Got user-level KeeperException when processing sessionid:0x13ba190b50e000c type:delete cxid:0x4 zxid:0x99 txntype:-1 reqpath:n/a Error Path:/solr/live_nodes/127.0.0.1:58213_zmed Error:KeeperErrorCode = NoNode for /solr/live_nodes/127.0.0.1:58213_zmed
[junit4:junit4]   2> 9548 T318 oascc.SolrZkClient.makePath makePath: /live_nodes/127.0.0.1:58213_zmed
[junit4:junit4]   2> 9551 T359 oascc.ZkStateReader$2.process A cluster state change: WatchedEvent state:SyncConnected type:NodeChildrenChanged path:/live_nodes, has occurred - updating... (live nodes size: 4)
[junit4:junit4]   2> 9551 T346 oascc.ZkStateReader$2.process A cluster state change: WatchedEvent state:SyncConnected type:NodeChildrenChanged path:/live_nodes, has occurred - updating... (live nodes size: 4)
[junit4:junit4]   2> 9551 T391 oascc.ZkStateReader$2.process A cluster state change: WatchedEvent state:SyncConnected type:NodeChildrenChanged path:/live_nodes, has occurred - updating... (live nodes size: 4)
[junit4:junit4]   2> 9552 T374 oascc.ZkStateReader$3.process Updating live nodes... (5)
[junit4:junit4]   2> 9552 T340 oascc.ZkStateReader$3.process Updating live nodes... (5)
[junit4:junit4]   2> 9552 T374 oascc.ZkStateReader$2.process A cluster state change: WatchedEvent state:SyncConnected type:NodeChildrenChanged path:/live_nodes, has occurred - updating... (live nodes size: 5)
[junit4:junit4]   2> 9552 T340 oascc.ZkStateReader$2.process A cluster state change: WatchedEvent state:SyncConnected type:NodeChildrenChanged path:/live_nodes, has occurred - updating... (live nodes size: 5)
[junit4:junit4]   2> 9553 T318 oashc.HttpShardHandlerFactory.getParameter Setting socketTimeout to: 0
[junit4:junit4]   2> 9553 T359 oascc.ZkStateReader$3.process Updating live nodes... (5)
[junit4:junit4]   2> 9553 T346 oascc.ZkStateReader$3.process Updating live nodes... (5)
[junit4:junit4]   2> 9553 T391 oascc.ZkStateReader$3.process Updating live nodes... (5)
[junit4:junit4]   2> 9553 T318 oashc.HttpShardHandlerFactory.getParameter Setting urlScheme to: http://
[junit4:junit4]   2> 9554 T318 oashc.HttpShardHandlerFactory.getParameter Setting connTimeout to: 0
[junit4:junit4]   2> 9554 T318 oashc.HttpShardHandlerFactory.getParameter Setting maxConnectionsPerHost to: 20
[junit4:junit4]   2> 9555 T318 oashc.HttpShardHandlerFactory.getParameter Setting corePoolSize to: 0
[junit4:junit4]   2> 9555 T318 oashc.HttpShardHandlerFactory.getParameter Setting maximumPoolSize to: 2147483647
[junit4:junit4]   2> 9555 T318 oashc.HttpShardHandlerFactory.getParameter Setting maxThreadIdleTime to: 5
[junit4:junit4]   2> 9556 T318 oashc.HttpShardHandlerFactory.getParameter Setting sizeOfQueue to: -1
[junit4:junit4]   2> 9556 T318 oashc.HttpShardHandlerFactory.getParameter Setting fairnessPolicy to: false
[junit4:junit4]   2> 9556 T318 oascsi.HttpClientUtil.createClient Creating new http client, config:maxConnectionsPerHost=20&maxConnections=10000&socketTimeout=0&connTimeout=0&retry=false
[junit4:junit4]   2> 9571 T318 oascc.ZkStateReader.createClusterStateWatchersAndUpdate Updating cluster state from ZooKeeper... 
[junit4:junit4]   2> 9579 T409 oasc.CoreContainer.create Creating SolrCore 'collection1' using instanceDir: /usr/home/hudson/hudson-slave/workspace/Lucene-Solr-Tests-trunk-Java6/solr/build/solr-core/test/J0/./org.apache.solr.cloud.SyncSliceTest-jetty4-1355625322512/collection1
[junit4:junit4]   2> 9579 T409 oasc.ZkController.createCollectionZkNode Check for collection zkNode:collection1
[junit4:junit4]   2> 9580 T409 oasc.ZkController.createCollectionZkNode Collection zkNode exists
[junit4:junit4]   2> 9580 T409 oasc.ZkController.readConfigName Load collection config from:/collections/collection1
[junit4:junit4]   2> 9582 T409 oasc.SolrResourceLoader.<init> new SolrResourceLoader for directory: '/usr/home/hudson/hudson-slave/workspace/Lucene-Solr-Tests-trunk-Java6/solr/build/solr-core/test/J0/./org.apache.solr.cloud.SyncSliceTest-jetty4-1355625322512/collection1/'
[junit4:junit4]   2> 9584 T409 oasc.SolrResourceLoader.replaceClassLoader Adding 'file:/usr/home/hudson/hudson-slave/workspace/Lucene-Solr-Tests-trunk-Java6/solr/build/solr-core/test/J0/org.apache.solr.cloud.SyncSliceTest-jetty4-1355625322512/collection1/lib/classes/' to classloader
[junit4:junit4]   2> 9584 T409 oasc.SolrResourceLoader.replaceClassLoader Adding 'file:/usr/home/hudson/hudson-slave/workspace/Lucene-Solr-Tests-trunk-Java6/solr/build/solr-core/test/J0/org.apache.solr.cloud.SyncSliceTest-jetty4-1355625322512/collection1/lib/README' to classloader
[junit4:junit4]   2> 9636 T409 oasc.SolrConfig.<init> Using Lucene MatchVersion: LUCENE_50
[junit4:junit4]   2> 9708 T409 oasc.SolrConfig.<init> Loaded SolrConfig: solrconfig.xml
[junit4:junit4]   2> 9809 T409 oass.IndexSchema.readSchema Reading Solr Schema
[junit4:junit4]   2> 9817 T409 oass.IndexSchema.readSchema Schema name=test
[junit4:junit4]   2> 10270 T409 oass.OpenExchangeRatesOrgProvider.init Initialized with rates=open-exchange-rates.json, refreshInterval=1440.
[junit4:junit4]   2> 10279 T409 oass.IndexSchema.readSchema default search field in schema is text
[junit4:junit4]   2> 10282 T409 oass.IndexSchema.readSchema unique key field: id
[junit4:junit4]   2> 10297 T409 oass.FileExchangeRateProvider.reload Reloading exchange rates from file currency.xml
[junit4:junit4]   2> 10301 T409 oass.FileExchangeRateProvider.reload Reloading exchange rates from file currency.xml
[junit4:junit4]   2> 10305 T409 oass.OpenExchangeRatesOrgProvider.reload Reloading exchange rates from open-exchange-rates.json
[junit4:junit4]   2> 10306 T409 oass.OpenExchangeRatesOrgProvider.reload Reloading exchange rates from open-exchange-rates.json
[junit4:junit4]   2> 10307 T409 oasc.SolrCore.<init> [collection1] Opening new SolrCore at /usr/home/hudson/hudson-slave/workspace/Lucene-Solr-Tests-trunk-Java6/solr/build/solr-core/test/J0/./org.apache.solr.cloud.SyncSliceTest-jetty4-1355625322512/collection1/, dataDir=./org.apache.solr.cloud.SyncSliceTest-1355625313165/jetty4/
[junit4:junit4]   2> 10308 T409 oasc.JmxMonitoredMap.<init> JMX monitoring is enabled. Adding Solr mbeans to JMX Server: com.sun.jmx.mbeanserver.JmxMBeanServer@37e55794
[junit4:junit4]   2> 10308 T409 oasc.SolrCore.initDirectoryFactory solr.NRTCachingDirectoryFactory
[junit4:junit4]   2> 10309 T409 oasc.CachingDirectoryFactory.get return new directory for /usr/home/hudson/hudson-slave/workspace/Lucene-Solr-Tests-trunk-Java6/solr/build/solr-core/test/J0/./org.apache.solr.cloud.SyncSliceTest-1355625313165/jetty4 forceNew:false
[junit4:junit4]   2> 10309 T409 oasc.CachingDirectoryFactory.close Releasing directory:/usr/home/hudson/hudson-slave/workspace/Lucene-Solr-Tests-trunk-Java6/solr/build/solr-core/test/J0/./org.apache.solr.cloud.SyncSliceTest-1355625313165/jetty4
[junit4:junit4]   2> 10309 T409 oasc.SolrCore.getNewIndexDir New index directory detected: old=null new=./org.apache.solr.cloud.SyncSliceTest-1355625313165/jetty4/index/
[junit4:junit4]   2> 10310 T409 oasc.SolrCore.initIndex WARNING [collection1] Solr index directory './org.apache.solr.cloud.SyncSliceTest-1355625313165/jetty4/index' doesn't exist. Creating new index...
[junit4:junit4]   2> 10311 T409 oasc.CachingDirectoryFactory.get return new directory for /usr/home/hudson/hudson-slave/workspace/Lucene-Solr-Tests-trunk-Java6/solr/build/solr-core/test/J0/./org.apache.solr.cloud.SyncSliceTest-1355625313165/jetty4/index forceNew:false
[junit4:junit4]   2> 10340 T409 oasc.SolrDeletionPolicy.onCommit SolrDeletionPolicy.onCommit: commits:num=1
[junit4:junit4]   2> 		commit{dir=RateLimitedDirectoryWrapper(NRTCachingDirectory(org.apache.lucene.store.NIOFSDirectory@/usr/home/hudson/hudson-slave/workspace/Lucene-Solr-Tests-trunk-Java6/solr/build/solr-core/test/J0/org.apache.solr.cloud.SyncSliceTest-1355625313165/jetty4/index lockFactory=org.apache.lucene.store.NativeFSLockFactory@4ec4b821; maxCacheMB=48.0 maxMergeSizeMB=4.0)),segFN=segments_1,generation=1,filenames=[segments_1]
[junit4:junit4]   2> 10341 T409 oasc.SolrDeletionPolicy.updateCommits newest commit = 1[segments_1]
[junit4:junit4]   2> 10341 T409 oasc.CachingDirectoryFactory.close Releasing directory:/usr/home/hudson/hudson-slave/workspace/Lucene-Solr-Tests-trunk-Java6/solr/build/solr-core/test/J0/./org.apache.solr.cloud.SyncSliceTest-1355625313165/jetty4/index
[junit4:junit4]   2> 10342 T409 oasc.SolrCore.initWriters created xml: solr.XMLResponseWriter
[junit4:junit4]   2> 10343 T409 oasup.UpdateRequestProcessorChain.init inserting DistributedUpdateProcessorFactory into updateRequestProcessorChain "dedupe"
[junit4:junit4]   2> 10343 T409 oasup.UpdateRequestProcessorChain.init inserting DistributedUpdateProcessorFactory into updateRequestProcessorChain "dedupe-allfields"
[junit4:junit4]   2> 10344 T409 oasup.UpdateRequestProcessorChain.init inserting DistributedUpdateProcessorFactory into updateRequestProcessorChain "stored_sig"
[junit4:junit4]   2> 10344 T409 oasup.UpdateRequestProcessorChain.init inserting DistributedUpdateProcessorFactory into updateRequestProcessorChain "uniq-fields"
[junit4:junit4]   2> 10344 T409 oasup.UpdateRequestProcessorChain.init inserting DistributedUpdateProcessorFactory into updateRequestProcessorChain "distrib-dup-test-chain-implicit"
[junit4:junit4]   2> 10345 T409 oasc.RequestHandlers.initHandlersFromConfig adding lazy requestHandler: solr.ReplicationHandler
[junit4:junit4]   2> 10345 T409 oasc.RequestHandlers.initHandlersFromConfig created /replication: solr.ReplicationHandler
[junit4:junit4]   2> 10346 T409 oasc.RequestHandlers.initHandlersFromConfig created standard: solr.StandardRequestHandler
[junit4:junit4]   2> 10346 T409 oasc.RequestHandlers.initHandlersFromConfig created /get: solr.RealTimeGetHandler
[junit4:junit4]   2> 10347 T409 oasc.RequestHandlers.initHandlersFromConfig created dismax: solr.SearchHandler
[junit4:junit4]   2> 10348 T409 oasc.RequestHandlers.initHandlersFromConfig created mock: org.apache.solr.core.MockQuerySenderListenerReqHandler
[junit4:junit4]   2> 10348 T409 oasc.RequestHandlers.initHandlersFromConfig created /admin/: org.apache.solr.handler.admin.AdminHandlers
[junit4:junit4]   2> 10349 T409 oasc.RequestHandlers.initHandlersFromConfig created defaults: solr.StandardRequestHandler
[junit4:junit4]   2> 10349 T409 oasc.RequestHandlers.initHandlersFromConfig adding lazy requestHandler: solr.StandardRequestHandler
[junit4:junit4]   2> 10349 T409 oasc.RequestHandlers.initHandlersFromConfig created lazy: solr.StandardRequestHandler
[junit4:junit4]   2> 10350 T409 oasc.RequestHandlers.initHandlersFromConfig created /update: solr.UpdateRequestHandler
[junit4:junit4]   2> 10350 T409 oasc.RequestHandlers.initHandlersFromConfig created /terms: org.apache.solr.handler.component.SearchHandler
[junit4:junit4]   2> 10351 T409 oasc.RequestHandlers.initHandlersFromConfig created spellCheckCompRH: org.apache.solr.handler.component.SearchHandler
[junit4:junit4]   2> 10352 T409 oasc.RequestHandlers.initHandlersFromConfig created spellCheckCompRH_Direct: org.apache.solr.handler.component.SearchHandler
[junit4:junit4]   2> 10352 T409 oasc.RequestHandlers.initHandlersFromConfig created spellCheckWithWordbreak: org.apache.solr.handler.component.SearchHandler
[junit4:junit4]   2> 10353 T409 oasc.RequestHandlers.initHandlersFromConfig created spellCheckWithWordbreak_Direct: org.apache.solr.handler.component.SearchHandler
[junit4:junit4]   2> 10354 T409 oasc.RequestHandlers.initHandlersFromConfig created spellCheckCompRH1: org.apache.solr.handler.component.SearchHandler
[junit4:junit4]   2> 10354 T409 oasc.RequestHandlers.initHandlersFromConfig created mltrh: org.apache.solr.handler.component.SearchHandler
[junit4:junit4]   2> 10355 T409 oasc.RequestHandlers.initHandlersFromConfig created tvrh: org.apache.solr.handler.component.SearchHandler
[junit4:junit4]   2> 10356 T409 oasc.RequestHandlers.initHandlersFromConfig created /mlt: solr.MoreLikeThisHandler
[junit4:junit4]   2> 10356 T409 oasc.RequestHandlers.initHandlersFromConfig created /debug/dump: solr.DumpRequestHandler
[junit4:junit4]   2> 10361 T409 oashl.XMLLoader.init xsltCacheLifetimeSeconds=60
[junit4:junit4]   2> 10365 T409 oasc.SolrCore.initDeprecatedSupport WARNING solrconfig.xml uses deprecated <admin/gettableFiles>, Please update your config to use the ShowFileRequestHandler.
[junit4:junit4]   2> 10367 T409 oasc.SolrCore.initDeprecatedSupport WARNING adding ShowFileRequestHandler with hidden files: [SCHEMA.XML, OLD_SYNONYMS.TXT, STOPWORDS.TXT, PROTWORDS.TXT, OPEN-EXCHANGE-RATES.JSON, SYNONYMS.TXT, CURRENCY.XML, MAPPING-ISOLATIN1ACCENT.TXT]
[junit4:junit4]   2> 10369 T409 oasc.CachingDirectoryFactory.close Releasing directory:/usr/home/hudson/hudson-slave/workspace/Lucene-Solr-Tests-trunk-Java6/solr/build/solr-core/test/J0/./org.apache.solr.cloud.SyncSliceTest-1355625313165/jetty4
[junit4:junit4]   2> 10370 T409 oass.SolrIndexSearcher.<init> Opening Searcher@ed4bc86 main
[junit4:junit4]   2> 10371 T409 oasu.CommitTracker.<init> Hard AutoCommit: disabled
[junit4:junit4]   2> 10371 T409 oasu.CommitTracker.<init> Soft AutoCommit: disabled
[junit4:junit4]   2> 10372 T409 oashc.SpellCheckComponent.inform Initializing spell checkers
[junit4:junit4]   2> 10379 T409 oass.DirectSolrSpellChecker.init init: {name=direct,classname=DirectSolrSpellChecker,field=lowerfilt,minQueryLength=3}
[junit4:junit4]   2> 10434 T410 oasc.SolrCore.registerSearcher [collection1] Registered new searcher Searcher@ed4bc86 main{StandardDirectoryReader(segments_1:1)}
[junit4:junit4]   2> 10437 T409 oasc.ZkController.publish publishing core=collection1 state=down
[junit4:junit4]   2> 10437 T409 oasc.ZkController.publish numShards not found on descriptor - reading it from system property
[junit4:junit4]   2> 10467 T341 oascc.ZkStateReader.updateClusterState Updating cloud state from ZooKeeper... 
[junit4:junit4]   2> 10468 T341 oasc.Overseer$ClusterStateUpdater.updateState Update state numShards=1 message={
[junit4:junit4]   2> 	  "operation":"state",
[junit4:junit4]   2> 	  "numShards":"1",
[junit4:junit4]   2> 	  "shard":null,
[junit4:junit4]   2> 	  "roles":null,
[junit4:junit4]   2> 	  "state":"down",
[junit4:junit4]   2> 	  "core":"collection1",
[junit4:junit4]   2> 	  "collection":"collection1",
[junit4:junit4]   2> 	  "node_name":"127.0.0.1:58213_zmed",
[junit4:junit4]   2> 	  "base_url":"http://127.0.0.1:58213/zmed"}
[junit4:junit4]   2> 10468 T341 oasc.Overseer$ClusterStateUpdater.updateState Collection already exists with numShards=1
[junit4:junit4]   2> 10468 T341 oasc.Overseer$ClusterStateUpdater.updateState Assigning new node to shard shard=shard1
[junit4:junit4]   2> 10480 T359 oascc.ZkStateReader$2.process A cluster state change: WatchedEvent state:SyncConnected type:NodeDataChanged path:/clusterstate.json, has occurred - updating... (live nodes size: 5)
[junit4:junit4]   2> 10480 T340 oascc.ZkStateReader$2.process A cluster state change: WatchedEvent state:SyncConnected type:NodeDataChanged path:/clusterstate.json, has occurred - updating... (live nodes size: 5)
[junit4:junit4]   2> 10480 T374 oascc.ZkStateReader$2.process A cluster state change: WatchedEvent state:SyncConnected type:NodeDataChanged path:/clusterstate.json, has occurred - updating... (live nodes size: 5)
[junit4:junit4]   2> 10480 T391 oascc.ZkStateReader$2.process A cluster state change: WatchedEvent state:SyncConnected type:NodeDataChanged path:/clusterstate.json, has occurred - updating... (live nodes size: 5)
[junit4:junit4]   2> 10480 T408 oascc.ZkStateReader$2.process A cluster state change: WatchedEvent state:SyncConnected type:NodeDataChanged path:/clusterstate.json, has occurred - updating... (live nodes size: 5)
[junit4:junit4]   2> 10480 T346 oascc.ZkStateReader$2.process A cluster state change: WatchedEvent state:SyncConnected type:NodeDataChanged path:/clusterstate.json, has occurred - updating... (live nodes size: 5)
[junit4:junit4]   2>  C16_STATE=coll:collection1 core:collection1 props:{shard=shard1, roles=null, state=recovering, core=collection1, collection=collection1, node_name=127.0.0.1:58203_zmed, base_url=http://127.0.0.1:58203/zmed}
[junit4:junit4]   2> 10608 T377 C16 P58203 oasc.RecoveryStrategy.doRecovery Begin buffering updates. core=collection1
[junit4:junit4]   2> 10608 T377 C16 P58203 oasu.UpdateLog.bufferUpdates Starting to buffer updates. FSUpdateLog{state=ACTIVE, tlog=null}
[junit4:junit4]   2> 10608 T377 C16 P58203 oasc.RecoveryStrategy.replicate Attempting to replicate from http://127.0.0.1:58200/zmed/collection1/. core=collection1
[junit4:junit4]   2> 10608 T377 C16 P58203 oascsi.HttpClientUtil.createClient Creating new http client, config:maxConnections=128&maxConnectionsPerHost=32&followRedirects=false
[junit4:junit4]   2> 10626 T352 C17 P58200 oascsi.HttpClientUtil.createClient Creating new http client, config:maxConnections=500&maxConnectionsPerHost=16
[junit4:junit4]   2> 10638 T352 C17 P58200 oasu.DirectUpdateHandler2.commit start commit{flags=0,_version_=0,optimize=false,openSearcher=false,waitSearcher=true,expungeDeletes=false,softCommit=false}
[junit4:junit4]   2> 10639 T352 C17 P58200 oasc.CachingDirectoryFactory.close Releasing directory:/usr/home/hudson/hudson-slave/workspace/Lucene-Solr-Tests-trunk-Java6/solr/build/solr-core/test/J0/./org.apache.solr.cloud.SyncSliceTest-1355625313165/jetty1
[junit4:junit4]   2> 10642 T352 C17 P58200 oasc.SolrDeletionPolicy.onInit SolrDeletionPolicy.onInit: commits:num=1
[junit4:junit4]   2> 		commit{dir=RateLimitedDirectoryWrapper(NRTCachingDirectory(org.apache.lucene.store.NIOFSDirectory@/usr/home/hudson/hudson-slave/workspace/Lucene-Solr-Tests-trunk-Java6/solr/build/solr-core/test/J0/org.apache.solr.cloud.SyncSliceTest-1355625313165/jetty1/index lockFactory=org.apache.lucene.store.NativeFSLockFactory@638a2b99; maxCacheMB=48.0 maxMergeSizeMB=4.0)),segFN=segments_1,generation=1,filenames=[segments_1]
[junit4:junit4]   2> 10643 T352 C17 P58200 oasc.SolrDeletionPolicy.updateCommits newest commit = 1[segments_1]
[junit4:junit4]   2> 10767 T352 C17 P58200 oasc.SolrDeletionPolicy.onCommit SolrDeletionPolicy.onCommit: commits:num=2
[junit4:junit4]   2> 		commit{dir=RateLimitedDirectoryWrapper(NRTCachingDirectory(org.apache.lucene.store.NIOFSDirectory@/usr/home/hudson/hudson-slave/workspace/Lucene-Solr-Tests-trunk-Java6/solr/build/solr-core/test/J0/org.apache.solr.cloud.SyncSliceTest-1355625313165/jetty1/index lockFactory=org.apache.lucene.store.NativeFSLockFactory@638a2b99; maxCacheMB=48.0 maxMergeSizeMB=4.0)),segFN=segments_1,generation=1,filenames=[segments_1]
[junit4:junit4]   2> 		commit{dir=RateLimitedDirectoryWrapper(NRTCachingDirectory(org.apache.lucene.store.NIOFSDirectory@/usr/home/hudson/hudson-slave/workspace/Lucene-Solr-Tests-trunk-Java6/solr/build/solr-core/test/J0/org.apache.solr.cloud.SyncSliceTest-1355625313165/jetty1/index lockFactory=org.apache.lucene.store.NativeFSLockFactory@638a2b99; maxCacheMB=48.0 maxMergeSizeMB=4.0)),segFN=segments_2,generation=2,filenames=[segments_2]
[junit4:junit4]   2> 10768 T352 C17 P58200 oasc.SolrDeletionPolicy.updateCommits newest commit = 2[segments_2]
[junit4:junit4]   2> 10769 T352 C17 P58200 oasc.CachingDirectoryFactory.close Releasing directory:/usr/home/hudson/hudson-slave/workspace/Lucene-Solr-Tests-trunk-Java6/solr/build/solr-core/test/J0/./org.apache.solr.cloud.SyncSliceTest-1355625313165/jetty1
[junit4:junit4]   2> 10769 T352 C17 P58200 oass.SolrIndexSearcher.<init> Opening Searcher@4024b170 realtime
[junit4:junit4]   2> 10770 T352 C17 P58200 oasu.DirectUpdateHandler2.commit end_commit_flush
[junit4:junit4]   2> 10770 T352 C17 P58200 /update {waitSearcher=true&openSearcher=false&commit=true&commit_end_point=true&wt=javabin&softCommit=false&version=2} {commit=} 0 150
[junit4:junit4]   2> 10813 T377 C16 P58203 oash.ReplicationHandler.inform Commits will be reserved for  10000
[junit4:junit4]   2> 10813 T377 C16 P58203 oascsi.HttpClientUtil.createClient Creating new http client, config:connTimeout=5000&socketTimeout=20000&allowCompression=false&maxConnections=10000&maxConnectionsPerHost=10000
[junit4:junit4]   2> 10831 T377 C16 P58203 oash.SnapPuller.<init>  No value set for 'pollInterval'. Timer Task not started.
[junit4:junit4]   2> 10834 T353 C17 P58200 oash.ReplicationHandler.inform Commits will be reserved for  10000
[junit4:junit4]   2> 10835 T353 C17 P58200 REQ /replication {command=indexversion&wt=javabin&qt=/replication&version=2} status=0 QTime=2 
[junit4:junit4]   2> 10836 T377 C16 P58203 oash.SnapPuller.fetchLatestIndex Master's generation: 2
[junit4:junit4]   2> 10836 T377 C16 P58203 oash.SnapPuller.fetchLatestIndex Slave's generation: 1
[junit4:junit4]   2> 10836 T377 C16 P58203 oash.SnapPuller.fetchLatestIndex Starting replication process
[junit4:junit4]   2> 10838 T353 C17 P58200 oasc.CachingDirectoryFactory.close Releasing directory:/usr/home/hudson/hudson-slave/workspace/Lucene-Solr-Tests-trunk-Java6/solr/build/solr-core/test/J0/./org.apache.solr.cloud.SyncSliceTest-1355625313165/jetty1
[junit4:junit4]   2> 10839 T353 C17 P58200 oasc.CachingDirectoryFactory.close Releasing directory:/usr/home/hudson/hudson-slave/workspace/Lucene-Solr-Tests-trunk-Java6/solr/build/solr-core/test/J0/./org.apache.solr.cloud.SyncSliceTest-1355625313165/jetty1/index
[junit4:junit4]   2> 10839 T353 C17 P58200 REQ /replication {command=filelist&generation=2&wt=javabin&qt=/replication&version=2} status=0 QTime=1 
[junit4:junit4]   2> 10840 T377 C16 P58203 oash.SnapPuller.fetchLatestIndex Number of files in latest index in master: 1
[junit4:junit4]   2> 10842 T377 C16 P58203 oasc.CachingDirectoryFactory.get return new directory for /usr/home/hudson/hudson-slave/workspace/Lucene-Solr-Tests-trunk-Java6/solr/build/solr-core/test/J0/./org.apache.solr.cloud.SyncSliceTest-1355625313165/jetty2/index.20121215233523999 forceNew:false
[junit4:junit4]   2> 10843 T377 C16 P58203 oasc.CachingDirectoryFactory.close Releasing directory:/usr/home/hudson/hudson-slave/workspace/Lucene-Solr-Tests-trunk-Java6/solr/build/solr-core/test/J0/./org.apache.solr.cloud.SyncSliceTest-1355625313165/jetty2
[junit4:junit4]   2> 10843 T377 C16 P58203 oash.SnapPuller.fetchLatestIndex Starting download to RateLimitedDirectoryWrapper(NRTCachingDirectory(org.apache.lucene.store.NIOFSDirectory@/usr/home/hudson/hudson-slave/workspace/Lucene-Solr-Tests-trunk-Java6/solr/build/solr-core/test/J0/org.apache.solr.cloud.SyncSliceTest-1355625313165/jetty2/index.20121215233523999 lockFactory=org.apache.lucene.store.NativeFSLockFactory@c0d207a; maxCacheMB=48.0 maxMergeSizeMB=4.0)) fullCopy=true
[junit4:junit4]   2> 10857 T353 C17 P58200 REQ /replication {file=segments_2&command=filecontent&checksum=true&generation=2&qt=/replication&wt=filestream} status=0 QTime=5 
[junit4:junit4]   2> 10870 T377 C16 P58203 oasc.CachingDirectoryFactory.close Releasing directory:/usr/home/hudson/hudson-slave/workspace/Lucene-Solr-Tests-trunk-Java6/solr/build/solr-core/test/J0/./org.apache.solr.cloud.SyncSliceTest-1355625313165/jetty2/index
[junit4:junit4]   2> 10870 T377 C16 P58203 oash.SnapPuller.fetchLatestIndex Total time taken for download : 0 secs
[junit4:junit4]   2> 10871 T377 C16 P58203 oash.SnapPuller.modifyIndexProps New index installed. Updating index properties... index=index.20121215233523999
[junit4:junit4]   2> 10872 T377 C16 P58203 oasc.CachingDirectoryFactory.close Releasing directory:/usr/home/hudson/hudson-slave/workspace/Lucene-Solr-Tests-trunk-Java6/solr/build/solr-core/test/J0/./org.apache.solr.cloud.SyncSliceTest-1355625313165/jetty2
[junit4:junit4]   2> 10872 T377 C16 P58203 oasc.CachingDirectoryFactory.close Releasing directory:/usr/home/hudson/hudson-slave/workspace/Lucene-Solr-Tests-trunk-Java6/solr/build/solr-core/test/J0/./org.apache.solr.cloud.SyncSliceTest-1355625313165/jetty2
[junit4:junit4]   2> 10873 T377 C16 P58203 oasc.SolrCore.getNewIndexDir New index directory detected: old=./org.apache.solr.cloud.SyncSliceTest-1355625313165/jetty2/index/ new=./org.apache.solr.cloud.SyncSliceTest-1355625313165/jetty2/index.20121215233523999
[junit4:junit4]   2> 10876 T377 C16 P58203 oasc.SolrDeletionPolicy.onInit SolrDeletionPolicy.onInit: commits:num=1
[junit4:junit4]   2> 		commit{dir=RateLimitedDirectoryWrapper(NRTCachingDirectory(org.apache.lucene.store.NIOFSDirectory@/usr/home/hudson/hudson-slave/workspace/Lucene-Solr-Tests-trunk-Java6/solr/build/solr-core/test/J0/org.apache.solr.cloud.SyncSliceTest-1355625313165/jetty2/index.20121215233523999 lockFactory=org.apache.lucene.store.NativeFSLockFactory@c0d207a; maxCacheMB=48.0 maxMergeSizeMB=4.0)),segFN=segments_2,generation=2,filenames=[segments_2]
[junit4:junit4]   2> 10876 T377 C16 P58203 oasc.SolrDeletionPolicy.updateCommits newest commit = 2[segments_2]
[junit4:junit4]   2> 10877 T377 C16 P58203 oasc.CachingDirectoryFactory.close Releasing directory:/usr/home/hudson/hudson-slave/workspace/Lucene-Solr-Tests-trunk-Java6/solr/build/solr-core/test/J0/./org.apache.solr.cloud.SyncSliceTest-1355625313165/jetty2
[junit4:junit4]   2> 10881 T377 C16 P58203 oasu.DefaultSolrCoreState.newIndexWriter Creating new IndexWriter...
[junit4:junit4]   2> 10881 T377 C16 P58203 oasu.DefaultSolrCoreState.newIndexWriter Waiting until IndexWriter is unused... core=collection1
[junit4:junit4]   2> 10881 T377 C16 P58203 oasu.DefaultSolrCoreState.newIndexWriter Rollback old IndexWriter... core=collection1
[junit4:junit4]   2> 10882 T377 C16 P58203 oasc.CachingDirectoryFactory.close Releasing directory:/usr/home/hudson/hudson-slave/workspace/Lucene-Solr-Tests-trunk-Java6/solr/build/solr-core/test/J0/./org.apache.solr.cloud.SyncSliceTest-1355625313165/jetty2/index.20121215233523999
[junit4:junit4]   2> 10882 T377 C16 P58203 oasc.CachingDirectoryFactory.close Releasing directory:/usr/home/hudson/hudson-slave/workspace/Lucene-Solr-Tests-trunk-Java6/solr/build/solr-core/test/J0/./org.apache.solr.cloud.SyncSliceTest-1355625313165/jetty2
[junit4:junit4]   2> 10885 T377 C16 P58203 oasc.SolrDeletionPolicy.onInit SolrDeletionPolicy.onInit: commits:num=1
[junit4:junit4]   2> 		commit{dir=RateLimitedDirectoryWrapper(NRTCachingDirectory(org.apache.lucene.store.NIOFSDirectory@/usr/home/hudson/hudson-slave/workspace/Lucene-Solr-Tests-trunk-Java6/solr/build/solr-core/test/J0/org.apache.solr.cloud.SyncSliceTest-1355625313165/jetty2/index.20121215233523999 lockFactory=org.apache.lucene.store.NativeFSLockFactory@c0d207a; maxCacheMB=48.0 maxMergeSizeMB=4.0)),segFN=segments_2,generation=2,filenames=[segments_2]
[junit4:junit4]   2> 10885 T377 C16 P58203 oasc.SolrDeletionPolicy.updateCommits newest commit = 2[segments_2]
[junit4:junit4]   2> 10885 T377 C16 P58203 oasu.DefaultSolrCoreState.newIndexWriter New IndexWriter is ready to be used.
[junit4:junit4]   2> 10885 T377 C16 P58203 oasc.CachingDirectoryFactory.close Releasing directory:/usr/home/hudson/hudson-slave/workspace/Lucene-Solr-Tests-trunk-Java6/solr/build/solr-core/test/J0/./org.apache.solr.cloud.SyncSliceTest-1355625313165/jetty2
[junit4:junit4]   2> 10886 T377 C16 P58203 oass.SolrIndexSearcher.<init> Opening Searcher@4952d7a6 main
[junit4:junit4]   2> 10887 T376 oasc.SolrCore.registerSearcher [collection1] Registered new searcher Searcher@4952d7a6 main{StandardDirectoryReader(segments_2:1:nrt)}
[junit4:junit4]   2> 10888 T376 oasc.CachingDirectoryFactory.close Releasing directory:/usr/home/hudson/hudson-slave/workspace/Lucene-Solr-Tests-trunk-Java6/solr/build/solr-core/test/J0/./org.apache.solr.cloud.SyncSliceTest-1355625313165/jetty2/index
[junit4:junit4]   2> 10888 T377 C16 P58203 oasu.DirectUpdateHandler2.commit start commit{flags=0,_version_=0,optimize=false,openSearcher=false,waitSearcher=false,expungeDeletes=false,softCommit=false}
[junit4:junit4]   2> 10891 T377 C16 P58203 oasc.SolrDeletionPolicy.onCommit SolrDeletionPolicy.onCommit: commits:num=2
[junit4:junit4]   2> 		commit{dir=RateLimitedDirectoryWrapper(NRTCachingDirectory(org.apache.lucene.store.NIOFSDirectory@/usr/home/hudson/hudson-slave/workspace/Lucene-Solr-Tests-trunk-Java6/solr/build/solr-core/test/J0/org.apache.solr.cloud.SyncSliceTest-1355625313165/jetty2/index.20121215233523999 lockFactory=org.apache.lucene.store.NativeFSLockFactory@c0d207a; maxCacheMB=48.0 maxMergeSizeMB=4.0)),segFN=segments_2,generation=2,filenames=[segments_2]
[junit4:junit4]   2> 		commit{dir=RateLimitedDirectoryWrapper(NRTCachingDirectory(org.apache.lucene.store.NIOFSDirectory@/usr/home/hudson/hudson-slave/workspace/Lucene-Solr-Tests-trunk-Java6/solr/build/solr-core/test/J0/org.apache.solr.cloud.SyncSliceTest-1355625313165/jetty2/index.20121215233523999 lockFactory=org.apache.lucene.store.NativeFSLockFactory@c0d207a; maxCacheMB=48.0 maxMergeSizeMB=4.0)),segFN=segments_3,generation=3,filenames=[segments_3]
[junit4:junit4]   2> 10891 T377 C16 P58203 oasc.SolrDeletionPolicy.updateCommits newest commit = 3[segments_3]
[junit4:junit4]   2> 10892 T377 C16 P58203 oasc.CachingDirectoryFactory.close Releasing directory:/usr/home/hudson/hudson-slave/workspace/Lucene-Solr-Tests-trunk-Java6/solr/build/solr-core/test/J0/./org.apache.solr.cloud.SyncSliceTest-1355625313165/jetty2
[junit4:junit4]   2> 10892 T377 C16 P58203 oasu.DirectUpdateHandler2.commit end_commit_flush
[junit4:junit4]   2> 10892 T377 C16 P58203 oasc.CachingDirectoryFactory.close Releasing directory:/usr/home/hudson/hudson-slave/workspace/Lucene-Solr-Tests-trunk-Java6/solr/build/solr-core/test/J0/./org.apache.solr.cloud.SyncSliceTest-1355625313165/jetty2/index.20121215233523999
[junit4:junit4]   2> 10892 T377 C16 P58203 oasc.CachingDirectoryFactory.close Releasing directory:/usr/home/hudson/hudson-slave/workspace/Lucene-Solr-Tests-trunk-Java6/solr/build/solr-core/test/J0/./org.apache.solr.cloud.SyncSliceTest-1355625313165/jetty2/index
[junit4:junit4]   2> 10893 T377 C16 P58203 oasc.RecoveryStrategy.replay No replay needed. core=collection1
[junit4:junit4]   2> 10893 T377 C16 P58203 oasc.RecoveryStrategy.doRecovery Replication Recovery was successful - registering as Active. core=collection1
[junit4:junit4]   2> 10893 T377 C16 P58203 oasc.ZkController.publish publishing core=collection1 state=active
[junit4:junit4]   2> 10893 T377 C16 P58203 oasc.ZkController.publish numShards not found on descriptor - reading it from system property
[junit4:junit4]   2> 10905 T377 C16 P58203 oasc.RecoveryStrategy.doRecovery Finished recovery process. core=collection1
[junit4:junit4]   2> 10940 T409 oasc.CoreContainer.registerCore registering core: collection1
[junit4:junit4]   2> 10940 T409 oasc.ZkController.register Register shard - core:collection1 address:http://127.0.0.1:58213/zmed shardId:shard1
[junit4:junit4]   2> 10979 T409 oasc.ZkController.register We are http://127.0.0.1:58213/zmed/collection1/ and leader is http://127.0.0.1:58200/zmed/collection1/
[junit4:junit4]   2> 10980 T409 oasc.ZkController.register No LogReplay needed for core=collection1 baseURL=http://127.0.0.1:58213/zmed
[junit4:junit4]   2> 10980 T409 oasc.ZkController.checkRecovery Core needs to recover:collection1
[junit4:junit4]   2> 10980 T409 oasu.DefaultSolrCoreState.doRecovery Running recovery - first canceling any ongoing recovery
[junit4:junit4]   2> ASYNC  NEW_CORE C19 name=collection1 org.apache.solr.core.SolrCore@64703b1b url=http://127.0.0.1:58213/zmed/collection1 node=127.0.0.1:58213_zmed
[junit4:junit4]   2> 10981 T412 C19 P58213 oasc.RecoveryStrategy.run Starting recovery process.  core=collection1 recoveringAfterStartup=true
[junit4:junit4]   2> 10981 T412 C19 P58213 oasc.RecoveryStrategy.doRecovery ###### startupVersions=[]
[junit4:junit4]   2> 10981 T412 C19 P58213 oasc.ZkController.publish publishing core=collection1 state=recovering
[junit4:junit4]   2> 10982 T412 C19 P58213 oasc.ZkController.publish numShards not found on descriptor - reading it from system property
[junit4:junit4]   2> 10982 T409 oascc.ZkStateReader.updateClusterState Updating cloud state from ZooKeeper... 
[junit4:junit4]   2> 10984 T412 C19 P58213 oasc.RecoveryStrategy.doRecovery Attempting to PeerSync from http://127.0.0.1:58200/zmed/collection1/ core=collection1 - recoveringAfterStartup=true
[junit4:junit4]   2> 10984 T412 C19 P58213 oasu.PeerSync.sync PeerSync: core=collection1 url=http://127.0.0.1:58213/zmed START replicas=[http://127.0.0.1:58200/zmed/collection1/] nUpdates=100
[junit4:junit4]   2> 10984 T412 C19 P58213 oasu.PeerSync.sync WARNING no frame of reference to tell of we've missed updates
[junit4:junit4]   2> 10984 T412 C19 P58213 oasc.RecoveryStrategy.doRecovery PeerSync Recovery was not successful - trying replication. core=collection1
[junit4:junit4]   2> 10984 T318 oass.SolrDispatchFilter.init user.dir=/usr/home/hudson/hudson-slave/workspace/Lucene-Solr-Tests-trunk-Java6/solr/build/solr-core/test/J0
[junit4:junit4]   2> 10985 T412 C19 P58213 oasc.RecoveryStrategy.doRecovery Starting Replication Recovery. core=collection1
[junit4:junit4]   2> 10985 T412 C19 P58213 oascsi.HttpClientUtil.createClient Creating new http client, config:maxConnections=128&maxConnectionsPerHost=32&followRedirects=false
[junit4:junit4]   2> 10985 T318 oass.SolrDispatchFilter.init SolrDispatchFilter.init() done
[junit4:junit4]   2> 10985 T318 oascsi.HttpClientUtil.createClient Creating new http client, config:maxConnections=128&maxConnectionsPerHost=32&followRedirects=false
[junit4:junit4]   2> 10986 T349 C17 P58200 REQ /get {distrib=false&qt=/get&wt=javabin&version=2&getVersions=100} status=0 QTime=0 
[junit4:junit4]   2> 10989 T341 oascc.ZkStateReader.updateClusterState Updating cloud state from ZooKeeper... 
[

[...truncated too long message...]

(LeaderElector.java:55)
[junit4:junit4]   2> 		at org.apache.solr.cloud.LeaderElector$1.process(LeaderElector.java:129)
[junit4:junit4]   2> 		at org.apache.zookeeper.ClientCnxn$EventThread.processEvent(ClientCnxn.java:519)
[junit4:junit4]   2> 		at org.apache.zookeeper.ClientCnxn$EventThread.run(ClientCnxn.java:495)
[junit4:junit4]   2> 	
[junit4:junit4]   2> 79437 T2778 oasu.DirectUpdateHandler2.close closing DirectUpdateHandler2{commits=5,autocommits=0,soft autocommits=0,optimizes=0,rollbacks=0,expungeDeletes=0,docsPending=0,adds=0,deletesById=0,deletesByQuery=0,errors=0,cumulative_adds=35,cumulative_deletesById=0,cumulative_deletesByQuery=0,cumulative_errors=0}
[junit4:junit4]   2> 79438 T2778 oasc.SolrCore.decrefSolrCoreState Closing SolrCoreState
[junit4:junit4]   2> 79438 T2778 oasu.DefaultSolrCoreState.closeIndexWriter SolrCoreState ref count has reached 0 - closing IndexWriter
[junit4:junit4]   2> 79438 T2778 oasu.DefaultSolrCoreState.closeIndexWriter closing IndexWriter with IndexWriterCloser
[junit4:junit4]   2> 79440 T2778 C151 P56357 oasc.CachingDirectoryFactory.close Releasing directory:/usr/home/hudson/hudson-slave/workspace/Lucene-Solr-Tests-trunk-Java6/solr/build/solr-core/test/J1/./org.apache.solr.cloud.BasicDistributedZk2Test-1355625961958/jetty4/index.20121216024615759
[junit4:junit4]   2> 79441 T2778 oasc.SolrCore.closeSearcher [collection1] Closing main searcher on request.
[junit4:junit4]   2> 79442 T2778 oasc.CachingDirectoryFactory.close Releasing directory:/usr/home/hudson/hudson-slave/workspace/Lucene-Solr-Tests-trunk-Java6/solr/build/solr-core/test/J1/./org.apache.solr.cloud.BasicDistributedZk2Test-1355625961958/jetty4/index.20121216024615759
[junit4:junit4]   2> 79443 T2778 oasc.CachingDirectoryFactory.close Closing directory when closing factory:/usr/home/hudson/hudson-slave/workspace/Lucene-Solr-Tests-trunk-Java6/solr/build/solr-core/test/J1/./org.apache.solr.cloud.BasicDistributedZk2Test-1355625961958/jetty4
[junit4:junit4]   2> 79443 T2778 oasc.CachingDirectoryFactory.close Closing directory when closing factory:/usr/home/hudson/hudson-slave/workspace/Lucene-Solr-Tests-trunk-Java6/solr/build/solr-core/test/J1/./org.apache.solr.cloud.BasicDistributedZk2Test-1355625961958/jetty4/index
[junit4:junit4]   2> 79443 T2778 oasc.CachingDirectoryFactory.close Closing directory when closing factory:/usr/home/hudson/hudson-slave/workspace/Lucene-Solr-Tests-trunk-Java6/solr/build/solr-core/test/J1/./org.apache.solr.cloud.BasicDistributedZk2Test-1355625961958/jetty4/index.20121216024615759
[junit4:junit4]   2> 79443 T2778 oascc.SolrZkClient.makePath makePath: /collections/collection1/leaders/shard2
[junit4:junit4]   2> 79444 T2778 oasc.LeaderElector$1.process WARNING  org.apache.zookeeper.KeeperException$SessionExpiredException: KeeperErrorCode = Session expired for /collections/collection1/leader_elect/shard2/election/88842303043403788-127.0.0.1:56357_lhgll%2Fcf_collection1-n_0000000001
[junit4:junit4]   2> 	at org.apache.zookeeper.KeeperException.create(KeeperException.java:127)
[junit4:junit4]   2> 	at org.apache.zookeeper.KeeperException.create(KeeperException.java:51)
[junit4:junit4]   2> 	at org.apache.zookeeper.ZooKeeper.delete(ZooKeeper.java:873)
[junit4:junit4]   2> 	at org.apache.solr.common.cloud.SolrZkClient$2.execute(SolrZkClient.java:153)
[junit4:junit4]   2> 	at org.apache.solr.common.cloud.SolrZkClient$2.execute(SolrZkClient.java:150)
[junit4:junit4]   2> 	at org.apache.solr.common.cloud.ZkCmdExecutor.retryOperation(ZkCmdExecutor.java:65)
[junit4:junit4]   2> 	at org.apache.solr.common.cloud.SolrZkClient.delete(SolrZkClient.java:150)
[junit4:junit4]   2> 	at org.apache.solr.cloud.ElectionContext.cancelElection(ElectionContext.java:63)
[junit4:junit4]   2> 	at org.apache.solr.cloud.ShardLeaderElectionContext.runLeaderProcess(ElectionContext.java:243)
[junit4:junit4]   2> 	at org.apache.solr.cloud.LeaderElector.runIamLeaderProcess(LeaderElector.java:156)
[junit4:junit4]   2> 	at org.apache.solr.cloud.LeaderElector.checkIfIamLeader(LeaderElector.java:100)
[junit4:junit4]   2> 	at org.apache.solr.cloud.LeaderElector.access$000(LeaderElector.java:55)
[junit4:junit4]   2> 	at org.apache.solr.cloud.LeaderElector$1.process(LeaderElector.java:129)
[junit4:junit4]   2> 	at org.apache.zookeeper.ClientCnxn$EventThread.processEvent(ClientCnxn.java:519)
[junit4:junit4]   2> 	at org.apache.zookeeper.ClientCnxn$EventThread.run(ClientCnxn.java:495)
[junit4:junit4]   2> 
[junit4:junit4]   2> 79444 T2778 oascc.ZkStateReader$3.process WARNING ZooKeeper watch triggered, but Solr cannot talk to ZK
[junit4:junit4]   2> 79444 T2778 oascc.ZkStateReader$2.process A cluster state change: WatchedEvent state:SyncConnected type:NodeChildrenChanged path:/live_nodes, has occurred - updating... (live nodes size: 5)
[junit4:junit4]   2> 79445 T2778 oascc.ZkStateReader$2.process WARNING ZooKeeper watch triggered, but Solr cannot talk to ZK
[junit4:junit4]   2> 79445 T2778 oascc.ZkStateReader$2.process A cluster state change: WatchedEvent state:SyncConnected type:NodeDataChanged path:/clusterstate.json, has occurred - updating... (live nodes size: 5)
[junit4:junit4]   2> 79445 T2778 oascc.ZkStateReader$2.process WARNING ZooKeeper watch triggered, but Solr cannot talk to ZK
[junit4:junit4]   2> 79445 T2778 oascc.ConnectionManager.process Watcher org.apache.solr.common.cloud.ConnectionManager@329127e8 name:ZooKeeperConnection Watcher:127.0.0.1:56323/solr got event WatchedEvent state:Disconnected type:None path:null path:null type:None
[junit4:junit4]   2> 79445 T2778 oascc.ConnectionManager.process Client->ZooKeeper status change trigger but we are already closed
[junit4:junit4]   2> 79445 T2778 oaz.ClientCnxn$EventThread.run EventThread shut down
[junit4:junit4]   2> NOTE: test params are: codec=Lucene40, sim=RandomSimilarityProvider(queryNorm=true,coord=no): {}, locale=fr, timezone=Etc/GMT-0
[junit4:junit4]   2> NOTE: FreeBSD 9.0-RELEASE amd64/Sun Microsystems Inc. 1.6.0_32 (64-bit)/cpus=16,threads=2,free=165962152,total=479068160
[junit4:junit4]   2> NOTE: All tests run in this JVM: [TestFunctionQuery, UUIDFieldTest, DistributedQueryElevationComponentTest, TestCharFilters, TestSolrIndexConfig, PingRequestHandlerTest, TermVectorComponentTest, TestRealTimeGet, SuggesterTSTTest, ScriptEngineTest, DirectSolrSpellCheckerTest, LukeRequestHandlerTest, TestDistributedGrouping, ConvertedLegacyTest, SpellingQueryConverterTest, QueryParsingTest, TestAnalyzedSuggestions, DirectUpdateHandlerTest, TestSolrXMLSerializer, LeaderElectionTest, TestZkChroot, ExternalFileFieldSortTest, TestSort, OutputWriterTest, SolrInfoMBeanTest, HighlighterTest, ZkSolrClientTest, IndexSchemaRuntimeFieldTest, MultiTermTest, DOMUtilTest, TestCodecSupport, TestReversedWildcardFilterFactory, TestUpdate, StandardRequestHandlerTest, RAMDirectoryFactoryTest, TestRecovery, URLClassifyProcessorTest, EchoParamsTest, ReturnFieldsTest, ZkNodePropsTest, SignatureUpdateProcessorFactoryTest, TestPluginEnable, LegacyHTMLStripCharFilterTest, PeerSyncTest, SoftAutoCommitTest, TestMultiCoreConfBootstrap, PrimitiveFieldTypeTest, TestQueryUtils, XsltUpdateRequestHandlerTest, TestDocSet, StatelessScriptUpdateProcessorFactoryTest, TestRemoteStreaming, OverseerTest, TestMergePolicyConfig, BadIndexSchemaTest, PolyFieldTest, DebugComponentTest, IndexReaderFactoryTest, TestHashPartitioner, RecoveryZkTest, FullSolrCloudDistribCmdsTest, TestReplicationHandler, LeaderElectionIntegrationTest, TestDistributedSearch, TestExtendedDismaxParser, BasicZkTest, TestFaceting, DistributedTermsComponentTest, StatsComponentTest, TestJoin, SolrCoreTest, TestRangeQuery, TestCoreContainer, TestGroupingSearch, QueryElevationComponentTest, SortByFunctionTest, BasicFunctionalityTest, TestJmxIntegration, SampleTest, TestIndexSearcher, CoreAdminHandlerTest, TestTrie, CacheHeaderTest, QueryEqualityTest, TestWordDelimiterFilterFactory, TestCSVLoader, TestCSVResponseWriter, DocumentBuilderTest, TestPseudoReturnFields, BinaryUpdateRequestHandlerTest, DistanceFunctionTest, TestPHPSerializedResponseWriter, JsonLoaderTest, DocumentAnalysisRequestHandlerTest, JSONWriterTest, SearchHandlerTest, TestOmitPositions, LoggingHandlerTest, UpdateParamsTest, SuggesterTest, ShowFileRequestHandlerTest, TestSearchPerf, TestFoldingMultitermQuery, TestLuceneMatchVersion, TestPropInject, FieldMutatingUpdateProcessorTest, TestBinaryField, TestPropInjectDefaults, TestXIncludeConfig, TestQuerySenderListener, NumericFieldsTest, TestSolrCoreProperties, TestBM25SimilarityFactory, TestDFRSimilarityFactory, TimeZoneUtilsTest, PrimUtilsTest, ResourceLoaderTest, TestSuggestSpellingConverter, TestLRUCache, TestUtils, CircularListTest, TestDocumentBuilder, PathHierarchyTokenizerFactoryTest, BasicDistributedZk2Test]
[junit4:junit4] Completed on J1 in 80.17s, 1 test, 1 failure <<< FAILURES!

[...truncated 55 lines...]
BUILD FAILED
/usr/home/hudson/hudson-slave/workspace/Lucene-Solr-Tests-trunk-Java6/build.xml:353: The following error occurred while executing this line:
/usr/home/hudson/hudson-slave/workspace/Lucene-Solr-Tests-trunk-Java6/build.xml:39: The following error occurred while executing this line:
/usr/home/hudson/hudson-slave/workspace/Lucene-Solr-Tests-trunk-Java6/solr/build.xml:178: The following error occurred while executing this line:
/usr/home/hudson/hudson-slave/workspace/Lucene-Solr-Tests-trunk-Java6/solr/common-build.xml:438: The following error occurred while executing this line:
/usr/home/hudson/hudson-slave/workspace/Lucene-Solr-Tests-trunk-Java6/lucene/common-build.xml:1175: The following error occurred while executing this line:
/usr/home/hudson/hudson-slave/workspace/Lucene-Solr-Tests-trunk-Java6/lucene/common-build.xml:840: There were test failures: 241 suites, 1006 tests, 2 failures, 21 ignored (3 assumptions)

Total time: 32 minutes 12 seconds
Build step 'Invoke Ant' marked build as failure
Archiving artifacts
Recording test results
Email was triggered for: Failure
Sending email for trigger: Failure



Mime
View raw message