lucene-dev mailing list archives

Site index · List index
Message view « Date » · « Thread »
Top « Date » · « Thread »
From Apache Jenkins Server <jenk...@builds.apache.org>
Subject [JENKINS] Lucene-Solr-Tests-4.x-java7 - Build # 813 - Failure
Date Thu, 20 Dec 2012 01:20:01 GMT
Build: https://builds.apache.org/job/Lucene-Solr-Tests-4.x-java7/813/

2 tests failed.
REGRESSION:  org.apache.solr.cloud.BasicDistributedZkTest.testDistribSearch

Error Message:
Test abandoned because suite timeout was reached.

Stack Trace:
java.lang.Exception: Test abandoned because suite timeout was reached.
	at __randomizedtesting.SeedInfo.seed([A3CD0BB54D6DC591]:0)


FAILED:  junit.framework.TestSuite.org.apache.solr.cloud.BasicDistributedZkTest

Error Message:
Suite timeout exceeded (>= 7200000 msec).

Stack Trace:
java.lang.Exception: Suite timeout exceeded (>= 7200000 msec).
	at __randomizedtesting.SeedInfo.seed([A3CD0BB54D6DC591]:0)




Build Log:
[...truncated 9315 lines...]
[junit4:junit4] Suite: org.apache.solr.cloud.BasicDistributedZkTest
[junit4:junit4]   2> 0 T1063 oas.BaseDistributedSearchTestCase.initHostContext Setting hostContext system property: /waso/s
[junit4:junit4]   2> 6 T1063 oas.SolrTestCaseJ4.setUp ###Starting testDistribSearch
[junit4:junit4]   2> Creating dataDir: /usr/home/hudson/hudson-slave/workspace/Lucene-Solr-Tests-4.x-java7/solr/build/solr-core/test/J0/./solrtest-BasicDistributedZkTest-1355959159685
[junit4:junit4]   2> 8 T1063 oasc.ZkTestServer.run STARTING ZK TEST SERVER
[junit4:junit4]   2> 9 T1064 oasc.ZkTestServer$ZKServerMain.runFromConfig Starting server
[junit4:junit4]   2> 11 T1064 oazs.ZooKeeperServer.setTickTime tickTime set to 1000
[junit4:junit4]   2> 11 T1064 oazs.ZooKeeperServer.setMinSessionTimeout minSessionTimeout set to -1
[junit4:junit4]   2> 11 T1064 oazs.ZooKeeperServer.setMaxSessionTimeout maxSessionTimeout set to -1
[junit4:junit4]   2> 11 T1064 oazs.NIOServerCnxnFactory.configure binding to port 0.0.0.0/0.0.0.0:0
[junit4:junit4]   2> 12 T1064 oazsp.FileTxnSnapLog.save Snapshotting: 0x0 to /usr/home/hudson/hudson-slave/workspace/Lucene-Solr-Tests-4.x-java7/solr/build/solr-core/test/J0/./org.apache.solr.cloud.BasicDistributedZkTest-1355959159685/zookeeper/server1/data/version-2/snapshot.0
[junit4:junit4]   2> 109 T1063 oasc.ZkTestServer.run start zk server on port:22107
[junit4:junit4]   2> 109 T1063 oaz.ZooKeeper.<init> Initiating client connection, connectString=127.0.0.1:22107 sessionTimeout=10000 watcher=org.apache.solr.common.cloud.ConnectionManager@6efc366b
[junit4:junit4]   2> 110 T1063 oascc.ConnectionManager.waitForConnected Waiting for client to connect to ZooKeeper
[junit4:junit4]   2> 111 T1069 oaz.ClientCnxn$SendThread.logStartConnect Opening socket connection to server localhost/127.0.0.1:22107. Will not attempt to authenticate using SASL (access denied ("javax.security.auth.AuthPermission" "getLoginConfiguration"))
[junit4:junit4]   2> 111 T1069 oaz.ClientCnxn$SendThread.primeConnection Socket connection established to localhost/127.0.0.1:22107, initiating session
[junit4:junit4]   2> 112 T1065 oazs.NIOServerCnxnFactory.run Accepted socket connection from /140.211.11.196:22108
[junit4:junit4]   2> 112 T1065 oazs.ZooKeeperServer.processConnectRequest Client attempting to establish new session at /140.211.11.196:22108
[junit4:junit4]   2> 112 T1067 oazsp.FileTxnLog.append Creating new log file: log.1
[junit4:junit4]   2> 115 T1067 oazs.ZooKeeperServer.finishSessionInit Established session 0x13bb576cb8b0000 with negotiated timeout 10000 for client /140.211.11.196:22108
[junit4:junit4]   2> 115 T1069 oaz.ClientCnxn$SendThread.onConnected Session establishment complete on server localhost/127.0.0.1:22107, sessionid = 0x13bb576cb8b0000, negotiated timeout = 10000
[junit4:junit4]   2> 115 T1070 oascc.ConnectionManager.process Watcher org.apache.solr.common.cloud.ConnectionManager@6efc366b name:ZooKeeperConnection Watcher:127.0.0.1:22107 got event WatchedEvent state:SyncConnected type:None path:null path:null type:None
[junit4:junit4]   2> 116 T1063 oascc.ConnectionManager.waitForConnected Client is connected to ZooKeeper
[junit4:junit4]   2> 116 T1063 oascc.SolrZkClient.makePath makePath: /solr
[junit4:junit4]   2> 119 T1068 oazs.PrepRequestProcessor.pRequest2Txn Processed session termination for sessionid: 0x13bb576cb8b0000
[junit4:junit4]   2> 128 T1070 oaz.ClientCnxn$EventThread.run EventThread shut down
[junit4:junit4]   2> 128 T1065 oazs.NIOServerCnxn.closeSock Closed socket connection for client /140.211.11.196:22108 which had sessionid 0x13bb576cb8b0000
[junit4:junit4]   2> 128 T1063 oaz.ZooKeeper.close Session: 0x13bb576cb8b0000 closed
[junit4:junit4]   2> 128 T1063 oaz.ZooKeeper.<init> Initiating client connection, connectString=127.0.0.1:22107/solr sessionTimeout=10000 watcher=org.apache.solr.common.cloud.ConnectionManager@36421403
[junit4:junit4]   2> 129 T1063 oascc.ConnectionManager.waitForConnected Waiting for client to connect to ZooKeeper
[junit4:junit4]   2> 129 T1071 oaz.ClientCnxn$SendThread.logStartConnect Opening socket connection to server localhost/127.0.0.1:22107. Will not attempt to authenticate using SASL (access denied ("javax.security.auth.AuthPermission" "getLoginConfiguration"))
[junit4:junit4]   2> 130 T1071 oaz.ClientCnxn$SendThread.primeConnection Socket connection established to localhost/127.0.0.1:22107, initiating session
[junit4:junit4]   2> 130 T1065 oazs.NIOServerCnxnFactory.run Accepted socket connection from /140.211.11.196:22109
[junit4:junit4]   2> 130 T1065 oazs.ZooKeeperServer.processConnectRequest Client attempting to establish new session at /140.211.11.196:22109
[junit4:junit4]   2> 131 T1067 oazs.ZooKeeperServer.finishSessionInit Established session 0x13bb576cb8b0001 with negotiated timeout 10000 for client /140.211.11.196:22109
[junit4:junit4]   2> 132 T1071 oaz.ClientCnxn$SendThread.onConnected Session establishment complete on server localhost/127.0.0.1:22107, sessionid = 0x13bb576cb8b0001, negotiated timeout = 10000
[junit4:junit4]   2> 132 T1072 oascc.ConnectionManager.process Watcher org.apache.solr.common.cloud.ConnectionManager@36421403 name:ZooKeeperConnection Watcher:127.0.0.1:22107/solr got event WatchedEvent state:SyncConnected type:None path:null path:null type:None
[junit4:junit4]   2> 132 T1063 oascc.ConnectionManager.waitForConnected Client is connected to ZooKeeper
[junit4:junit4]   2> 133 T1063 oascc.SolrZkClient.makePath makePath: /collections/collection1
[junit4:junit4]   2> 136 T1063 oascc.SolrZkClient.makePath makePath: /collections/collection1/shards
[junit4:junit4]   2> 145 T1063 oascc.SolrZkClient.makePath makePath: /collections/control_collection
[junit4:junit4]   2> 148 T1063 oascc.SolrZkClient.makePath makePath: /collections/control_collection/shards
[junit4:junit4]   2> 152 T1063 oasc.AbstractZkTestCase.putConfig put /usr/home/hudson/hudson-slave/workspace/Lucene-Solr-Tests-4.x-java7/solr/build/solr-core/test-files/solr/collection1/conf/solrconfig.xml to /configs/conf1/solrconfig.xml
[junit4:junit4]   2> 153 T1063 oascc.SolrZkClient.makePath makePath: /configs/conf1/solrconfig.xml
[junit4:junit4]   2> 164 T1063 oasc.AbstractZkTestCase.putConfig put /usr/home/hudson/hudson-slave/workspace/Lucene-Solr-Tests-4.x-java7/solr/build/solr-core/test-files/solr/collection1/conf/schema.xml to /configs/conf1/schema.xml
[junit4:junit4]   2> 165 T1063 oascc.SolrZkClient.makePath makePath: /configs/conf1/schema.xml
[junit4:junit4]   2> 268 T1063 oasc.AbstractZkTestCase.putConfig put /usr/home/hudson/hudson-slave/workspace/Lucene-Solr-Tests-4.x-java7/solr/build/solr-core/test-files/solr/collection1/conf/stopwords.txt to /configs/conf1/stopwords.txt
[junit4:junit4]   2> 269 T1063 oascc.SolrZkClient.makePath makePath: /configs/conf1/stopwords.txt
[junit4:junit4]   2> 287 T1063 oasc.AbstractZkTestCase.putConfig put /usr/home/hudson/hudson-slave/workspace/Lucene-Solr-Tests-4.x-java7/solr/build/solr-core/test-files/solr/collection1/conf/protwords.txt to /configs/conf1/protwords.txt
[junit4:junit4]   2> 287 T1063 oascc.SolrZkClient.makePath makePath: /configs/conf1/protwords.txt
[junit4:junit4]   2> 291 T1063 oasc.AbstractZkTestCase.putConfig put /usr/home/hudson/hudson-slave/workspace/Lucene-Solr-Tests-4.x-java7/solr/build/solr-core/test-files/solr/collection1/conf/currency.xml to /configs/conf1/currency.xml
[junit4:junit4]   2> 292 T1063 oascc.SolrZkClient.makePath makePath: /configs/conf1/currency.xml
[junit4:junit4]   2> 295 T1063 oasc.AbstractZkTestCase.putConfig put /usr/home/hudson/hudson-slave/workspace/Lucene-Solr-Tests-4.x-java7/solr/build/solr-core/test-files/solr/collection1/conf/open-exchange-rates.json to /configs/conf1/open-exchange-rates.json
[junit4:junit4]   2> 296 T1063 oascc.SolrZkClient.makePath makePath: /configs/conf1/open-exchange-rates.json
[junit4:junit4]   2> 299 T1063 oasc.AbstractZkTestCase.putConfig put /usr/home/hudson/hudson-slave/workspace/Lucene-Solr-Tests-4.x-java7/solr/build/solr-core/test-files/solr/collection1/conf/mapping-ISOLatin1Accent.txt to /configs/conf1/mapping-ISOLatin1Accent.txt
[junit4:junit4]   2> 300 T1063 oascc.SolrZkClient.makePath makePath: /configs/conf1/mapping-ISOLatin1Accent.txt
[junit4:junit4]   2> 303 T1063 oasc.AbstractZkTestCase.putConfig put /usr/home/hudson/hudson-slave/workspace/Lucene-Solr-Tests-4.x-java7/solr/build/solr-core/test-files/solr/collection1/conf/old_synonyms.txt to /configs/conf1/old_synonyms.txt
[junit4:junit4]   2> 304 T1063 oascc.SolrZkClient.makePath makePath: /configs/conf1/old_synonyms.txt
[junit4:junit4]   2> 307 T1063 oasc.AbstractZkTestCase.putConfig put /usr/home/hudson/hudson-slave/workspace/Lucene-Solr-Tests-4.x-java7/solr/build/solr-core/test-files/solr/collection1/conf/synonyms.txt to /configs/conf1/synonyms.txt
[junit4:junit4]   2> 308 T1063 oascc.SolrZkClient.makePath makePath: /configs/conf1/synonyms.txt
[junit4:junit4]   2> 311 T1068 oazs.PrepRequestProcessor.pRequest2Txn Processed session termination for sessionid: 0x13bb576cb8b0001
[junit4:junit4]   2> 312 T1072 oaz.ClientCnxn$EventThread.run EventThread shut down
[junit4:junit4]   2> 312 T1065 oazs.NIOServerCnxn.closeSock Closed socket connection for client /140.211.11.196:22109 which had sessionid 0x13bb576cb8b0001
[junit4:junit4]   2> 312 T1063 oaz.ZooKeeper.close Session: 0x13bb576cb8b0001 closed
[junit4:junit4]   2> 480 T1063 oejs.Server.doStart jetty-8.1.8.v20121106
[junit4:junit4]   2> 486 T1063 oejs.AbstractConnector.doStart Started SocketConnector@127.0.0.1:22110
[junit4:junit4]   2> 488 T1063 oasc.SolrResourceLoader.locateSolrHome JNDI not configured for solr (NoInitialContextEx)
[junit4:junit4]   2> 489 T1063 oasc.SolrResourceLoader.locateSolrHome using system property solr.solr.home: /usr/home/hudson/hudson-slave/workspace/Lucene-Solr-Tests-4.x-java7/solr/build/solr-core/test/J0/./org.apache.solr.cloud.BasicDistributedZkTest-controljetty-1355959159991
[junit4:junit4]   2> 490 T1063 oasc.SolrResourceLoader.<init> new SolrResourceLoader for deduced Solr Home: '/usr/home/hudson/hudson-slave/workspace/Lucene-Solr-Tests-4.x-java7/solr/build/solr-core/test/J0/./org.apache.solr.cloud.BasicDistributedZkTest-controljetty-1355959159991/'
[junit4:junit4]   2> 533 T1063 oass.SolrDispatchFilter.init SolrDispatchFilter.init()
[junit4:junit4]   2> 534 T1063 oasc.SolrResourceLoader.locateSolrHome JNDI not configured for solr (NoInitialContextEx)
[junit4:junit4]   2> 535 T1063 oasc.SolrResourceLoader.locateSolrHome using system property solr.solr.home: /usr/home/hudson/hudson-slave/workspace/Lucene-Solr-Tests-4.x-java7/solr/build/solr-core/test/J0/./org.apache.solr.cloud.BasicDistributedZkTest-controljetty-1355959159991
[junit4:junit4]   2> 536 T1063 oasc.CoreContainer$Initializer.initialize looking for solr.xml: /usr/home/hudson/hudson-slave/workspace/Lucene-Solr-Tests-4.x-java7/solr/build/solr-core/test/J0/./org.apache.solr.cloud.BasicDistributedZkTest-controljetty-1355959159991/solr.xml
[junit4:junit4]   2> 536 T1063 oasc.CoreContainer.<init> New CoreContainer 1125147562
[junit4:junit4]   2> 537 T1063 oasc.CoreContainer.load Loading CoreContainer using Solr Home: '/usr/home/hudson/hudson-slave/workspace/Lucene-Solr-Tests-4.x-java7/solr/build/solr-core/test/J0/./org.apache.solr.cloud.BasicDistributedZkTest-controljetty-1355959159991/'
[junit4:junit4]   2> 538 T1063 oasc.SolrResourceLoader.<init> new SolrResourceLoader for directory: '/usr/home/hudson/hudson-slave/workspace/Lucene-Solr-Tests-4.x-java7/solr/build/solr-core/test/J0/./org.apache.solr.cloud.BasicDistributedZkTest-controljetty-1355959159991/'
[junit4:junit4]   2> 569 T1063 oashc.HttpShardHandlerFactory.getParameter Setting socketTimeout to: 30000
[junit4:junit4]   2> 570 T1063 oashc.HttpShardHandlerFactory.getParameter Setting urlScheme to: http://
[junit4:junit4]   2> 570 T1063 oashc.HttpShardHandlerFactory.getParameter Setting connTimeout to: 15000
[junit4:junit4]   2> 571 T1063 oashc.HttpShardHandlerFactory.getParameter Setting maxConnectionsPerHost to: 20
[junit4:junit4]   2> 572 T1063 oashc.HttpShardHandlerFactory.getParameter Setting corePoolSize to: 0
[junit4:junit4]   2> 572 T1063 oashc.HttpShardHandlerFactory.getParameter Setting maximumPoolSize to: 2147483647
[junit4:junit4]   2> 573 T1063 oashc.HttpShardHandlerFactory.getParameter Setting maxThreadIdleTime to: 5
[junit4:junit4]   2> 573 T1063 oashc.HttpShardHandlerFactory.getParameter Setting sizeOfQueue to: -1
[junit4:junit4]   2> 574 T1063 oashc.HttpShardHandlerFactory.getParameter Setting fairnessPolicy to: false
[junit4:junit4]   2> 575 T1063 oascsi.HttpClientUtil.createClient Creating new http client, config:maxConnectionsPerHost=20&maxConnections=10000&socketTimeout=30000&connTimeout=15000&retry=false
[junit4:junit4]   2> 597 T1063 oasc.CoreContainer.load Registering Log Listener
[junit4:junit4]   2> 617 T1063 oasc.CoreContainer.initZooKeeper Zookeeper client=127.0.0.1:22107/solr
[junit4:junit4]   2> 618 T1063 oasc.ZkController.checkChrootPath zkHost includes chroot
[junit4:junit4]   2> 619 T1063 oaz.ZooKeeper.<init> Initiating client connection, connectString=127.0.0.1:22107 sessionTimeout=60000 watcher=org.apache.solr.common.cloud.ConnectionManager@3940f2a5
[junit4:junit4]   2> 620 T1063 oascc.ConnectionManager.waitForConnected Waiting for client to connect to ZooKeeper
[junit4:junit4]   2> 621 T1082 oaz.ClientCnxn$SendThread.logStartConnect Opening socket connection to server localhost/127.0.0.1:22107. Will not attempt to authenticate using SASL (access denied ("javax.security.auth.AuthPermission" "getLoginConfiguration"))
[junit4:junit4]   2> 622 T1082 oaz.ClientCnxn$SendThread.primeConnection Socket connection established to localhost/127.0.0.1:22107, initiating session
[junit4:junit4]   2> 622 T1065 oazs.NIOServerCnxnFactory.run Accepted socket connection from /140.211.11.196:22111
[junit4:junit4]   2> 622 T1065 oazs.ZooKeeperServer.processConnectRequest Client attempting to establish new session at /140.211.11.196:22111
[junit4:junit4]   2> 624 T1067 oazs.ZooKeeperServer.finishSessionInit Established session 0x13bb576cb8b0002 with negotiated timeout 20000 for client /140.211.11.196:22111
[junit4:junit4]   2> 624 T1082 oaz.ClientCnxn$SendThread.onConnected Session establishment complete on server localhost/127.0.0.1:22107, sessionid = 0x13bb576cb8b0002, negotiated timeout = 20000
[junit4:junit4]   2> 625 T1083 oascc.ConnectionManager.process Watcher org.apache.solr.common.cloud.ConnectionManager@3940f2a5 name:ZooKeeperConnection Watcher:127.0.0.1:22107 got event WatchedEvent state:SyncConnected type:None path:null path:null type:None
[junit4:junit4]   2> 625 T1063 oascc.ConnectionManager.waitForConnected Client is connected to ZooKeeper
[junit4:junit4]   2> 627 T1068 oazs.PrepRequestProcessor.pRequest2Txn Processed session termination for sessionid: 0x13bb576cb8b0002
[junit4:junit4]   2> 628 T1083 oaz.ClientCnxn$EventThread.run EventThread shut down
[junit4:junit4]   2> 628 T1065 oazs.NIOServerCnxn.closeSock Closed socket connection for client /140.211.11.196:22111 which had sessionid 0x13bb576cb8b0002
[junit4:junit4]   2> 628 T1063 oaz.ZooKeeper.close Session: 0x13bb576cb8b0002 closed
[junit4:junit4]   2> 629 T1063 oascsi.HttpClientUtil.createClient Creating new http client, config:maxConnections=500&maxConnectionsPerHost=16&socketTimeout=15000&connTimeout=30000
[junit4:junit4]   2> 641 T1063 oaz.ZooKeeper.<init> Initiating client connection, connectString=127.0.0.1:22107/solr sessionTimeout=30000 watcher=org.apache.solr.common.cloud.ConnectionManager@25c8d6ed
[junit4:junit4]   2> 642 T1063 oascc.ConnectionManager.waitForConnected Waiting for client to connect to ZooKeeper
[junit4:junit4]   2> 642 T1084 oaz.ClientCnxn$SendThread.logStartConnect Opening socket connection to server localhost/127.0.0.1:22107. Will not attempt to authenticate using SASL (access denied ("javax.security.auth.AuthPermission" "getLoginConfiguration"))
[junit4:junit4]   2> 643 T1084 oaz.ClientCnxn$SendThread.primeConnection Socket connection established to localhost/127.0.0.1:22107, initiating session
[junit4:junit4]   2> 643 T1065 oazs.NIOServerCnxnFactory.run Accepted socket connection from /140.211.11.196:22112
[junit4:junit4]   2> 644 T1065 oazs.ZooKeeperServer.processConnectRequest Client attempting to establish new session at /140.211.11.196:22112
[junit4:junit4]   2> 645 T1067 oazs.ZooKeeperServer.finishSessionInit Established session 0x13bb576cb8b0003 with negotiated timeout 20000 for client /140.211.11.196:22112
[junit4:junit4]   2> 645 T1084 oaz.ClientCnxn$SendThread.onConnected Session establishment complete on server localhost/127.0.0.1:22107, sessionid = 0x13bb576cb8b0003, negotiated timeout = 20000
[junit4:junit4]   2> 645 T1085 oascc.ConnectionManager.process Watcher org.apache.solr.common.cloud.ConnectionManager@25c8d6ed name:ZooKeeperConnection Watcher:127.0.0.1:22107/solr got event WatchedEvent state:SyncConnected type:None path:null path:null type:None
[junit4:junit4]   2> 646 T1063 oascc.ConnectionManager.waitForConnected Client is connected to ZooKeeper
[junit4:junit4]   2> 648 T1068 oazs.PrepRequestProcessor.pRequest Got user-level KeeperException when processing sessionid:0x13bb576cb8b0003 type:create cxid:0x2 zxid:0x1a txntype:-1 reqpath:n/a Error Path:/solr/overseer Error:KeeperErrorCode = NodeExists for /solr/overseer
[junit4:junit4]   2> 656 T1063 oascc.SolrZkClient.makePath makePath: /live_nodes
[junit4:junit4]   2> 659 T1063 oasc.ZkController.createEphemeralLiveNode Register node as live in ZooKeeper:/live_nodes/127.0.0.1:22110_waso%2Fs
[junit4:junit4]   2> 660 T1068 oazs.PrepRequestProcessor.pRequest Got user-level KeeperException when processing sessionid:0x13bb576cb8b0003 type:delete cxid:0x7 zxid:0x1c txntype:-1 reqpath:n/a Error Path:/solr/live_nodes/127.0.0.1:22110_waso%2Fs Error:KeeperErrorCode = NoNode for /solr/live_nodes/127.0.0.1:22110_waso%2Fs
[junit4:junit4]   2> 661 T1063 oascc.SolrZkClient.makePath makePath: /live_nodes/127.0.0.1:22110_waso%2Fs
[junit4:junit4]   2> 671 T1063 oascc.SolrZkClient.makePath makePath: /overseer_elect/election
[junit4:junit4]   2> 678 T1068 oazs.PrepRequestProcessor.pRequest Got user-level KeeperException when processing sessionid:0x13bb576cb8b0003 type:delete cxid:0x15 zxid:0x21 txntype:-1 reqpath:n/a Error Path:/solr/overseer_elect/leader Error:KeeperErrorCode = NoNode for /solr/overseer_elect/leader
[junit4:junit4]   2> 679 T1063 oascc.SolrZkClient.makePath makePath: /overseer_elect/leader
[junit4:junit4]   2> 682 T1063 oasc.Overseer.start Overseer (id=88864139489509379-127.0.0.1:22110_waso%2Fs-n_0000000000) starting
[junit4:junit4]   2> 683 T1068 oazs.PrepRequestProcessor.pRequest Got user-level KeeperException when processing sessionid:0x13bb576cb8b0003 type:create cxid:0x1a zxid:0x23 txntype:-1 reqpath:n/a Error Path:/solr/overseer Error:KeeperErrorCode = NodeExists for /solr/overseer
[junit4:junit4]   2> 690 T1068 oazs.PrepRequestProcessor.pRequest Got user-level KeeperException when processing sessionid:0x13bb576cb8b0003 type:create cxid:0x1b zxid:0x24 txntype:-1 reqpath:n/a Error Path:/solr/overseer Error:KeeperErrorCode = NodeExists for /solr/overseer
[junit4:junit4]   2> 692 T1068 oazs.PrepRequestProcessor.pRequest Got user-level KeeperException when processing sessionid:0x13bb576cb8b0003 type:create cxid:0x1c zxid:0x25 txntype:-1 reqpath:n/a Error Path:/solr/overseer Error:KeeperErrorCode = NodeExists for /solr/overseer
[junit4:junit4]   2> 694 T1068 oazs.PrepRequestProcessor.pRequest Got user-level KeeperException when processing sessionid:0x13bb576cb8b0003 type:create cxid:0x1d zxid:0x26 txntype:-1 reqpath:n/a Error Path:/solr/overseer Error:KeeperErrorCode = NodeExists for /solr/overseer
[junit4:junit4]   2> 695 T1087 oasc.OverseerCollectionProcessor.run Process current queue of collection messages
[junit4:junit4]   2> 696 T1063 oascc.SolrZkClient.makePath makePath: /clusterstate.json
[junit4:junit4]   2> 699 T1063 oascc.ZkStateReader.createClusterStateWatchersAndUpdate Updating cluster state from ZooKeeper... 
[junit4:junit4]   2> 701 T1086 oasc.Overseer$ClusterStateUpdater.run Starting to work on the main queue
[junit4:junit4]   2> 707 T1088 oasc.CoreContainer.create Creating SolrCore 'collection1' using instanceDir: /usr/home/hudson/hudson-slave/workspace/Lucene-Solr-Tests-4.x-java7/solr/build/solr-core/test/J0/./org.apache.solr.cloud.BasicDistributedZkTest-controljetty-1355959159991/collection1
[junit4:junit4]   2> 708 T1088 oasc.ZkController.createCollectionZkNode Check for collection zkNode:control_collection
[junit4:junit4]   2> 708 T1088 oasc.ZkController.createCollectionZkNode Collection zkNode exists
[junit4:junit4]   2> 709 T1088 oasc.ZkController.readConfigName Load collection config from:/collections/control_collection
[junit4:junit4]   2> 710 T1088 oasc.SolrResourceLoader.<init> new SolrResourceLoader for directory: '/usr/home/hudson/hudson-slave/workspace/Lucene-Solr-Tests-4.x-java7/solr/build/solr-core/test/J0/./org.apache.solr.cloud.BasicDistributedZkTest-controljetty-1355959159991/collection1/'
[junit4:junit4]   2> 712 T1088 oasc.SolrResourceLoader.replaceClassLoader Adding 'file:/usr/home/hudson/hudson-slave/workspace/Lucene-Solr-Tests-4.x-java7/solr/build/solr-core/test/J0/org.apache.solr.cloud.BasicDistributedZkTest-controljetty-1355959159991/collection1/lib/classes/' to classloader
[junit4:junit4]   2> 712 T1088 oasc.SolrResourceLoader.replaceClassLoader Adding 'file:/usr/home/hudson/hudson-slave/workspace/Lucene-Solr-Tests-4.x-java7/solr/build/solr-core/test/J0/org.apache.solr.cloud.BasicDistributedZkTest-controljetty-1355959159991/collection1/lib/README' to classloader
[junit4:junit4]   2> 768 T1088 oasc.SolrConfig.<init> Using Lucene MatchVersion: LUCENE_41
[junit4:junit4]   2> 842 T1088 oasc.SolrConfig.<init> Loaded SolrConfig: solrconfig.xml
[junit4:junit4]   2> 943 T1088 oass.IndexSchema.readSchema Reading Solr Schema
[junit4:junit4]   2> 950 T1088 oass.IndexSchema.readSchema Schema name=test
[junit4:junit4]   2> 1642 T1088 oass.OpenExchangeRatesOrgProvider.init Initialized with rates=open-exchange-rates.json, refreshInterval=1440.
[junit4:junit4]   2> 1653 T1088 oass.IndexSchema.readSchema default search field in schema is text
[junit4:junit4]   2> 1657 T1088 oass.IndexSchema.readSchema unique key field: id
[junit4:junit4]   2> 1671 T1088 oass.FileExchangeRateProvider.reload Reloading exchange rates from file currency.xml
[junit4:junit4]   2> 1676 T1088 oass.FileExchangeRateProvider.reload Reloading exchange rates from file currency.xml
[junit4:junit4]   2> 1681 T1088 oass.OpenExchangeRatesOrgProvider.reload Reloading exchange rates from open-exchange-rates.json
[junit4:junit4]   2> 1682 T1088 oass.OpenExchangeRatesOrgProvider.reload Reloading exchange rates from open-exchange-rates.json
[junit4:junit4]   2> 1684 T1088 oasc.SolrCore.<init> [collection1] Opening new SolrCore at /usr/home/hudson/hudson-slave/workspace/Lucene-Solr-Tests-4.x-java7/solr/build/solr-core/test/J0/./org.apache.solr.cloud.BasicDistributedZkTest-controljetty-1355959159991/collection1/, dataDir=./org.apache.solr.cloud.BasicDistributedZkTest-1355959159685/control/data/
[junit4:junit4]   2> 1684 T1088 oasc.JmxMonitoredMap.<init> JMX monitoring is enabled. Adding Solr mbeans to JMX Server: com.sun.jmx.mbeanserver.JmxMBeanServer@4139a82d
[junit4:junit4]   2> 1684 T1088 oasc.SolrCore.initDirectoryFactory solr.NRTCachingDirectoryFactory
[junit4:junit4]   2> 1686 T1088 oasc.CachingDirectoryFactory.get return new directory for /usr/home/hudson/hudson-slave/workspace/Lucene-Solr-Tests-4.x-java7/solr/build/solr-core/test/J0/./org.apache.solr.cloud.BasicDistributedZkTest-1355959159685/control/data forceNew:false
[junit4:junit4]   2> 1687 T1088 oasc.CachingDirectoryFactory.close Releasing directory:/usr/home/hudson/hudson-slave/workspace/Lucene-Solr-Tests-4.x-java7/solr/build/solr-core/test/J0/./org.apache.solr.cloud.BasicDistributedZkTest-1355959159685/control/data
[junit4:junit4]   2> 1687 T1088 oasc.SolrCore.getNewIndexDir New index directory detected: old=null new=./org.apache.solr.cloud.BasicDistributedZkTest-1355959159685/control/data/index/
[junit4:junit4]   2> 1688 T1088 oasc.SolrCore.initIndex WARNING [collection1] Solr index directory './org.apache.solr.cloud.BasicDistributedZkTest-1355959159685/control/data/index' doesn't exist. Creating new index...
[junit4:junit4]   2> 1689 T1088 oasc.CachingDirectoryFactory.get return new directory for /usr/home/hudson/hudson-slave/workspace/Lucene-Solr-Tests-4.x-java7/solr/build/solr-core/test/J0/./org.apache.solr.cloud.BasicDistributedZkTest-1355959159685/control/data/index forceNew:false
[junit4:junit4]   2> 1704 T1088 oasc.SolrDeletionPolicy.onCommit SolrDeletionPolicy.onCommit: commits:num=1
[junit4:junit4]   2> 		commit{dir=RateLimitedDirectoryWrapper(NRTCachingDirectory(org.apache.lucene.store.NIOFSDirectory@/usr/home/hudson/hudson-slave/workspace/Lucene-Solr-Tests-4.x-java7/solr/build/solr-core/test/J0/org.apache.solr.cloud.BasicDistributedZkTest-1355959159685/control/data/index lockFactory=org.apache.lucene.store.NativeFSLockFactory@13e8924f; maxCacheMB=48.0 maxMergeSizeMB=4.0)),segFN=segments_1,generation=1,filenames=[segments_1]
[junit4:junit4]   2> 1705 T1088 oasc.SolrDeletionPolicy.updateCommits newest commit = 1[segments_1]
[junit4:junit4]   2> 1705 T1088 oasc.CachingDirectoryFactory.close Releasing directory:/usr/home/hudson/hudson-slave/workspace/Lucene-Solr-Tests-4.x-java7/solr/build/solr-core/test/J0/./org.apache.solr.cloud.BasicDistributedZkTest-1355959159685/control/data/index
[junit4:junit4]   2> 1706 T1088 oasc.SolrCore.initWriters created xml: solr.XMLResponseWriter
[junit4:junit4]   2> 1708 T1088 oasup.UpdateRequestProcessorChain.init inserting DistributedUpdateProcessorFactory into updateRequestProcessorChain "dedupe"
[junit4:junit4]   2> 1708 T1088 oasup.UpdateRequestProcessorChain.init inserting DistributedUpdateProcessorFactory into updateRequestProcessorChain "dedupe-allfields"
[junit4:junit4]   2> 1709 T1088 oasup.UpdateRequestProcessorChain.init inserting DistributedUpdateProcessorFactory into updateRequestProcessorChain "stored_sig"
[junit4:junit4]   2> 1709 T1088 oasup.UpdateRequestProcessorChain.init inserting DistributedUpdateProcessorFactory into updateRequestProcessorChain "uniq-fields"
[junit4:junit4]   2> 1710 T1088 oasup.UpdateRequestProcessorChain.init inserting DistributedUpdateProcessorFactory into updateRequestProcessorChain "distrib-dup-test-chain-implicit"
[junit4:junit4]   2> 1710 T1088 oasc.RequestHandlers.initHandlersFromConfig adding lazy requestHandler: solr.ReplicationHandler
[junit4:junit4]   2> 1710 T1088 oasc.RequestHandlers.initHandlersFromConfig created /replication: solr.ReplicationHandler
[junit4:junit4]   2> 1711 T1088 oasc.RequestHandlers.initHandlersFromConfig created standard: solr.StandardRequestHandler
[junit4:junit4]   2> 1712 T1088 oasc.RequestHandlers.initHandlersFromConfig created /get: solr.RealTimeGetHandler
[junit4:junit4]   2> 1713 T1088 oasc.RequestHandlers.initHandlersFromConfig created dismax: solr.SearchHandler
[junit4:junit4]   2> 1714 T1088 oasc.RequestHandlers.initHandlersFromConfig created mock: org.apache.solr.core.MockQuerySenderListenerReqHandler
[junit4:junit4]   2> 1714 T1088 oasc.RequestHandlers.initHandlersFromConfig created /admin/: org.apache.solr.handler.admin.AdminHandlers
[junit4:junit4]   2> 1715 T1088 oasc.RequestHandlers.initHandlersFromConfig created defaults: solr.StandardRequestHandler
[junit4:junit4]   2> 1715 T1088 oasc.RequestHandlers.initHandlersFromConfig adding lazy requestHandler: solr.StandardRequestHandler
[junit4:junit4]   2> 1716 T1088 oasc.RequestHandlers.initHandlersFromConfig created lazy: solr.StandardRequestHandler
[junit4:junit4]   2> 1716 T1088 oasc.RequestHandlers.initHandlersFromConfig created /update: solr.UpdateRequestHandler
[junit4:junit4]   2> 1717 T1088 oasc.RequestHandlers.initHandlersFromConfig created /terms: org.apache.solr.handler.component.SearchHandler
[junit4:junit4]   2> 1718 T1088 oasc.RequestHandlers.initHandlersFromConfig created spellCheckCompRH: org.apache.solr.handler.component.SearchHandler
[junit4:junit4]   2> 1719 T1088 oasc.RequestHandlers.initHandlersFromConfig created spellCheckCompRH_Direct: org.apache.solr.handler.component.SearchHandler
[junit4:junit4]   2> 1719 T1088 oasc.RequestHandlers.initHandlersFromConfig created spellCheckWithWordbreak: org.apache.solr.handler.component.SearchHandler
[junit4:junit4]   2> 1720 T1088 oasc.RequestHandlers.initHandlersFromConfig created spellCheckWithWordbreak_Direct: org.apache.solr.handler.component.SearchHandler
[junit4:junit4]   2> 1721 T1088 oasc.RequestHandlers.initHandlersFromConfig created spellCheckCompRH1: org.apache.solr.handler.component.SearchHandler
[junit4:junit4]   2> 1722 T1088 oasc.RequestHandlers.initHandlersFromConfig created mltrh: org.apache.solr.handler.component.SearchHandler
[junit4:junit4]   2> 1722 T1088 oasc.RequestHandlers.initHandlersFromConfig created tvrh: org.apache.solr.handler.component.SearchHandler
[junit4:junit4]   2> 1723 T1088 oasc.RequestHandlers.initHandlersFromConfig created /mlt: solr.MoreLikeThisHandler
[junit4:junit4]   2> 1724 T1088 oasc.RequestHandlers.initHandlersFromConfig created /debug/dump: solr.DumpRequestHandler
[junit4:junit4]   2> 1737 T1088 oashl.XMLLoader.init xsltCacheLifetimeSeconds=60
[junit4:junit4]   2> 1742 T1088 oasc.SolrCore.initDeprecatedSupport WARNING solrconfig.xml uses deprecated <admin/gettableFiles>, Please update your config to use the ShowFileRequestHandler.
[junit4:junit4]   2> 1743 T1088 oasc.SolrCore.initDeprecatedSupport WARNING adding ShowFileRequestHandler with hidden files: [SCHEMA.XML, OLD_SYNONYMS.TXT, STOPWORDS.TXT, PROTWORDS.TXT, OPEN-EXCHANGE-RATES.JSON, SYNONYMS.TXT, CURRENCY.XML, MAPPING-ISOLATIN1ACCENT.TXT]
[junit4:junit4]   2> 1746 T1088 oasc.CachingDirectoryFactory.close Releasing directory:/usr/home/hudson/hudson-slave/workspace/Lucene-Solr-Tests-4.x-java7/solr/build/solr-core/test/J0/./org.apache.solr.cloud.BasicDistributedZkTest-1355959159685/control/data
[junit4:junit4]   2> 1748 T1088 oass.SolrIndexSearcher.<init> Opening Searcher@18eaaaa main
[junit4:junit4]   2> 1749 T1088 oasu.CommitTracker.<init> Hard AutoCommit: disabled
[junit4:junit4]   2> 1749 T1088 oasu.CommitTracker.<init> Soft AutoCommit: disabled
[junit4:junit4]   2> 1750 T1088 oashc.SpellCheckComponent.inform Initializing spell checkers
[junit4:junit4]   2> 1757 T1088 oass.DirectSolrSpellChecker.init init: {name=direct,classname=DirectSolrSpellChecker,field=lowerfilt,minQueryLength=3}
[junit4:junit4]   2> 1814 T1089 oasc.SolrCore.registerSearcher [collection1] Registered new searcher Searcher@18eaaaa main{StandardDirectoryReader(segments_1:1)}
[junit4:junit4]   2> 1817 T1088 oasc.ZkController.publish publishing core=collection1 state=down
[junit4:junit4]   2> 1818 T1088 oasc.ZkController.publish numShards not found on descriptor - reading it from system property
[junit4:junit4]   2> 1819 T1068 oazs.PrepRequestProcessor.pRequest Got user-level KeeperException when processing sessionid:0x13bb576cb8b0003 type:create cxid:0x56 zxid:0x29 txntype:-1 reqpath:n/a Error Path:/solr/overseer/queue Error:KeeperErrorCode = NoNode for /solr/overseer/queue
[junit4:junit4]   2> 2232 T1086 oascc.ZkStateReader.updateClusterState Updating cloud state from ZooKeeper... 
[junit4:junit4]   2> 2233 T1086 oasc.Overseer$ClusterStateUpdater.updateState Update state numShards=1 message={
[junit4:junit4]   2> 	  "operation":"state",
[junit4:junit4]   2> 	  "numShards":"1",
[junit4:junit4]   2> 	  "shard":null,
[junit4:junit4]   2> 	  "roles":null,
[junit4:junit4]   2> 	  "state":"down",
[junit4:junit4]   2> 	  "core":"collection1",
[junit4:junit4]   2> 	  "collection":"control_collection",
[junit4:junit4]   2> 	  "node_name":"127.0.0.1:22110_waso%2Fs",
[junit4:junit4]   2> 	  "base_url":"http://127.0.0.1:22110/waso/s"}
[junit4:junit4]   2> 2233 T1086 oasc.Overseer$ClusterStateUpdater.createCollection Create collection control_collection with numShards 1
[junit4:junit4]   2> 2234 T1086 oasc.Overseer$ClusterStateUpdater.updateState Assigning new node to shard shard=shard1
[junit4:junit4]   2> 2234 T1068 oazs.PrepRequestProcessor.pRequest Got user-level KeeperException when processing sessionid:0x13bb576cb8b0003 type:create cxid:0x5e zxid:0x2c txntype:-1 reqpath:n/a Error Path:/solr/overseer/queue-work Error:KeeperErrorCode = NoNode for /solr/overseer/queue-work
[junit4:junit4]   2> 2255 T1085 oascc.ZkStateReader$2.process A cluster state change: WatchedEvent state:SyncConnected type:NodeDataChanged path:/clusterstate.json, has occurred - updating... (live nodes size: 1)
[junit4:junit4]   2> 2332 T1088 oasc.CoreContainer.registerCore registering core: collection1
[junit4:junit4]   2> 2332 T1088 oasc.ZkController.register Register replica - core:collection1 address:http://127.0.0.1:22110/waso/s collection:control_collection shard:shard1
[junit4:junit4]   2> 2333 T1088 oascc.SolrZkClient.makePath makePath: /collections/control_collection/leader_elect/shard1/election
[junit4:junit4]   2> 2354 T1068 oazs.PrepRequestProcessor.pRequest Got user-level KeeperException when processing sessionid:0x13bb576cb8b0003 type:delete cxid:0x78 zxid:0x36 txntype:-1 reqpath:n/a Error Path:/solr/collections/control_collection/leaders Error:KeeperErrorCode = NoNode for /solr/collections/control_collection/leaders
[junit4:junit4]   2> 2355 T1088 oasc.ShardLeaderElectionContext.runLeaderProcess Running the leader process.
[junit4:junit4]   2> 2356 T1068 oazs.PrepRequestProcessor.pRequest Got user-level KeeperException when processing sessionid:0x13bb576cb8b0003 type:create cxid:0x79 zxid:0x37 txntype:-1 reqpath:n/a Error Path:/solr/overseer Error:KeeperErrorCode = NodeExists for /solr/overseer
[junit4:junit4]   2> 2367 T1088 oasc.ShardLeaderElectionContext.waitForReplicasToComeUp Enough replicas found to continue.
[junit4:junit4]   2> 2368 T1088 oasc.ShardLeaderElectionContext.runLeaderProcess I may be the new leader - try and sync
[junit4:junit4]   2> 2368 T1088 oasc.SyncStrategy.sync Sync replicas to http://127.0.0.1:22110/waso/s/collection1/
[junit4:junit4]   2> 2368 T1088 oasc.SyncStrategy.syncReplicas Sync Success - now sync replicas to me
[junit4:junit4]   2> 2369 T1088 oasc.SyncStrategy.syncToMe http://127.0.0.1:22110/waso/s/collection1/ has no replicas
[junit4:junit4]   2> 2369 T1088 oasc.ShardLeaderElectionContext.runLeaderProcess I am the new leader: http://127.0.0.1:22110/waso/s/collection1/
[junit4:junit4]   2> 2369 T1088 oascc.SolrZkClient.makePath makePath: /collections/control_collection/leaders/shard1
[junit4:junit4]   2> 2374 T1068 oazs.PrepRequestProcessor.pRequest Got user-level KeeperException when processing sessionid:0x13bb576cb8b0003 type:create cxid:0x83 zxid:0x3b txntype:-1 reqpath:n/a Error Path:/solr/overseer Error:KeeperErrorCode = NodeExists for /solr/overseer
[junit4:junit4]   2> 2765 T1086 oascc.ZkStateReader.updateClusterState Updating cloud state from ZooKeeper... 
[junit4:junit4]   2> 2780 T1085 oascc.ZkStateReader$2.process A cluster state change: WatchedEvent state:SyncConnected type:NodeDataChanged path:/clusterstate.json, has occurred - updating... (live nodes size: 1)
[junit4:junit4]   2> 2792 T1088 oasc.ZkController.register We are http://127.0.0.1:22110/waso/s/collection1/ and leader is http://127.0.0.1:22110/waso/s/collection1/
[junit4:junit4]   2> 2792 T1088 oasc.ZkController.register No LogReplay needed for core=collection1 baseURL=http://127.0.0.1:22110/waso/s
[junit4:junit4]   2> 2792 T1088 oasc.ZkController.checkRecovery I am the leader, no recovery necessary
[junit4:junit4]   2> 2793 T1088 oasc.ZkController.publish publishing core=collection1 state=active
[junit4:junit4]   2> 2793 T1088 oasc.ZkController.publish numShards not found on descriptor - reading it from system property
[junit4:junit4]   2> 2795 T1088 oascc.ZkStateReader.updateClusterState Updating cloud state from ZooKeeper... 
[junit4:junit4]   2> 2796 T1063 oass.SolrDispatchFilter.init user.dir=/usr/home/hudson/hudson-slave/workspace/Lucene-Solr-Tests-4.x-java7/solr/build/solr-core/test/J0
[junit4:junit4]   2> 2797 T1063 oass.SolrDispatchFilter.init SolrDispatchFilter.init() done
[junit4:junit4]   2> 2797 T1063 oascsi.HttpClientUtil.createClient Creating new http client, config:maxConnections=128&maxConnectionsPerHost=32&followRedirects=false
[junit4:junit4]   2> 2816 T1063 oascsi.HttpClientUtil.createClient Creating new http client, config:
[junit4:junit4]   2> 2828 T1063 oaz.ZooKeeper.<init> Initiating client connection, connectString=127.0.0.1:22107/solr sessionTimeout=10000 watcher=org.apache.solr.common.cloud.ConnectionManager@1aef47be
[junit4:junit4]   2> 2829 T1063 oascc.ConnectionManager.waitForConnected Waiting for client to connect to ZooKeeper
[junit4:junit4]   2> 2829 T1090 oaz.ClientCnxn$SendThread.logStartConnect Opening socket connection to server localhost/127.0.0.1:22107. Will not attempt to authenticate using SASL (access denied ("javax.security.auth.AuthPermission" "getLoginConfiguration"))
[junit4:junit4]   2> 2830 T1090 oaz.ClientCnxn$SendThread.primeConnection Socket connection established to localhost/127.0.0.1:22107, initiating session
[junit4:junit4]   2> 2830 T1065 oazs.NIOServerCnxnFactory.run Accepted socket connection from /140.211.11.196:22114
[junit4:junit4]   2> 2831 T1065 oazs.ZooKeeperServer.processConnectRequest Client attempting to establish new session at /140.211.11.196:22114
[junit4:junit4]   2> 2832 T1067 oazs.ZooKeeperServer.finishSessionInit Established session 0x13bb576cb8b0004 with negotiated timeout 10000 for client /140.211.11.196:22114
[junit4:junit4]   2> 2832 T1090 oaz.ClientCnxn$SendThread.onConnected Session establishment complete on server localhost/127.0.0.1:22107, sessionid = 0x13bb576cb8b0004, negotiated timeout = 10000
[junit4:junit4]   2> 2833 T1091 oascc.ConnectionManager.process Watcher org.apache.solr.common.cloud.ConnectionManager@1aef47be name:ZooKeeperConnection Watcher:127.0.0.1:22107/solr got event WatchedEvent state:SyncConnected type:None path:null path:null type:None
[junit4:junit4]   2> 2833 T1063 oascc.ConnectionManager.waitForConnected Client is connected to ZooKeeper
[junit4:junit4]   2> 2835 T1063 oascc.ZkStateReader.createClusterStateWatchersAndUpdate Updating cluster state from ZooKeeper... 
[junit4:junit4]   2> 2837 T1063 oasc.ChaosMonkey.monkeyLog monkey: init - expire sessions:true cause connection loss:true
[junit4:junit4]   2> 3010 T1063 oejs.Server.doStart jetty-8.1.8.v20121106
[junit4:junit4]   2> 3013 T1063 oejs.AbstractConnector.doStart Started SocketConnector@127.0.0.1:22115
[junit4:junit4]   2> 3014 T1063 oasc.SolrResourceLoader.locateSolrHome JNDI not configured for solr (NoInitialContextEx)
[junit4:junit4]   2> 3015 T1063 oasc.SolrResourceLoader.locateSolrHome using system property solr.solr.home: /usr/home/hudson/hudson-slave/workspace/Lucene-Solr-Tests-4.x-java7/solr/build/solr-core/test/J0/./org.apache.solr.cloud.BasicDistributedZkTest-jetty1-1355959162515
[junit4:junit4]   2> 3016 T1063 oasc.SolrResourceLoader.<init> new SolrResourceLoader for deduced Solr Home: '/usr/home/hudson/hudson-slave/workspace/Lucene-Solr-Tests-4.x-java7/solr/build/solr-core/test/J0/./org.apache.solr.cloud.BasicDistributedZkTest-jetty1-1355959162515/'
[junit4:junit4]   2> 3061 T1063 oass.SolrDispatchFilter.init SolrDispatchFilter.init()
[junit4:junit4]   2> 3062 T1063 oasc.SolrResourceLoader.locateSolrHome JNDI not configured for solr (NoInitialContextEx)
[junit4:junit4]   2> 3063 T1063 oasc.SolrResourceLoader.locateSolrHome using system property solr.solr.home: /usr/home/hudson/hudson-slave/workspace/Lucene-Solr-Tests-4.x-java7/solr/build/solr-core/test/J0/./org.apache.solr.cloud.BasicDistributedZkTest-jetty1-1355959162515
[junit4:junit4]   2> 3063 T1063 oasc.CoreContainer$Initializer.initialize looking for solr.xml: /usr/home/hudson/hudson-slave/workspace/Lucene-Solr-Tests-4.x-java7/solr/build/solr-core/test/J0/./org.apache.solr.cloud.BasicDistributedZkTest-jetty1-1355959162515/solr.xml
[junit4:junit4]   2> 3064 T1063 oasc.CoreContainer.<init> New CoreContainer 2136457289
[junit4:junit4]   2> 3065 T1063 oasc.CoreContainer.load Loading CoreContainer using Solr Home: '/usr/home/hudson/hudson-slave/workspace/Lucene-Solr-Tests-4.x-java7/solr/build/solr-core/test/J0/./org.apache.solr.cloud.BasicDistributedZkTest-jetty1-1355959162515/'
[junit4:junit4]   2> 3065 T1063 oasc.SolrResourceLoader.<init> new SolrResourceLoader for directory: '/usr/home/hudson/hudson-slave/workspace/Lucene-Solr-Tests-4.x-java7/solr/build/solr-core/test/J0/./org.apache.solr.cloud.BasicDistributedZkTest-jetty1-1355959162515/'
[junit4:junit4]   2> 3098 T1063 oashc.HttpShardHandlerFactory.getParameter Setting socketTimeout to: 30000
[junit4:junit4]   2> 3099 T1063 oashc.HttpShardHandlerFactory.getParameter Setting urlScheme to: http://
[junit4:junit4]   2> 3100 T1063 oashc.HttpShardHandlerFactory.getParameter Setting connTimeout to: 15000
[junit4:junit4]   2> 3101 T1063 oashc.HttpShardHandlerFactory.getParameter Setting maxConnectionsPerHost to: 20
[junit4:junit4]   2> 3101 T1063 oashc.HttpShardHandlerFactory.getParameter Setting corePoolSize to: 0
[junit4:junit4]   2> 3102 T1063 oashc.HttpShardHandlerFactory.getParameter Setting maximumPoolSize to: 2147483647
[junit4:junit4]   2> 3103 T1063 oashc.HttpShardHandlerFactory.getParameter Setting maxThreadIdleTime to: 5
[junit4:junit4]   2> 3103 T1063 oashc.HttpShardHandlerFactory.getParameter Setting sizeOfQueue to: -1
[junit4:junit4]   2> 3104 T1063 oashc.HttpShardHandlerFactory.getParameter Setting fairnessPolicy to: false
[junit4:junit4]   2> 3105 T1063 oascsi.HttpClientUtil.createClient Creating new http client, config:maxConnectionsPerHost=20&maxConnections=10000&socketTimeout=30000&connTimeout=15000&retry=false
[junit4:junit4]   2> 3127 T1063 oasc.CoreContainer.load Registering Log Listener
[junit4:junit4]   2> 3147 T1063 oasc.CoreContainer.initZooKeeper Zookeeper client=127.0.0.1:22107/solr
[junit4:junit4]   2> 3148 T1063 oasc.ZkController.checkChrootPath zkHost includes chroot
[junit4:junit4]   2> 3149 T1063 oaz.ZooKeeper.<init> Initiating client connection, connectString=127.0.0.1:22107 sessionTimeout=60000 watcher=org.apache.solr.common.cloud.ConnectionManager@57d4357
[junit4:junit4]   2> 3150 T1063 oascc.ConnectionManager.waitForConnected Waiting for client to connect to ZooKeeper
[junit4:junit4]   2> 3150 T1101 oaz.ClientCnxn$SendThread.logStartConnect Opening socket connection to server localhost/127.0.0.1:22107. Will not attempt to authenticate using SASL (access denied ("javax.security.auth.AuthPermission" "getLoginConfiguration"))
[junit4:junit4]   2> 3151 T1101 oaz.ClientCnxn$SendThread.primeConnection Socket connection established to localhost/127.0.0.1:22107, initiating session
[junit4:junit4]   2> 3151 T1065 oazs.NIOServerCnxnFactory.run Accepted socket connection from /140.211.11.196:22116
[junit4:junit4]   2> 3152 T1065 oazs.ZooKeeperServer.processConnectRequest Client attempting to establish new session at /140.211.11.196:22116
[junit4:junit4]   2> 3154 T1067 oazs.ZooKeeperServer.finishSessionInit Established session 0x13bb576cb8b0005 with negotiated timeout 20000 for client /140.211.11.196:22116
[junit4:junit4]   2> 3154 T1101 oaz.ClientCnxn$SendThread.onConnected Session establishment complete on server localhost/127.0.0.1:22107, sessionid = 0x13bb576cb8b0005, negotiated timeout = 20000
[junit4:junit4]   2> 3154 T1102 oascc.ConnectionManager.process Watcher org.apache.solr.common.cloud.ConnectionManager@57d4357 name:ZooKeeperConnection Watcher:127.0.0.1:22107 got event WatchedEvent state:SyncConnected type:None path:null path:null type:None
[junit4:junit4]   2> 3155 T1063 oascc.ConnectionManager.waitForConnected Client is connected to ZooKeeper
[junit4:junit4]   2> 3156 T1068 oazs.PrepRequestProcessor.pRequest2Txn Processed session termination for sessionid: 0x13bb576cb8b0005
[junit4:junit4]   2> 3169 T1102 oaz.ClientCnxn$EventThread.run EventThread shut down
[junit4:junit4]   2> 3169 T1065 oazs.NIOServerCnxn.closeSock Closed socket connection for client /140.211.11.196:22116 which had sessionid 0x13bb576cb8b0005
[junit4:junit4]   2> 3169 T1063 oaz.ZooKeeper.close Session: 0x13bb576cb8b0005 closed
[junit4:junit4]   2> 3170 T1063 oascsi.HttpClientUtil.createClient Creating new http client, config:maxConnections=500&maxConnectionsPerHost=16&socketTimeout=15000&connTimeout=30000
[junit4:junit4]   2> 3181 T1063 oaz.ZooKeeper.<init> Initiating client connection, connectString=127.0.0.1:22107/solr sessionTimeout=30000 watcher=org.apache.solr.common.cloud.ConnectionManager@7519612d
[junit4:junit4]   2> 3183 T1103 oaz.ClientCnxn$SendThread.logStartConnect Opening socket connection to server localhost/127.0.0.1:22107. Will not attempt to authenticate using SASL (access denied ("javax.security.auth.AuthPermission" "getLoginConfiguration"))
[junit4:junit4]   2> 3183 T1063 oascc.ConnectionManager.waitForConnected Waiting for client to connect to ZooKeeper
[junit4:junit4]   2> 3184 T1103 oaz.ClientCnxn$SendThread.primeConnection Socket connection established to localhost/127.0.0.1:22107, initiating session
[junit4:junit4]   2> 3184 T1065 oazs.NIOServerCnxnFactory.run Accepted socket connection from /140.211.11.196:22117
[junit4:junit4]   2> 3184 T1065 oazs.ZooKeeperServer.processConnectRequest Client attempting to establish new session at /140.211.11.196:22117
[junit4:junit4]   2> 3186 T1067 oazs.ZooKeeperServer.finishSessionInit Established session 0x13bb576cb8b0006 with negotiated timeout 20000 for client /140.211.11.196:22117
[junit4:junit4]   2> 3186 T1103 oaz.ClientCnxn$SendThread.onConnected Session establishment complete on server localhost/127.0.0.1:22107, sessionid = 0x13bb576cb8b0006, negotiated timeout = 20000
[junit4:junit4]   2> 3186 T1104 oascc.ConnectionManager.process Watcher org.apache.solr.common.cloud.ConnectionManager@7519612d name:ZooKeeperConnection Watcher:127.0.0.1:22107/solr got event WatchedEvent state:SyncConnected type:None path:null path:null type:None
[junit4:junit4]   2> 3186 T1063 oascc.ConnectionManager.waitForConnected Client is connected to ZooKeeper
[junit4:junit4]   2> 3188 T1068 oazs.PrepRequestProcessor.pRequest Got user-level KeeperException when processing sessionid:0x13bb576cb8b0006 type:create cxid:0x1 zxid:0x49 txntype:-1 reqpath:n/a Error Path:/solr/overseer Error:KeeperErrorCode = NodeExists for /solr/overseer
[junit4:junit4]   2> 3189 T1068 oazs.PrepRequestProcessor.pRequest Got user-level KeeperException when processing sessionid:0x13bb576cb8b0006 type:create cxid:0x2 zxid:0x4a txntype:-1 reqpath:n/a Error Path:/solr/overseer Error:KeeperErrorCode = NodeExists for /solr/overseer
[junit4:junit4]   2> 3198 T1063 oasc.ZkController.createEphemeralLiveNode Register node as live in ZooKeeper:/live_nodes/127.0.0.1:22115_waso%2Fs
[junit4:junit4]   2> 3199 T1068 oazs.PrepRequestProcessor.pRequest Got user-level KeeperException when processing sessionid:0x13bb576cb8b0006 type:delete cxid:0x4 zxid:0x4b txntype:-1 reqpath:n/a Error Path:/solr/live_nodes/127.0.0.1:22115_waso%2Fs Error:KeeperErrorCode = NoNode for /solr/live_nodes/127.0.0.1:22115_waso%2Fs
[junit4:junit4]   2> 3200 T1063 oascc.SolrZkClient.makePath makePath: /live_nodes/127.0.0.1:22115_waso%2Fs
[junit4:junit4]   2> 3203 T1085 oascc.ZkStateReader$3.process Updating live nodes... (2)
[junit4:junit4]   2> 3204 T1091 oascc.ZkStateReader$3.process Updating live nodes... (2)
[junit4:junit4]   2> 3204 T1085 oascc.ZkStateReader$2.process A cluster state change: WatchedEvent state:SyncConnected type:NodeChildrenChanged path:/live_nodes, has occurred - updating... (live nodes size: 2)
[junit4:junit4]   2> 3212 T1063 oascc.ZkStateReader.createClusterStateWatchersAndUpdate Updating cluster state from ZooKeeper... 
[junit4:junit4]   2> 3220 T1105 oasc.CoreContainer.create Creating SolrCore 'collection1' using instanceDir: /usr/home/hudson/hudson-slave/workspace/Lucene-Solr-Tests-4.x-java7/solr/build/solr-core/test/J0/./org.apache.solr.cloud.BasicDistributedZkTest-jetty1-1355959162515/collection1
[junit4:junit4]   2> 3220 T1105 oasc.ZkController.createCollectionZkNode Check for collection zkNode:collection1
[junit4:junit4]   2> 3221 T1105 oasc.ZkController.createCollectionZkNode Collection zkNode exists
[junit4:junit4]   2> 3221 T1105 oasc.ZkController.readConfigName Load collection config from:/collections/collection1
[junit4:junit4]   2> 3223 T1105 oasc.SolrResourceLoader.<init> new SolrResourceLoader for directory: '/usr/home/hudson/hudson-slave/workspace/Lucene-Solr-Tests-4.x-java7/solr/build/solr-core/test/J0/./org.apache.solr.cloud.BasicDistributedZkTest-jetty1-1355959162515/collection1/'
[junit4:junit4]   2> 3224 T1105 oasc.SolrResourceLoader.replaceClassLoader Adding 'file:/usr/home/hudson/hudson-slave/workspace/Lucene-Solr-Tests-4.x-java7/solr/build/solr-core/test/J0/org.apache.solr.cloud.BasicDistributedZkTest-jetty1-1355959162515/collection1/lib/README' to classloader
[junit4:junit4]   2> 3225 T1105 oasc.SolrResourceLoader.replaceClassLoader Adding 'file:/usr/home/hudson/hudson-slave/workspace/Lucene-Solr-Tests-4.x-java7/solr/build/solr-core/test/J0/org.apache.solr.cloud.BasicDistributedZkTest-jetty1-1355959162515/collection1/lib/classes/' to classloader
[junit4:junit4]   2> 3283 T1105 oasc.SolrConfig.<init> Using Lucene MatchVersion: LUCENE_41
[junit4:junit4]   2> 3285 T1086 oascc.ZkStateReader.updateClusterState Updating cloud state from ZooKeeper... 
[junit4:junit4]   2> 3286 T1086 oasc.Overseer$ClusterStateUpdater.updateState Update state numShards=1 message={
[junit4:junit4]   2> 	  "operation":"state",
[junit4:junit4]   2> 	  "numShards":"1",
[junit4:junit4]   2> 	  "shard":"shard1",
[junit4:junit4]   2> 	  "roles":null,
[junit4:junit4]   2> 	  "state":"active",
[junit4:junit4]   2> 	  "core":"collection1",
[junit4:junit4]   2> 	  "collection":"control_collection",
[junit4:junit4]   2> 	  "node_name":"127.0.0.1:22110_waso%2Fs",
[junit4:junit4]   2> 	  "base_url":"http://127.0.0.1:22110/waso/s"}
[junit4:junit4]   2> 3300 T1104 oascc.ZkStateReader$2.process A cluster state change: WatchedEvent state:SyncConnected type:NodeDataChanged path:/clusterstate.json, has occurred - updating... (live nodes size: 2)
[junit4:junit4]   2> 3300 T1085 oascc.ZkStateReader$2.process A cluster state change: WatchedEvent state:SyncConnected type:NodeDataChanged path:/clusterstate.json, has occurred - updating... (live nodes size: 2)
[junit4:junit4]   2> 3300 T1091 oascc.ZkStateReader$2.process A cluster state change: WatchedEvent state:SyncConnected type:NodeDataChanged path:/clusterstate.json, has occurred - updating... (live nodes size: 2)
[junit4:junit4]   2> 3360 T1105 oasc.SolrConfig.<init> Loaded SolrConfig: solrconfig.xml
[junit4:junit4]   2> 3461 T1105 oass.IndexSchema.readSchema Reading Solr Schema
[junit4:junit4]   2> 3468 T1105 oass.IndexSchema.readSchema Schema name=test
[junit4:junit4]   2> 4148 T1105 oass.OpenExchangeRatesOrgProvider.init Initialized with rates=open-exchange-rates.json, refreshInterval=1440.
[junit4:junit4]   2> 4156 T1105 oass.IndexSchema.readSchema default search field in schema is text
[junit4:junit4]   2> 4159 T1105 oass.IndexSchema.readSchema unique key field: id
[junit4:junit4]   2> 4170 T1105 oass.FileExchangeRateProvider.reload Reloading exchange rates from file currency.xml
[junit4:junit4]   2> 4174 T1105 oass.FileExchangeRateProvider.reload Reloading exchange rates from file currency.xml
[junit4:junit4]   2> 4177 T1105 oass.OpenExchangeRatesOrgProvider.reload Reloading exchange rates from open-exchange-rates.json
[junit4:junit4]   2> 4178 T1105 oass.OpenExchangeRatesOrgProvider.reload Reloading exchange rates from open-exchange-rates.json
[junit4:junit4]   2> 4179 T1105 oasc.SolrCore.<init> [collection1] Opening new SolrCore at /usr/home/hudson/hudson-slave/workspace/Lucene-Solr-Tests-4.x-java7/solr/build/solr-core/test/J0/./org.apache.solr.cloud.BasicDistributedZkTest-jetty1-1355959162515/collection1/, dataDir=./org.apache.solr.cloud.BasicDistributedZkTest-1355959159685/jetty1/
[junit4:junit4]   2> 4179 T1105 oasc.JmxMonitoredMap.<init> JMX monitoring is enabled. Adding Solr mbeans to JMX Server: com.sun.jmx.mbeanserver.JmxMBeanServer@4139a82d
[junit4:junit4]   2> 4180 T1105 oasc.SolrCore.initDirectoryFactory solr.NRTCachingDirectoryFactory
[junit4:junit4]   2> 4180 T1105 oasc.CachingDirectoryFactory.get return new directory for /usr/home/hudson/hudson-slave/workspace/Lucene-Solr-Tests-4.x-java7/solr/build/solr-core/test/J0/./org.apache.solr.cloud.BasicDistributedZkTest-1355959159685/jetty1 forceNew:false
[junit4:junit4]   2> 4181 T1105 oasc.CachingDirectoryFactory.close Releasing directory:/usr/home/hudson/hudson-slave/workspace/Lucene-Solr-Tests-4.x-java7/solr/build/solr-core/test/J0/./org.apache.solr.cloud.BasicDistributedZkTest-1355959159685/jetty1
[junit4:junit4]   2> 4181 T1105 oasc.SolrCore.getNewIndexDir New index directory detected: old=null new=./org.apache.solr.cloud.BasicDistributedZkTest-1355959159685/jetty1/index/
[junit4:junit4]   2> 4182 T1105 oasc.SolrCore.initIndex WARNING [collection1] Solr index directory './org.apache.solr.cloud.BasicDistributedZkTest-1355959159685/jetty1/index' doesn't exist. Creating new index...
[junit4:junit4]   2> 4183 T1105 oasc.CachingDirectoryFactory.get return new directory for /usr/home/hudson/hudson-slave/workspace/Lucene-Solr-Tests-4.x-java7/solr/build/solr-core/test/J0/./org.apache.solr.cloud.BasicDistributedZkTest-1355959159685/jetty1/index forceNew:false
[junit4:junit4]   2> 4214 T1105 oasc.SolrDeletionPolicy.onCommit SolrDeletionPolicy.onCommit: commits:num=1
[junit4:junit4]   2> 		commit{dir=RateLimitedDirectoryWrapper(NRTCachingDirectory(org.apache.lucene.store.NIOFSDirectory@/usr/home/hudson/hudson-slave/workspace/Lucene-Solr-Tests-4.x-java7/solr/build/solr-core/test/J0/org.apache.solr.cloud.BasicDistributedZkTest-1355959159685/jetty1/index lockFactory=org.apache.lucene.store.NativeFSLockFactory@a405ea4; maxCacheMB=48.0 maxMergeSizeMB=4.0)),segFN=segments_1,generation=1,filenames=[segments_1]
[junit4:junit4]   2> 4215 T1105 oasc.SolrDeletionPolicy.updateCommits newest commit = 1[segments_1]
[junit4:junit4]   2> 4215 T1105 oasc.CachingDirectoryFactory.close Releasing directory:/usr/home/hudson/hudson-slave/workspace/Lucene-Solr-Tests-4.x-java7/solr/build/solr-core/test/J0/./org.apache.solr.cloud.BasicDistributedZkTest-1355959159685/jetty1/index
[junit4:junit4]   2> 4216 T1105 oasc.SolrCore.initWriters created xml: solr.XMLResponseWriter
[junit4:junit4]   2> 4217 T1105 oasup.UpdateRequestProcessorChain.init inserting DistributedUpdateProcessorFactory into updateRequestProcessorChain "dedupe"
[junit4:junit4]   2> 4217 T1105 oasup.UpdateRequestProcessorChain.init inserting DistributedUpdateProcessorFactory into updateRequestProcessorChain "dedupe-allfields"
[junit4:junit4]   2> 4218 T1105 oasup.UpdateRequestProcessorChain.init inserting DistributedUpdateProcessorFactory into updateRequestProcessorChain "stored_sig"
[junit4:junit4]   2> 4218 T1105 oasup.UpdateRequestProcessorChain.init inserting DistributedUpdateProcessorFactory into updateRequestProcessorChain "uniq-fields"
[junit4:junit4]   2> 4218 T1105 oasup.UpdateRequestProcessorChain.init inserting DistributedUpdateProcessorFactory into updateRequestProcessorChain "distrib-dup-test-chain-implicit"
[junit4:junit4]   2> 4219 T1105 oasc.RequestHandlers.initHandlersFromConfig adding lazy requestHandler: solr.ReplicationHandler
[junit4:junit4]   2> 4219 T1105 oasc.RequestHandlers.initHandlersFromConfig created /replication: solr.ReplicationHandler
[junit4:junit4]   2> 4220 T1105 oasc.RequestHandlers.initHandlersFromConfig created standard: solr.StandardRequestHandler
[junit4:junit4]   2> 4220 T1105 oasc.RequestHandlers.initHandlersFromConfig created /get: solr.RealTimeGetHandler
[junit4:junit4]   2> 4221 T1105 oasc.RequestHandlers.initHandlersFromConfig created dismax: solr.SearchHandler
[junit4:junit4]   2> 4222 T1105 oasc.RequestHandlers.initHandlersFromConfig created mock: org.apache.solr.core.MockQuerySenderListenerReqHandler
[junit4:junit4]   2> 4222 T1105 oasc.RequestHandlers.initHandlersFromConfig created /admin/: org.apache.solr.handler.admin.AdminHandlers
[junit4:junit4]   2> 4223 T1105 oasc.RequestHandlers.initHandlersFromConfig created defaults: solr.StandardRequestHandler
[junit4:junit4]   2> 4223 T1105 oasc.RequestHandlers.initHandlersFromConfig adding lazy requestHandler: solr.StandardRequestHandler
[junit4:junit4]   2> 4223 T1105 oasc.RequestHandlers.initHandlersFromConfig created lazy: solr.StandardRequestHandler
[junit4:junit4]   2> 4224 T1105 oasc.RequestHandlers.initHandlersFromConfig created /update: solr.UpdateRequestHandler
[junit4:junit4]   2> 4224 T1105 oasc.RequestHandlers.initHandlersFromConfig created /terms: org.apache.solr.handler.component.SearchHandler
[junit4:junit4]   2> 4225 T1105 oasc.RequestHandlers.initHandlersFromConfig created spellCheckCompRH: org.apache.solr.handler.component.SearchHandler
[junit4:junit4]   2> 4226 T1105 oasc.RequestHandlers.initHandlersFromConfig created spellCheckCompRH_Direct: org.apache.solr.handler.component.SearchHandler
[junit4:junit4]   2> 4226 T1105 oasc.RequestHandlers.initHandlersFromConfig created spellCheckWithWordbreak: org.apache.solr.handler.component.SearchHandler
[junit4:junit4]   2> 4227 T1105 oasc.RequestHandlers.initHandlersFromConfig created spellCheckWithWordbreak_Direct: org.apache.solr.handler.component.SearchHandler
[junit4:junit4]   2> 4227 T1105 oasc.RequestHandlers.initHandlersFromConfig created spellCheckCompRH1: org.apache.solr.handler.component.SearchHandler
[junit4:junit4]   2> 4228 T1105 oasc.RequestHandlers.initHandlersFromConfig created mltrh: org.apache.solr.handler.component.SearchHandler
[junit4:junit4]   2> 4229 T1105 oasc.RequestHandlers.initHandlersFromConfig created tvrh: org.apache.solr.handler.component.SearchHandler
[junit4:junit4]   2> 4229 T1105 oasc.RequestHandlers.initHandlersFromConfig created /mlt: solr.MoreLikeThisHandler
[junit4:junit4]   2> 4230 T1105 oasc.RequestHandlers.initHandlersFromConfig created /debug/dump: solr.DumpRequestHandler
[junit4:junit4]   2> 4240 T1105 oashl.XMLLoader.init xsltCacheLifetimeSeconds=60
[junit4:junit4]   2> 4243 T1105 oasc.SolrCore.initDeprecatedSupport WARNING solrconfig.xml uses deprecated <admin/gettableFiles>, Please update your config to use the ShowFileRequestHandler.
[junit4:junit4]   2> 4245 T1105 oasc.SolrCore.initDeprecatedSupport WARNING adding ShowFileRequestHandler with hidden files: [SCHEMA.XML, OLD_SYNONYMS.TXT, STOPWORDS.TXT, PROTWORDS.TXT, OPEN-EXCHANGE-RATES.JSON, SYNONYMS.TXT, CURRENCY.XML, MAPPING-ISOLATIN1ACCENT.TXT]
[junit4:junit4]   2> 4247 T1105 oasc.CachingDirectoryFactory.close Releasing directory:/usr/home/hudson/hudson-slave/workspace/Lucene-Solr-Tests-4.x-java7/solr/build/solr-core/test/J0/./org.apache.solr.cloud.BasicDistributedZkTest-1355959159685/jetty1
[junit4:junit4]   2> 4248 T1105 oass.SolrIndexSearcher.<init> Opening Searcher@19bd8c1d main
[junit4:junit4]   2> 4249 T1105 oasu.CommitTracker.<init> Hard AutoCommit: disabled
[junit4:junit4]   2> 4249 T1105 oasu.CommitTracker.<init> Soft AutoCommit: disabled
[junit4:junit4]   2> 4250 T1105 oashc.SpellCheckComponent.inform Initializing spell checkers
[junit4:junit4]   2> 4256 T1105 oass.DirectSolrSpellChecker.init init: {name=direct,classname=DirectSolrSpellChecker,field=lowerfilt,minQueryLength=3}
[junit4:junit4]   2> 4305 T1106 oasc.SolrCore.registerSearcher [collection1] Registered new searcher Searcher@19bd8c1d main{StandardDirectoryReader(segments_1:1)}
[junit4:junit4]   2> 4308 T1105 oasc.ZkController.publish publishing core=collection1 state=down
[junit4:junit4]   2> 4308 T1105 oasc.ZkController.publish numShards not found on descriptor - reading it from system property
[junit4:junit4]   2> 4809 T1086 oascc.ZkStateReader.updateClusterState Updating cloud state from ZooKeeper... 
[junit4:junit4]   2> 4810 T1086 oasc.Overseer$ClusterStateUpdater.updateState Update state numShards=2 message={
[junit4:junit4]   2> 	  "operation":"state",
[junit4:junit4]   2> 	  "numShards":"2",
[junit4:junit4]   2> 	  "shard":null,
[junit4:junit4]   2> 	  "roles":null,
[junit4:junit4]   2> 	  "state":"down",
[junit4:junit4]   2> 	  "core":"collection1",
[junit4:junit4]   2> 	  "collection":"collection1",
[junit4:junit4]   2> 	  "node_name":"127.0.0.1:22115_waso%2Fs",
[junit4:junit4]   2> 	  "base_url":"http://127.0.0.1:22115/waso/s"}
[junit4:junit4]   2> 4810 T1086 oasc.Overseer$ClusterStateUpdater.createCollection Create collection collection1 with numShards 2
[junit4:junit4]   2> 4810 T1086 oasc.Overseer$ClusterStateUpdater.updateState Assigning new node to shard shard=shard1
[junit4:junit4]   2> 4828 T1091 oascc.ZkStateReader$2.process A cluster state change: WatchedEvent state:SyncConnected type:NodeDataChanged path:/clusterstate.json, has occurred - updating... (live nodes size: 2)
[junit4:junit4]   2> 4828 T1104 oascc.ZkStateReader$2.process A cluster state change: WatchedEvent state:SyncConnected type:NodeDataChanged path:/clusterstate.json, has occurred - updating... (live nodes size: 2)
[junit4:junit4]   2> 4828 T1085 oascc.ZkStateReader$2.process A cluster state change: WatchedEvent state:SyncConnected type:NodeDataChanged path:/clusterstate.json, has occurred - updating... (live nodes size: 2)
[junit4:junit4]   2> 5311 T1105 oasc.CoreContainer.registerCore registering core: collection1
[junit4:junit4]   2> 5311 T1105 oasc.ZkController.register Register replica - core:collection1 address:http://127.0.0.1:22115/waso/s collection:collection1 shard:shard1
[junit4:junit4]   2> 5312 T1105 oascc.SolrZkClient.makePath makePath: /collections/collection1/leader_elect/shard1/election
[junit4:junit4]   2> 5329 T1068 oazs.PrepRequestProcessor.pRequest Got user-level KeeperException when processing sessionid:0x13bb576cb8b0006 type:delete cxid:0x45 zxid:0x5b txntype:-1 reqpath:n/a Error Path:/solr/collections/collection1/leaders Error:KeeperErrorCode = NoNode for /solr/collections/collection1/leaders
[junit4:junit4]   2> 5330 T1105 oasc.ShardLeaderElectionContext.runLeaderProcess Running the leader process.
[junit4:junit4]   2> 5330 T1068 oazs.PrepRequestProcessor.pRequest Got user-level KeeperException when processing sessionid:0x13bb576cb8b0006 type:create cxid:0x46 zxid:0x5c txntype:-1 reqpath:n/a Error Path:/solr/overseer Error:KeeperErrorCode = NodeExists for /solr/overseer
[junit4:junit4]   2> 5340 T1105 oasc.ShardLeaderElectionContext.waitForReplicasToComeUp Enough replicas found to continue.
[junit4:junit4]   2> 5340 T1105 oasc.ShardLeaderElectionContext.runLeaderProcess I may be the new leader - try and sync
[junit4:junit4]   2> 5341 T1105 oasc.SyncStrategy.sync Sync replicas to http://127.0.0.1:22115/waso/s/collection1/
[junit4:junit4]   2> 5341 T1105 oasc.SyncStrategy.syncReplicas Sync Success - now sync replicas to me
[junit4:junit4]   2> 5341 T1105 oasc.SyncStrategy.syncToMe http://127.0.0.1:22115/waso/s/collection1/ has no replicas
[junit4:junit4]   2> 5342 T1105 oasc.ShardLeaderElectionContext.runLeaderProcess I am the new leader: http://127.0.0.1:22115/waso/s/collection1/
[junit4:junit4]   2> 5342 T1105 oascc.SolrZkClient.makePath makePath: /collections/collection1/leaders/shard1
[junit4:junit4]   2> 5343 T1086 oascc.ZkStateReader.updateClusterState Updating cloud state from ZooKeeper... 
[junit4:junit4]   2> 5356 T1068 oazs.PrepRequestProcessor.pRequest Got user-level KeeperException when processing sessionid:0x13bb576cb8b0006 type:create cxid:0x50 zxid:0x63 txntype:-1 reqpath:n/a Error Path:/solr/overseer Error:KeeperErrorCode = NodeExists for /solr/overseer
[junit4:junit4]   2> 5356 T1091 oascc.ZkStateReader$2.process A cluster state change: WatchedEvent state:SyncConnected type:NodeDataChanged path:/clusterstate.json, has occurred - updating... (live nodes size: 2)
[junit4:junit4]   2> 5356 T1104 oascc.ZkStateReader$2.process A cluster state change: WatchedEvent state:SyncConnected type:NodeDataChanged path:/clusterstate.json, has occurred - updating... (live nodes size: 2)
[junit4:junit4]   2> 5356 T1085 oascc.ZkStateReader$2.process A cluster state change: WatchedEvent state:SyncConnected type:NodeDataChanged path:/clusterstate.json, has occurred - updating... (live nodes size: 2)
[junit4:junit4]   2> 5870 T1086 oascc.ZkStateReader.updateClusterState Updating cloud state from ZooKeeper... 
[junit4:junit4]   2> 5886 T1104 oascc.ZkStateReader$2.process A cluster state change: WatchedEvent state:SyncConnected type:NodeDataChanged path:/clusterstate.json, has occurred - updating... (live nodes size: 2)
[junit4:junit4]   2> 5886 T1085 oascc.ZkStateReader$2.process A cluster state change: WatchedEvent state:SyncConnected type:NodeDataChanged path:/clusterstate.json, has occurred - updating... (live nodes size: 2)
[junit4:junit4]   2> 5886 T1091 oascc.ZkStateReader$2.process A cluster state change: WatchedEvent state:SyncConnected type:NodeDataChanged path:/clusterstate.json, has occurred - updating... (live nodes size: 2)
[junit4:junit4]   2> 5929 T1105 oasc.ZkController.register We are http://127.0.0.1:22115/waso/s/collection1/ and leader is http://127.0.0.1:22115/waso/s/collection1/
[junit4:junit4]   2> 5929 T1105 oasc.ZkController.register No LogReplay needed for core=collection1 baseURL=http://127.0.0.1:22115/waso/s
[junit4:junit4]   2> 5929 T1105 oasc.ZkController.checkRecovery I am the leader, no recovery necessary
[junit4:junit4]   2> 5930 T1105 oasc.ZkController.publish publishing core=collection1 state=active
[junit4:junit4]   2> 5930 T1105 oasc.ZkController.publish numShards not found on descriptor - reading it from system property
[junit4:junit4]   2> 5932 T1105 oascc.ZkStateReader.updateClusterState Updating cloud state from ZooKeeper... 
[junit4:junit4]   2> 5933 T1063 oass.SolrDispatchFilter.init user.dir=/usr/home/hudson/hudson-slave/workspace/Lucene-Solr-Tests-4.x-java7/solr/build/solr-core/test/J0
[junit4:junit4]   2> 5934 T1063 oass.SolrDispatchFilter.init SolrDispatchFilter.init() done
[junit4:junit4]   2> 5934 T1063 oascsi.HttpClientUtil.createClient Creating new http client, config:maxConnections=128&maxConnectionsPerHost=32&followRedirects=false
[junit4:junit4]   2> 6132 T1063 oejs.Server.doStart jetty-8.1.8.v20121106
[junit4:junit4]   2> 6136 T1063 oejs.AbstractConnector.doStart Started SocketConnector@127.0.0.1:22118
[junit4:junit4]   2> 6137 T1063 oasc.SolrResourceLoader.locateSolrHome JNDI not configured for solr (NoInitialContextEx)
[junit4:junit4]   2> 6138 T1063 oasc.SolrResourceLoader.locateSolrHome using system property solr.solr.home: /usr/home/hudson/hudson-slave/workspace/Lucene-Solr-Tests-4.x-java7/solr/build/solr-core/test/J0/./org.apache.solr.cloud.BasicDistributedZkTest-jetty2-1355959165627
[junit4:junit4]   2> 6139 T1063 oasc.SolrResourceLoader.<init> new SolrResourceLoader for deduced Solr Home: '/usr/home/hudson/hudson-slave/workspace/Lucene-Solr-Tests-4.x-java7/solr/build/solr-core/test/J0/./org.apache.solr.cloud.BasicDistributedZkTest-jetty2-1355959165627/'
[junit4:junit4]   2> 6189 T1063 oass.SolrDispatchFilter.init SolrDispatchFilter.init()
[junit4:junit4]   2> 6190 T1063 oasc.SolrResourceLoader.locateSolrHome JNDI not configured for solr (NoInitialContextEx)
[junit4:junit4]   2> 6191 T1063 oasc.SolrResourceLoader.locateSolrHome using system property solr.solr.home: /usr/home/hudson/hudson-slave/workspace/Lucene-Solr-Tests-4.x-java7/solr/build/solr-core/test/J0/./org.apache.solr.cloud.BasicDistributedZkTest-jetty2-1355959165627
[junit4:junit4]   2> 6192 T1063 oasc.CoreContainer$Initializer.initialize looking for solr.xml: /usr/home/hudson/hudson-slave/workspace/Lucene-Solr-Tests-4.x-java7/solr/build/solr-core/test/J0/./org.apache.solr.cloud.BasicDistributedZkTest-jetty2-1355959165627/solr.xml
[junit4:junit4]   2> 6192 T1063 oasc.CoreContainer.<init> New CoreContainer 828682119
[junit4:junit4]   2> 6193 T1063 oasc.CoreContainer.load Loading CoreContainer using Solr Home: '/usr/home/hudson/hudson-slave/workspace/Lucene-Solr-Tests-4.x-java7/solr/build/solr-core/test/J0/./org.apache.solr.cloud.BasicDistributedZkTest-jetty2-1355959165627/'
[junit4:junit4]   2> 6194 T1063 oasc.SolrResourceLoader.<init> new SolrResourceLoader for directory: '/usr/home/hudson/hudson-slave/workspace/Lucene-Solr-Tests-4.x-java7/solr/build/solr-core/test/J0/./org.apache.solr.cloud.BasicDistributedZkTest-jetty2-1355959165627/'
[junit4:junit4]   2> 6228 T1063 oashc.HttpShardHandlerFactory.getParameter Setting socketTimeout to: 30000
[junit4:junit4]   2> 6229 T1063 oashc.HttpShardHandlerFactory.getParameter Setting urlScheme to: http://
[junit4:junit4]   2> 6230 T1063 oashc.HttpShardHandlerFactory.getParameter Setting connTimeout to: 15000
[junit4:junit4]   2> 6230 T1063 oashc.HttpShardHandlerFactory.getParameter Setting maxConnectionsPerHost to: 20
[junit4:junit4]   2> 6231 T1063 oashc.HttpShardHandlerFactory.getParameter Setting corePoolSize to: 0
[junit4:junit4]   2> 6231 T1063 oashc.HttpShardHandlerFactory.getParameter Setting maximumPoolSize to: 2147483647
[junit4:junit4]   2> 6232 T1063 oashc.HttpShardHandlerFactory.getParameter Setting maxThreadIdleTime to: 5
[junit4:junit4]   2> 6233 T1063 oashc.HttpShardHandlerFactory.getParameter Setting sizeOfQueue to: -1
[junit4:junit4]   2> 6233 T1063 oashc.HttpShardHandlerFactory.getParameter Setting fairnessPolicy to: false
[junit4:junit4]   2> 6234 T1063 oascsi.HttpClientUtil.createClient Creating new http client, config:maxConnectionsPerHost=20&maxConnections=10000&socketTimeout=30000&connTimeout=15000&retry=false
[junit4:junit4]   2> 6255 T1063 oasc.CoreContainer.load Registering Log Listener
[junit4:junit4]   2> 6281 T1063 oasc.CoreContainer.initZooKeeper Zookeeper client=127.0.0.1:22107/solr
[junit4:junit4]   2> 6282 T1063 oasc.ZkController.checkChrootPath zkHost includes chroot
[junit4:junit4]   2> 6283 T1063 oaz.ZooKeeper.<init> Initiating client connection, connectString=127.0.0.1:22107 sessionTimeout=60000 watcher=org.apache.solr.common.cloud.ConnectionManager@2186464c
[junit4:junit4]   2> 6284 T1063 oascc.ConnectionManager.waitForConnected Waiting for client to connect to ZooKeeper
[junit4:junit4]   2> 6284 T1116 oaz.ClientCnxn$SendThread.logStartConnect Opening socket connection to server localhost/127.0.0.1:22107. Will not attempt to authenticate using SASL (access denied ("javax.security.auth.AuthPermission" "getLoginConfiguration"))
[junit4:junit4]   2> 6286 T1116 oaz.ClientCnxn$SendThread.primeConnection Socket connection established to localhost/127.0.0.1:22107, initiating session
[junit4:junit4]   2> 6286 T1065 oazs.NIOServerCnxnFactory.run Accepted socket connection from /140.211.11.196:22119
[junit4:junit4]   2> 6287 T1065 oazs.ZooKeeperServer.processConnectRequest Client attempting to establish new session at /140.211.11.196:22119
[junit4:junit4]   2> 6289 T1067 oazs.ZooKeeperServer.finishSessionInit Established session 0x13bb576cb8b0007 with negotiated timeout 20000 for client /140.211.11.196:22119
[junit4:junit4]   2> 6289 T1116 oaz.ClientCnxn$SendThread.onConnected Session establishment complete on server localhost/127.0.0.1:22107, sessionid = 0x13bb576cb8b0007, negotiated timeout = 20000
[junit4:junit4]   2> 6289 T1117 oascc.ConnectionManager.process Watcher org.apache.solr.common.cloud.ConnectionManager@2186464c name:ZooKeeperConnection Watcher:127.0.0.1:22107 got event WatchedEvent state:SyncConnected type:None path:null path:null type:None
[junit4:junit4]   2> 6289 T1063 oascc.ConnectionManager.waitForConnected Client is connected to ZooKeeper
[junit4:junit4]   2> 6291 T1068 oazs.PrepRequestProcessor.pRequest2Txn Processed session termination for sessionid: 0x13bb576cb8b0007
[junit4:junit4]   2> 6305 T1117 oaz.ClientCnxn$EventThread.run EventThread shut down
[junit4:junit4]   2> 6305 T1065 oazs.NIOServerCnxn.closeSock Closed socket connection for client /140.211.11.196:22119 which had sessionid 0x13bb576cb8b0007
[junit4:junit4]   2> 6305 T1063 oaz.ZooKeeper.close Session: 0x13bb576cb8b0007 closed
[junit4:junit4]   2> 6307 T1063 oascsi.HttpClientUtil.createClient Creating new http client, config:maxConnections=500&maxConnectionsPerHost=16&socketTimeout=15000&connTimeout=30000
[junit4:junit4]   2> 6317 T1063 oaz.ZooKeeper.<init> Initiating client connection, connectString=127.0.0.1:22107/solr sessionTimeout=30000 watcher=org.apache.solr.common.cloud.ConnectionManager@7fc43531
[junit4:junit4]   2> 6319 T1118 oaz.ClientCnxn$SendThread.logStartConnect Opening socket connection to server localhost/127.0.0.1:22107. Will not attempt to authenticate using SASL (access denied ("javax.security.auth.AuthPermission" "getLoginConfiguration"))
[junit4:junit4]   2> 6319 T1063 oascc.ConnectionManager.waitForConnected Waiting for client to connect to ZooKeeper
[junit4:junit4]   2> 6320 T1118 oaz.ClientCnxn$SendThread.primeConnection Socket connection established to localhost/127.0.0.1:22107, initiating session
[junit4:junit4]   2> 6320 T1065 oazs.NIOServerCnxnFactory.run Accepted socket connection from /140.211.11.196:22120
[junit4:junit4]   2> 6320 T1065 oazs.ZooKeeperServer.processConnectRequest Client attempting to establish new session at /140.211.11.196:22120
[junit4:junit4]   2> 6321 T1067 oazs.ZooKeeperServer.finishSessionInit Established session 0x13bb576cb8b0008 with negotiated timeout 20000 for client /140.211.11.196:22120
[junit4:junit4]   2> 6321 T1118 oaz.ClientCnxn$SendThread.onConnected Session establishment complete on server localhost/127.0.0.1:22107, sessionid = 0x13bb576cb8b0008, negotiated timeout = 20000
[junit4:junit4]   2> 6321 T1119 oascc.ConnectionManager.process Watcher org.apache.solr.common.cloud.ConnectionManager@7fc43531 name:ZooKeeperConnection Watcher:127.0.0.1:22107/solr got event WatchedEvent state:SyncConnected type:None path:null path:null type:None
[junit4:junit4]   2> 6322 T1063 oascc.ConnectionManager.waitForConnected Client is connected to ZooKeeper
[junit4:junit4]   2> 6323 T1068 oazs.PrepRequestProcessor.pRequest Got user-level KeeperException when processing sessionid:0x13bb576cb8b0008 type:create cxid:0x1 zxid:0x6e txntype:-1 reqpath:n/a Error Path:/solr/overseer Error:KeeperErrorCode = NodeExists for /solr/overseer
[junit4:junit4]   2> 6325 T1068 oazs.PrepRequestProcessor.pRequest Got user-level KeeperException when processing sessionid:0x13bb576cb8b0008 type:create cxid:0x2 zxid:0x6f txntype:-1 reqpath:n/a Error Path:/solr/overseer Error:KeeperErrorCode = NodeExists for /solr/overseer
[junit4:junit4]   2> 6332 T1063 oasc.ZkController.createEphemeralLiveNode Register node as live in ZooKeeper:/live_nodes/127.0.0.1:22118_waso%2Fs
[junit4:junit4]   2> 6334 T1068 oazs.PrepRequestProcessor.pRequest Got user-level KeeperException when processing sessionid:0x13bb576cb8b0008 type:delete cxid:0x4 zxid:0x70 txntype:-1 reqpath:n/a Error Path:/solr/live_nodes/127.0.0.1:22118_waso%2Fs Error:KeeperErrorCode = NoNode for /solr/live_nodes/127.0.0.1:22118_waso%2Fs
[junit4:junit4]   2> 6335 T1063 oascc.SolrZkClient.makePath makePath: /live_nodes/127.0.0.1:22118_waso%2Fs
[junit4:junit4]   2> 6337 T1091 oascc.ZkStateReader$3.process Updating live nodes... (3)
[junit4:junit4]   2> 6338 T1085 oascc.ZkStateReader$3.process Updating live nodes... (3)
[junit4:junit4]   2> 6338 T1104 oascc.ZkStateReader$3.process Updating live nodes... (3)
[junit4:junit4]   2> 6338 T1091 oascc.ZkStateReader$2.process A cluster state change: WatchedEvent state:SyncConnected type:NodeChildrenChanged path:/live_nodes, has occurred - updating... (live nodes size: 3)
[junit4:junit4]   2> 6338 T1085 oascc.ZkStateReader$2.process A cluster state change: WatchedEvent state:SyncConnected type:NodeChildrenChanged path:/live_nodes, has occurred - updating... (live nodes size: 3)
[junit4:junit4]   2> 6338 T1104 oascc.ZkStateReader$2.process A cluster state change: WatchedEvent state:SyncConnected type:NodeChildrenChanged path:/live_nodes, has occurred - updating... (live nodes size: 3)
[junit4:junit4]   2> 6347 T1063 oascc.ZkStateReader.createClusterStateWatchersAndUpdate Updating cluster state from ZooKeeper... 
[junit4:junit4]   2> 6359 T1120 oasc.CoreContainer.create Creating SolrCore 'collection1' using instanceDir: /usr/home/hudson/hudson-slave/workspace/Lucene-Solr-Tests-4.x-java7/solr/build/solr-core/test/J0/./org.apache.solr.cloud.BasicDistributedZkTest-jetty2-1355959165627/collection1
[junit4:junit4]   2> 6360 T1120 oasc.ZkController.createCollectionZkNode Check for collection zkNode:collection1
[junit4:junit4]   2> 6360 T1120 oasc.ZkController.createCollectionZkNode Collection zkNode exists
[junit4:junit4]   2> 6361 T1120 oasc.ZkController.readConfigName Load collection config from:/collections/collection1
[junit4:junit4]   2> 6362 T1120 oasc.SolrResourceLoader.<init> new SolrResourceLoader for directory: '/usr/home/hudson/hudson-slave/workspace/Lucene-Solr-Tests-4.x-java7/solr/build/solr-core/test/J0/./org.apache.solr.cloud.BasicDistributedZkTest-jetty2-1355959165627/collection1/'
[junit4:junit4]   2> 6363 T1120 oasc.SolrResourceLoader.replaceClassLoader Adding 'file:/usr/home/hudson/hudson-slave/workspace/Lucene-Solr-Tests-4.x-java7/solr/build/solr-core/test/J0/org.apache.solr.cloud.BasicDistributedZkTest-jetty2-1355959165627/collection1/lib/README' to classloader
[junit4:junit4]   2> 6363 T1120 oasc.SolrResourceLoader.replaceClassLoader Adding 'file:/usr/home/hudson/hudson-slave/workspace/Lucene-Solr-Tests-4.x-java7/solr/build/solr-core/test/J0/org.apache.solr.cloud.BasicDistributedZkTest-jetty2-1355959165627/collection1/lib/classes/' to classloader
[junit4:junit4]   2> 6390 T1086 oascc.ZkStateReader.updateClusterState Updating cloud state from ZooKeeper... 
[junit4:junit4]   2> 6391 T1086 oasc.Overseer$ClusterStateUpdater.updateState Update state numShards=2 message={
[junit4:junit4]   2> 	  "operation":"state",
[junit4:junit4]   2> 	  "numShards":"2",
[junit4:junit4]   2> 	  "shard":"shard1",
[junit4:junit4]   2> 	  "roles":null,
[junit4:junit4]   2> 	  "state":"active",
[junit4:junit4]   2> 	  "core":"collection1",
[junit4:junit4]   2> 	  "collection":"collection1",
[junit4:junit4]   2> 	  "node_name":"127.0.0.1:22115_waso%2Fs",
[junit4:junit4]   2> 	  "base_url":"http://127.0.0.1:22115/waso/s"}
[junit4:junit4]   2> 6396 T1085 oascc.ZkStateReader$2.process A cluster state change: WatchedEvent state:SyncConnected type:NodeDataChanged path:/clusterstate.json, has occurred - updating... (live nodes size: 3)
[junit4:junit4]   2> 6396 T1091 oascc.ZkStateReader$2.process A cluster state change: WatchedEvent state:SyncConnected type:NodeDataChanged path:/clusterstate.json, has occurred - updating... (live nodes size: 3)
[junit4:junit4]   2> 6396 T1104 oascc.ZkStateReader$2.process A cluster state change: WatchedEvent state:SyncConnected type:NodeDataChanged path:/clusterstate.json, has occurred - updating... (live nodes size: 3)
[junit4:junit4]   2> 6396 T1119 oascc.ZkStateReader$2.process A cluster state change: WatchedEvent state:SyncConnected type:NodeDataChanged path:/clusterstate.json, has occurred - updating... (live nodes size: 3)
[junit4:junit4]   2> 6405 T1120 oasc.SolrConfig.<init> Using Lucene MatchVersion: LUCENE_41
[junit4:junit4]   2> 6462 T1120 oasc.SolrConfig.<init> Loaded SolrConfig: solrconfig.xml
[junit4:junit4]   2> 6563 T1120 oass.IndexSchema.readSchema Reading Solr Schema
[junit4:junit4]   2> 6568 T1120 oass.IndexSchema.readSchema Schema name=test
[junit4:junit4]   2> 7042 T1120 oass.OpenExchangeRatesOrgProvider.init Initialized with rates=open-exchange-rates.json, refreshInterval=1440.
[junit4:junit4]   2> 7050 T1120 oass.IndexSchema.readSchema default search field in schema is text
[junit4:junit4]   2> 7053 T1120 oass.IndexSchema.readSchema unique key field: id
[junit4:junit4]   2> 7065 T1120 oass.FileExchangeRateProvider.reload Reloading exchange rates from file currency.xml
[junit4:junit4]   2> 7069 T1120 oass.FileExchangeRateProvider.reload Reloading exchange rates from file currency.xml
[junit4:junit4]   2> 7073 T1120 oass.OpenExchangeRatesOrgProvider.reload Reloading exchange rates from open-exchange-rates.json
[junit4:junit4]   2> 7074 T1120 oass.OpenExchangeRatesOrgProvider.reload Reloading exchange rates from open-exchange-rates.json
[junit4:junit4]   2> 7075 T1120 oasc.SolrCore.<init> [collection1] Opening new SolrCore at /usr/home/hudson/hudson-slave/workspace/Lucene-Solr-Tests-4.x-java7/solr/build/solr-core/test/J0/./org.apache.solr.cloud.BasicDistributedZkTest-jetty2-1355959165627/collection1/, dataDir=./org.apache.solr.cloud.BasicDistributedZkTest-1355959159685/jetty2/
[junit4:junit4]   2> 7075 T1120 oasc.JmxMonitoredMap.<init> JMX monitoring is enabled. Adding Solr mbeans to JMX Server: com.sun.jmx.mbeanserver.JmxMBeanServer@4139a82d
[junit4:junit4]   2> 7076 T1120 oasc.SolrCore.initDirectoryFactory solr.NRTCachingDirectoryFactory
[junit4:junit4]   2> 7077 T1120 oasc.CachingDirectoryFactory.get return new directory for /usr/home/hudson/hudson-slave/workspace/Lucene-Solr-Tests-4.x-java7/solr/build/solr-core/test/J0/./org.apache.solr.cloud.BasicDistributedZkTest-1355959159685/jetty2 forceNew:false
[junit4:junit4]   2> 7077 T1120 oasc.CachingDirectoryFactory.close Releasing directory:/usr/home/hudson/hudson-slave/workspace/Lucene-Solr-Tests-4.x-java7/solr/build/solr-core/test/J0/./org.apache.solr.cloud.BasicDistributedZkTest-1355959159685/jetty2
[junit4:junit4]   2> 7077 T1120 oasc.SolrCore.getNewIndexDir New index directory detected: old=null new=./org.apache.solr.cloud.BasicDistributedZkTest-1355959159685/jetty2/index/
[junit4:junit4]   2> 7078 T1120 oasc.SolrCore.initIndex WARNING [collection1] Solr index directory './org.apache.solr.cloud.BasicDistributedZkTest-1355959159685/jetty2/index' doesn't exist. Creating new index...
[junit4:junit4]   2> 7079 T1120 oasc.CachingDirectoryFactory.get return new directory for /usr/home/hudson/hudson-slave/workspace/Lucene-Solr-Tests-4.x-java7/solr/build/solr-core/test/J0/./org.apache.solr.cloud.BasicDistributedZkTest-1355959159685/jetty2/index forceNew:false
[junit4:junit4]   2> 7086 T1120 oasc.SolrDeletionPolicy.onCommit SolrDeletionPolicy.onCommit: commits:num=1
[junit4:junit4]   2> 		commit{dir=RateLimitedDirectoryWrapper(NRTCachingDirectory(org.apache.lucene.store.NIOFSDirectory@/usr/home/hudson/hudson-slave/workspace/Lucene-Solr-Tests-4.x-java7/solr/build/solr-core/test/J0/org.apache.solr.cloud.BasicDistributedZkTest-1355959159685/jetty2/index lockFactory=org.apache.lucene.store.NativeFSLockFactory@5e542efc; maxCacheMB=48.0 maxMergeSizeMB=4.0)),segFN=segments_1,generation=1,filenames=[segments_1]
[junit4:junit4]   2> 7086 T1120 oasc.SolrDeletionPolicy.updateCommits newest commit = 1[segments_1]
[junit4:junit4]   2> 7087 T1120 oasc.CachingDirectoryFactory.close Releasing directory:/usr/home/hudson/hudson-slave/workspace/Lucene-Solr-Tests-4.x-java7/solr/build/solr-core/test/J0/./org.apache.solr.cloud.BasicDistributedZkTest-1355959159685/jetty2/index
[junit4:junit4]   2> 7087 T1120 oasc.SolrCore.initWriters created xml: solr.XMLResponseWriter
[junit4:junit4]   2> 7088 T1120 oasup.UpdateRequestProcessorChain.init inserting DistributedUpdateProcessorFactory into updateRequestProcessorChain "dedupe"
[junit4:junit4]   2> 7089 T1120 oasup.UpdateRequestProcessorChain.init inserting DistributedUpdateProcessorFactory into updateRequestProcessorChain "dedupe-allfields"
[junit4:junit4]   2> 7089 T1120 oasup.UpdateRequestProcessorChain.init inserting DistributedUpdateProcessorFactory into updateRequestProcessorChain "stored_sig"
[junit4:junit4]   2> 7089 T1120 oasup.UpdateRequestProcessorChain.init inserting DistributedUpdateProcessorFactory into updateRequestProcessorChain "uniq-fields"
[junit4:junit4]   2> 7090 T1120 oasup.UpdateRequestProcessorChain.init inserting DistributedUpdateProcessorFactory into updateRequestProcessorChain "distrib-dup-test-chain-implicit"
[junit4:junit4]   2> 7090 T1120 oasc.RequestHandlers.initHandlersFromConfig adding lazy requestHandler: solr.ReplicationHandler
[junit4:junit4]   2> 7090 T1120 oasc.RequestHandlers.initHandlersFromConfig created /replication: solr.ReplicationHandler
[junit4:junit4]   2> 7091 T1120 oasc.RequestHandlers.initHandlersFromConfig created standard: solr.StandardRequestHandler
[junit4:junit4]   2> 7092 T1120 oasc.RequestHandlers.initHandlersFromConfig created /get: solr.RealTimeGetHandler
[junit4:junit4]   2> 7092 T1120 oasc.RequestHandlers.initHandlersFromConfig created dismax: solr.SearchHandler
[junit4:junit4]   2> 7093 T1120 oasc.RequestHandlers.initHandlersFromConfig created mock: org.apache.solr.core.MockQuerySenderListenerReqHandler
[junit4:junit4]   2> 7093 T1120 oasc.RequestHandlers.initHandlersFromConfig created /admin/: org.apache.solr.handler.admin.AdminHandlers
[junit4:junit4]   2> 7094 T1120 oasc.RequestHandlers.initHandlersFromConfig created defaults: solr.StandardRequestHandler
[junit4:junit4]   2> 7094 T1120 oasc.RequestHandlers.initHandlersFromConfig adding lazy requestHandler: solr.StandardRequestHandler
[junit4:junit4]   2> 7094 T1120 oasc.RequestHandlers.initHandlersFromConfig created lazy: solr.StandardRequestHandler
[junit4:junit4]   2> 7095 T1120 oasc.RequestHandlers.initHandlersFromConfig created /update: solr.UpdateRequestHandler
[junit4:junit4]   2> 7096 T1120 oasc.RequestHandlers.initHandlersFromConfig created /terms: org.apache.solr.handler.component.SearchHandler
[junit4:junit4]   2> 7096 T1120 oasc.RequestHandlers.initHandlersFromConfig created spellCheckCompRH: org.apache.solr.handler.component.SearchHandler
[junit4:junit4]   2> 7097 T1120 oasc.RequestHandlers.initHandlersFromConfig created spellCheckCompRH_Direct: org.apache.solr.handler.component.SearchHandler
[junit4:junit4]   2> 7097 T1120 oasc.RequestHandlers.initHandlersFromConfig created spellCheckWithWordbreak: org.apache.solr.handler.component.SearchHandler
[junit4:junit4]   2> 7098 T1120 oasc.RequestHandlers.initHandlersFromConfig created spellCheckWithWordbreak_Direct: org.apache.solr.handler.component.SearchHandler
[junit4:junit4]   2> 7099 T1120 oasc.RequestHandlers.initHandlersFromConfig created spellCheckCompRH1: org.apache.solr.handler.component.SearchHandler
[junit4:junit4]   2> 7099 T1120 oasc.RequestHandlers.initHandlersFromConfig created mltrh: org.apache.solr.handler.component.SearchHandler
[junit4:junit4]   2> 7100 T1120 oasc.RequestHandlers.initHandlersFromConfig created tvrh: org.apache.solr.handler.component.SearchHandler
[junit4:junit4]   2> 7100 T1120 oasc.RequestHandlers.initHandlersFromConfig created /mlt: solr.MoreLikeThisHandler
[junit4:junit4]   2> 7101 T1120 oasc.RequestHandlers.initHandlersFromConfig created /debug/dump: solr.DumpRequestHandler
[junit4:junit4]   2> 7111 T1120 oashl.XMLLoader.init xsltCacheLifetimeSeconds=60
[junit4:junit4]   2> 7115 T1120 oasc.SolrCore.initDeprecatedSupport WARNING solrconfig.xml uses deprecated <admin/gettableFiles>, Please update your config to use the ShowFileRequestHandler.
[junit4:junit4]   2> 7116 T1120 oasc.SolrCore.initDeprecatedSupport WARNING adding ShowFileRequestHandler with hidden files: [SCHEMA.XML, OLD_SYNONYMS.TXT, STOPWORDS.TXT, PROTWORDS.TXT, OPEN-EXCHANGE-RATES.JSON, SYNONYMS.TXT, CURRENCY.XML, MAPPING-ISOLATIN1ACCENT.TXT]
[junit4:junit4]   2> 7118 T1120 oasc.CachingDirectoryFactory.close Releasing directory:/usr/home/hudson/hudson-slave/workspace/Lucene-Solr-Tests-4.x-java7/solr/build/solr-core/test/J0/./org.apache.solr.cloud.BasicDistributedZkTest-1355959159685/jetty2
[junit4:junit4]   2> 7119 T1120 oass.SolrIndexSearcher.<init> Opening Searcher@5d75684d main
[junit4:junit4]   2> 7120 T1120 oasu.CommitTracker.<init> Hard AutoCommit: disabled
[junit4:junit4]   2> 7121 T1120 oasu.CommitTracker.<init> Soft AutoCommit: disabled
[junit4:junit4]   2> 7121 T1120 oashc.SpellCheckComponent.inform Initializing spell checkers
[junit4:junit4]   2> 7127 T1120 oass.DirectSolrSpellChecker.init init: {name=direct,classname=DirectSolrSpellChecker,field=lowerfilt,minQueryLength=3}
[junit4:junit4]   2> 7192 T1121 oasc.SolrCore.registerSearcher [collection1] Registered new searcher Searcher@5d75684d main{StandardDirectoryReader(segments_1:1)}
[junit4:junit4]   2> 7196 T1120 oasc.ZkController.publish publishing core=collection1 state=down
[junit4:junit4]   2> 7197 T1120 oasc.ZkController.publish numShards not found on descriptor - reading it from system property
[junit4:junit4]   2> 7411 T1086 oascc.ZkStateReader.updateClusterState Updating cloud state from ZooKeeper... 
[junit4:junit4]   2> 7412 T1086 oasc.Overseer$ClusterStateUpdater.updateState Update state numShards=2 message={
[junit4:junit4]   2> 	  "operation":"state",
[junit4:junit4]   2> 	  "numShards":"2",
[junit4:junit4]   2> 	  "shard":null,
[junit4:junit4]   2> 	  "roles":null,
[junit4:junit4]   2> 	  "state":"down",
[junit4:junit4]   2> 	  "core":"collection1",
[junit4:junit4]   2> 	  "collection":"collection1",
[junit4:junit4]   2> 	  "node_name":"127.0.0.1:22118_waso%2Fs",
[junit4:junit4]   2> 	  "base_url":"http://127.0.0.1:22118/waso/s"}
[junit4:junit4]   2> 7412 T1086 oasc.Overseer$ClusterStateUpdater.updateState Collection already exists with numShards=2
[junit4:junit4]   2> 7413 T1086 oasc.Overseer$ClusterStateUpdater.updateState Assigning new node to shard shard=shard2
[junit4:junit4]   2> 7427 T1119 oascc.ZkStateReader$2.process A cluster state change: WatchedEvent state:SyncConnected type:NodeDataChanged path:/clusterstate.json, has occurred - updating... (live nodes size: 3)
[junit4:junit4]   2> 7427 T1104 oascc.ZkStateReader$2.process A cluster state change: WatchedEvent state:SyncConnected type:NodeDataChanged path:/clusterstate.json, has occurred - updating... (live nodes size: 3)
[junit4:junit4]   2> 7427 T1085 oascc.ZkStateReader$2.process A cluster state change: WatchedEvent state:SyncConnected type:NodeDataChanged path:/clusterstate.json, has occurred - updating... (live nodes size: 3)
[junit4:junit4]   2> 7427 T1091 oascc.ZkStateReader$2.process A cluster state change: WatchedEvent state:SyncConnected type:NodeDataChanged path:/clusterstate.json, has occurred - updating... (live nodes size: 3)
[junit4:junit4]   2> 7700 T1120 oasc.CoreContainer.registerCore registering core: collection1
[junit4:junit4]   2> 7700 T1120 oasc.ZkController.register Register replica - core:collection1 address:http://127.0.0.1:22118/waso/s collection:collection1 shard:shard2
[junit4:junit4]   2> 7701 T1120 oascc.SolrZkClient.makePath makePath: /collections/collection1/leader_elect/shard2/election
[junit4:junit4]   2> 7721 T1068 oazs.PrepRequestProcessor.pRequest Got user-level KeeperException when processing sessionid:0x13bb576cb8b0008 type:delete cxid:0x44 zxid:0x7f txntype:-1 reqpath:n/a Error Path:/solr/collections/collection1/leaders/shard2 Error:KeeperErrorCode = NoNode for /solr/collections/collection1/leaders/shard2
[junit4:junit4]   2> 7722 T1120 oasc.ShardLeaderElectionContext.runLeaderProcess Running the leader process.
[junit4:junit4]   2> 7722 T1068 oazs.PrepRequestProcessor.pRequest Got user-level KeeperException when processing sessionid:0x13bb576cb8b0008 type:create cxid:0x45 zxid:0x80 txntype:-1 reqpath:n/a Error Path:/solr/overseer Error:KeeperErrorCode = NodeExists for /solr/overseer
[junit4:junit4]   2> 7724 T1120 oasc.ShardLeaderElectionContext.waitForReplicasToComeUp Enough replicas found to continue.
[junit4:junit4]   2> 7724 T1120 oasc.ShardLeaderElectionContext.runLeaderProcess I may be the new leader - try and sync
[junit4:junit4]   2> 7724 T1120 oasc.SyncStrategy.sync Sync replicas to http://127.0.0.1:22118/waso/s/collection1/
[junit4:junit4]   2> 7725 T1120 oasc.SyncStrategy.syncReplicas Sync Success - now sync replicas to me
[junit4:junit4]   2> 7725 T1120 oasc.SyncStrategy.syncToMe http://127.0.0.1:22118/waso/s/collection1/ has no replicas
[junit4:junit4]   2> 7725 T1120 oasc.ShardLeaderElectionContext.runLeaderProcess I am the new leader: http://127.0.0.1:22118/waso/s/collection1/
[junit4:junit4]   2> 7725 T1120 oascc.SolrZkClient.makePath makePath: /collections/collection1/leaders/shard2
[junit4:junit4]   2> 7728 T1068 oazs.PrepRequestProcessor.pRequest Got user-level KeeperException when processing sessionid:0x13bb576cb8b0008 type:create cxid:0x4e zxid:0x83 txntype:-1 reqpath:n/a Error Path:/solr/overseer Error:KeeperErrorCode = NodeExists for /solr/overseer
[junit4:junit4]   2> 7931 T1086 oascc.ZkStateReader.updateClusterState Updating cloud state from ZooKeeper... 
[junit4:junit4]   2> 7947 T1085 oascc.ZkStateReader$2.process A cluster state change: WatchedEvent state:SyncConnected type:NodeDataChanged path:/clusterstate.json, has occurred - updating... (live nodes size: 3)
[junit4:junit4]   2> 7947 T1119 oascc.ZkStateReader$2.process A cluster state change: WatchedEvent state:SyncConnected type:NodeDataChanged path:/clusterstate.json, has occurred - updating... (live nodes size: 3)
[junit4:junit4]   2> 7947 T1104 oascc.ZkStateReader$2.process A cluster state change: WatchedEvent state:SyncConnected type:NodeDataChanged path:/clusterstate.json, has occurred - updating... (live nodes size: 3)
[junit4:junit4]   2> 7947 T1091 oascc.ZkStateReader$2.process A cluster state change: WatchedEvent state:SyncConnected type:NodeDataChanged path:/clusterstate.json, has occurred - updating... (live nodes size: 3)
[junit4:junit4]   2> 7985 T1120 oasc.ZkController.register We are http://127.0.0.1:22118/waso/s/collection1/ and leader is http://127.0.0.1:22118/waso/s/collection1/
[junit4:junit4]   2> 7985 T1120 oasc.ZkController.register No LogReplay needed for core=collection1 baseURL=http://127.0.0.1:22118/waso/s
[junit4:junit4]   2> 7985 T1120 oasc.ZkController.checkRecovery I am the leader, no recovery necessary
[junit4:junit4]   2> 7986 T1120 oasc.ZkController.publish publishing core=collection1 state=active
[junit4:junit4]   2> 7986 T1120 oasc.ZkController.publish numShards not found on descriptor - reading it from system property
[junit4:junit4]   2> 7988 T1120 oascc.ZkStateReader.updateClusterState Updating cloud state from ZooKeeper... 
[junit4:junit4]   2> 7989 T1063 oass.SolrDispatchFilter.init user.dir=/usr/home/hudson/hudson-slave/workspace/Lucene-Solr-Tests-4.x-java7/solr/build/solr-core/test/J0
[junit4:junit4]   2> 7990 T1063 oass.SolrDispatchFilter.init SolrDispatchFilter.init() done
[junit4:junit4]   2> 7991 T1063 oascsi.HttpClientUtil.createClient Creating new http client, config:maxConnections=128&maxConnectionsPerHost=32&followRedirects=false
[junit4:junit4]   2> 8112 T1063 oejs.Server.doStart jetty-8.1.8.v20121106
[junit4:junit4]   2> 8115 T1063 oejs.AbstractConnector.doStart Started SocketConnector@127.0.0.1:22121
[junit4:junit4]   2> 8116 T1063 oasc.SolrResourceLoader.locateSolrHome JNDI not configured for solr (NoInitialContextEx)
[junit4:junit4]   2> 8117 T1063 oasc.SolrResourceLoader.locateSolrHome using system property solr.solr.home: /usr/home/hudson/hudson-slave/workspace/Lucene-Solr-Tests-4.x-java7/solr/build/solr-core/test/J0/./org.apache.solr.cloud.BasicDistributedZkTest-jetty3-1355959167678
[junit4:junit4]   2> 8117 T1063 oasc.SolrResourceLoader.<init> new SolrResourceLoader for deduced Solr Home: '/usr/home/hudson/hudson-slave/workspace/Lucene-Solr-Tests-4.x-java7/solr/build/solr-core/test/J0/./org.apache.solr.cloud.BasicDistributedZkTest-jetty3-1355959167678/'
[junit4:junit4]   2> 8148 T1063 oass.SolrDispatchFilter.init SolrDispatchFilter.init()
[junit4:junit4]   2> 8149 T1063 oasc.SolrResourceLoader.locateSolrHome JNDI not configured for solr (NoInitialContextEx)
[junit4:junit4]   2> 8149 T1063 oasc.SolrResourceLoader.locateSolrHome using system property solr.solr.home: /usr/home/hudson/hudson-slave/workspace/Lucene-Solr-Tests-4.x-java7/solr/build/solr-core/test/J0/./org.apache.solr.cloud.BasicDistributedZkTest-jetty3-1355959167678
[junit4:junit4]   2> 8150 T1063 oasc.CoreContainer$Initializer.initialize looking for solr.xml: /usr/home/hudson/hudson-slave/workspace/Lucene-Solr-Tests-4.x-java7/solr/build/solr-core/test/J0/./org.apache.solr.cloud.BasicDistributedZkTest-jetty3-1355959167678/solr.xml
[junit4:junit4]   2> 8150 T1063 oasc.CoreContainer.<init> New CoreContainer 1146950005
[junit4:junit4]   2> 8151 T1063 oasc.CoreContainer.load Loading CoreContainer using Solr Home: '/usr/home/hudson/hudson-slave/workspace/Lucene-Solr-Tests-4.x-java7/solr/build/solr-core/test/J0/./org.apache.solr.cloud.BasicDistributedZkTest-jetty3-1355959167678/'
[junit4:junit4]   2> 8151 T1063 oasc.SolrResourceLoader.<init> new SolrResourceLoader for directory: '/usr/home/hudson/hudson-slave/workspace/Lucene-Solr-Tests-4.x-java7/solr/build/solr-core/test/J0/./org.apache.solr.cloud.BasicDistributedZkTest-jetty3-1355959167678/'
[junit4:junit4]   2> 8174 T1063 oashc.HttpShardHandlerFactory.getParameter Setting socketTimeout to: 30000
[junit4:junit4]   2> 8175 T1063 oashc.HttpShardHandlerFactory.getParameter Setting urlScheme to: http://
[junit4:junit4]   2> 8175 T1063 oashc.HttpShardHandlerFactory.getParameter Setting connTimeout to: 15000
[junit4:junit4]   2> 8176 T1063 oashc.HttpShardHandlerFactory.getParameter Setting maxConnectionsPerHost to: 20
[junit4:junit4]   2> 8176 T1063 oashc.HttpShardHandlerFactory.getParameter Setting corePoolSize to: 0
[junit4:junit4]   2> 8176 T1063 oashc.HttpShardHandlerFactory.getParameter Setting maximumPoolSize to: 2147483647
[junit4:junit4]   2> 8177 T1063 oashc.HttpShardHandlerFactory.getParameter Setting maxThreadIdleTime to: 5
[junit4:junit4]   2> 8177 T1063 oashc.HttpShardHandlerFactory.getParameter Setting sizeOfQueue to: -1
[junit4:junit4]   2> 8178 T1063 oashc.HttpShardHandlerFactory.getParameter Setting fairnessPolicy to: false
[junit4:junit4]   2> 8178 T1063 oascsi.HttpClientUtil.createClient Creating new http client, config:maxConnectionsPerHost=20&maxConnections=10000&socketTimeout=30000&connTimeout=15000&retry=false
[junit4:junit4]   2> 8192 T1063 oasc.CoreContainer.load Registering Log Listener
[junit4:junit4]   2> 8206 T1063 oasc.CoreContainer.initZooKeeper Zookeeper client=127.0.0.1:22107/solr
[junit4:junit4]   2> 8208 T1063 oasc.ZkController.checkChrootPath zkHost includes chroot
[junit4:junit4]   2> 8208 T1063 oaz.ZooKeeper.<init> Initiating client connection, connectString=127.0.0.1:22107 sessionTimeout=60000 watcher=org.apache.solr.common.cloud.ConnectionManager@5b4f97bf
[junit4:junit4]   2> 8209 T1063 oascc.ConnectionManager.waitForConnected Waiting for client to connect to ZooKeeper
[junit4:junit4]   2> 8209 T1131 oaz.ClientCnxn$SendThread.logStartConnect Opening socket connection to server localhost/127.0.0.1:22107. Will not attempt to authenticate using SASL (access denied ("javax.security.auth.AuthPermission" "getLoginConfiguration"))
[junit4:junit4]   2> 8210 T1131 oaz.ClientCnxn$SendThread.primeConnection Socket connection established to localhost/127.0.0.1:22107, initiating session
[junit4:junit4]   2> 8210 T1065 oazs.NIOServerCnxnFactory.run Accepted socket connection from /140.211.11.196:22122
[junit4:junit4]   2> 8211 T1065 oazs.ZooKeeperServer.processConnectRequest Client attempting to establish new session at /140.211.11.196:22122
[junit4:junit4]   2> 8213 T1067 oazs.ZooKeeperServer.finishSessionInit Established session 0x13bb576cb8b0009 with negotiated timeout 20000 for client /140.211.11.196:22122
[junit4:junit4]   2> 8213 T1131 oaz.ClientCnxn$SendThread.onConnected Session establishment complete on server localhost/127.0.0.1:22107, sessionid = 0x13bb576cb8b0009, negotiated timeout = 20000
[junit4:junit4]   2> 8213 T1132 oascc.ConnectionManager.process Watcher org.apache.solr.common.cloud.ConnectionManager@5b4f97bf name:ZooKeeperConnection Watcher:127.0.0.1:22107 got event WatchedEvent state:SyncConnected type:None path:null path:null type:None
[junit4:junit4]   2> 8213 T1063 oascc.ConnectionManager.waitForConnected Client is connected to ZooKeeper
[junit4:junit4]   2> 8215 T1068 oazs.PrepRequestProcessor.pRequest2Txn Processed session termination for sessionid: 0x13bb576cb8b0009
[junit4:junit4]   2> 8225 T1132 oaz.ClientCnxn$EventThread.run EventThread shut down
[junit4:junit4]   2> 8225 T1065 oazs.NIOServerCnxn.closeSock Closed socket connection for client /140.211.11.196:22122 which had sessionid 0x13bb576cb8b0009
[junit4:junit4]   2> 8225 T1063 oaz.ZooKeeper.close Session: 0x13bb576cb8b0009 closed
[junit4:junit4]   2> 8226 T1063 oascsi.HttpClientUtil.createClient Creating new http client, config:maxConnections=500&maxConnectionsPerHost=16&socketTimeout=15000&connTimeout=30000
[junit4:junit4]   2> 8232 T1063 oaz.ZooKeeper.<init> Initiating client connection, connectString=127.0.0.1:22107/solr sessionTimeout=30000 watcher=org.apache.solr.common.cloud.ConnectionManager@268885cc
[junit4:junit4]   2> 8234 T1063 oascc.ConnectionManager.waitForConnected Waiting for client to connect to ZooKeeper
[junit4:junit4]   2> 8234 T1133 oaz.ClientCnxn$SendThread.logStartConnect Opening socket connection to server localhost/127.0.0.1:22107. Will not attempt to authenticate using SASL (access denied ("javax.security.auth.AuthPermission" "getLoginConfiguration"))
[junit4:junit4]   2> 8235 T1133 oaz.ClientCnxn$SendThread.primeConnection Socket connection established to localhost/127.0.0.1:22107, initiating session
[junit4:junit4]   2> 8235 T1065 oazs.NIOServerCnxnFactory.run Accepted socket connection from /140.211.11.196:22123
[junit4:junit4]   2> 8235 T1065 oazs.ZooKeeperServer.processConnectRequest Client attempting to establish new session at /140.211.11.196:22123
[junit4:junit4]   2> 8237 T1067 oazs.ZooKeeperServer.finishSessionInit Established session 0x13bb576cb8b000a with negotiated timeout 20000 for client /140.211.11.196:22123
[junit4:junit4]   2> 8237 T1133 oaz.ClientCnxn$SendThread.onConnected Session establishment complete on server localhost/127.0.0.1:22107, sessionid = 0x13bb576cb8b000a, negotiated timeout = 20000
[junit4:junit4]   2> 8237 T1134 oascc.ConnectionManager.process Watcher org.apache.solr.common.cloud.ConnectionManager@268885cc name:ZooKeeperConnection Watcher:127.0.0.1:22107/solr got event WatchedEvent state:SyncConnected type:None path:null path:null type:None
[junit4:junit4]   2> 8237 T1063 oascc.ConnectionManager.waitForConnected Client is connected to ZooKeeper
[junit4:junit4]   2> 8238 T1068 oazs.PrepRequestProcessor.pRequest Got user-level KeeperException when processing sessionid:0x13bb576cb8b000a type:create cxid:0x1 zxid:0x90 txntype:-1 reqpath:n/a Error Path:/solr/overseer Error:KeeperErrorCode = NodeExists for /solr/overseer
[junit4:junit4]   2> 8240 T1068 oazs.PrepRequestProcessor.pRequest Got user-level KeeperException when processing sessionid:0x13bb576cb8b000a type:create cxid:0x2 zxid:0x91 txntype:-1 reqpath:n/a Error Path:/solr/overseer Error:KeeperErrorCode = NodeExists for /solr/overseer
[junit4:junit4]   2> 8241 T1063 oasc.ZkController.createEphemeralLiveNode Register node as live in ZooKeeper:/live_nodes/127.0.0.1:22121_waso%2Fs
[junit4:junit4]   2> 8242 T1068 oazs.PrepRequestProcessor.pRequest Got user-level KeeperException when processing sessionid:0x13bb576cb8b000a type:delete cxid:0x4 zxid:0x92 txntype:-1 reqpath:n/a Error Path:/solr/live_nodes/127.0.0.1:22121_waso%2Fs Error:KeeperErrorCode = NoNode for /solr/live_nodes/127.0.0.1:22121_waso%2Fs
[junit4:junit4]   2> 8250 T1063 oascc.SolrZkClient.makePath makePath: /live_nodes/127.0.0.1:22121_waso%2Fs
[junit4:junit4]   2> 8253 T1119 oascc.ZkStateReader$2.process A cluster state change: WatchedEvent state:SyncConnected type:NodeChildrenChanged path:/live_nodes, has occurred - updating... (live nodes size: 3)
[junit4:junit4]   2> 8253 T1085 oascc.ZkStateReader$3.process Updating live nodes... (4)
[junit4:junit4]   2> 8253 T1104 oascc.ZkStateReader$3.process Updating live nodes... (4)
[junit4:junit4]   2> 8253 T1091 oascc.ZkStateReader$3.process Updating live nodes... (4)
[junit4:junit4]   2> 8254 T1085 oascc.ZkStateReader$2.process A cluster state change: WatchedEvent state:SyncConnected type:NodeChildrenChanged path:/live_nodes, has occurred - updating... (live nodes size: 4)
[junit4:junit4]   2> 8254 T1104 oascc.ZkStateReader$2.process A cluster state change: WatchedEvent state:SyncConnected type:NodeChildrenChanged path:/live_nodes, has occurred - updating... (live nodes size: 4)
[junit4:junit4]   2> 8254 T1091 oascc.ZkStateReader$2.process A cluster state change: WatchedEvent state:SyncConnected type:NodeChildrenChanged path:/live_nodes, has occurred - updating... (live nodes size: 4)
[junit4:junit4]   2> 8256 T1119 oascc.ZkStateReader$3.process Updating live nodes... (4)
[junit4:junit4]   2> 8257 T1063 oascc.ZkStateReader.createClusterStateWatchersAndUpdate Updating cluster state from ZooKeeper... 
[junit4:junit4]   2> 8263 T1135 oasc.CoreContainer.create Creating SolrCore 'collection1' using instanceDir: /usr/home/hudson/hudson-slave/workspace/Lucene-Solr-Tests-4.x-java7/solr/build/solr-core/test/J0/./org.apache.solr.cloud.BasicDistributedZkTest-jetty3-1355959167678/collection1
[junit4:junit4]   2> 8263 T1135 oasc.ZkController.createCollectionZkNode Check for collection zkNode:collection1
[junit4:junit4]   2> 8264 T1135 oasc.ZkController.createCollectionZkNode Collection zkNode exists
[junit4:junit4]   2> 8264 T1135 oasc.ZkController.readConfigName Load collection config from:/collections/collection1
[junit4:junit4]   2> 8266 T1135 oasc.SolrResourceLoader.<init> new SolrResourceLoader for directory: '/usr/home/hudson/hudson-slave/workspace/Lucene-Solr-Tests-4.x-java7/solr/build/solr-core/test/J0/./org.apache.solr.cloud.BasicDistributedZkTest-jetty3-1355959167678/collection1/'
[junit4:junit4]   2> 8267 T1135 oasc.SolrResourceLoader.replaceClassLoader Adding 'file:/usr/home/hudson/hudson-slave/workspace/Lucene-Solr-Tests-4.x-java7/solr/build/solr-core/test/J0/org.apache.solr.cloud.BasicDistributedZkTest-jetty3-1355959167678/collection1/lib/README' to classloader
[junit4:junit4]   2> 8268 T1135 oasc.SolrResourceLoader.replaceClassLoader Adding 'file:/usr/home/hudson/hudson-slave/workspace/Lucene-Solr-Tests-4.x-java7/solr/build/solr-core/test/J0/org.apache.solr.cloud.BasicDistributedZkTest-jetty3-1355959167678/collection1/lib/classes/' to classloader
[junit4:junit4]   2> 8327 T1135 oasc.SolrConfig.<init> Using Lucene MatchVersion: LUCENE_41
[junit4:junit4]   2> 8407 T1135 oasc.SolrConfig.<init> Loaded SolrConfig: solrconfig.xml
[junit4:junit4]   2> 8461 T1086 oascc.ZkStateReader.updateClusterState Updating cloud state from ZooKeeper... 
[junit4:junit4]   2> 8462 T1086 oasc.Overseer$ClusterStateUpdater.updateState Update state numShards=2 message={
[junit4:junit4]   2> 	  "operation":"state",
[junit4:junit4]   2> 	  "numShards":"2",
[junit4:junit4]   2> 	  "shard":"shard2",
[junit4:junit4]   2> 	  "roles":null,
[junit4:junit4]   2> 	  "state":"active",
[junit4:junit4]   2> 	  "core":"collection1",
[junit4:junit4]   2> 	  "collection":"collection1",
[junit4:junit4]   2> 	  "node_name":"127.0.0.1:22118_waso%2Fs",
[junit4:junit4]   2> 	  "base_url":"http://127.0.0.1:22118/waso/s"}
[junit4:junit4]   2> 8474 T1085 oascc.ZkStateReader$2.process A cluster state change: WatchedEvent state:SyncConnected type:NodeDataChanged path:/clusterstate.json, has occurred - updating... (live nodes size: 4)
[junit4:junit4]   2> 8474 T1104 oascc.ZkStateReader$2.process A cluster state change: WatchedEvent state:SyncConnected type:NodeDataChanged path:/clusterstate.json, has occurred - updating... (live nodes size: 4)
[junit4:junit4]   2> 8474 T1119 oascc.ZkStateReader$2.process A cluster state change: WatchedEvent state:SyncConnected type:NodeDataChanged path:/clusterstate.json, has occurred - updating... (live nodes size: 4)
[junit4:junit4]   2> 8474 T1091 oascc.ZkStateReader$2.process A cluster state change: WatchedEvent state:SyncConnected type:NodeDataChanged path:/clusterstate.json, has occurred - updating... (live nodes size: 4)
[junit4:junit4]   2> 8508 T1134 oascc.ZkStateReader$2.process A cluster state change: WatchedEvent state:SyncConnected type:NodeDataChanged path:/clusterstate.json, has occurred - updating... (live nodes size: 4)
[junit4:junit4]   2> 8508 T1135 oass.IndexSchema.readSchema Reading Solr Schema
[junit4:junit4]   2> 8516 T1135 oass.IndexSchema.readSchema Schema name=test
[junit4:junit4]   2> 9152 T1135 oass.OpenExchangeRatesOrgProvider.init Initialized with rates=open-exchange-rates.json, refreshInterval=1440.
[junit4:junit4]   2> 9160 T1135 oass.IndexSchema.readSchema default search field in schema is text
[junit4:junit4]   2> 9162 T1135 oass.IndexSchema.readSchema unique key field: id
[junit4:junit4]   2> 9174 T1135 oass.FileExchangeRateProvider.reload Reloading exchange rates from file currency.xml
[junit4:junit4]   2> 9178 T1135 oass.FileExchangeRateProvider.reload Reloading exchange rates from file currency.xml
[junit4:junit4]   2> 9181 T1135 oass.OpenExchangeRatesOrgProvider.reload Reloading exchange rates from open-exchange-rates.json
[junit4:junit4]   2> 9182 T1135 oass.OpenExchangeRatesOrgProvider.reload Reloading exchange rates from open-exchange-rates.json
[junit4:junit4]   2> 9183 T1135 oasc.SolrCore.<init> [collection1] Opening new SolrCore at /usr/home/hudson/hudson-slave/workspace/Lucene-Solr-Tests-4.x-java7/solr/build/solr-core/test/J0/./org.apache.solr.cloud.BasicDistributedZkTest-jetty3-1355959167678/collection1/, dataDir=./org.apache.solr.cloud.BasicDistributedZkTest-1355959159685/jetty3/
[junit4:junit4]   2> 9184 T1135 oasc.JmxMonitoredMap.<init> JMX monitoring is enabled. Adding Solr mbeans to JMX Server: com.sun.jmx.mbeanserver.JmxMBeanServer@4139a82d
[junit4:junit4]   2> 9184 T1135 oasc.SolrCore.initDirectoryFactory solr.NRTCachingDirectoryFactory
[junit4:junit4]   2> 9185 T1135 oasc.CachingDirectoryFactory.get return new directory for /usr/home/hudson/hudson-slave/workspace/Lucene-Solr-Tests-4.x-java7/solr/build/solr-core/test/J0/./org.apache.solr.cloud.BasicDistributedZkTest-1355959159685/jetty3 forceNew:false
[junit4:junit4]   2> 9185 T1135 oasc.CachingDirectoryFactory.close Releasing directory:/usr/home/hudson/hudson-slave/workspace/Lucene-Solr-Tests-4.x-java7/solr/build/solr-core/test/J0/./org.apache.solr.cloud.BasicDistributedZkTest-1355959159685/jetty3
[junit4:junit4]   2> 9186 T1135 oasc.SolrCore.getNewIndexDir New index directory detected: old=null new=./org.apache.solr.cloud.BasicDistributedZkTest-1355959159685/jetty3/index/
[junit4:junit4]   2> 9186 T1135 oasc.SolrCore.initIndex WARNING [collection1] Solr index directory './org.apache.solr.cloud.BasicDistributedZkTest-1355959159685/jetty3/index' doesn't exist. Creating new index...
[junit4:junit4]   2> 9189 T1135 oasc.CachingDirectoryFactory.get return new directory for /usr/home/hudson/hudson-slave/workspace/Lucene-Solr-Tests-4.x-java7/solr/build/solr-core/test/J0/./org.apache.solr.cloud.BasicDistributedZkTest-1355959159685/jetty3/index forceNew:false
[junit4:junit4]   2> 9218 T1135 oasc.SolrDeletionPolicy.onCommit SolrDeletionPolicy.onCommit: commits:num=1
[junit4:junit4]   2> 		commit{dir=RateLimitedDirectoryWrapper(NRTCachingDirectory(org.apache.lucene.store.NIOFSDirectory@/usr/home/hudson/hudson-slave/workspace/Lucene-Solr-Tests-4.x-java7/solr/build/solr-core/test/J0/org.apache.solr.cloud.BasicDistributedZkTest-1355959159685/jetty3/index lockFactory=org.apache.lucene.store.NativeFSLockFactory@48bc8c33; maxCacheMB=48.0 maxMergeSizeMB=4.0)),segFN=segments_1,generation=1,filenames=[segments_1]
[junit4:junit4]   2> 9219 T1135 oasc.SolrDeletionPolicy.updateCommits newest commit = 1[segments_1]
[junit4:junit4]   2> 9219 T1135 oasc.CachingDirectoryFactory.close Releasing directory:/usr/home/hudson/hudson-slave/workspace/Lucene-Solr-Tests-4.x-java7/solr/build/solr-core/test/J0/./org.apache.solr.cloud.BasicDistributedZkTest-1355959159685/jetty3/index
[junit4:junit4]   2> 9220 T1135 oasc.SolrCore.initWriters created xml: solr.XMLResponseWriter
[junit4:junit4]   2> 9221 T1135 oasup.UpdateRequestProcessorChain.init inserting DistributedUpdateProcessorFactory into updateRequestProcessorChain "dedupe"
[junit4:junit4]   2> 9221 T1135 oasup.UpdateRequestProcessorChain.init inserting DistributedUpdateProcessorFactory into updateRequestProcessorChain "dedupe-allfields"
[junit4:junit4]   2> 9222 T1135 oasup.UpdateRequestProcessorChain.init inserting DistributedUpdateProcessorFactory into updateRequestProcessorChain "stored_sig"
[junit4:junit4]   2> 9222 T1135 oasup.UpdateRequestProcessorChain.init inserting DistributedUpdateProcessorFactory into updateRequestProcessorChain "uniq-fields"
[junit4:junit4]   2> 9223 T1135 oasup.UpdateRequestProcessorChain.init inserting DistributedUpdateProcessorFactory into updateRequestProcessorChain "distrib-dup-test-chain-implicit"
[junit4:junit4]   2> 9223 T1135 oasc.RequestHandlers.initHandlersFromConfig adding lazy requestHandler: solr.ReplicationHandler
[junit4:junit4]   2> 9223 T1135 oasc.RequestHandlers.initHandlersFromConfig created /replication: solr.ReplicationHandler
[junit4:junit4]   2> 9224 T1135 oasc.RequestHandlers.initHandlersFromConfig created standard: solr.StandardRequestHandler
[junit4:junit4]   2> 9224 T1135 oasc.RequestHandlers.initHandlersFromConfig created /get: solr.RealTimeGetHandler
[junit4:junit4]   2> 9225 T1135 oasc.RequestHandlers.initHandlersFromConfig created dismax: solr.SearchHandler
[junit4:junit4]   2> 9226 T1135 oasc.RequestHandlers.initHandlersFromConfig created mock: org.apache.solr.core.MockQuerySenderListenerReqHandler
[junit4:junit4]   2> 9226 T1135 oasc.RequestHandlers.initHandlersFromConfig created /admin/: org.apache.solr.handler.admin.AdminHandlers
[junit4:junit4]   2> 9227 T1135 oasc.RequestHandlers.initHandlersFromConfig created defaults: solr.StandardRequestHandler
[junit4:junit4]   2> 9227 T1135 oasc.RequestHandlers.initHandlersFromConfig adding lazy requestHandler: solr.StandardRequestHandler
[junit4:junit4]   2> 9227 T1135 oasc.RequestHandlers.initHandlersFromConfig created lazy: solr.StandardRequestHandler
[junit4:junit4]   2> 9228 T1135 oasc.RequestHandlers.initHandlersFromConfig created /update: solr.UpdateRequestHandler
[junit4:junit4]   2> 9229 T1135 oasc.RequestHandlers.initHandlersFromConfig created /terms: org.apache.solr.handler.component.SearchHandler
[junit4:junit4]   2> 9229 T1135 oasc.RequestHandlers.initHandlersFromConfig created spellCheckCompRH: org.apache.solr.handler.component.SearchHandler
[junit4:junit4]   2> 9230 T1135 oasc.RequestHandlers.initHandlersFromConfig created spellCheckCompRH_Direct: org.apache.solr.handler.component.SearchHandler
[junit4:junit4]   2> 9230 T1135 oasc.RequestHandlers.initHandlersFromConfig created spellCheckWithWordbreak: org.apache.solr.handler.component.SearchHandler
[junit4:junit4]   2> 9231 T1135 oasc.RequestHandlers.initHandlersFromConfig created spellCheckWithWordbreak_Direct: org.apache.solr.handler.component.SearchHandler
[junit4:junit4]   2> 9232 T1135 oasc.RequestHandlers.initHandlersFromConfig created spellCheckCompRH1: org.apache.solr.handler.component.SearchHandler
[junit4:junit4]   2> 9232 T1135 oasc.RequestHandlers.initHandlersFromConfig created mltrh: org.apache.solr.handler.component.SearchHandler
[junit4:junit4]   2> 9233 T1135 oasc.RequestHandlers.initHandlersFromConfig created tvrh: org.apache.solr.handler.component.SearchHandler
[junit4:junit4]   2> 9233 T1135 oasc.RequestHandlers.initHandlersFromConfig created /mlt: solr.MoreLikeThisHandler
[junit4:junit4]   2> 9234 T1135 oasc.RequestHandlers.initHandlersFromConfig created /debug/dump: solr.DumpRequestHandler
[junit4:junit4]   2> 9244 T1135 oashl.XMLLoader.init xsltCacheLifetimeSeconds=60
[junit4:junit4]   2> 9248 T1135 oasc.SolrCore.initDeprecatedSupport WARNING solrconfig.xml uses deprecated <admin/gettableFiles>, Please update your config to use the ShowFileRequestHandler.
[junit4:junit4]   2> 9249 T1135 oasc.SolrCore.initDeprecatedSupport WARNING adding ShowFileRequestHandler with hidden files: [SCHEMA.XML, OLD_SYNONYMS.TXT, STOPWORDS.TXT, PROTWORDS.TXT, OPEN-EXCHANGE-RATES.JSON, SYNONYMS.TXT, CURRENCY.XML, MAPPING-ISOLATIN1ACCENT.TXT]
[junit4:junit4]   2> 9251 T1135 oasc.CachingDirectoryFactory.close Releasing directory:/usr/home/hudson/hudson-slave/workspace/Lucene-Solr-Tests-4.x-java7/solr/build/solr-core/test/J0/./org.apache.solr.cloud.BasicDistributedZkTest-1355959159685/jetty3
[junit4:junit4]   2> 9252 T1135 oass.SolrIndexSearcher.<init> Opening Searcher@463bc18 main
[junit4:junit4]   2> 9253 T1135 oasu.CommitTracker.<init> Hard AutoCommit: disabled
[junit4:junit4]   2> 9253 T1135 oasu.CommitTracker.<init> Soft AutoCommit: disabled
[junit4:junit4]   2> 9254 T1135 oashc.SpellCheckComponent.inform Initializing spell checkers
[junit4:junit4]   2> 9260 T1135 oass.DirectSolrSpellChecker.init init: {name=direct,classname=DirectSolrSpellChecker,field=lowerfilt,minQueryLength=3}
[junit4:junit4]   2> 9301 T1136 oasc.SolrCore.registerSearcher [collection1] Registered new searcher Searcher@463bc18 main{StandardDirectoryReader(segments_1:1)}
[junit4:junit4]   2> 9306 T1135 oasc.ZkController.publish publishing core=collection1 state=down
[junit4:junit4]   2> 9306 T1135 oasc.ZkController.publish numShards not found on descriptor - reading it from system property
[junit4:junit4]   2> 9480 T1086 oascc.ZkStateReader.updateClusterState Updating cloud state from ZooKeeper... 
[junit4:junit4]   2> 9481 T1086 oasc.Overseer$ClusterStateUpdater.updateState Update state numShards=2 message={
[junit4:junit4]   2> 	  "operation":"state",
[junit4:junit4]   2> 	  "numShards":"2",
[junit4:junit4]   2> 	  "shard":null,
[junit4:junit4]   2> 	  "roles":null,
[junit4:junit4]   2> 	  "state":"down",
[junit4:junit4]   2> 	  "core":"collection1",
[junit4:junit4]   2> 	  "collection":"collection1",
[junit4:junit4]   2> 	  "node_name":"127.0.0.1:22121_waso%2Fs",
[junit4:junit4]   2> 	  "base_url":"http://127.0.0.1:22121/waso/s"}
[junit4:junit4]   2> 9481 T1086 oasc.Overseer$ClusterStateUpdater.updateState Collection already exists with numShards=2
[junit4:junit4]   2> 9482 T1086 oasc.Overseer$ClusterStateUpdater.updateState Assigning new node to shard shard=shard1
[junit4:junit4]   2> 9486 T1134 oascc.ZkStateReader$2.process A cluster state change: WatchedEvent state:SyncConnected type:NodeDataChanged path:/clusterstate.json, has occurred - updating... (live nodes size: 4)
[junit4:junit4]   2> 9486 T1091 oascc.ZkStateReader$2.process A cluster state change: WatchedEvent state:SyncConnected type:NodeDataChanged path:/clusterstate.json, has occurred - updating... (live nodes size: 4)
[junit4:junit4]   2> 9486 T1104 oascc.ZkStateReader$2.process A cluster state change: WatchedEvent state:SyncConnected type:NodeDataChanged path:/clusterstate.json, has occurred - updating... (live nodes size: 4)
[junit4:junit4]   2> 9486 T1119 oascc.ZkStateReader$2.process A cluster state change: WatchedEvent state:SyncConnected type:NodeDataChanged path:/clusterstate.json, has occurred - updating... (live nodes size: 4)
[junit4:junit4]   2> 9486 T1085 oascc.ZkStateReader$2.process A cluster state change: WatchedEvent state:SyncConnected type:NodeDataChanged path:/clusterstate.json, has occurred - updating... (live nodes size: 4)
[junit4:junit4]   2> 9810 T1135 oasc.CoreContainer.registerCore registering core: collection1
[junit4:junit4]   2> 9810 T1135 oasc.ZkController.register Register replica - core:collection1 address:http://127.0.0.1:22121/waso/s collection:collection1 shard:shard1
[junit4:junit4]   2> 9813 T1135 oasc.ZkController.register We are http://127.0.0.1:22121/waso/s/collection1/ and leader is http://127.0.0.1:22115/waso/s/collection1/
[junit4:junit4]   2> 9814 T1135 oasc.ZkController.register No LogReplay needed for core=collection1 baseURL=http://127.0.0.1:22121/waso/s
[junit4:junit4]   2> 9814 T1135 oasc.ZkController.checkRecovery Core needs to recover:collection1
[junit4:junit4]   2> 9814 T1135 oasu.DefaultSolrCoreState.doRecovery Running recovery - first canceling any ongoing recovery
[junit4:junit4]   2> ASYNC  NEW_CORE C142 name=collection1 org.apache.solr.core.SolrCore@311930b7 url=http://127.0.0.1:22121/waso/s/collection1 node=127.0.0.1:22121_waso%2Fs C142_STATE=coll:collection1 core:collection1 props:{shard=null, roles=null, state=down, core=collection1, collection=collection1, node_name=127.0.0.1:22121_waso%2Fs, base_url=http://127.0.0.1:22121/waso/s}
[junit4:junit4]   2> 9814 T1137 C142 P22121 oasc.RecoveryStrategy.run Starting recovery process.  core=collection1 recoveringAfterStartup=true
[junit4:junit4]   2> 9815 T1135 oascc.ZkStateReader.updateClusterState Updating cloud state from ZooKeeper... 
[junit4:junit4]   2> 9815 T1137 C142 P22121 oasc.RecoveryStrategy.doRecovery ###### startupVersions=[]
[junit4:junit4]   2> 9815 T1137 C142 P22121 oasc.ZkController.publish publishing core=collection1 state=recovering
[junit4:junit4]   2> 9816 T1137 C142 P22121 oasc.ZkController.publish numShards not found on descriptor - reading it from system property
[junit4:junit4]   2> 9816 T1063 oass.SolrDispatchFilter.init user.dir=/usr/home/hudson/hudson-slave/workspace/Lucene-Solr-Tests-4.x-java7/solr/build/solr-core/test/J0
[junit4:junit4]   2> 9817 T1137 C142 P22121 oasc.RecoveryStrategy.doRecovery Attempting to PeerSync from http://127.0.0.1:22115/waso/s/collection1/ core=collection1 - recoveringAfterStartup=true
[junit4:junit4]   2> 9817 T1063 oass.SolrDispatchFilter.init SolrDispatchFilter.init() done
[junit4:junit4]   2> 9817 T1137 C142 P22121 oasu.PeerSync.sync PeerSync: core=collection1 url=http://127.0.0.1:22121/waso/s START replicas=[http://127.0.0.1:22115/waso/s/collection1/] nUpdates=100
[junit4:junit4]   2> 9817 T1063 oascsi.HttpClientUtil.createClient Creating new http client, config:maxConnections=128&maxConnectionsPerHost=32&followRedirects=false
[junit4:junit4]   2> 9818 T1137 C142 P22121 oasu.PeerSync.sync WARNING no frame of reference to tell of we've missed updates
[junit4:junit4]   2> ASYNC  NEW_CORE C143 name=collection1 org.apache.solr.core.SolrCore@35509ae7 url=http://127.0.0.1:22115/waso/s/collection1 node=127.0.0.1:22115_waso%2Fs C143_STATE=coll:collection1 core:collection1 props:{shard=shard1, roles=null, state=active, core=collection1, collection=collection1, node_name=127.0.0.1:22115_waso%2Fs, base_url=http://127.0.0.1:22115/waso/s, leader=true}
[junit4:junit4]   2> 9826 T1094 C143 P22115 REQ /get {distrib=false&qt=/get&wt=javabin&version=2&getVersions=100} status=0 QTime=1 
[junit4:junit4]   2> 9859 T1137 C142 P22121 oasc.RecoveryStrategy.doRecovery PeerSync Recovery was not successful - trying replication. core=collection1
[junit4:junit4]   2> 9860 T1137 C142 P22121 oasc.RecoveryStrategy.doRecovery Starting Replication Recovery. core=collection1
[junit4:junit4]   2> 9860 T1137 C142 P22121 oascsi.HttpClientUtil.createClient Creating new http client, config:maxConnections=128&maxConnectionsPerHost=32&followRedirects=false
[junit4:junit4]   2> 9999 T1086 oascc.ZkStateReader.updateClusterState Updating cloud state from ZooKeeper... 
[junit4:junit4]   2> 10000 T1086 oasc.Overseer$ClusterStateUpdater.updateState Update state numShards=2 message={
[junit4:junit4]   2> 	  "operation":"state",
[junit4:junit4]   2> 	  "numShards":"2",
[junit4:junit4]   2> 	  "shard":"shard1",
[junit4:junit4]   2> 	  "roles":null,
[junit4:junit4]   2> 	  "state":"recovering",
[junit4:junit4]   2> 	  "core":"collection1",
[junit4:junit4]   2> 	  "collection":"collection1",
[junit4:junit4]   2> 	  "node_name":"127.0.0.1:22121_waso%2Fs",
[junit4:junit4]   2> 	  "base_url":"http://127.0.0.1:22121/waso/s"}
[junit4:junit4]   2> 10014 T1134 oascc.ZkStateReader$2.process A cluster state change: WatchedEvent state:SyncConnected type:NodeDataChanged path:/clusterstate.json, has occurred - updating... (live nodes size: 4)
[junit4:junit4]   2> 10014 T1091 oascc.ZkStateReader$2.process A cluster state change: WatchedEvent state:SyncConnected type:NodeDataChanged path:/clusterstate.json, has occurred - updating... (live nodes size: 4)
[junit4:junit4]   2> 10014 T1119 oascc.ZkStateReader$2.process A cluster state change: WatchedEvent state:SyncConnected type:NodeDataChanged path:/clusterstate.json, has occurred - updating... (live nodes size: 4)
[junit4:junit4]   2> 10014 T1085 oascc.ZkStateReader$2.process A cluster state change: WatchedEvent state:SyncConnected type:NodeDataChanged path:/clusterstate.json, has occurred - updating... (live nodes size: 4)
[junit4:junit4]   2> 10015 T1104 oascc.ZkStateReader$2.process A cluster state change: WatchedEvent state:SyncConnected type:NodeDataChanged path:/clusterstate.json, has occurred - updating... (live nodes size: 4)
[junit4:junit4]   2> 10024 T1063 oejs.Server.doStart jetty-8.1.8.v20121106
[junit4:junit4]   2> 10028 T1063 oejs.AbstractConnector.doStart Started SocketConnector@127.0.0.1:22126
[junit4:junit4]   2> 10029 T1063 oasc.SolrResourceLoader.locateSolrHome JNDI not configured for solr (NoInitialContextEx)
[junit4:junit4]   2> 10030 T1063 oasc.SolrResourceLoader.locateSolrHome using system property solr.solr.home: /usr/home/hudson/hudson-slave/workspace/Lucene-Solr-Tests-4.x-java7/solr/build/solr-core/test/J0/./org.apache.solr.cloud.BasicDistributedZkTest-jetty4-1355959169511
[junit4:junit4]   2> 10031 T1063 oasc.SolrResourceLoader.<init> new SolrResourceLoader for deduced Solr Home: '/usr/home/hudson/hudson-slave/workspace/Lucene-Solr-Tests-4.x-java7/solr/build/solr-core/test/J0/./org.apache.solr.cloud.BasicDistributedZkTest-jetty4-1355959169511/'
[junit4:junit4]   2> 10079 T1063 oass.SolrDispatchFilter.init SolrDispatchFilter.init()
[junit4:junit4]   2> 10080 T1063 oasc.SolrResourceLoader.locateSolrHome JNDI not configured for solr (NoInitialContextEx)
[junit4:junit4]   2> 10080 T1063 oasc.SolrResourceLoader.locateSolrHome using system property solr.solr.home: /usr/home/hudson/hudson-slave/workspace/Lucene-Solr-Tests-4.x-java7/solr/build/solr-core/test/J0/./org.apache.solr.cloud.BasicDistributedZkTest-jetty4-1355959169511
[junit4:junit4]   2> 10081 T1063 oasc.CoreContainer$Initializer.initialize looking for solr.xml: /usr/home/hudson/hudson-slave/workspace/Lucene-Solr-Tests-4.x-java7/solr/build/solr-core/test/J0/./org.apache.solr.cloud.BasicDistributedZkTest-jetty4-1355959169511/solr.xml
[junit4:junit4]   2> 10082 T1063 oasc.CoreContainer.<init> New CoreContainer 1444899067
[junit4:junit4]   2> 10082 T1063 oasc.CoreContainer.load Loading CoreContainer using Solr Home: '/usr/home/hudson/hudson-slave/workspace/Lucene-Solr-Tests-4.x-java7/solr/build/solr-core/test/J0/./org.apache.solr.cloud.BasicDistributedZkTest-jetty4-1355959169511/'
[junit4:junit4]   2> 10083 T1063 oasc.SolrResourceLoader.<init> new SolrResourceLoader for directory: '/usr/home/hudson/hudson-slave/workspace/Lucene-Solr-Tests-4.x-java7/solr/build/solr-core/test/J0/./org.apache.solr.cloud.BasicDistributedZkTest-jetty4-1355959169511/'
[junit4:junit4]   2> 10117 T1063 oashc.HttpShardHandlerFactory.getParameter Setting socketTimeout to: 30000
[junit4:junit4]   2> 10118 T1063 oashc.HttpShardHandlerFactory.getParameter Setting urlScheme to: http://
[junit4:junit4]   2> 10118 T1063 oashc.HttpShardHandlerFactory.getParameter Setting connTimeout to: 15000
[junit4:junit4]   2> 10119 T1063 oashc.HttpShardHandlerFactory.getParameter Setting maxConnectionsPerHost to: 20
[junit4:junit4]   2> 10120 T1063 oashc.HttpShardHandlerFactory.getParameter Setting corePoolSize to: 0
[junit4:junit4]   2> 10120 T1063 oashc.HttpShardHandlerFactory.getParameter Setting maximumPoolSize to: 2147483647
[junit4:junit4]   2> 10121 T1063 oashc.HttpShardHandlerFactory.getParameter Setting maxThreadIdleTime to: 5
[junit4:junit4]   2> 10121 T1063 oashc.HttpShardHandlerFactory.getParameter Setting sizeOfQueue to: -1
[junit4:junit4]   2> 10122 T1063 oashc.HttpShardHandlerFactory.getParameter Setting fairnessPolicy to: false
[junit4:junit4]   2> 10123 T1063 oascsi.HttpClientUtil.createClient Creating new http client, config:maxConnectionsPerHost=20&maxConnections=10000&socketTimeout=30000&connTimeout=15000&retry=false
[junit4:junit4]   2> 10143 T1063 oasc.CoreContainer.load Registering Log Listener
[junit4:junit4]   2> 10165 T1063 oasc.CoreContainer.initZooKeeper Zookeeper client=127.0.0.1:22107/solr
[junit4:junit4]   2> 10166 T1063 oasc.ZkController.checkChrootPath zkHost includes chroot
[junit4:junit4]   2> 10167 T1063 oaz.ZooKeeper.<init> Initiating client connection, connectString=127.0.0.1:22107 sessionTimeout=60000 watcher=org.apache.solr.common.cloud.ConnectionManager@97b6d49
[junit4:junit4]   2> 10168 T1063 oascc.ConnectionManager.waitForConnected Waiting for client to connect to ZooKeeper
[junit4:junit4]   2> 10168 T1148 oaz.ClientCnxn$SendThread.logStartConnect Opening socket connection to server localhost/127.0.0.1:22107. Will not attempt to authenticate using SASL (access denied ("javax.security.auth.AuthPermission" "getLoginConfiguration"))
[junit4:junit4]   2> 10170 T1148 oaz.ClientCnxn$SendThread.primeConnection Socket connection established to localhost/127.0.0.1:22107, initiating session
[junit4:junit4]   2> 10170 T1065 oazs.NIOServerCnxnFactory.run Accepted socket connection from /140.211.11.196:22127
[junit4:junit4]   2> 10170 T1065 oazs.ZooKeeperServer.processConnectRequest Client attempting to establish new session at /140.211.11.196:22127
[junit4:junit4]   2> 10172 T1067 oazs.ZooKeeperServer.finishSessionInit Established session 0x13bb576cb8b000b with negotiated timeout 20000 for client /140.211.11.196:22127
[junit4:junit4]   2> 10172 T1148 oaz.ClientCnxn$SendThread.onConnected Session establishment complete on server localhost/127.0.0.1:22107, sessionid = 0x13bb576cb8b000b, negotiated timeout = 20000
[junit4:junit4]   2> 10172 T1149 oascc.ConnectionManager.process Watcher org.apache.solr.common.cloud.ConnectionManager@97b6d49 name:ZooKeeperConnection Watcher:127.0.0.1:22107 got event WatchedEvent state:SyncConnected type:None path:null path:null type:None
[junit4:junit4]   2> 10172 T1063 oascc.ConnectionManager.waitForConnected Client is connected to ZooKeeper
[junit4:junit4]   2> 10174 T1068 oazs.PrepRequestProcessor.pRequest2Txn Processed session termination for sessionid: 0x13bb576cb8b000b
[junit4:junit4]   2> 10175 T1149 oaz.ClientCnxn$EventThread.run EventThread shut down
[junit4:junit4]   2> 10175 T1065 oazs.NIOServerCnxn.closeSock Closed socket connection for client /140.211.11.196:22127 which had sessionid 0x13bb576cb8b000b
[junit4:junit4]   2> 10175 T1063 oaz.ZooKeeper.close Session: 0x13bb576cb8b000b closed
[junit4:junit4]   2> 10176 T1063 oascsi.HttpClientUtil.createClient Creating new http client, config:maxConnections=500&maxConnectionsPerHost=16&socketTimeout=15000&connTimeout=30000
[junit4:junit4]   2> 10186 T1063 oaz.ZooKeeper.<init> Initiating client connection, connectString=127.0.0.1:22107/solr sessionTimeout=30000 watcher=org.apache.solr.common.cloud.ConnectionManager@be07aaa
[junit4:junit4]   2> 10187 T1063 oascc.ConnectionManager.waitForConnected Waiting for client to connect to ZooKeeper
[junit4:junit4]   2> 10187 T1150 oaz.ClientCnxn$SendThread.logStartConnect Opening socket connection to server localhost/127.0.0.1:22107. Will not attempt to authenticate using SASL (access denied ("javax.security.auth.AuthPermission" "getLoginConfiguration"))
[junit4:junit4]   2> 10188 T1150 oaz.ClientCnxn$SendThread.primeConnection Socket connection established to localhost/127.0.0.1:22107, initiating session
[junit4:junit4]   2> 10188 T1065 oazs.NIOServerCnxnFactory.run Accepted socket connection from /140.211.11.196:22128
[junit4:junit4]   2> 10189 T1065 oazs.ZooKeeperServer.processConnectRequest Client attempting to establish new session at /140.211.11.196:22128
[junit4:junit4]   2> 10190 T1067 oazs.ZooKeeperServer.finishSessionInit Established session 0x13bb576cb8b000c with negotiated timeout 20000 for client /140.211.11.196:22128
[junit4:junit4]   2> 10190 T1150 oaz.ClientCnxn$SendThread.onConnected Session establishment complete on server localhost/127.0.0.1:22107, sessionid = 0x13bb576cb8b000c, negotiated timeout = 20000
[junit4:junit4]   2> 10190 T1151 oascc.ConnectionManager.process Watcher org.apache.solr.common.cloud.ConnectionManager@be07aaa name:ZooKeeperConnection Watcher:127.0.0.1:22107/solr got event WatchedEvent state:SyncConnected type:None path:null path:null type:None
[junit4:junit4]   2> 10191 T1063 oascc.ConnectionManager.waitForConnected Client is connected to ZooKeeper
[junit4:junit4]   2> 10192 T1068 oazs.PrepRequestProcessor.pRequest Got user-level KeeperException when processing sessionid:0x13bb576cb8b000c type:create cxid:0x1 zxid:0xa7 txntype:-1 reqpath:n/a Error Path:/solr/overseer Error:KeeperErrorCode = NodeExists for /solr/overseer
[junit4:junit4]   2> 10193 T1068 oazs.PrepRequestProcessor.pRequest Got user-level KeeperException when processing sessionid:0x13bb576cb8b000c type:create cxid:0x2 zxid:0xa8 txntype:-1 reqpath:n/a Error Path:/solr/overseer Error:KeeperErrorCode = NodeExists for /solr/overseer
[junit4:junit4]   2> 10195 T1063 oasc.ZkController.createEphemeralLiveNode Register node as live in ZooKeeper:/live_nodes/127.0.0.1:22126_waso%2Fs
[junit4:junit4]   2> 10196 T1068 oazs.PrepRequestProcessor.pRequest Got user-level KeeperException when processing sessionid:0x13bb576cb8b000c type:delete cxid:0x4 zxid:0xa9 txntype:-1 reqpath:n/a Error Path:/solr/live_nodes/127.0.0.1:22126_waso%2Fs Error:KeeperErrorCode = NoNode for /solr/live_nodes/127.0.0.1:22126_waso%2Fs
[junit4:junit4]   2> 10204 T1063 oascc.SolrZkClient.makePath makePath: /live_nodes/127.0.0.1:22126_waso%2Fs
[junit4:junit4]   2> 10206 T1119 oascc.ZkStateReader$2.process A cluster state change: WatchedEvent state:SyncConnected type:NodeChildrenChanged path:/live_nodes, has occurred - updating... (live nodes size: 4)
[junit4:junit4]   2> 10207 T1085 oascc.ZkStateReader$3.process Updating live nodes... (5)
[junit4:junit4]   2> 10207 T1104 oascc.ZkStateReader$3.process Updating live nodes... (5)
[junit4:junit4]   2> 10207 T1091 oascc.ZkStateReader$3.process Updating live nodes... (5)
[junit4:junit4]   2> 10207 T1134 oascc.ZkStateReader$3.process Updating live nodes... (5)
[junit4:junit4]   2> 10207 T1104 oascc.ZkStateReader$2.process A cluster state change: WatchedEvent state:SyncConnected type:NodeChildrenChanged path:/live_nodes, has occurred - updating... (live nodes size: 5)
[junit4:junit4]   2> 10207 T1085 oascc.ZkStateReader$2.process A cluster state change: WatchedEvent state:SyncConnected type:NodeChildrenChanged path:/live_nodes, has occurred - updating... (live nodes size: 5)
[junit4:junit4]   2> 10208 T1134 oascc.ZkStateReader$2.process A cluster state change: WatchedEvent state:SyncConnected type:NodeChildrenChanged path:/live_nodes, has occurred - updating... (live nodes size: 5)
[junit4:junit4]   2> 10207 T1091 oascc.ZkStateReader$2.process A cluster state change: WatchedEvent state:SyncConnected type:NodeChildrenChanged path:/live_nodes, has occurred - updating... (live nodes size: 5)
[junit4:junit4]   2> 10208 T1119 oascc.ZkStateReader$3.process Updating live nodes... (5)
[junit4:junit4]   2> 10210 T1063 oascc.ZkStateReader.createClusterStateWatchersAndUpdate Updating cluster state from ZooKeeper... 
[junit4:junit4]   2> 10217 T1152 oasc.CoreContainer.create Creating SolrCore 'collection1' using instanceDir: /usr/home/hudson/hudson-slave/workspace/Lucene-Solr-Tests-4.x-java7/solr/build/solr-core/test/J0/./org.apache.solr.cloud.BasicDistributedZkTest-jetty4-1355959169511/collection1
[junit4:junit4]   2> 10218 T1152 oasc.ZkController.createCollectionZkNode Check for collection zkNode:collection1
[junit4:junit4]   2> 10218 T1152 oasc.ZkController.createCollectionZkNode Collection zkNode exists
[junit4:junit4]   2> 10219 T1152 oasc.ZkController.readConfigName Load collection config from:/collections/collection1
[junit4:junit4]   2> 10220 T1152 oasc.SolrResourceLoader.<init> new SolrResourceLoader for directory: '/usr/home/hudson/hudson-slave/workspace/Lucene-Solr-Tests-4.x-java7/solr/build/solr-core/test/J0/./org.apache.solr.cloud.BasicDistributedZkTest-jetty4-1355959169511/collection1/'
[junit4:junit4]   2> 10222 T1152 oasc.SolrResourceLoader.replaceClassLoader Adding 'file:/usr/home/hudson/hudson-slave/workspace/Lucene-Solr-Tests-4.x-java7/solr/build/solr-core/test/J0/org.apache.solr.cloud.BasicDistributedZkTest-jetty4-1355959169511/collection1/lib/README' to classloader
[junit4:junit4]   2> 10222 T1152 oasc.SolrResourceLoader.replaceClassLoader Adding 'file:/usr/home/hudson/hudson-slave/workspace/Lucene-Solr-Tests-4.x-java7/solr/build/solr-core/test/J0/org.apache.solr.cloud.BasicDistributedZkTest-jetty4-1355959169511/collection1/lib/classes/' to classloader
[junit4:junit4]   2> 10281 T1152 oasc.SolrConfig.<init> Using Lucene MatchVersion: LUCENE_41
[junit4:junit4]   2> 10360 T1152 oasc.SolrConfig.<init> Loaded SolrConfig: solrconfig.xml
[junit4:junit4]   2> 10461 T1152 oass.IndexSchema.readSchema Reading Solr Schema
[junit4:junit4]   2> 10471 T1152 oass.IndexSchema.readSchema Schema name=test
[junit4:junit4]   2> 11162 T1152 oass.OpenExchangeRatesOrgProvider.init Initialized with rates=open-exchange-rates.json, refreshInterval=1440.
[junit4:junit4]   2> 11173 T1152 oass.IndexSchema.readSchema default search field in schema is text
[junit4:junit4]   2> 11177 T1152 oass.IndexSchema.readSchema unique key field: id
[junit4:junit4]   2> 11190 T1152 oass.FileExchangeRateProvider.reload Reloading exchange rates from file currency.xml
[junit4:junit4]   2> 11195 T1152 oass.FileExchangeRateProvider.reload Reloading exchange rates from file currency.xml
[junit4:junit4]   2> 11199 T1152 oass.OpenExchangeRatesOrgProvider.reload Reloading exchange rates from open-exchange-rates.json
[junit4:junit4]   2> 11201 T1152 oass.OpenExchangeRatesOrgProvider.reload Reloading exchange rates from open-exchange-rates.json
[junit4:junit4]   2> 11202 T1152 oasc.SolrCore.<init> [collection1] Opening new SolrCore at /usr/home/hudson/hudson-slave/workspace/Lucene-Solr-Tests-4.x-java7/solr/build/solr-core/test/J0/./org.apache.solr.cloud.BasicDistributedZkTest-jetty4-1355959169511/collection1/, dataDir=./org.apache.solr.cloud.BasicDistributedZkTest-1355959159685/jetty4/
[junit4:junit4]   2> 11202 T1152 oasc.JmxMonitoredMap.<init> JMX monitoring is enabled. Adding Solr mbeans to JMX Server: com.sun.jmx.mbeanserver.JmxMBeanServer@4139a82d
[junit4:junit4]   2> 11203 T1152 oasc.SolrCore.initDirectoryFactory solr.NRTCachingDirectoryFactory
[junit4:junit4]   2> 11204 T1152 oasc.CachingDirectoryFactory.get return new directory for /usr/home/hudson/hudson-slave/workspace/Lucene-Solr-Tests-4.x-java7/solr/build/solr-core/test/J0/./org.apache.solr.cloud.BasicDistributedZkTest-1355959159685/jetty4 forceNew:false
[junit4:junit4]   2> 11204 T1152 oasc.CachingDirectoryFactory.close Releasing directory:/usr/home/hudson/hudson-slave/workspace/Lucene-Solr-Tests-4.x-java7/solr/build/solr-core/test/J0/./org.apache.solr.cloud.BasicDistributedZkTest-1355959159685/jetty4
[junit4:junit4]   2> 11205 T1152 oasc.SolrCore.getNewIndexDir New index directory detected: old=null new=./org.apache.solr.cloud.BasicDistributedZkTest-1355959159685/jetty4/index/
[junit4:junit4]   2> 11205 T1152 oasc.SolrCore.initIndex WARNING [collection1] Solr index directory './org.apache.solr.cloud.BasicDistributedZkTest-1355959159685/jetty4/index' doesn't exist. Creating new index...
[junit4:junit4]   2> 11206 T1152 oasc.CachingDirectoryFactory.get return new directory for /usr/home/hudson/hudson-slave/workspace/Lucene-Solr-Tests-4.x-java7/solr/build/solr-core/test/J0/./org.apache.solr.cloud.BasicDistributedZkTest-1355959159685/jetty4/index forceNew:false
[junit4:junit4]   2> 11239 T1152 oasc.SolrDeletionPolicy.onCommit SolrDeletionPolicy.onCommit: commits:num=1
[junit4:junit4]   2> 		commit{dir=RateLimitedDirectoryWrapper(NRTCachingDirectory(org.apache.lucene.store.NIOFSDirectory@/usr/home/hudson/hudson-slave/workspace/Lucene-Solr-Tests-4.x-java7/solr/build/solr-core/test/J0/org.apache.solr.cloud.BasicDistributedZkTest-1355959159685/jetty4/index lockFactory=org.apache.lucene.store.NativeFSLockFactory@1252b4a6; maxCacheMB=48.0 maxMergeSizeMB=4.0)),segFN=segments_1,generation=1,filenames=[segments_1]
[junit4:junit4]   2> 11239 T1152 oasc.SolrDeletionPolicy.updateCommits newest commit = 1[segments_1]
[junit4:junit4]   2> 11240 T1152 oasc.CachingDirectoryFactory.close Releasing directory:/usr/home/hudson/hudson-slave/workspace/Lucene-Solr-Tests-4.x-java7/solr/build/solr-core/test/J0/./org.apache.solr.cloud.BasicDistributedZkTest-1355959159685/jetty4/index
[junit4:junit4]   2> 11240 T1152 oasc.SolrCore.initWriters created xml: solr.XMLResponseWriter
[junit4:junit4]   2> 11242 T1152 oasup.UpdateRequestProcessorChain.init inserting DistributedUpdateProcessorFactory into updateRequestProcessorChain "dedupe"
[junit4:junit4]   2> 11243 T1152 oasup.UpdateRequestProcessorChain.init inserting DistributedUpdateProcessorFactory into updateRequestProcessorChain "dedupe-allfields"
[junit4:junit4]   2> 11243 T1152 oasup.UpdateRequestProcessorChain.init inserting DistributedUpdateProcessorFactory into updateRequestProcessorChain "stored_sig"
[junit4:junit4]   2> 11244 T1152 oasup.UpdateRequestProcessorChain.init inserting DistributedUpdateProcessorFactory into updateRequestProcessorChain "uniq-fields"
[junit4:junit4]   2> 11244 T1152 oasup.UpdateRequestProcessorChain.init inserting DistributedUpdateProcessorFactory into updateRequestProcessorChain "distrib-dup-test-chain-implicit"
[junit4:junit4]   2> 11245 T1152 oasc.RequestHandlers.initHandlersFromConfig adding lazy requestHandler: solr.ReplicationHandler
[junit4:junit4]   2> 11245 T1152 oasc.RequestHandlers.initHandlersFromConfig created /replication: solr.ReplicationHandler
[junit4:junit4]   2> 11246 T1152 oasc.RequestHandlers.initHandlersFromConfig created standard: solr.StandardRequestHandler
[junit4:junit4]   2> 11247 T1152 oasc.RequestHandlers.initHandlersFromConfig created /get: solr.RealTimeGetHandler
[junit4:junit4]   2> 11248 T1152 oasc.RequestHandlers.initHandlersFromConfig created dismax: solr.SearchHandler
[junit4:junit4]   2> 11249 T1152 oasc.RequestHandlers.initHandlersFromConfig created mock: org.apache.solr.core.MockQuerySenderListenerReqHandler
[junit4:junit4]   2> 11249 T1152 oasc.RequestHandlers.initHandlersFromConfig created /admin/: org.apache.solr.handler.admin.AdminHandlers
[junit4:junit4]   2> 11250 T1152 oasc.RequestHandlers.initHandlersFromConfig created defaults: solr.StandardRequestHandler
[junit4:junit4]   2> 11250 T1152 oasc.RequestHandlers.initHandlersFromConfig adding lazy requestHandler: solr.StandardRequestHandler
[junit4:junit4]   2> 11251 T1152 oasc.RequestHandlers.initHandlersFromConfig created lazy: solr.StandardRequestHandler
[junit4:junit4]   2> 11251 T1152 oasc.RequestHandlers.initHandlersFromConfig created /update: solr.UpdateRequestHandler
[junit4:junit4]   2> 11252 T1152 oasc.RequestHandlers.initHandlersFromConfig created /terms: org.apache.solr.handler.component.SearchHandler
[junit4:junit4]   2> 11253 T1152 oasc.RequestHandlers.initHandlersFromConfig created spellCheckCompRH: org.apache.solr.handler.component.SearchHandler
[junit4:junit4]   2> 11254 T1152 oasc.RequestHandlers.initHandlersFromConfig created spellCheckCompRH_Direct: org.apache.solr.handler.component.SearchHandler
[junit4:junit4]   2> 11255 T1152 oasc.RequestHandlers.initHandlersFromConfig created spellCheckWithWordbreak: org.apache.solr.handler.component.SearchHandler
[junit4:junit4]   2> 11256 T1152 oasc.RequestHandlers.initHandlersFromConfig created spellCheckWithWordbreak_Direct: org.apache.solr.handler.component.SearchHandler
[junit4:junit4]   2> 11256 T1152 oasc.RequestHandlers.initHandlersFromConfig created spellCheckCompRH1: org.apache.solr.handler.component.SearchHandler
[junit4:junit4]   2> 11257 T1152 oasc.RequestHandlers.initHandlersFromConfig created mltrh: org.apache.solr.handler.component.SearchHandler
[junit4:junit4]   2> 11258 T1152 oasc.RequestHandlers.initHandlersFromConfig created tvrh: org.apache.solr.handler.component.SearchHandler
[junit4:junit4]   2> 11259 T1152 oasc.RequestHandlers.initHandlersFromConfig created /mlt: solr.MoreLikeThisHandler
[junit4:junit4]   2> 11260 T1152 oasc.RequestHandlers.initHandlersFromConfig created /debug/dump: solr.DumpRequestHandler
[junit4:junit4]   2> 11273 T1152 oashl.XMLLoader.init xsltCacheLifetimeSeconds=60
[junit4:junit4]   2> 11278 T1152 oasc.SolrCore.initDeprecatedSupport WARNING solrconfig.xml uses deprecated <admin/gettableFiles>, Please update your config to use the ShowFileRequestHandler.
[junit4:junit4]   2> 11280 T1152 oasc.SolrCore.initDeprecatedSupport WARNING adding ShowFileRequestHandler with hidden files: [SCHEMA.XML, OLD_SYNONYMS.TXT, STOPWORDS.TXT, PROTWORDS.TXT, OPEN-EXCHANGE-RATES.JSON, SYNONYMS.TXT, CURRENCY.XML, MAPPING-ISOLATIN1ACCENT.TXT]
[junit4:junit4]   2> 11282 T1152 oasc.CachingDirectoryFactory.close Releasing directory:/usr/home/hudson/hudson-slave/workspace/Lucene-Solr-Tests-4.x-java7/solr/build/solr-core/test/J0/./org.apache.solr.cloud.BasicDistributedZkTest-1355959159685/jetty4
[junit4:junit4]   2> 11284 T1152 oass.SolrIndexSearcher.<init> Opening Searcher@7d0688b8 main
[junit4:junit4]   2> 11285 T1152 oasu.CommitTracker.<init> Hard AutoCommit: disabled
[junit4:junit4]   2> 11286 T1152 oasu.CommitTracker.<init> Soft AutoCommit: disabled
[junit4:junit4]   2> 11286 T1152 oashc.SpellCheckComponent.inform Initializing spell checkers
[junit4:junit4]   2> 11294 T1152 oass.DirectSolrSpellChecker.init init: {name=direct,classname=DirectSolrSpellChecker,field=lowerfilt,minQueryLength=3}
[junit4:junit4]   2> 11346 T1153 oasc.SolrCore.registerSearcher [collection1] Registered new searcher Searcher@7d0688b8 main{StandardDirectoryReader(segments_1:1)}
[junit4:junit4]   2> 11350 T1152 oasc.ZkController.publish publishing core=collection1 state=down
[junit4:junit4]   2> 11351 T1152 oasc.ZkController.publish numShards not found on descriptor - reading it from system property
[junit4:junit4]   2> 11528 T1086 oascc.ZkStateReader.updateClusterState Updating cloud state from ZooKeeper... 
[junit4:junit4]   2> 11529 T1086 oasc.Overseer$ClusterStateUpdater.updateState Update state numShards=2 message={
[junit4:junit4]   2> 	  "operation":"state",
[junit4:junit4]   2> 	  "numShards":"2",
[junit4:junit4]   2> 	  "shard":null,
[junit4:junit4]   2> 	  "roles":null,
[junit4:junit4]   2> 	  "state":"down",
[junit4:junit4]   2> 	  "core":"collection1",
[junit4:junit4]   2> 	  "collection":"collection1",
[junit4:junit4]   2> 	  "node_name":"127.0.0.1:22126_waso%2Fs",
[junit4:junit4]   2> 	  "base_url":"http://127.0.0.1:22126/waso/s"}
[junit4:junit4]   2> 11530 T1086 oasc.Overseer$ClusterStateUpdater.updateState Collection already exists with numShards=2
[junit4:junit4]   2> 11530 T1086 oasc.Overseer$ClusterStateUpdater.updateState Assigning new node to shard shard=shard2
[junit4:junit4]   2> 11548 T1119 oascc.ZkStateReader$2.process A cluster state change: WatchedEvent state:SyncConnected type:NodeDataChanged path:/clusterstate.json, has occurred - updating... (live nodes size: 5)
[junit4:junit4]   2> 11548 T1091 oascc.ZkStateReader$2.process A cluster state change: WatchedEvent state:SyncConnected type:NodeDataChanged path:/clusterstate.json, has occurred - updating... (live nodes size: 5)
[junit4:junit4]   2> 11548 T1085 oascc.ZkStateReader$2.process A cluster state change: WatchedEvent state:SyncConnected type:NodeDataChanged path:/clusterstate.json, has occurred - updating... (live nodes size: 5)
[junit4:junit4]   2> 11548 T1134 oascc.ZkStateReader$2.process A cluster state change: WatchedEvent state:SyncConnected type:NodeDataChanged path:/clusterstate.json, has occurred - updating... (live nodes size: 5)
[junit4:junit4]   2> 11548 T1104 oascc.ZkStateReader$2.process A cluster state change: WatchedEvent state:SyncConnected type:NodeDataChanged path:/clusterstate.json, has occurred - updating... (live nodes size: 5)
[junit4:junit4]   2> 11549 T1151 oascc.ZkStateReader$2.process A cluster state change: WatchedEvent state:SyncConnected type:NodeDataChanged path:/clusterstate.json, has occurred - updating... (live nodes size: 5)
[junit4:junit4]   2> 11853 T1152 oasc.CoreContainer.registerCore registering core: collection1
[junit4:junit4]   2> 11853 T1152 oasc.ZkController.register Register replica - core:collection1 address:http://127.0.0.1:22126/waso/s collection:collection1 shard:shard2
[junit4:junit4]   2> 11863 T1152 oasc.ZkController.register We are http://127.0.0.1:22126/waso/s/collection1/ and leader is http://127.0.0.1:22118/waso/s/collection1/
[junit4:junit4]   2> 11863 T1152 oasc.ZkController.register No LogReplay needed for core=collection1 baseURL=http://127.0.0.1:22126/waso/s
[junit4:junit4]   2> 11863 T1152 oasc.ZkController.checkRecovery Core needs to recover:collection1
[junit4:junit4]   2> 11864 T1152 oasu.DefaultSolrCoreState.doRecovery Running recovery - first canceling any ongoing recovery
[junit4:junit4]   2> ASYNC  NEW_CORE C144 name=collection1 org.apache.solr.core.SolrCore@3b74ae76 url=http://127.0.0.1:22126/waso/s/collection1 node=127.0.0.1:22126_waso%2Fs C144_STATE=coll:collection1 core:collection1 props:{shard=null, roles=null, state=down, core=collection1, collection=collection1, node_name=127.0.0.1:22126_waso%2Fs, base_url=http://127.0.0.1:22126/waso/s}
[junit4:junit4]   2> 11864 T1154 C144 P22126 oasc.RecoveryStrategy.run Starting recovery process.  core=collection1 recoveringAfterStartup=true
[junit4:junit4]   2> 11865 T1154 C144 P22126 oasc.RecoveryStrategy.doRecovery ###### startupVersions=[]
[junit4:junit4]   2> 11865 T1152 oascc.ZkStateReader.updateClusterState Updating cloud state from ZooKeeper... 
[junit4:junit4]   2> 11865 T1154 C144 P22126 oasc.ZkController.publish publishing core=collection1 state=recovering
[junit4:junit4]   2> 11865 T1154 C144 P22126 oasc.ZkController.publish numShards not found on descriptor - reading it from system property
[junit4:junit4]   2> 11866 T1063 oass.SolrDispatchFilter.init user.dir=/usr/home/hudson/hudson-slave/workspace/Lucene-Solr-Tests-4.x-java7/solr/build/solr-core/test/J0
[junit4:junit4]   2> 11867 T1154 C144 P22126 oasc.RecoveryStrategy.doRecovery Attempting to PeerSync from http://127.0.0.1:22118/waso/s/collection1/ core=collection1 - recoveringAfterStartup=true
[junit4:junit4]   2> 11867 T1063 oass.SolrDispatchFilter.init SolrDispatchFilter.init() done
[junit4:junit4]   2> 11867 T1154 C144 P22126 oasu.PeerSync.sync PeerSync: core=collection1 url=http://127.0.0.1:22126/waso/s START replicas=[http://127.0.0.1:22118/waso/s/collection1/] nUpdates=100
[junit4:junit4]   2> 11867 T1063 oascsi.HttpClientUtil.createClient Creating new http client, config:maxConnections=128&maxConnectionsPerHost=32&followRedirects=false
[junit4:junit4]   2> 11868 T1154 C144 P22126 oasu.PeerSync.sync WARNING no frame of reference to tell of we've missed updates
[junit4:junit4]   2> 11869 T1154 C144 P22126 oasc.RecoveryStrategy.doRecovery PeerSync Recovery was not successful - trying replication. core=collection1
[junit4:junit4]   2> 11869 T1154 C144 P22126 oasc.RecoveryStrategy.doRecovery Starting Replication Recovery. core=collection1
[junit4:junit4]   2> 11869 T1154 C144 P22126 oascsi.HttpClientUtil.createClient Creating new http client, config:maxConnections=128&maxConnectionsPerHost=32&followRedirects=false
[junit4:junit4]   2> ASYNC  NEW_CORE C145 name=collection1 org.apache.solr.core.SolrCore@21335e80 url=http://127.0.0.1:22118/waso/s/collection1 node=127.0.0.1:22118_waso%2Fs C145_STATE=coll:collection1 core:collection1 props:{shard=shard2, roles=null, state=active, core=collection1, collection=collection1, node_name=127.0.0.1:22118_waso%2Fs, base_url=http://127.0.0.1:22118/waso/s, leader=true}
[junit4:junit4]   2> 11879 T1109 C145 P22118 REQ /get {distrib=false&qt=/get&wt=javabin&version=2&getVersions=100} status=0 QTime=0 
[junit4:junit4]   2> 11884 T1063 oascc.ZkStateReader.updateClusterState Updating cloud state from ZooKeeper... 
[junit4:junit4]   2> 11887 T1063 oasc.AbstractDistribZkTestBase.waitForRecoveriesToFinish Wait for recoveries to finish - collection: collection1 failOnTimeout:true timeout (sec):540
[junit4:junit4]   2> 11887 T1063 oascc.ZkStateReader.updateClusterState Updating cloud state from ZooKeeper... 
[junit4:junit4]   2> 12110 T1086 oascc.ZkStateReader.updateClusterState Updating cloud state from ZooKeeper... 
[junit4:junit4]   2> 12111 T1086 oasc.Overseer$ClusterStateUpdater.updateState Update state numShards=2 message={
[junit4:junit4]   2> 	  "operation":"state",
[junit4:junit4]   2> 	  "numShards":"2",
[junit4:junit4]   2> 	  "shard":"shard2",
[junit4:junit4]   2> 	  "roles":null,
[junit4:junit4]   2> 	  "state":"recovering",
[junit4:junit4]   2> 	  "core":"collection1",
[junit4:junit4]   2> 	  "collection":"collection1",
[junit4:junit4]   2> 	  "node_name":"127.0.0.1:22126_waso%2Fs",
[junit4:junit4]   2> 	  "base_url":"http://127.0.0.1:22126/waso/s"}
[junit4:junit4]   2> 12131 T1085 oascc.ZkStateReader$2.process A cluster state change: WatchedEvent state:SyncConnected type:NodeDataChanged path:/clusterstate.json, has occurred - updating... (live nodes size: 5)
[junit4:junit4]   2> 12131 T1134 oascc.ZkStateReader$2.process A cluster state change: WatchedEvent state:SyncConnected type:NodeDataChanged path:/clusterstate.json, has occurred - updating... (live nodes size: 5)
[junit4:junit4]   2> 12131 T1151 oascc.ZkStateReader$2.process A cluster state change: WatchedEvent state:SyncConnected type:NodeDataChanged path:/clusterstate.json, has occurred - updating... (live nodes size: 5)
[junit4:junit4]   2> 12131 T1091 oascc.ZkStateReader$2.process A cluster state change: WatchedEvent state:SyncConnected type:NodeDataChanged path:/clusterstate.json, has occurred - updating... (live nodes size: 5)
[junit4:junit4]   2> 12131 T1104 oascc.ZkStateReader$2.process A cluster state change: WatchedEvent state:SyncConnected type:NodeDataChanged path:/clusterstate.json, has occurred - updating... (live nodes size: 5)
[junit4:junit4]   2> 12131 T1119 oascc.ZkStateReader$2.process A cluster state change: WatchedEvent state:SyncConnected type:NodeDataChanged path:/clusterstate.json, has occurred - updating... (live nodes size: 5)
[junit4:junit4]   2>  C142_STATE=coll:collection1 core:collection1 props:{shard=shard1, roles=null, state=recovering, core=collection1, collection=collection1, node_name=127.0.0.1:22121_waso%2Fs, base_url=http://127.0.0.1:22121/waso/s}
[junit4:junit4]   2> 12878 T1137 C142 P22121 oasc.RecoveryStrategy.doRecovery Begin buffering updates. core=collection1
[junit4:junit4]   2> 12878 T1137 C142 P22121 oasu.UpdateLog.bufferUpdates Starting to buffer updates. FSUpdateLog{state=ACTIVE, tlog=null}
[junit4:junit4]   2> 12878 T1137 C142 P22121 oasc.RecoveryStrategy.replicate Attempting to replicate from http://127.0.0.1:22115/waso/s/collection1/. core=collection1
[junit4:junit4]   2> 12879 T1137 C142 P22121 oascsi.HttpClientUtil.createClient Creating new http client, config:maxConnections=128&maxConnectionsPerHost=32&followRedirects=false
[junit4:junit4]   2> 12889 T1096 C143 P22115 oasu.DirectUpdateHandler2.commit start commit{flags=0,_version_=0,optimize=false,openSearcher=false,waitSearcher=true,expungeDeletes=false,softCommit=false}
[junit4:junit4]   2> 12889 T1063 oascc.ZkStateReader.updateClusterState Updating cloud state from ZooKeeper... 
[junit4:junit4]   2> 12890 T1096 C143 P22115 oasc.CachingDirectoryFactory.close Releasing directory:/usr/home/hudson/hudson-slave/workspace/Lucene-Solr-Tests-4.x-java7/solr/build/solr-core/test/J0/./org.apache.solr.cloud.BasicDistributedZkTest-1355959159685/jetty1
[junit4:junit4]   2> 12894 T1096 C143 P22115 oasc.SolrDeletionPolicy.onInit SolrDeletionPolicy.onInit: commits:num=1
[junit4:junit4]   2> 		commit{dir=RateLimitedDirectoryWrapper(NRTCachingDirectory(org.apache.lucene.store.NIOFSDirectory@/usr/home/hudson/hudson-slave/workspace/Lucene-Solr-Tests-4.x-java7/solr/build/solr-core/test/J0/org.apache.solr.cloud.BasicDistributedZkTest-1355959159685/jetty1/index lockFactory=org.apache.lucene.store.NativeFSLockFactory@a405ea4; maxCacheMB=48.0 maxMergeSizeMB=4.0)),segFN=segments_1,generation=1,filenames=[segments_1]
[junit4:junit4]   2> 12894 T1096 C143 P22115 oasc.SolrDeletionPolicy.updateCommits newest commit = 1[segments_1]
[junit4:junit4]   2> 12925 T1096 C143 P22115 oasc.SolrDeletionPolicy.onCommit SolrDeletionPolicy.onCommit: commits:num=2
[junit4:junit4]   2> 		commit{dir=RateLimitedDirectoryWrapper(NRTCachingDirectory(org.apache.lucene.store.NIOFSDirectory@/usr/home/hudson/hudson-slave/workspace/Lucene-Solr-Tests-4.x-java7/solr/build/solr-core/test/J0/org.apache.solr.cloud.BasicDistributedZkTest-1355959159685/jetty1/index lockFactory=org.apache.lucene.store.NativeFSLockFactory@a405ea4; maxCacheMB=48.0 maxMergeSizeMB=4.0)),segFN=segments_1,generation=1,filenames=[segments_1]
[junit4:junit4]   2> 		commit{dir=RateLimitedDirectoryWrapper(NRTCachingDirectory(org.apache.lucene.store.NIOFSDirectory@/usr/home/hudson/hudson-slave/workspace/Lucene-Solr-Tests-4.x-java7/solr/build/solr-core/test/J0/org.apache.solr.cloud.BasicDistributedZkTest-1355959159685/jetty1/index lockFactory=org.apache.lucene.store.NativeFSLockFactory@a405ea4; maxCacheMB=48.0 maxMergeSizeMB=4.0)),segFN=segments_2,generation=2,filenames=[segments_2]
[junit4:junit4]   2> 12925 T1096 C143 P22115 oasc.SolrDeletionPolicy.updateCommits newest commit = 2[segments_2]
[junit4:junit4]   2> 12926 T1096 C143 P22115 oasc.CachingDirectoryFactory.close Releasing directory:/usr/home/hudson/hudson-slave/workspace/Lucene-Solr-Tests-4.x-java7/solr/build/solr-core/test/J0/./org.apache.solr.cloud.BasicDistributedZkTest-1355959159685/jetty1
[junit4:junit4]   2> 12926 T1096 C143 P22115 oass.SolrIndexSearcher.<init> Opening Searcher@2b318063 realtime
[junit4:junit4]   2> 12927 T1096 C143 P22115 oasu.DirectUpdateHandler2.commit end_commit_flush
[junit4:junit4]   2> 12927 T1096 C143 P22115 /update {waitSearcher=true&openSearcher=false&commit=true&commit_end_point=true&wt=javabin&softCommit=false&version=2} {commit=} 0 38
[junit4:junit4]   2> 12929 T1137 C142 P22121 oash.ReplicationHandler.inform Commits will be reserved for  10000
[junit4:junit4]   2> 12929 T1137 C142 P22121 oash.SnapPuller.<init>  No value set for 'pollInterval'. Timer Task not started.
[junit4:junit4]   2> 12932 T1097 C143 P22115 oash.ReplicationHandler.inform Commits will be reserved for  10000
[junit4:junit4]   2> 12932 T1097 C143 P22115 REQ /replication {command=indexversion&wt=javabin&qt=/replication&version=2} status=0 QTime=2 
[junit4:junit4]   2> 12933 T1137 C142 P22121 oash.SnapPuller.fetchLatestIndex Master's generation: 2
[junit4:junit4]   2> 12933 T1137 C142 P22121 oash.SnapPuller.fetchLatestIndex Slave's generation: 1
[junit4:junit4]   2> 12933 T1137 C142 P22121 oash.SnapPuller.fetchLatestIndex Starting replication process
[junit4:junit4]   2> 12936 T1097 C143 P22115 oasc.CachingDirectoryFactory.close Releasing directory:/usr/home/hudson/hudson-slave/workspace/Lucene-Solr-Tests-4.x-java7/solr/build/solr-core/test/J0/./org.apache.solr.cloud.BasicDistributedZkTest-1355959159685/jetty1
[junit4:junit4]   2> 12937 T1097 C143 P22115 oasc.CachingDirectoryFactory.close Releasing directory:/usr/home/hudson/hudson-slave/workspace/Lucene-Solr-Tests-4.x-java7/solr/build/solr-core/test/J0/./org.apache.solr.cloud.BasicDistributedZkTest-1355959159685/jetty1/index
[junit4:junit4]   2> 12937 T1097 C143 P22115 REQ /replication {command=filelist&generation=2&wt=javabin&qt=/replication&version=2} status=0 QTime=1 
[junit4:junit4]   2> 12938 T1137 C142 P22121 oash.SnapPuller.fetchLatestIndex Number of files in latest index in master: 1
[junit4:junit4]   2> 12939 T1137 C142 P22121 oasc.CachingDirectoryFactory.get return new directory for /usr/home/hudson/hudson-slave/workspace/Lucene-Solr-Tests-4.x-java7/solr/build/solr-core/test/J0/./org.apache.solr.cloud.BasicDistributedZkTest-1355959159685/jetty3/index.20121220001932616 forceNew:false
[junit4:junit4]   2> 12940 T1137 C142 P22121 oasc.CachingDirectoryFactory.close Releasing directory:/usr/home/hudson/hudson-slave/workspace/Lucene-Solr-Tests-4.x-java7/solr/build/solr-core/test/J0/./org.apache.solr.cloud.BasicDistributedZkTest-1355959159685/jetty3
[junit4:junit4]   2> 12940 T1137 C142 P22121 oash.SnapPuller.fetchLatestIndex Starting download to RateLimitedDirectoryWrapper(NRTCachingDirectory(org.apache.lucene.store.NIOFSDirectory@/usr/home/hudson/hudson-slave/workspace/Lucene-Solr-Tests-4.x-java7/solr/build/solr-core/test/J0/org.apache.solr.cloud.BasicDistributedZkTest-1355959159685/jetty3/index.20121220001932616 lockFactory=org.apache.lucene.store.NativeFSLockFactory@21d71918; maxCacheMB=48.0 maxMergeSizeMB=4.0)) fullCopy=true
[junit4:junit4]   2> 12944 T1097 C143 P22115 REQ /replication {file=segments_2&command=filecontent&checksum=true&generation=2&qt=/replication&wt=filestream} status=0 QTime=0 
[junit4:junit4]   2> 12945 T1137 C142 P22121 oasc.CachingDirectoryFactory.close Releasing directory:/usr/home/hudson/hudson-slave/workspace/Lucene-Solr-Tests-4.x-java7/solr/build/solr-core/test/J0/./org.apache.solr.cloud.BasicDistributedZkTest-1355959159685/jetty3/index
[junit4:junit4]   2> 12946 T1137 C142 P22121 oash.SnapPuller.fetchLatestIndex Total time taken for download : 0 secs
[junit4:junit4]   2> 12946 T1137 C142 P22121 oash.SnapPuller.modifyIndexProps New index installed. Updating index properties... index=index.20121220001932616
[junit4:junit4]   2> 12947 T1137 C142 P22121 oasc.CachingDirectoryFactory.close Releasing directory:/usr/home/hudson/hudson-slave/workspace/Lucene-Solr-Tests-4.x-java7/solr/build/solr-core/test/J0/./org.apache.solr.cloud.BasicDistributedZkTest-1355959159685/jetty3
[junit4:junit4]   2> 12947 T1137 C142 P22121 oasc.CachingDirectoryFactory.close Releasing directory:/usr/home/hudson/hudson-slave/workspace/Lucene-Solr-Tests-4.x-java7/solr/build/solr-core/test/J0/./org.apache.solr.cloud.BasicDistributedZkTest-1355959159685/jetty3
[junit4:junit4]   2> 12947 T1137 C142 P22121 oasc.SolrCore.getNewIndexDir New index directory detected: old=./org.apache.solr.cloud.BasicDistributedZkTest-1355959159685/jetty3/index/ new=./org.apache.solr.cloud.BasicDistributedZkTest-1355959159685/jetty3/index.20121220001932616
[junit4:junit4]   2> 12950 T1137 C142 P22121 oasc.SolrDeletionPolicy.onInit SolrDeletionPolicy.onInit: commits:num=1
[junit4:junit4]   2> 		commit{dir=RateLimitedDirectoryWrapper(NRTCachingDirectory(org.apache.lucene.store.NIOFSDirectory@/usr/home/hudson/hudson-slave/workspace/Lucene-Solr-Tests-4.x-java7/solr/build/solr-core/test/J0/org.apache.solr.cloud.BasicDistributedZkTest-1355959159685/jetty3/index.20121220001932616 lockFactory=org.apache.lucene.store.NativeFSLockFactory@21d71918; maxCacheMB=48.0 maxMergeSizeMB=4.0)),segFN=segments_2,generation=2,filenames=[segments_2]
[junit4:junit4]   2> 12950 T1137 C142 P22121 oasc.SolrDeletionPolicy.updateCommits newest commit = 2[segments_2]
[junit4:junit4]   2> 12951 T1137 C142 P22121 oasc.CachingDirectoryFactory.close Releasing directory:/usr/home/hudson/hudson-slave/workspace/Lucene-Solr-Tests-4.x-java7/solr/build/solr-core/test/J0/./org.apache.solr.cloud.BasicDistributedZkTest-1355959159685/jetty3
[junit4:junit4]   2> 12951 T1137 C142 P22121 oasu.DefaultSolrCoreState.newIndexWriter Creating new IndexWriter...
[junit4:junit4]   2> 12951 T1137 C142 P22121 oasu.DefaultSolrCoreState.newIndexWriter Waiting until IndexWriter is unused... core=collection1
[junit4:junit4]   2> 12952 T1137 C142 P22121 oasu.DefaultSolrCoreState.newIndexWriter Rollback old IndexWriter... core=collection1
[junit4:junit4]   2> 12952 T1137 C142 P22121 oasc.CachingDirectoryFactory.close Releasing directory:/usr/home/hudson/hudson-slave/workspace/Lucene-Solr-Tests-4.x-java7/solr/build/solr-core/test/J0/./org.apache.solr.cloud.BasicDistributedZkTest-1355959159685/jetty3/index.20121220001932616
[junit4:junit4]   2> 12953 T1137 C142 P22121 oasc.CachingDirectoryFactory.close Releasing directory:/usr/home/hudson/hudson-slave/workspace/Lucene-Solr-Tests-4.x-java7/solr/build/solr-core/test/J0/./org.apache.solr.cloud.BasicDistributedZkTest-1355959159685/jetty3
[junit4:junit4]   2> 12955 T1137 C142 P22121 oasc.SolrDeletionPolicy.onInit SolrDeletionPolicy.onInit: commits:num=1
[junit4:junit4]   2> 		commit{dir=RateLimitedDirectoryWrapper(NRTCachingDirectory(org.apache.lucene.store.NIOFSDirectory@/usr/home/hudson/hudson-slave/workspace/Lucene-Solr-Tests-4.x-java7/solr/build/solr-core/test/J0/org.apache.solr.cloud.BasicDistributedZkTest-1355959159685/jetty3/index.20121220001932616 lockFactory=org.apache.lucene.store.NativeFSLockFactory@21d71918; maxCacheMB=48.0 maxMergeSizeMB=4.0)),segFN=segments_2,generation=2,filenames=[segments_2]
[junit4:junit4]   2> 12955 T1137 C142 P22121 oasc.SolrDeletionPolicy.updateCommits newest commit = 2[segments_2]
[junit4:junit4]   2> 12956 T1137 C142 P22121 oasu.DefaultSolrCoreState.newIndexWriter New IndexWriter is ready to be used.
[junit4:junit4]   2> 12956 T1137 C142 P22121 oasc.CachingDirectoryFactory.close Releasing directory:/usr/home/hudson/hudson-slave/workspace/Lucene-Solr-Tests-4.x-java7/solr/build/solr-core/test/J0/./org.apache.solr.cloud.BasicDistributedZkTest-1355959159685/jetty3
[junit4:junit4]   2> 12956 T1137 C142 P22121 oass.SolrIndexSearcher.<init> Opening Searcher@5ff492af main
[junit4:junit4]   2> 12958 T1136 oasc.SolrCore.registerSearcher [collection1] Registered new searcher Searcher@5ff492af main{StandardDirectoryReader(segments_2:1:nrt)}
[junit4:junit4]   2> 12959 T1136 oasc.CachingDirectoryFactory.close Releasing directory:/usr/home/hudson/hudson-slave/workspace/Lucene-Solr-Tests-4.x-java7/solr/build/solr-core/test/J0/./org.apache.solr.cloud.BasicDistributedZkTest-1355959159685/jetty3/index
[junit4:junit4]   2> 12959 T1137 C142 P22121 oasu.DirectUpdateHandler2.commit start commit{flags=0,_version_=0,optimize=false,openSearcher=false,waitSearcher=false,expungeDeletes=false,softCommit=false}
[junit4:junit4]   2> 12962 T1137 C142 P22121 oasc.SolrDeletionPolicy.onCommit SolrDeletionPolicy.onCommit: commits:num=2
[junit4:junit4]   2> 		commit{dir=RateLimitedDirectoryWrapper(NRTCachingDirectory(org.apache.lucene.store.NIOFSDirectory@/usr/home/hudson/hudson-slave/workspace/Lucene-Solr-Tests-4.x-java7/solr/build/solr-core/test/J0/org.apache.solr.cloud.BasicDistributedZkTest-1355959159685/jetty3/index.20121220001932616 lockFactory=org.apache.lucene.store.NativeFSLockFactory@21d71918; maxCacheMB=48.0 maxMergeSizeMB=4.0)),segFN=segments_2,generation=2,filenames=[segments_2]
[junit4:junit4]   2> 		commit{dir=RateLimitedDirectoryWrapper(NRTCachingDirectory(org.apache.lucene.store.NIOFSDirectory@/usr/home/hudson/hudson-slave/workspace/Lucene-Solr-Tests-4.x-java7/solr/build/solr-core/test/J0/org.apache.solr.cloud.BasicDistributedZkTest-1355959159685/jetty3/index.20121220001932616 lockFactory=org.apache.lucene.store.NativeFSLockFactory@21d71918; maxCacheMB=48.0 maxMergeSizeMB=4.0)),segFN=segments_3,generation=3,filenames=[segments_3]
[junit4:junit4]   2> 12962 T1137 C142 P22121 oasc.SolrDeletionPolicy.updateCommits newest commit = 3[segments_3]
[junit4:junit4]   2> 12963 T1137 C142 P22121 oasc.CachingDirectoryFactory.close Releasing directory:/usr/home/hudson/hudson-slave/workspace/Lucene-Solr-Tests-4.x-java7/solr/build/solr-core/test/J0/./org.apache.solr.cloud.BasicDistributedZkTest-1355959159685/jetty3
[junit4:junit4]   2> 12963 T1137 C142 P22121 oasu.DirectUpdateHandler2.commit end_commit_flush
[junit4:junit4]   2> 12963 T1137 C142 P22121 oasc.CachingDirectoryFactory.close Releasing directory:/usr/home/hudson/hudson-slave/workspace/Lucene-Solr-Tests-4.x-java7/solr/build/solr-core/test/J0/./org.apache.solr.cloud.BasicDistributedZkTest-1355959159685/jetty3/index.20121220001932616
[junit4:junit4]   2> 12964 T1137 C142 P22121 oasc.CachingDirectoryFactory.close Releasing directory:/usr/home/hudson/hudson-slave/workspace/Lucene-Solr-Tests-4.x-java7/solr/build/solr-core/test/J0/./org.apache.solr.cloud.BasicDistributedZkTest-1355959159685/jetty3/index
[junit4:junit4]   2> 12964 T1137 C142 P22121 oasc.RecoveryStrategy.replay No replay needed. core=collection1
[junit4:junit4]   2> 12964 T1137 C142 P22121 oasc.RecoveryStrategy.doRecovery Replication Recovery was successful - registering as Active. core=collection1
[junit4:junit4]   2> 12964 T1137 C142 P22121 oasc.ZkController.publish publishing core=collection1 state=active
[junit4:junit4]   2> 12964 T1137 C142 P22121 oasc.ZkController.publish numShards not found on descriptor - reading it from system property
[junit4:junit4]   2> 12966 T1137 C142 P22121 oasc.RecoveryStrategy.doRecovery Finished recovery process. core=collection1
[junit4:junit4]   2> 13146 T1086 oascc.ZkStateReader.updateClusterState Updating cloud state from ZooKeeper... 
[junit4:junit4]   2> 13147 T1086 oasc.Overseer$ClusterStateUpdater.updateState Update state numShards=2 message={
[junit4:junit4]   2> 	  "operation":"state",
[junit4:junit4]   2> 	  "numShards":"2",
[junit4:junit4]   2> 	  "shard":"shard1",
[junit4:junit4]   2> 	  "roles":null,
[junit4:junit4]   2> 	  "state":"active",
[junit4:junit4]   2> 	  "core":"collection1",
[junit4:junit4]   2> 	  "collection":"collection1",
[junit4:junit4]   2> 	  "node_name":"127.0.0.1:22121_waso%2Fs",
[junit4:junit4]   2> 	  "base_url":"http://127.0.0.1:22121/waso/s"}
[junit4:junit4]   2> 13159 T1085 oascc.ZkStateReader$2.process A cluster state change: WatchedEvent state:SyncConnected type:NodeDataChanged path:/clusterstate.json, has occurred - updating... (live nodes size: 5)
[junit4:junit4]   2> 13159 T1104 oascc.ZkStateReader$2.process A cluster state change: WatchedEvent state:SyncConnected type:NodeDataChanged path:/clusterstate.json, has occurred - updating... (live nodes size: 5)
[junit4:junit4]   2> 13159 T1151 oascc.ZkStateReader$2.process A cluster state change: WatchedEvent state:SyncConnected type:NodeDataChanged path:/clusterstate.json, has occurred - updating... (live nodes size: 5)
[junit4:junit4]   2> 13159 T1091 oascc.ZkStateReader$2.process A cluster state change: WatchedEvent state:SyncConnected type:NodeDataChanged path:/clusterstate.json, has occurred - updating... (live nodes size: 5)
[junit4:junit4]   2> 13159 T1134 oascc.ZkStateReader$2.process A cluster state change: WatchedEvent state:SyncConnected type:NodeDataChanged path:/clusterstate.json, has occurred - updating... (live nodes size: 5)
[junit4:junit4]   2> 13159 T1119 oascc.ZkStateReader$2.process A cluster state change: WatchedEvent state:SyncConnected type:NodeDataChanged path:/clusterstate.json, has occurred - updating... (live nodes size: 5)
[junit4:junit4]   2> 13892 T1063 oascc.ZkStateReader.updateClusterState Updating cloud state from ZooKeeper... 
[junit4:junit4]   2>  C144_STATE=coll:collection1 core:collection1 props:{shard=shard2, roles=null, state=recovering, core=collection1, collection=collection1, node_name=127.0.0.1:22126_waso%2Fs, base_url=http://127.0.0.1:22126/waso/s}
[junit4:junit4]   2> 14888 T1154 C144 P22126 oasc.RecoveryStrategy.doRecovery Begin buffering updates. core=collection1
[junit4:junit4]   2> 14888 T1154 C144 P22126 oasu.UpdateLog.bufferUpdates Starting to buffer updates. FSUpdateLog{state=ACTIVE, tlog=null}
[junit4:junit4]   2> 14888 T1154 C144 P22126 oasc.RecoveryStrategy.replicate Attempting to replicate from http://127.0.0.1:22118/waso/s/collection1/. core=collection1
[junit4:junit4]   2> 14889 T1154 C144 P22126 oascsi.HttpClientUtil.createClient Creating new http client, config:maxConnections=128&maxConnectionsPerHost=32&followRedirects=false
[junit4:junit4]   2> 14895 T1063 oascc.ZkStateReader.updateClusterState Updating cloud state from ZooKeeper... 
[junit4:junit4]   2> 14904 T1111 C145 P22118 oasu.DirectUpdateHandler2.commit start commit{flags=0,_version_=0,optimize=false,openSearcher=false,waitSearcher=true,expungeDeletes=false,softCommit=false}
[junit4:junit4]   2> 14905 T1111 C145 P22118 oasc.CachingDirectoryFactory.close Releasing directory:/usr/home/hudson/hudson-slave/workspace/Lucene-Solr-Tests-4.x-java7/solr/build/solr-core/test/J0/./org.apache.solr.cloud.BasicDistributedZkTest-1355959159685/jetty2
[junit4:junit4]   2> 14910 T1111 C145 P22118 oasc.SolrDeletionPolicy.onInit SolrDeletionPolicy.onInit: commits:num=1
[junit4:junit4]   2> 		commit{dir=RateLimitedDirectoryWrapper(NRTCachingDirectory(org.apache.lucene.store.NIOFSDirectory@/usr/home/hudson/hudson-slave/workspace/Lucene-Solr-Tests-4.x-java7/solr/build/solr-core/test/J0/org.apache.solr.cloud.BasicDistributedZkTest-1355959159685/jetty2/index lockFactory=org.apache.lucene.store.NativeFSLockFactory@5e542efc; maxCacheMB=48.0 maxMergeSizeMB=4.0)),segFN=segments_1,generation=1,filenames=[segments_1]
[junit4:junit4]   2> 14910 T1111 C145 P22118 oasc.SolrDeletionPolicy.updateCommits newest commit = 1[segments_1]
[junit4:junit4]   2> 14915 T1111 C145 P22118 oasc.SolrDeletionPolicy.onCommit SolrDeletionPolicy.onCommit: commits:num=2
[junit4:junit4]   2> 		commit{dir=RateLimitedDirectoryWrapper(NRTCachingDirectory(org.apache.lucene.store.NIOFSDirectory@/usr/home/hudson/hudson-slave/workspace/Lucene-Solr-Tests-4.x-java7/solr/build/solr-core/test/J0/org.apache.solr.cloud.BasicDistributedZkTest-1355959159685/jetty2/index lockFactory=org.apache.lucene.store.NativeFSLockFactory@5e542efc; maxCacheMB=48.0 maxMergeSizeMB=4.0)),segFN=segments_1,generation=1,filenames=[segments_1]
[junit4:junit4]   2> 		commit{dir=RateLimitedDirectoryWrapper(NRTCachingDirectory(org.apache.lucene.store.NIOFSDirectory@/usr/home/hudson/hudson-slave/workspace/Lucene-Solr-Tests-4.x-java7/solr/build/solr-core/test/J0/org.apache.solr.cloud.BasicDistributedZkTest-1355959159685/jetty2/index lockFactory=org.apache.lucene.store.NativeFSLockFactory@5e542efc; maxCacheMB=48.0 maxMergeSizeMB=4.0)),segFN=segments_2,generation=2,filenames=[segments_2]
[junit4:junit4]   2> 14915 T1111 C145 P22118 oasc.SolrDeletionPolicy.updateCommits newest commit = 2[segments_2]
[junit4:junit4]   2> 14917 T1111 C145 P22118 oasc.CachingDirectoryFactory.close Releasing directory:/usr/home/hudson/hudson-slave/workspace/Lucene-Solr-Tests-4.x-java7/solr/build/solr-core/test/J0/./org.apache.solr.cloud.BasicDistributedZkTest-1355959159685/jetty2
[junit4:junit4]   2> 14917 T1111 C145 P22118 oass.SolrIndexSearcher.<init> Opening Searcher@f80b63c realtime
[junit4:junit4]   2> 14918 T1111 C145 P22118 oasu.DirectUpdateHandler2.commit end_commit_flush
[junit4:junit4]   2> 14918 T1111 C145 P22118 /update {waitSearcher=true&openSearcher=false&commit=true&commit_end_point=true&wt=javabin&softCommit=false&version=2} {commit=} 0 14
[junit4:junit4]   2> 14920 T1154 C144 P22126 oash.ReplicationHandler.inform Commits will be reserved for  10000
[junit4:junit4]   2> 14920 T1154 C144 P22126 oash.SnapPuller.<init>  No value set for 'pollInterval'. Timer Task not started.
[junit4:junit4]   2> 14923 T1112 C145 P22118 oash.ReplicationHandler.inform Commits will be reserved for  10000
[junit4:junit4]   2> 14923 T1112 C145 P22118 REQ /replication {command=indexversion&wt=javabin&qt=/replication&version=2} status=0 QTime=1 
[junit4:junit4]   2> 14924 T1154 C144 P22126 oash.SnapPuller.fetchLatestIndex Master's generation: 2
[junit4:junit4]   2> 14925 T1154 C144 P22126 oash.SnapPuller.fetchLatestIndex Slave's generation: 1
[junit4:junit4]   2> 14925 T1154 C144 P22126 oash.SnapPuller.fetchLatestIndex Starting replication process
[junit4:junit4]   2> 14927 T1112 C145 P22118 oasc.CachingDirectoryFactory.close Releasing directory:/usr/home/hudson/hudson-slave/workspace/Lucene-Solr-Tests-4.x-java7/solr/build/solr-core/test/J0/./org.apache.solr.cloud.BasicDistributedZkTest-1355959159685/jetty2
[junit4:junit4]   2> 14928 T1112 C145 P22118 oasc.CachingDirectoryFactory.close Releasing directory:/usr/home/hudson/hudson-slave/workspace/Lucene-Solr-Tests-4.x-java7/solr/build/solr-core/test/J0/./org.apache.solr.cloud.BasicDistributedZkTest-1355959159685/jetty2/index
[junit4:junit4]   2> 14929 T1112 C145 P22118 REQ /replication {command=filelist&generation=2&wt=javabin&qt=/replication&version=2} status=0 QTime=2 
[junit4:junit4]   2> 14930 T1154 C144 P22126 oash.SnapPuller.fetchLatestIndex Number of files in latest index in master: 1
[junit4:junit4]   2> 14931 T1154 C144 P22126 oasc.CachingDirectoryFactory.get return new directory for /usr/home/hudson/hudson-slave/workspace/Lucene-Solr-Tests-4.x-java7/solr/build/solr-core/test/J0/./org.apache.solr.cloud.BasicDistributedZkTest-1355959159685/jetty4/index.20121220001934608 forceNew:false
[junit4:junit4]   2> 14932 T1154 C144 P22126 oasc.CachingDirectoryFactory.close Releasing directory:/usr/home/hudson/hudson-slave/workspace/Lucene-Solr-Tests-4.x-java7/solr/build/solr-core/test/J0/./org.apache.solr.cloud.BasicDistributedZkTest-1355959159685/jetty4
[junit4:junit4]   2> 14932 T1154 C144 P22126 oash.SnapPuller.fetchLatestIndex Starting download to RateLimitedDirectoryWrapper(NRTCachingDirectory(org.apache.lucene.store.NIOFSDirectory@/usr/home/hudson/hudson-slave/workspace/Lucene-Solr-Tests-4.x-java7/solr/build/solr-core/test/J0/org.apache.solr.cloud.BasicDistributedZkTest-1355959159685/jetty4/index.20121220001934608 lockFactory=org.apache.lucene.store.NativeFSLockFactory@7195bf7e; maxCacheMB=48.0 maxMergeSizeMB=4.0)) fullCopy=true
[junit4:junit4]   2> 14936 T1112 C145 P22118 REQ /replication {file=segments_2&command=filecontent&checksum=true&generation=2&qt=/replication&wt=filestream} status=0 QTime=0 
[junit4:junit4]   2> 14938 T1154 C144 P22126 oasc.CachingDirectoryFactory.close Releasing directory:/usr/home/hudson/hudson-slave/workspace/Lucene-Solr-Tests-4.x-java7/solr/build/solr-core/test/J0/./org.apache.solr.cloud.BasicDistributedZkTest-1355959159685/jetty4/index
[junit4:junit4]   2> 14938 T1154 C144 P22126 oash.SnapPuller.fetchLatestIndex Total time taken for download : 0 secs
[junit4:junit4]   2> 14939 T1154 C144 P22126 oash.SnapPuller.modifyIndexProps New index installed. Updating index properties... index=index.20121220001934608
[junit4:junit4]   2> 14940 T1154 C144 P22126 oasc.CachingDirectoryFactory.close Releasing directory:/usr/home/hudson/hudson-slave/workspace/Lucene-Solr-Tests-4.x-java7/solr/build/solr-core/test/J0/./org.apache.solr.cloud.BasicDistributedZkTest-1355959159685/jetty4
[junit4:junit4]   2> 14940 T1154 C144 P22126 oasc.CachingDirectoryFactory.close Releasing directory:/usr/home/hudson/hudson-slave/workspace/Lucene-Solr-Tests-4.x-java7/solr/build/solr-core/test/J0/./org.apache.solr.cloud.BasicDistributedZkTest-1355959159685/jetty4
[junit4:junit4]   2> 14941 T1154 C144 P22126 oasc.SolrCore.getNewIndexDir New index directory detected: old=./org.apache.solr.cloud.BasicDistributedZkTest-1355959159685/jetty4/index/ new=./org.apache.solr.cloud.BasicDistributedZkTest-1355959159685/jetty4/index.20121220001934608
[junit4:junit4]   2> 14944 T1154 C144 P22126 oasc.SolrDeletionPolicy.onInit SolrDeletionPolicy.onInit: commits:num=1
[junit4:junit4]   2> 		commit{dir=RateLimitedDirectoryWrapper(NRTCachingDirectory(org.apache.lucene.store.NIOFSDirectory@/usr/home/hudson/hudson-slave/workspace/Lucene-Solr-Tests-4.x-java7/solr/build/solr-core/test/J0/org.apache.solr.cloud.BasicDistributedZkTest-1355959159685/jetty4/index.20121220001934608 lockFactory=org.apache.lucene.store.NativeFSLockFactory@7195bf7e; maxCacheMB=48.0 maxMergeSizeMB=4.0)),segFN=segments_2,generation=2,filenames=[segments_2]
[junit4:junit4]   2> 14945 T1154 C144 P22126 oasc.SolrDeletionPolicy.updateCommits newest commit = 2[segments_2]
[junit4:junit4]   2> 14946 T1154 C144 P22126 oasc.CachingDirectoryFactory.close Releasing directory:/usr/home/hudson/hudson-slave/workspace/Lucene-Solr-Tests-4.x-java7/solr/build/solr-core/test/J0/./org.apache.solr.cloud.BasicDistributedZkTest-1355959159685/jetty4
[junit4:junit4]   2> 14946 T1154 C144 P22126 oasu.DefaultSolrCoreState.newIndexWriter Creating new IndexWriter...
[junit4:junit4]   2> 14947 T1154 C144 P22126 oasu.DefaultSolrCoreState.newIndexWriter Waiting until IndexWriter is unused... core=collection1
[junit4:junit4]   2> 14947 T1154 C144 P22126 oasu.DefaultSolrCoreState.newIndexWriter Rollback old IndexWriter... core=collection1
[junit4:junit4]   2> 14948 T1154 C144 P22126 oasc.CachingDirectoryFactory.close Releasing directory:/usr/home/hudson/hudson-slave/workspace/Lucene-Solr-Tests-4.x-java7/solr/build/solr-core/test/J0/./org.apache.solr.cloud.BasicDistributedZkTest-1355959159685/jetty4/index.20121220001934608
[junit4:junit4]   2> 14949 T1154 C144 P22126 oasc.CachingDirectoryFactory.close Releasing directory:/usr/home/hudson/hudson-slave/workspace/Lucene-Solr-Tests-4.x-java7/solr/build/solr-core/test/J0/./org.apache.solr.cloud.BasicDistributedZkTest-1355959159685/jetty4
[junit4:junit4]   2> 14952 T1154 C144 P22126 oasc.SolrDeletionPolicy.onInit SolrDeletionPolicy.onInit: commits:num=1
[junit4:junit4]   2> 		commit{dir=RateLimitedDirectoryWrapper(NRTCachingDirectory(org.apache.lucene.store.NIOFSDirectory@/usr/home/hudson/hudson-slave/workspace/Lucene-Solr-Tests-4.x-java7/solr/build/solr-core/test/J0/org.apache.solr.cloud.BasicDistributedZkTest-1355959159685/jetty4/index.20121220001934608 lockFactory=org.apache.lucene.store.NativeFSLockFactory@7195bf7e; maxCacheMB=48.0 maxMergeSizeMB=4.0)),segFN=segments_2,generation=2,filenames=[segments_2]
[junit4:junit4]   2> 14952 T1154 C144 P22126 oasc.SolrDeletionPolicy.updateCommits newest commit = 2[segments_2]
[junit4:junit4]   2> 14953 T1154 C144 P22126 oasu.DefaultSolrCoreState.newIndexWriter New IndexWriter is ready to be used.
[junit4:junit4]   2> 14953 T1154 C144 P22126 oasc.CachingDirectoryFactory.close Releasing directory:/usr/home/hudson/hudson-slave/workspace/Lucene-Solr-Tests-4.x-java7/solr/build/solr-core/test/J0/./org.apache.solr.cloud.BasicDistributedZkTest-1355959159685/jetty4
[junit4:junit4]   2> 14954 T1154 C144 P22126 oass.SolrIndexSearcher.<init> Opening Searcher@4bb9d5fd main
[junit4:junit4]   2> 14955 T1153 oasc.SolrCore.registerSearcher [collection1] Registered new searcher Searcher@4bb9d5fd main{StandardDirectoryReader(segments_2:1:nrt)}
[junit4:junit4]   2> 14956 T1153 oasc.CachingDirectoryFactory.close Releasing directory:/usr/home/hudson/hudson-slave/workspace/Lucene-Solr-Tests-4.x-java7/solr/build/solr-core/test/J0/./org.apache.solr.cloud.BasicDistributedZkTest-1355959159685/jetty4/index
[junit4:junit4]   2> 14956 T1154 C144 P22126 oasu.DirectUpdateHandler2.commit start commit{flags=0,_version_=0,optimize=false,openSearcher=false,waitSearcher=false,expungeDeletes=false,softCommit=false}
[junit4:junit4]   2> 14960 T1154 C144 P22126 oasc.SolrDeletionPolicy.onCommit SolrDeletionPolicy.onCommit: commits:num=2
[junit4:junit4]   2> 		commit{dir=RateLimitedDirectoryWrapper(NRTCachingDirectory(org.apache.lucene.store.NIOFSDirectory@/usr/home/hudson/hudson-slave/workspace/Lucene-Solr-Tests-4.x-java7/solr/build/solr-core/test/J0/org.apache.solr.cloud.BasicDistributedZkTest-1355959159685/jetty4/index.20121220001934608 lockFactory=org.apache.lucene.store.NativeFSLockFactory@7195bf7e; maxCacheMB=48.0 maxMergeSizeMB=4.0)),segFN=segments_2,generation=2,filenames=[segments_2]
[junit4:junit4]   2> 		commit{dir=RateLimitedDirectoryWrapper(NRTCachingDirectory(org.apache.lucene.store.NIOFSDirectory@/usr/home/hudson/hudson-slave/workspace/Lucene-Solr-Tests-4.x-java7/solr/build/solr-core/test/J0/org.apache.solr.cloud.BasicDistributedZkTest-1355959159685/jetty4/index.20121220001934608 lockFactory=org.apache.lucene.store.NativeFSLockFactory@7195bf7e; maxCacheMB=48.0 maxMergeSizeMB=4.0)),segFN=segments_3,generation=3,filenames=[segments_3]
[junit4:junit4]   2> 14960 T1154 C144 P22126 oasc.SolrDeletionPolicy.updateCommits newest commit = 3[segments_3]
[junit4:junit4]   2> 14962 T1154 C144 P22126 oasc.CachingDirectoryFactory.close Releasing directory:/usr/home/hudson/hudson-slave/workspace/Lucene-Solr-Tests-4.x-java7/solr/build/solr-core/test/J0/./org.apache.solr.cloud.BasicDistributedZkTest-1355959159685/jetty4
[junit4:junit4]   2> 14962 T1154 C144 P22126 oasu.DirectUpdateHandler2.commit end_commit_flush
[junit4:junit4]   2> 14962 T1154 C144 P22126 oasc.CachingDirectoryFactory.close Releasing directory:/usr/home/hudson/hudson-slave/workspace/Lucene-Solr-Tests-4.x-java7/solr/build/solr-core/test/J0/./org.apache.solr.cloud.BasicDistributedZkTest-1355959159685/jetty4/index.20121220001934608
[junit4:junit4]   2> 14963 T1154 C144 P22126 oasc.CachingDirectoryFactory.close Releasing directory:/usr/home/hudson/hudson-slave/workspace/Lucene-Solr-Tests-4.x-java7/solr/build/solr-core/test/J0/./org.apache.solr.cloud.BasicDistributedZkTest-1355959159685/jetty4/index
[junit4:junit4]   2> 14963 T1154 C144 P22126 oasc.RecoveryStrategy.replay No replay needed. core=collection1
[junit4:junit4]   2> 14963 T1154 C144 P22126 oasc.RecoveryStrategy.doRecovery Replication Recovery was successful - registering as Active. core=collection1
[junit4:junit4]   2> 14963 T1154 C144 P22126 oasc.ZkController.publish publishing core=collection1 state=active
[junit4:junit4]   2> 14964 T1154 C144 P22126 oasc.ZkController.publish numShards not found on descriptor - reading it from system property
[junit4:junit4]   2> 14965 T1154 C144 P22126 oasc.RecoveryStrategy.doRecovery Finished recovery process. core=collection1
[junit4:junit4]   2> 15170 T1086 oascc.ZkStateReader.updateClusterState Updating cloud state from ZooKeeper... 
[junit4:junit4]   2> 15171 T1086 oasc.Overseer$ClusterStateUpdater.updateState Update state numShards=2 message={
[junit4:junit4]   2> 	  "operation":"state",
[junit4:junit4]   2> 	  "numShards":"2",
[junit4:junit4]   2> 	  "shard":"shard2",
[junit4:junit4]   2> 	  "roles":null,
[junit4:junit4]   2> 	  "state":"active",
[junit4:junit4]   2> 	  "core":"collection1",
[junit4:junit4]   2> 	  "collection":"collection1",
[junit4:junit4]   2> 	  "node_name":"127.0.0.1:22126_waso%2Fs",
[junit4:junit4]   2> 	  "base_url":"http://127.0.0.1:22126/waso/s"}
[junit4:junit4]   2> 15184 T1085 oascc.ZkStateReader$2.process A cluster state change: WatchedEvent state:SyncConnected type:NodeDataChanged path:/clusterstate.json, has occurred - updating... (live nodes size: 5)
[junit4:junit4]   2> 15184 T1151 oascc.ZkStateReader$2.process A cluster state change: WatchedEvent state:SyncConnected type:NodeDataChanged path:/clusterstate.json, has occurred - updating... (live nodes size: 5)
[junit4:junit4]   2> 15184 T1104 oascc.ZkStateReader$2.process A cluster state change: WatchedEvent state:SyncConnected type:NodeDataChanged path:/clusterstate.json, has occurred - updating... (live nodes size: 5)
[junit4:junit4]   2> 15184 T1134 oascc.ZkStateReader$2.process A cluster state change: WatchedEvent state:SyncConnected type:NodeDataChanged path:/clusterstate.json, has occurred - updating... (live nodes size: 5)
[junit4:junit4]   2> 15184 T1091 oascc.ZkStateReader$2.process A cluster state change: WatchedEvent state:SyncConnected type:NodeDataChanged path:/clusterstate.json, has occurred - updating... (live nodes size: 5)
[junit4:junit4]   2> 15184 T1119 oascc.ZkStateReader$2.process A cluster state change: WatchedEvent state:SyncConnected type:NodeDataChanged path:/clusterstate.json, has occurred - updating... (live nodes size: 5)
[junit4:junit4]   2> 15898 T1063 oascc.ZkStateReader.updateClusterState Updating cloud state from ZooKeeper... 
[junit4:junit4]   2> 15900 T1063 oasc.AbstractDistribZkTestBase.waitForRecoveriesToFinish Recoveries finished - collection: collection1
[junit4:junit4]   2> ASYNC  NEW_CORE C146 name=collection1 org.apache.solr.core.SolrCore@10531345 url=http://127.0.0.1:22110/waso/s/collection1 node=127.0.0.1:22110_waso%2Fs C146_STATE=coll:control_collection core:collection1 props:{shard=shard1, roles=null, state=active, core=collection1, collection=control_collection, node_name=127.0.0.1:22110_waso%2Fs, base_url=http://127.0.0.1:22110/waso/s, leader=true}
[junit4:junit4]   2> 15911 T1075 C146 P22110 oasc.CachingDirectoryFactory.close Releasing directory:/usr/home/hudson/hudson-slave/workspace/Lucene-Solr-Tests-4.x-java7/solr/build/solr-core/test/J0/./org.apache.solr.cloud.BasicDistributedZkTest-1355959159685/control/data
[junit4:junit4]   2> 15916 T1075 C146 P22110 oasc.SolrDeletionPolicy.onInit SolrDeletionPolicy.onInit: commits:num=1
[junit4:junit4]   2> 		commit{dir=RateLimitedDirectoryWrapper(NRTCachingDirectory(org.apache.lucene.store.NIOFSDirectory@/usr/home/hudson/hudson-slave/workspace/Lucene-Solr-Tests-4.x-java7/solr/build/solr-core/test/J0/org.apache.solr.cloud.BasicDistributedZkTest-1355959159685/control/data/index lockFactory=org.apache.lucene.store.NativeFSLockFactory@13e8924f; maxCacheMB=48.0 maxMergeSizeMB=4.0)),segFN=segments_1,generation=1,filenames=[segments_1]
[junit4:junit4]   2> 15917 T1075 C146 P22110 oasc.SolrDeletionPolicy.updateCommits newest commit = 1[segments_1]
[junit4:junit4]   2> 15919 T1075 C146 P22110 oasc.CachingDirectoryFactory.close Releasing directory:/usr/home/hudson/hudson-slave/workspace/Lucene-Solr-Tests-4.x-java7/solr/build/solr-core/test/J0/./org.apache.solr.cloud.BasicDistributedZkTest-1355959159685/con

[...truncated too long message...]

p2029927964-1140 Acceptor0 SocketConnector@127.0.0.1:22126, state=RUNNABLE, group=TGRP-BasicDistributedZkTest]
[junit4:junit4]   2> 	        at java.net.PlainSocketImpl.socketAccept(Native Method)
[junit4:junit4]   2> 	        at java.net.AbstractPlainSocketImpl.accept(AbstractPlainSocketImpl.java:398)
[junit4:junit4]   2> 	        at java.net.ServerSocket.implAccept(ServerSocket.java:522)
[junit4:junit4]   2> 	        at java.net.ServerSocket.accept(ServerSocket.java:490)
[junit4:junit4]   2> 	        at org.eclipse.jetty.server.bio.SocketConnector.accept(SocketConnector.java:117)
[junit4:junit4]   2> 	        at org.eclipse.jetty.server.AbstractConnector$Acceptor.run(AbstractConnector.java:938)
[junit4:junit4]   2> 	        at org.eclipse.jetty.util.thread.QueuedThreadPool.runJob(QueuedThreadPool.java:608)
[junit4:junit4]   2> 	        at org.eclipse.jetty.util.thread.QueuedThreadPool$3.run(QueuedThreadPool.java:543)
[junit4:junit4]   2> 	        at java.lang.Thread.run(Thread.java:722)
[junit4:junit4]   2> 	  13) Thread[id=1200, name=searcherExecutor-1106-thread-1, state=WAITING, group=TGRP-BasicDistributedZkTest]
[junit4:junit4]   2> 	        at sun.misc.Unsafe.park(Native Method)
[junit4:junit4]   2> 	        at java.util.concurrent.locks.LockSupport.park(LockSupport.java:186)
[junit4:junit4]   2> 	        at java.util.concurrent.locks.AbstractQueuedSynchronizer$ConditionObject.await(AbstractQueuedSynchronizer.java:2043)
[junit4:junit4]   2> 	        at java.util.concurrent.LinkedBlockingQueue.take(LinkedBlockingQueue.java:442)
[junit4:junit4]   2> 	        at java.util.concurrent.ThreadPoolExecutor.getTask(ThreadPoolExecutor.java:1043)
[junit4:junit4]   2> 	        at java.util.concurrent.ThreadPoolExecutor.runWorker(ThreadPoolExecutor.java:1103)
[junit4:junit4]   2> 	        at java.util.concurrent.ThreadPoolExecutor$Worker.run(ThreadPoolExecutor.java:603)
[junit4:junit4]   2> 	        at java.lang.Thread.run(Thread.java:722)
[junit4:junit4]   2> 	  14) Thread[id=1153, name=searcherExecutor-1078-thread-1, state=WAITING, group=TGRP-BasicDistributedZkTest]
[junit4:junit4]   2> 	        at sun.misc.Unsafe.park(Native Method)
[junit4:junit4]   2> 	        at java.util.concurrent.locks.LockSupport.park(LockSupport.java:186)
[junit4:junit4]   2> 	        at java.util.concurrent.locks.AbstractQueuedSynchronizer$ConditionObject.await(AbstractQueuedSynchronizer.java:2043)
[junit4:junit4]   2> 	        at java.util.concurrent.LinkedBlockingQueue.take(LinkedBlockingQueue.java:442)
[junit4:junit4]   2> 	        at java.util.concurrent.ThreadPoolExecutor.getTask(ThreadPoolExecutor.java:1043)
[junit4:junit4]   2> 	        at java.util.concurrent.ThreadPoolExecutor.runWorker(ThreadPoolExecutor.java:1103)
[junit4:junit4]   2> 	        at java.util.concurrent.ThreadPoolExecutor$Worker.run(ThreadPoolExecutor.java:603)
[junit4:junit4]   2> 	        at java.lang.Thread.run(Thread.java:722)
[junit4:junit4]   2> 	  15) Thread[id=1122, name=HashSessionScavenger-18, state=TIMED_WAITING, group=TGRP-BasicDistributedZkTest]
[junit4:junit4]   2> 	        at java.lang.Object.wait(Native Method)
[junit4:junit4]   2> 	        at java.util.TimerThread.mainLoop(Timer.java:552)
[junit4:junit4]   2> 	        at java.util.TimerThread.run(Timer.java:505)
[junit4:junit4]   2> 	  16) Thread[id=1211, name=searcherExecutor-1127-thread-1, state=WAITING, group=TGRP-BasicDistributedZkTest]
[junit4:junit4]   2> 	        at sun.misc.Unsafe.park(Native Method)
[junit4:junit4]   2> 	        at java.util.concurrent.locks.LockSupport.park(LockSupport.java:186)
[junit4:junit4]   2> 	        at java.util.concurrent.locks.AbstractQueuedSynchronizer$ConditionObject.await(AbstractQueuedSynchronizer.java:2043)
[junit4:junit4]   2> 	        at java.util.concurrent.LinkedBlockingQueue.take(LinkedBlockingQueue.java:442)
[junit4:junit4]   2> 	        at java.util.concurrent.ThreadPoolExecutor.getTask(ThreadPoolExecutor.java:1043)
[junit4:junit4]   2> 	        at java.util.concurrent.ThreadPoolExecutor.runWorker(ThreadPoolExecutor.java:1103)
[junit4:junit4]   2> 	        at java.util.concurrent.ThreadPoolExecutor$Worker.run(ThreadPoolExecutor.java:603)
[junit4:junit4]   2> 	        at java.lang.Thread.run(Thread.java:722)
[junit4:junit4]   2> 	  17) Thread[id=1108, name=qtp436917813-1108 Acceptor0 SocketConnector@127.0.0.1:22118, state=RUNNABLE, group=TGRP-BasicDistributedZkTest]
[junit4:junit4]   2> 	        at java.net.PlainSocketImpl.socketAccept(Native Method)
[junit4:junit4]   2> 	        at java.net.AbstractPlainSocketImpl.accept(AbstractPlainSocketImpl.java:398)
[junit4:junit4]   2> 	        at java.net.ServerSocket.implAccept(ServerSocket.java:522)
[junit4:junit4]   2> 	        at java.net.ServerSocket.accept(ServerSocket.java:490)
[junit4:junit4]   2> 	        at org.eclipse.jetty.server.bio.SocketConnector.accept(SocketConnector.java:117)
[junit4:junit4]   2> 	        at org.eclipse.jetty.server.AbstractConnector$Acceptor.run(AbstractConnector.java:938)
[junit4:junit4]   2> 	        at org.eclipse.jetty.util.thread.QueuedThreadPool.runJob(QueuedThreadPool.java:608)
[junit4:junit4]   2> 	        at org.eclipse.jetty.util.thread.QueuedThreadPool$3.run(QueuedThreadPool.java:543)
[junit4:junit4]   2> 	        at java.lang.Thread.run(Thread.java:722)
[junit4:junit4]   2> NOTE: test params are: codec=Lucene41: {n_f1=Lucene41(blocksize=128), foo_b=MockFixedIntBlock(blockSize=1313), cat=PostingsFormat(name=NestedPulsing), foo_d=PostingsFormat(name=MockSep), foo_f=MockFixedIntBlock(blockSize=1313), n_tl1=Lucene41(blocksize=128), n_d1=PostingsFormat(name=NestedPulsing), rnd_b=PostingsFormat(name=MockSep), intDefault=Lucene41(blocksize=128), n_td1=Lucene41(blocksize=128), timestamp=PostingsFormat(name=NestedPulsing), id=PostingsFormat(name=MockSep), range_facet_sl=PostingsFormat(name=MockSep), range_facet_si=PostingsFormat(name=NestedPulsing), oddField_s=PostingsFormat(name=MockSep), sequence_i=PostingsFormat(name=MockSep), name=PostingsFormat(name=MockSep), foo_i=Lucene41(blocksize=128), regex_dup_B_s=PostingsFormat(name=NestedPulsing), multiDefault=PostingsFormat(name=NestedPulsing), n_tf1=PostingsFormat(name=NestedPulsing), n_dt1=Lucene41(blocksize=128), genre_s=PostingsFormat(name=MockSep), author_t=Lucene41(blocksize=128), n_ti1=PostingsFormat(name=MockSep), range_facet_l=PostingsFormat(name=NestedPulsing), text=MockFixedIntBlock(blockSize=1313), _version_=Lucene41(blocksize=128), val_i=PostingsFormat(name=MockSep), SubjectTerms_mfacet=Lucene41(blocksize=128), series_t=Lucene41(blocksize=128), a_t=PostingsFormat(name=NestedPulsing), n_tdt1=Lucene41(blocksize=128), regex_dup_A_s=MockFixedIntBlock(blockSize=1313), price=MockFixedIntBlock(blockSize=1313), other_tl1=Lucene41(blocksize=128), n_l1=PostingsFormat(name=NestedPulsing), a_si=Lucene41(blocksize=128), inStock=MockFixedIntBlock(blockSize=1313)}, sim=DefaultSimilarity, locale=lt_LT, timezone=Africa/Porto-Novo
[junit4:junit4]   2> NOTE: FreeBSD 9.0-RELEASE amd64/Oracle Corporation 1.7.0_09 (64-bit)/cpus=16,threads=19,free=207300832,total=536870912
[junit4:junit4]   2> NOTE: All tests run in this JVM: [TestDefaultSimilarityFactory, TestFiltering, SolrPluginUtilsTest, ClusterStateTest, TestWordDelimiterFilterFactory, QueryElevationComponentTest, TestSearchPerf, SearchHandlerTest, NumericFieldsTest, TestIBSimilarityFactory, TestIndexingPerformance, TestSolrQueryParser, BadComponentTest, RequestHandlersTest, SpellPossibilityIteratorTest, TestLMDirichletSimilarityFactory, TestLFUCache, MoreLikeThisHandlerTest, SimplePostToolTest, TestNumberUtils, TestJoin, TestExtendedDismaxParser, TestFastLRUCache, SortByFunctionTest, OverseerCollectionProcessorTest, TestSolrJ, SOLR749Test, TermsComponentTest, PreAnalyzedFieldTest, DateFieldTest, DistributedMLTComponentTest, TestPerFieldSimilarity, TestBadConfig, LoggingHandlerTest, DateMathParserTest, SuggesterFSTTest, TestJmxMonitoredMap, DirectSolrConnectionTest, ZkControllerTest, SyncSliceTest, TestReload, CollectionsAPIDistributedZkTest, FieldAnalysisRequestHandlerTest, TestAnalyzedSuggestions, FileBasedSpellCheckerTest, NoCacheHeaderTest, TestLuceneMatchVersion, ResourceLoaderTest, TestCollationField, TestCoreContainer, NotRequiredUniqueKeyTest, BasicDistributedZkTest]
[junit4:junit4]   2> NOTE: reproduce with: ant test  -Dtestcase=BasicDistributedZkTest -Dtests.seed=A3CD0BB54D6DC591 -Dtests.multiplier=3 -Dtests.slow=true -Dtests.locale=lt_LT -Dtests.timezone=Africa/Porto-Novo -Dtests.file.encoding=US-ASCII
[junit4:junit4] ERROR   0.00s J0 | BasicDistributedZkTest (suite) <<<
[junit4:junit4]    > Throwable #1: java.lang.Exception: Suite timeout exceeded (>= 7200000 msec).
[junit4:junit4]    > 	at __randomizedtesting.SeedInfo.seed([A3CD0BB54D6DC591]:0)
[junit4:junit4] Completed on J0 in 7223.56s, 1 test, 2 errors <<< FAILURES!

[...truncated 32 lines...]
BUILD FAILED
/usr/home/hudson/hudson-slave/workspace/Lucene-Solr-Tests-4.x-java7/build.xml:353: The following error occurred while executing this line:
/usr/home/hudson/hudson-slave/workspace/Lucene-Solr-Tests-4.x-java7/build.xml:39: The following error occurred while executing this line:
/usr/home/hudson/hudson-slave/workspace/Lucene-Solr-Tests-4.x-java7/solr/build.xml:178: The following error occurred while executing this line:
/usr/home/hudson/hudson-slave/workspace/Lucene-Solr-Tests-4.x-java7/solr/common-build.xml:438: The following error occurred while executing this line:
/usr/home/hudson/hudson-slave/workspace/Lucene-Solr-Tests-4.x-java7/lucene/common-build.xml:1175: The following error occurred while executing this line:
/usr/home/hudson/hudson-slave/workspace/Lucene-Solr-Tests-4.x-java7/lucene/common-build.xml:840: There were test failures: 244 suites, 1011 tests, 1 suite-level error, 1 error, 51 ignored (3 assumptions)

Total time: 151 minutes 27 seconds
Build step 'Invoke Ant' marked build as failure
Archiving artifacts
Recording test results
Email was triggered for: Failure
Sending email for trigger: Failure



Mime
View raw message