lucene-dev mailing list archives

Site index · List index
Message view « Date » · « Thread »
Top « Date » · « Thread »
From Apache Jenkins Server <jenk...@builds.apache.org>
Subject [JENKINS] Lucene-Solr-Tests-4.x-java7 - Build # 811 - Failure
Date Wed, 19 Dec 2012 11:06:03 GMT
Build: https://builds.apache.org/job/Lucene-Solr-Tests-4.x-java7/811/

2 tests failed.
REGRESSION:  org.apache.solr.cloud.BasicDistributedZkTest.testDistribSearch

Error Message:
Test abandoned because suite timeout was reached.

Stack Trace:
java.lang.Exception: Test abandoned because suite timeout was reached.
	at __randomizedtesting.SeedInfo.seed([E9A79181CFF72639]:0)


FAILED:  junit.framework.TestSuite.org.apache.solr.cloud.BasicDistributedZkTest

Error Message:
Suite timeout exceeded (>= 7200000 msec).

Stack Trace:
java.lang.Exception: Suite timeout exceeded (>= 7200000 msec).
	at __randomizedtesting.SeedInfo.seed([E9A79181CFF72639]:0)




Build Log:
[...truncated 9251 lines...]
[junit4:junit4] Suite: org.apache.solr.cloud.BasicDistributedZkTest
[junit4:junit4]   2> 0 T41 oas.BaseDistributedSearchTestCase.initHostContext Setting hostContext system property: /
[junit4:junit4]   2> 6 T41 oas.SolrTestCaseJ4.setUp ###Starting testDistribSearch
[junit4:junit4]   2> Creating dataDir: /usr/home/hudson/hudson-slave/workspace/Lucene-Solr-Tests-4.x-java7/solr/build/solr-core/test/J0/./solrtest-BasicDistributedZkTest-1355907916225
[junit4:junit4]   2> 15 T41 oasc.ZkTestServer.run STARTING ZK TEST SERVER
[junit4:junit4]   2> 21 T42 oasc.ZkTestServer$ZKServerMain.runFromConfig Starting server
[junit4:junit4]   2> 96 T42 oaz.Environment.logEnv Server environment:zookeeper.version=3.4.5-1392090, built on 09/30/2012 17:52 GMT
[junit4:junit4]   2> 96 T42 oaz.Environment.logEnv Server environment:host.name=lucene.zones.apache.org
[junit4:junit4]   2> 97 T42 oaz.Environment.logEnv Server environment:java.version=1.7.0_09
[junit4:junit4]   2> 97 T42 oaz.Environment.logEnv Server environment:java.vendor=Oracle Corporation
[junit4:junit4]   2> 97 T42 oaz.Environment.logEnv Server environment:java.home=/usr/local/openjdk7/jre
[junit4:junit4]   2> 98 T42 oaz.Environment.logEnv Server environment:java.class.path=/usr/home/hudson/hudson-slave/workspace/Lucene-Solr-Tests-4.x-java7/solr/build/solr-core/classes/test:/usr/home/hudson/hudson-slave/workspace/Lucene-Solr-Tests-4.x-java7/solr/build/solr-test-framework/classes/java:/usr/home/hudson/hudson-slave/workspace/Lucene-Solr-Tests-4.x-java7/solr/build/solr-core/test-files:/usr/home/hudson/hudson-slave/workspace/Lucene-Solr-Tests-4.x-java7/lucene/build/test-framework/classes/java:/usr/home/hudson/hudson-slave/workspace/Lucene-Solr-Tests-4.x-java7/lucene/build/codecs/classes/java:/usr/home/hudson/hudson-slave/workspace/Lucene-Solr-Tests-4.x-java7/solr/build/solr-solrj/classes/java:/usr/home/hudson/hudson-slave/workspace/Lucene-Solr-Tests-4.x-java7/solr/build/solr-core/classes/java:/usr/home/hudson/hudson-slave/workspace/Lucene-Solr-Tests-4.x-java7/lucene/build/analysis/common/lucene-analyzers-common-4.1-SNAPSHOT.jar:/usr/home/hudson/hudson-slave/workspace/Lucene-Solr-Tests-4.x-java7/lucene/build/analysis/kuromoji/lucene-analyzers-kuromoji-4.1-SNAPSHOT.jar:/usr/home/hudson/hudson-slave/workspace/Lucene-Solr-Tests-4.x-java7/lucene/build/analysis/phonetic/lucene-analyzers-phonetic-4.1-SNAPSHOT.jar:/usr/home/hudson/hudson-slave/workspace/Lucene-Solr-Tests-4.x-java7/lucene/build/highlighter/lucene-highlighter-4.1-SNAPSHOT.jar:/usr/home/hudson/hudson-slave/workspace/Lucene-Solr-Tests-4.x-java7/lucene/build/memory/lucene-memory-4.1-SNAPSHOT.jar:/usr/home/hudson/hudson-slave/workspace/Lucene-Solr-Tests-4.x-java7/lucene/build/misc/lucene-misc-4.1-SNAPSHOT.jar:/usr/home/hudson/hudson-slave/workspace/Lucene-Solr-Tests-4.x-java7/lucene/build/spatial/lucene-spatial-4.1-SNAPSHOT.jar:/usr/home/hudson/hudson-slave/workspace/Lucene-Solr-Tests-4.x-java7/lucene/build/suggest/lucene-suggest-4.1-SNAPSHOT.jar:/usr/home/hudson/hudson-slave/workspace/Lucene-Solr-Tests-4.x-java7/lucene/build/grouping/lucene-grouping-4.1-SNAPSHOT.jar:/usr/home/hudson/hudson-slave/workspace/Lucene-Solr-Tests-4.x-java7/lucene/build/queries/lucene-queries-4.1-SNAPSHOT.jar:/usr/home/hudson/hudson-slave/workspace/Lucene-Solr-Tests-4.x-java7/lucene/build/queryparser/lucene-queryparser-4.1-SNAPSHOT.jar:/usr/home/hudson/hudson-slave/workspace/Lucene-Solr-Tests-4.x-java7/solr/core/lib/cglib-nodep-2.2.jar:/usr/home/hudson/hudson-slave/workspace/Lucene-Solr-Tests-4.x-java7/solr/core/lib/commons-cli-1.2.jar:/usr/home/hudson/hudson-slave/workspace/Lucene-Solr-Tests-4.x-java7/solr/core/lib/commons-codec-1.7.jar:/usr/home/hudson/hudson-slave/workspace/Lucene-Solr-Tests-4.x-java7/solr/core/lib/commons-fileupload-1.2.1.jar:/usr/home/hudson/hudson-slave/workspace/Lucene-Solr-Tests-4.x-java7/solr/core/lib/commons-lang-2.6.jar:/usr/home/hudson/hudson-slave/workspace/Lucene-Solr-Tests-4.x-java7/solr/core/lib/easymock-3.0.jar:/usr/home/hudson/hudson-slave/workspace/Lucene-Solr-Tests-4.x-java7/solr/core/lib/guava-13.0.1.jar:/usr/home/hudson/hudson-slave/workspace/Lucene-Solr-Tests-4.x-java7/solr/core/lib/javax.servlet-api-3.0.1.jar:/usr/home/hudson/hudson-slave/workspace/Lucene-Solr-Tests-4.x-java7/solr/core/lib/metrics-core-2.1.2.jar:/usr/home/hudson/hudson-slave/workspace/Lucene-Solr-Tests-4.x-java7/solr/core/lib/objenesis-1.2.jar:/usr/home/hudson/hudson-slave/workspace/Lucene-Solr-Tests-4.x-java7/solr/core/lib/spatial4j-0.3.jar:/usr/home/hudson/hudson-slave/workspace/Lucene-Solr-Tests-4.x-java7/solr/solrj/lib/commons-io-2.1.jar:/usr/home/hudson/hudson-slave/workspace/Lucene-Solr-Tests-4.x-java7/solr/solrj/lib/httpclient-4.1.3.jar:/usr/home/hudson/hudson-slave/workspace/Lucene-Solr-Tests-4.x-java7/solr/solrj/lib/httpcore-4.1.4.jar:/usr/home/hudson/hudson-slave/workspace/Lucene-Solr-Tests-4.x-java7/solr/solrj/lib/httpmime-4.1.3.jar:/usr/home/hudson/hudson-slave/workspace/Lucene-Solr-Tests-4.x-java7/solr/solrj/lib/jcl-over-slf4j-1.6.4.jar:/usr/home/hudson/hudson-slave/workspace/Lucene-Solr-Tests-4.x-java7/solr/solrj/lib/log4j-over-slf4j-1.6.4.jar:/usr/home/hudson/hudson-slave/workspace/Lucene-Solr-Tests-4.x-java7/solr/solrj/lib/slf4j-api-1.6.4.jar:/usr/home/hudson/hudson-slave/workspace/Lucene-Solr-Tests-4.x-java7/solr/solrj/lib/slf4j-jdk14-1.6.4.jar:/usr/home/hudson/hudson-slave/workspace/Lucene-Solr-Tests-4.x-java7/solr/solrj/lib/wstx-asl-3.2.7.jar:/usr/home/hudson/hudson-slave/workspace/Lucene-Solr-Tests-4.x-java7/solr/solrj/lib/zookeeper-3.4.5.jar:/usr/home/hudson/hudson-slave/workspace/Lucene-Solr-Tests-4.x-java7/solr/example/lib/jetty-continuation-8.1.8.v20121106.jar:/usr/home/hudson/hudson-slave/workspace/Lucene-Solr-Tests-4.x-java7/solr/example/lib/jetty-deploy-8.1.8.v20121106.jar:/usr/home/hudson/hudson-slave/workspace/Lucene-Solr-Tests-4.x-java7/solr/example/lib/jetty-http-8.1.8.v20121106.jar:/usr/home/hudson/hudson-slave/workspace/Lucene-Solr-Tests-4.x-java7/solr/example/lib/jetty-io-8.1.8.v20121106.jar:/usr/home/hudson/hudson-slave/workspace/Lucene-Solr-Tests-4.x-java7/solr/example/lib/jetty-jmx-8.1.8.v20121106.jar:/usr/home/hudson/hudson-slave/workspace/Lucene-Solr-Tests-4.x-java7/solr/example/lib/jetty-security-8.1.8.v20121106.jar:/usr/home/hudson/hudson-slave/workspace/Lucene-Solr-Tests-4.x-java7/solr/example/lib/jetty-server-8.1.8.v20121106.jar:/usr/home/hudson/hudson-slave/workspace/Lucene-Solr-Tests-4.x-java7/solr/example/lib/jetty-servlet-8.1.8.v20121106.jar:/usr/home/hudson/hudson-slave/workspace/Lucene-Solr-Tests-4.x-java7/solr/example/lib/jetty-util-8.1.8.v20121106.jar:/usr/home/hudson/hudson-slave/workspace/Lucene-Solr-Tests-4.x-java7/solr/example/lib/jetty-webapp-8.1.8.v20121106.jar:/usr/home/hudson/hudson-slave/workspace/Lucene-Solr-Tests-4.x-java7/solr/example/lib/jetty-xml-8.1.8.v20121106.jar:/usr/home/hudson/hudson-slave/workspace/Lucene-Solr-Tests-4.x-java7/solr/example/lib/servlet-api-3.0.jar:/usr/home/hudson/hudson-slave/workspace/Lucene-Solr-Tests-4.x-java7/solr/example/example-DIH/solr/db/lib/derby-10.9.1.0.jar:/usr/home/hudson/hudson-slave/workspace/Lucene-Solr-Tests-4.x-java7/solr/example/example-DIH/solr/db/lib/hsqldb-1.8.0.10.jar:/usr/home/hudson/hudson-slave/workspace/Lucene-Solr-Tests-4.x-java7/lucene/build/core/classes/java:/usr/home/hudson/hudson-slave/workspace/Lucene-Solr-Tests-4.x-java7/lucene/test-framework/lib/junit-4.10.jar:/usr/home/hudson/hudson-slave/workspace/Lucene-Solr-Tests-4.x-java7/lucene/test-framework/lib/randomizedtesting-runner-2.0.7.jar:/home/hudson/hudson-slave/tools/Ant/ant-1.8.2/lib/ant-launcher.jar:/home/hudson/.ant/lib/ivy-2.2.0.jar:/home/hudson/hudson-slave/tools/Ant/ant-1.8.2/lib/ant-apache-regexp.jar:/home/hudson/hudson-slave/tools/Ant/ant-1.8.2/lib/ant-junit.jar:/home/hudson/hudson-slave/tools/Ant/ant-1.8.2/lib/ant-apache-bsf.jar:/home/hudson/hudson-slave/tools/Ant/ant-1.8.2/lib/ant-commons-net.jar:/home/hudson/hudson-slave/tools/Ant/ant-1.8.2/lib/ant-antlr.jar:/home/hudson/hudson-slave/tools/Ant/ant-1.8.2/lib/ant-apache-log4j.jar:/home/hudson/hudson-slave/tools/Ant/ant-1.8.2/lib/ant-commons-logging.jar:/home/hudson/hudson-slave/tools/Ant/ant-1.8.2/lib/ant-apache-xalan2.jar:/home/hudson/hudson-slave/tools/Ant/ant-1.8.2/lib/ant-apache-oro.jar:/home/hudson/hudson-slave/tools/Ant/ant-1.8.2/lib/ant-junit4.jar:/home/hudson/hudson-slave/tools/Ant/ant-1.8.2/lib/ant-netrexx.jar:/home/hudson/hudson-slave/tools/Ant/ant-1.8.2/lib/ant-swing.jar:/home/hudson/hudson-slave/tools/Ant/ant-1.8.2/lib/ant-javamail.jar:/home/hudson/hudson-slave/tools/Ant/ant-1.8.2/lib/ant-jsch.jar:/home/hudson/hudson-slave/tools/Ant/ant-1.8.2/lib/ant-jmf.jar:/home/hudson/hudson-slave/tools/Ant/ant-1.8.2/lib/ant.jar:/home/hudson/hudson-slave/tools/Ant/ant-1.8.2/lib/ant-apache-bcel.jar:/home/hudson/hudson-slave/tools/Ant/ant-1.8.2/lib/ant-jai.jar:/home/hudson/hudson-slave/tools/Ant/ant-1.8.2/lib/ant-testutil.jar:/home/hudson/hudson-slave/tools/Ant/ant-1.8.2/lib/ant-apache-resolver.jar:/home/hudson/hudson-slave/tools/Ant/ant-1.8.2/lib/ant-jdepend.jar:/usr/local/openjdk7/lib/tools.jar:/home/hudson/.ivy2/cache/com.carrotsearch.randomizedtesting/junit4-ant/jars/junit4-ant-2.0.7.jar
[junit4:junit4]   2> 99 T42 oaz.Environment.logEnv Server environment:java.library.path=/usr/local/openjdk7/jre/lib/amd64/server:/usr/local/openjdk7/jre/lib/amd64:/usr/local/openjdk7/jre/../lib/amd64:/usr/local/openjdk6/jre/lib/amd64/server:/usr/local/openjdk6/jre/lib/amd64:/usr/local/openjdk6/jre/../lib/amd64:/usr/java/packages/lib/amd64:/lib:/usr/lib:/usr/local/lib
[junit4:junit4]   2> 99 T42 oaz.Environment.logEnv Server environment:java.io.tmpdir=.
[junit4:junit4]   2> 100 T42 oaz.Environment.logEnv Server environment:java.compiler=<NA>
[junit4:junit4]   2> 100 T42 oaz.Environment.logEnv Server environment:os.name=FreeBSD
[junit4:junit4]   2> 100 T42 oaz.Environment.logEnv Server environment:os.arch=amd64
[junit4:junit4]   2> 100 T42 oaz.Environment.logEnv Server environment:os.version=9.0-RELEASE
[junit4:junit4]   2> 101 T42 oaz.Environment.logEnv Server environment:user.name=hudson
[junit4:junit4]   2> 101 T42 oaz.Environment.logEnv Server environment:user.home=/home/hudson
[junit4:junit4]   2> 101 T42 oaz.Environment.logEnv Server environment:user.dir=/usr/home/hudson/hudson-slave/workspace/Lucene-Solr-Tests-4.x-java7/solr/build/solr-core/test/J0
[junit4:junit4]   2> 151 T42 oazs.ZooKeeperServer.setTickTime tickTime set to 1000
[junit4:junit4]   2> 152 T42 oazs.ZooKeeperServer.setMinSessionTimeout minSessionTimeout set to -1
[junit4:junit4]   2> 152 T42 oazs.ZooKeeperServer.setMaxSessionTimeout maxSessionTimeout set to -1
[junit4:junit4]   2> 160 T42 oazs.NIOServerCnxnFactory.configure binding to port 0.0.0.0/0.0.0.0:0
[junit4:junit4]   2> 223 T41 oasc.ZkTestServer.run start zk server on port:32779
[junit4:junit4]   2> 234 T42 oazsp.FileTxnSnapLog.save Snapshotting: 0x0 to /usr/home/hudson/hudson-slave/workspace/Lucene-Solr-Tests-4.x-java7/solr/build/solr-core/test/J0/./org.apache.solr.cloud.BasicDistributedZkTest-1355907916225/zookeeper/server1/data/version-2/snapshot.0
[junit4:junit4]   2> 299 T41 oaz.Environment.logEnv Client environment:zookeeper.version=3.4.5-1392090, built on 09/30/2012 17:52 GMT
[junit4:junit4]   2> 300 T41 oaz.Environment.logEnv Client environment:host.name=lucene.zones.apache.org
[junit4:junit4]   2> 301 T41 oaz.Environment.logEnv Client environment:java.version=1.7.0_09
[junit4:junit4]   2> 301 T41 oaz.Environment.logEnv Client environment:java.vendor=Oracle Corporation
[junit4:junit4]   2> 302 T41 oaz.Environment.logEnv Client environment:java.home=/usr/local/openjdk7/jre
[junit4:junit4]   2> 302 T41 oaz.Environment.logEnv Client environment:java.class.path=/usr/home/hudson/hudson-slave/workspace/Lucene-Solr-Tests-4.x-java7/solr/build/solr-core/classes/test:/usr/home/hudson/hudson-slave/workspace/Lucene-Solr-Tests-4.x-java7/solr/build/solr-test-framework/classes/java:/usr/home/hudson/hudson-slave/workspace/Lucene-Solr-Tests-4.x-java7/solr/build/solr-core/test-files:/usr/home/hudson/hudson-slave/workspace/Lucene-Solr-Tests-4.x-java7/lucene/build/test-framework/classes/java:/usr/home/hudson/hudson-slave/workspace/Lucene-Solr-Tests-4.x-java7/lucene/build/codecs/classes/java:/usr/home/hudson/hudson-slave/workspace/Lucene-Solr-Tests-4.x-java7/solr/build/solr-solrj/classes/java:/usr/home/hudson/hudson-slave/workspace/Lucene-Solr-Tests-4.x-java7/solr/build/solr-core/classes/java:/usr/home/hudson/hudson-slave/workspace/Lucene-Solr-Tests-4.x-java7/lucene/build/analysis/common/lucene-analyzers-common-4.1-SNAPSHOT.jar:/usr/home/hudson/hudson-slave/workspace/Lucene-Solr-Tests-4.x-java7/lucene/build/analysis/kuromoji/lucene-analyzers-kuromoji-4.1-SNAPSHOT.jar:/usr/home/hudson/hudson-slave/workspace/Lucene-Solr-Tests-4.x-java7/lucene/build/analysis/phonetic/lucene-analyzers-phonetic-4.1-SNAPSHOT.jar:/usr/home/hudson/hudson-slave/workspace/Lucene-Solr-Tests-4.x-java7/lucene/build/highlighter/lucene-highlighter-4.1-SNAPSHOT.jar:/usr/home/hudson/hudson-slave/workspace/Lucene-Solr-Tests-4.x-java7/lucene/build/memory/lucene-memory-4.1-SNAPSHOT.jar:/usr/home/hudson/hudson-slave/workspace/Lucene-Solr-Tests-4.x-java7/lucene/build/misc/lucene-misc-4.1-SNAPSHOT.jar:/usr/home/hudson/hudson-slave/workspace/Lucene-Solr-Tests-4.x-java7/lucene/build/spatial/lucene-spatial-4.1-SNAPSHOT.jar:/usr/home/hudson/hudson-slave/workspace/Lucene-Solr-Tests-4.x-java7/lucene/build/suggest/lucene-suggest-4.1-SNAPSHOT.jar:/usr/home/hudson/hudson-slave/workspace/Lucene-Solr-Tests-4.x-java7/lucene/build/grouping/lucene-grouping-4.1-SNAPSHOT.jar:/usr/home/hudson/hudson-slave/workspace/Lucene-Solr-Tests-4.x-java7/lucene/build/queries/lucene-queries-4.1-SNAPSHOT.jar:/usr/home/hudson/hudson-slave/workspace/Lucene-Solr-Tests-4.x-java7/lucene/build/queryparser/lucene-queryparser-4.1-SNAPSHOT.jar:/usr/home/hudson/hudson-slave/workspace/Lucene-Solr-Tests-4.x-java7/solr/core/lib/cglib-nodep-2.2.jar:/usr/home/hudson/hudson-slave/workspace/Lucene-Solr-Tests-4.x-java7/solr/core/lib/commons-cli-1.2.jar:/usr/home/hudson/hudson-slave/workspace/Lucene-Solr-Tests-4.x-java7/solr/core/lib/commons-codec-1.7.jar:/usr/home/hudson/hudson-slave/workspace/Lucene-Solr-Tests-4.x-java7/solr/core/lib/commons-fileupload-1.2.1.jar:/usr/home/hudson/hudson-slave/workspace/Lucene-Solr-Tests-4.x-java7/solr/core/lib/commons-lang-2.6.jar:/usr/home/hudson/hudson-slave/workspace/Lucene-Solr-Tests-4.x-java7/solr/core/lib/easymock-3.0.jar:/usr/home/hudson/hudson-slave/workspace/Lucene-Solr-Tests-4.x-java7/solr/core/lib/guava-13.0.1.jar:/usr/home/hudson/hudson-slave/workspace/Lucene-Solr-Tests-4.x-java7/solr/core/lib/javax.servlet-api-3.0.1.jar:/usr/home/hudson/hudson-slave/workspace/Lucene-Solr-Tests-4.x-java7/solr/core/lib/metrics-core-2.1.2.jar:/usr/home/hudson/hudson-slave/workspace/Lucene-Solr-Tests-4.x-java7/solr/core/lib/objenesis-1.2.jar:/usr/home/hudson/hudson-slave/workspace/Lucene-Solr-Tests-4.x-java7/solr/core/lib/spatial4j-0.3.jar:/usr/home/hudson/hudson-slave/workspace/Lucene-Solr-Tests-4.x-java7/solr/solrj/lib/commons-io-2.1.jar:/usr/home/hudson/hudson-slave/workspace/Lucene-Solr-Tests-4.x-java7/solr/solrj/lib/httpclient-4.1.3.jar:/usr/home/hudson/hudson-slave/workspace/Lucene-Solr-Tests-4.x-java7/solr/solrj/lib/httpcore-4.1.4.jar:/usr/home/hudson/hudson-slave/workspace/Lucene-Solr-Tests-4.x-java7/solr/solrj/lib/httpmime-4.1.3.jar:/usr/home/hudson/hudson-slave/workspace/Lucene-Solr-Tests-4.x-java7/solr/solrj/lib/jcl-over-slf4j-1.6.4.jar:/usr/home/hudson/hudson-slave/workspace/Lucene-Solr-Tests-4.x-java7/solr/solrj/lib/log4j-over-slf4j-1.6.4.jar:/usr/home/hudson/hudson-slave/workspace/Lucene-Solr-Tests-4.x-java7/solr/solrj/lib/slf4j-api-1.6.4.jar:/usr/home/hudson/hudson-slave/workspace/Lucene-Solr-Tests-4.x-java7/solr/solrj/lib/slf4j-jdk14-1.6.4.jar:/usr/home/hudson/hudson-slave/workspace/Lucene-Solr-Tests-4.x-java7/solr/solrj/lib/wstx-asl-3.2.7.jar:/usr/home/hudson/hudson-slave/workspace/Lucene-Solr-Tests-4.x-java7/solr/solrj/lib/zookeeper-3.4.5.jar:/usr/home/hudson/hudson-slave/workspace/Lucene-Solr-Tests-4.x-java7/solr/example/lib/jetty-continuation-8.1.8.v20121106.jar:/usr/home/hudson/hudson-slave/workspace/Lucene-Solr-Tests-4.x-java7/solr/example/lib/jetty-deploy-8.1.8.v20121106.jar:/usr/home/hudson/hudson-slave/workspace/Lucene-Solr-Tests-4.x-java7/solr/example/lib/jetty-http-8.1.8.v20121106.jar:/usr/home/hudson/hudson-slave/workspace/Lucene-Solr-Tests-4.x-java7/solr/example/lib/jetty-io-8.1.8.v20121106.jar:/usr/home/hudson/hudson-slave/workspace/Lucene-Solr-Tests-4.x-java7/solr/example/lib/jetty-jmx-8.1.8.v20121106.jar:/usr/home/hudson/hudson-slave/workspace/Lucene-Solr-Tests-4.x-java7/solr/example/lib/jetty-security-8.1.8.v20121106.jar:/usr/home/hudson/hudson-slave/workspace/Lucene-Solr-Tests-4.x-java7/solr/example/lib/jetty-server-8.1.8.v20121106.jar:/usr/home/hudson/hudson-slave/workspace/Lucene-Solr-Tests-4.x-java7/solr/example/lib/jetty-servlet-8.1.8.v20121106.jar:/usr/home/hudson/hudson-slave/workspace/Lucene-Solr-Tests-4.x-java7/solr/example/lib/jetty-util-8.1.8.v20121106.jar:/usr/home/hudson/hudson-slave/workspace/Lucene-Solr-Tests-4.x-java7/solr/example/lib/jetty-webapp-8.1.8.v20121106.jar:/usr/home/hudson/hudson-slave/workspace/Lucene-Solr-Tests-4.x-java7/solr/example/lib/jetty-xml-8.1.8.v20121106.jar:/usr/home/hudson/hudson-slave/workspace/Lucene-Solr-Tests-4.x-java7/solr/example/lib/servlet-api-3.0.jar:/usr/home/hudson/hudson-slave/workspace/Lucene-Solr-Tests-4.x-java7/solr/example/example-DIH/solr/db/lib/derby-10.9.1.0.jar:/usr/home/hudson/hudson-slave/workspace/Lucene-Solr-Tests-4.x-java7/solr/example/example-DIH/solr/db/lib/hsqldb-1.8.0.10.jar:/usr/home/hudson/hudson-slave/workspace/Lucene-Solr-Tests-4.x-java7/lucene/build/core/classes/java:/usr/home/hudson/hudson-slave/workspace/Lucene-Solr-Tests-4.x-java7/lucene/test-framework/lib/junit-4.10.jar:/usr/home/hudson/hudson-slave/workspace/Lucene-Solr-Tests-4.x-java7/lucene/test-framework/lib/randomizedtesting-runner-2.0.7.jar:/home/hudson/hudson-slave/tools/Ant/ant-1.8.2/lib/ant-launcher.jar:/home/hudson/.ant/lib/ivy-2.2.0.jar:/home/hudson/hudson-slave/tools/Ant/ant-1.8.2/lib/ant-apache-regexp.jar:/home/hudson/hudson-slave/tools/Ant/ant-1.8.2/lib/ant-junit.jar:/home/hudson/hudson-slave/tools/Ant/ant-1.8.2/lib/ant-apache-bsf.jar:/home/hudson/hudson-slave/tools/Ant/ant-1.8.2/lib/ant-commons-net.jar:/home/hudson/hudson-slave/tools/Ant/ant-1.8.2/lib/ant-antlr.jar:/home/hudson/hudson-slave/tools/Ant/ant-1.8.2/lib/ant-apache-log4j.jar:/home/hudson/hudson-slave/tools/Ant/ant-1.8.2/lib/ant-commons-logging.jar:/home/hudson/hudson-slave/tools/Ant/ant-1.8.2/lib/ant-apache-xalan2.jar:/home/hudson/hudson-slave/tools/Ant/ant-1.8.2/lib/ant-apache-oro.jar:/home/hudson/hudson-slave/tools/Ant/ant-1.8.2/lib/ant-junit4.jar:/home/hudson/hudson-slave/tools/Ant/ant-1.8.2/lib/ant-netrexx.jar:/home/hudson/hudson-slave/tools/Ant/ant-1.8.2/lib/ant-swing.jar:/home/hudson/hudson-slave/tools/Ant/ant-1.8.2/lib/ant-javamail.jar:/home/hudson/hudson-slave/tools/Ant/ant-1.8.2/lib/ant-jsch.jar:/home/hudson/hudson-slave/tools/Ant/ant-1.8.2/lib/ant-jmf.jar:/home/hudson/hudson-slave/tools/Ant/ant-1.8.2/lib/ant.jar:/home/hudson/hudson-slave/tools/Ant/ant-1.8.2/lib/ant-apache-bcel.jar:/home/hudson/hudson-slave/tools/Ant/ant-1.8.2/lib/ant-jai.jar:/home/hudson/hudson-slave/tools/Ant/ant-1.8.2/lib/ant-testutil.jar:/home/hudson/hudson-slave/tools/Ant/ant-1.8.2/lib/ant-apache-resolver.jar:/home/hudson/hudson-slave/tools/Ant/ant-1.8.2/lib/ant-jdepend.jar:/usr/local/openjdk7/lib/tools.jar:/home/hudson/.ivy2/cache/com.carrotsearch.randomizedtesting/junit4-ant/jars/junit4-ant-2.0.7.jar
[junit4:junit4]   2> 304 T41 oaz.Environment.logEnv Client environment:java.library.path=/usr/local/openjdk7/jre/lib/amd64/server:/usr/local/openjdk7/jre/lib/amd64:/usr/local/openjdk7/jre/../lib/amd64:/usr/local/openjdk6/jre/lib/amd64/server:/usr/local/openjdk6/jre/lib/amd64:/usr/local/openjdk6/jre/../lib/amd64:/usr/java/packages/lib/amd64:/lib:/usr/lib:/usr/local/lib
[junit4:junit4]   2> 304 T41 oaz.Environment.logEnv Client environment:java.io.tmpdir=.
[junit4:junit4]   2> 305 T41 oaz.Environment.logEnv Client environment:java.compiler=<NA>
[junit4:junit4]   2> 305 T41 oaz.Environment.logEnv Client environment:os.name=FreeBSD
[junit4:junit4]   2> 306 T41 oaz.Environment.logEnv Client environment:os.arch=amd64
[junit4:junit4]   2> 306 T41 oaz.Environment.logEnv Client environment:os.version=9.0-RELEASE
[junit4:junit4]   2> 307 T41 oaz.Environment.logEnv Client environment:user.name=hudson
[junit4:junit4]   2> 307 T41 oaz.Environment.logEnv Client environment:user.home=/home/hudson
[junit4:junit4]   2> 308 T41 oaz.Environment.logEnv Client environment:user.dir=/usr/home/hudson/hudson-slave/workspace/Lucene-Solr-Tests-4.x-java7/solr/build/solr-core/test/J0
[junit4:junit4]   2> 312 T41 oaz.ZooKeeper.<init> Initiating client connection, connectString=127.0.0.1:32779 sessionTimeout=10000 watcher=org.apache.solr.common.cloud.ConnectionManager@379c975
[junit4:junit4]   2> 379 T41 oascc.ConnectionManager.waitForConnected Waiting for client to connect to ZooKeeper
[junit4:junit4]   2> 390 T47 oaz.ClientCnxn$SendThread.logStartConnect Opening socket connection to server localhost/127.0.0.1:32779. Will not attempt to authenticate using SASL (access denied ("javax.security.auth.AuthPermission" "getLoginConfiguration"))
[junit4:junit4]   2> 392 T47 oaz.ClientCnxn$SendThread.primeConnection Socket connection established to localhost/127.0.0.1:32779, initiating session
[junit4:junit4]   2> 393 T43 oazs.NIOServerCnxnFactory.run Accepted socket connection from /140.211.11.196:50054
[junit4:junit4]   2> 417 T43 oazs.ZooKeeperServer.processConnectRequest Client attempting to establish new session at /140.211.11.196:50054
[junit4:junit4]   2> 432 T45 oazsp.FileTxnLog.append Creating new log file: log.1
[junit4:junit4]   2> 464 T45 oazs.ZooKeeperServer.finishSessionInit Established session 0x13bb268e2cb0000 with negotiated timeout 10000 for client /140.211.11.196:50054
[junit4:junit4]   2> 464 T47 oaz.ClientCnxn$SendThread.onConnected Session establishment complete on server localhost/127.0.0.1:32779, sessionid = 0x13bb268e2cb0000, negotiated timeout = 10000
[junit4:junit4]   2> 471 T48 oascc.ConnectionManager.process Watcher org.apache.solr.common.cloud.ConnectionManager@379c975 name:ZooKeeperConnection Watcher:127.0.0.1:32779 got event WatchedEvent state:SyncConnected type:None path:null path:null type:None
[junit4:junit4]   2> 471 T41 oascc.ConnectionManager.waitForConnected Client is connected to ZooKeeper
[junit4:junit4]   2> 475 T41 oascc.SolrZkClient.makePath makePath: /solr
[junit4:junit4]   2> 543 T46 oazs.PrepRequestProcessor.pRequest2Txn Processed session termination for sessionid: 0x13bb268e2cb0000
[junit4:junit4]   2> 545 T48 oaz.ClientCnxn$EventThread.run EventThread shut down
[junit4:junit4]   2> 545 T41 oaz.ZooKeeper.close Session: 0x13bb268e2cb0000 closed
[junit4:junit4]   2> 546 T43 oazs.NIOServerCnxn.closeSock Closed socket connection for client /140.211.11.196:50054 which had sessionid 0x13bb268e2cb0000
[junit4:junit4]   2> 546 T41 oaz.ZooKeeper.<init> Initiating client connection, connectString=127.0.0.1:32779/solr sessionTimeout=10000 watcher=org.apache.solr.common.cloud.ConnectionManager@22a0c2ca
[junit4:junit4]   2> 547 T41 oascc.ConnectionManager.waitForConnected Waiting for client to connect to ZooKeeper
[junit4:junit4]   2> 548 T49 oaz.ClientCnxn$SendThread.logStartConnect Opening socket connection to server localhost/127.0.0.1:32779. Will not attempt to authenticate using SASL (access denied ("javax.security.auth.AuthPermission" "getLoginConfiguration"))
[junit4:junit4]   2> 549 T49 oaz.ClientCnxn$SendThread.primeConnection Socket connection established to localhost/127.0.0.1:32779, initiating session
[junit4:junit4]   2> 549 T43 oazs.NIOServerCnxnFactory.run Accepted socket connection from /140.211.11.196:42300
[junit4:junit4]   2> 550 T43 oazs.ZooKeeperServer.processConnectRequest Client attempting to establish new session at /140.211.11.196:42300
[junit4:junit4]   2> 552 T45 oazs.ZooKeeperServer.finishSessionInit Established session 0x13bb268e2cb0001 with negotiated timeout 10000 for client /140.211.11.196:42300
[junit4:junit4]   2> 552 T49 oaz.ClientCnxn$SendThread.onConnected Session establishment complete on server localhost/127.0.0.1:32779, sessionid = 0x13bb268e2cb0001, negotiated timeout = 10000
[junit4:junit4]   2> 553 T50 oascc.ConnectionManager.process Watcher org.apache.solr.common.cloud.ConnectionManager@22a0c2ca name:ZooKeeperConnection Watcher:127.0.0.1:32779/solr got event WatchedEvent state:SyncConnected type:None path:null path:null type:None
[junit4:junit4]   2> 553 T41 oascc.ConnectionManager.waitForConnected Client is connected to ZooKeeper
[junit4:junit4]   2> 568 T41 oascc.SolrZkClient.makePath makePath: /collections/collection1
[junit4:junit4]   2> 575 T41 oascc.SolrZkClient.makePath makePath: /collections/collection1/shards
[junit4:junit4]   2> 582 T41 oascc.SolrZkClient.makePath makePath: /collections/control_collection
[junit4:junit4]   2> 588 T41 oascc.SolrZkClient.makePath makePath: /collections/control_collection/shards
[junit4:junit4]   2> 595 T41 oasc.AbstractZkTestCase.putConfig put /usr/home/hudson/hudson-slave/workspace/Lucene-Solr-Tests-4.x-java7/solr/build/solr-core/test-files/solr/collection1/conf/solrconfig.xml to /configs/conf1/solrconfig.xml
[junit4:junit4]   2> 618 T41 oascc.SolrZkClient.makePath makePath: /configs/conf1/solrconfig.xml
[junit4:junit4]   2> 634 T41 oasc.AbstractZkTestCase.putConfig put /usr/home/hudson/hudson-slave/workspace/Lucene-Solr-Tests-4.x-java7/solr/build/solr-core/test-files/solr/collection1/conf/schema.xml to /configs/conf1/schema.xml
[junit4:junit4]   2> 636 T41 oascc.SolrZkClient.makePath makePath: /configs/conf1/schema.xml
[junit4:junit4]   2> 743 T41 oasc.AbstractZkTestCase.putConfig put /usr/home/hudson/hudson-slave/workspace/Lucene-Solr-Tests-4.x-java7/solr/build/solr-core/test-files/solr/collection1/conf/stopwords.txt to /configs/conf1/stopwords.txt
[junit4:junit4]   2> 744 T41 oascc.SolrZkClient.makePath makePath: /configs/conf1/stopwords.txt
[junit4:junit4]   2> 751 T41 oasc.AbstractZkTestCase.putConfig put /usr/home/hudson/hudson-slave/workspace/Lucene-Solr-Tests-4.x-java7/solr/build/solr-core/test-files/solr/collection1/conf/protwords.txt to /configs/conf1/protwords.txt
[junit4:junit4]   2> 752 T41 oascc.SolrZkClient.makePath makePath: /configs/conf1/protwords.txt
[junit4:junit4]   2> 759 T41 oasc.AbstractZkTestCase.putConfig put /usr/home/hudson/hudson-slave/workspace/Lucene-Solr-Tests-4.x-java7/solr/build/solr-core/test-files/solr/collection1/conf/currency.xml to /configs/conf1/currency.xml
[junit4:junit4]   2> 760 T41 oascc.SolrZkClient.makePath makePath: /configs/conf1/currency.xml
[junit4:junit4]   2> 767 T41 oasc.AbstractZkTestCase.putConfig put /usr/home/hudson/hudson-slave/workspace/Lucene-Solr-Tests-4.x-java7/solr/build/solr-core/test-files/solr/collection1/conf/open-exchange-rates.json to /configs/conf1/open-exchange-rates.json
[junit4:junit4]   2> 768 T41 oascc.SolrZkClient.makePath makePath: /configs/conf1/open-exchange-rates.json
[junit4:junit4]   2> 773 T41 oasc.AbstractZkTestCase.putConfig put /usr/home/hudson/hudson-slave/workspace/Lucene-Solr-Tests-4.x-java7/solr/build/solr-core/test-files/solr/collection1/conf/mapping-ISOLatin1Accent.txt to /configs/conf1/mapping-ISOLatin1Accent.txt
[junit4:junit4]   2> 774 T41 oascc.SolrZkClient.makePath makePath: /configs/conf1/mapping-ISOLatin1Accent.txt
[junit4:junit4]   2> 780 T41 oasc.AbstractZkTestCase.putConfig put /usr/home/hudson/hudson-slave/workspace/Lucene-Solr-Tests-4.x-java7/solr/build/solr-core/test-files/solr/collection1/conf/old_synonyms.txt to /configs/conf1/old_synonyms.txt
[junit4:junit4]   2> 782 T41 oascc.SolrZkClient.makePath makePath: /configs/conf1/old_synonyms.txt
[junit4:junit4]   2> 788 T41 oasc.AbstractZkTestCase.putConfig put /usr/home/hudson/hudson-slave/workspace/Lucene-Solr-Tests-4.x-java7/solr/build/solr-core/test-files/solr/collection1/conf/synonyms.txt to /configs/conf1/synonyms.txt
[junit4:junit4]   2> 789 T41 oascc.SolrZkClient.makePath makePath: /configs/conf1/synonyms.txt
[junit4:junit4]   2> 796 T46 oazs.PrepRequestProcessor.pRequest2Txn Processed session termination for sessionid: 0x13bb268e2cb0001
[junit4:junit4]   2> 798 T50 oaz.ClientCnxn$EventThread.run EventThread shut down
[junit4:junit4]   2> 798 T43 oazs.NIOServerCnxn.closeSock Closed socket connection for client /140.211.11.196:42300 which had sessionid 0x13bb268e2cb0001
[junit4:junit4]   2> 798 T41 oaz.ZooKeeper.close Session: 0x13bb268e2cb0001 closed
[junit4:junit4]   2> 1402 T41 oejs.Server.doStart jetty-8.1.8.v20121106
[junit4:junit4]   2> 1651 T41 oejs.AbstractConnector.doStart Started SocketConnector@127.0.0.1:42359
[junit4:junit4]   2> 1692 T41 oasc.SolrResourceLoader.locateSolrHome JNDI not configured for solr (NoInitialContextEx)
[junit4:junit4]   2> 1693 T41 oasc.SolrResourceLoader.locateSolrHome using system property solr.solr.home: /usr/home/hudson/hudson-slave/workspace/Lucene-Solr-Tests-4.x-java7/solr/build/solr-core/test/J0/./org.apache.solr.cloud.BasicDistributedZkTest-controljetty-1355907917019
[junit4:junit4]   2> 1694 T41 oasc.SolrResourceLoader.<init> new SolrResourceLoader for deduced Solr Home: '/usr/home/hudson/hudson-slave/workspace/Lucene-Solr-Tests-4.x-java7/solr/build/solr-core/test/J0/./org.apache.solr.cloud.BasicDistributedZkTest-controljetty-1355907917019/'
[junit4:junit4]   2> 1735 T41 oass.SolrDispatchFilter.init SolrDispatchFilter.init()
[junit4:junit4]   2> 1736 T41 oasc.SolrResourceLoader.locateSolrHome JNDI not configured for solr (NoInitialContextEx)
[junit4:junit4]   2> 1737 T41 oasc.SolrResourceLoader.locateSolrHome using system property solr.solr.home: /usr/home/hudson/hudson-slave/workspace/Lucene-Solr-Tests-4.x-java7/solr/build/solr-core/test/J0/./org.apache.solr.cloud.BasicDistributedZkTest-controljetty-1355907917019
[junit4:junit4]   2> 1737 T41 oasc.CoreContainer$Initializer.initialize looking for solr.xml: /usr/home/hudson/hudson-slave/workspace/Lucene-Solr-Tests-4.x-java7/solr/build/solr-core/test/J0/./org.apache.solr.cloud.BasicDistributedZkTest-controljetty-1355907917019/solr.xml
[junit4:junit4]   2> 1738 T41 oasc.CoreContainer.<init> New CoreContainer 806519038
[junit4:junit4]   2> 1739 T41 oasc.CoreContainer.load Loading CoreContainer using Solr Home: '/usr/home/hudson/hudson-slave/workspace/Lucene-Solr-Tests-4.x-java7/solr/build/solr-core/test/J0/./org.apache.solr.cloud.BasicDistributedZkTest-controljetty-1355907917019/'
[junit4:junit4]   2> 1739 T41 oasc.SolrResourceLoader.<init> new SolrResourceLoader for directory: '/usr/home/hudson/hudson-slave/workspace/Lucene-Solr-Tests-4.x-java7/solr/build/solr-core/test/J0/./org.apache.solr.cloud.BasicDistributedZkTest-controljetty-1355907917019/'
[junit4:junit4]   2> 1777 T41 oashc.HttpShardHandlerFactory.getParameter Setting socketTimeout to: 30000
[junit4:junit4]   2> 1778 T41 oashc.HttpShardHandlerFactory.getParameter Setting urlScheme to: http://
[junit4:junit4]   2> 1778 T41 oashc.HttpShardHandlerFactory.getParameter Setting connTimeout to: 15000
[junit4:junit4]   2> 1779 T41 oashc.HttpShardHandlerFactory.getParameter Setting maxConnectionsPerHost to: 20
[junit4:junit4]   2> 1779 T41 oashc.HttpShardHandlerFactory.getParameter Setting corePoolSize to: 0
[junit4:junit4]   2> 1780 T41 oashc.HttpShardHandlerFactory.getParameter Setting maximumPoolSize to: 2147483647
[junit4:junit4]   2> 1780 T41 oashc.HttpShardHandlerFactory.getParameter Setting maxThreadIdleTime to: 5
[junit4:junit4]   2> 1781 T41 oashc.HttpShardHandlerFactory.getParameter Setting sizeOfQueue to: -1
[junit4:junit4]   2> 1781 T41 oashc.HttpShardHandlerFactory.getParameter Setting fairnessPolicy to: false
[junit4:junit4]   2> 1809 T41 oascsi.HttpClientUtil.createClient Creating new http client, config:maxConnectionsPerHost=20&maxConnections=10000&socketTimeout=30000&connTimeout=15000&retry=false
[junit4:junit4]   2> 2202 T41 oasc.CoreContainer.load Registering Log Listener
[junit4:junit4]   2> 2220 T41 oasc.CoreContainer.initZooKeeper Zookeeper client=127.0.0.1:32779/solr
[junit4:junit4]   2> 2240 T41 oasc.ZkController.checkChrootPath zkHost includes chroot
[junit4:junit4]   2> 2241 T41 oaz.ZooKeeper.<init> Initiating client connection, connectString=127.0.0.1:32779 sessionTimeout=60000 watcher=org.apache.solr.common.cloud.ConnectionManager@710fba4e
[junit4:junit4]   2> 2242 T41 oascc.ConnectionManager.waitForConnected Waiting for client to connect to ZooKeeper
[junit4:junit4]   2> 2244 T61 oaz.ClientCnxn$SendThread.logStartConnect Opening socket connection to server localhost/127.0.0.1:32779. Will not attempt to authenticate using SASL (access denied ("javax.security.auth.AuthPermission" "getLoginConfiguration"))
[junit4:junit4]   2> 2245 T61 oaz.ClientCnxn$SendThread.primeConnection Socket connection established to localhost/127.0.0.1:32779, initiating session
[junit4:junit4]   2> 2245 T43 oazs.NIOServerCnxnFactory.run Accepted socket connection from /140.211.11.196:52763
[junit4:junit4]   2> 2246 T43 oazs.ZooKeeperServer.processConnectRequest Client attempting to establish new session at /140.211.11.196:52763
[junit4:junit4]   2> 2285 T45 oazs.ZooKeeperServer.finishSessionInit Established session 0x13bb268e2cb0002 with negotiated timeout 20000 for client /140.211.11.196:52763
[junit4:junit4]   2> 2285 T61 oaz.ClientCnxn$SendThread.onConnected Session establishment complete on server localhost/127.0.0.1:32779, sessionid = 0x13bb268e2cb0002, negotiated timeout = 20000
[junit4:junit4]   2> 2285 T62 oascc.ConnectionManager.process Watcher org.apache.solr.common.cloud.ConnectionManager@710fba4e name:ZooKeeperConnection Watcher:127.0.0.1:32779 got event WatchedEvent state:SyncConnected type:None path:null path:null type:None
[junit4:junit4]   2> 2286 T41 oascc.ConnectionManager.waitForConnected Client is connected to ZooKeeper
[junit4:junit4]   2> 2288 T46 oazs.PrepRequestProcessor.pRequest2Txn Processed session termination for sessionid: 0x13bb268e2cb0002
[junit4:junit4]   2> 2289 T43 oazs.NIOServerCnxn.closeSock Closed socket connection for client /140.211.11.196:52763 which had sessionid 0x13bb268e2cb0002
[junit4:junit4]   2> 2289 T62 oaz.ClientCnxn$EventThread.run EventThread shut down
[junit4:junit4]   2> 2289 T41 oaz.ZooKeeper.close Session: 0x13bb268e2cb0002 closed
[junit4:junit4]   2> 2293 T41 oascsi.HttpClientUtil.createClient Creating new http client, config:maxConnections=500&maxConnectionsPerHost=16&socketTimeout=15000&connTimeout=30000
[junit4:junit4]   2> 2307 T41 oaz.ZooKeeper.<init> Initiating client connection, connectString=127.0.0.1:32779/solr sessionTimeout=30000 watcher=org.apache.solr.common.cloud.ConnectionManager@e06d6c
[junit4:junit4]   2> 2308 T41 oascc.ConnectionManager.waitForConnected Waiting for client to connect to ZooKeeper
[junit4:junit4]   2> 2309 T63 oaz.ClientCnxn$SendThread.logStartConnect Opening socket connection to server localhost/127.0.0.1:32779. Will not attempt to authenticate using SASL (access denied ("javax.security.auth.AuthPermission" "getLoginConfiguration"))
[junit4:junit4]   2> 2309 T63 oaz.ClientCnxn$SendThread.primeConnection Socket connection established to localhost/127.0.0.1:32779, initiating session
[junit4:junit4]   2> 2310 T43 oazs.NIOServerCnxnFactory.run Accepted socket connection from /140.211.11.196:54189
[junit4:junit4]   2> 2311 T43 oazs.ZooKeeperServer.processConnectRequest Client attempting to establish new session at /140.211.11.196:54189
[junit4:junit4]   2> 2312 T45 oazs.ZooKeeperServer.finishSessionInit Established session 0x13bb268e2cb0003 with negotiated timeout 20000 for client /140.211.11.196:54189
[junit4:junit4]   2> 2312 T63 oaz.ClientCnxn$SendThread.onConnected Session establishment complete on server localhost/127.0.0.1:32779, sessionid = 0x13bb268e2cb0003, negotiated timeout = 20000
[junit4:junit4]   2> 2313 T64 oascc.ConnectionManager.process Watcher org.apache.solr.common.cloud.ConnectionManager@e06d6c name:ZooKeeperConnection Watcher:127.0.0.1:32779/solr got event WatchedEvent state:SyncConnected type:None path:null path:null type:None
[junit4:junit4]   2> 2314 T41 oascc.ConnectionManager.waitForConnected Client is connected to ZooKeeper
[junit4:junit4]   2> 2328 T46 oazs.PrepRequestProcessor.pRequest Got user-level KeeperException when processing sessionid:0x13bb268e2cb0003 type:create cxid:0x2 zxid:0x1a txntype:-1 reqpath:n/a Error Path:/solr/overseer Error:KeeperErrorCode = NodeExists for /solr/overseer
[junit4:junit4]   2> 2337 T41 oascc.SolrZkClient.makePath makePath: /live_nodes
[junit4:junit4]   2> 2340 T41 oasc.ZkController.createEphemeralLiveNode Register node as live in ZooKeeper:/live_nodes/127.0.0.1:42359_
[junit4:junit4]   2> 2345 T46 oazs.PrepRequestProcessor.pRequest Got user-level KeeperException when processing sessionid:0x13bb268e2cb0003 type:delete cxid:0x7 zxid:0x1c txntype:-1 reqpath:n/a Error Path:/solr/live_nodes/127.0.0.1:42359_ Error:KeeperErrorCode = NoNode for /solr/live_nodes/127.0.0.1:42359_
[junit4:junit4]   2> 2346 T41 oascc.SolrZkClient.makePath makePath: /live_nodes/127.0.0.1:42359_
[junit4:junit4]   2> 2353 T41 oascc.SolrZkClient.makePath makePath: /overseer_elect/election
[junit4:junit4]   2> 2373 T46 oazs.PrepRequestProcessor.pRequest Got user-level KeeperException when processing sessionid:0x13bb268e2cb0003 type:delete cxid:0x15 zxid:0x21 txntype:-1 reqpath:n/a Error Path:/solr/overseer_elect/leader Error:KeeperErrorCode = NoNode for /solr/overseer_elect/leader
[junit4:junit4]   2> 2375 T41 oascc.SolrZkClient.makePath makePath: /overseer_elect/leader
[junit4:junit4]   2> 2380 T41 oasc.Overseer.start Overseer (id=88860781215154179-127.0.0.1:42359_-n_0000000000) starting
[junit4:junit4]   2> 2381 T46 oazs.PrepRequestProcessor.pRequest Got user-level KeeperException when processing sessionid:0x13bb268e2cb0003 type:create cxid:0x1a zxid:0x23 txntype:-1 reqpath:n/a Error Path:/solr/overseer Error:KeeperErrorCode = NodeExists for /solr/overseer
[junit4:junit4]   2> 2398 T46 oazs.PrepRequestProcessor.pRequest Got user-level KeeperException when processing sessionid:0x13bb268e2cb0003 type:create cxid:0x1b zxid:0x24 txntype:-1 reqpath:n/a Error Path:/solr/overseer Error:KeeperErrorCode = NodeExists for /solr/overseer
[junit4:junit4]   2> 2400 T46 oazs.PrepRequestProcessor.pRequest Got user-level KeeperException when processing sessionid:0x13bb268e2cb0003 type:create cxid:0x1c zxid:0x25 txntype:-1 reqpath:n/a Error Path:/solr/overseer Error:KeeperErrorCode = NodeExists for /solr/overseer
[junit4:junit4]   2> 2407 T46 oazs.PrepRequestProcessor.pRequest Got user-level KeeperException when processing sessionid:0x13bb268e2cb0003 type:create cxid:0x1d zxid:0x26 txntype:-1 reqpath:n/a Error Path:/solr/overseer Error:KeeperErrorCode = NodeExists for /solr/overseer
[junit4:junit4]   2> 2409 T66 oasc.OverseerCollectionProcessor.run Process current queue of collection messages
[junit4:junit4]   2> 2410 T41 oascc.SolrZkClient.makePath makePath: /clusterstate.json
[junit4:junit4]   2> 2415 T41 oascc.ZkStateReader.createClusterStateWatchersAndUpdate Updating cluster state from ZooKeeper... 
[junit4:junit4]   2> 2433 T65 oasc.Overseer$ClusterStateUpdater.run Starting to work on the main queue
[junit4:junit4]   2> 2490 T67 oasc.CoreContainer.create Creating SolrCore 'collection1' using instanceDir: /usr/home/hudson/hudson-slave/workspace/Lucene-Solr-Tests-4.x-java7/solr/build/solr-core/test/J0/./org.apache.solr.cloud.BasicDistributedZkTest-controljetty-1355907917019/collection1
[junit4:junit4]   2> 2490 T67 oasc.ZkController.createCollectionZkNode Check for collection zkNode:control_collection
[junit4:junit4]   2> 2492 T67 oasc.ZkController.createCollectionZkNode Collection zkNode exists
[junit4:junit4]   2> 2492 T67 oasc.ZkController.readConfigName Load collection config from:/collections/control_collection
[junit4:junit4]   2> 2495 T67 oasc.SolrResourceLoader.<init> new SolrResourceLoader for directory: '/usr/home/hudson/hudson-slave/workspace/Lucene-Solr-Tests-4.x-java7/solr/build/solr-core/test/J0/./org.apache.solr.cloud.BasicDistributedZkTest-controljetty-1355907917019/collection1/'
[junit4:junit4]   2> 2497 T67 oasc.SolrResourceLoader.replaceClassLoader Adding 'file:/usr/home/hudson/hudson-slave/workspace/Lucene-Solr-Tests-4.x-java7/solr/build/solr-core/test/J0/org.apache.solr.cloud.BasicDistributedZkTest-controljetty-1355907917019/collection1/lib/README' to classloader
[junit4:junit4]   2> 2497 T67 oasc.SolrResourceLoader.replaceClassLoader Adding 'file:/usr/home/hudson/hudson-slave/workspace/Lucene-Solr-Tests-4.x-java7/solr/build/solr-core/test/J0/org.apache.solr.cloud.BasicDistributedZkTest-controljetty-1355907917019/collection1/lib/classes/' to classloader
[junit4:junit4]   2> 2589 T67 oasc.SolrConfig.<init> Using Lucene MatchVersion: LUCENE_41
[junit4:junit4]   2> 2655 T67 oasc.SolrConfig.<init> Loaded SolrConfig: solrconfig.xml
[junit4:junit4]   2> 2758 T67 oass.IndexSchema.readSchema Reading Solr Schema
[junit4:junit4]   2> 2778 T67 oass.IndexSchema.readSchema Schema name=test
[junit4:junit4]   2> 3363 T67 oass.OpenExchangeRatesOrgProvider.init Initialized with rates=open-exchange-rates.json, refreshInterval=1440.
[junit4:junit4]   2> 3378 T67 oass.IndexSchema.readSchema default search field in schema is text
[junit4:junit4]   2> 3382 T67 oass.IndexSchema.readSchema unique key field: id
[junit4:junit4]   2> 3410 T67 oass.FileExchangeRateProvider.reload Reloading exchange rates from file currency.xml
[junit4:junit4]   2> 3416 T67 oass.FileExchangeRateProvider.reload Reloading exchange rates from file currency.xml
[junit4:junit4]   2> 3421 T67 oass.OpenExchangeRatesOrgProvider.reload Reloading exchange rates from open-exchange-rates.json
[junit4:junit4]   2> 3424 T67 oass.OpenExchangeRatesOrgProvider.reload Reloading exchange rates from open-exchange-rates.json
[junit4:junit4]   2> 3427 T67 oasc.SolrCore.<init> [collection1] Opening new SolrCore at /usr/home/hudson/hudson-slave/workspace/Lucene-Solr-Tests-4.x-java7/solr/build/solr-core/test/J0/./org.apache.solr.cloud.BasicDistributedZkTest-controljetty-1355907917019/collection1/, dataDir=./org.apache.solr.cloud.BasicDistributedZkTest-1355907916225/control/data/
[junit4:junit4]   2> 3431 T67 oasc.JmxMonitoredMap.<init> JMX monitoring is enabled. Adding Solr mbeans to JMX Server: com.sun.jmx.mbeanserver.JmxMBeanServer@137b2615
[junit4:junit4]   2> 3432 T67 oasc.SolrCore.initDirectoryFactory solr.NRTCachingDirectoryFactory
[junit4:junit4]   2> 3456 T67 oasc.CachingDirectoryFactory.get return new directory for /usr/home/hudson/hudson-slave/workspace/Lucene-Solr-Tests-4.x-java7/solr/build/solr-core/test/J0/./org.apache.solr.cloud.BasicDistributedZkTest-1355907916225/control/data forceNew:false
[junit4:junit4]   2> 3457 T67 oasc.CachingDirectoryFactory.close Releasing directory:/usr/home/hudson/hudson-slave/workspace/Lucene-Solr-Tests-4.x-java7/solr/build/solr-core/test/J0/./org.apache.solr.cloud.BasicDistributedZkTest-1355907916225/control/data
[junit4:junit4]   2> 3457 T67 oasc.SolrCore.getNewIndexDir New index directory detected: old=null new=./org.apache.solr.cloud.BasicDistributedZkTest-1355907916225/control/data/index/
[junit4:junit4]   2> 3458 T67 oasc.SolrCore.initIndex WARNING [collection1] Solr index directory './org.apache.solr.cloud.BasicDistributedZkTest-1355907916225/control/data/index' doesn't exist. Creating new index...
[junit4:junit4]   2> 3459 T67 oasc.CachingDirectoryFactory.get return new directory for /usr/home/hudson/hudson-slave/workspace/Lucene-Solr-Tests-4.x-java7/solr/build/solr-core/test/J0/./org.apache.solr.cloud.BasicDistributedZkTest-1355907916225/control/data/index forceNew:false
[junit4:junit4]   2> 3464 T67 oasc.SolrDeletionPolicy.onCommit SolrDeletionPolicy.onCommit: commits:num=1
[junit4:junit4]   2> 		commit{dir=RateLimitedDirectoryWrapper(NRTCachingDirectory(org.apache.lucene.store.NIOFSDirectory@/usr/home/hudson/hudson-slave/workspace/Lucene-Solr-Tests-4.x-java7/solr/build/solr-core/test/J0/org.apache.solr.cloud.BasicDistributedZkTest-1355907916225/control/data/index lockFactory=org.apache.lucene.store.NativeFSLockFactory@6637b7f6; maxCacheMB=48.0 maxMergeSizeMB=4.0)),segFN=segments_1,generation=1,filenames=[segments_1]
[junit4:junit4]   2> 3465 T67 oasc.SolrDeletionPolicy.updateCommits newest commit = 1[segments_1]
[junit4:junit4]   2> 3466 T67 oasc.CachingDirectoryFactory.close Releasing directory:/usr/home/hudson/hudson-slave/workspace/Lucene-Solr-Tests-4.x-java7/solr/build/solr-core/test/J0/./org.apache.solr.cloud.BasicDistributedZkTest-1355907916225/control/data/index
[junit4:junit4]   2> 3466 T67 oasc.SolrCore.initWriters created xml: solr.XMLResponseWriter
[junit4:junit4]   2> 3468 T67 oasup.UpdateRequestProcessorChain.init inserting DistributedUpdateProcessorFactory into updateRequestProcessorChain "dedupe"
[junit4:junit4]   2> 3468 T67 oasup.UpdateRequestProcessorChain.init inserting DistributedUpdateProcessorFactory into updateRequestProcessorChain "dedupe-allfields"
[junit4:junit4]   2> 3469 T67 oasup.UpdateRequestProcessorChain.init inserting DistributedUpdateProcessorFactory into updateRequestProcessorChain "stored_sig"
[junit4:junit4]   2> 3469 T67 oasup.UpdateRequestProcessorChain.init inserting DistributedUpdateProcessorFactory into updateRequestProcessorChain "uniq-fields"
[junit4:junit4]   2> 3470 T67 oasup.UpdateRequestProcessorChain.init inserting DistributedUpdateProcessorFactory into updateRequestProcessorChain "distrib-dup-test-chain-implicit"
[junit4:junit4]   2> 3470 T67 oasc.RequestHandlers.initHandlersFromConfig adding lazy requestHandler: solr.ReplicationHandler
[junit4:junit4]   2> 3471 T67 oasc.RequestHandlers.initHandlersFromConfig created /replication: solr.ReplicationHandler
[junit4:junit4]   2> 3472 T67 oasc.RequestHandlers.initHandlersFromConfig created standard: solr.StandardRequestHandler
[junit4:junit4]   2> 3473 T67 oasc.RequestHandlers.initHandlersFromConfig created /get: solr.RealTimeGetHandler
[junit4:junit4]   2> 3474 T67 oasc.RequestHandlers.initHandlersFromConfig created dismax: solr.SearchHandler
[junit4:junit4]   2> 3475 T67 oasc.RequestHandlers.initHandlersFromConfig created mock: org.apache.solr.core.MockQuerySenderListenerReqHandler
[junit4:junit4]   2> 3476 T67 oasc.RequestHandlers.initHandlersFromConfig created /admin/: org.apache.solr.handler.admin.AdminHandlers
[junit4:junit4]   2> 3477 T67 oasc.RequestHandlers.initHandlersFromConfig created defaults: solr.StandardRequestHandler
[junit4:junit4]   2> 3477 T67 oasc.RequestHandlers.initHandlersFromConfig adding lazy requestHandler: solr.StandardRequestHandler
[junit4:junit4]   2> 3478 T67 oasc.RequestHandlers.initHandlersFromConfig created lazy: solr.StandardRequestHandler
[junit4:junit4]   2> 3479 T67 oasc.RequestHandlers.initHandlersFromConfig created /update: solr.UpdateRequestHandler
[junit4:junit4]   2> 3480 T67 oasc.RequestHandlers.initHandlersFromConfig created /terms: org.apache.solr.handler.component.SearchHandler
[junit4:junit4]   2> 3481 T67 oasc.RequestHandlers.initHandlersFromConfig created spellCheckCompRH: org.apache.solr.handler.component.SearchHandler
[junit4:junit4]   2> 3482 T67 oasc.RequestHandlers.initHandlersFromConfig created spellCheckCompRH_Direct: org.apache.solr.handler.component.SearchHandler
[junit4:junit4]   2> 3483 T67 oasc.RequestHandlers.initHandlersFromConfig created spellCheckWithWordbreak: org.apache.solr.handler.component.SearchHandler
[junit4:junit4]   2> 3484 T67 oasc.RequestHandlers.initHandlersFromConfig created spellCheckWithWordbreak_Direct: org.apache.solr.handler.component.SearchHandler
[junit4:junit4]   2> 3485 T67 oasc.RequestHandlers.initHandlersFromConfig created spellCheckCompRH1: org.apache.solr.handler.component.SearchHandler
[junit4:junit4]   2> 3486 T67 oasc.RequestHandlers.initHandlersFromConfig created mltrh: org.apache.solr.handler.component.SearchHandler
[junit4:junit4]   2> 3487 T67 oasc.RequestHandlers.initHandlersFromConfig created tvrh: org.apache.solr.handler.component.SearchHandler
[junit4:junit4]   2> 3488 T67 oasc.RequestHandlers.initHandlersFromConfig created /mlt: solr.MoreLikeThisHandler
[junit4:junit4]   2> 3490 T67 oasc.RequestHandlers.initHandlersFromConfig created /debug/dump: solr.DumpRequestHandler
[junit4:junit4]   2> 3499 T67 oashl.XMLLoader.init xsltCacheLifetimeSeconds=60
[junit4:junit4]   2> 3503 T67 oasc.SolrCore.initDeprecatedSupport WARNING solrconfig.xml uses deprecated <admin/gettableFiles>, Please update your config to use the ShowFileRequestHandler.
[junit4:junit4]   2> 3505 T67 oasc.SolrCore.initDeprecatedSupport WARNING adding ShowFileRequestHandler with hidden files: [SCHEMA.XML, OLD_SYNONYMS.TXT, STOPWORDS.TXT, PROTWORDS.TXT, OPEN-EXCHANGE-RATES.JSON, SYNONYMS.TXT, CURRENCY.XML, MAPPING-ISOLATIN1ACCENT.TXT]
[junit4:junit4]   2> 3508 T67 oasc.CachingDirectoryFactory.close Releasing directory:/usr/home/hudson/hudson-slave/workspace/Lucene-Solr-Tests-4.x-java7/solr/build/solr-core/test/J0/./org.apache.solr.cloud.BasicDistributedZkTest-1355907916225/control/data
[junit4:junit4]   2> 3509 T67 oass.SolrIndexSearcher.<init> Opening Searcher@78b15cbb main
[junit4:junit4]   2> 3528 T67 oasu.CommitTracker.<init> Hard AutoCommit: disabled
[junit4:junit4]   2> 3529 T67 oasu.CommitTracker.<init> Soft AutoCommit: disabled
[junit4:junit4]   2> 3529 T67 oashc.SpellCheckComponent.inform Initializing spell checkers
[junit4:junit4]   2> 3540 T67 oass.DirectSolrSpellChecker.init init: {name=direct,classname=DirectSolrSpellChecker,field=lowerfilt,minQueryLength=3}
[junit4:junit4]   2> 3597 T68 oasc.SolrCore.registerSearcher [collection1] Registered new searcher Searcher@78b15cbb main{StandardDirectoryReader(segments_1:1)}
[junit4:junit4]   2> 3602 T67 oasc.ZkController.publish publishing core=collection1 state=down
[junit4:junit4]   2> 3603 T67 oasc.ZkController.publish numShards not found on descriptor - reading it from system property
[junit4:junit4]   2> 3604 T46 oazs.PrepRequestProcessor.pRequest Got user-level KeeperException when processing sessionid:0x13bb268e2cb0003 type:create cxid:0x56 zxid:0x29 txntype:-1 reqpath:n/a Error Path:/solr/overseer/queue Error:KeeperErrorCode = NoNode for /solr/overseer/queue
[junit4:junit4]   2> 3947 T65 oascc.ZkStateReader.updateClusterState Updating cloud state from ZooKeeper... 
[junit4:junit4]   2> 3948 T65 oasc.Overseer$ClusterStateUpdater.updateState Update state numShards=1 message={
[junit4:junit4]   2> 	  "operation":"state",
[junit4:junit4]   2> 	  "numShards":"1",
[junit4:junit4]   2> 	  "shard":null,
[junit4:junit4]   2> 	  "roles":null,
[junit4:junit4]   2> 	  "state":"down",
[junit4:junit4]   2> 	  "core":"collection1",
[junit4:junit4]   2> 	  "collection":"control_collection",
[junit4:junit4]   2> 	  "node_name":"127.0.0.1:42359_",
[junit4:junit4]   2> 	  "base_url":"http://127.0.0.1:42359"}
[junit4:junit4]   2> 3949 T65 oasc.Overseer$ClusterStateUpdater.createCollection Create collection control_collection with numShards 1
[junit4:junit4]   2> 3975 T65 oasc.Overseer$ClusterStateUpdater.updateState Assigning new node to shard shard=shard1
[junit4:junit4]   2> 3976 T46 oazs.PrepRequestProcessor.pRequest Got user-level KeeperException when processing sessionid:0x13bb268e2cb0003 type:create cxid:0x5e zxid:0x2c txntype:-1 reqpath:n/a Error Path:/solr/overseer/queue-work Error:KeeperErrorCode = NoNode for /solr/overseer/queue-work
[junit4:junit4]   2> 4096 T64 oascc.ZkStateReader$2.process A cluster state change: WatchedEvent state:SyncConnected type:NodeDataChanged path:/clusterstate.json, has occurred - updating... (live nodes size: 1)
[junit4:junit4]   2> 4109 T67 oasc.CoreContainer.registerCore registering core: collection1
[junit4:junit4]   2> 4109 T67 oasc.ZkController.register Register replica - core:collection1 address:http://127.0.0.1:42359 collection:control_collection shard:shard1
[junit4:junit4]   2> 4119 T67 oascsi.HttpClientUtil.createClient Creating new http client, config:maxConnections=10000&maxConnectionsPerHost=20&connTimeout=30000&socketTimeout=30000&retry=false
[junit4:junit4]   2> 4134 T67 oascc.SolrZkClient.makePath makePath: /collections/control_collection/leader_elect/shard1/election
[junit4:junit4]   2> 4145 T46 oazs.PrepRequestProcessor.pRequest Got user-level KeeperException when processing sessionid:0x13bb268e2cb0003 type:delete cxid:0x78 zxid:0x36 txntype:-1 reqpath:n/a Error Path:/solr/collections/control_collection/leaders Error:KeeperErrorCode = NoNode for /solr/collections/control_collection/leaders
[junit4:junit4]   2> 4153 T67 oasc.ShardLeaderElectionContext.runLeaderProcess Running the leader process.
[junit4:junit4]   2> 4154 T46 oazs.PrepRequestProcessor.pRequest Got user-level KeeperException when processing sessionid:0x13bb268e2cb0003 type:create cxid:0x79 zxid:0x37 txntype:-1 reqpath:n/a Error Path:/solr/overseer Error:KeeperErrorCode = NodeExists for /solr/overseer
[junit4:junit4]   2> 4157 T67 oasc.ShardLeaderElectionContext.waitForReplicasToComeUp Enough replicas found to continue.
[junit4:junit4]   2> 4157 T67 oasc.ShardLeaderElectionContext.runLeaderProcess I may be the new leader - try and sync
[junit4:junit4]   2> 4158 T67 oasc.SyncStrategy.sync Sync replicas to http://127.0.0.1:42359/collection1/
[junit4:junit4]   2> 4158 T67 oasc.SyncStrategy.syncReplicas Sync Success - now sync replicas to me
[junit4:junit4]   2> 4159 T67 oasc.SyncStrategy.syncToMe http://127.0.0.1:42359/collection1/ has no replicas
[junit4:junit4]   2> 4159 T67 oasc.ShardLeaderElectionContext.runLeaderProcess I am the new leader: http://127.0.0.1:42359/collection1/
[junit4:junit4]   2> 4159 T67 oascc.SolrZkClient.makePath makePath: /collections/control_collection/leaders/shard1
[junit4:junit4]   2> 4172 T46 oazs.PrepRequestProcessor.pRequest Got user-level KeeperException when processing sessionid:0x13bb268e2cb0003 type:create cxid:0x83 zxid:0x3b txntype:-1 reqpath:n/a Error Path:/solr/overseer Error:KeeperErrorCode = NodeExists for /solr/overseer
[junit4:junit4]   2> 4602 T65 oascc.ZkStateReader.updateClusterState Updating cloud state from ZooKeeper... 
[junit4:junit4]   2> 4627 T64 oascc.ZkStateReader$2.process A cluster state change: WatchedEvent state:SyncConnected type:NodeDataChanged path:/clusterstate.json, has occurred - updating... (live nodes size: 1)
[junit4:junit4]   2> 4685 T67 oasc.ZkController.register We are http://127.0.0.1:42359/collection1/ and leader is http://127.0.0.1:42359/collection1/
[junit4:junit4]   2> 4689 T67 oasc.ZkController.register No LogReplay needed for core=collection1 baseURL=http://127.0.0.1:42359
[junit4:junit4]   2> 4690 T67 oasc.ZkController.checkRecovery I am the leader, no recovery necessary
[junit4:junit4]   2> 4690 T67 oasc.ZkController.publish publishing core=collection1 state=active
[junit4:junit4]   2> 4690 T67 oasc.ZkController.publish numShards not found on descriptor - reading it from system property
[junit4:junit4]   2> 4693 T67 oascc.ZkStateReader.updateClusterState Updating cloud state from ZooKeeper... 
[junit4:junit4]   2> 4695 T41 oass.SolrDispatchFilter.init user.dir=/usr/home/hudson/hudson-slave/workspace/Lucene-Solr-Tests-4.x-java7/solr/build/solr-core/test/J0
[junit4:junit4]   2> 4696 T41 oass.SolrDispatchFilter.init SolrDispatchFilter.init() done
[junit4:junit4]   2> 4762 T41 oascsi.HttpClientUtil.createClient Creating new http client, config:maxConnections=128&maxConnectionsPerHost=32&followRedirects=false
[junit4:junit4]   2> 4790 T41 oascsi.HttpClientUtil.createClient Creating new http client, config:
[junit4:junit4]   2> 4808 T41 oaz.ZooKeeper.<init> Initiating client connection, connectString=127.0.0.1:32779/solr sessionTimeout=10000 watcher=org.apache.solr.common.cloud.ConnectionManager@1a2e808a
[junit4:junit4]   2> 4809 T41 oascc.ConnectionManager.waitForConnected Waiting for client to connect to ZooKeeper
[junit4:junit4]   2> 4810 T69 oaz.ClientCnxn$SendThread.logStartConnect Opening socket connection to server localhost/127.0.0.1:32779. Will not attempt to authenticate using SASL (access denied ("javax.security.auth.AuthPermission" "getLoginConfiguration"))
[junit4:junit4]   2> 4811 T69 oaz.ClientCnxn$SendThread.primeConnection Socket connection established to localhost/127.0.0.1:32779, initiating session
[junit4:junit4]   2> 4811 T43 oazs.NIOServerCnxnFactory.run Accepted socket connection from /140.211.11.196:60585
[junit4:junit4]   2> 4811 T43 oazs.ZooKeeperServer.processConnectRequest Client attempting to establish new session at /140.211.11.196:60585
[junit4:junit4]   2> 4813 T45 oazs.ZooKeeperServer.finishSessionInit Established session 0x13bb268e2cb0004 with negotiated timeout 10000 for client /140.211.11.196:60585
[junit4:junit4]   2> 4813 T69 oaz.ClientCnxn$SendThread.onConnected Session establishment complete on server localhost/127.0.0.1:32779, sessionid = 0x13bb268e2cb0004, negotiated timeout = 10000
[junit4:junit4]   2> 4813 T70 oascc.ConnectionManager.process Watcher org.apache.solr.common.cloud.ConnectionManager@1a2e808a name:ZooKeeperConnection Watcher:127.0.0.1:32779/solr got event WatchedEvent state:SyncConnected type:None path:null path:null type:None
[junit4:junit4]   2> 4814 T41 oascc.ConnectionManager.waitForConnected Client is connected to ZooKeeper
[junit4:junit4]   2> 4815 T41 oascc.ZkStateReader.createClusterStateWatchersAndUpdate Updating cluster state from ZooKeeper... 
[junit4:junit4]   2> 4819 T41 oasc.ChaosMonkey.monkeyLog monkey: init - expire sessions:true cause connection loss:true
[junit4:junit4]   2> 5005 T41 oejs.Server.doStart jetty-8.1.8.v20121106
[junit4:junit4]   2> 5009 T41 oejs.AbstractConnector.doStart Started SocketConnector@127.0.0.1:34871
[junit4:junit4]   2> 5010 T41 oasc.SolrResourceLoader.locateSolrHome JNDI not configured for solr (NoInitialContextEx)
[junit4:junit4]   2> 5011 T41 oasc.SolrResourceLoader.locateSolrHome using system property solr.solr.home: /usr/home/hudson/hudson-slave/workspace/Lucene-Solr-Tests-4.x-java7/solr/build/solr-core/test/J0/./org.apache.solr.cloud.BasicDistributedZkTest-jetty1-1355907921038
[junit4:junit4]   2> 5012 T41 oasc.SolrResourceLoader.<init> new SolrResourceLoader for deduced Solr Home: '/usr/home/hudson/hudson-slave/workspace/Lucene-Solr-Tests-4.x-java7/solr/build/solr-core/test/J0/./org.apache.solr.cloud.BasicDistributedZkTest-jetty1-1355907921038/'
[junit4:junit4]   2> 5098 T41 oass.SolrDispatchFilter.init SolrDispatchFilter.init()
[junit4:junit4]   2> 5099 T41 oasc.SolrResourceLoader.locateSolrHome JNDI not configured for solr (NoInitialContextEx)
[junit4:junit4]   2> 5100 T41 oasc.SolrResourceLoader.locateSolrHome using system property solr.solr.home: /usr/home/hudson/hudson-slave/workspace/Lucene-Solr-Tests-4.x-java7/solr/build/solr-core/test/J0/./org.apache.solr.cloud.BasicDistributedZkTest-jetty1-1355907921038
[junit4:junit4]   2> 5101 T41 oasc.CoreContainer$Initializer.initialize looking for solr.xml: /usr/home/hudson/hudson-slave/workspace/Lucene-Solr-Tests-4.x-java7/solr/build/solr-core/test/J0/./org.apache.solr.cloud.BasicDistributedZkTest-jetty1-1355907921038/solr.xml
[junit4:junit4]   2> 5102 T41 oasc.CoreContainer.<init> New CoreContainer 1439887603
[junit4:junit4]   2> 5104 T41 oasc.CoreContainer.load Loading CoreContainer using Solr Home: '/usr/home/hudson/hudson-slave/workspace/Lucene-Solr-Tests-4.x-java7/solr/build/solr-core/test/J0/./org.apache.solr.cloud.BasicDistributedZkTest-jetty1-1355907921038/'
[junit4:junit4]   2> 5105 T41 oasc.SolrResourceLoader.<init> new SolrResourceLoader for directory: '/usr/home/hudson/hudson-slave/workspace/Lucene-Solr-Tests-4.x-java7/solr/build/solr-core/test/J0/./org.apache.solr.cloud.BasicDistributedZkTest-jetty1-1355907921038/'
[junit4:junit4]   2> 5144 T65 oascc.ZkStateReader.updateClusterState Updating cloud state from ZooKeeper... 
[junit4:junit4]   2> 5145 T65 oasc.Overseer$ClusterStateUpdater.updateState Update state numShards=1 message={
[junit4:junit4]   2> 	  "operation":"state",
[junit4:junit4]   2> 	  "numShards":"1",
[junit4:junit4]   2> 	  "shard":"shard1",
[junit4:junit4]   2> 	  "roles":null,
[junit4:junit4]   2> 	  "state":"active",
[junit4:junit4]   2> 	  "core":"collection1",
[junit4:junit4]   2> 	  "collection":"control_collection",
[junit4:junit4]   2> 	  "node_name":"127.0.0.1:42359_",
[junit4:junit4]   2> 	  "base_url":"http://127.0.0.1:42359"}
[junit4:junit4]   2> 5165 T41 oashc.HttpShardHandlerFactory.getParameter Setting socketTimeout to: 30000
[junit4:junit4]   2> 5166 T41 oashc.HttpShardHandlerFactory.getParameter Setting urlScheme to: http://
[junit4:junit4]   2> 5167 T41 oashc.HttpShardHandlerFactory.getParameter Setting connTimeout to: 15000
[junit4:junit4]   2> 5167 T41 oashc.HttpShardHandlerFactory.getParameter Setting maxConnectionsPerHost to: 20
[junit4:junit4]   2> 5168 T41 oashc.HttpShardHandlerFactory.getParameter Setting corePoolSize to: 0
[junit4:junit4]   2> 5169 T41 oashc.HttpShardHandlerFactory.getParameter Setting maximumPoolSize to: 2147483647
[junit4:junit4]   2> 5169 T41 oashc.HttpShardHandlerFactory.getParameter Setting maxThreadIdleTime to: 5
[junit4:junit4]   2> 5170 T41 oashc.HttpShardHandlerFactory.getParameter Setting sizeOfQueue to: -1
[junit4:junit4]   2> 5171 T41 oashc.HttpShardHandlerFactory.getParameter Setting fairnessPolicy to: false
[junit4:junit4]   2> 5171 T41 oascsi.HttpClientUtil.createClient Creating new http client, config:maxConnectionsPerHost=20&maxConnections=10000&socketTimeout=30000&connTimeout=15000&retry=false
[junit4:junit4]   2> 5174 T64 oascc.ZkStateReader$2.process A cluster state change: WatchedEvent state:SyncConnected type:NodeDataChanged path:/clusterstate.json, has occurred - updating... (live nodes size: 1)
[junit4:junit4]   2> 5174 T70 oascc.ZkStateReader$2.process A cluster state change: WatchedEvent state:SyncConnected type:NodeDataChanged path:/clusterstate.json, has occurred - updating... (live nodes size: 1)
[junit4:junit4]   2> 5200 T41 oasc.CoreContainer.load Registering Log Listener
[junit4:junit4]   2> 5224 T41 oasc.CoreContainer.initZooKeeper Zookeeper client=127.0.0.1:32779/solr
[junit4:junit4]   2> 5225 T41 oasc.ZkController.checkChrootPath zkHost includes chroot
[junit4:junit4]   2> 5226 T41 oaz.ZooKeeper.<init> Initiating client connection, connectString=127.0.0.1:32779 sessionTimeout=60000 watcher=org.apache.solr.common.cloud.ConnectionManager@40c81bbd
[junit4:junit4]   2> 5227 T41 oascc.ConnectionManager.waitForConnected Waiting for client to connect to ZooKeeper
[junit4:junit4]   2> 5228 T80 oaz.ClientCnxn$SendThread.logStartConnect Opening socket connection to server localhost/127.0.0.1:32779. Will not attempt to authenticate using SASL (access denied ("javax.security.auth.AuthPermission" "getLoginConfiguration"))
[junit4:junit4]   2> 5229 T80 oaz.ClientCnxn$SendThread.primeConnection Socket connection established to localhost/127.0.0.1:32779, initiating session
[junit4:junit4]   2> 5229 T43 oazs.NIOServerCnxnFactory.run Accepted socket connection from /140.211.11.196:58874
[junit4:junit4]   2> 5230 T43 oazs.ZooKeeperServer.processConnectRequest Client attempting to establish new session at /140.211.11.196:58874
[junit4:junit4]   2> 5241 T45 oazs.ZooKeeperServer.finishSessionInit Established session 0x13bb268e2cb0005 with negotiated timeout 20000 for client /140.211.11.196:58874
[junit4:junit4]   2> 5242 T80 oaz.ClientCnxn$SendThread.onConnected Session establishment complete on server localhost/127.0.0.1:32779, sessionid = 0x13bb268e2cb0005, negotiated timeout = 20000
[junit4:junit4]   2> 5243 T81 oascc.ConnectionManager.process Watcher org.apache.solr.common.cloud.ConnectionManager@40c81bbd name:ZooKeeperConnection Watcher:127.0.0.1:32779 got event WatchedEvent state:SyncConnected type:None path:null path:null type:None
[junit4:junit4]   2> 5244 T41 oascc.ConnectionManager.waitForConnected Client is connected to ZooKeeper
[junit4:junit4]   2> 5247 T46 oazs.PrepRequestProcessor.pRequest2Txn Processed session termination for sessionid: 0x13bb268e2cb0005
[junit4:junit4]   2> 5248 T81 oaz.ClientCnxn$EventThread.run EventThread shut down
[junit4:junit4]   2> 5248 T41 oaz.ZooKeeper.close Session: 0x13bb268e2cb0005 closed
[junit4:junit4]   2> 5249 T43 oazs.NIOServerCnxn.closeSock Closed socket connection for client /140.211.11.196:58874 which had sessionid 0x13bb268e2cb0005
[junit4:junit4]   2> 5249 T41 oascsi.HttpClientUtil.createClient Creating new http client, config:maxConnections=500&maxConnectionsPerHost=16&socketTimeout=15000&connTimeout=30000
[junit4:junit4]   2> 5259 T41 oaz.ZooKeeper.<init> Initiating client connection, connectString=127.0.0.1:32779/solr sessionTimeout=30000 watcher=org.apache.solr.common.cloud.ConnectionManager@35bc2f85
[junit4:junit4]   2> 5260 T41 oascc.ConnectionManager.waitForConnected Waiting for client to connect to ZooKeeper
[junit4:junit4]   2> 5261 T82 oaz.ClientCnxn$SendThread.logStartConnect Opening socket connection to server localhost/127.0.0.1:32779. Will not attempt to authenticate using SASL (access denied ("javax.security.auth.AuthPermission" "getLoginConfiguration"))
[junit4:junit4]   2> 5262 T82 oaz.ClientCnxn$SendThread.primeConnection Socket connection established to localhost/127.0.0.1:32779, initiating session
[junit4:junit4]   2> 5262 T43 oazs.NIOServerCnxnFactory.run Accepted socket connection from /140.211.11.196:45848
[junit4:junit4]   2> 5263 T43 oazs.ZooKeeperServer.processConnectRequest Client attempting to establish new session at /140.211.11.196:45848
[junit4:junit4]   2> 5264 T45 oazs.ZooKeeperServer.finishSessionInit Established session 0x13bb268e2cb0006 with negotiated timeout 20000 for client /140.211.11.196:45848
[junit4:junit4]   2> 5264 T82 oaz.ClientCnxn$SendThread.onConnected Session establishment complete on server localhost/127.0.0.1:32779, sessionid = 0x13bb268e2cb0006, negotiated timeout = 20000
[junit4:junit4]   2> 5265 T83 oascc.ConnectionManager.process Watcher org.apache.solr.common.cloud.ConnectionManager@35bc2f85 name:ZooKeeperConnection Watcher:127.0.0.1:32779/solr got event WatchedEvent state:SyncConnected type:None path:null path:null type:None
[junit4:junit4]   2> 5266 T41 oascc.ConnectionManager.waitForConnected Client is connected to ZooKeeper
[junit4:junit4]   2> 5267 T46 oazs.PrepRequestProcessor.pRequest Got user-level KeeperException when processing sessionid:0x13bb268e2cb0006 type:create cxid:0x1 zxid:0x4d txntype:-1 reqpath:n/a Error Path:/solr/overseer Error:KeeperErrorCode = NodeExists for /solr/overseer
[junit4:junit4]   2> 5269 T46 oazs.PrepRequestProcessor.pRequest Got user-level KeeperException when processing sessionid:0x13bb268e2cb0006 type:create cxid:0x2 zxid:0x4e txntype:-1 reqpath:n/a Error Path:/solr/overseer Error:KeeperErrorCode = NodeExists for /solr/overseer
[junit4:junit4]   2> 5271 T41 oasc.ZkController.createEphemeralLiveNode Register node as live in ZooKeeper:/live_nodes/127.0.0.1:34871_
[junit4:junit4]   2> 5272 T46 oazs.PrepRequestProcessor.pRequest Got user-level KeeperException when processing sessionid:0x13bb268e2cb0006 type:delete cxid:0x4 zxid:0x4f txntype:-1 reqpath:n/a Error Path:/solr/live_nodes/127.0.0.1:34871_ Error:KeeperErrorCode = NoNode for /solr/live_nodes/127.0.0.1:34871_
[junit4:junit4]   2> 5279 T41 oascc.SolrZkClient.makePath makePath: /live_nodes/127.0.0.1:34871_
[junit4:junit4]   2> 5283 T64 oascc.ZkStateReader$3.process Updating live nodes... (2)
[junit4:junit4]   2> 5283 T70 oascc.ZkStateReader$3.process Updating live nodes... (2)
[junit4:junit4]   2> 5283 T64 oascc.ZkStateReader$2.process A cluster state change: WatchedEvent state:SyncConnected type:NodeChildrenChanged path:/live_nodes, has occurred - updating... (live nodes size: 2)
[junit4:junit4]   2> 5284 T70 oascc.ZkStateReader$2.process A cluster state change: WatchedEvent state:SyncConnected type:NodeChildrenChanged path:/live_nodes, has occurred - updating... (live nodes size: 2)
[junit4:junit4]   2> 5292 T41 oascc.ZkStateReader.createClusterStateWatchersAndUpdate Updating cluster state from ZooKeeper... 
[junit4:junit4]   2> 5301 T84 oasc.CoreContainer.create Creating SolrCore 'collection1' using instanceDir: /usr/home/hudson/hudson-slave/workspace/Lucene-Solr-Tests-4.x-java7/solr/build/solr-core/test/J0/./org.apache.solr.cloud.BasicDistributedZkTest-jetty1-1355907921038/collection1
[junit4:junit4]   2> 5301 T84 oasc.ZkController.createCollectionZkNode Check for collection zkNode:collection1
[junit4:junit4]   2> 5302 T84 oasc.ZkController.createCollectionZkNode Collection zkNode exists
[junit4:junit4]   2> 5303 T84 oasc.ZkController.readConfigName Load collection config from:/collections/collection1
[junit4:junit4]   2> 5305 T84 oasc.SolrResourceLoader.<init> new SolrResourceLoader for directory: '/usr/home/hudson/hudson-slave/workspace/Lucene-Solr-Tests-4.x-java7/solr/build/solr-core/test/J0/./org.apache.solr.cloud.BasicDistributedZkTest-jetty1-1355907921038/collection1/'
[junit4:junit4]   2> 5307 T84 oasc.SolrResourceLoader.replaceClassLoader Adding 'file:/usr/home/hudson/hudson-slave/workspace/Lucene-Solr-Tests-4.x-java7/solr/build/solr-core/test/J0/org.apache.solr.cloud.BasicDistributedZkTest-jetty1-1355907921038/collection1/lib/classes/' to classloader
[junit4:junit4]   2> 5309 T84 oasc.SolrResourceLoader.replaceClassLoader Adding 'file:/usr/home/hudson/hudson-slave/workspace/Lucene-Solr-Tests-4.x-java7/solr/build/solr-core/test/J0/org.apache.solr.cloud.BasicDistributedZkTest-jetty1-1355907921038/collection1/lib/README' to classloader
[junit4:junit4]   2> 5395 T84 oasc.SolrConfig.<init> Using Lucene MatchVersion: LUCENE_41
[junit4:junit4]   2> 5483 T84 oasc.SolrConfig.<init> Loaded SolrConfig: solrconfig.xml
[junit4:junit4]   2> 5585 T84 oass.IndexSchema.readSchema Reading Solr Schema
[junit4:junit4]   2> 5609 T84 oass.IndexSchema.readSchema Schema name=test
[junit4:junit4]   2> 6387 T84 oass.OpenExchangeRatesOrgProvider.init Initialized with rates=open-exchange-rates.json, refreshInterval=1440.
[junit4:junit4]   2> 6404 T84 oass.IndexSchema.readSchema default search field in schema is text
[junit4:junit4]   2> 6407 T84 oass.IndexSchema.readSchema unique key field: id
[junit4:junit4]   2> 6430 T84 oass.FileExchangeRateProvider.reload Reloading exchange rates from file currency.xml
[junit4:junit4]   2> 6434 T84 oass.FileExchangeRateProvider.reload Reloading exchange rates from file currency.xml
[junit4:junit4]   2> 6439 T84 oass.OpenExchangeRatesOrgProvider.reload Reloading exchange rates from open-exchange-rates.json
[junit4:junit4]   2> 6441 T84 oass.OpenExchangeRatesOrgProvider.reload Reloading exchange rates from open-exchange-rates.json
[junit4:junit4]   2> 6443 T84 oasc.SolrCore.<init> [collection1] Opening new SolrCore at /usr/home/hudson/hudson-slave/workspace/Lucene-Solr-Tests-4.x-java7/solr/build/solr-core/test/J0/./org.apache.solr.cloud.BasicDistributedZkTest-jetty1-1355907921038/collection1/, dataDir=./org.apache.solr.cloud.BasicDistributedZkTest-1355907916225/jetty1/
[junit4:junit4]   2> 6444 T84 oasc.JmxMonitoredMap.<init> JMX monitoring is enabled. Adding Solr mbeans to JMX Server: com.sun.jmx.mbeanserver.JmxMBeanServer@137b2615
[junit4:junit4]   2> 6444 T84 oasc.SolrCore.initDirectoryFactory solr.NRTCachingDirectoryFactory
[junit4:junit4]   2> 6445 T84 oasc.CachingDirectoryFactory.get return new directory for /usr/home/hudson/hudson-slave/workspace/Lucene-Solr-Tests-4.x-java7/solr/build/solr-core/test/J0/./org.apache.solr.cloud.BasicDistributedZkTest-1355907916225/jetty1 forceNew:false
[junit4:junit4]   2> 6446 T84 oasc.CachingDirectoryFactory.close Releasing directory:/usr/home/hudson/hudson-slave/workspace/Lucene-Solr-Tests-4.x-java7/solr/build/solr-core/test/J0/./org.apache.solr.cloud.BasicDistributedZkTest-1355907916225/jetty1
[junit4:junit4]   2> 6446 T84 oasc.SolrCore.getNewIndexDir New index directory detected: old=null new=./org.apache.solr.cloud.BasicDistributedZkTest-1355907916225/jetty1/index/
[junit4:junit4]   2> 6447 T84 oasc.SolrCore.initIndex WARNING [collection1] Solr index directory './org.apache.solr.cloud.BasicDistributedZkTest-1355907916225/jetty1/index' doesn't exist. Creating new index...
[junit4:junit4]   2> 6447 T84 oasc.CachingDirectoryFactory.get return new directory for /usr/home/hudson/hudson-slave/workspace/Lucene-Solr-Tests-4.x-java7/solr/build/solr-core/test/J0/./org.apache.solr.cloud.BasicDistributedZkTest-1355907916225/jetty1/index forceNew:false
[junit4:junit4]   2> 6452 T84 oasc.SolrDeletionPolicy.onCommit SolrDeletionPolicy.onCommit: commits:num=1
[junit4:junit4]   2> 		commit{dir=RateLimitedDirectoryWrapper(NRTCachingDirectory(org.apache.lucene.store.NIOFSDirectory@/usr/home/hudson/hudson-slave/workspace/Lucene-Solr-Tests-4.x-java7/solr/build/solr-core/test/J0/org.apache.solr.cloud.BasicDistributedZkTest-1355907916225/jetty1/index lockFactory=org.apache.lucene.store.NativeFSLockFactory@607b55c5; maxCacheMB=48.0 maxMergeSizeMB=4.0)),segFN=segments_1,generation=1,filenames=[segments_1]
[junit4:junit4]   2> 6453 T84 oasc.SolrDeletionPolicy.updateCommits newest commit = 1[segments_1]
[junit4:junit4]   2> 6453 T84 oasc.CachingDirectoryFactory.close Releasing directory:/usr/home/hudson/hudson-slave/workspace/Lucene-Solr-Tests-4.x-java7/solr/build/solr-core/test/J0/./org.apache.solr.cloud.BasicDistributedZkTest-1355907916225/jetty1/index
[junit4:junit4]   2> 6454 T84 oasc.SolrCore.initWriters created xml: solr.XMLResponseWriter
[junit4:junit4]   2> 6456 T84 oasup.UpdateRequestProcessorChain.init inserting DistributedUpdateProcessorFactory into updateRequestProcessorChain "dedupe"
[junit4:junit4]   2> 6457 T84 oasup.UpdateRequestProcessorChain.init inserting DistributedUpdateProcessorFactory into updateRequestProcessorChain "dedupe-allfields"
[junit4:junit4]   2> 6457 T84 oasup.UpdateRequestProcessorChain.init inserting DistributedUpdateProcessorFactory into updateRequestProcessorChain "stored_sig"
[junit4:junit4]   2> 6457 T84 oasup.UpdateRequestProcessorChain.init inserting DistributedUpdateProcessorFactory into updateRequestProcessorChain "uniq-fields"
[junit4:junit4]   2> 6458 T84 oasup.UpdateRequestProcessorChain.init inserting DistributedUpdateProcessorFactory into updateRequestProcessorChain "distrib-dup-test-chain-implicit"
[junit4:junit4]   2> 6458 T84 oasc.RequestHandlers.initHandlersFromConfig adding lazy requestHandler: solr.ReplicationHandler
[junit4:junit4]   2> 6459 T84 oasc.RequestHandlers.initHandlersFromConfig created /replication: solr.ReplicationHandler
[junit4:junit4]   2> 6460 T84 oasc.RequestHandlers.initHandlersFromConfig created standard: solr.StandardRequestHandler
[junit4:junit4]   2> 6461 T84 oasc.RequestHandlers.initHandlersFromConfig created /get: solr.RealTimeGetHandler
[junit4:junit4]   2> 6462 T84 oasc.RequestHandlers.initHandlersFromConfig created dismax: solr.SearchHandler
[junit4:junit4]   2> 6464 T84 oasc.RequestHandlers.initHandlersFromConfig created mock: org.apache.solr.core.MockQuerySenderListenerReqHandler
[junit4:junit4]   2> 6464 T84 oasc.RequestHandlers.initHandlersFromConfig created /admin/: org.apache.solr.handler.admin.AdminHandlers
[junit4:junit4]   2> 6465 T84 oasc.RequestHandlers.initHandlersFromConfig created defaults: solr.StandardRequestHandler
[junit4:junit4]   2> 6465 T84 oasc.RequestHandlers.initHandlersFromConfig adding lazy requestHandler: solr.StandardRequestHandler
[junit4:junit4]   2> 6466 T84 oasc.RequestHandlers.initHandlersFromConfig created lazy: solr.StandardRequestHandler
[junit4:junit4]   2> 6467 T84 oasc.RequestHandlers.initHandlersFromConfig created /update: solr.UpdateRequestHandler
[junit4:junit4]   2> 6468 T84 oasc.RequestHandlers.initHandlersFromConfig created /terms: org.apache.solr.handler.component.SearchHandler
[junit4:junit4]   2> 6469 T84 oasc.RequestHandlers.initHandlersFromConfig created spellCheckCompRH: org.apache.solr.handler.component.SearchHandler
[junit4:junit4]   2> 6470 T84 oasc.RequestHandlers.initHandlersFromConfig created spellCheckCompRH_Direct: org.apache.solr.handler.component.SearchHandler
[junit4:junit4]   2> 6472 T84 oasc.RequestHandlers.initHandlersFromConfig created spellCheckWithWordbreak: org.apache.solr.handler.component.SearchHandler
[junit4:junit4]   2> 6473 T84 oasc.RequestHandlers.initHandlersFromConfig created spellCheckWithWordbreak_Direct: org.apache.solr.handler.component.SearchHandler
[junit4:junit4]   2> 6474 T84 oasc.RequestHandlers.initHandlersFromConfig created spellCheckCompRH1: org.apache.solr.handler.component.SearchHandler
[junit4:junit4]   2> 6475 T84 oasc.RequestHandlers.initHandlersFromConfig created mltrh: org.apache.solr.handler.component.SearchHandler
[junit4:junit4]   2> 6476 T84 oasc.RequestHandlers.initHandlersFromConfig created tvrh: org.apache.solr.handler.component.SearchHandler
[junit4:junit4]   2> 6477 T84 oasc.RequestHandlers.initHandlersFromConfig created /mlt: solr.MoreLikeThisHandler
[junit4:junit4]   2> 6478 T84 oasc.RequestHandlers.initHandlersFromConfig created /debug/dump: solr.DumpRequestHandler
[junit4:junit4]   2> 6487 T84 oashl.XMLLoader.init xsltCacheLifetimeSeconds=60
[junit4:junit4]   2> 6491 T84 oasc.SolrCore.initDeprecatedSupport WARNING solrconfig.xml uses deprecated <admin/gettableFiles>, Please update your config to use the ShowFileRequestHandler.
[junit4:junit4]   2> 6493 T84 oasc.SolrCore.initDeprecatedSupport WARNING adding ShowFileRequestHandler with hidden files: [SCHEMA.XML, OLD_SYNONYMS.TXT, STOPWORDS.TXT, PROTWORDS.TXT, OPEN-EXCHANGE-RATES.JSON, SYNONYMS.TXT, CURRENCY.XML, MAPPING-ISOLATIN1ACCENT.TXT]
[junit4:junit4]   2> 6495 T84 oasc.CachingDirectoryFactory.close Releasing directory:/usr/home/hudson/hudson-slave/workspace/Lucene-Solr-Tests-4.x-java7/solr/build/solr-core/test/J0/./org.apache.solr.cloud.BasicDistributedZkTest-1355907916225/jetty1
[junit4:junit4]   2> 6496 T84 oass.SolrIndexSearcher.<init> Opening Searcher@23020bf9 main
[junit4:junit4]   2> 6498 T84 oasu.CommitTracker.<init> Hard AutoCommit: disabled
[junit4:junit4]   2> 6498 T84 oasu.CommitTracker.<init> Soft AutoCommit: disabled
[junit4:junit4]   2> 6499 T84 oashc.SpellCheckComponent.inform Initializing spell checkers
[junit4:junit4]   2> 6504 T84 oass.DirectSolrSpellChecker.init init: {name=direct,classname=DirectSolrSpellChecker,field=lowerfilt,minQueryLength=3}
[junit4:junit4]   2> 6553 T85 oasc.SolrCore.registerSearcher [collection1] Registered new searcher Searcher@23020bf9 main{StandardDirectoryReader(segments_1:1)}
[junit4:junit4]   2> 6559 T84 oasc.ZkController.publish publishing core=collection1 state=down
[junit4:junit4]   2> 6560 T84 oasc.ZkController.publish numShards not found on descriptor - reading it from system property
[junit4:junit4]   2> 6689 T65 oascc.ZkStateReader.updateClusterState Updating cloud state from ZooKeeper... 
[junit4:junit4]   2> 6690 T65 oasc.Overseer$ClusterStateUpdater.updateState Update state numShards=2 message={
[junit4:junit4]   2> 	  "operation":"state",
[junit4:junit4]   2> 	  "numShards":"2",
[junit4:junit4]   2> 	  "shard":null,
[junit4:junit4]   2> 	  "roles":null,
[junit4:junit4]   2> 	  "state":"down",
[junit4:junit4]   2> 	  "core":"collection1",
[junit4:junit4]   2> 	  "collection":"collection1",
[junit4:junit4]   2> 	  "node_name":"127.0.0.1:34871_",
[junit4:junit4]   2> 	  "base_url":"http://127.0.0.1:34871"}
[junit4:junit4]   2> 6691 T65 oasc.Overseer$ClusterStateUpdater.createCollection Create collection collection1 with numShards 2
[junit4:junit4]   2> 6691 T65 oasc.Overseer$ClusterStateUpdater.updateState Assigning new node to shard shard=shard1
[junit4:junit4]   2> 6704 T64 oascc.ZkStateReader$2.process A cluster state change: WatchedEvent state:SyncConnected type:NodeDataChanged path:/clusterstate.json, has occurred - updating... (live nodes size: 2)
[junit4:junit4]   2> 6705 T70 oascc.ZkStateReader$2.process A cluster state change: WatchedEvent state:SyncConnected type:NodeDataChanged path:/clusterstate.json, has occurred - updating... (live nodes size: 2)
[junit4:junit4]   2> 6704 T83 oascc.ZkStateReader$2.process A cluster state change: WatchedEvent state:SyncConnected type:NodeDataChanged path:/clusterstate.json, has occurred - updating... (live nodes size: 2)
[junit4:junit4]   2> 7062 T84 oasc.CoreContainer.registerCore registering core: collection1
[junit4:junit4]   2> 7062 T84 oasc.ZkController.register Register replica - core:collection1 address:http://127.0.0.1:34871 collection:collection1 shard:shard1
[junit4:junit4]   2> 7064 T84 oascc.SolrZkClient.makePath makePath: /collections/collection1/leader_elect/shard1/election
[junit4:junit4]   2> 7082 T46 oazs.PrepRequestProcessor.pRequest Got user-level KeeperException when processing sessionid:0x13bb268e2cb0006 type:delete cxid:0x43 zxid:0x5b txntype:-1 reqpath:n/a Error Path:/solr/collections/collection1/leaders Error:KeeperErrorCode = NoNode for /solr/collections/collection1/leaders
[junit4:junit4]   2> 7083 T84 oasc.ShardLeaderElectionContext.runLeaderProcess Running the leader process.
[junit4:junit4]   2> 7084 T46 oazs.PrepRequestProcessor.pRequest Got user-level KeeperException when processing sessionid:0x13bb268e2cb0006 type:create cxid:0x44 zxid:0x5c txntype:-1 reqpath:n/a Error Path:/solr/overseer Error:KeeperErrorCode = NodeExists for /solr/overseer
[junit4:junit4]   2> 7094 T84 oasc.ShardLeaderElectionContext.waitForReplicasToComeUp Enough replicas found to continue.
[junit4:junit4]   2> 7094 T84 oasc.ShardLeaderElectionContext.runLeaderProcess I may be the new leader - try and sync
[junit4:junit4]   2> 7095 T84 oasc.SyncStrategy.sync Sync replicas to http://127.0.0.1:34871/collection1/
[junit4:junit4]   2> 7095 T84 oasc.SyncStrategy.syncReplicas Sync Success - now sync replicas to me
[junit4:junit4]   2> 7095 T84 oasc.SyncStrategy.syncToMe http://127.0.0.1:34871/collection1/ has no replicas
[junit4:junit4]   2> 7096 T84 oasc.ShardLeaderElectionContext.runLeaderProcess I am the new leader: http://127.0.0.1:34871/collection1/
[junit4:junit4]   2> 7096 T84 oascc.SolrZkClient.makePath makePath: /collections/collection1/leaders/shard1
[junit4:junit4]   2> 7102 T46 oazs.PrepRequestProcessor.pRequest Got user-level KeeperException when processing sessionid:0x13bb268e2cb0006 type:create cxid:0x4e zxid:0x60 txntype:-1 reqpath:n/a Error Path:/solr/overseer Error:KeeperErrorCode = NodeExists for /solr/overseer
[junit4:junit4]   2> 7242 T65 oascc.ZkStateReader.updateClusterState Updating cloud state from ZooKeeper... 
[junit4:junit4]   2> 7266 T64 oascc.ZkStateReader$2.process A cluster state change: WatchedEvent state:SyncConnected type:NodeDataChanged path:/clusterstate.json, has occurred - updating... (live nodes size: 2)
[junit4:junit4]   2> 7266 T70 oascc.ZkStateReader$2.process A cluster state change: WatchedEvent state:SyncConnected type:NodeDataChanged path:/clusterstate.json, has occurred - updating... (live nodes size: 2)
[junit4:junit4]   2> 7266 T83 oascc.ZkStateReader$2.process A cluster state change: WatchedEvent state:SyncConnected type:NodeDataChanged path:/clusterstate.json, has occurred - updating... (live nodes size: 2)
[junit4:junit4]   2> 7309 T84 oasc.ZkController.register We are http://127.0.0.1:34871/collection1/ and leader is http://127.0.0.1:34871/collection1/
[junit4:junit4]   2> 7309 T84 oasc.ZkController.register No LogReplay needed for core=collection1 baseURL=http://127.0.0.1:34871
[junit4:junit4]   2> 7309 T84 oasc.ZkController.checkRecovery I am the leader, no recovery necessary
[junit4:junit4]   2> 7310 T84 oasc.ZkController.publish publishing core=collection1 state=active
[junit4:junit4]   2> 7310 T84 oasc.ZkController.publish numShards not found on descriptor - reading it from system property
[junit4:junit4]   2> 7313 T84 oascc.ZkStateReader.updateClusterState Updating cloud state from ZooKeeper... 
[junit4:junit4]   2> 7314 T41 oass.SolrDispatchFilter.init user.dir=/usr/home/hudson/hudson-slave/workspace/Lucene-Solr-Tests-4.x-java7/solr/build/solr-core/test/J0
[junit4:junit4]   2> 7315 T41 oass.SolrDispatchFilter.init SolrDispatchFilter.init() done
[junit4:junit4]   2> 7316 T41 oascsi.HttpClientUtil.createClient Creating new http client, config:maxConnections=128&maxConnectionsPerHost=32&followRedirects=false
[junit4:junit4]   2> 7507 T41 oejs.Server.doStart jetty-8.1.8.v20121106
[junit4:junit4]   2> 7511 T41 oejs.AbstractConnector.doStart Started SocketConnector@127.0.0.1:17574
[junit4:junit4]   2> 7512 T41 oasc.SolrResourceLoader.locateSolrHome JNDI not configured for solr (NoInitialContextEx)
[junit4:junit4]   2> 7512 T41 oasc.SolrResourceLoader.locateSolrHome using system property solr.solr.home: /usr/home/hudson/hudson-slave/workspace/Lucene-Solr-Tests-4.x-java7/solr/build/solr-core/test/J0/./org.apache.solr.cloud.BasicDistributedZkTest-jetty2-1355907923552
[junit4:junit4]   2> 7513 T41 oasc.SolrResourceLoader.<init> new SolrResourceLoader for deduced Solr Home: '/usr/home/hudson/hudson-slave/workspace/Lucene-Solr-Tests-4.x-java7/solr/build/solr-core/test/J0/./org.apache.solr.cloud.BasicDistributedZkTest-jetty2-1355907923552/'
[junit4:junit4]   2> 7557 T41 oass.SolrDispatchFilter.init SolrDispatchFilter.init()
[junit4:junit4]   2> 7558 T41 oasc.SolrResourceLoader.locateSolrHome JNDI not configured for solr (NoInitialContextEx)
[junit4:junit4]   2> 7558 T41 oasc.SolrResourceLoader.locateSolrHome using system property solr.solr.home: /usr/home/hudson/hudson-slave/workspace/Lucene-Solr-Tests-4.x-java7/solr/build/solr-core/test/J0/./org.apache.solr.cloud.BasicDistributedZkTest-jetty2-1355907923552
[junit4:junit4]   2> 7559 T41 oasc.CoreContainer$Initializer.initialize looking for solr.xml: /usr/home/hudson/hudson-slave/workspace/Lucene-Solr-Tests-4.x-java7/solr/build/solr-core/test/J0/./org.apache.solr.cloud.BasicDistributedZkTest-jetty2-1355907923552/solr.xml
[junit4:junit4]   2> 7560 T41 oasc.CoreContainer.<init> New CoreContainer 74677915
[junit4:junit4]   2> 7561 T41 oasc.CoreContainer.load Loading CoreContainer using Solr Home: '/usr/home/hudson/hudson-slave/workspace/Lucene-Solr-Tests-4.x-java7/solr/build/solr-core/test/J0/./org.apache.solr.cloud.BasicDistributedZkTest-jetty2-1355907923552/'
[junit4:junit4]   2> 7562 T41 oasc.SolrResourceLoader.<init> new SolrResourceLoader for directory: '/usr/home/hudson/hudson-slave/workspace/Lucene-Solr-Tests-4.x-java7/solr/build/solr-core/test/J0/./org.apache.solr.cloud.BasicDistributedZkTest-jetty2-1355907923552/'
[junit4:junit4]   2> 7593 T41 oashc.HttpShardHandlerFactory.getParameter Setting socketTimeout to: 30000
[junit4:junit4]   2> 7594 T41 oashc.HttpShardHandlerFactory.getParameter Setting urlScheme to: http://
[junit4:junit4]   2> 7594 T41 oashc.HttpShardHandlerFactory.getParameter Setting connTimeout to: 15000
[junit4:junit4]   2> 7595 T41 oashc.HttpShardHandlerFactory.getParameter Setting maxConnectionsPerHost to: 20
[junit4:junit4]   2> 7596 T41 oashc.HttpShardHandlerFactory.getParameter Setting corePoolSize to: 0
[junit4:junit4]   2> 7596 T41 oashc.HttpShardHandlerFactory.getParameter Setting maximumPoolSize to: 2147483647
[junit4:junit4]   2> 7597 T41 oashc.HttpShardHandlerFactory.getParameter Setting maxThreadIdleTime to: 5
[junit4:junit4]   2> 7598 T41 oashc.HttpShardHandlerFactory.getParameter Setting sizeOfQueue to: -1
[junit4:junit4]   2> 7598 T41 oashc.HttpShardHandlerFactory.getParameter Setting fairnessPolicy to: false
[junit4:junit4]   2> 7599 T41 oascsi.HttpClientUtil.createClient Creating new http client, config:maxConnectionsPerHost=20&maxConnections=10000&socketTimeout=30000&connTimeout=15000&retry=false
[junit4:junit4]   2> 7622 T41 oasc.CoreContainer.load Registering Log Listener
[junit4:junit4]   2> 7644 T41 oasc.CoreContainer.initZooKeeper Zookeeper client=127.0.0.1:32779/solr
[junit4:junit4]   2> 7645 T41 oasc.ZkController.checkChrootPath zkHost includes chroot
[junit4:junit4]   2> 7645 T41 oaz.ZooKeeper.<init> Initiating client connection, connectString=127.0.0.1:32779 sessionTimeout=60000 watcher=org.apache.solr.common.cloud.ConnectionManager@3f6d88ef
[junit4:junit4]   2> 7647 T41 oascc.ConnectionManager.waitForConnected Waiting for client to connect to ZooKeeper
[junit4:junit4]   2> 7647 T95 oaz.ClientCnxn$SendThread.logStartConnect Opening socket connection to server localhost/127.0.0.1:32779. Will not attempt to authenticate using SASL (access denied ("javax.security.auth.AuthPermission" "getLoginConfiguration"))
[junit4:junit4]   2> 7649 T95 oaz.ClientCnxn$SendThread.primeConnection Socket connection established to localhost/127.0.0.1:32779, initiating session
[junit4:junit4]   2> 7649 T43 oazs.NIOServerCnxnFactory.run Accepted socket connection from /140.211.11.196:64207
[junit4:junit4]   2> 7650 T43 oazs.ZooKeeperServer.processConnectRequest Client attempting to establish new session at /140.211.11.196:64207
[junit4:junit4]   2> 7652 T45 oazs.ZooKeeperServer.finishSessionInit Established session 0x13bb268e2cb0007 with negotiated timeout 20000 for client /140.211.11.196:64207
[junit4:junit4]   2> 7652 T95 oaz.ClientCnxn$SendThread.onConnected Session establishment complete on server localhost/127.0.0.1:32779, sessionid = 0x13bb268e2cb0007, negotiated timeout = 20000
[junit4:junit4]   2> 7653 T96 oascc.ConnectionManager.process Watcher org.apache.solr.common.cloud.ConnectionManager@3f6d88ef name:ZooKeeperConnection Watcher:127.0.0.1:32779 got event WatchedEvent state:SyncConnected type:None path:null path:null type:None
[junit4:junit4]   2> 7653 T41 oascc.ConnectionManager.waitForConnected Client is connected to ZooKeeper
[junit4:junit4]   2> 7655 T46 oazs.PrepRequestProcessor.pRequest2Txn Processed session termination for sessionid: 0x13bb268e2cb0007
[junit4:junit4]   2> 7657 T96 oaz.ClientCnxn$EventThread.run EventThread shut down
[junit4:junit4]   2> 7657 T41 oaz.ZooKeeper.close Session: 0x13bb268e2cb0007 closed
[junit4:junit4]   2> 7657 T43 oazs.NIOServerCnxn.closeSock Closed socket connection for client /140.211.11.196:64207 which had sessionid 0x13bb268e2cb0007
[junit4:junit4]   2> 7658 T41 oascsi.HttpClientUtil.createClient Creating new http client, config:maxConnections=500&maxConnectionsPerHost=16&socketTimeout=15000&connTimeout=30000
[junit4:junit4]   2> 7670 T41 oaz.ZooKeeper.<init> Initiating client connection, connectString=127.0.0.1:32779/solr sessionTimeout=30000 watcher=org.apache.solr.common.cloud.ConnectionManager@35dcb5a6
[junit4:junit4]   2> 7671 T41 oascc.ConnectionManager.waitForConnected Waiting for client to connect to ZooKeeper
[junit4:junit4]   2> 7672 T97 oaz.ClientCnxn$SendThread.logStartConnect Opening socket connection to server localhost/127.0.0.1:32779. Will not attempt to authenticate using SASL (access denied ("javax.security.auth.AuthPermission" "getLoginConfiguration"))
[junit4:junit4]   2> 7673 T97 oaz.ClientCnxn$SendThread.primeConnection Socket connection established to localhost/127.0.0.1:32779, initiating session
[junit4:junit4]   2> 7673 T43 oazs.NIOServerCnxnFactory.run Accepted socket connection from /140.211.11.196:56125
[junit4:junit4]   2> 7674 T43 oazs.ZooKeeperServer.processConnectRequest Client attempting to establish new session at /140.211.11.196:56125
[junit4:junit4]   2> 7675 T45 oazs.ZooKeeperServer.finishSessionInit Established session 0x13bb268e2cb0008 with negotiated timeout 20000 for client /140.211.11.196:56125
[junit4:junit4]   2> 7675 T97 oaz.ClientCnxn$SendThread.onConnected Session establishment complete on server localhost/127.0.0.1:32779, sessionid = 0x13bb268e2cb0008, negotiated timeout = 20000
[junit4:junit4]   2> 7676 T98 oascc.ConnectionManager.process Watcher org.apache.solr.common.cloud.ConnectionManager@35dcb5a6 name:ZooKeeperConnection Watcher:127.0.0.1:32779/solr got event WatchedEvent state:SyncConnected type:None path:null path:null type:None
[junit4:junit4]   2> 7677 T41 oascc.ConnectionManager.waitForConnected Client is connected to ZooKeeper
[junit4:junit4]   2> 7678 T46 oazs.PrepRequestProcessor.pRequest Got user-level KeeperException when processing sessionid:0x13bb268e2cb0008 type:create cxid:0x1 zxid:0x6d txntype:-1 reqpath:n/a Error Path:/solr/overseer Error:KeeperErrorCode = NodeExists for /solr/overseer
[junit4:junit4]   2> 7680 T46 oazs.PrepRequestProcessor.pRequest Got user-level KeeperException when processing sessionid:0x13bb268e2cb0008 type:create cxid:0x2 zxid:0x6e txntype:-1 reqpath:n/a Error Path:/solr/overseer Error:KeeperErrorCode = NodeExists for /solr/overseer
[junit4:junit4]   2> 7682 T41 oasc.ZkController.createEphemeralLiveNode Register node as live in ZooKeeper:/live_nodes/127.0.0.1:17574_
[junit4:junit4]   2> 7683 T46 oazs.PrepRequestProcessor.pRequest Got user-level KeeperException when processing sessionid:0x13bb268e2cb0008 type:delete cxid:0x4 zxid:0x6f txntype:-1 reqpath:n/a Error Path:/solr/live_nodes/127.0.0.1:17574_ Error:KeeperErrorCode = NoNode for /solr/live_nodes/127.0.0.1:17574_
[junit4:junit4]   2> 7690 T41 oascc.SolrZkClient.makePath makePath: /live_nodes/127.0.0.1:17574_
[junit4:junit4]   2> 7695 T64 oascc.ZkStateReader$3.process Updating live nodes... (3)
[junit4:junit4]   2> 7695 T83 oascc.ZkStateReader$3.process Updating live nodes... (3)
[junit4:junit4]   2> 7695 T70 oascc.ZkStateReader$3.process Updating live nodes... (3)
[junit4:junit4]   2> 7695 T64 oascc.ZkStateReader$2.process A cluster state change: WatchedEvent state:SyncConnected type:NodeChildrenChanged path:/live_nodes, has occurred - updating... (live nodes size: 3)
[junit4:junit4]   2> 7696 T83 oascc.ZkStateReader$2.process A cluster state change: WatchedEvent state:SyncConnected type:NodeChildrenChanged path:/live_nodes, has occurred - updating... (live nodes size: 3)
[junit4:junit4]   2> 7696 T70 oascc.ZkStateReader$2.process A cluster state change: WatchedEvent state:SyncConnected type:NodeChildrenChanged path:/live_nodes, has occurred - updating... (live nodes size: 3)
[junit4:junit4]   2> 7706 T41 oascc.ZkStateReader.createClusterStateWatchersAndUpdate Updating cluster state from ZooKeeper... 
[junit4:junit4]   2> 7718 T99 oasc.CoreContainer.create Creating SolrCore 'collection1' using instanceDir: /usr/home/hudson/hudson-slave/workspace/Lucene-Solr-Tests-4.x-java7/solr/build/solr-core/test/J0/./org.apache.solr.cloud.BasicDistributedZkTest-jetty2-1355907923552/collection1
[junit4:junit4]   2> 7719 T99 oasc.ZkController.createCollectionZkNode Check for collection zkNode:collection1
[junit4:junit4]   2> 7720 T99 oasc.ZkController.createCollectionZkNode Collection zkNode exists
[junit4:junit4]   2> 7720 T99 oasc.ZkController.readConfigName Load collection config from:/collections/collection1
[junit4:junit4]   2> 7723 T99 oasc.SolrResourceLoader.<init> new SolrResourceLoader for directory: '/usr/home/hudson/hudson-slave/workspace/Lucene-Solr-Tests-4.x-java7/solr/build/solr-core/test/J0/./org.apache.solr.cloud.BasicDistributedZkTest-jetty2-1355907923552/collection1/'
[junit4:junit4]   2> 7724 T99 oasc.SolrResourceLoader.replaceClassLoader Adding 'file:/usr/home/hudson/hudson-slave/workspace/Lucene-Solr-Tests-4.x-java7/solr/build/solr-core/test/J0/org.apache.solr.cloud.BasicDistributedZkTest-jetty2-1355907923552/collection1/lib/README' to classloader
[junit4:junit4]   2> 7726 T99 oasc.SolrResourceLoader.replaceClassLoader Adding 'file:/usr/home/hudson/hudson-slave/workspace/Lucene-Solr-Tests-4.x-java7/solr/build/solr-core/test/J0/org.apache.solr.cloud.BasicDistributedZkTest-jetty2-1355907923552/collection1/lib/classes/' to classloader
[junit4:junit4]   2> 7775 T65 oascc.ZkStateReader.updateClusterState Updating cloud state from ZooKeeper... 
[junit4:junit4]   2> 7777 T65 oasc.Overseer$ClusterStateUpdater.updateState Update state numShards=2 message={
[junit4:junit4]   2> 	  "operation":"state",
[junit4:junit4]   2> 	  "numShards":"2",
[junit4:junit4]   2> 	  "shard":"shard1",
[junit4:junit4]   2> 	  "roles":null,
[junit4:junit4]   2> 	  "state":"active",
[junit4:junit4]   2> 	  "core":"collection1",
[junit4:junit4]   2> 	  "collection":"collection1",
[junit4:junit4]   2> 	  "node_name":"127.0.0.1:34871_",
[junit4:junit4]   2> 	  "base_url":"http://127.0.0.1:34871"}
[junit4:junit4]   2> 7790 T64 oascc.ZkStateReader$2.process A cluster state change: WatchedEvent state:SyncConnected type:NodeDataChanged path:/clusterstate.json, has occurred - updating... (live nodes size: 3)
[junit4:junit4]   2> 7790 T83 oascc.ZkStateReader$2.process A cluster state change: WatchedEvent state:SyncConnected type:NodeDataChanged path:/clusterstate.json, has occurred - updating... (live nodes size: 3)
[junit4:junit4]   2> 7790 T98 oascc.ZkStateReader$2.process A cluster state change: WatchedEvent state:SyncConnected type:NodeDataChanged path:/clusterstate.json, has occurred - updating... (live nodes size: 3)
[junit4:junit4]   2> 7790 T70 oascc.ZkStateReader$2.process A cluster state change: WatchedEvent state:SyncConnected type:NodeDataChanged path:/clusterstate.json, has occurred - updating... (live nodes size: 3)
[junit4:junit4]   2> 7794 T99 oasc.SolrConfig.<init> Using Lucene MatchVersion: LUCENE_41
[junit4:junit4]   2> 7889 T99 oasc.SolrConfig.<init> Loaded SolrConfig: solrconfig.xml
[junit4:junit4]   2> 7991 T99 oass.IndexSchema.readSchema Reading Solr Schema
[junit4:junit4]   2> 8003 T99 oass.IndexSchema.readSchema Schema name=test
[junit4:junit4]   2> 8749 T99 oass.OpenExchangeRatesOrgProvider.init Initialized with rates=open-exchange-rates.json, refreshInterval=1440.
[junit4:junit4]   2> 8776 T99 oass.IndexSchema.readSchema default search field in schema is text
[junit4:junit4]   2> 8792 T99 oass.IndexSchema.readSchema unique key field: id
[junit4:junit4]   2> 8842 T99 oass.FileExchangeRateProvider.reload Reloading exchange rates from file currency.xml
[junit4:junit4]   2> 8851 T99 oass.FileExchangeRateProvider.reload Reloading exchange rates from file currency.xml
[junit4:junit4]   2> 8861 T99 oass.OpenExchangeRatesOrgProvider.reload Reloading exchange rates from open-exchange-rates.json
[junit4:junit4]   2> 8865 T99 oass.OpenExchangeRatesOrgProvider.reload Reloading exchange rates from open-exchange-rates.json
[junit4:junit4]   2> 8869 T99 oasc.SolrCore.<init> [collection1] Opening new SolrCore at /usr/home/hudson/hudson-slave/workspace/Lucene-Solr-Tests-4.x-java7/solr/build/solr-core/test/J0/./org.apache.solr.cloud.BasicDistributedZkTest-jetty2-1355907923552/collection1/, dataDir=./org.apache.solr.cloud.BasicDistributedZkTest-1355907916225/jetty2/
[junit4:junit4]   2> 8870 T99 oasc.JmxMonitoredMap.<init> JMX monitoring is enabled. Adding Solr mbeans to JMX Server: com.sun.jmx.mbeanserver.JmxMBeanServer@137b2615
[junit4:junit4]   2> 8871 T99 oasc.SolrCore.initDirectoryFactory solr.NRTCachingDirectoryFactory
[junit4:junit4]   2> 8872 T99 oasc.CachingDirectoryFactory.get return new directory for /usr/home/hudson/hudson-slave/workspace/Lucene-Solr-Tests-4.x-java7/solr/build/solr-core/test/J0/./org.apache.solr.cloud.BasicDistributedZkTest-1355907916225/jetty2 forceNew:false
[junit4:junit4]   2> 8873 T99 oasc.CachingDirectoryFactory.close Releasing directory:/usr/home/hudson/hudson-slave/workspace/Lucene-Solr-Tests-4.x-java7/solr/build/solr-core/test/J0/./org.apache.solr.cloud.BasicDistributedZkTest-1355907916225/jetty2
[junit4:junit4]   2> 8873 T99 oasc.SolrCore.getNewIndexDir New index directory detected: old=null new=./org.apache.solr.cloud.BasicDistributedZkTest-1355907916225/jetty2/index/
[junit4:junit4]   2> 8874 T99 oasc.SolrCore.initIndex WARNING [collection1] Solr index directory './org.apache.solr.cloud.BasicDistributedZkTest-1355907916225/jetty2/index' doesn't exist. Creating new index...
[junit4:junit4]   2> 8875 T99 oasc.CachingDirectoryFactory.get return new directory for /usr/home/hudson/hudson-slave/workspace/Lucene-Solr-Tests-4.x-java7/solr/build/solr-core/test/J0/./org.apache.solr.cloud.BasicDistributedZkTest-1355907916225/jetty2/index forceNew:false
[junit4:junit4]   2> 8883 T99 oasc.SolrDeletionPolicy.onCommit SolrDeletionPolicy.onCommit: commits:num=1
[junit4:junit4]   2> 		commit{dir=RateLimitedDirectoryWrapper(NRTCachingDirectory(org.apache.lucene.store.NIOFSDirectory@/usr/home/hudson/hudson-slave/workspace/Lucene-Solr-Tests-4.x-java7/solr/build/solr-core/test/J0/org.apache.solr.cloud.BasicDistributedZkTest-1355907916225/jetty2/index lockFactory=org.apache.lucene.store.NativeFSLockFactory@3df584; maxCacheMB=48.0 maxMergeSizeMB=4.0)),segFN=segments_1,generation=1,filenames=[segments_1]
[junit4:junit4]   2> 8883 T99 oasc.SolrDeletionPolicy.updateCommits newest commit = 1[segments_1]
[junit4:junit4]   2> 8884 T99 oasc.CachingDirectoryFactory.close Releasing directory:/usr/home/hudson/hudson-slave/workspace/Lucene-Solr-Tests-4.x-java7/solr/build/solr-core/test/J0/./org.apache.solr.cloud.BasicDistributedZkTest-1355907916225/jetty2/index
[junit4:junit4]   2> 8885 T99 oasc.SolrCore.initWriters created xml: solr.XMLResponseWriter
[junit4:junit4]   2> 8888 T99 oasup.UpdateRequestProcessorChain.init inserting DistributedUpdateProcessorFactory into updateRequestProcessorChain "dedupe"
[junit4:junit4]   2> 8889 T99 oasup.UpdateRequestProcessorChain.init inserting DistributedUpdateProcessorFactory into updateRequestProcessorChain "dedupe-allfields"
[junit4:junit4]   2> 8889 T99 oasup.UpdateRequestProcessorChain.init inserting DistributedUpdateProcessorFactory into updateRequestProcessorChain "stored_sig"
[junit4:junit4]   2> 8890 T99 oasup.UpdateRequestProcessorChain.init inserting DistributedUpdateProcessorFactory into updateRequestProcessorChain "uniq-fields"
[junit4:junit4]   2> 8891 T99 oasup.UpdateRequestProcessorChain.init inserting DistributedUpdateProcessorFactory into updateRequestProcessorChain "distrib-dup-test-chain-implicit"
[junit4:junit4]   2> 8891 T99 oasc.RequestHandlers.initHandlersFromConfig adding lazy requestHandler: solr.ReplicationHandler
[junit4:junit4]   2> 8892 T99 oasc.RequestHandlers.initHandlersFromConfig created /replication: solr.ReplicationHandler
[junit4:junit4]   2> 8894 T99 oasc.RequestHandlers.initHandlersFromConfig created standard: solr.StandardRequestHandler
[junit4:junit4]   2> 8896 T99 oasc.RequestHandlers.initHandlersFromConfig created /get: solr.RealTimeGetHandler
[junit4:junit4]   2> 8898 T99 oasc.RequestHandlers.initHandlersFromConfig created dismax: solr.SearchHandler
[junit4:junit4]   2> 8899 T99 oasc.RequestHandlers.initHandlersFromConfig created mock: org.apache.solr.core.MockQuerySenderListenerReqHandler
[junit4:junit4]   2> 8900 T99 oasc.RequestHandlers.initHandlersFromConfig created /admin/: org.apache.solr.handler.admin.AdminHandlers
[junit4:junit4]   2> 8902 T99 oasc.RequestHandlers.initHandlersFromConfig created defaults: solr.StandardRequestHandler
[junit4:junit4]   2> 8902 T99 oasc.RequestHandlers.initHandlersFromConfig adding lazy requestHandler: solr.StandardRequestHandler
[junit4:junit4]   2> 8903 T99 oasc.RequestHandlers.initHandlersFromConfig created lazy: solr.StandardRequestHandler
[junit4:junit4]   2> 8904 T99 oasc.RequestHandlers.initHandlersFromConfig created /update: solr.UpdateRequestHandler
[junit4:junit4]   2> 8906 T99 oasc.RequestHandlers.initHandlersFromConfig created /terms: org.apache.solr.handler.component.SearchHandler
[junit4:junit4]   2> 8908 T99 oasc.RequestHandlers.initHandlersFromConfig created spellCheckCompRH: org.apache.solr.handler.component.SearchHandler
[junit4:junit4]   2> 8909 T99 oasc.RequestHandlers.initHandlersFromConfig created spellCheckCompRH_Direct: org.apache.solr.handler.component.SearchHandler
[junit4:junit4]   2> 8911 T99 oasc.RequestHandlers.initHandlersFromConfig created spellCheckWithWordbreak: org.apache.solr.handler.component.SearchHandler
[junit4:junit4]   2> 8913 T99 oasc.RequestHandlers.initHandlersFromConfig created spellCheckWithWordbreak_Direct: org.apache.solr.handler.component.SearchHandler
[junit4:junit4]   2> 8914 T99 oasc.RequestHandlers.initHandlersFromConfig created spellCheckCompRH1: org.apache.solr.handler.component.SearchHandler
[junit4:junit4]   2> 8916 T99 oasc.RequestHandlers.initHandlersFromConfig created mltrh: org.apache.solr.handler.component.SearchHandler
[junit4:junit4]   2> 8918 T99 oasc.RequestHandlers.initHandlersFromConfig created tvrh: org.apache.solr.handler.component.SearchHandler
[junit4:junit4]   2> 8919 T99 oasc.RequestHandlers.initHandlersFromConfig created /mlt: solr.MoreLikeThisHandler
[junit4:junit4]   2> 8921 T99 oasc.RequestHandlers.initHandlersFromConfig created /debug/dump: solr.DumpRequestHandler
[junit4:junit4]   2> 8935 T99 oashl.XMLLoader.init xsltCacheLifetimeSeconds=60
[junit4:junit4]   2> 8940 T99 oasc.SolrCore.initDeprecatedSupport WARNING solrconfig.xml uses deprecated <admin/gettableFiles>, Please update your config to use the ShowFileRequestHandler.
[junit4:junit4]   2> 8944 T99 oasc.SolrCore.initDeprecatedSupport WARNING adding ShowFileRequestHandler with hidden files: [SCHEMA.XML, OLD_SYNONYMS.TXT, STOPWORDS.TXT, PROTWORDS.TXT, OPEN-EXCHANGE-RATES.JSON, SYNONYMS.TXT, CURRENCY.XML, MAPPING-ISOLATIN1ACCENT.TXT]
[junit4:junit4]   2> 8947 T99 oasc.CachingDirectoryFactory.close Releasing directory:/usr/home/hudson/hudson-slave/workspace/Lucene-Solr-Tests-4.x-java7/solr/build/solr-core/test/J0/./org.apache.solr.cloud.BasicDistributedZkTest-1355907916225/jetty2
[junit4:junit4]   2> 8949 T99 oass.SolrIndexSearcher.<init> Opening Searcher@2da09081 main
[junit4:junit4]   2> 8950 T99 oasu.CommitTracker.<init> Hard AutoCommit: disabled
[junit4:junit4]   2> 8951 T99 oasu.CommitTracker.<init> Soft AutoCommit: disabled
[junit4:junit4]   2> 8952 T99 oashc.SpellCheckComponent.inform Initializing spell checkers
[junit4:junit4]   2> 9038 T99 oass.DirectSolrSpellChecker.init init: {name=direct,classname=DirectSolrSpellChecker,field=lowerfilt,minQueryLength=3}
[junit4:junit4]   2> 9303 T100 oasc.SolrCore.registerSearcher [collection1] Registered new searcher Searcher@2da09081 main{StandardDirectoryReader(segments_1:1)}
[junit4:junit4]   2> 9312 T99 oasc.ZkController.publish publishing core=collection1 state=down
[junit4:junit4]   2> 9313 T99 oasc.ZkController.publish numShards not found on descriptor - reading it from system property
[junit4:junit4]   2> 9812 T65 oascc.ZkStateReader.updateClusterState Updating cloud state from ZooKeeper... 
[junit4:junit4]   2> 9814 T65 oasc.Overseer$ClusterStateUpdater.updateState Update state numShards=2 message={
[junit4:junit4]   2> 	  "operation":"state",
[junit4:junit4]   2> 	  "numShards":"2",
[junit4:junit4]   2> 	  "shard":null,
[junit4:junit4]   2> 	  "roles":null,
[junit4:junit4]   2> 	  "state":"down",
[junit4:junit4]   2> 	  "core":"collection1",
[junit4:junit4]   2> 	  "collection":"collection1",
[junit4:junit4]   2> 	  "node_name":"127.0.0.1:17574_",
[junit4:junit4]   2> 	  "base_url":"http://127.0.0.1:17574"}
[junit4:junit4]   2> 9814 T65 oasc.Overseer$ClusterStateUpdater.updateState Collection already exists with numShards=2
[junit4:junit4]   2> 9815 T65 oasc.Overseer$ClusterStateUpdater.updateState Assigning new node to shard shard=shard2
[junit4:junit4]   2> 9831 T64 oascc.ZkStateReader$2.process A cluster state change: WatchedEvent state:SyncConnected type:NodeDataChanged path:/clusterstate.json, has occurred - updating... (live nodes size: 3)
[junit4:junit4]   2> 9831 T98 oascc.ZkStateReader$2.process A cluster state change: WatchedEvent state:SyncConnected type:NodeDataChanged path:/clusterstate.json, has occurred - updating... (live nodes size: 3)
[junit4:junit4]   2> 9831 T70 oascc.ZkStateReader$2.process A cluster state change: WatchedEvent state:SyncConnected type:NodeDataChanged path:/clusterstate.json, has occurred - updating... (live nodes size: 3)
[junit4:junit4]   2> 9831 T83 oascc.ZkStateReader$2.process A cluster state change: WatchedEvent state:SyncConnected type:NodeDataChanged path:/clusterstate.json, has occurred - updating... (live nodes size: 3)
[junit4:junit4]   2> 10317 T99 oasc.CoreContainer.registerCore registering core: collection1
[junit4:junit4]   2> 10317 T99 oasc.ZkController.register Register replica - core:collection1 address:http://127.0.0.1:17574 collection:collection1 shard:shard2
[junit4:junit4]   2> 10319 T99 oascc.SolrZkClient.makePath makePath: /collections/collection1/leader_elect/shard2/election
[junit4:junit4]   2> 10336 T46 oazs.PrepRequestProcessor.pRequest Got user-level KeeperException when processing sessionid:0x13bb268e2cb0008 type:delete cxid:0x44 zxid:0x7e txntype:-1 reqpath:n/a Error Path:/solr/collections/collection1/leaders/shard2 Error:KeeperErrorCode = NoNode for /solr/collections/collection1/leaders/shard2
[junit4:junit4]   2> 10337 T99 oasc.ShardLeaderElectionContext.runLeaderProcess Running the leader process.
[junit4:junit4]   2> 10338 T46 oazs.PrepRequestProcessor.pRequest Got user-level KeeperException when processing sessionid:0x13bb268e2cb0008 type:create cxid:0x45 zxid:0x7f txntype:-1 reqpath:n/a Error Path:/solr/overseer Error:KeeperErrorCode = NodeExists for /solr/overseer
[junit4:junit4]   2> 10348 T99 oasc.ShardLeaderElectionContext.waitForReplicasToComeUp Enough replicas found to continue.
[junit4:junit4]   2> 10349 T99 oasc.ShardLeaderElectionContext.runLeaderProcess I may be the new leader - try and sync
[junit4:junit4]   2> 10349 T99 oasc.SyncStrategy.sync Sync replicas to http://127.0.0.1:17574/collection1/
[junit4:junit4]   2> 10350 T99 oasc.SyncStrategy.syncReplicas Sync Success - now sync replicas to me
[junit4:junit4]   2> 10350 T99 oasc.SyncStrategy.syncToMe http://127.0.0.1:17574/collection1/ has no replicas
[junit4:junit4]   2> 10350 T99 oasc.ShardLeaderElectionContext.runLeaderProcess I am the new leader: http://127.0.0.1:17574/collection1/
[junit4:junit4]   2> 10351 T99 oascc.SolrZkClient.makePath makePath: /collections/collection1/leaders/shard2
[junit4:junit4]   2> 10356 T46 oazs.PrepRequestProcessor.pRequest Got user-level KeeperException when processing sessionid:0x13bb268e2cb0008 type:create cxid:0x4e zxid:0x82 txntype:-1 reqpath:n/a Error Path:/solr/overseer Error:KeeperErrorCode = NodeExists for /solr/overseer
[junit4:junit4]   2> 10844 T65 oascc.ZkStateReader.updateClusterState Updating cloud state from ZooKeeper... 
[junit4:junit4]   2> 10862 T64 oascc.ZkStateReader$2.process A cluster state change: WatchedEvent state:SyncConnected type:NodeDataChanged path:/clusterstate.json, has occurred - updating... (live nodes size: 3)
[junit4:junit4]   2> 10862 T98 oascc.ZkStateReader$2.process A cluster state change: WatchedEvent state:SyncConnected type:NodeDataChanged path:/clusterstate.json, has occurred - updating... (live nodes size: 3)
[junit4:junit4]   2> 10862 T83 oascc.ZkStateReader$2.process A cluster state change: WatchedEvent state:SyncConnected type:NodeDataChanged path:/clusterstate.json, has occurred - updating... (live nodes size: 3)
[junit4:junit4]   2> 10862 T70 oascc.ZkStateReader$2.process A cluster state change: WatchedEvent state:SyncConnected type:NodeDataChanged path:/clusterstate.json, has occurred - updating... (live nodes size: 3)
[junit4:junit4]   2> 10870 T99 oasc.ZkController.register We are http://127.0.0.1:17574/collection1/ and leader is http://127.0.0.1:17574/collection1/
[junit4:junit4]   2> 10870 T99 oasc.ZkController.register No LogReplay needed for core=collection1 baseURL=http://127.0.0.1:17574
[junit4:junit4]   2> 10870 T99 oasc.ZkController.checkRecovery I am the leader, no recovery necessary
[junit4:junit4]   2> 10871 T99 oasc.ZkController.publish publishing core=collection1 state=active
[junit4:junit4]   2> 10871 T99 oasc.ZkController.publish numShards not found on descriptor - reading it from system property
[junit4:junit4]   2> 10874 T99 oascc.ZkStateReader.updateClusterState Updating cloud state from ZooKeeper... 
[junit4:junit4]   2> 10875 T41 oass.SolrDispatchFilter.init user.dir=/usr/home/hudson/hudson-slave/workspace/Lucene-Solr-Tests-4.x-java7/solr/build/solr-core/test/J0
[junit4:junit4]   2> 10876 T41 oass.SolrDispatchFilter.init SolrDispatchFilter.init() done
[junit4:junit4]   2> 10876 T41 oascsi.HttpClientUtil.createClient Creating new http client, config:maxConnections=128&maxConnectionsPerHost=32&followRedirects=false
[junit4:junit4]   2> 11010 T41 oejs.Server.doStart jetty-8.1.8.v20121106
[junit4:junit4]   2> 11012 T41 oejs.AbstractConnector.doStart Started SocketConnector@127.0.0.1:51208
[junit4:junit4]   2> 11013 T41 oasc.SolrResourceLoader.locateSolrHome JNDI not configured for solr (NoInitialContextEx)
[junit4:junit4]   2> 11014 T41 oasc.SolrResourceLoader.locateSolrHome using system property solr.solr.home: /usr/home/hudson/hudson-slave/workspace/Lucene-Solr-Tests-4.x-java7/solr/build/solr-core/test/J0/./org.apache.solr.cloud.BasicDistributedZkTest-jetty3-1355907927106
[junit4:junit4]   2> 11014 T41 oasc.SolrResourceLoader.<init> new SolrResourceLoader for deduced Solr Home: '/usr/home/hudson/hudson-slave/workspace/Lucene-Solr-Tests-4.x-java7/solr/build/solr-core/test/J0/./org.apache.solr.cloud.BasicDistributedZkTest-jetty3-1355907927106/'
[junit4:junit4]   2> 11051 T41 oass.SolrDispatchFilter.init SolrDispatchFilter.init()
[junit4:junit4]   2> 11052 T41 oasc.SolrResourceLoader.locateSolrHome JNDI not configured for solr (NoInitialContextEx)
[junit4:junit4]   2> 11052 T41 oasc.SolrResourceLoader.locateSolrHome using system property solr.solr.home: /usr/home/hudson/hudson-slave/workspace/Lucene-Solr-Tests-4.x-java7/solr/build/solr-core/test/J0/./org.apache.solr.cloud.BasicDistributedZkTest-jetty3-1355907927106
[junit4:junit4]   2> 11053 T41 oasc.CoreContainer$Initializer.initialize looking for solr.xml: /usr/home/hudson/hudson-slave/workspace/Lucene-Solr-Tests-4.x-java7/solr/build/solr-core/test/J0/./org.apache.solr.cloud.BasicDistributedZkTest-jetty3-1355907927106/solr.xml
[junit4:junit4]   2> 11053 T41 oasc.CoreContainer.<init> New CoreContainer 514247602
[junit4:junit4]   2> 11054 T41 oasc.CoreContainer.load Loading CoreContainer using Solr Home: '/usr/home/hudson/hudson-slave/workspace/Lucene-Solr-Tests-4.x-java7/solr/build/solr-core/test/J0/./org.apache.solr.cloud.BasicDistributedZkTest-jetty3-1355907927106/'
[junit4:junit4]   2> 11054 T41 oasc.SolrResourceLoader.<init> new SolrResourceLoader for directory: '/usr/home/hudson/hudson-slave/workspace/Lucene-Solr-Tests-4.x-java7/solr/build/solr-core/test/J0/./org.apache.solr.cloud.BasicDistributedZkTest-jetty3-1355907927106/'
[junit4:junit4]   2> 11081 T41 oashc.HttpShardHandlerFactory.getParameter Setting socketTimeout to: 30000
[junit4:junit4]   2> 11081 T41 oashc.HttpShardHandlerFactory.getParameter Setting urlScheme to: http://
[junit4:junit4]   2> 11082 T41 oashc.HttpShardHandlerFactory.getParameter Setting connTimeout to: 15000
[junit4:junit4]   2> 11082 T41 oashc.HttpShardHandlerFactory.getParameter Setting maxConnectionsPerHost to: 20
[junit4:junit4]   2> 11082 T41 oashc.HttpShardHandlerFactory.getParameter Setting corePoolSize to: 0
[junit4:junit4]   2> 11083 T41 oashc.HttpShardHandlerFactory.getParameter Setting maximumPoolSize to: 2147483647
[junit4:junit4]   2> 11083 T41 oashc.HttpShardHandlerFactory.getParameter Setting maxThreadIdleTime to: 5
[junit4:junit4]   2> 11084 T41 oashc.HttpShardHandlerFactory.getParameter Setting sizeOfQueue to: -1
[junit4:junit4]   2> 11084 T41 oashc.HttpShardHandlerFactory.getParameter Setting fairnessPolicy to: false
[junit4:junit4]   2> 11085 T41 oascsi.HttpClientUtil.createClient Creating new http client, config:maxConnectionsPerHost=20&maxConnections=10000&socketTimeout=30000&connTimeout=15000&retry=false
[junit4:junit4]   2> 11102 T41 oasc.CoreContainer.load Registering Log Listener
[junit4:junit4]   2> 11119 T41 oasc.CoreContainer.initZooKeeper Zookeeper client=127.0.0.1:32779/solr
[junit4:junit4]   2> 11119 T41 oasc.ZkController.checkChrootPath zkHost includes chroot
[junit4:junit4]   2> 11120 T41 oaz.ZooKeeper.<init> Initiating client connection, connectString=127.0.0.1:32779 sessionTimeout=60000 watcher=org.apache.solr.common.cloud.ConnectionManager@664020c7
[junit4:junit4]   2> 11121 T41 oascc.ConnectionManager.waitForConnected Waiting for client to connect to ZooKeeper
[junit4:junit4]   2> 11121 T110 oaz.ClientCnxn$SendThread.logStartConnect Opening socket connection to server localhost/127.0.0.1:32779. Will not attempt to authenticate using SASL (access denied ("javax.security.auth.AuthPermission" "getLoginConfiguration"))
[junit4:junit4]   2> 11122 T110 oaz.ClientCnxn$SendThread.primeConnection Socket connection established to localhost/127.0.0.1:32779, initiating session
[junit4:junit4]   2> 11123 T43 oazs.NIOServerCnxnFactory.run Accepted socket connection from /140.211.11.196:33242
[junit4:junit4]   2> 11123 T43 oazs.ZooKeeperServer.processConnectRequest Client attempting to establish new session at /140.211.11.196:33242
[junit4:junit4]   2> 11126 T45 oazs.ZooKeeperServer.finishSessionInit Established session 0x13bb268e2cb0009 with negotiated timeout 20000 for client /140.211.11.196:33242
[junit4:junit4]   2> 11126 T110 oaz.ClientCnxn$SendThread.onConnected Session establishment complete on server localhost/127.0.0.1:32779, sessionid = 0x13bb268e2cb0009, negotiated timeout = 20000
[junit4:junit4]   2> 11127 T111 oascc.ConnectionManager.process Watcher org.apache.solr.common.cloud.ConnectionManager@664020c7 name:ZooKeeperConnection Watcher:127.0.0.1:32779 got event WatchedEvent state:SyncConnected type:None path:null path:null type:None
[junit4:junit4]   2> 11127 T41 oascc.ConnectionManager.waitForConnected Client is connected to ZooKeeper
[junit4:junit4]   2> 11129 T46 oazs.PrepRequestProcessor.pRequest2Txn Processed session termination for sessionid: 0x13bb268e2cb0009
[junit4:junit4]   2> 11136 T43 oazs.NIOServerCnxn.closeSock Closed socket connection for client /140.211.11.196:33242 which had sessionid 0x13bb268e2cb0009
[junit4:junit4]   2> 11136 T111 oaz.ClientCnxn$EventThread.run EventThread shut down
[junit4:junit4]   2> 11136 T41 oaz.ZooKeeper.close Session: 0x13bb268e2cb0009 closed
[junit4:junit4]   2> 11137 T41 oascsi.HttpClientUtil.createClient Creating new http client, config:maxConnections=500&maxConnectionsPerHost=16&socketTimeout=15000&connTimeout=30000
[junit4:junit4]   2> 11145 T41 oaz.ZooKeeper.<init> Initiating client connection, connectString=127.0.0.1:32779/solr sessionTimeout=30000 watcher=org.apache.solr.common.cloud.ConnectionManager@14242376
[junit4:junit4]   2> 11146 T41 oascc.ConnectionManager.waitForConnected Waiting for client to connect to ZooKeeper
[junit4:junit4]   2> 11146 T112 oaz.ClientCnxn$SendThread.logStartConnect Opening socket connection to server localhost/127.0.0.1:32779. Will not attempt to authenticate using SASL (access denied ("javax.security.auth.AuthPermission" "getLoginConfiguration"))
[junit4:junit4]   2> 11147 T112 oaz.ClientCnxn$SendThread.primeConnection Socket connection established to localhost/127.0.0.1:32779, initiating session
[junit4:junit4]   2> 11147 T43 oazs.NIOServerCnxnFactory.run Accepted socket connection from /140.211.11.196:56712
[junit4:junit4]   2> 11148 T43 oazs.ZooKeeperServer.processConnectRequest Client attempting to establish new session at /140.211.11.196:56712
[junit4:junit4]   2> 11149 T45 oazs.ZooKeeperServer.finishSessionInit Established session 0x13bb268e2cb000a with negotiated timeout 20000 for client /140.211.11.196:56712
[junit4:junit4]   2> 11150 T112 oaz.ClientCnxn$SendThread.onConnected Session establishment complete on server localhost/127.0.0.1:32779, sessionid = 0x13bb268e2cb000a, negotiated timeout = 20000
[junit4:junit4]   2> 11150 T113 oascc.ConnectionManager.process Watcher org.apache.solr.common.cloud.ConnectionManager@14242376 name:ZooKeeperConnection Watcher:127.0.0.1:32779/solr got event WatchedEvent state:SyncConnected type:None path:null path:null type:None
[junit4:junit4]   2> 11151 T41 oascc.ConnectionManager.waitForConnected Client is connected to ZooKeeper
[junit4:junit4]   2> 11152 T46 oazs.PrepRequestProcessor.pRequest Got user-level KeeperException when processing sessionid:0x13bb268e2cb000a type:create cxid:0x1 zxid:0x8f txntype:-1 reqpath:n/a Error Path:/solr/overseer Error:KeeperErrorCode = NodeExists for /solr/overseer
[junit4:junit4]   2> 11155 T46 oazs.PrepRequestProcessor.pRequest Got user-level KeeperException when processing sessionid:0x13bb268e2cb000a type:create cxid:0x2 zxid:0x90 txntype:-1 reqpath:n/a Error Path:/solr/overseer Error:KeeperErrorCode = NodeExists for /solr/overseer
[junit4:junit4]   2> 11157 T41 oasc.ZkController.createEphemeralLiveNode Register node as live in ZooKeeper:/live_nodes/127.0.0.1:51208_
[junit4:junit4]   2> 11158 T46 oazs.PrepRequestProcessor.pRequest Got user-level KeeperException when processing sessionid:0x13bb268e2cb000a type:delete cxid:0x4 zxid:0x91 txntype:-1 reqpath:n/a Error Path:/solr/live_nodes/127.0.0.1:51208_ Error:KeeperErrorCode = NoNode for /solr/live_nodes/127.0.0.1:51208_
[junit4:junit4]   2> 11164 T41 oascc.SolrZkClient.makePath makePath: /live_nodes/127.0.0.1:51208_
[junit4:junit4]   2> 11167 T70 oascc.ZkStateReader$3.process Updating live nodes... (4)
[junit4:junit4]   2> 11168 T64 oascc.ZkStateReader$3.process Updating live nodes... (4)
[junit4:junit4]   2> 11168 T98 oascc.ZkStateReader$3.process Updating live nodes... (4)
[junit4:junit4]   2> 11168 T70 oascc.ZkStateReader$2.process A cluster state change: WatchedEvent state:SyncConnected type:NodeChildrenChanged path:/live_nodes, has occurred - updating... (live nodes size: 4)
[junit4:junit4]   2> 11168 T83 oascc.ZkStateReader$3.process Updating live nodes... (4)
[junit4:junit4]   2> 11168 T64 oascc.ZkStateReader$2.process A cluster state change: WatchedEvent state:SyncConnected type:NodeChildrenChanged path:/live_nodes, has occurred - updating... (live nodes size: 4)
[junit4:junit4]   2> 11169 T83 oascc.ZkStateReader$2.process A cluster state change: WatchedEvent state:SyncConnected type:NodeChildrenChanged path:/live_nodes, has occurred - updating... (live nodes size: 4)
[junit4:junit4]   2> 11169 T98 oascc.ZkStateReader$2.process A cluster state change: WatchedEvent state:SyncConnected type:NodeChildrenChanged path:/live_nodes, has occurred - updating... (live nodes size: 4)
[junit4:junit4]   2> 11174 T41 oascc.ZkStateReader.createClusterStateWatchersAndUpdate Updating cluster state from ZooKeeper... 
[junit4:junit4]   2> 11182 T114 oasc.CoreContainer.create Creating SolrCore 'collection1' using instanceDir: /usr/home/hudson/hudson-slave/workspace/Lucene-Solr-Tests-4.x-java7/solr/build/solr-core/test/J0/./org.apache.solr.cloud.BasicDistributedZkTest-jetty3-1355907927106/collection1
[junit4:junit4]   2> 11182 T114 oasc.ZkController.createCollectionZkNode Check for collection zkNode:collection1
[junit4:junit4]   2> 11183 T114 oasc.ZkController.createCollectionZkNode Collection zkNode exists
[junit4:junit4]   2> 11184 T114 oasc.ZkController.readConfigName Load collection config from:/collections/collection1
[junit4:junit4]   2> 11186 T114 oasc.SolrResourceLoader.<init> new SolrResourceLoader for directory: '/usr/home/hudson/hudson-slave/workspace/Lucene-Solr-Tests-4.x-java7/solr/build/solr-core/test/J0/./org.apache.solr.cloud.BasicDistributedZkTest-jetty3-1355907927106/collection1/'
[junit4:junit4]   2> 11187 T114 oasc.SolrResourceLoader.replaceClassLoader Adding 'file:/usr/home/hudson/hudson-slave/workspace/Lucene-Solr-Tests-4.x-java7/solr/build/solr-core/test/J0/org.apache.solr.cloud.BasicDistributedZkTest-jetty3-1355907927106/collection1/lib/classes/' to classloader
[junit4:junit4]   2> 11188 T114 oasc.SolrResourceLoader.replaceClassLoader Adding 'file:/usr/home/hudson/hudson-slave/workspace/Lucene-Solr-Tests-4.x-java7/solr/build/solr-core/test/J0/org.apache.solr.cloud.BasicDistributedZkTest-jetty3-1355907927106/collection1/lib/README' to classloader
[junit4:junit4]   2> 11252 T114 oasc.SolrConfig.<init> Using Lucene MatchVersion: LUCENE_41
[junit4:junit4]   2> 11344 T114 oasc.SolrConfig.<init> Loaded SolrConfig: solrconfig.xml
[junit4:junit4]   2> 11371 T65 oascc.ZkStateReader.updateClusterState Updating cloud state from ZooKeeper... 
[junit4:junit4]   2> 11373 T65 oasc.Overseer$ClusterStateUpdater.updateState Update state numShards=2 message={
[junit4:junit4]   2> 	  "operation":"state",
[junit4:junit4]   2> 	  "numShards":"2",
[junit4:junit4]   2> 	  "shard":"shard2",
[junit4:junit4]   2> 	  "roles":null,
[junit4:junit4]   2> 	  "state":"active",
[junit4:junit4]   2> 	  "core":"collection1",
[junit4:junit4]   2> 	  "collection":"collection1",
[junit4:junit4]   2> 	  "node_name":"127.0.0.1:17574_",
[junit4:junit4]   2> 	  "base_url":"http://127.0.0.1:17574"}
[junit4:junit4]   2> 11388 T64 oascc.ZkStateReader$2.process A cluster state change: WatchedEvent state:SyncConnected type:NodeDataChanged path:/clusterstate.json, has occurred - updating... (live nodes size: 4)
[junit4:junit4]   2> 11388 T98 oascc.ZkStateReader$2.process A cluster state change: WatchedEvent state:SyncConnected type:NodeDataChanged path:/clusterstate.json, has occurred - updating... (live nodes size: 4)
[junit4:junit4]   2> 11388 T83 oascc.ZkStateReader$2.process A cluster state change: WatchedEvent state:SyncConnected type:NodeDataChanged path:/clusterstate.json, has occurred - updating... (live nodes size: 4)
[junit4:junit4]   2> 11388 T70 oascc.ZkStateReader$2.process A cluster state change: WatchedEvent state:SyncConnected type:NodeDataChanged path:/clusterstate.json, has occurred - updating... (live nodes size: 4)
[junit4:junit4]   2> 11446 T114 oass.IndexSchema.readSchema Reading Solr Schema
[junit4:junit4]   2> 11446 T113 oascc.ZkStateReader$2.process A cluster state change: WatchedEvent state:SyncConnected type:NodeDataChanged path:/clusterstate.json, has occurred - updating... (live nodes size: 4)
[junit4:junit4]   2> 11459 T114 oass.IndexSchema.readSchema Schema name=test
[junit4:junit4]   2> 12187 T114 oass.OpenExchangeRatesOrgProvider.init Initialized with rates=open-exchange-rates.json, refreshInterval=1440.
[junit4:junit4]   2> 12202 T114 oass.IndexSchema.readSchema default search field in schema is text
[junit4:junit4]   2> 12206 T114 oass.IndexSchema.readSchema unique key field: id
[junit4:junit4]   2> 12259 T114 oass.FileExchangeRateProvider.reload Reloading exchange rates from file currency.xml
[junit4:junit4]   2> 12266 T114 oass.FileExchangeRateProvider.reload Reloading exchange rates from file currency.xml
[junit4:junit4]   2> 12272 T114 oass.OpenExchangeRatesOrgProvider.reload Reloading exchange rates from open-exchange-rates.json
[junit4:junit4]   2> 12275 T114 oass.OpenExchangeRatesOrgProvider.reload Reloading exchange rates from open-exchange-rates.json
[junit4:junit4]   2> 12278 T114 oasc.SolrCore.<init> [collection1] Opening new SolrCore at /usr/home/hudson/hudson-slave/workspace/Lucene-Solr-Tests-4.x-java7/solr/build/solr-core/test/J0/./org.apache.solr.cloud.BasicDistributedZkTest-jetty3-1355907927106/collection1/, dataDir=./org.apache.solr.cloud.BasicDistributedZkTest-1355907916225/jetty3/
[junit4:junit4]   2> 12279 T114 oasc.JmxMonitoredMap.<init> JMX monitoring is enabled. Adding Solr mbeans to JMX Server: com.sun.jmx.mbeanserver.JmxMBeanServer@137b2615
[junit4:junit4]   2> 12280 T114 oasc.SolrCore.initDirectoryFactory solr.NRTCachingDirectoryFactory
[junit4:junit4]   2> 12281 T114 oasc.CachingDirectoryFactory.get return new directory for /usr/home/hudson/hudson-slave/workspace/Lucene-Solr-Tests-4.x-java7/solr/build/solr-core/test/J0/./org.apache.solr.cloud.BasicDistributedZkTest-1355907916225/jetty3 forceNew:false
[junit4:junit4]   2> 12282 T114 oasc.CachingDirectoryFactory.close Releasing directory:/usr/home/hudson/hudson-slave/workspace/Lucene-Solr-Tests-4.x-java7/solr/build/solr-core/test/J0/./org.apache.solr.cloud.BasicDistributedZkTest-1355907916225/jetty3
[junit4:junit4]   2> 12282 T114 oasc.SolrCore.getNewIndexDir New index directory detected: old=null new=./org.apache.solr.cloud.BasicDistributedZkTest-1355907916225/jetty3/index/
[junit4:junit4]   2> 12283 T114 oasc.SolrCore.initIndex WARNING [collection1] Solr index directory './org.apache.solr.cloud.BasicDistributedZkTest-1355907916225/jetty3/index' doesn't exist. Creating new index...
[junit4:junit4]   2> 12284 T114 oasc.CachingDirectoryFactory.get return new directory for /usr/home/hudson/hudson-slave/workspace/Lucene-Solr-Tests-4.x-java7/solr/build/solr-core/test/J0/./org.apache.solr.cloud.BasicDistributedZkTest-1355907916225/jetty3/index forceNew:false
[junit4:junit4]   2> 12327 T114 oasc.SolrDeletionPolicy.onCommit SolrDeletionPolicy.onCommit: commits:num=1
[junit4:junit4]   2> 		commit{dir=RateLimitedDirectoryWrapper(NRTCachingDirectory(org.apache.lucene.store.NIOFSDirectory@/usr/home/hudson/hudson-slave/workspace/Lucene-Solr-Tests-4.x-java7/solr/build/solr-core/test/J0/org.apache.solr.cloud.BasicDistributedZkTest-1355907916225/jetty3/index lockFactory=org.apache.lucene.store.NativeFSLockFactory@5085a96d; maxCacheMB=48.0 maxMergeSizeMB=4.0)),segFN=segments_1,generation=1,filenames=[segments_1]
[junit4:junit4]   2> 12327 T114 oasc.SolrDeletionPolicy.updateCommits newest commit = 1[segments_1]
[junit4:junit4]   2> 12328 T114 oasc.CachingDirectoryFactory.close Releasing directory:/usr/home/hudson/hudson-slave/workspace/Lucene-Solr-Tests-4.x-java7/solr/build/solr-core/test/J0/./org.apache.solr.cloud.BasicDistributedZkTest-1355907916225/jetty3/index
[junit4:junit4]   2> 12329 T114 oasc.SolrCore.initWriters created xml: solr.XMLResponseWriter
[junit4:junit4]   2> 12332 T114 oasup.UpdateRequestProcessorChain.init inserting DistributedUpdateProcessorFactory into updateRequestProcessorChain "dedupe"
[junit4:junit4]   2> 12332 T114 oasup.UpdateRequestProcessorChain.init inserting DistributedUpdateProcessorFactory into updateRequestProcessorChain "dedupe-allfields"
[junit4:junit4]   2> 12333 T114 oasup.UpdateRequestProcessorChain.init inserting DistributedUpdateProcessorFactory into updateRequestProcessorChain "stored_sig"
[junit4:junit4]   2> 12333 T114 oasup.UpdateRequestProcessorChain.init inserting DistributedUpdateProcessorFactory into updateRequestProcessorChain "uniq-fields"
[junit4:junit4]   2> 12334 T114 oasup.UpdateRequestProcessorChain.init inserting DistributedUpdateProcessorFactory into updateRequestProcessorChain "distrib-dup-test-chain-implicit"
[junit4:junit4]   2> 12335 T114 oasc.RequestHandlers.initHandlersFromConfig adding lazy requestHandler: solr.ReplicationHandler
[junit4:junit4]   2> 12335 T114 oasc.RequestHandlers.initHandlersFromConfig created /replication: solr.ReplicationHandler
[junit4:junit4]   2> 12337 T114 oasc.RequestHandlers.initHandlersFromConfig created standard: solr.StandardRequestHandler
[junit4:junit4]   2> 12338 T114 oasc.RequestHandlers.initHandlersFromConfig created /get: solr.RealTimeGetHandler
[junit4:junit4]   2> 12340 T114 oasc.RequestHandlers.initHandlersFromConfig created dismax: solr.SearchHandler
[junit4:junit4]   2> 12341 T114 oasc.RequestHandlers.initHandlersFromConfig created mock: org.apache.solr.core.MockQuerySenderListenerReqHandler
[junit4:junit4]   2> 12342 T114 oasc.RequestHandlers.initHandlersFromConfig created /admin/: org.apache.solr.handler.admin.AdminHandlers
[junit4:junit4]   2> 12343 T114 oasc.RequestHandlers.initHandlersFromConfig created defaults: solr.StandardRequestHandler
[junit4:junit4]   2> 12344 T114 oasc.RequestHandlers.initHandlersFromConfig adding lazy requestHandler: solr.StandardRequestHandler
[junit4:junit4]   2> 12344 T114 oasc.RequestHandlers.initHandlersFromConfig created lazy: solr.StandardRequestHandler
[junit4:junit4]   2> 12346 T114 oasc.RequestHandlers.initHandlersFromConfig created /update: solr.UpdateRequestHandler
[junit4:junit4]   2> 12347 T114 oasc.RequestHandlers.initHandlersFromConfig created /terms: org.apache.solr.handler.component.SearchHandler
[junit4:junit4]   2> 12349 T114 oasc.RequestHandlers.initHandlersFromConfig created spellCheckCompRH: org.apache.solr.handler.component.SearchHandler
[junit4:junit4]   2> 12350 T114 oasc.RequestHandlers.initHandlersFromConfig created spellCheckCompRH_Direct: org.apache.solr.handler.component.SearchHandler
[junit4:junit4]   2> 12352 T114 oasc.RequestHandlers.initHandlersFromConfig created spellCheckWithWordbreak: org.apache.solr.handler.component.SearchHandler
[junit4:junit4]   2> 12353 T114 oasc.RequestHandlers.initHandlersFromConfig created spellCheckWithWordbreak_Direct: org.apache.solr.handler.component.SearchHandler
[junit4:junit4]   2> 12355 T114 oasc.RequestHandlers.initHandlersFromConfig created spellCheckCompRH1: org.apache.solr.handler.component.SearchHandler
[junit4:junit4]   2> 12356 T114 oasc.RequestHandlers.initHandlersFromConfig created mltrh: org.apache.solr.handler.component.SearchHandler
[junit4:junit4]   2> 12358 T114 oasc.RequestHandlers.initHandlersFromConfig created tvrh: org.apache.solr.handler.component.SearchHandler
[junit4:junit4]   2> 12359 T114 oasc.RequestHandlers.initHandlersFromConfig created /mlt: solr.MoreLikeThisHandler
[junit4:junit4]   2> 12361 T114 oasc.RequestHandlers.initHandlersFromConfig created /debug/dump: solr.DumpRequestHandler
[junit4:junit4]   2> 12375 T114 oashl.XMLLoader.init xsltCacheLifetimeSeconds=60
[junit4:junit4]   2> 12380 T114 oasc.SolrCore.initDeprecatedSupport WARNING solrconfig.xml uses deprecated <admin/gettableFiles>, Please update your config to use the ShowFileRequestHandler.
[junit4:junit4]   2> 12383 T114 oasc.SolrCore.initDeprecatedSupport WARNING adding ShowFileRequestHandler with hidden files: [SCHEMA.XML, OLD_SYNONYMS.TXT, STOPWORDS.TXT, PROTWORDS.TXT, OPEN-EXCHANGE-RATES.JSON, SYNONYMS.TXT, CURRENCY.XML, MAPPING-ISOLATIN1ACCENT.TXT]
[junit4:junit4]   2> 12386 T114 oasc.CachingDirectoryFactory.close Releasing directory:/usr/home/hudson/hudson-slave/workspace/Lucene-Solr-Tests-4.x-java7/solr/build/solr-core/test/J0/./org.apache.solr.cloud.BasicDistributedZkTest-1355907916225/jetty3
[junit4:junit4]   2> 12388 T114 oass.SolrIndexSearcher.<init> Opening Searcher@8fee1db main
[junit4:junit4]   2> 12389 T114 oasu.CommitTracker.<init> Hard AutoCommit: disabled
[junit4:junit4]   2> 12390 T114 oasu.CommitTracker.<init> Soft AutoCommit: disabled
[junit4:junit4]   2> 12391 T114 oashc.SpellCheckComponent.inform Initializing spell checkers
[junit4:junit4]   2> 12406 T114 oass.DirectSolrSpellChecker.init init: {name=direct,classname=DirectSolrSpellChecker,field=lowerfilt,minQueryLength=3}
[junit4:junit4]   2> 12502 T115 oasc.SolrCore.registerSearcher [collection1] Registered new searcher Searcher@8fee1db main{StandardDirectoryReader(segments_1:1)}
[junit4:junit4]   2> 12512 T114 oasc.ZkController.publish publishing core=collection1 state=down
[junit4:junit4]   2> 12513 T114 oasc.ZkController.publish numShards not found on descriptor - reading it from system property
[junit4:junit4]   2> 12903 T65 oascc.ZkStateReader.updateClusterState Updating cloud state from ZooKeeper... 
[junit4:junit4]   2> 12905 T65 oasc.Overseer$ClusterStateUpdater.updateState Update state numShards=2 message={
[junit4:junit4]   2> 	  "operation":"state",
[junit4:junit4]   2> 	  "numShards":"2",
[junit4:junit4]   2> 	  "shard":null,
[junit4:junit4]   2> 	  "roles":null,
[junit4:junit4]   2> 	  "state":"down",
[junit4:junit4]   2> 	  "core":"collection1",
[junit4:junit4]   2> 	  "collection":"collection1",
[junit4:junit4]   2> 	  "node_name":"127.0.0.1:51208_",
[junit4:junit4]   2> 	  "base_url":"http://127.0.0.1:51208"}
[junit4:junit4]   2> 12905 T65 oasc.Overseer$ClusterStateUpdater.updateState Collection already exists with numShards=2
[junit4:junit4]   2> 12905 T65 oasc.Overseer$ClusterStateUpdater.updateState Assigning new node to shard shard=shard1
[junit4:junit4]   2> 12919 T64 oascc.ZkStateReader$2.process A cluster state change: WatchedEvent state:SyncConnected type:NodeDataChanged path:/clusterstate.json, has occurred - updating... (live nodes size: 4)
[junit4:junit4]   2> 12919 T83 oascc.ZkStateReader$2.process A cluster state change: WatchedEvent state:SyncConnected type:NodeDataChanged path:/clusterstate.json, has occurred - updating... (live nodes size: 4)
[junit4:junit4]   2> 12919 T98 oascc.ZkStateReader$2.process A cluster state change: WatchedEvent state:SyncConnected type:NodeDataChanged path:/clusterstate.json, has occurred - updating... (live nodes size: 4)
[junit4:junit4]   2> 12919 T70 oascc.ZkStateReader$2.process A cluster state change: WatchedEvent state:SyncConnected type:NodeDataChanged path:/clusterstate.json, has occurred - updating... (live nodes size: 4)
[junit4:junit4]   2> 12919 T113 oascc.ZkStateReader$2.process A cluster state change: WatchedEvent state:SyncConnected type:NodeDataChanged path:/clusterstate.json, has occurred - updating... (live nodes size: 4)
[junit4:junit4]   2> 13016 T114 oasc.CoreContainer.registerCore registering core: collection1
[junit4:junit4]   2> 13016 T114 oasc.ZkController.register Register replica - core:collection1 address:http://127.0.0.1:51208 collection:collection1 shard:shard1
[junit4:junit4]   2> 13021 T114 oasc.ZkController.register We are http://127.0.0.1:51208/collection1/ and leader is http://127.0.0.1:34871/collection1/
[junit4:junit4]   2> 13022 T114 oasc.ZkController.register No LogReplay needed for core=collection1 baseURL=http://127.0.0.1:51208
[junit4:junit4]   2> 13022 T114 oasc.ZkController.checkRecovery Core needs to recover:collection1
[junit4:junit4]   2> 13023 T114 oasu.DefaultSolrCoreState.doRecovery Running recovery - first canceling any ongoing recovery
[junit4:junit4]   2> ASYNC  NEW_CORE C3 name=collection1 org.apache.solr.core.SolrCore@70c5c327 url=http://127.0.0.1:51208/collection1 node=127.0.0.1:51208_ C3_STATE=coll:collection1 core:collection1 props:{shard=null, roles=null, state=down, core=collection1, collection=collection1, node_name=127.0.0.1:51208_, base_url=http://127.0.0.1:51208}
[junit4:junit4]   2> 13029 T116 C3 P51208 oasc.RecoveryStrategy.run Starting recovery process.  core=collection1 recoveringAfterStartup=true
[junit4:junit4]   2> 13030 T114 oascc.ZkStateReader.updateClusterState Updating cloud state from ZooKeeper... 
[junit4:junit4]   2> 13030 T116 C3 P51208 oasc.RecoveryStrategy.doRecovery ###### startupVersions=[]
[junit4:junit4]   2> 13031 T116 C3 P51208 oasc.ZkController.publish publishing core=collection1 state=recovering
[junit4:junit4]   2> 13031 T116 C3 P51208 oasc.ZkController.publish numShards not found on descriptor - reading it from system property
[junit4:junit4]   2> 13032 T41 oass.SolrDispatchFilter.init user.dir=/usr/home/hudson/hudson-slave/workspace/Lucene-Solr-Tests-4.x-java7/solr/build/solr-core/test/J0
[junit4:junit4]   2> 13033 T41 oass.SolrDispatchFilter.init SolrDispatchFilter.init() done
[junit4:junit4]   2> 13033 T41 oascsi.HttpClientUtil.createClient Creating new http client, config:maxConnections=128&maxConnectionsPerHost=32&followRedirects=false
[junit4:junit4]   2> 13071 T116 C3 P51208 oasc.RecoveryStrategy.doRecovery Attempting to PeerSync from http://127.0.0.1:34871/collection1/ core=collection1 - recoveringAfterStartup=true
[junit4:junit4]   2> 13081 T116 C3 P51208 oascsi.HttpClientUtil.createClient Creating new http client, config:maxConnectionsPerHost=20&maxConnections=10000&connTimeout=30000&socketTimeout=30000&retry=false
[junit4:junit4]   2> 13103 T116 C3 P51208 oasu.PeerSync.sync PeerSync: core=collection1 url=http://127.0.0.1:51208 START replicas=[http://127.0.0.1:34871/collection1/] nUpdates=100
[junit4:junit4]   2> 13116 T116 C3 P51208 oasu.PeerSync.sync WARNING no frame of reference to tell of we've missed updates
[junit4:junit4]   2> 13116 T116 C3 P51208 oasc.RecoveryStrategy.doRecovery PeerSync Recovery was not successful - trying replication. core=collection1
[junit4:junit4]   2> 13117 T116 C3 P51208 oasc.RecoveryStrategy.doRecovery Starting Replication Recovery. core=collection1
[junit4:junit4]   2> 13117 T116 C3 P51208 oascsi.HttpClientUtil.createClient Creating new http client, config:maxConnections=128&maxConnectionsPerHost=32&followRedirects=false
[junit4:junit4]   2> 13267 T41 oejs.Server.doStart jetty-8.1.8.v20121106
[junit4:junit4]   2> 13270 T41 oejs.AbstractConnector.doStart Started SocketConnector@127.0.0.1:52622
[junit4:junit4]   2> 13271 T41 oasc.SolrResourceLoader.locateSolrHome JNDI not configured for solr (NoInitialContextEx)
[junit4:junit4]   2> 13272 T41 oasc.SolrResourceLoader.locateSolrHome using system property solr.solr.home: /usr/home/hudson/hudson-slave/workspace/Lucene-Solr-Tests-4.x-java7/solr/build/solr-core/test/J0/./org.apache.solr.cloud.BasicDistributedZkTest-jetty4-1355907929269
[junit4:junit4]   2> 13273 T41 oasc.SolrResourceLoader.<init> new SolrResourceLoader for deduced Solr Home: '/usr/home/hudson/hudson-slave/workspace/Lucene-Solr-Tests-4.x-java7/solr/build/solr-core/test/J0/./org.apache.solr.cloud.BasicDistributedZkTest-jetty4-1355907929269/'
[junit4:junit4]   2> 13338 T41 oass.SolrDispatchFilter.init SolrDispatchFilter.init()
[junit4:junit4]   2> 13339 T41 oasc.SolrResourceLoader.locateSolrHome JNDI not configured for solr (NoInitialContextEx)
[junit4:junit4]   2> 13340 T41 oasc.SolrResourceLoader.locateSolrHome using system property solr.solr.home: /usr/home/hudson/hudson-slave/workspace/Lucene-Solr-Tests-4.x-java7/solr/build/solr-core/test/J0/./org.apache.solr.cloud.BasicDistributedZkTest-jetty4-1355907929269
[junit4:junit4]   2> 13340 T41 oasc.CoreContainer$Initializer.initialize looking for solr.xml: /usr/home/hudson/hudson-slave/workspace/Lucene-Solr-Tests-4.x-java7/solr/build/solr-core/test/J0/./org.apache.solr.cloud.BasicDistributedZkTest-jetty4-1355907929269/solr.xml
[junit4:junit4]   2> 13341 T41 oasc.CoreContainer.<init> New CoreContainer 262629768
[junit4:junit4]   2> 13342 T41 oasc.CoreContainer.load Loading CoreContainer using Solr Home: '/usr/home/hudson/hudson-slave/workspace/Lucene-Solr-Tests-4.x-java7/solr/build/solr-core/test/J0/./org.apache.solr.cloud.BasicDistributedZkTest-jetty4-1355907929269/'
[junit4:junit4]   2> 13343 T41 oasc.SolrResourceLoader.<init> new SolrResourceLoader for directory: '/usr/home/hudson/hudson-slave/workspace/Lucene-Solr-Tests-4.x-java7/solr/build/solr-core/test/J0/./org.apache.solr.cloud.BasicDistributedZkTest-jetty4-1355907929269/'
[junit4:junit4]   2> 13386 T41 oashc.HttpShardHandlerFactory.getParameter Setting socketTimeout to: 30000
[junit4:junit4]   2> 13387 T41 oashc.HttpShardHandlerFactory.getParameter Setting urlScheme to: http://
[junit4:junit4]   2> 13388 T41 oashc.HttpShardHandlerFactory.getParameter Setting connTimeout to: 15000
[junit4:junit4]   2> 13388 T41 oashc.HttpShardHandlerFactory.getParameter Setting maxConnectionsPerHost to: 20
[junit4:junit4]   2> 13389 T41 oashc.HttpShardHandlerFactory.getParameter Setting corePoolSize to: 0
[junit4:junit4]   2> 13390 T41 oashc.HttpShardHandlerFactory.getParameter Setting maximumPoolSize to: 2147483647
[junit4:junit4]   2> 13390 T41 oashc.HttpShardHandlerFactory.getParameter Setting maxThreadIdleTime to: 5
[junit4:junit4]   2> 13391 T41 oashc.HttpShardHandlerFactory.getParameter Setting sizeOfQueue to: -1
[junit4:junit4]   2> 13392 T41 oashc.HttpShardHandlerFactory.getParameter Setting fairnessPolicy to: false
[junit4:junit4]   2> 13392 T41 oascsi.HttpClientUtil.createClient Creating new http client, config:maxConnectionsPerHost=20&maxConnections=10000&socketTimeout=30000&connTimeout=15000&retry=false
[junit4:junit4]   2> 13422 T41 oasc.CoreContainer.load Registering Log Listener
[junit4:junit4]   2> 13429 T65 oascc.ZkStateReader.updateClusterState Updating cloud state from ZooKeeper... 
[junit4:junit4]   2> 13431 T65 oasc.Overseer$ClusterStateUpdater.updateState Update state numShards=2 message={
[junit4:junit4]   2> 	  "operation":"state",
[junit4:junit4]   2> 	  "numShards":"2",
[junit4:junit4]   2> 	  "shard":"shard1",
[junit4:junit4]   2> 	  "roles":null,
[junit4:junit4]   2> 	  "state":"recovering",
[junit4:junit4]   2> 	  "core":"collection1",
[junit4:junit4]   2> 	  "collection":"collection1",
[junit4:junit4]   2> 	  "node_name":"127.0.0.1:51208_",
[junit4:junit4]   2> 	  "base_url":"http://127.0.0.1:51208"}
[junit4:junit4]   2> 13447 T41 oasc.CoreContainer.initZooKeeper Zookeeper client=127.0.0.1:32779/solr
[junit4:junit4]   2> 13448 T41 oasc.ZkController.checkChrootPath zkHost includes chroot
[junit4:junit4]   2> 13449 T41 oaz.ZooKeeper.<init> Initiating client connection, connectString=127.0.0.1:32779 sessionTimeout=60000 watcher=org.apache.solr.common.cloud.ConnectionManager@aa8caa8
[junit4:junit4]   2> 13450 T41 oascc.ConnectionManager.waitForConnected Waiting for client to connect to ZooKeeper
[junit4:junit4]   2> 13451 T127 oaz.ClientCnxn$SendThread.logStartConnect Opening socket connection to server localhost/127.0.0.1:32779. Will not attempt to authenticate using SASL (access denied ("javax.security.auth.AuthPermission" "getLoginConfiguration"))
[junit4:junit4]   2> 13452 T113 oascc.ZkStateReader$2.process A cluster state change: WatchedEvent state:SyncConnected type:NodeDataChanged path:/clusterstate.json, has occurred - updating... (live nodes size: 4)
[junit4:junit4]   2> 13452 T43 oazs.NIOServerCnxnFactory.run Accepted socket connection from /140.211.11.196:12000
[junit4:junit4]   2> 13452 T127 oaz.ClientCnxn$SendThread.primeConnection Socket connection established to localhost/127.0.0.1:32779, initiating session
[junit4:junit4]   2> 13452 T83 oascc.ZkStateReader$2.process A cluster state change: WatchedEvent state:SyncConnected type:NodeDataChanged path:/clusterstate.json, has occurred - updating... (live nodes size: 4)
[junit4:junit4]   2> 13453 T43 oazs.ZooKeeperServer.processConnectRequest Client attempting to establish new session at /140.211.11.196:12000
[junit4:junit4]   2> 13452 T70 oascc.ZkStateReader$2.process A cluster state change: WatchedEvent state:SyncConnected type:NodeDataChanged path:/clusterstate.json, has occurred - updating... (live nodes size: 4)
[junit4:junit4]   2> 13452 T98 oascc.ZkStateReader$2.process A cluster state change: WatchedEvent state:SyncConnected type:NodeDataChanged path:/clusterstate.json, has occurred - updating... (live nodes size: 4)
[junit4:junit4]   2> 13452 T64 oascc.ZkStateReader$2.process A cluster state change: WatchedEvent state:SyncConnected type:NodeDataChanged path:/clusterstate.json, has occurred - updating... (live nodes size: 4)
[junit4:junit4]   2> 13456 T45 oazs.ZooKeeperServer.finishSessionInit Established session 0x13bb268e2cb000b with negotiated timeout 20000 for client /140.211.11.196:12000
[junit4:junit4]   2> 13456 T127 oaz.ClientCnxn$SendThread.onConnected Session establishment complete on server localhost/127.0.0.1:32779, sessionid = 0x13bb268e2cb000b, negotiated timeout = 20000
[junit4:junit4]   2> 13457 T128 oascc.ConnectionManager.process Watcher org.apache.solr.common.cloud.ConnectionManager@aa8caa8 name:ZooKeeperConnection Watcher:127.0.0.1:32779 got event WatchedEvent state:SyncConnected type:None path:null path:null type:None
[junit4:junit4]   2> 13458 T41 oascc.ConnectionManager.waitForConnected Client is connected to ZooKeeper
[junit4:junit4]   2> 13460 T46 oazs.PrepRequestProcessor.pRequest2Txn Processed session termination for sessionid: 0x13bb268e2cb000b
[junit4:junit4]   2> 13462 T128 oaz.ClientCnxn$EventThread.run EventThread shut down
[junit4:junit4]   2> 13462 T41 oaz.ZooKeeper.close Session: 0x13bb268e2cb000b closed
[junit4:junit4]   2> 13462 T43 oazs.NIOServerCnxn.closeSock Closed socket connection for client /140.211.11.196:12000 which had sessionid 0x13bb268e2cb000b
[junit4:junit4]   2> 13463 T41 oascsi.HttpClientUtil.createClient Creating new http client, config:maxConnections=500&maxConnectionsPerHost=16&socketTimeout=15000&connTimeout=30000
[junit4:junit4]   2> 13477 T41 oaz.ZooKeeper.<init> Initiating client connection, connectString=127.0.0.1:32779/solr sessionTimeout=30000 watcher=org.apache.solr.common.cloud.ConnectionManager@3ad932b2
[junit4:junit4]   2> 13478 T41 oascc.ConnectionManager.waitForConnected Waiting for client to connect to ZooKeeper
[junit4:junit4]   2> 13479 T129 oaz.ClientCnxn$SendThread.logStartConnect Opening socket connection to server localhost/127.0.0.1:32779. Will not attempt to authenticate using SASL (access denied ("javax.security.auth.AuthPermission" "getLoginConfiguration"))
[junit4:junit4]   2> 13479 T129 oaz.ClientCnxn$SendThread.primeConnection Socket connection established to localhost/127.0.0.1:32779, initiating session
[junit4:junit4]   2> 13480 T43 oazs.NIOServerCnxnFactory.run Accepted socket connection from /140.211.11.196:52078
[junit4:junit4]   2> 13481 T43 oazs.ZooKeeperServer.processConnectRequest Client attempting to establish new session at /140.211.11.196:52078
[junit4:junit4]   2> 13483 T45 oazs.ZooKeeperServer.finishSessionInit Established session 0x13bb268e2cb000c with negotiated timeout 20000 for client /140.211.11.196:52078
[junit4:junit4]   2> 13483 T129 oaz.ClientCnxn$SendThread.onConnected Session establishment complete on server localhost/127.0.0.1:32779, sessionid = 0x13bb268e2cb000c, negotiated timeout = 20000
[junit4:junit4]   2> 13483 T130 oascc.ConnectionManager.process Watcher org.apache.solr.common.cloud.ConnectionManager@3ad932b2 name:ZooKeeperConnection Watcher:127.0.0.1:32779/solr got event WatchedEvent state:SyncConnected type:None path:null path:null type:None
[junit4:junit4]   2> 13484 T41 oascc.ConnectionManager.waitForConnected Client is connected to ZooKeeper
[junit4:junit4]   2> 13485 T46 oazs.PrepRequestProcessor.pRequest Got user-level KeeperException when processing sessionid:0x13bb268e2cb000c type:create cxid:0x1 zxid:0xa6 txntype:-1 reqpath:n/a Error Path:/solr/overseer Error:KeeperErrorCode = NodeExists for /solr/overseer
[junit4:junit4]   2> 13488 T46 oazs.PrepRequestProcessor.pRequest Got user-level KeeperException when processing sessionid:0x13bb268e2cb000c type:create cxid:0x2 zxid:0xa7 txntype:-1 reqpath:n/a Error Path:/solr/overseer Error:KeeperErrorCode = NodeExists for /solr/overseer
[junit4:junit4]   2> 13490 T41 oasc.ZkController.createEphemeralLiveNode Register node as live in ZooKeeper:/live_nodes/127.0.0.1:52622_
[junit4:junit4]   2> 13491 T46 oazs.PrepRequestProcessor.pRequest Got user-level KeeperException when processing sessionid:0x13bb268e2cb000c type:delete cxid:0x4 zxid:0xa8 txntype:-1 reqpath:n/a Error Path:/solr/live_nodes/127.0.0.1:52622_ Error:KeeperErrorCode = NoNode for /solr/live_nodes/127.0.0.1:52622_
[junit4:junit4]   2> 13492 T41 oascc.SolrZkClient.makePath makePath: /live_nodes/127.0.0.1:52622_
[junit4:junit4]   2> 13497 T64 oascc.ZkStateReader$3.process Updating live nodes... (5)
[junit4:junit4]   2> 13498 T70 oascc.ZkStateReader$3.process Updating live nodes... (5)
[junit4:junit4]   2> 13498 T83 oascc.ZkStateReader$3.process Updating live nodes... (5)
[junit4:junit4]   2> 13498 T98 oascc.ZkStateReader$3.process Updating live nodes... (5)
[junit4:junit4]   2> 13498 T64 oascc.ZkStateReader$2.process A cluster state change: WatchedEvent state:SyncConnected type:NodeChildrenChanged path:/live_nodes, has occurred - updating... (live nodes size: 5)
[junit4:junit4]   2> 13497 T113 oascc.ZkStateReader$3.process Updating live nodes... (5)
[junit4:junit4]   2> 13499 T98 oascc.ZkStateReader$2.process A cluster state change: WatchedEvent state:SyncConnected type:NodeChildrenChanged path:/live_nodes, has occurred - updating... (live nodes size: 5)
[junit4:junit4]   2> 13498 T70 oascc.ZkStateReader$2.process A cluster state change: WatchedEvent state:SyncConnected type:NodeChildrenChanged path:/live_nodes, has occurred - updating... (live nodes size: 5)
[junit4:junit4]   2> 13500 T113 oascc.ZkStateReader$2.process A cluster state change: WatchedEvent state:SyncConnected type:NodeChildrenChanged path:/live_nodes, has occurred - updating... (live nodes size: 5)
[junit4:junit4]   2> 13499 T83 oascc.ZkStateReader$2.process A cluster state change: WatchedEvent state:SyncConnected type:NodeChildrenChanged path:/live_nodes, has occurred - updating... (live nodes size: 5)
[junit4:junit4]   2> 13506 T41 oascc.ZkStateReader.createClusterStateWatchersAndUpdate Updating cluster state from ZooKeeper... 
[junit4:junit4]   2> 13524 T131 oasc.CoreContainer.create Creating SolrCore 'collection1' using instanceDir: /usr/home/hudson/hudson-slave/workspace/Lucene-Solr-Tests-4.x-java7/solr/build/solr-core/test/J0/./org.apache.solr.cloud.BasicDistributedZkTest-jetty4-1355907929269/collection1
[junit4:junit4]   2> 13524 T131 oasc.ZkController.createCollectionZkNode Check for collection zkNode:collection1
[junit4:junit4]   2> 13526 T131 oasc.ZkController.createCollectionZkNode Collection zkNode exists
[junit4:junit4]   2> 13526 T131 oasc.ZkController.readConfigName Load collection config from:/collections/collection1
[junit4:junit4]   2> 13529 T131 oasc.SolrResourceLoader.<init> new SolrResourceLoader for directory: '/usr/home/hudson/hudson-slave/workspace/Lucene-Solr-Tests-4.x-java7/solr/build/solr-core/test/J0/./org.apache.solr.cloud.BasicDistributedZkTest-jetty4-1355907929269/collection1/'
[junit4:junit4]   2> 13531 T131 oasc.SolrResourceLoader.replaceClassLoader Adding 'file:/usr/home/hudson/hudson-slave/workspace/Lucene-Solr-Tests-4.x-java7/solr/build/solr-core/test/J0/org.apache.solr.cloud.BasicDistributedZkTest-jetty4-1355907929269/collection1/lib/README' to classloader
[junit4:junit4]   2> 13532 T131 oasc.SolrResourceLoader.replaceClassLoader Adding 'file:/usr/home/hudson/hudson-slave/workspace/Lucene-Solr-Tests-4.x-java7/solr/build/solr-core/test/J0/org.apache.solr.cloud.BasicDistributedZkTest-jetty4-1355907929269/collection1/lib/classes/' to classloader
[junit4:junit4]   2> 13637 T131 oasc.SolrConfig.<init> Using Lucene MatchVersion: LUCENE_41
[junit4:junit4]   2> 13731 T131 oasc.SolrConfig.<init> Loaded SolrConfig: solrconfig.xml
[junit4:junit4]   2> 13833 T131 oass.IndexSchema.readSchema Reading Solr Schema
[junit4:junit4]   2> 13863 T131 oass.IndexSchema.readSchema Schema name=test
[junit4:junit4]   2> ASYNC  NEW_CORE C4 name=collection1 org.apache.solr.core.SolrCore@3c305562 url=http://127.0.0.1:34871/collection1 node=127.0.0.1:34871_ C4_STATE=coll:collection1 core:collection1 props:{shard=shard1, roles=null, state=active, core=collection1, collection=collection1, node_name=127.0.0.1:34871_, base_url=http://127.0.0.1:34871, leader=true}
[junit4:junit4]   2> 14628 T74 C4 P34871 REQ /get {distrib=false&qt=/get&wt=javabin&version=2&getVersions=100} status=0 QTime=13 
[junit4:junit4]   2> 14670 T131 oass.OpenExchangeRatesOrgProvider.init Initialized with rates=open-exchange-rates.json, refreshInterval=1440.
[junit4:junit4]   2> 14683 T131 oass.IndexSchema.readSchema default search field in schema is text
[junit4:junit4]   2> 14687 T131 oass.IndexSchema.readSchema unique key field: id
[junit4:junit4]   2> 14714 T131 oass.FileExchangeRateProvider.reload Reloading exchange rates from file currency.xml
[junit4:junit4]   2> 14738 T131 oass.FileExchangeRateProvider.reload Reloading exchange rates from file currency.xml
[junit4:junit4]   2> 14743 T131 oass.OpenExchangeRatesOrgProvider.reload Reloading exchange rates from open-exchange-rates.json
[junit4:junit4]   2> 14745 T131 oass.OpenExchangeRatesOrgProvider.reload Reloading exchange rates from open-exchange-rates.json
[junit4:junit4]   2> 14747 T131 oasc.SolrCore.<init> [collection1] Opening new SolrCore at /usr/home/hudson/hudson-slave/workspace/Lucene-Solr-Tests-4.x-java7/solr/build/solr-core/test/J0/./org.apache.solr.cloud.BasicDistributedZkTest-jetty4-1355907929269/collection1/, dataDir=./org.apache.solr.cloud.BasicDistributedZkTest-1355907916225/jetty4/
[junit4:junit4]   2> 14748 T131 oasc.JmxMonitoredMap.<init> JMX monitoring is enabled. Adding Solr mbeans to JMX Server: com.sun.jmx.mbeanserver.JmxMBeanServer@137b2615
[junit4:junit4]   2> 14748 T131 oasc.SolrCore.initDirectoryFactory solr.NRTCachingDirectoryFactory
[junit4:junit4]   2> 14749 T131 oasc.CachingDirectoryFactory.get return new directory for /usr/home/hudson/hudson-slave/workspace/Lucene-Solr-Tests-4.x-java7/solr/build/solr-core/test/J0/./org.apache.solr.cloud.BasicDistributedZkTest-1355907916225/jetty4 forceNew:false
[junit4:junit4]   2> 14750 T131 oasc.CachingDirectoryFactory.close Releasing directory:/usr/home/hudson/hudson-slave/workspace/Lucene-Solr-Tests-4.x-java7/solr/build/solr-core/test/J0/./org.apache.solr.cloud.BasicDistributedZkTest-1355907916225/jetty4
[junit4:junit4]   2> 14750 T131 oasc.SolrCore.getNewIndexDir New index directory detected: old=null new=./org.apache.solr.cloud.BasicDistributedZkTest-1355907916225/jetty4/index/
[junit4:junit4]   2> 14751 T131 oasc.SolrCore.initIndex WARNING [collection1] Solr index directory './org.apache.solr.cloud.BasicDistributedZkTest-1355907916225/jetty4/index' doesn't exist. Creating new index...
[junit4:junit4]   2> 14752 T131 oasc.CachingDirectoryFactory.get return new directory for /usr/home/hudson/hudson-slave/workspace/Lucene-Solr-Tests-4.x-java7/solr/build/solr-core/test/J0/./org.apache.solr.cloud.BasicDistributedZkTest-1355907916225/jetty4/index forceNew:false
[junit4:junit4]   2> 14765 T131 oasc.SolrDeletionPolicy.onCommit SolrDeletionPolicy.onCommit: commits:num=1
[junit4:junit4]   2> 		commit{dir=RateLimitedDirectoryWrapper(NRTCachingDirectory(org.apache.lucene.store.NIOFSDirectory@/usr/home/hudson/hudson-slave/workspace/Lucene-Solr-Tests-4.x-java7/solr/build/solr-core/test/J0/org.apache.solr.cloud.BasicDistributedZkTest-1355907916225/jetty4/index lockFactory=org.apache.lucene.store.NativeFSLockFactory@74976197; maxCacheMB=48.0 maxMergeSizeMB=4.0)),segFN=segments_1,generation=1,filenames=[segments_1]
[junit4:junit4]   2> 14766 T131 oasc.SolrDeletionPolicy.updateCommits newest commit = 1[segments_1]
[junit4:junit4]   2> 14766 T131 oasc.CachingDirectoryFactory.close Releasing directory:/usr/home/hudson/hudson-slave/workspace/Lucene-Solr-Tests-4.x-java7/solr/build/solr-core/test/J0/./org.apache.solr.cloud.BasicDistributedZkTest-1355907916225/jetty4/index
[junit4:junit4]   2> 14767 T131 oasc.SolrCore.initWriters created xml: solr.XMLResponseWriter
[junit4:junit4]   2> 14769 T131 oasup.UpdateRequestProcessorChain.init inserting DistributedUpdateProcessorFactory into updateRequestProcessorChain "dedupe"
[junit4:junit4]   2> 14769 T131 oasup.UpdateRequestProcessorChain.init inserting DistributedUpdateProcessorFactory into updateRequestProcessorChain "dedupe-allfields"
[junit4:junit4]   2> 14770 T131 oasup.UpdateRequestProcessorChain.init inserting DistributedUpdateProcessorFactory into updateRequestProcessorChain "stored_sig"
[junit4:junit4]   2> 14770 T131 oasup.UpdateRequestProcessorChain.init inserting DistributedUpdateProcessorFactory into updateRequestProcessorChain "uniq-fields"
[junit4:junit4]   2> 14771 T131 oasup.UpdateRequestProcessorChain.init inserting DistributedUpdateProcessorFactory into updateRequestProcessorChain "distrib-dup-test-chain-implicit"
[junit4:junit4]   2> 14771 T131 oasc.RequestHandlers.initHandlersFromConfig adding lazy requestHandler: solr.ReplicationHandler
[junit4:junit4]   2> 14771 T131 oasc.RequestHandlers.initHandlersFromConfig created /replication: solr.ReplicationHandler
[junit4:junit4]   2> 14773 T131 oasc.RequestHandlers.initHandlersFromConfig created standard: solr.StandardRequestHandler
[junit4:junit4]   2> 14774 T131 oasc.RequestHandlers.initHandlersFromConfig created /get: solr.RealTimeGetHandler
[junit4:junit4]   2> 14775 T131 oasc.RequestHandlers.initHandlersFromConfig created dismax: solr.SearchHandler
[junit4:junit4]   2> 14776 T131 oasc.RequestHandlers.initHandlersFromConfig created mock: org.apache.solr.core.MockQuerySenderListenerReqHandler
[junit4:junit4]   2> 14776 T131 oasc.RequestHandlers.initHandlersFromConfig created /admin/: org.apache.solr.handler.admin.AdminHandlers
[junit4:junit4]   2> 14777 T131 oasc.RequestHandlers.initHandlersFromConfig created defaults: solr.StandardRequestHandler
[junit4:junit4]   2> 14778 T131 oasc.RequestHandlers.initHandlersFromConfig adding lazy requestHandler: solr.StandardRequestHandler
[junit4:junit4]   2> 14778 T131 oasc.RequestHandlers.initHandlersFromConfig created lazy: solr.StandardRequestHandler
[junit4:junit4]   2> 14779 T131 oasc.RequestHandlers.initHandlersFromConfig created /update: solr.UpdateRequestHandler
[junit4:junit4]   2> 14780 T131 oasc.RequestHandlers.initHandlersFromConfig created /terms: org.apache.solr.handler.component.SearchHandler
[junit4:junit4]   2> 14781 T131 oasc.RequestHandlers.initHandlersFromConfig created spellCheckCompRH: org.apache.solr.handler.component.SearchHandler
[junit4:junit4]   2> 14782 T131 oasc.RequestHandlers.initHandlersFromConfig created spellCheckCompRH_Direct: org.apache.solr.handler.component.SearchHandler
[junit4:junit4]   2> 14784 T131 oasc.RequestHandlers.initHandlersFromConfig created spellCheckWithWordbreak: org.apache.solr.handler.component.SearchHandler
[junit4:junit4]   2> 14785 T131 oasc.RequestHandlers.initHandlersFromConfig created spellCheckWithWordbreak_Direct: org.apache.solr.handler.component.SearchHandler
[junit4:junit4]   2> 14786 T131 oasc.RequestHandlers.initHandlersFromConfig created spellCheckCompRH1: org.apache.solr.handler.component.SearchHandler
[junit4:junit4]   2> 14787 T131 oasc.RequestHandlers.initHandlersFromConfig created mltrh: org.apache.solr.handler.component.SearchHandler
[junit4:junit4]   2> 14788 T131 oasc.RequestHandlers.initHandlersFromConfig created tvrh: org.apache.solr.handler.component.SearchHandler
[junit4:junit4]   2> 14789 T131 oasc.RequestHandlers.initHandlersFromConfig created /mlt: solr.MoreLikeThisHandler
[junit4:junit4]   2> 14790 T131 oasc.RequestHandlers.initHandlersFromConfig created /debug/dump: solr.DumpRequestHandler
[junit4:junit4]   2> 14799 T131 oashl.XMLLoader.init xsltCacheLifetimeSeconds=60
[junit4:junit4]   2> 14802 T131 oasc.SolrCore.initDeprecatedSupport WARNING solrconfig.xml uses deprecated <admin/gettableFiles>, Please update your config to use the ShowFileRequestHandler.
[junit4:junit4]   2> 14805 T131 oasc.SolrCore.initDeprecatedSupport WARNING adding ShowFileRequestHandler with hidden files: [SCHEMA.XML, OLD_SYNONYMS.TXT, STOPWORDS.TXT, PROTWORDS.TXT, OPEN-EXCHANGE-RATES.JSON, SYNONYMS.TXT, CURRENCY.XML, MAPPING-ISOLATIN1ACCENT.TXT]
[junit4:junit4]   2> 14807 T131 oasc.CachingDirectoryFactory.close Releasing directory:/usr/home/hudson/hudson-slave/workspace/Lucene-Solr-Tests-4.x-java7/solr/build/solr-core/test/J0/./org.apache.solr.cloud.BasicDistributedZkTest-1355907916225/jetty4
[junit4:junit4]   2> 14808 T131 oass.SolrIndexSearcher.<init> Opening Searcher@779dfd5a main
[junit4:junit4]   2> 14809 T131 oasu.CommitTracker.<init> Hard AutoCommit: disabled
[junit4:junit4]   2> 14810 T131 oasu.CommitTracker.<init> Soft AutoCommit: disabled
[junit4:junit4]   2> 14810 T131 oashc.SpellCheckComponent.inform Initializing spell checkers
[junit4:junit4]   2> 14815 T131 oass.DirectSolrSpellChecker.init init: {name=direct,classname=DirectSolrSpellChecker,field=lowerfilt,minQueryLength=3}
[junit4:junit4]   2> 14874 T132 oasc.SolrCore.registerSearcher [collection1] Registered new searcher Searcher@779dfd5a main{StandardDirectoryReader(segments_1:1)}
[junit4:junit4]   2> 14879 T131 oasc.ZkController.publish publishing core=collection1 state=down
[junit4:junit4]   2> 14879 T131 oasc.ZkController.publish numShards not found on descriptor - reading it from system property
[junit4:junit4]   2> 14969 T65 oascc.ZkStateReader.updateClusterState Updating cloud state from ZooKeeper... 
[junit4:junit4]   2> 14971 T65 oasc.Overseer$ClusterStateUpdater.updateState Update state numShards=2 message={
[junit4:junit4]   2> 	  "operation":"state",
[junit4:junit4]   2> 	  "numShards":"2",
[junit4:junit4]   2> 	  "shard":null,
[junit4:junit4]   2> 	  "roles":null,
[junit4:junit4]   2> 	  "state":"down",
[junit4:junit4]   2> 	  "core":"collection1",
[junit4:junit4]   2> 	  "collection":"collection1",
[junit4:junit4]   2> 	  "node_name":"127.0.0.1:52622_",
[junit4:junit4]   2> 	  "base_url":"http://127.0.0.1:52622"}
[junit4:junit4]   2> 14971 T65 oasc.Overseer$ClusterStateUpdater.updateState Collection already exists with numShards=2
[junit4:junit4]   2> 14971 T65 oasc.Overseer$ClusterStateUpdater.updateState Assigning new node to shard shard=shard2
[junit4:junit4]   2> 14984 T70 oascc.ZkStateReader$2.process A cluster state change: WatchedEvent state:SyncConnected type:NodeDataChanged path:/clusterstate.json, has occurred - updating... (live nodes size: 5)
[junit4:junit4]   2> 14984 T83 oascc.ZkStateReader$2.process A cluster state change: WatchedEvent state:SyncConnected type:NodeDataChanged path:/clusterstate.json, has occurred - updating... (live nodes size: 5)
[junit4:junit4]   2> 14984 T113 oascc.ZkStateReader$2.process A cluster state change: WatchedEvent state:SyncConnected type:NodeDataChanged path:/clusterstate.json, has occurred - updating... (live nodes size: 5)
[junit4:junit4]   2> 14984 T98 oascc.ZkStateReader$2.process A cluster state change: WatchedEvent state:SyncConnected type:NodeDataChanged path:/clusterstate.json, has occurred - updating... (live nodes size: 5)
[junit4:junit4]   2> 14984 T64 oascc.ZkStateReader$2.process A cluster state change: WatchedEvent state:SyncConnected type:NodeDataChanged path:/clusterstate.json, has occurred - updating... (live nodes size: 5)
[junit4:junit4]   2> 14984 T130 oascc.ZkStateReader$2.process A cluster state change: WatchedEvent state:SyncConnected type:NodeDataChanged path:/clusterstate.json, has occurred - updating... (live nodes size: 5)
[junit4:junit4]   2> 15383 T131 oasc.CoreContainer.registerCore registering core: collection1
[junit4:junit4]   2> 15383 T131 oasc.ZkController.register Register replica - core:collection1 address:http://127.0.0.1:52622 collection:collection1 shard:shard2
[junit4:junit4]   2> 15388 T131 oasc.ZkController.register We are http://127.0.0.1:52622/collection1/ and leader is http://127.0.0.1:17574/collection1/
[junit4:junit4]   2> 15388 T131 oasc.ZkController.register No LogReplay needed for core=collection1 baseURL=http://127.0.0.1:52622
[junit4:junit4]   2> 15388 T131 oasc.ZkController.checkRecovery Core needs to recover:collection1
[junit4:junit4]   2> 15389 T131 oasu.DefaultSolrCoreState.doRecovery Running recovery - first canceling any ongoing recovery
[junit4:junit4]   2> ASYNC  NEW_CORE C5 name=collection1 org.apache.solr.core.SolrCore@1517f0c url=http://127.0.0.1:52622/collection1 node=127.0.0.1:52622_ C5_STATE=coll:collection1 core:collection1 props:{shard=null, roles=null, state=down, core=collection1, collection=collection1, node_name=127.0.0.1:52622_, base_url=http://127.0.0.1:52622}
[junit4:junit4]   2> 15390 T133 C5 P52622 oasc.RecoveryStrategy.run Starting recovery process.  core=collection1 recoveringAfterStartup=true
[junit4:junit4]   2> 15390 T133 C5 P52622 oasc.RecoveryStrategy.doRecovery ###### startupVersions=[]
[junit4:junit4]   2> 15390 T131 oascc.ZkStateReader.updateClusterState Updating cloud state from ZooKeeper... 
[junit4:junit4]   2> 15391 T133 C5 P52622 oasc.ZkController.publish publishing core=collection1 state=recovering
[junit4:junit4]   2> 15391 T133 C5 P52622 oasc.ZkController.publish numShards not found on descriptor - reading it from system property
[junit4:junit4]   2> 15392 T41 oass.SolrDispatchFilter.init user.dir=/usr/home/hudson/hudson-slave/workspace/Lucene-Solr-Tests-4.x-java7/solr/build/solr-core/test/J0
[junit4:junit4]   2> 15393 T133 C5 P52622 oasc.RecoveryStrategy.doRecovery Attempting to PeerSync from http://127.0.0.1:17574/collection1/ core=collection1 - recoveringAfterStartup=true
[junit4:junit4]   2> 15393 T41 oass.SolrDispatchFilter.init SolrDispatchFilter.init() done
[junit4:junit4]   2> 15393 T133 C5 P52622 oasu.PeerSync.sync PeerSync: core=collection1 url=http://127.0.0.1:52622 START replicas=[http://127.0.0.1:17574/collection1/] nUpdates=100
[junit4:junit4]   2> 15393 T41 oascsi.HttpClientUtil.createClient Creating new http client, config:maxConnections=128&maxConnectionsPerHost=32&followRedirects=false
[junit4:junit4]   2> 15394 T133 C5 P52622 oasu.PeerSync.sync WARNING no frame of reference to tell of we've missed updates
[junit4:junit4]   2> 15394 T133 C5 P52622 oasc.RecoveryStrategy.doRecovery PeerSync Recovery was not successful - trying replication. core=collection1
[junit4:junit4]   2> 15394 T133 C5 P52622 oasc.RecoveryStrategy.doRecovery Starting Replication Recovery. core=collection1
[junit4:junit4]   2> 15395 T133 C5 P52622 oascsi.HttpClientUtil.createClient Creating new http client, config:maxConnections=128&maxConnectionsPerHost=32&followRedirects=false
[junit4:junit4]   2> ASYNC  NEW_CORE C6 name=collection1 org.apache.solr.core.SolrCore@3cab7269 url=http://127.0.0.1:17574/collection1 node=127.0.0.1:17574_ C6_STATE=coll:collection1 core:collection1 props:{shard=shard2, roles=null, state=active, core=collection1, collection=collection1, node_name=127.0.0.1:17574_, base_url=http://127.0.0.1:17574, leader=true}
[junit4:junit4]   2> 15402 T88 C6 P17574 REQ /get {distrib=false&qt=/get&wt=javabin&version=2&getVersions=100} status=0 QTime=0 
[junit4:junit4]   2> 15409 T41 oascc.ZkStateReader.updateClusterState Updating cloud state from ZooKeeper... 
[junit4:junit4]   2> 15412 T41 oasc.AbstractDistribZkTestBase.waitForRecoveriesToFinish Wait for recoveries to finish - collection: collection1 failOnTimeout:true timeout (sec):540
[junit4:junit4]   2> 15414 T41 oascc.ZkStateReader.updateClusterState Updating cloud state from ZooKeeper... 
[junit4:junit4]   2> 15492 T65 oascc.ZkStateReader.updateClusterState Updating cloud state from ZooKeeper... 
[junit4:junit4]   2> 15493 T65 oasc.Overseer$ClusterStateUpdater.updateState Update state numShards=2 message={
[junit4:junit4]   2> 	  "operation":"state",
[junit4:junit4]   2> 	  "numShards":"2",
[junit4:junit4]   2> 	  "shard":"shard2",
[junit4:junit4]   2> 	  "roles":null,
[junit4:junit4]   2> 	  "state":"recovering",
[junit4:junit4]   2> 	  "core":"collection1",
[junit4:junit4]   2> 	  "collection":"collection1",
[junit4:junit4]   2> 	  "node_name":"127.0.0.1:52622_",
[junit4:junit4]   2> 	  "base_url":"http://127.0.0.1:52622"}
[junit4:junit4]   2> 15506 T64 oascc.ZkStateReader$2.process A cluster state change: WatchedEvent state:SyncConnected type:NodeDataChanged path:/clusterstate.json, has occurred - updating... (live nodes size: 5)
[junit4:junit4]   2> 15506 T130 oascc.ZkStateReader$2.process A cluster state change: WatchedEvent state:SyncConnected type:NodeDataChanged path:/clusterstate.json, has occurred - updating... (live nodes size: 5)
[junit4:junit4]   2> 15506 T83 oascc.ZkStateReader$2.process A cluster state change: WatchedEvent state:SyncConnected type:NodeDataChanged path:/clusterstate.json, has occurred - updating... (live nodes size: 5)
[junit4:junit4]   2> 15506 T70 oascc.ZkStateReader$2.process A cluster state change: WatchedEvent state:SyncConnected type:NodeDataChanged path:/clusterstate.json, has occurred - updating... (live nodes size: 5)
[junit4:junit4]   2> 15506 T113 oascc.ZkStateReader$2.process A cluster state change: WatchedEvent state:SyncConnected type:NodeDataChanged path:/clusterstate.json, has occurred - updating... (live nodes size: 5)
[junit4:junit4]   2> 15506 T98 oascc.ZkStateReader$2.process A cluster state change: WatchedEvent state:SyncConnected type:NodeDataChanged path:/clusterstate.json, has occurred - updating... (live nodes size: 5)
[junit4:junit4]   2> 16418 T41 oascc.ZkStateReader.updateClusterState Updating cloud state from ZooKeeper... 
[junit4:junit4]   2>  C3_STATE=coll:collection1 core:collection1 props:{shard=shard1, roles=null, state=recovering, core=collection1, collection=collection1, node_name=127.0.0.1:51208_, base_url=http://127.0.0.1:51208}
[junit4:junit4]   2> 16766 T116 C3 P51208 oasc.RecoveryStrategy.doRecovery Begin buffering updates. core=collection1
[junit4:junit4]   2> 16766 T116 C3 P51208 oasu.UpdateLog.bufferUpdates Starting to buffer updates. FSUpdateLog{state=ACTIVE, tlog=null}
[junit4:junit4]   2> 16767 T116 C3 P51208 oasc.RecoveryStrategy.replicate Attempting to replicate from http://127.0.0.1:34871/collection1/. core=collection1
[junit4:junit4]   2> 16767 T116 C3 P51208 oascsi.HttpClientUtil.createClient Creating new http client, config:maxConnections=128&maxConnectionsPerHost=32&followRedirects=false
[junit4:junit4]   2> 16799 T75 C4 P34871 oasu.DirectUpdateHandler2.commit start commit{flags=0,_version_=0,optimize=false,openSearcher=false,waitSearcher=true,expungeDeletes=false,softCommit=false}
[junit4:junit4]   2> 16801 T75 C4 P34871 oasc.CachingDirectoryFactory.close Releasing directory:/usr/home/hudson/hudson-slave/workspace/Lucene-Solr-Tests-4.x-java7/solr/build/solr-core/test/J0/./org.apache.solr.cloud.BasicDistributedZkTest-1355907916225/jetty1
[junit4:junit4]   2> 16807 T75 C4 P34871 oasc.SolrDeletionPolicy.onInit SolrDeletionPolicy.onInit: commits:num=1
[junit4:junit4]   2> 		commit{dir=RateLimitedDirectoryWrapper(NRTCachingDirectory(org.apache.lucene.store.NIOFSDirectory@/usr/home/hudson/hudson-slave/workspace/Lucene-Solr-Tests-4.x-java7/solr/build/solr-core/test/J0/org.apache.solr.cloud.BasicDistributedZkTest-1355907916225/jetty1/index lockFactory=org.apache.lucene.store.NativeFSLockFactory@607b55c5; maxCacheMB=48.0 maxMergeSizeMB=4.0)),segFN=segments_1,generation=1,filenames=[segments_1]
[junit4:junit4]   2> 16807 T75 C4 P34871 oasc.SolrDeletionPolicy.updateCommits newest commit = 1[segments_1]
[junit4:junit4]   2> 16813 T75 C4 P34871 oasc.SolrDeletionPolicy.onCommit SolrDeletionPolicy.onCommit: commits:num=2
[junit4:junit4]   2> 		commit{dir=RateLimitedDirectoryWrapper(NRTCachingDirectory(org.apache.lucene.store.NIOFSDirectory@/usr/home/hudson/hudson-slave/workspace/Lucene-Solr-Tests-4.x-java7/solr/build/solr-core/test/J0/org.apache.solr.cloud.BasicDistributedZkTest-1355907916225/jetty1/index lockFactory=org.apache.lucene.store.NativeFSLockFactory@607b55c5; maxCacheMB=48.0 maxMergeSizeMB=4.0)),segFN=segments_1,generation=1,filenames=[segments_1]
[junit4:junit4]   2> 		commit{dir=RateLimitedDirectoryWrapper(NRTCachingDirectory(org.apache.lucene.store.NIOFSDirectory@/usr/home/hudson/hudson-slave/workspace/Lucene-Solr-Tests-4.x-java7/solr/build/solr-core/test/J0/org.apache.solr.cloud.BasicDistributedZkTest-1355907916225/jetty1/index lockFactory=org.apache.lucene.store.NativeFSLockFactory@607b55c5; maxCacheMB=48.0 maxMergeSizeMB=4.0)),segFN=segments_2,generation=2,filenames=[segments_2]
[junit4:junit4]   2> 16813 T75 C4 P34871 oasc.SolrDeletionPolicy.updateCommits newest commit = 2[segments_2]
[junit4:junit4]   2> 16815 T75 C4 P34871 oasc.CachingDirectoryFactory.close Releasing directory:/usr/home/hudson/hudson-slave/workspace/Lucene-Solr-Tests-4.x-java7/solr/build/solr-core/test/J0/./org.apache.solr.cloud.BasicDistributedZkTest-1355907916225/jetty1
[junit4:junit4]   2> 16816 T75 C4 P34871 oass.SolrIndexSearcher.<init> Opening Searcher@44cdbc59 realtime
[junit4:junit4]   2> 16816 T75 C4 P34871 oasu.DirectUpdateHandler2.commit end_commit_flush
[junit4:junit4]   2> 16817 T75 C4 P34871 /update {waitSearcher=true&openSearcher=false&commit=true&commit_end_point=true&wt=javabin&softCommit=false&version=2} {commit=} 0 28
[junit4:junit4]   2> 16886 T116 C3 P51208 oash.ReplicationHandler.inform Commits will be reserved for  10000
[junit4:junit4]   2> 16887 T116 C3 P51208 oascsi.HttpClientUtil.createClient Creating new http client, config:connTimeout=5000&socketTimeout=20000&allowCompression=false&maxConnections=10000&maxConnectionsPerHost=10000
[junit4:junit4]   2> 16918 T116 C3 P51208 oash.SnapPuller.<init>  No value set for 'pollInterval'. Timer Task not started.
[junit4:junit4]   2> 16980 T76 C4 P34871 oash.ReplicationHandler.inform Commits will be reserved for  10000
[junit4:junit4]   2> 16981 T76 C4 P34871 REQ /replication {command=indexversion&wt=javabin&qt=/replication&version=2} status=0 QTime=60 
[junit4:junit4]   2> 16983 T116 C3 P51208 oash.SnapPuller.fetchLatestIndex Master's generation: 2
[junit4:junit4]   2> 16983 T116 C3 P51208 oash.SnapPuller.fetchLatestIndex Slave's generation: 1
[junit4:junit4]   2> 16984 T116 C3 P51208 oash.SnapPuller.fetchLatestIndex Starting replication process
[junit4:junit4]   2> 16988 T76 C4 P34871 oasc.CachingDirectoryFactory.close Releasing directory:/usr/home/hudson/hudson-slave/workspace/Lucene-Solr-Tests-4.x-java7/solr/build/solr-core/test/J0/./org.apache.solr.cloud.BasicDistributedZkTest-1355907916225/jetty1
[junit4:junit4]   2> 16989 T76 C4 P34871 oasc.CachingDirectoryFactory.close Releasing directory:/usr/home/hudson/hudson-slave/workspace/Lucene-Solr-Tests-4.x-java7/solr/build/solr-core/test/J0/./org.apache.solr.cloud.BasicDistributedZkTest-1355907916225/jetty1/index
[junit4:junit4]   2> 16990 T76 C4 P34871 REQ /replication {command=filelist&generation=2&wt=javabin&qt=/replication&version=2} status=0 QTime=2 
[junit4:junit4]   2> 16991 T116 C3 P51208 oash.SnapPuller.fetchLatestIndex Number of files in latest index in master: 1
[junit4:junit4]   2> 16993 T116 C3 P51208 oasc.CachingDirectoryFactory.get return new directory for /usr/home/hudson/hudson-slave/workspace/Lucene-Solr-Tests-4.x-java7/solr/build/solr-core/test/J0/./org.apache.solr.cloud.BasicDistributedZkTest-1355907916225/jetty3/index.20121219100533211 forceNew:false
[junit4:junit4]   2> 16993 T116 C3 P51208 oasc.CachingDirectoryFactory.close Releasing directory:/usr/home/hudson/hudson-slave/workspace/Lucene-Solr-Tests-4.x-java7/solr/build/solr-core/test/J0/./org.apache.solr.cloud.BasicDistributedZkTest-1355907916225/jetty3
[junit4:junit4]   2> 16994 T116 C3 P51208 oash.SnapPuller.fetchLatestIndex Starting download to RateLimitedDirectoryWrapper(NRTCachingDirectory(org.apache.lucene.store.NIOFSDirectory@/usr/home/hudson/hudson-slave/workspace/Lucene-Solr-Tests-4.x-java7/solr/build/solr-core/test/J0/org.apache.solr.cloud.BasicDistributedZkTest-1355907916225/jetty3/index.20121219100533211 lockFactory=org.apache.lucene.store.NativeFSLockFactory@52ec59c7; maxCacheMB=48.0 maxMergeSizeMB=4.0)) fullCopy=true
[junit4:junit4]   2> 17005 T76 C4 P34871 REQ /replication {file=segments_2&command=filecontent&checksum=true&generation=2&qt=/replication&wt=filestream} status=0 QTime=4 
[junit4:junit4]   2> 17015 T116 C3 P51208 oasc.CachingDirectoryFactory.close Releasing directory:/usr/home/hudson/hudson-slave/workspace/Lucene-Solr-Tests-4.x-java7/solr/build/solr-core/test/J0/./org.apache.solr.cloud.BasicDistributedZkTest-1355907916225/jetty3/index
[junit4:junit4]   2> 17015 T116 C3 P51208 oash.SnapPuller.fetchLatestIndex Total time taken for download : 0 secs
[junit4:junit4]   2> 17016 T116 C3 P51208 oash.SnapPuller.modifyIndexProps New index installed. Updating index properties... index=index.20121219100533211
[junit4:junit4]   2> 17018 T116 C3 P51208 oasc.CachingDirectoryFactory.close Releasing directory:/usr/home/hudson/hudson-slave/workspace/Lucene-Solr-Tests-4.x-java7/solr/build/solr-core/test/J0/./org.apache.solr.cloud.BasicDistributedZkTest-1355907916225/jetty3
[junit4:junit4]   2> 17019 T116 C3 P51208 oasc.CachingDirectoryFactory.close Releasing directory:/usr/home/hudson/hudson-slave/workspace/Lucene-Solr-Tests-4.x-java7/solr/build/solr-core/test/J0/./org.apache.solr.cloud.BasicDistributedZkTest-1355907916225/jetty3
[junit4:junit4]   2> 17019 T116 C3 P51208 oasc.SolrCore.getNewIndexDir New index directory detected: old=./org.apache.solr.cloud.BasicDistributedZkTest-1355907916225/jetty3/index/ new=./org.apache.solr.cloud.BasicDistributedZkTest-1355907916225/jetty3/index.20121219100533211
[junit4:junit4]   2> 17022 T116 C3 P51208 oasc.SolrDeletionPolicy.onInit SolrDeletionPolicy.onInit: commits:num=1
[junit4:junit4]   2> 		commit{dir=RateLimitedDirectoryWrapper(NRTCachingDirectory(org.apache.lucene.store.NIOFSDirectory@/usr/home/hudson/hudson-slave/workspace/Lucene-Solr-Tests-4.x-java7/solr/build/solr-core/test/J0/org.apache.solr.cloud.BasicDistributedZkTest-1355907916225/jetty3/index.20121219100533211 lockFactory=org.apache.lucene.store.NativeFSLockFactory@52ec59c7; maxCacheMB=48.0 maxMergeSizeMB=4.0)),segFN=segments_2,generation=2,filenames=[segments_2]
[junit4:junit4]   2> 17022 T116 C3 P51208 oasc.SolrDeletionPolicy.updateCommits newest commit = 2[segments_2]
[junit4:junit4]   2> 17024 T116 C3 P51208 oasc.CachingDirectoryFactory.close Releasing directory:/usr/home/hudson/hudson-slave/workspace/Lucene-Solr-Tests-4.x-java7/solr/build/solr-core/test/J0/./org.apache.solr.cloud.BasicDistributedZkTest-1355907916225/jetty3
[junit4:junit4]   2> 17027 T116 C3 P51208 oasu.DefaultSolrCoreState.newIndexWriter Creating new IndexWriter...
[junit4:junit4]   2> 17027 T116 C3 P51208 oasu.DefaultSolrCoreState.newIndexWriter Waiting until IndexWriter is unused... core=collection1
[junit4:junit4]   2> 17027 T116 C3 P51208 oasu.DefaultSolrCoreState.newIndexWriter Rollback old IndexWriter... core=collection1
[junit4:junit4]   2> 17028 T116 C3 P51208 oasc.CachingDirectoryFactory.close Releasing directory:/usr/home/hudson/hudson-slave/workspace/Lucene-Solr-Tests-4.x-java7/solr/build/solr-core/test/J0/./org.apache.solr.cloud.BasicDistributedZkTest-1355907916225/jetty3/index.20121219100533211
[junit4:junit4]   2> 17029 T116 C3 P51208 oasc.CachingDirectoryFactory.close Releasing directory:/usr/home/hudson/hudson-slave/workspace/Lucene-Solr-Tests-4.x-java7/solr/build/solr-core/test/J0/./org.apache.solr.cloud.BasicDistributedZkTest-1355907916225/jetty3
[junit4:junit4]   2> 17031 T116 C3 P51208 oasc.SolrDeletionPolicy.onInit SolrDeletionPolicy.onInit: commits:num=1
[junit4:junit4]   2> 		commit{dir=RateLimitedDirectoryWrapper(NRTCachingDirectory(org.apache.lucene.store.NIOFSDirectory@/usr/home/hudson/hudson-slave/workspace/Lucene-Solr-Tests-4.x-java7/solr/build/solr-core/test/J0/org.apache.solr.cloud.BasicDistributedZkTest-1355907916225/jetty3/index.20121219100533211 lockFactory=org.apache.lucene.store.NativeFSLockFactory@52ec59c7; maxCacheMB=48.0 maxMergeSizeMB=4.0)),segFN=segments_2,generation=2,filenames=[segments_2]
[junit4:junit4]   2> 17032 T116 C3 P51208 oasc.SolrDeletionPolicy.updateCommits newest commit = 2[segments_2]
[junit4:junit4]   2> 17032 T116 C3 P51208 oasu.DefaultSolrCoreState.newIndexWriter New IndexWriter is ready to be used.
[junit4:junit4]   2> 17033 T116 C3 P51208 oasc.CachingDirectoryFactory.close Releasing directory:/usr/home/hudson/hudson-slave/workspace/Lucene-Solr-Tests-4.x-java7/solr/build/solr-core/test/J0/./org.apache.solr.cloud.BasicDistributedZkTest-1355907916225/jetty3
[junit4:junit4]   2> 17033 T116 C3 P51208 oass.SolrIndexSearcher.<init> Opening Searcher@288a366d main
[junit4:junit4]   2> 17035 T115 oasc.SolrCore.registerSearcher [collection1] Registered new searcher Searcher@288a366d main{StandardDirectoryReader(segments_2:1:nrt)}
[junit4:junit4]   2> 17036 T115 oasc.CachingDirectoryFactory.close Releasing directory:/usr/home/hudson/hudson-slave/workspace/Lucene-Solr-Tests-4.x-java7/solr/build/solr-core/test/J0/./org.apache.solr.cloud.BasicDistributedZkTest-1355907916225/jetty3/index
[junit4:junit4]   2> 17037 T116 C3 P51208 oasu.DirectUpdateHandler2.commit start commit{flags=0,_version_=0,optimize=false,openSearcher=false,waitSearcher=false,expungeDeletes=false,softCommit=false}
[junit4:junit4]   2> 17040 T116 C3 P51208 oasc.SolrDeletionPolicy.onCommit SolrDeletionPolicy.onCommit: commits:num=2
[junit4:junit4]   2> 		commit{dir=RateLimitedDirectoryWrapper(NRTCachingDirectory(org.apache.lucene.store.NIOFSDirectory@/usr/home/hudson/hudson-slave/workspace/Lucene-Solr-Tests-4.x-java7/solr/build/solr-core/test/J0/org.apache.solr.cloud.BasicDistributedZkTest-1355907916225/jetty3/index.20121219100533211 lockFactory=org.apache.lucene.store.NativeFSLockFactory@52ec59c7; maxCacheMB=48.0 maxMergeSizeMB=4.0)),segFN=segments_2,generation=2,filenames=[segments_2]
[junit4:junit4]   2> 		commit{dir=RateLimitedDirectoryWrapper(NRTCachingDirectory(org.apache.lucene.store.NIOFSDirectory@/usr/home/hudson/hudson-slave/workspace/Lucene-Solr-Tests-4.x-java7/solr/build/solr-core/test/J0/org.apache.solr.cloud.BasicDistributedZkTest-1355907916225/jetty3/index.20121219100533211 lockFactory=org.apache.lucene.store.NativeFSLockFactory@52ec59c7; maxCacheMB=48.0 maxMergeSizeMB=4.0)),segFN=segments_3,generation=3,filenames=[segments_3]
[junit4:junit4]   2> 17041 T116 C3 P51208 oasc.SolrDeletionPolicy.updateCommits newest commit = 3[segments_3]
[junit4:junit4]   2> 17042 T116 C3 P51208 oasc.CachingDirectoryFactory.close Releasing directory:/usr/home/hudson/hudson-slave/workspace/Lucene-Solr-Tests-4.x-java7/solr/build/solr-core/test/J0/./org.apache.solr.cloud.BasicDistributedZkTest-1355907916225/jetty3
[junit4:junit4]   2> 17042 T116 C3 P51208 oasu.DirectUpdateHandler2.commit end_commit_flush
[junit4:junit4]   2> 17043 T116 C3 P51208 oasc.CachingDirectoryFactory.close Releasing directory:/usr/home/hudson/hudson-slave/workspace/Lucene-Solr-Tests-4.x-java7/solr/build/solr-core/test/J0/./org.apache.solr.cloud.BasicDistributedZkTest-1355907916225/jetty3/index.20121219100533211
[junit4:junit4]   2> 17043 T116 C3 P51208 oasc.CachingDirectoryFactory.close Releasing directory:/usr/home/hudson/hudson-slave/workspace/Lucene-Solr-Tests-4.x-java7/solr/build/solr-core/test/J0/./org.apache.solr.cloud.BasicDistributedZkTest-1355907916225/jetty3/index
[junit4:junit4]   2> 17044 T116 C3 P51208 oasc.RecoveryStrategy.replay No replay needed. core=collection1
[junit4:junit4]   2> 17044 T116 C3 P51208 oasc.RecoveryStrategy.doRecovery Replication Recovery was successful - registering as Active. core=collection1
[junit4:junit4]   2> 17044 T116 C3 P51208 oasc.ZkController.publish publishing core=collection1 state=active
[junit4:junit4]   2> 17045 T116 C3 P51208 oasc.ZkController.publish numShards not found on descriptor - reading it from system property
[junit4:junit4]   2> 17047 T116 C3 P51208 oasc.RecoveryStrategy.doRecovery Finished recovery process. core=collection1
[junit4:junit4]   2> 17422 T41 oascc.ZkStateReader.updateClusterState Updating cloud state from ZooKeeper... 
[junit4:junit4]   2> 17524 T65 oascc.ZkStateReader.updateClusterState Updating cloud state from ZooKeeper... 
[junit4:junit4]   2> 17525 T65 oasc.Overseer$ClusterStateUpdater.updateState Update state numShards=2 message={
[junit4:junit4]   2> 	  "operation":"state",
[junit4:junit4]   2> 	  "numShards":"2",
[junit4:junit4]   2> 	  "shard":"shard1",
[junit4:junit4]   2> 	  "roles":null,
[junit4:junit4]   2> 	  "state":"active",
[junit4:junit4]   2> 	  "core":"collection1",
[junit4:junit4]   2> 	  "collection":"collection1",
[junit4:junit4]   2> 	  "node_name":"127.0.0.1:51208_",
[junit4:junit4]   2> 	  "base_url":"http://127.0.0.1:51208"}
[junit4:junit4]   2> 17538 T70 oascc.ZkStateReader$2.process A cluster state change: WatchedEvent state:SyncConnected type:NodeDataChanged path:/clusterstate.json, has occurred - updating... (live nodes size: 5)
[junit4:junit4]   2> 17538 T98 oascc.ZkStateReader$2.process A cluster state change: WatchedEvent state:SyncConnected type:NodeDataChanged path:/clusterstate.json, has occurred - updating... (live nodes size: 5)
[junit4:junit4]   2> 17538 T64 oascc.ZkStateReader$2.process A cluster state change: WatchedEvent state:SyncConnected type:NodeDataChanged path:/clusterstate.json, has occurred - updating... (live nodes size: 5)
[junit4:junit4]   2> 17538 T113 oascc.ZkStateReader$2.process A cluster state change: WatchedEvent state:SyncConnected type:NodeDataChanged path:/clusterstate.json, has occurred - updating... (live nodes size: 5)
[junit4:junit4]   2> 17538 T130 oascc.ZkStateReader$2.process A cluster state change: WatchedEvent state:SyncConnected type:NodeDataChanged path:/clusterstate.json, has occurred - updating... (live nodes size: 5)
[junit4:junit4]   2> 17538 T83 oascc.ZkStateReader$2.process A cluster state change: WatchedEvent state:SyncConnected type:NodeDataChanged path:/clusterstate.json, has occurred - updating... (live nodes size: 5)
[junit4:junit4]   2>  C5_STATE=coll:collection1 core:collection1 props:{shard=shard2, roles=null, state=recovering, core=collection1, collection=collection1, node_name=127.0.0.1:52622_, base_url=http://127.0.0.1:52622}
[junit4:junit4]   2> 18414 T133 C5 P52622 oasc.RecoveryStrategy.doRecovery Begin buffering updates. core=collection1
[junit4:junit4]   2> 18414 T133 C5 P52622 oasu.UpdateLog.bufferUpdates Starting to buffer updates. FSUpdateLog{state=ACTIVE, tlog=null}
[junit4:junit4]   2> 18415 T133 C5 P52622 oasc.RecoveryStrategy.replicate Attempting to replicate from http://127.0.0.1:17574/collection1/. core=collection1
[junit4:junit4]   2> 18415 T133 C5 P52622 oascsi.HttpClientUtil.createClient Creating new http client, config:maxConnections=128&maxConnectionsPerHost=32&followRedirects=false
[junit4:junit4]   2> 18425 T41 oascc.ZkStateReader.updateClusterState Updating cloud state from ZooKeeper... 
[junit4:junit4]   2> 18435 T90 C6 P17574 oasu.DirectUpdateHandler2.commit start commit{flags=0,_version_=0,optimize=false,openSearcher=false,waitSearcher=true,expungeDeletes=false,softCommit=false}
[junit4:junit4]   2> 18436 T90 C6 P17574 oasc.CachingDirectoryFactory.close Releasing directory:/usr/home/hudson/hudson-slave/workspace/Lucene-Solr-Tests-4.x-java7/solr/build/solr-core/test/J0/./org.apache.solr.cloud.BasicDistributedZkTest-1355907916225/jetty2
[junit4:junit4]   2

[...truncated too long message...]

ead-1, state=WAITING, group=TGRP-BasicDistributedZkTest]
[junit4:junit4]   2> 	        at sun.misc.Unsafe.park(Native Method)
[junit4:junit4]   2> 	        at java.util.concurrent.locks.LockSupport.park(LockSupport.java:186)
[junit4:junit4]   2> 	        at java.util.concurrent.locks.AbstractQueuedSynchronizer$ConditionObject.await(AbstractQueuedSynchronizer.java:2043)
[junit4:junit4]   2> 	        at java.util.concurrent.LinkedBlockingQueue.take(LinkedBlockingQueue.java:442)
[junit4:junit4]   2> 	        at java.util.concurrent.ThreadPoolExecutor.getTask(ThreadPoolExecutor.java:1043)
[junit4:junit4]   2> 	        at java.util.concurrent.ThreadPoolExecutor.runWorker(ThreadPoolExecutor.java:1103)
[junit4:junit4]   2> 	        at java.util.concurrent.ThreadPoolExecutor$Worker.run(ThreadPoolExecutor.java:603)
[junit4:junit4]   2> 	        at java.lang.Thread.run(Thread.java:722)
[junit4:junit4]   2> 	  24) Thread[id=490, name=searcherExecutor-214-thread-1, state=WAITING, group=TGRP-BasicDistributedZkTest]
[junit4:junit4]   2> 	        at sun.misc.Unsafe.park(Native Method)
[junit4:junit4]   2> 	        at java.util.concurrent.locks.LockSupport.park(LockSupport.java:186)
[junit4:junit4]   2> 	        at java.util.concurrent.locks.AbstractQueuedSynchronizer$ConditionObject.await(AbstractQueuedSynchronizer.java:2043)
[junit4:junit4]   2> 	        at java.util.concurrent.LinkedBlockingQueue.take(LinkedBlockingQueue.java:442)
[junit4:junit4]   2> 	        at java.util.concurrent.ThreadPoolExecutor.getTask(ThreadPoolExecutor.java:1043)
[junit4:junit4]   2> 	        at java.util.concurrent.ThreadPoolExecutor.runWorker(ThreadPoolExecutor.java:1103)
[junit4:junit4]   2> 	        at java.util.concurrent.ThreadPoolExecutor$Worker.run(ThreadPoolExecutor.java:603)
[junit4:junit4]   2> 	        at java.lang.Thread.run(Thread.java:722)
[junit4:junit4]   2> 	  25) Thread[id=531, name=RecoveryThread, state=RUNNABLE, group=TGRP-BasicDistributedZkTest]
[junit4:junit4]   2> 	        at java.net.SocketInputStream.socketRead0(Native Method)
[junit4:junit4]   2> 	        at java.net.SocketInputStream.read(SocketInputStream.java:150)
[junit4:junit4]   2> 	        at java.net.SocketInputStream.read(SocketInputStream.java:121)
[junit4:junit4]   2> 	        at org.apache.http.impl.io.AbstractSessionInputBuffer.fillBuffer(AbstractSessionInputBuffer.java:149)
[junit4:junit4]   2> 	        at org.apache.http.impl.io.SocketInputBuffer.fillBuffer(SocketInputBuffer.java:111)
[junit4:junit4]   2> 	        at org.apache.http.impl.io.SocketInputBuffer.isDataAvailable(SocketInputBuffer.java:122)
[junit4:junit4]   2> 	        at org.apache.http.impl.AbstractHttpClientConnection.isStale(AbstractHttpClientConnection.java:311)
[junit4:junit4]   2> 	        at org.apache.http.impl.conn.AbstractClientConnAdapter.isStale(AbstractClientConnAdapter.java:170)
[junit4:junit4]   2> 	        at org.apache.http.impl.client.DefaultRequestDirector.execute(DefaultRequestDirector.java:412)
[junit4:junit4]   2> 	        at org.apache.http.impl.client.AbstractHttpClient.execute(AbstractHttpClient.java:820)
[junit4:junit4]   2> 	        at org.apache.http.impl.client.AbstractHttpClient.execute(AbstractHttpClient.java:754)
[junit4:junit4]   2> 	        at org.apache.http.impl.client.AbstractHttpClient.execute(AbstractHttpClient.java:732)
[junit4:junit4]   2> 	        at org.apache.solr.client.solrj.impl.HttpSolrServer.request(HttpSolrServer.java:352)
[junit4:junit4]   2> 	        at org.apache.solr.client.solrj.impl.HttpSolrServer.request(HttpSolrServer.java:181)
[junit4:junit4]   2> 	        at org.apache.solr.handler.SnapPuller.fetchFileList(SnapPuller.java:267)
[junit4:junit4]   2> 	        at org.apache.solr.handler.SnapPuller.fetchLatestIndex(SnapPuller.java:360)
[junit4:junit4]   2> 	        at org.apache.solr.handler.ReplicationHandler.doFetch(ReplicationHandler.java:273)
[junit4:junit4]   2> 	        at org.apache.solr.cloud.RecoveryStrategy.replicate(RecoveryStrategy.java:153)
[junit4:junit4]   2> 	        at org.apache.solr.cloud.RecoveryStrategy.doRecovery(RecoveryStrategy.java:408)
[junit4:junit4]   2> 	        at org.apache.solr.cloud.RecoveryStrategy.run(RecoveryStrategy.java:223)
[junit4:junit4]   2> 	  26) Thread[id=97, name=TEST-BasicDistributedZkTest.testDistribSearch-seed#[E9A79181CFF72639]-SendThread(localhost:32779), state=RUNNABLE, group=TGRP-BasicDistributedZkTest]
[junit4:junit4]   2> 	        at sun.nio.ch.SelectorImpl.lockAndDoSelect(SelectorImpl.java:82)
[junit4:junit4]   2> 	        at sun.nio.ch.SelectorImpl.select(SelectorImpl.java:98)
[junit4:junit4]   2> 	        at org.apache.zookeeper.ClientCnxnSocketNIO.doTransport(ClientCnxnSocketNIO.java:338)
[junit4:junit4]   2> 	        at org.apache.zookeeper.ClientCnxn$SendThread.run(ClientCnxn.java:1068)
[junit4:junit4]   2> 	  27) Thread[id=87, name=qtp1567445796-87 Acceptor0 SocketConnector@127.0.0.1:17574, state=RUNNABLE, group=TGRP-BasicDistributedZkTest]
[junit4:junit4]   2> 	        at java.net.PlainSocketImpl.socketAccept(Native Method)
[junit4:junit4]   2> 	        at java.net.AbstractPlainSocketImpl.accept(AbstractPlainSocketImpl.java:398)
[junit4:junit4]   2> 	        at java.net.ServerSocket.implAccept(ServerSocket.java:522)
[junit4:junit4]   2> 	        at java.net.ServerSocket.accept(ServerSocket.java:490)
[junit4:junit4]   2> 	        at org.eclipse.jetty.server.bio.SocketConnector.accept(SocketConnector.java:117)
[junit4:junit4]   2> 	        at org.eclipse.jetty.server.AbstractConnector$Acceptor.run(AbstractConnector.java:938)
[junit4:junit4]   2> 	        at org.eclipse.jetty.util.thread.QueuedThreadPool.runJob(QueuedThreadPool.java:608)
[junit4:junit4]   2> 	        at org.eclipse.jetty.util.thread.QueuedThreadPool$3.run(QueuedThreadPool.java:543)
[junit4:junit4]   2> 	        at java.lang.Thread.run(Thread.java:722)
[junit4:junit4]   2> NOTE: test params are: codec=Lucene41: {n_f1=PostingsFormat(name=SimpleText), foo_b=MockFixedIntBlock(blockSize=905), cat=PostingsFormat(name=Lucene41WithOrds), foo_d=PostingsFormat(name=TestBloomFilteredLucene41Postings), foo_f=MockFixedIntBlock(blockSize=905), n_tl1=PostingsFormat(name=SimpleText), n_d1=PostingsFormat(name=Lucene41WithOrds), rnd_b=PostingsFormat(name=TestBloomFilteredLucene41Postings), intDefault=PostingsFormat(name=Lucene41WithOrds), n_td1=PostingsFormat(name=SimpleText), timestamp=PostingsFormat(name=Lucene41WithOrds), id=PostingsFormat(name=TestBloomFilteredLucene41Postings), range_facet_sl=MockFixedIntBlock(blockSize=905), range_facet_si=PostingsFormat(name=SimpleText), oddField_s=MockFixedIntBlock(blockSize=905), sequence_i=MockFixedIntBlock(blockSize=905), name=PostingsFormat(name=TestBloomFilteredLucene41Postings), foo_i=PostingsFormat(name=SimpleText), regex_dup_B_s=PostingsFormat(name=Lucene41WithOrds), multiDefault=PostingsFormat(name=SimpleText), n_tf1=PostingsFormat(name=Lucene41WithOrds), n_dt1=PostingsFormat(name=SimpleText), genre_s=MockFixedIntBlock(blockSize=905), author_t=PostingsFormat(name=SimpleText), n_ti1=PostingsFormat(name=TestBloomFilteredLucene41Postings), range_facet_l=PostingsFormat(name=Lucene41WithOrds), text=MockFixedIntBlock(blockSize=905), _version_=PostingsFormat(name=Lucene41WithOrds), val_i=PostingsFormat(name=TestBloomFilteredLucene41Postings), SubjectTerms_mfacet=PostingsFormat(name=Lucene41WithOrds), series_t=PostingsFormat(name=SimpleText), a_t=PostingsFormat(name=Lucene41WithOrds), n_tdt1=PostingsFormat(name=Lucene41WithOrds), regex_dup_A_s=MockFixedIntBlock(blockSize=905), price=MockFixedIntBlock(blockSize=905), other_tl1=PostingsFormat(name=Lucene41WithOrds), n_l1=PostingsFormat(name=Lucene41WithOrds), a_si=PostingsFormat(name=SimpleText), inStock=MockFixedIntBlock(blockSize=905)}, sim=RandomSimilarityProvider(queryNorm=false,coord=no): {}, locale=sk, timezone=MET
[junit4:junit4]   2> NOTE: FreeBSD 9.0-RELEASE amd64/Oracle Corporation 1.7.0_09 (64-bit)/cpus=16,threads=28,free=177481720,total=406847488
[junit4:junit4]   2> NOTE: All tests run in this JVM: [PathHierarchyTokenizerFactoryTest, DefaultValueUpdateProcessorTest, DateMathParserTest, DirectSolrConnectionTest, TestSearchPerf, TestFastLRUCache, JSONWriterTest, SolrPluginUtilsTest, TestQuerySenderNoQuery, PluginInfoTest, BasicDistributedZkTest]
[junit4:junit4]   2> NOTE: reproduce with: ant test  -Dtestcase=BasicDistributedZkTest -Dtests.seed=E9A79181CFF72639 -Dtests.multiplier=3 -Dtests.slow=true -Dtests.locale=sk -Dtests.timezone=MET -Dtests.file.encoding=UTF-8
[junit4:junit4] ERROR   0.00s J0 | BasicDistributedZkTest (suite) <<<
[junit4:junit4]    > Throwable #1: java.lang.Exception: Suite timeout exceeded (>= 7200000 msec).
[junit4:junit4]    > 	at __randomizedtesting.SeedInfo.seed([E9A79181CFF72639]:0)
[junit4:junit4] Completed on J0 in 7223.80s, 1 test, 2 errors <<< FAILURES!

[...truncated 158 lines...]
BUILD FAILED
/usr/home/hudson/hudson-slave/workspace/Lucene-Solr-Tests-4.x-java7/build.xml:353: The following error occurred while executing this line:
/usr/home/hudson/hudson-slave/workspace/Lucene-Solr-Tests-4.x-java7/build.xml:39: The following error occurred while executing this line:
/usr/home/hudson/hudson-slave/workspace/Lucene-Solr-Tests-4.x-java7/solr/build.xml:178: The following error occurred while executing this line:
/usr/home/hudson/hudson-slave/workspace/Lucene-Solr-Tests-4.x-java7/solr/common-build.xml:438: The following error occurred while executing this line:
/usr/home/hudson/hudson-slave/workspace/Lucene-Solr-Tests-4.x-java7/lucene/common-build.xml:1175: The following error occurred while executing this line:
/usr/home/hudson/hudson-slave/workspace/Lucene-Solr-Tests-4.x-java7/lucene/common-build.xml:840: There were test failures: 244 suites, 1011 tests, 1 suite-level error, 1 error, 201 ignored (1 assumption)

Total time: 139 minutes 40 seconds
Build step 'Invoke Ant' marked build as failure
Archiving artifacts
Recording test results
Email was triggered for: Failure
Sending email for trigger: Failure



Mime
View raw message