lucene-dev mailing list archives

Site index · List index
Message view « Date » · « Thread »
Top « Date » · « Thread »
From Apache Jenkins Server <jenk...@builds.apache.org>
Subject [JENKINS] Lucene-Solr-Tests-4.x-Java6 - Build # 1136 - Failure
Date Tue, 18 Dec 2012 16:56:01 GMT
Build: https://builds.apache.org/job/Lucene-Solr-Tests-4.x-Java6/1136/

1 tests failed.
REGRESSION:  org.apache.solr.cloud.SyncSliceTest.testDistribSearch

Error Message:


Stack Trace:
java.lang.AssertionError
	at __randomizedtesting.SeedInfo.seed([DF801F368D6DCA8C:5E66912EFA32AAB0]:0)
	at org.junit.Assert.fail(Assert.java:92)
	at org.junit.Assert.assertTrue(Assert.java:43)
	at org.junit.Assert.assertNotNull(Assert.java:526)
	at org.junit.Assert.assertNotNull(Assert.java:537)
	at org.apache.solr.cloud.SyncSliceTest.doTest(SyncSliceTest.java:211)
	at org.apache.solr.BaseDistributedSearchTestCase.testDistribSearch(BaseDistributedSearchTestCase.java:794)
	at sun.reflect.NativeMethodAccessorImpl.invoke0(Native Method)
	at sun.reflect.NativeMethodAccessorImpl.invoke(NativeMethodAccessorImpl.java:57)
	at sun.reflect.DelegatingMethodAccessorImpl.invoke(DelegatingMethodAccessorImpl.java:43)
	at java.lang.reflect.Method.invoke(Method.java:616)
	at com.carrotsearch.randomizedtesting.RandomizedRunner.invoke(RandomizedRunner.java:1559)
	at com.carrotsearch.randomizedtesting.RandomizedRunner.access$600(RandomizedRunner.java:79)
	at com.carrotsearch.randomizedtesting.RandomizedRunner$6.evaluate(RandomizedRunner.java:737)
	at com.carrotsearch.randomizedtesting.RandomizedRunner$7.evaluate(RandomizedRunner.java:773)
	at com.carrotsearch.randomizedtesting.RandomizedRunner$8.evaluate(RandomizedRunner.java:787)
	at com.carrotsearch.randomizedtesting.rules.SystemPropertiesRestoreRule$1.evaluate(SystemPropertiesRestoreRule.java:53)
	at org.apache.lucene.util.TestRuleSetupTeardownChained$1.evaluate(TestRuleSetupTeardownChained.java:50)
	at org.apache.lucene.util.TestRuleFieldCacheSanity$1.evaluate(TestRuleFieldCacheSanity.java:51)
	at org.apache.lucene.util.AbstractBeforeAfterRule$1.evaluate(AbstractBeforeAfterRule.java:46)
	at com.carrotsearch.randomizedtesting.rules.SystemPropertiesInvariantRule$1.evaluate(SystemPropertiesInvariantRule.java:55)
	at org.apache.lucene.util.TestRuleThreadAndTestName$1.evaluate(TestRuleThreadAndTestName.java:49)
	at org.apache.lucene.util.TestRuleIgnoreAfterMaxFailures$1.evaluate(TestRuleIgnoreAfterMaxFailures.java:70)
	at org.apache.lucene.util.TestRuleMarkFailure$1.evaluate(TestRuleMarkFailure.java:48)
	at com.carrotsearch.randomizedtesting.rules.StatementAdapter.evaluate(StatementAdapter.java:36)
	at com.carrotsearch.randomizedtesting.ThreadLeakControl$StatementRunner.run(ThreadLeakControl.java:358)
	at com.carrotsearch.randomizedtesting.ThreadLeakControl.forkTimeoutingTask(ThreadLeakControl.java:782)
	at com.carrotsearch.randomizedtesting.ThreadLeakControl$3.evaluate(ThreadLeakControl.java:442)
	at com.carrotsearch.randomizedtesting.RandomizedRunner.runSingleTest(RandomizedRunner.java:746)
	at com.carrotsearch.randomizedtesting.RandomizedRunner$3.evaluate(RandomizedRunner.java:648)
	at com.carrotsearch.randomizedtesting.RandomizedRunner$4.evaluate(RandomizedRunner.java:682)
	at com.carrotsearch.randomizedtesting.RandomizedRunner$5.evaluate(RandomizedRunner.java:693)
	at com.carrotsearch.randomizedtesting.rules.StatementAdapter.evaluate(StatementAdapter.java:36)
	at com.carrotsearch.randomizedtesting.rules.SystemPropertiesRestoreRule$1.evaluate(SystemPropertiesRestoreRule.java:53)
	at org.apache.lucene.util.AbstractBeforeAfterRule$1.evaluate(AbstractBeforeAfterRule.java:46)
	at org.apache.lucene.util.TestRuleStoreClassName$1.evaluate(TestRuleStoreClassName.java:42)
	at com.carrotsearch.randomizedtesting.rules.SystemPropertiesInvariantRule$1.evaluate(SystemPropertiesInvariantRule.java:55)
	at com.carrotsearch.randomizedtesting.rules.NoShadowingOrOverridesOnMethodsRule$1.evaluate(NoShadowingOrOverridesOnMethodsRule.java:39)
	at com.carrotsearch.randomizedtesting.rules.NoShadowingOrOverridesOnMethodsRule$1.evaluate(NoShadowingOrOverridesOnMethodsRule.java:39)
	at com.carrotsearch.randomizedtesting.rules.StatementAdapter.evaluate(StatementAdapter.java:36)
	at org.apache.lucene.util.TestRuleAssertionsRequired$1.evaluate(TestRuleAssertionsRequired.java:43)
	at org.apache.lucene.util.TestRuleMarkFailure$1.evaluate(TestRuleMarkFailure.java:48)
	at org.apache.lucene.util.TestRuleIgnoreAfterMaxFailures$1.evaluate(TestRuleIgnoreAfterMaxFailures.java:70)
	at org.apache.lucene.util.TestRuleIgnoreTestSuites$1.evaluate(TestRuleIgnoreTestSuites.java:55)
	at com.carrotsearch.randomizedtesting.rules.StatementAdapter.evaluate(StatementAdapter.java:36)
	at com.carrotsearch.randomizedtesting.ThreadLeakControl$StatementRunner.run(ThreadLeakControl.java:358)
	at java.lang.Thread.run(Thread.java:679)




Build Log:
[...truncated 8701 lines...]
[junit4:junit4] Suite: org.apache.solr.cloud.SyncSliceTest
[junit4:junit4]   2> 0 T3011 oas.BaseDistributedSearchTestCase.initHostContext Setting hostContext system property: /vy/
[junit4:junit4]   2> 5 T3011 oas.SolrTestCaseJ4.setUp ###Starting testDistribSearch
[junit4:junit4]   2> Creating dataDir: /usr/home/hudson/hudson-slave/workspace/Lucene-Solr-Tests-4.x-Java6/solr/build/solr-core/test/J1/./solrtest-SyncSliceTest-1355849590345
[junit4:junit4]   2> 7 T3011 oasc.ZkTestServer.run STARTING ZK TEST SERVER
[junit4:junit4]   2> 7 T3012 oasc.ZkTestServer$ZKServerMain.runFromConfig Starting server
[junit4:junit4]   2> 11 T3012 oazs.ZooKeeperServer.setTickTime tickTime set to 1000
[junit4:junit4]   2> 11 T3012 oazs.ZooKeeperServer.setMinSessionTimeout minSessionTimeout set to -1
[junit4:junit4]   2> 11 T3012 oazs.ZooKeeperServer.setMaxSessionTimeout maxSessionTimeout set to -1
[junit4:junit4]   2> 12 T3012 oazs.NIOServerCnxnFactory.configure binding to port 0.0.0.0/0.0.0.0:0
[junit4:junit4]   2> 13 T3012 oazsp.FileTxnSnapLog.save Snapshotting: 0x0 to /usr/home/hudson/hudson-slave/workspace/Lucene-Solr-Tests-4.x-Java6/solr/build/solr-core/test/J1/./org.apache.solr.cloud.SyncSliceTest-1355849590345/zookeeper/server1/data/version-2/snapshot.0
[junit4:junit4]   2> 108 T3011 oasc.ZkTestServer.run start zk server on port:24624
[junit4:junit4]   2> 108 T3011 oaz.ZooKeeper.<init> Initiating client connection, connectString=127.0.0.1:24624 sessionTimeout=10000 watcher=org.apache.solr.common.cloud.ConnectionManager@63ee589b
[junit4:junit4]   2> 109 T3011 oascc.ConnectionManager.waitForConnected Waiting for client to connect to ZooKeeper
[junit4:junit4]   2> 110 T3017 oaz.ClientCnxn$SendThread.logStartConnect Opening socket connection to server localhost/127.0.0.1:24624. Will not attempt to authenticate using SASL (access denied (javax.security.auth.AuthPermission getLoginConfiguration))
[junit4:junit4]   2> 110 T3017 oaz.ClientCnxn$SendThread.primeConnection Socket connection established to localhost/127.0.0.1:24624, initiating session
[junit4:junit4]   2> 111 T3013 oazs.NIOServerCnxnFactory.run Accepted socket connection from /140.211.11.196:55174
[junit4:junit4]   2> 111 T3013 oazs.ZooKeeperServer.processConnectRequest Client attempting to establish new session at /140.211.11.196:55174
[junit4:junit4]   2> 111 T3015 oazsp.FileTxnLog.append Creating new log file: log.1
[junit4:junit4]   2> 117 T3015 oazs.ZooKeeperServer.finishSessionInit Established session 0x13baeeee6510000 with negotiated timeout 10000 for client /140.211.11.196:55174
[junit4:junit4]   2> 117 T3017 oaz.ClientCnxn$SendThread.onConnected Session establishment complete on server localhost/127.0.0.1:24624, sessionid = 0x13baeeee6510000, negotiated timeout = 10000
[junit4:junit4]   2> 117 T3018 oascc.ConnectionManager.process Watcher org.apache.solr.common.cloud.ConnectionManager@63ee589b name:ZooKeeperConnection Watcher:127.0.0.1:24624 got event WatchedEvent state:SyncConnected type:None path:null path:null type:None
[junit4:junit4]   2> 118 T3011 oascc.ConnectionManager.waitForConnected Client is connected to ZooKeeper
[junit4:junit4]   2> 118 T3011 oascc.SolrZkClient.makePath makePath: /solr
[junit4:junit4]   2> 130 T3016 oazs.PrepRequestProcessor.pRequest2Txn Processed session termination for sessionid: 0x13baeeee6510000
[junit4:junit4]   2> 131 T3018 oaz.ClientCnxn$EventThread.run EventThread shut down
[junit4:junit4]   2> 132 T3013 oazs.NIOServerCnxn.closeSock Closed socket connection for client /140.211.11.196:55174 which had sessionid 0x13baeeee6510000
[junit4:junit4]   2> 131 T3011 oaz.ZooKeeper.close Session: 0x13baeeee6510000 closed
[junit4:junit4]   2> 133 T3011 oaz.ZooKeeper.<init> Initiating client connection, connectString=127.0.0.1:24624/solr sessionTimeout=10000 watcher=org.apache.solr.common.cloud.ConnectionManager@6f0f415f
[junit4:junit4]   2> 134 T3011 oascc.ConnectionManager.waitForConnected Waiting for client to connect to ZooKeeper
[junit4:junit4]   2> 134 T3019 oaz.ClientCnxn$SendThread.logStartConnect Opening socket connection to server localhost/127.0.0.1:24624. Will not attempt to authenticate using SASL (access denied (javax.security.auth.AuthPermission getLoginConfiguration))
[junit4:junit4]   2> 135 T3019 oaz.ClientCnxn$SendThread.primeConnection Socket connection established to localhost/127.0.0.1:24624, initiating session
[junit4:junit4]   2> 135 T3013 oazs.NIOServerCnxnFactory.run Accepted socket connection from /140.211.11.196:62983
[junit4:junit4]   2> 135 T3013 oazs.ZooKeeperServer.processConnectRequest Client attempting to establish new session at /140.211.11.196:62983
[junit4:junit4]   2> 136 T3015 oazs.ZooKeeperServer.finishSessionInit Established session 0x13baeeee6510001 with negotiated timeout 10000 for client /140.211.11.196:62983
[junit4:junit4]   2> 136 T3019 oaz.ClientCnxn$SendThread.onConnected Session establishment complete on server localhost/127.0.0.1:24624, sessionid = 0x13baeeee6510001, negotiated timeout = 10000
[junit4:junit4]   2> 137 T3020 oascc.ConnectionManager.process Watcher org.apache.solr.common.cloud.ConnectionManager@6f0f415f name:ZooKeeperConnection Watcher:127.0.0.1:24624/solr got event WatchedEvent state:SyncConnected type:None path:null path:null type:None
[junit4:junit4]   2> 137 T3011 oascc.ConnectionManager.waitForConnected Client is connected to ZooKeeper
[junit4:junit4]   2> 138 T3011 oascc.SolrZkClient.makePath makePath: /collections/collection1
[junit4:junit4]   2> 141 T3011 oascc.SolrZkClient.makePath makePath: /collections/collection1/shards
[junit4:junit4]   2> 144 T3011 oascc.SolrZkClient.makePath makePath: /collections/control_collection
[junit4:junit4]   2> 152 T3011 oascc.SolrZkClient.makePath makePath: /collections/control_collection/shards
[junit4:junit4]   2> 155 T3011 oasc.AbstractZkTestCase.putConfig put /usr/home/hudson/hudson-slave/workspace/Lucene-Solr-Tests-4.x-Java6/solr/build/solr-core/test-files/solr/collection1/conf/solrconfig.xml to /configs/conf1/solrconfig.xml
[junit4:junit4]   2> 156 T3011 oascc.SolrZkClient.makePath makePath: /configs/conf1/solrconfig.xml
[junit4:junit4]   2> 161 T3011 oasc.AbstractZkTestCase.putConfig put /usr/home/hudson/hudson-slave/workspace/Lucene-Solr-Tests-4.x-Java6/solr/build/solr-core/test-files/solr/collection1/conf/schema.xml to /configs/conf1/schema.xml
[junit4:junit4]   2> 163 T3011 oascc.SolrZkClient.makePath makePath: /configs/conf1/schema.xml
[junit4:junit4]   2> 266 T3011 oasc.AbstractZkTestCase.putConfig put /usr/home/hudson/hudson-slave/workspace/Lucene-Solr-Tests-4.x-Java6/solr/build/solr-core/test-files/solr/collection1/conf/stopwords.txt to /configs/conf1/stopwords.txt
[junit4:junit4]   2> 267 T3011 oascc.SolrZkClient.makePath makePath: /configs/conf1/stopwords.txt
[junit4:junit4]   2> 270 T3011 oasc.AbstractZkTestCase.putConfig put /usr/home/hudson/hudson-slave/workspace/Lucene-Solr-Tests-4.x-Java6/solr/build/solr-core/test-files/solr/collection1/conf/protwords.txt to /configs/conf1/protwords.txt
[junit4:junit4]   2> 271 T3011 oascc.SolrZkClient.makePath makePath: /configs/conf1/protwords.txt
[junit4:junit4]   2> 273 T3011 oasc.AbstractZkTestCase.putConfig put /usr/home/hudson/hudson-slave/workspace/Lucene-Solr-Tests-4.x-Java6/solr/build/solr-core/test-files/solr/collection1/conf/currency.xml to /configs/conf1/currency.xml
[junit4:junit4]   2> 274 T3011 oascc.SolrZkClient.makePath makePath: /configs/conf1/currency.xml
[junit4:junit4]   2> 277 T3011 oasc.AbstractZkTestCase.putConfig put /usr/home/hudson/hudson-slave/workspace/Lucene-Solr-Tests-4.x-Java6/solr/build/solr-core/test-files/solr/collection1/conf/open-exchange-rates.json to /configs/conf1/open-exchange-rates.json
[junit4:junit4]   2> 278 T3011 oascc.SolrZkClient.makePath makePath: /configs/conf1/open-exchange-rates.json
[junit4:junit4]   2> 286 T3011 oasc.AbstractZkTestCase.putConfig put /usr/home/hudson/hudson-slave/workspace/Lucene-Solr-Tests-4.x-Java6/solr/build/solr-core/test-files/solr/collection1/conf/mapping-ISOLatin1Accent.txt to /configs/conf1/mapping-ISOLatin1Accent.txt
[junit4:junit4]   2> 287 T3011 oascc.SolrZkClient.makePath makePath: /configs/conf1/mapping-ISOLatin1Accent.txt
[junit4:junit4]   2> 289 T3011 oasc.AbstractZkTestCase.putConfig put /usr/home/hudson/hudson-slave/workspace/Lucene-Solr-Tests-4.x-Java6/solr/build/solr-core/test-files/solr/collection1/conf/old_synonyms.txt to /configs/conf1/old_synonyms.txt
[junit4:junit4]   2> 290 T3011 oascc.SolrZkClient.makePath makePath: /configs/conf1/old_synonyms.txt
[junit4:junit4]   2> 293 T3011 oasc.AbstractZkTestCase.putConfig put /usr/home/hudson/hudson-slave/workspace/Lucene-Solr-Tests-4.x-Java6/solr/build/solr-core/test-files/solr/collection1/conf/synonyms.txt to /configs/conf1/synonyms.txt
[junit4:junit4]   2> 294 T3011 oascc.SolrZkClient.makePath makePath: /configs/conf1/synonyms.txt
[junit4:junit4]   2> 297 T3016 oazs.PrepRequestProcessor.pRequest2Txn Processed session termination for sessionid: 0x13baeeee6510001
[junit4:junit4]   2> 304 T3020 oaz.ClientCnxn$EventThread.run EventThread shut down
[junit4:junit4]   2> 304 T3013 oazs.NIOServerCnxn.closeSock Closed socket connection for client /140.211.11.196:62983 which had sessionid 0x13baeeee6510001
[junit4:junit4]   2> 304 T3011 oaz.ZooKeeper.close Session: 0x13baeeee6510001 closed
[junit4:junit4]   2> 473 T3011 oejs.Server.doStart jetty-8.1.8.v20121106
[junit4:junit4]   2> 476 T3011 oejs.AbstractConnector.doStart Started SocketConnector@127.0.0.1:28150
[junit4:junit4]   2> 477 T3011 oasc.SolrResourceLoader.locateSolrHome JNDI not configured for solr (NoInitialContextEx)
[junit4:junit4]   2> 478 T3011 oasc.SolrResourceLoader.locateSolrHome using system property solr.solr.home: /usr/home/hudson/hudson-slave/workspace/Lucene-Solr-Tests-4.x-Java6/solr/build/solr-core/test/J1/./org.apache.solr.cloud.SyncSliceTest-controljetty-1355849590644
[junit4:junit4]   2> 478 T3011 oasc.SolrResourceLoader.<init> new SolrResourceLoader for deduced Solr Home: '/usr/home/hudson/hudson-slave/workspace/Lucene-Solr-Tests-4.x-Java6/solr/build/solr-core/test/J1/./org.apache.solr.cloud.SyncSliceTest-controljetty-1355849590644/'
[junit4:junit4]   2> 519 T3011 oass.SolrDispatchFilter.init SolrDispatchFilter.init()
[junit4:junit4]   2> 520 T3011 oasc.SolrResourceLoader.locateSolrHome JNDI not configured for solr (NoInitialContextEx)
[junit4:junit4]   2> 521 T3011 oasc.SolrResourceLoader.locateSolrHome using system property solr.solr.home: /usr/home/hudson/hudson-slave/workspace/Lucene-Solr-Tests-4.x-Java6/solr/build/solr-core/test/J1/./org.apache.solr.cloud.SyncSliceTest-controljetty-1355849590644
[junit4:junit4]   2> 521 T3011 oasc.CoreContainer$Initializer.initialize looking for solr.xml: /usr/home/hudson/hudson-slave/workspace/Lucene-Solr-Tests-4.x-Java6/solr/build/solr-core/test/J1/./org.apache.solr.cloud.SyncSliceTest-controljetty-1355849590644/solr.xml
[junit4:junit4]   2> 522 T3011 oasc.CoreContainer.<init> New CoreContainer 1411547162
[junit4:junit4]   2> 523 T3011 oasc.CoreContainer.load Loading CoreContainer using Solr Home: '/usr/home/hudson/hudson-slave/workspace/Lucene-Solr-Tests-4.x-Java6/solr/build/solr-core/test/J1/./org.apache.solr.cloud.SyncSliceTest-controljetty-1355849590644/'
[junit4:junit4]   2> 523 T3011 oasc.SolrResourceLoader.<init> new SolrResourceLoader for directory: '/usr/home/hudson/hudson-slave/workspace/Lucene-Solr-Tests-4.x-Java6/solr/build/solr-core/test/J1/./org.apache.solr.cloud.SyncSliceTest-controljetty-1355849590644/'
[junit4:junit4]   2> 549 T3011 oashc.HttpShardHandlerFactory.getParameter Setting socketTimeout to: 30000
[junit4:junit4]   2> 550 T3011 oashc.HttpShardHandlerFactory.getParameter Setting urlScheme to: http://
[junit4:junit4]   2> 551 T3011 oashc.HttpShardHandlerFactory.getParameter Setting connTimeout to: 15000
[junit4:junit4]   2> 551 T3011 oashc.HttpShardHandlerFactory.getParameter Setting maxConnectionsPerHost to: 20
[junit4:junit4]   2> 552 T3011 oashc.HttpShardHandlerFactory.getParameter Setting corePoolSize to: 0
[junit4:junit4]   2> 552 T3011 oashc.HttpShardHandlerFactory.getParameter Setting maximumPoolSize to: 2147483647
[junit4:junit4]   2> 553 T3011 oashc.HttpShardHandlerFactory.getParameter Setting maxThreadIdleTime to: 5
[junit4:junit4]   2> 554 T3011 oashc.HttpShardHandlerFactory.getParameter Setting sizeOfQueue to: -1
[junit4:junit4]   2> 554 T3011 oashc.HttpShardHandlerFactory.getParameter Setting fairnessPolicy to: false
[junit4:junit4]   2> 555 T3011 oascsi.HttpClientUtil.createClient Creating new http client, config:maxConnectionsPerHost=20&maxConnections=10000&socketTimeout=30000&connTimeout=15000&retry=false
[junit4:junit4]   2> 577 T3011 oasc.CoreContainer.load Registering Log Listener
[junit4:junit4]   2> 598 T3011 oasc.CoreContainer.initZooKeeper Zookeeper client=127.0.0.1:24624/solr
[junit4:junit4]   2> 599 T3011 oasc.ZkController.checkChrootPath zkHost includes chroot
[junit4:junit4]   2> 599 T3011 oaz.ZooKeeper.<init> Initiating client connection, connectString=127.0.0.1:24624 sessionTimeout=60000 watcher=org.apache.solr.common.cloud.ConnectionManager@464d9ce9
[junit4:junit4]   2> 601 T3011 oascc.ConnectionManager.waitForConnected Waiting for client to connect to ZooKeeper
[junit4:junit4]   2> 601 T3030 oaz.ClientCnxn$SendThread.logStartConnect Opening socket connection to server localhost/127.0.0.1:24624. Will not attempt to authenticate using SASL (access denied (javax.security.auth.AuthPermission getLoginConfiguration))
[junit4:junit4]   2> 602 T3030 oaz.ClientCnxn$SendThread.primeConnection Socket connection established to localhost/127.0.0.1:24624, initiating session
[junit4:junit4]   2> 602 T3013 oazs.NIOServerCnxnFactory.run Accepted socket connection from /140.211.11.196:14740
[junit4:junit4]   2> 602 T3013 oazs.ZooKeeperServer.processConnectRequest Client attempting to establish new session at /140.211.11.196:14740
[junit4:junit4]   2> 604 T3015 oazs.ZooKeeperServer.finishSessionInit Established session 0x13baeeee6510002 with negotiated timeout 20000 for client /140.211.11.196:14740
[junit4:junit4]   2> 604 T3030 oaz.ClientCnxn$SendThread.onConnected Session establishment complete on server localhost/127.0.0.1:24624, sessionid = 0x13baeeee6510002, negotiated timeout = 20000
[junit4:junit4]   2> 604 T3031 oascc.ConnectionManager.process Watcher org.apache.solr.common.cloud.ConnectionManager@464d9ce9 name:ZooKeeperConnection Watcher:127.0.0.1:24624 got event WatchedEvent state:SyncConnected type:None path:null path:null type:None
[junit4:junit4]   2> 604 T3011 oascc.ConnectionManager.waitForConnected Client is connected to ZooKeeper
[junit4:junit4]   2> 606 T3016 oazs.PrepRequestProcessor.pRequest2Txn Processed session termination for sessionid: 0x13baeeee6510002
[junit4:junit4]   2> 607 T3031 oaz.ClientCnxn$EventThread.run EventThread shut down
[junit4:junit4]   2> 607 T3013 oazs.NIOServerCnxn.closeSock Closed socket connection for client /140.211.11.196:14740 which had sessionid 0x13baeeee6510002
[junit4:junit4]   2> 606 T3011 oaz.ZooKeeper.close Session: 0x13baeeee6510002 closed
[junit4:junit4]   2> 607 T3011 oascsi.HttpClientUtil.createClient Creating new http client, config:maxConnections=500&maxConnectionsPerHost=16&socketTimeout=15000&connTimeout=30000
[junit4:junit4]   2> 618 T3011 oaz.ZooKeeper.<init> Initiating client connection, connectString=127.0.0.1:24624/solr sessionTimeout=30000 watcher=org.apache.solr.common.cloud.ConnectionManager@4dacd1f2
[junit4:junit4]   2> 620 T3032 oaz.ClientCnxn$SendThread.logStartConnect Opening socket connection to server localhost/127.0.0.1:24624. Will not attempt to authenticate using SASL (access denied (javax.security.auth.AuthPermission getLoginConfiguration))
[junit4:junit4]   2> 619 T3011 oascc.ConnectionManager.waitForConnected Waiting for client to connect to ZooKeeper
[junit4:junit4]   2> 620 T3032 oaz.ClientCnxn$SendThread.primeConnection Socket connection established to localhost/127.0.0.1:24624, initiating session
[junit4:junit4]   2> 620 T3013 oazs.NIOServerCnxnFactory.run Accepted socket connection from /140.211.11.196:21393
[junit4:junit4]   2> 621 T3013 oazs.ZooKeeperServer.processConnectRequest Client attempting to establish new session at /140.211.11.196:21393
[junit4:junit4]   2> 622 T3015 oazs.ZooKeeperServer.finishSessionInit Established session 0x13baeeee6510003 with negotiated timeout 20000 for client /140.211.11.196:21393
[junit4:junit4]   2> 622 T3032 oaz.ClientCnxn$SendThread.onConnected Session establishment complete on server localhost/127.0.0.1:24624, sessionid = 0x13baeeee6510003, negotiated timeout = 20000
[junit4:junit4]   2> 622 T3033 oascc.ConnectionManager.process Watcher org.apache.solr.common.cloud.ConnectionManager@4dacd1f2 name:ZooKeeperConnection Watcher:127.0.0.1:24624/solr got event WatchedEvent state:SyncConnected type:None path:null path:null type:None
[junit4:junit4]   2> 623 T3011 oascc.ConnectionManager.waitForConnected Client is connected to ZooKeeper
[junit4:junit4]   2> 624 T3016 oazs.PrepRequestProcessor.pRequest Got user-level KeeperException when processing sessionid:0x13baeeee6510003 type:create cxid:0x2 zxid:0x1a txntype:-1 reqpath:n/a Error Path:/solr/overseer Error:KeeperErrorCode = NodeExists for /solr/overseer
[junit4:junit4]   2> 633 T3011 oascc.SolrZkClient.makePath makePath: /live_nodes
[junit4:junit4]   2> 635 T3011 oasc.ZkController.createEphemeralLiveNode Register node as live in ZooKeeper:/live_nodes/127.0.0.1:28150_vy
[junit4:junit4]   2> 636 T3016 oazs.PrepRequestProcessor.pRequest Got user-level KeeperException when processing sessionid:0x13baeeee6510003 type:delete cxid:0x7 zxid:0x1c txntype:-1 reqpath:n/a Error Path:/solr/live_nodes/127.0.0.1:28150_vy Error:KeeperErrorCode = NoNode for /solr/live_nodes/127.0.0.1:28150_vy
[junit4:junit4]   2> 637 T3011 oascc.SolrZkClient.makePath makePath: /live_nodes/127.0.0.1:28150_vy
[junit4:junit4]   2> 646 T3011 oascc.SolrZkClient.makePath makePath: /overseer_elect/election
[junit4:junit4]   2> 657 T3016 oazs.PrepRequestProcessor.pRequest Got user-level KeeperException when processing sessionid:0x13baeeee6510003 type:delete cxid:0x15 zxid:0x21 txntype:-1 reqpath:n/a Error Path:/solr/overseer_elect/leader Error:KeeperErrorCode = NoNode for /solr/overseer_elect/leader
[junit4:junit4]   2> 658 T3011 oascc.SolrZkClient.makePath makePath: /overseer_elect/leader
[junit4:junit4]   2> 665 T3011 oasc.Overseer.start Overseer (id=88856958753374211-127.0.0.1:28150_vy-n_0000000000) starting
[junit4:junit4]   2> 666 T3016 oazs.PrepRequestProcessor.pRequest Got user-level KeeperException when processing sessionid:0x13baeeee6510003 type:create cxid:0x1a zxid:0x23 txntype:-1 reqpath:n/a Error Path:/solr/overseer Error:KeeperErrorCode = NodeExists for /solr/overseer
[junit4:junit4]   2> 667 T3016 oazs.PrepRequestProcessor.pRequest Got user-level KeeperException when processing sessionid:0x13baeeee6510003 type:create cxid:0x1b zxid:0x24 txntype:-1 reqpath:n/a Error Path:/solr/overseer Error:KeeperErrorCode = NodeExists for /solr/overseer
[junit4:junit4]   2> 669 T3016 oazs.PrepRequestProcessor.pRequest Got user-level KeeperException when processing sessionid:0x13baeeee6510003 type:create cxid:0x1c zxid:0x25 txntype:-1 reqpath:n/a Error Path:/solr/overseer Error:KeeperErrorCode = NodeExists for /solr/overseer
[junit4:junit4]   2> 678 T3016 oazs.PrepRequestProcessor.pRequest Got user-level KeeperException when processing sessionid:0x13baeeee6510003 type:create cxid:0x1d zxid:0x26 txntype:-1 reqpath:n/a Error Path:/solr/overseer Error:KeeperErrorCode = NodeExists for /solr/overseer
[junit4:junit4]   2> 680 T3035 oasc.OverseerCollectionProcessor.run Process current queue of collection messages
[junit4:junit4]   2> 681 T3011 oascc.SolrZkClient.makePath makePath: /clusterstate.json
[junit4:junit4]   2> 691 T3011 oascc.ZkStateReader.createClusterStateWatchersAndUpdate Updating cluster state from ZooKeeper... 
[junit4:junit4]   2> 694 T3034 oasc.Overseer$ClusterStateUpdater.run Starting to work on the main queue
[junit4:junit4]   2> 697 T3036 oasc.CoreContainer.create Creating SolrCore 'collection1' using instanceDir: /usr/home/hudson/hudson-slave/workspace/Lucene-Solr-Tests-4.x-Java6/solr/build/solr-core/test/J1/./org.apache.solr.cloud.SyncSliceTest-controljetty-1355849590644/collection1
[junit4:junit4]   2> 697 T3036 oasc.ZkController.createCollectionZkNode Check for collection zkNode:control_collection
[junit4:junit4]   2> 698 T3036 oasc.ZkController.createCollectionZkNode Collection zkNode exists
[junit4:junit4]   2> 698 T3036 oasc.ZkController.readConfigName Load collection config from:/collections/control_collection
[junit4:junit4]   2> 700 T3036 oasc.SolrResourceLoader.<init> new SolrResourceLoader for directory: '/usr/home/hudson/hudson-slave/workspace/Lucene-Solr-Tests-4.x-Java6/solr/build/solr-core/test/J1/./org.apache.solr.cloud.SyncSliceTest-controljetty-1355849590644/collection1/'
[junit4:junit4]   2> 701 T3036 oasc.SolrResourceLoader.replaceClassLoader Adding 'file:/usr/home/hudson/hudson-slave/workspace/Lucene-Solr-Tests-4.x-Java6/solr/build/solr-core/test/J1/org.apache.solr.cloud.SyncSliceTest-controljetty-1355849590644/collection1/lib/classes/' to classloader
[junit4:junit4]   2> 701 T3036 oasc.SolrResourceLoader.replaceClassLoader Adding 'file:/usr/home/hudson/hudson-slave/workspace/Lucene-Solr-Tests-4.x-Java6/solr/build/solr-core/test/J1/org.apache.solr.cloud.SyncSliceTest-controljetty-1355849590644/collection1/lib/README' to classloader
[junit4:junit4]   2> 757 T3036 oasc.SolrConfig.<init> Using Lucene MatchVersion: LUCENE_41
[junit4:junit4]   2> 839 T3036 oasc.SolrConfig.<init> Loaded SolrConfig: solrconfig.xml
[junit4:junit4]   2> 940 T3036 oass.IndexSchema.readSchema Reading Solr Schema
[junit4:junit4]   2> 947 T3036 oass.IndexSchema.readSchema Schema name=test
[junit4:junit4]   2> 1575 T3036 oass.OpenExchangeRatesOrgProvider.init Initialized with rates=open-exchange-rates.json, refreshInterval=1440.
[junit4:junit4]   2> 1583 T3036 oass.IndexSchema.readSchema default search field in schema is text
[junit4:junit4]   2> 1586 T3036 oass.IndexSchema.readSchema unique key field: id
[junit4:junit4]   2> 1594 T3036 oass.FileExchangeRateProvider.reload Reloading exchange rates from file currency.xml
[junit4:junit4]   2> 1598 T3036 oass.FileExchangeRateProvider.reload Reloading exchange rates from file currency.xml
[junit4:junit4]   2> 1601 T3036 oass.OpenExchangeRatesOrgProvider.reload Reloading exchange rates from open-exchange-rates.json
[junit4:junit4]   2> 1602 T3036 oass.OpenExchangeRatesOrgProvider.reload Reloading exchange rates from open-exchange-rates.json
[junit4:junit4]   2> 1602 T3036 oasc.SolrCore.<init> [collection1] Opening new SolrCore at /usr/home/hudson/hudson-slave/workspace/Lucene-Solr-Tests-4.x-Java6/solr/build/solr-core/test/J1/./org.apache.solr.cloud.SyncSliceTest-controljetty-1355849590644/collection1/, dataDir=./org.apache.solr.cloud.SyncSliceTest-1355849590345/control/data/
[junit4:junit4]   2> 1603 T3036 oasc.JmxMonitoredMap.<init> JMX monitoring is enabled. Adding Solr mbeans to JMX Server: com.sun.jmx.mbeanserver.JmxMBeanServer@26c1186f
[junit4:junit4]   2> 1603 T3036 oasc.SolrCore.initDirectoryFactory solr.NRTCachingDirectoryFactory
[junit4:junit4]   2> 1604 T3036 oasc.CachingDirectoryFactory.get return new directory for /usr/home/hudson/hudson-slave/workspace/Lucene-Solr-Tests-4.x-Java6/solr/build/solr-core/test/J1/./org.apache.solr.cloud.SyncSliceTest-1355849590345/control/data forceNew:false
[junit4:junit4]   2> 1604 T3036 oasc.CachingDirectoryFactory.close Releasing directory:/usr/home/hudson/hudson-slave/workspace/Lucene-Solr-Tests-4.x-Java6/solr/build/solr-core/test/J1/./org.apache.solr.cloud.SyncSliceTest-1355849590345/control/data
[junit4:junit4]   2> 1605 T3036 oasc.SolrCore.getNewIndexDir New index directory detected: old=null new=./org.apache.solr.cloud.SyncSliceTest-1355849590345/control/data/index/
[junit4:junit4]   2> 1605 T3036 oasc.SolrCore.initIndex WARNING [collection1] Solr index directory './org.apache.solr.cloud.SyncSliceTest-1355849590345/control/data/index' doesn't exist. Creating new index...
[junit4:junit4]   2> 1606 T3036 oasc.CachingDirectoryFactory.get return new directory for /usr/home/hudson/hudson-slave/workspace/Lucene-Solr-Tests-4.x-Java6/solr/build/solr-core/test/J1/./org.apache.solr.cloud.SyncSliceTest-1355849590345/control/data/index forceNew:false
[junit4:junit4]   2> 1613 T3036 oasc.SolrDeletionPolicy.onCommit SolrDeletionPolicy.onCommit: commits:num=1
[junit4:junit4]   2> 		commit{dir=RateLimitedDirectoryWrapper(NRTCachingDirectory(org.apache.lucene.store.NIOFSDirectory@/usr/home/hudson/hudson-slave/workspace/Lucene-Solr-Tests-4.x-Java6/solr/build/solr-core/test/J1/org.apache.solr.cloud.SyncSliceTest-1355849590345/control/data/index lockFactory=org.apache.lucene.store.NativeFSLockFactory@197a1f32; maxCacheMB=48.0 maxMergeSizeMB=4.0)),segFN=segments_1,generation=1,filenames=[segments_1]
[junit4:junit4]   2> 1613 T3036 oasc.SolrDeletionPolicy.updateCommits newest commit = 1[segments_1]
[junit4:junit4]   2> 1614 T3036 oasc.CachingDirectoryFactory.close Releasing directory:/usr/home/hudson/hudson-slave/workspace/Lucene-Solr-Tests-4.x-Java6/solr/build/solr-core/test/J1/./org.apache.solr.cloud.SyncSliceTest-1355849590345/control/data/index
[junit4:junit4]   2> 1614 T3036 oasc.SolrCore.initWriters created xml: solr.XMLResponseWriter
[junit4:junit4]   2> 1615 T3036 oasup.UpdateRequestProcessorChain.init inserting DistributedUpdateProcessorFactory into updateRequestProcessorChain "dedupe"
[junit4:junit4]   2> 1616 T3036 oasup.UpdateRequestProcessorChain.init inserting DistributedUpdateProcessorFactory into updateRequestProcessorChain "dedupe-allfields"
[junit4:junit4]   2> 1616 T3036 oasup.UpdateRequestProcessorChain.init inserting DistributedUpdateProcessorFactory into updateRequestProcessorChain "stored_sig"
[junit4:junit4]   2> 1616 T3036 oasup.UpdateRequestProcessorChain.init inserting DistributedUpdateProcessorFactory into updateRequestProcessorChain "uniq-fields"
[junit4:junit4]   2> 1617 T3036 oasup.UpdateRequestProcessorChain.init inserting DistributedUpdateProcessorFactory into updateRequestProcessorChain "distrib-dup-test-chain-implicit"
[junit4:junit4]   2> 1617 T3036 oasc.RequestHandlers.initHandlersFromConfig adding lazy requestHandler: solr.ReplicationHandler
[junit4:junit4]   2> 1617 T3036 oasc.RequestHandlers.initHandlersFromConfig created /replication: solr.ReplicationHandler
[junit4:junit4]   2> 1618 T3036 oasc.RequestHandlers.initHandlersFromConfig created standard: solr.StandardRequestHandler
[junit4:junit4]   2> 1619 T3036 oasc.RequestHandlers.initHandlersFromConfig created /get: solr.RealTimeGetHandler
[junit4:junit4]   2> 1619 T3036 oasc.RequestHandlers.initHandlersFromConfig created dismax: solr.SearchHandler
[junit4:junit4]   2> 1620 T3036 oasc.RequestHandlers.initHandlersFromConfig created mock: org.apache.solr.core.MockQuerySenderListenerReqHandler
[junit4:junit4]   2> 1620 T3036 oasc.RequestHandlers.initHandlersFromConfig created /admin/: org.apache.solr.handler.admin.AdminHandlers
[junit4:junit4]   2> 1621 T3036 oasc.RequestHandlers.initHandlersFromConfig created defaults: solr.StandardRequestHandler
[junit4:junit4]   2> 1621 T3036 oasc.RequestHandlers.initHandlersFromConfig adding lazy requestHandler: solr.StandardRequestHandler
[junit4:junit4]   2> 1621 T3036 oasc.RequestHandlers.initHandlersFromConfig created lazy: solr.StandardRequestHandler
[junit4:junit4]   2> 1622 T3036 oasc.RequestHandlers.initHandlersFromConfig created /update: solr.UpdateRequestHandler
[junit4:junit4]   2> 1623 T3036 oasc.RequestHandlers.initHandlersFromConfig created /terms: org.apache.solr.handler.component.SearchHandler
[junit4:junit4]   2> 1623 T3036 oasc.RequestHandlers.initHandlersFromConfig created spellCheckCompRH: org.apache.solr.handler.component.SearchHandler
[junit4:junit4]   2> 1624 T3036 oasc.RequestHandlers.initHandlersFromConfig created spellCheckCompRH_Direct: org.apache.solr.handler.component.SearchHandler
[junit4:junit4]   2> 1624 T3036 oasc.RequestHandlers.initHandlersFromConfig created spellCheckWithWordbreak: org.apache.solr.handler.component.SearchHandler
[junit4:junit4]   2> 1625 T3036 oasc.RequestHandlers.initHandlersFromConfig created spellCheckWithWordbreak_Direct: org.apache.solr.handler.component.SearchHandler
[junit4:junit4]   2> 1626 T3036 oasc.RequestHandlers.initHandlersFromConfig created spellCheckCompRH1: org.apache.solr.handler.component.SearchHandler
[junit4:junit4]   2> 1626 T3036 oasc.RequestHandlers.initHandlersFromConfig created mltrh: org.apache.solr.handler.component.SearchHandler
[junit4:junit4]   2> 1627 T3036 oasc.RequestHandlers.initHandlersFromConfig created tvrh: org.apache.solr.handler.component.SearchHandler
[junit4:junit4]   2> 1628 T3036 oasc.RequestHandlers.initHandlersFromConfig created /mlt: solr.MoreLikeThisHandler
[junit4:junit4]   2> 1628 T3036 oasc.RequestHandlers.initHandlersFromConfig created /debug/dump: solr.DumpRequestHandler
[junit4:junit4]   2> 1633 T3036 oashl.XMLLoader.init xsltCacheLifetimeSeconds=60
[junit4:junit4]   2> 1637 T3036 oasc.SolrCore.initDeprecatedSupport WARNING solrconfig.xml uses deprecated <admin/gettableFiles>, Please update your config to use the ShowFileRequestHandler.
[junit4:junit4]   2> 1638 T3036 oasc.SolrCore.initDeprecatedSupport WARNING adding ShowFileRequestHandler with hidden files: [SCHEMA.XML, OLD_SYNONYMS.TXT, STOPWORDS.TXT, PROTWORDS.TXT, OPEN-EXCHANGE-RATES.JSON, SYNONYMS.TXT, CURRENCY.XML, MAPPING-ISOLATIN1ACCENT.TXT]
[junit4:junit4]   2> 1640 T3036 oasc.CachingDirectoryFactory.close Releasing directory:/usr/home/hudson/hudson-slave/workspace/Lucene-Solr-Tests-4.x-Java6/solr/build/solr-core/test/J1/./org.apache.solr.cloud.SyncSliceTest-1355849590345/control/data
[junit4:junit4]   2> 1642 T3036 oass.SolrIndexSearcher.<init> Opening Searcher@6a0f4ae6 main
[junit4:junit4]   2> 1643 T3036 oasu.CommitTracker.<init> Hard AutoCommit: disabled
[junit4:junit4]   2> 1643 T3036 oasu.CommitTracker.<init> Soft AutoCommit: disabled
[junit4:junit4]   2> 1643 T3036 oashc.SpellCheckComponent.inform Initializing spell checkers
[junit4:junit4]   2> 1650 T3036 oass.DirectSolrSpellChecker.init init: {name=direct,classname=DirectSolrSpellChecker,field=lowerfilt,minQueryLength=3}
[junit4:junit4]   2> 1698 T3037 oasc.SolrCore.registerSearcher [collection1] Registered new searcher Searcher@6a0f4ae6 main{StandardDirectoryReader(segments_1:1)}
[junit4:junit4]   2> 1701 T3036 oasc.ZkController.publish publishing core=collection1 state=down
[junit4:junit4]   2> 1701 T3036 oasc.ZkController.publish numShards not found on descriptor - reading it from system property
[junit4:junit4]   2> 1701 T3016 oazs.PrepRequestProcessor.pRequest Got user-level KeeperException when processing sessionid:0x13baeeee6510003 type:create cxid:0x56 zxid:0x29 txntype:-1 reqpath:n/a Error Path:/solr/overseer/queue Error:KeeperErrorCode = NoNode for /solr/overseer/queue
[junit4:junit4]   2> 2201 T3034 oascc.ZkStateReader.updateClusterState Updating cloud state from ZooKeeper... 
[junit4:junit4]   2> 2202 T3034 oasc.Overseer$ClusterStateUpdater.updateState Update state numShards=1 message={
[junit4:junit4]   2> 	  "operation":"state",
[junit4:junit4]   2> 	  "numShards":"1",
[junit4:junit4]   2> 	  "shard":null,
[junit4:junit4]   2> 	  "roles":null,
[junit4:junit4]   2> 	  "state":"down",
[junit4:junit4]   2> 	  "core":"collection1",
[junit4:junit4]   2> 	  "collection":"control_collection",
[junit4:junit4]   2> 	  "node_name":"127.0.0.1:28150_vy",
[junit4:junit4]   2> 	  "base_url":"http://127.0.0.1:28150/vy"}
[junit4:junit4]   2> 2202 T3034 oasc.Overseer$ClusterStateUpdater.createCollection Create collection control_collection with numShards 1
[junit4:junit4]   2> 2202 T3034 oasc.Overseer$ClusterStateUpdater.updateState Assigning new node to shard shard=shard1
[junit4:junit4]   2> 2203 T3016 oazs.PrepRequestProcessor.pRequest Got user-level KeeperException when processing sessionid:0x13baeeee6510003 type:create cxid:0x5e zxid:0x2c txntype:-1 reqpath:n/a Error Path:/solr/overseer/queue-work Error:KeeperErrorCode = NoNode for /solr/overseer/queue-work
[junit4:junit4]   2> 2231 T3033 oascc.ZkStateReader$2.process A cluster state change: WatchedEvent state:SyncConnected type:NodeDataChanged path:/clusterstate.json, has occurred - updating... (live nodes size: 1)
[junit4:junit4]   2> 2715 T3036 oasc.CoreContainer.registerCore registering core: collection1
[junit4:junit4]   2> 2715 T3036 oasc.ZkController.register Register replica - core:collection1 address:http://127.0.0.1:28150/vy collection:control_collection shard:shard1
[junit4:junit4]   2> 2716 T3036 oascc.SolrZkClient.makePath makePath: /collections/control_collection/leader_elect/shard1/election
[junit4:junit4]   2> 2737 T3016 oazs.PrepRequestProcessor.pRequest Got user-level KeeperException when processing sessionid:0x13baeeee6510003 type:delete cxid:0x7b zxid:0x36 txntype:-1 reqpath:n/a Error Path:/solr/collections/control_collection/leaders Error:KeeperErrorCode = NoNode for /solr/collections/control_collection/leaders
[junit4:junit4]   2> 2739 T3036 oasc.ShardLeaderElectionContext.runLeaderProcess Running the leader process.
[junit4:junit4]   2> 2739 T3016 oazs.PrepRequestProcessor.pRequest Got user-level KeeperException when processing sessionid:0x13baeeee6510003 type:create cxid:0x7c zxid:0x37 txntype:-1 reqpath:n/a Error Path:/solr/overseer Error:KeeperErrorCode = NodeExists for /solr/overseer
[junit4:junit4]   2> 2749 T3036 oasc.ShardLeaderElectionContext.waitForReplicasToComeUp Enough replicas found to continue.
[junit4:junit4]   2> 2749 T3036 oasc.ShardLeaderElectionContext.runLeaderProcess I may be the new leader - try and sync
[junit4:junit4]   2> 2749 T3036 oasc.SyncStrategy.sync Sync replicas to http://127.0.0.1:28150/vy/collection1/
[junit4:junit4]   2> 2750 T3036 oasc.SyncStrategy.syncReplicas Sync Success - now sync replicas to me
[junit4:junit4]   2> 2750 T3036 oasc.SyncStrategy.syncToMe http://127.0.0.1:28150/vy/collection1/ has no replicas
[junit4:junit4]   2> 2750 T3036 oasc.ShardLeaderElectionContext.runLeaderProcess I am the new leader: http://127.0.0.1:28150/vy/collection1/
[junit4:junit4]   2> 2750 T3036 oascc.SolrZkClient.makePath makePath: /collections/control_collection/leaders/shard1
[junit4:junit4]   2> 2754 T3016 oazs.PrepRequestProcessor.pRequest Got user-level KeeperException when processing sessionid:0x13baeeee6510003 type:create cxid:0x86 zxid:0x3b txntype:-1 reqpath:n/a Error Path:/solr/overseer Error:KeeperErrorCode = NodeExists for /solr/overseer
[junit4:junit4]   2> 3239 T3034 oascc.ZkStateReader.updateClusterState Updating cloud state from ZooKeeper... 
[junit4:junit4]   2> 3277 T3033 oascc.ZkStateReader$2.process A cluster state change: WatchedEvent state:SyncConnected type:NodeDataChanged path:/clusterstate.json, has occurred - updating... (live nodes size: 1)
[junit4:junit4]   2> 3325 T3036 oasc.ZkController.register We are http://127.0.0.1:28150/vy/collection1/ and leader is http://127.0.0.1:28150/vy/collection1/
[junit4:junit4]   2> 3325 T3036 oasc.ZkController.register No LogReplay needed for core=collection1 baseURL=http://127.0.0.1:28150/vy
[junit4:junit4]   2> 3325 T3036 oasc.ZkController.checkRecovery I am the leader, no recovery necessary
[junit4:junit4]   2> 3326 T3036 oasc.ZkController.publish publishing core=collection1 state=active
[junit4:junit4]   2> 3326 T3036 oasc.ZkController.publish numShards not found on descriptor - reading it from system property
[junit4:junit4]   2> 3328 T3036 oascc.ZkStateReader.updateClusterState Updating cloud state from ZooKeeper... 
[junit4:junit4]   2> 3329 T3011 oass.SolrDispatchFilter.init user.dir=/usr/home/hudson/hudson-slave/workspace/Lucene-Solr-Tests-4.x-Java6/solr/build/solr-core/test/J1
[junit4:junit4]   2> 3330 T3011 oass.SolrDispatchFilter.init SolrDispatchFilter.init() done
[junit4:junit4]   2> 3331 T3011 oascsi.HttpClientUtil.createClient Creating new http client, config:maxConnections=128&maxConnectionsPerHost=32&followRedirects=false
[junit4:junit4]   2> 3347 T3011 oascsi.HttpClientUtil.createClient Creating new http client, config:
[junit4:junit4]   2> 3358 T3011 oaz.ZooKeeper.<init> Initiating client connection, connectString=127.0.0.1:24624/solr sessionTimeout=10000 watcher=org.apache.solr.common.cloud.ConnectionManager@5cdde592
[junit4:junit4]   2> 3359 T3011 oascc.ConnectionManager.waitForConnected Waiting for client to connect to ZooKeeper
[junit4:junit4]   2> 3359 T3038 oaz.ClientCnxn$SendThread.logStartConnect Opening socket connection to server localhost/127.0.0.1:24624. Will not attempt to authenticate using SASL (access denied (javax.security.auth.AuthPermission getLoginConfiguration))
[junit4:junit4]   2> 3360 T3038 oaz.ClientCnxn$SendThread.primeConnection Socket connection established to localhost/127.0.0.1:24624, initiating session
[junit4:junit4]   2> 3360 T3013 oazs.NIOServerCnxnFactory.run Accepted socket connection from /140.211.11.196:45973
[junit4:junit4]   2> 3360 T3013 oazs.ZooKeeperServer.processConnectRequest Client attempting to establish new session at /140.211.11.196:45973
[junit4:junit4]   2> 3362 T3015 oazs.ZooKeeperServer.finishSessionInit Established session 0x13baeeee6510004 with negotiated timeout 10000 for client /140.211.11.196:45973
[junit4:junit4]   2> 3362 T3038 oaz.ClientCnxn$SendThread.onConnected Session establishment complete on server localhost/127.0.0.1:24624, sessionid = 0x13baeeee6510004, negotiated timeout = 10000
[junit4:junit4]   2> 3362 T3039 oascc.ConnectionManager.process Watcher org.apache.solr.common.cloud.ConnectionManager@5cdde592 name:ZooKeeperConnection Watcher:127.0.0.1:24624/solr got event WatchedEvent state:SyncConnected type:None path:null path:null type:None
[junit4:junit4]   2> 3362 T3011 oascc.ConnectionManager.waitForConnected Client is connected to ZooKeeper
[junit4:junit4]   2> 3363 T3011 oascc.ZkStateReader.createClusterStateWatchersAndUpdate Updating cluster state from ZooKeeper... 
[junit4:junit4]   2> 3365 T3011 oasc.ChaosMonkey.monkeyLog monkey: init - expire sessions:true cause connection loss:true
[junit4:junit4]   2> 3525 T3011 oejs.Server.doStart jetty-8.1.8.v20121106
[junit4:junit4]   2> 3529 T3011 oejs.AbstractConnector.doStart Started SocketConnector@127.0.0.1:16448
[junit4:junit4]   2> 3529 T3011 oasc.SolrResourceLoader.locateSolrHome JNDI not configured for solr (NoInitialContextEx)
[junit4:junit4]   2> 3530 T3011 oasc.SolrResourceLoader.locateSolrHome using system property solr.solr.home: /usr/home/hudson/hudson-slave/workspace/Lucene-Solr-Tests-4.x-Java6/solr/build/solr-core/test/J1/./org.apache.solr.cloud.SyncSliceTest-jetty1-1355849593704
[junit4:junit4]   2> 3531 T3011 oasc.SolrResourceLoader.<init> new SolrResourceLoader for deduced Solr Home: '/usr/home/hudson/hudson-slave/workspace/Lucene-Solr-Tests-4.x-Java6/solr/build/solr-core/test/J1/./org.apache.solr.cloud.SyncSliceTest-jetty1-1355849593704/'
[junit4:junit4]   2> 3571 T3011 oass.SolrDispatchFilter.init SolrDispatchFilter.init()
[junit4:junit4]   2> 3572 T3011 oasc.SolrResourceLoader.locateSolrHome JNDI not configured for solr (NoInitialContextEx)
[junit4:junit4]   2> 3572 T3011 oasc.SolrResourceLoader.locateSolrHome using system property solr.solr.home: /usr/home/hudson/hudson-slave/workspace/Lucene-Solr-Tests-4.x-Java6/solr/build/solr-core/test/J1/./org.apache.solr.cloud.SyncSliceTest-jetty1-1355849593704
[junit4:junit4]   2> 3573 T3011 oasc.CoreContainer$Initializer.initialize looking for solr.xml: /usr/home/hudson/hudson-slave/workspace/Lucene-Solr-Tests-4.x-Java6/solr/build/solr-core/test/J1/./org.apache.solr.cloud.SyncSliceTest-jetty1-1355849593704/solr.xml
[junit4:junit4]   2> 3574 T3011 oasc.CoreContainer.<init> New CoreContainer 29367646
[junit4:junit4]   2> 3575 T3011 oasc.CoreContainer.load Loading CoreContainer using Solr Home: '/usr/home/hudson/hudson-slave/workspace/Lucene-Solr-Tests-4.x-Java6/solr/build/solr-core/test/J1/./org.apache.solr.cloud.SyncSliceTest-jetty1-1355849593704/'
[junit4:junit4]   2> 3575 T3011 oasc.SolrResourceLoader.<init> new SolrResourceLoader for directory: '/usr/home/hudson/hudson-slave/workspace/Lucene-Solr-Tests-4.x-Java6/solr/build/solr-core/test/J1/./org.apache.solr.cloud.SyncSliceTest-jetty1-1355849593704/'
[junit4:junit4]   2> 3601 T3011 oashc.HttpShardHandlerFactory.getParameter Setting socketTimeout to: 30000
[junit4:junit4]   2> 3602 T3011 oashc.HttpShardHandlerFactory.getParameter Setting urlScheme to: http://
[junit4:junit4]   2> 3603 T3011 oashc.HttpShardHandlerFactory.getParameter Setting connTimeout to: 15000
[junit4:junit4]   2> 3603 T3011 oashc.HttpShardHandlerFactory.getParameter Setting maxConnectionsPerHost to: 20
[junit4:junit4]   2> 3604 T3011 oashc.HttpShardHandlerFactory.getParameter Setting corePoolSize to: 0
[junit4:junit4]   2> 3605 T3011 oashc.HttpShardHandlerFactory.getParameter Setting maximumPoolSize to: 2147483647
[junit4:junit4]   2> 3605 T3011 oashc.HttpShardHandlerFactory.getParameter Setting maxThreadIdleTime to: 5
[junit4:junit4]   2> 3606 T3011 oashc.HttpShardHandlerFactory.getParameter Setting sizeOfQueue to: -1
[junit4:junit4]   2> 3606 T3011 oashc.HttpShardHandlerFactory.getParameter Setting fairnessPolicy to: false
[junit4:junit4]   2> 3607 T3011 oascsi.HttpClientUtil.createClient Creating new http client, config:maxConnectionsPerHost=20&maxConnections=10000&socketTimeout=30000&connTimeout=15000&retry=false
[junit4:junit4]   2> 3628 T3011 oasc.CoreContainer.load Registering Log Listener
[junit4:junit4]   2> 3646 T3011 oasc.CoreContainer.initZooKeeper Zookeeper client=127.0.0.1:24624/solr
[junit4:junit4]   2> 3647 T3011 oasc.ZkController.checkChrootPath zkHost includes chroot
[junit4:junit4]   2> 3647 T3011 oaz.ZooKeeper.<init> Initiating client connection, connectString=127.0.0.1:24624 sessionTimeout=60000 watcher=org.apache.solr.common.cloud.ConnectionManager@1951e329
[junit4:junit4]   2> 3649 T3011 oascc.ConnectionManager.waitForConnected Waiting for client to connect to ZooKeeper
[junit4:junit4]   2> 3649 T3049 oaz.ClientCnxn$SendThread.logStartConnect Opening socket connection to server localhost/127.0.0.1:24624. Will not attempt to authenticate using SASL (access denied (javax.security.auth.AuthPermission getLoginConfiguration))
[junit4:junit4]   2> 3650 T3049 oaz.ClientCnxn$SendThread.primeConnection Socket connection established to localhost/127.0.0.1:24624, initiating session
[junit4:junit4]   2> 3650 T3013 oazs.NIOServerCnxnFactory.run Accepted socket connection from /140.211.11.196:37080
[junit4:junit4]   2> 3650 T3013 oazs.ZooKeeperServer.processConnectRequest Client attempting to establish new session at /140.211.11.196:37080
[junit4:junit4]   2> 3652 T3015 oazs.ZooKeeperServer.finishSessionInit Established session 0x13baeeee6510005 with negotiated timeout 20000 for client /140.211.11.196:37080
[junit4:junit4]   2> 3652 T3049 oaz.ClientCnxn$SendThread.onConnected Session establishment complete on server localhost/127.0.0.1:24624, sessionid = 0x13baeeee6510005, negotiated timeout = 20000
[junit4:junit4]   2> 3653 T3050 oascc.ConnectionManager.process Watcher org.apache.solr.common.cloud.ConnectionManager@1951e329 name:ZooKeeperConnection Watcher:127.0.0.1:24624 got event WatchedEvent state:SyncConnected type:None path:null path:null type:None
[junit4:junit4]   2> 3653 T3011 oascc.ConnectionManager.waitForConnected Client is connected to ZooKeeper
[junit4:junit4]   2> 3654 T3016 oazs.PrepRequestProcessor.pRequest2Txn Processed session termination for sessionid: 0x13baeeee6510005
[junit4:junit4]   2> 3663 T3050 oaz.ClientCnxn$EventThread.run EventThread shut down
[junit4:junit4]   2> 3663 T3013 oazs.NIOServerCnxn.closeSock Closed socket connection for client /140.211.11.196:37080 which had sessionid 0x13baeeee6510005
[junit4:junit4]   2> 3663 T3011 oaz.ZooKeeper.close Session: 0x13baeeee6510005 closed
[junit4:junit4]   2> 3664 T3011 oascsi.HttpClientUtil.createClient Creating new http client, config:maxConnections=500&maxConnectionsPerHost=16&socketTimeout=15000&connTimeout=30000
[junit4:junit4]   2> 3682 T3011 oaz.ZooKeeper.<init> Initiating client connection, connectString=127.0.0.1:24624/solr sessionTimeout=30000 watcher=org.apache.solr.common.cloud.ConnectionManager@b1926c8
[junit4:junit4]   2> 3684 T3051 oaz.ClientCnxn$SendThread.logStartConnect Opening socket connection to server localhost/127.0.0.1:24624. Will not attempt to authenticate using SASL (access denied (javax.security.auth.AuthPermission getLoginConfiguration))
[junit4:junit4]   2> 3683 T3011 oascc.ConnectionManager.waitForConnected Waiting for client to connect to ZooKeeper
[junit4:junit4]   2> 3684 T3013 oazs.NIOServerCnxnFactory.run Accepted socket connection from /140.211.11.196:56556
[junit4:junit4]   2> 3684 T3051 oaz.ClientCnxn$SendThread.primeConnection Socket connection established to localhost/127.0.0.1:24624, initiating session
[junit4:junit4]   2> 3685 T3013 oazs.ZooKeeperServer.processConnectRequest Client attempting to establish new session at /140.211.11.196:56556
[junit4:junit4]   2> 3686 T3015 oazs.ZooKeeperServer.finishSessionInit Established session 0x13baeeee6510006 with negotiated timeout 20000 for client /140.211.11.196:56556
[junit4:junit4]   2> 3686 T3051 oaz.ClientCnxn$SendThread.onConnected Session establishment complete on server localhost/127.0.0.1:24624, sessionid = 0x13baeeee6510006, negotiated timeout = 20000
[junit4:junit4]   2> 3687 T3052 oascc.ConnectionManager.process Watcher org.apache.solr.common.cloud.ConnectionManager@b1926c8 name:ZooKeeperConnection Watcher:127.0.0.1:24624/solr got event WatchedEvent state:SyncConnected type:None path:null path:null type:None
[junit4:junit4]   2> 3687 T3011 oascc.ConnectionManager.waitForConnected Client is connected to ZooKeeper
[junit4:junit4]   2> 3688 T3016 oazs.PrepRequestProcessor.pRequest Got user-level KeeperException when processing sessionid:0x13baeeee6510006 type:create cxid:0x1 zxid:0x49 txntype:-1 reqpath:n/a Error Path:/solr/overseer Error:KeeperErrorCode = NodeExists for /solr/overseer
[junit4:junit4]   2> 3689 T3016 oazs.PrepRequestProcessor.pRequest Got user-level KeeperException when processing sessionid:0x13baeeee6510006 type:create cxid:0x2 zxid:0x4a txntype:-1 reqpath:n/a Error Path:/solr/overseer Error:KeeperErrorCode = NodeExists for /solr/overseer
[junit4:junit4]   2> 3696 T3011 oasc.ZkController.createEphemeralLiveNode Register node as live in ZooKeeper:/live_nodes/127.0.0.1:16448_vy
[junit4:junit4]   2> 3697 T3016 oazs.PrepRequestProcessor.pRequest Got user-level KeeperException when processing sessionid:0x13baeeee6510006 type:delete cxid:0x4 zxid:0x4b txntype:-1 reqpath:n/a Error Path:/solr/live_nodes/127.0.0.1:16448_vy Error:KeeperErrorCode = NoNode for /solr/live_nodes/127.0.0.1:16448_vy
[junit4:junit4]   2> 3698 T3011 oascc.SolrZkClient.makePath makePath: /live_nodes/127.0.0.1:16448_vy
[junit4:junit4]   2> 3700 T3033 oascc.ZkStateReader$3.process Updating live nodes... (2)
[junit4:junit4]   2> 3700 T3039 oascc.ZkStateReader$3.process Updating live nodes... (2)
[junit4:junit4]   2> 3701 T3033 oascc.ZkStateReader$2.process A cluster state change: WatchedEvent state:SyncConnected type:NodeChildrenChanged path:/live_nodes, has occurred - updating... (live nodes size: 2)
[junit4:junit4]   2> 3708 T3011 oascc.ZkStateReader.createClusterStateWatchersAndUpdate Updating cluster state from ZooKeeper... 
[junit4:junit4]   2> 3715 T3053 oasc.CoreContainer.create Creating SolrCore 'collection1' using instanceDir: /usr/home/hudson/hudson-slave/workspace/Lucene-Solr-Tests-4.x-Java6/solr/build/solr-core/test/J1/./org.apache.solr.cloud.SyncSliceTest-jetty1-1355849593704/collection1
[junit4:junit4]   2> 3716 T3053 oasc.ZkController.createCollectionZkNode Check for collection zkNode:collection1
[junit4:junit4]   2> 3716 T3053 oasc.ZkController.createCollectionZkNode Collection zkNode exists
[junit4:junit4]   2> 3716 T3053 oasc.ZkController.readConfigName Load collection config from:/collections/collection1
[junit4:junit4]   2> 3718 T3053 oasc.SolrResourceLoader.<init> new SolrResourceLoader for directory: '/usr/home/hudson/hudson-slave/workspace/Lucene-Solr-Tests-4.x-Java6/solr/build/solr-core/test/J1/./org.apache.solr.cloud.SyncSliceTest-jetty1-1355849593704/collection1/'
[junit4:junit4]   2> 3719 T3053 oasc.SolrResourceLoader.replaceClassLoader Adding 'file:/usr/home/hudson/hudson-slave/workspace/Lucene-Solr-Tests-4.x-Java6/solr/build/solr-core/test/J1/org.apache.solr.cloud.SyncSliceTest-jetty1-1355849593704/collection1/lib/README' to classloader
[junit4:junit4]   2> 3719 T3053 oasc.SolrResourceLoader.replaceClassLoader Adding 'file:/usr/home/hudson/hudson-slave/workspace/Lucene-Solr-Tests-4.x-Java6/solr/build/solr-core/test/J1/org.apache.solr.cloud.SyncSliceTest-jetty1-1355849593704/collection1/lib/classes/' to classloader
[junit4:junit4]   2> 3774 T3053 oasc.SolrConfig.<init> Using Lucene MatchVersion: LUCENE_41
[junit4:junit4]   2> 3803 T3034 oascc.ZkStateReader.updateClusterState Updating cloud state from ZooKeeper... 
[junit4:junit4]   2> 3804 T3034 oasc.Overseer$ClusterStateUpdater.updateState Update state numShards=1 message={
[junit4:junit4]   2> 	  "operation":"state",
[junit4:junit4]   2> 	  "numShards":"1",
[junit4:junit4]   2> 	  "shard":"shard1",
[junit4:junit4]   2> 	  "roles":null,
[junit4:junit4]   2> 	  "state":"active",
[junit4:junit4]   2> 	  "core":"collection1",
[junit4:junit4]   2> 	  "collection":"control_collection",
[junit4:junit4]   2> 	  "node_name":"127.0.0.1:28150_vy",
[junit4:junit4]   2> 	  "base_url":"http://127.0.0.1:28150/vy"}
[junit4:junit4]   2> 3809 T3039 oascc.ZkStateReader$2.process A cluster state change: WatchedEvent state:SyncConnected type:NodeDataChanged path:/clusterstate.json, has occurred - updating... (live nodes size: 2)
[junit4:junit4]   2> 3809 T3033 oascc.ZkStateReader$2.process A cluster state change: WatchedEvent state:SyncConnected type:NodeDataChanged path:/clusterstate.json, has occurred - updating... (live nodes size: 2)
[junit4:junit4]   2> 3809 T3052 oascc.ZkStateReader$2.process A cluster state change: WatchedEvent state:SyncConnected type:NodeDataChanged path:/clusterstate.json, has occurred - updating... (live nodes size: 2)
[junit4:junit4]   2> 3849 T3053 oasc.SolrConfig.<init> Loaded SolrConfig: solrconfig.xml
[junit4:junit4]   2> 3950 T3053 oass.IndexSchema.readSchema Reading Solr Schema
[junit4:junit4]   2> 3958 T3053 oass.IndexSchema.readSchema Schema name=test
[junit4:junit4]   2> 4615 T3053 oass.OpenExchangeRatesOrgProvider.init Initialized with rates=open-exchange-rates.json, refreshInterval=1440.
[junit4:junit4]   2> 4624 T3053 oass.IndexSchema.readSchema default search field in schema is text
[junit4:junit4]   2> 4627 T3053 oass.IndexSchema.readSchema unique key field: id
[junit4:junit4]   2> 4635 T3053 oass.FileExchangeRateProvider.reload Reloading exchange rates from file currency.xml
[junit4:junit4]   2> 4639 T3053 oass.FileExchangeRateProvider.reload Reloading exchange rates from file currency.xml
[junit4:junit4]   2> 4642 T3053 oass.OpenExchangeRatesOrgProvider.reload Reloading exchange rates from open-exchange-rates.json
[junit4:junit4]   2> 4643 T3053 oass.OpenExchangeRatesOrgProvider.reload Reloading exchange rates from open-exchange-rates.json
[junit4:junit4]   2> 4644 T3053 oasc.SolrCore.<init> [collection1] Opening new SolrCore at /usr/home/hudson/hudson-slave/workspace/Lucene-Solr-Tests-4.x-Java6/solr/build/solr-core/test/J1/./org.apache.solr.cloud.SyncSliceTest-jetty1-1355849593704/collection1/, dataDir=./org.apache.solr.cloud.SyncSliceTest-1355849590345/jetty1/
[junit4:junit4]   2> 4644 T3053 oasc.JmxMonitoredMap.<init> JMX monitoring is enabled. Adding Solr mbeans to JMX Server: com.sun.jmx.mbeanserver.JmxMBeanServer@26c1186f
[junit4:junit4]   2> 4644 T3053 oasc.SolrCore.initDirectoryFactory solr.NRTCachingDirectoryFactory
[junit4:junit4]   2> 4645 T3053 oasc.CachingDirectoryFactory.get return new directory for /usr/home/hudson/hudson-slave/workspace/Lucene-Solr-Tests-4.x-Java6/solr/build/solr-core/test/J1/./org.apache.solr.cloud.SyncSliceTest-1355849590345/jetty1 forceNew:false
[junit4:junit4]   2> 4646 T3053 oasc.CachingDirectoryFactory.close Releasing directory:/usr/home/hudson/hudson-slave/workspace/Lucene-Solr-Tests-4.x-Java6/solr/build/solr-core/test/J1/./org.apache.solr.cloud.SyncSliceTest-1355849590345/jetty1
[junit4:junit4]   2> 4646 T3053 oasc.SolrCore.getNewIndexDir New index directory detected: old=null new=./org.apache.solr.cloud.SyncSliceTest-1355849590345/jetty1/index/
[junit4:junit4]   2> 4646 T3053 oasc.SolrCore.initIndex WARNING [collection1] Solr index directory './org.apache.solr.cloud.SyncSliceTest-1355849590345/jetty1/index' doesn't exist. Creating new index...
[junit4:junit4]   2> 4647 T3053 oasc.CachingDirectoryFactory.get return new directory for /usr/home/hudson/hudson-slave/workspace/Lucene-Solr-Tests-4.x-Java6/solr/build/solr-core/test/J1/./org.apache.solr.cloud.SyncSliceTest-1355849590345/jetty1/index forceNew:false
[junit4:junit4]   2> 4652 T3053 oasc.SolrDeletionPolicy.onCommit SolrDeletionPolicy.onCommit: commits:num=1
[junit4:junit4]   2> 		commit{dir=RateLimitedDirectoryWrapper(NRTCachingDirectory(org.apache.lucene.store.NIOFSDirectory@/usr/home/hudson/hudson-slave/workspace/Lucene-Solr-Tests-4.x-Java6/solr/build/solr-core/test/J1/org.apache.solr.cloud.SyncSliceTest-1355849590345/jetty1/index lockFactory=org.apache.lucene.store.NativeFSLockFactory@6040e7c6; maxCacheMB=48.0 maxMergeSizeMB=4.0)),segFN=segments_1,generation=1,filenames=[segments_1]
[junit4:junit4]   2> 4652 T3053 oasc.SolrDeletionPolicy.updateCommits newest commit = 1[segments_1]
[junit4:junit4]   2> 4653 T3053 oasc.CachingDirectoryFactory.close Releasing directory:/usr/home/hudson/hudson-slave/workspace/Lucene-Solr-Tests-4.x-Java6/solr/build/solr-core/test/J1/./org.apache.solr.cloud.SyncSliceTest-1355849590345/jetty1/index
[junit4:junit4]   2> 4653 T3053 oasc.SolrCore.initWriters created xml: solr.XMLResponseWriter
[junit4:junit4]   2> 4655 T3053 oasup.UpdateRequestProcessorChain.init inserting DistributedUpdateProcessorFactory into updateRequestProcessorChain "dedupe"
[junit4:junit4]   2> 4655 T3053 oasup.UpdateRequestProcessorChain.init inserting DistributedUpdateProcessorFactory into updateRequestProcessorChain "dedupe-allfields"
[junit4:junit4]   2> 4655 T3053 oasup.UpdateRequestProcessorChain.init inserting DistributedUpdateProcessorFactory into updateRequestProcessorChain "stored_sig"
[junit4:junit4]   2> 4656 T3053 oasup.UpdateRequestProcessorChain.init inserting DistributedUpdateProcessorFactory into updateRequestProcessorChain "uniq-fields"
[junit4:junit4]   2> 4656 T3053 oasup.UpdateRequestProcessorChain.init inserting DistributedUpdateProcessorFactory into updateRequestProcessorChain "distrib-dup-test-chain-implicit"
[junit4:junit4]   2> 4656 T3053 oasc.RequestHandlers.initHandlersFromConfig adding lazy requestHandler: solr.ReplicationHandler
[junit4:junit4]   2> 4657 T3053 oasc.RequestHandlers.initHandlersFromConfig created /replication: solr.ReplicationHandler
[junit4:junit4]   2> 4657 T3053 oasc.RequestHandlers.initHandlersFromConfig created standard: solr.StandardRequestHandler
[junit4:junit4]   2> 4658 T3053 oasc.RequestHandlers.initHandlersFromConfig created /get: solr.RealTimeGetHandler
[junit4:junit4]   2> 4659 T3053 oasc.RequestHandlers.initHandlersFromConfig created dismax: solr.SearchHandler
[junit4:junit4]   2> 4659 T3053 oasc.RequestHandlers.initHandlersFromConfig created mock: org.apache.solr.core.MockQuerySenderListenerReqHandler
[junit4:junit4]   2> 4660 T3053 oasc.RequestHandlers.initHandlersFromConfig created /admin/: org.apache.solr.handler.admin.AdminHandlers
[junit4:junit4]   2> 4660 T3053 oasc.RequestHandlers.initHandlersFromConfig created defaults: solr.StandardRequestHandler
[junit4:junit4]   2> 4661 T3053 oasc.RequestHandlers.initHandlersFromConfig adding lazy requestHandler: solr.StandardRequestHandler
[junit4:junit4]   2> 4661 T3053 oasc.RequestHandlers.initHandlersFromConfig created lazy: solr.StandardRequestHandler
[junit4:junit4]   2> 4662 T3053 oasc.RequestHandlers.initHandlersFromConfig created /update: solr.UpdateRequestHandler
[junit4:junit4]   2> 4662 T3053 oasc.RequestHandlers.initHandlersFromConfig created /terms: org.apache.solr.handler.component.SearchHandler
[junit4:junit4]   2> 4663 T3053 oasc.RequestHandlers.initHandlersFromConfig created spellCheckCompRH: org.apache.solr.handler.component.SearchHandler
[junit4:junit4]   2> 4664 T3053 oasc.RequestHandlers.initHandlersFromConfig created spellCheckCompRH_Direct: org.apache.solr.handler.component.SearchHandler
[junit4:junit4]   2> 4664 T3053 oasc.RequestHandlers.initHandlersFromConfig created spellCheckWithWordbreak: org.apache.solr.handler.component.SearchHandler
[junit4:junit4]   2> 4665 T3053 oasc.RequestHandlers.initHandlersFromConfig created spellCheckWithWordbreak_Direct: org.apache.solr.handler.component.SearchHandler
[junit4:junit4]   2> 4666 T3053 oasc.RequestHandlers.initHandlersFromConfig created spellCheckCompRH1: org.apache.solr.handler.component.SearchHandler
[junit4:junit4]   2> 4666 T3053 oasc.RequestHandlers.initHandlersFromConfig created mltrh: org.apache.solr.handler.component.SearchHandler
[junit4:junit4]   2> 4667 T3053 oasc.RequestHandlers.initHandlersFromConfig created tvrh: org.apache.solr.handler.component.SearchHandler
[junit4:junit4]   2> 4668 T3053 oasc.RequestHandlers.initHandlersFromConfig created /mlt: solr.MoreLikeThisHandler
[junit4:junit4]   2> 4668 T3053 oasc.RequestHandlers.initHandlersFromConfig created /debug/dump: solr.DumpRequestHandler
[junit4:junit4]   2> 4674 T3053 oashl.XMLLoader.init xsltCacheLifetimeSeconds=60
[junit4:junit4]   2> 4678 T3053 oasc.SolrCore.initDeprecatedSupport WARNING solrconfig.xml uses deprecated <admin/gettableFiles>, Please update your config to use the ShowFileRequestHandler.
[junit4:junit4]   2> 4679 T3053 oasc.SolrCore.initDeprecatedSupport WARNING adding ShowFileRequestHandler with hidden files: [SCHEMA.XML, OLD_SYNONYMS.TXT, STOPWORDS.TXT, PROTWORDS.TXT, OPEN-EXCHANGE-RATES.JSON, SYNONYMS.TXT, CURRENCY.XML, MAPPING-ISOLATIN1ACCENT.TXT]
[junit4:junit4]   2> 4681 T3053 oasc.CachingDirectoryFactory.close Releasing directory:/usr/home/hudson/hudson-slave/workspace/Lucene-Solr-Tests-4.x-Java6/solr/build/solr-core/test/J1/./org.apache.solr.cloud.SyncSliceTest-1355849590345/jetty1
[junit4:junit4]   2> 4682 T3053 oass.SolrIndexSearcher.<init> Opening Searcher@2320a98a main
[junit4:junit4]   2> 4683 T3053 oasu.CommitTracker.<init> Hard AutoCommit: disabled
[junit4:junit4]   2> 4683 T3053 oasu.CommitTracker.<init> Soft AutoCommit: disabled
[junit4:junit4]   2> 4683 T3053 oashc.SpellCheckComponent.inform Initializing spell checkers
[junit4:junit4]   2> 4689 T3053 oass.DirectSolrSpellChecker.init init: {name=direct,classname=DirectSolrSpellChecker,field=lowerfilt,minQueryLength=3}
[junit4:junit4]   2> 4737 T3054 oasc.SolrCore.registerSearcher [collection1] Registered new searcher Searcher@2320a98a main{StandardDirectoryReader(segments_1:1)}
[junit4:junit4]   2> 4740 T3053 oasc.ZkController.publish publishing core=collection1 state=down
[junit4:junit4]   2> 4740 T3053 oasc.ZkController.publish numShards not found on descriptor - reading it from system property
[junit4:junit4]   2> 4823 T3034 oascc.ZkStateReader.updateClusterState Updating cloud state from ZooKeeper... 
[junit4:junit4]   2> 4823 T3034 oasc.Overseer$ClusterStateUpdater.updateState Update state numShards=1 message={
[junit4:junit4]   2> 	  "operation":"state",
[junit4:junit4]   2> 	  "numShards":"1",
[junit4:junit4]   2> 	  "shard":null,
[junit4:junit4]   2> 	  "roles":null,
[junit4:junit4]   2> 	  "state":"down",
[junit4:junit4]   2> 	  "core":"collection1",
[junit4:junit4]   2> 	  "collection":"collection1",
[junit4:junit4]   2> 	  "node_name":"127.0.0.1:16448_vy",
[junit4:junit4]   2> 	  "base_url":"http://127.0.0.1:16448/vy"}
[junit4:junit4]   2> 4823 T3034 oasc.Overseer$ClusterStateUpdater.createCollection Create collection collection1 with numShards 1
[junit4:junit4]   2> 4824 T3034 oasc.Overseer$ClusterStateUpdater.updateState Assigning new node to shard shard=shard1
[junit4:junit4]   2> 4835 T3033 oascc.ZkStateReader$2.process A cluster state change: WatchedEvent state:SyncConnected type:NodeDataChanged path:/clusterstate.json, has occurred - updating... (live nodes size: 2)
[junit4:junit4]   2> 4835 T3052 oascc.ZkStateReader$2.process A cluster state change: WatchedEvent state:SyncConnected type:NodeDataChanged path:/clusterstate.json, has occurred - updating... (live nodes size: 2)
[junit4:junit4]   2> 4835 T3039 oascc.ZkStateReader$2.process A cluster state change: WatchedEvent state:SyncConnected type:NodeDataChanged path:/clusterstate.json, has occurred - updating... (live nodes size: 2)
[junit4:junit4]   2> 5242 T3053 oasc.CoreContainer.registerCore registering core: collection1
[junit4:junit4]   2> 5242 T3053 oasc.ZkController.register Register replica - core:collection1 address:http://127.0.0.1:16448/vy collection:collection1 shard:shard1
[junit4:junit4]   2> 5243 T3053 oascc.SolrZkClient.makePath makePath: /collections/collection1/leader_elect/shard1/election
[junit4:junit4]   2> 5258 T3016 oazs.PrepRequestProcessor.pRequest Got user-level KeeperException when processing sessionid:0x13baeeee6510006 type:delete cxid:0x45 zxid:0x5b txntype:-1 reqpath:n/a Error Path:/solr/collections/collection1/leaders Error:KeeperErrorCode = NoNode for /solr/collections/collection1/leaders
[junit4:junit4]   2> 5259 T3053 oasc.ShardLeaderElectionContext.runLeaderProcess Running the leader process.
[junit4:junit4]   2> 5260 T3016 oazs.PrepRequestProcessor.pRequest Got user-level KeeperException when processing sessionid:0x13baeeee6510006 type:create cxid:0x46 zxid:0x5c txntype:-1 reqpath:n/a Error Path:/solr/overseer Error:KeeperErrorCode = NodeExists for /solr/overseer
[junit4:junit4]   2> 5270 T3053 oasc.ShardLeaderElectionContext.waitForReplicasToComeUp Enough replicas found to continue.
[junit4:junit4]   2> 5270 T3053 oasc.ShardLeaderElectionContext.runLeaderProcess I may be the new leader - try and sync
[junit4:junit4]   2> 5270 T3053 oasc.SyncStrategy.sync Sync replicas to http://127.0.0.1:16448/vy/collection1/
[junit4:junit4]   2> 5270 T3053 oasc.SyncStrategy.syncReplicas Sync Success - now sync replicas to me
[junit4:junit4]   2> 5271 T3053 oasc.SyncStrategy.syncToMe http://127.0.0.1:16448/vy/collection1/ has no replicas
[junit4:junit4]   2> 5271 T3053 oasc.ShardLeaderElectionContext.runLeaderProcess I am the new leader: http://127.0.0.1:16448/vy/collection1/
[junit4:junit4]   2> 5271 T3053 oascc.SolrZkClient.makePath makePath: /collections/collection1/leaders/shard1
[junit4:junit4]   2> 5275 T3016 oazs.PrepRequestProcessor.pRequest Got user-level KeeperException when processing sessionid:0x13baeeee6510006 type:create cxid:0x50 zxid:0x60 txntype:-1 reqpath:n/a Error Path:/solr/overseer Error:KeeperErrorCode = NodeExists for /solr/overseer
[junit4:junit4]   2> 5338 T3034 oascc.ZkStateReader.updateClusterState Updating cloud state from ZooKeeper... 
[junit4:junit4]   2> 5353 T3033 oascc.ZkStateReader$2.process A cluster state change: WatchedEvent state:SyncConnected type:NodeDataChanged path:/clusterstate.json, has occurred - updating... (live nodes size: 2)
[junit4:junit4]   2> 5353 T3052 oascc.ZkStateReader$2.process A cluster state change: WatchedEvent state:SyncConnected type:NodeDataChanged path:/clusterstate.json, has occurred - updating... (live nodes size: 2)
[junit4:junit4]   2> 5353 T3039 oascc.ZkStateReader$2.process A cluster state change: WatchedEvent state:SyncConnected type:NodeDataChanged path:/clusterstate.json, has occurred - updating... (live nodes size: 2)
[junit4:junit4]   2> 5379 T3053 oasc.ZkController.register We are http://127.0.0.1:16448/vy/collection1/ and leader is http://127.0.0.1:16448/vy/collection1/
[junit4:junit4]   2> 5379 T3053 oasc.ZkController.register No LogReplay needed for core=collection1 baseURL=http://127.0.0.1:16448/vy
[junit4:junit4]   2> 5379 T3053 oasc.ZkController.checkRecovery I am the leader, no recovery necessary
[junit4:junit4]   2> 5379 T3053 oasc.ZkController.publish publishing core=collection1 state=active
[junit4:junit4]   2> 5379 T3053 oasc.ZkController.publish numShards not found on descriptor - reading it from system property
[junit4:junit4]   2> 5381 T3053 oascc.ZkStateReader.updateClusterState Updating cloud state from ZooKeeper... 
[junit4:junit4]   2> 5382 T3011 oass.SolrDispatchFilter.init user.dir=/usr/home/hudson/hudson-slave/workspace/Lucene-Solr-Tests-4.x-Java6/solr/build/solr-core/test/J1
[junit4:junit4]   2> 5383 T3011 oass.SolrDispatchFilter.init SolrDispatchFilter.init() done
[junit4:junit4]   2> 5384 T3011 oascsi.HttpClientUtil.createClient Creating new http client, config:maxConnections=128&maxConnectionsPerHost=32&followRedirects=false
[junit4:junit4]   2> 5577 T3011 oejs.Server.doStart jetty-8.1.8.v20121106
[junit4:junit4]   2> 5580 T3011 oejs.AbstractConnector.doStart Started SocketConnector@127.0.0.1:19730
[junit4:junit4]   2> 5582 T3011 oasc.SolrResourceLoader.locateSolrHome JNDI not configured for solr (NoInitialContextEx)
[junit4:junit4]   2> 5582 T3011 oasc.SolrResourceLoader.locateSolrHome using system property solr.solr.home: /usr/home/hudson/hudson-slave/workspace/Lucene-Solr-Tests-4.x-Java6/solr/build/solr-core/test/J1/./org.apache.solr.cloud.SyncSliceTest-jetty2-1355849595738
[junit4:junit4]   2> 5583 T3011 oasc.SolrResourceLoader.<init> new SolrResourceLoader for deduced Solr Home: '/usr/home/hudson/hudson-slave/workspace/Lucene-Solr-Tests-4.x-Java6/solr/build/solr-core/test/J1/./org.apache.solr.cloud.SyncSliceTest-jetty2-1355849595738/'
[junit4:junit4]   2> 5625 T3011 oass.SolrDispatchFilter.init SolrDispatchFilter.init()
[junit4:junit4]   2> 5626 T3011 oasc.SolrResourceLoader.locateSolrHome JNDI not configured for solr (NoInitialContextEx)
[junit4:junit4]   2> 5627 T3011 oasc.SolrResourceLoader.locateSolrHome using system property solr.solr.home: /usr/home/hudson/hudson-slave/workspace/Lucene-Solr-Tests-4.x-Java6/solr/build/solr-core/test/J1/./org.apache.solr.cloud.SyncSliceTest-jetty2-1355849595738
[junit4:junit4]   2> 5627 T3011 oasc.CoreContainer$Initializer.initialize looking for solr.xml: /usr/home/hudson/hudson-slave/workspace/Lucene-Solr-Tests-4.x-Java6/solr/build/solr-core/test/J1/./org.apache.solr.cloud.SyncSliceTest-jetty2-1355849595738/solr.xml
[junit4:junit4]   2> 5628 T3011 oasc.CoreContainer.<init> New CoreContainer 672089490
[junit4:junit4]   2> 5629 T3011 oasc.CoreContainer.load Loading CoreContainer using Solr Home: '/usr/home/hudson/hudson-slave/workspace/Lucene-Solr-Tests-4.x-Java6/solr/build/solr-core/test/J1/./org.apache.solr.cloud.SyncSliceTest-jetty2-1355849595738/'
[junit4:junit4]   2> 5629 T3011 oasc.SolrResourceLoader.<init> new SolrResourceLoader for directory: '/usr/home/hudson/hudson-slave/workspace/Lucene-Solr-Tests-4.x-Java6/solr/build/solr-core/test/J1/./org.apache.solr.cloud.SyncSliceTest-jetty2-1355849595738/'
[junit4:junit4]   2> 5655 T3011 oashc.HttpShardHandlerFactory.getParameter Setting socketTimeout to: 30000
[junit4:junit4]   2> 5656 T3011 oashc.HttpShardHandlerFactory.getParameter Setting urlScheme to: http://
[junit4:junit4]   2> 5657 T3011 oashc.HttpShardHandlerFactory.getParameter Setting connTimeout to: 15000
[junit4:junit4]   2> 5657 T3011 oashc.HttpShardHandlerFactory.getParameter Setting maxConnectionsPerHost to: 20
[junit4:junit4]   2> 5658 T3011 oashc.HttpShardHandlerFactory.getParameter Setting corePoolSize to: 0
[junit4:junit4]   2> 5658 T3011 oashc.HttpShardHandlerFactory.getParameter Setting maximumPoolSize to: 2147483647
[junit4:junit4]   2> 5659 T3011 oashc.HttpShardHandlerFactory.getParameter Setting maxThreadIdleTime to: 5
[junit4:junit4]   2> 5660 T3011 oashc.HttpShardHandlerFactory.getParameter Setting sizeOfQueue to: -1
[junit4:junit4]   2> 5660 T3011 oashc.HttpShardHandlerFactory.getParameter Setting fairnessPolicy to: false
[junit4:junit4]   2> 5661 T3011 oascsi.HttpClientUtil.createClient Creating new http client, config:maxConnectionsPerHost=20&maxConnections=10000&socketTimeout=30000&connTimeout=15000&retry=false
[junit4:junit4]   2> 5683 T3011 oasc.CoreContainer.load Registering Log Listener
[junit4:junit4]   2> 5703 T3011 oasc.CoreContainer.initZooKeeper Zookeeper client=127.0.0.1:24624/solr
[junit4:junit4]   2> 5704 T3011 oasc.ZkController.checkChrootPath zkHost includes chroot
[junit4:junit4]   2> 5705 T3011 oaz.ZooKeeper.<init> Initiating client connection, connectString=127.0.0.1:24624 sessionTimeout=60000 watcher=org.apache.solr.common.cloud.ConnectionManager@7974871e
[junit4:junit4]   2> 5706 T3011 oascc.ConnectionManager.waitForConnected Waiting for client to connect to ZooKeeper
[junit4:junit4]   2> 5706 T3064 oaz.ClientCnxn$SendThread.logStartConnect Opening socket connection to server localhost/127.0.0.1:24624. Will not attempt to authenticate using SASL (access denied (javax.security.auth.AuthPermission getLoginConfiguration))
[junit4:junit4]   2> 5707 T3064 oaz.ClientCnxn$SendThread.primeConnection Socket connection established to localhost/127.0.0.1:24624, initiating session
[junit4:junit4]   2> 5707 T3013 oazs.NIOServerCnxnFactory.run Accepted socket connection from /140.211.11.196:16611
[junit4:junit4]   2> 5708 T3013 oazs.ZooKeeperServer.processConnectRequest Client attempting to establish new session at /140.211.11.196:16611
[junit4:junit4]   2> 5710 T3015 oazs.ZooKeeperServer.finishSessionInit Established session 0x13baeeee6510007 with negotiated timeout 20000 for client /140.211.11.196:16611
[junit4:junit4]   2> 5710 T3064 oaz.ClientCnxn$SendThread.onConnected Session establishment complete on server localhost/127.0.0.1:24624, sessionid = 0x13baeeee6510007, negotiated timeout = 20000
[junit4:junit4]   2> 5710 T3065 oascc.ConnectionManager.process Watcher org.apache.solr.common.cloud.ConnectionManager@7974871e name:ZooKeeperConnection Watcher:127.0.0.1:24624 got event WatchedEvent state:SyncConnected type:None path:null path:null type:None
[junit4:junit4]   2> 5711 T3011 oascc.ConnectionManager.waitForConnected Client is connected to ZooKeeper
[junit4:junit4]   2> 5712 T3016 oazs.PrepRequestProcessor.pRequest2Txn Processed session termination for sessionid: 0x13baeeee6510007
[junit4:junit4]   2> 5723 T3065 oaz.ClientCnxn$EventThread.run EventThread shut down
[junit4:junit4]   2> 5723 T3013 oazs.NIOServerCnxn.closeSock Closed socket connection for client /140.211.11.196:16611 which had sessionid 0x13baeeee6510007
[junit4:junit4]   2> 5723 T3011 oaz.ZooKeeper.close Session: 0x13baeeee6510007 closed
[junit4:junit4]   2> 5723 T3011 oascsi.HttpClientUtil.createClient Creating new http client, config:maxConnections=500&maxConnectionsPerHost=16&socketTimeout=15000&connTimeout=30000
[junit4:junit4]   2> 5734 T3011 oaz.ZooKeeper.<init> Initiating client connection, connectString=127.0.0.1:24624/solr sessionTimeout=30000 watcher=org.apache.solr.common.cloud.ConnectionManager@5ea7bc81
[junit4:junit4]   2> 5735 T3011 oascc.ConnectionManager.waitForConnected Waiting for client to connect to ZooKeeper
[junit4:junit4]   2> 5736 T3066 oaz.ClientCnxn$SendThread.logStartConnect Opening socket connection to server localhost/127.0.0.1:24624. Will not attempt to authenticate using SASL (access denied (javax.security.auth.AuthPermission getLoginConfiguration))
[junit4:junit4]   2> 5737 T3066 oaz.ClientCnxn$SendThread.primeConnection Socket connection established to localhost/127.0.0.1:24624, initiating session
[junit4:junit4]   2> 5737 T3013 oazs.NIOServerCnxnFactory.run Accepted socket connection from /140.211.11.196:26129
[junit4:junit4]   2> 5737 T3013 oazs.ZooKeeperServer.processConnectRequest Client attempting to establish new session at /140.211.11.196:26129
[junit4:junit4]   2> 5738 T3015 oazs.ZooKeeperServer.finishSessionInit Established session 0x13baeeee6510008 with negotiated timeout 20000 for client /140.211.11.196:26129
[junit4:junit4]   2> 5738 T3066 oaz.ClientCnxn$SendThread.onConnected Session establishment complete on server localhost/127.0.0.1:24624, sessionid = 0x13baeeee6510008, negotiated timeout = 20000
[junit4:junit4]   2> 5739 T3067 oascc.ConnectionManager.process Watcher org.apache.solr.common.cloud.ConnectionManager@5ea7bc81 name:ZooKeeperConnection Watcher:127.0.0.1:24624/solr got event WatchedEvent state:SyncConnected type:None path:null path:null type:None
[junit4:junit4]   2> 5739 T3011 oascc.ConnectionManager.waitForConnected Client is connected to ZooKeeper
[junit4:junit4]   2> 5740 T3016 oazs.PrepRequestProcessor.pRequest Got user-level KeeperException when processing sessionid:0x13baeeee6510008 type:create cxid:0x1 zxid:0x6d txntype:-1 reqpath:n/a Error Path:/solr/overseer Error:KeeperErrorCode = NodeExists for /solr/overseer
[junit4:junit4]   2> 5746 T3016 oazs.PrepRequestProcessor.pRequest Got user-level KeeperException when processing sessionid:0x13baeeee6510008 type:create cxid:0x2 zxid:0x6e txntype:-1 reqpath:n/a Error Path:/solr/overseer Error:KeeperErrorCode = NodeExists for /solr/overseer
[junit4:junit4]   2> 5747 T3011 oasc.ZkController.createEphemeralLiveNode Register node as live in ZooKeeper:/live_nodes/127.0.0.1:19730_vy
[junit4:junit4]   2> 5748 T3016 oazs.PrepRequestProcessor.pRequest Got user-level KeeperException when processing sessionid:0x13baeeee6510008 type:delete cxid:0x4 zxid:0x6f txntype:-1 reqpath:n/a Error Path:/solr/live_nodes/127.0.0.1:19730_vy Error:KeeperErrorCode = NoNode for /solr/live_nodes/127.0.0.1:19730_vy
[junit4:junit4]   2> 5750 T3011 oascc.SolrZkClient.makePath makePath: /live_nodes/127.0.0.1:19730_vy
[junit4:junit4]   2> 5752 T3039 oascc.ZkStateReader$2.process A cluster state change: WatchedEvent state:SyncConnected type:NodeChildrenChanged path:/live_nodes, has occurred - updating... (live nodes size: 2)
[junit4:junit4]   2> 5752 T3033 oascc.ZkStateReader$3.process Updating live nodes... (3)
[junit4:junit4]   2> 5752 T3052 oascc.ZkStateReader$3.process Updating live nodes... (3)
[junit4:junit4]   2> 5753 T3033 oascc.ZkStateReader$2.process A cluster state change: WatchedEvent state:SyncConnected type:NodeChildrenChanged path:/live_nodes, has occurred - updating... (live nodes size: 3)
[junit4:junit4]   2> 5753 T3052 oascc.ZkStateReader$2.process A cluster state change: WatchedEvent state:SyncConnected type:NodeChildrenChanged path:/live_nodes, has occurred - updating... (live nodes size: 3)
[junit4:junit4]   2> 5761 T3039 oascc.ZkStateReader$3.process Updating live nodes... (3)
[junit4:junit4]   2> 5762 T3011 oascc.ZkStateReader.createClusterStateWatchersAndUpdate Updating cluster state from ZooKeeper... 
[junit4:junit4]   2> 5770 T3068 oasc.CoreContainer.create Creating SolrCore 'collection1' using instanceDir: /usr/home/hudson/hudson-slave/workspace/Lucene-Solr-Tests-4.x-Java6/solr/build/solr-core/test/J1/./org.apache.solr.cloud.SyncSliceTest-jetty2-1355849595738/collection1
[junit4:junit4]   2> 5771 T3068 oasc.ZkController.createCollectionZkNode Check for collection zkNode:collection1
[junit4:junit4]   2> 5771 T3068 oasc.ZkController.createCollectionZkNode Collection zkNode exists
[junit4:junit4]   2> 5772 T3068 oasc.ZkController.readConfigName Load collection config from:/collections/collection1
[junit4:junit4]   2> 5773 T3068 oasc.SolrResourceLoader.<init> new SolrResourceLoader for directory: '/usr/home/hudson/hudson-slave/workspace/Lucene-Solr-Tests-4.x-Java6/solr/build/solr-core/test/J1/./org.apache.solr.cloud.SyncSliceTest-jetty2-1355849595738/collection1/'
[junit4:junit4]   2> 5774 T3068 oasc.SolrResourceLoader.replaceClassLoader Adding 'file:/usr/home/hudson/hudson-slave/workspace/Lucene-Solr-Tests-4.x-Java6/solr/build/solr-core/test/J1/org.apache.solr.cloud.SyncSliceTest-jetty2-1355849595738/collection1/lib/README' to classloader
[junit4:junit4]   2> 5775 T3068 oasc.SolrResourceLoader.replaceClassLoader Adding 'file:/usr/home/hudson/hudson-slave/workspace/Lucene-Solr-Tests-4.x-Java6/solr/build/solr-core/test/J1/org.apache.solr.cloud.SyncSliceTest-jetty2-1355849595738/collection1/lib/classes/' to classloader
[junit4:junit4]   2> 5830 T3068 oasc.SolrConfig.<init> Using Lucene MatchVersion: LUCENE_41
[junit4:junit4]   2> 5865 T3034 oascc.ZkStateReader.updateClusterState Updating cloud state from ZooKeeper... 
[junit4:junit4]   2> 5866 T3034 oasc.Overseer$ClusterStateUpdater.updateState Update state numShards=1 message={
[junit4:junit4]   2> 	  "operation":"state",
[junit4:junit4]   2> 	  "numShards":"1",
[junit4:junit4]   2> 	  "shard":"shard1",
[junit4:junit4]   2> 	  "roles":null,
[junit4:junit4]   2> 	  "state":"active",
[junit4:junit4]   2> 	  "core":"collection1",
[junit4:junit4]   2> 	  "collection":"collection1",
[junit4:junit4]   2> 	  "node_name":"127.0.0.1:16448_vy",
[junit4:junit4]   2> 	  "base_url":"http://127.0.0.1:16448/vy"}
[junit4:junit4]   2> 5878 T3033 oascc.ZkStateReader$2.process A cluster state change: WatchedEvent state:SyncConnected type:NodeDataChanged path:/clusterstate.json, has occurred - updating... (live nodes size: 3)
[junit4:junit4]   2> 5878 T3039 oascc.ZkStateReader$2.process A cluster state change: WatchedEvent state:SyncConnected type:NodeDataChanged path:/clusterstate.json, has occurred - updating... (live nodes size: 3)
[junit4:junit4]   2> 5878 T3067 oascc.ZkStateReader$2.process A cluster state change: WatchedEvent state:SyncConnected type:NodeDataChanged path:/clusterstate.json, has occurred - updating... (live nodes size: 3)
[junit4:junit4]   2> 5878 T3052 oascc.ZkStateReader$2.process A cluster state change: WatchedEvent state:SyncConnected type:NodeDataChanged path:/clusterstate.json, has occurred - updating... (live nodes size: 3)
[junit4:junit4]   2> 5905 T3068 oasc.SolrConfig.<init> Loaded SolrConfig: solrconfig.xml
[junit4:junit4]   2> 6006 T3068 oass.IndexSchema.readSchema Reading Solr Schema
[junit4:junit4]   2> 6013 T3068 oass.IndexSchema.readSchema Schema name=test
[junit4:junit4]   2> 6472 T3068 oass.OpenExchangeRatesOrgProvider.init Initialized with rates=open-exchange-rates.json, refreshInterval=1440.
[junit4:junit4]   2> 6481 T3068 oass.IndexSchema.readSchema default search field in schema is text
[junit4:junit4]   2> 6484 T3068 oass.IndexSchema.readSchema unique key field: id
[junit4:junit4]   2> 6492 T3068 oass.FileExchangeRateProvider.reload Reloading exchange rates from file currency.xml
[junit4:junit4]   2> 6496 T3068 oass.FileExchangeRateProvider.reload Reloading exchange rates from file currency.xml
[junit4:junit4]   2> 6499 T3068 oass.OpenExchangeRatesOrgProvider.reload Reloading exchange rates from open-exchange-rates.json
[junit4:junit4]   2> 6500 T3068 oass.OpenExchangeRatesOrgProvider.reload Reloading exchange rates from open-exchange-rates.json
[junit4:junit4]   2> 6500 T3068 oasc.SolrCore.<init> [collection1] Opening new SolrCore at /usr/home/hudson/hudson-slave/workspace/Lucene-Solr-Tests-4.x-Java6/solr/build/solr-core/test/J1/./org.apache.solr.cloud.SyncSliceTest-jetty2-1355849595738/collection1/, dataDir=./org.apache.solr.cloud.SyncSliceTest-1355849590345/jetty2/
[junit4:junit4]   2> 6501 T3068 oasc.JmxMonitoredMap.<init> JMX monitoring is enabled. Adding Solr mbeans to JMX Server: com.sun.jmx.mbeanserver.JmxMBeanServer@26c1186f
[junit4:junit4]   2> 6501 T3068 oasc.SolrCore.initDirectoryFactory solr.NRTCachingDirectoryFactory
[junit4:junit4]   2> 6502 T3068 oasc.CachingDirectoryFactory.get return new directory for /usr/home/hudson/hudson-slave/workspace/Lucene-Solr-Tests-4.x-Java6/solr/build/solr-core/test/J1/./org.apache.solr.cloud.SyncSliceTest-1355849590345/jetty2 forceNew:false
[junit4:junit4]   2> 6502 T3068 oasc.CachingDirectoryFactory.close Releasing directory:/usr/home/hudson/hudson-slave/workspace/Lucene-Solr-Tests-4.x-Java6/solr/build/solr-core/test/J1/./org.apache.solr.cloud.SyncSliceTest-1355849590345/jetty2
[junit4:junit4]   2> 6502 T3068 oasc.SolrCore.getNewIndexDir New index directory detected: old=null new=./org.apache.solr.cloud.SyncSliceTest-1355849590345/jetty2/index/
[junit4:junit4]   2> 6503 T3068 oasc.SolrCore.initIndex WARNING [collection1] Solr index directory './org.apache.solr.cloud.SyncSliceTest-1355849590345/jetty2/index' doesn't exist. Creating new index...
[junit4:junit4]   2> 6504 T3068 oasc.CachingDirectoryFactory.get return new directory for /usr/home/hudson/hudson-slave/workspace/Lucene-Solr-Tests-4.x-Java6/solr/build/solr-core/test/J1/./org.apache.solr.cloud.SyncSliceTest-1355849590345/jetty2/index forceNew:false
[junit4:junit4]   2> 6526 T3068 oasc.SolrDeletionPolicy.onCommit SolrDeletionPolicy.onCommit: commits:num=1
[junit4:junit4]   2> 		commit{dir=RateLimitedDirectoryWrapper(NRTCachingDirectory(org.apache.lucene.store.NIOFSDirectory@/usr/home/hudson/hudson-slave/workspace/Lucene-Solr-Tests-4.x-Java6/solr/build/solr-core/test/J1/org.apache.solr.cloud.SyncSliceTest-1355849590345/jetty2/index lockFactory=org.apache.lucene.store.NativeFSLockFactory@263ef374; maxCacheMB=48.0 maxMergeSizeMB=4.0)),segFN=segments_1,generation=1,filenames=[segments_1]
[junit4:junit4]   2> 6526 T3068 oasc.SolrDeletionPolicy.updateCommits newest commit = 1[segments_1]
[junit4:junit4]   2> 6527 T3068 oasc.CachingDirectoryFactory.close Releasing directory:/usr/home/hudson/hudson-slave/workspace/Lucene-Solr-Tests-4.x-Java6/solr/build/solr-core/test/J1/./org.apache.solr.cloud.SyncSliceTest-1355849590345/jetty2/index
[junit4:junit4]   2> 6527 T3068 oasc.SolrCore.initWriters created xml: solr.XMLResponseWriter
[junit4:junit4]   2> 6529 T3068 oasup.UpdateRequestProcessorChain.init inserting DistributedUpdateProcessorFactory into updateRequestProcessorChain "dedupe"
[junit4:junit4]   2> 6529 T3068 oasup.UpdateRequestProcessorChain.init inserting DistributedUpdateProcessorFactory into updateRequestProcessorChain "dedupe-allfields"
[junit4:junit4]   2> 6529 T3068 oasup.UpdateRequestProcessorChain.init inserting DistributedUpdateProcessorFactory into updateRequestProcessorChain "stored_sig"
[junit4:junit4]   2> 6530 T3068 oasup.UpdateRequestProcessorChain.init inserting DistributedUpdateProcessorFactory into updateRequestProcessorChain "uniq-fields"
[junit4:junit4]   2> 6530 T3068 oasup.UpdateRequestProcessorChain.init inserting DistributedUpdateProcessorFactory into updateRequestProcessorChain "distrib-dup-test-chain-implicit"
[junit4:junit4]   2> 6530 T3068 oasc.RequestHandlers.initHandlersFromConfig adding lazy requestHandler: solr.ReplicationHandler
[junit4:junit4]   2> 6531 T3068 oasc.RequestHandlers.initHandlersFromConfig created /replication: solr.ReplicationHandler
[junit4:junit4]   2> 6531 T3068 oasc.RequestHandlers.initHandlersFromConfig created standard: solr.StandardRequestHandler
[junit4:junit4]   2> 6532 T3068 oasc.RequestHandlers.initHandlersFromConfig created /get: solr.RealTimeGetHandler
[junit4:junit4]   2> 6533 T3068 oasc.RequestHandlers.initHandlersFromConfig created dismax: solr.SearchHandler
[junit4:junit4]   2> 6534 T3068 oasc.RequestHandlers.initHandlersFromConfig created mock: org.apache.solr.core.MockQuerySenderListenerReqHandler
[junit4:junit4]   2> 6534 T3068 oasc.RequestHandlers.initHandlersFromConfig created /admin/: org.apache.solr.handler.admin.AdminHandlers
[junit4:junit4]   2> 6535 T3068 oasc.RequestHandlers.initHandlersFromConfig created defaults: solr.StandardRequestHandler
[junit4:junit4]   2> 6535 T3068 oasc.RequestHandlers.initHandlersFromConfig adding lazy requestHandler: solr.StandardRequestHandler
[junit4:junit4]   2> 6535 T3068 oasc.RequestHandlers.initHandlersFromConfig created lazy: solr.StandardRequestHandler
[junit4:junit4]   2> 6536 T3068 oasc.RequestHandlers.initHandlersFromConfig created /update: solr.UpdateRequestHandler
[junit4:junit4]   2> 6537 T3068 oasc.RequestHandlers.initHandlersFromConfig created /terms: org.apache.solr.handler.component.SearchHandler
[junit4:junit4]   2> 6538 T3068 oasc.RequestHandlers.initHandlersFromConfig created spellCheckCompRH: org.apache.solr.handler.component.SearchHandler
[junit4:junit4]   2> 6538 T3068 oasc.RequestHandlers.initHandlersFromConfig created spellCheckCompRH_Direct: org.apache.solr.handler.component.SearchHandler
[junit4:junit4]   2> 6539 T3068 oasc.RequestHandlers.initHandlersFromConfig created spellCheckWithWordbreak: org.apache.solr.handler.component.SearchHandler
[junit4:junit4]   2> 6540 T3068 oasc.RequestHandlers.initHandlersFromConfig created spellCheckWithWordbreak_Direct: org.apache.solr.handler.component.SearchHandler
[junit4:junit4]   2> 6540 T3068 oasc.RequestHandlers.initHandlersFromConfig created spellCheckCompRH1: org.apache.solr.handler.component.SearchHandler
[junit4:junit4]   2> 6541 T3068 oasc.RequestHandlers.initHandlersFromConfig created mltrh: org.apache.solr.handler.component.SearchHandler
[junit4:junit4]   2> 6542 T3068 oasc.RequestHandlers.initHandlersFromConfig created tvrh: org.apache.solr.handler.component.SearchHandler
[junit4:junit4]   2> 6542 T3068 oasc.RequestHandlers.initHandlersFromConfig created /mlt: solr.MoreLikeThisHandler
[junit4:junit4]   2> 6543 T3068 oasc.RequestHandlers.initHandlersFromConfig created /debug/dump: solr.DumpRequestHandler
[junit4:junit4]   2> 6548 T3068 oashl.XMLLoader.init xsltCacheLifetimeSeconds=60
[junit4:junit4]   2> 6552 T3068 oasc.SolrCore.initDeprecatedSupport WARNING solrconfig.xml uses deprecated <admin/gettableFiles>, Please update your config to use the ShowFileRequestHandler.
[junit4:junit4]   2> 6553 T3068 oasc.SolrCore.initDeprecatedSupport WARNING adding ShowFileRequestHandler with hidden files: [SCHEMA.XML, OLD_SYNONYMS.TXT, STOPWORDS.TXT, PROTWORDS.TXT, OPEN-EXCHANGE-RATES.JSON, SYNONYMS.TXT, CURRENCY.XML, MAPPING-ISOLATIN1ACCENT.TXT]
[junit4:junit4]   2> 6555 T3068 oasc.CachingDirectoryFactory.close Releasing directory:/usr/home/hudson/hudson-slave/workspace/Lucene-Solr-Tests-4.x-Java6/solr/build/solr-core/test/J1/./org.apache.solr.cloud.SyncSliceTest-1355849590345/jetty2
[junit4:junit4]   2> 6556 T3068 oass.SolrIndexSearcher.<init> Opening Searcher@22591f2f main
[junit4:junit4]   2> 6557 T3068 oasu.CommitTracker.<init> Hard AutoCommit: disabled
[junit4:junit4]   2> 6557 T3068 oasu.CommitTracker.<init> Soft AutoCommit: disabled
[junit4:junit4]   2> 6557 T3068 oashc.SpellCheckComponent.inform Initializing spell checkers
[junit4:junit4]   2> 6563 T3068 oass.DirectSolrSpellChecker.init init: {name=direct,classname=DirectSolrSpellChecker,field=lowerfilt,minQueryLength=3}
[junit4:junit4]   2> 6608 T3069 oasc.SolrCore.registerSearcher [collection1] Registered new searcher Searcher@22591f2f main{StandardDirectoryReader(segments_1:1)}
[junit4:junit4]   2> 6610 T3068 oasc.ZkController.publish publishing core=collection1 state=down
[junit4:junit4]   2> 6611 T3068 oasc.ZkController.publish numShards not found on descriptor - reading it from system property
[junit4:junit4]   2> 6885 T3034 oascc.ZkStateReader.updateClusterState Updating cloud state from ZooKeeper... 
[junit4:junit4]   2> 6885 T3034 oasc.Overseer$ClusterStateUpdater.updateState Update state numShards=1 message={
[junit4:junit4]   2> 	  "operation":"state",
[junit4:junit4]   2> 	  "numShards":"1",
[junit4:junit4]   2> 	  "shard":null,
[junit4:junit4]   2> 	  "roles":null,
[junit4:junit4]   2> 	  "state":"down",
[junit4:junit4]   2> 	  "core":"collection1",
[junit4:junit4]   2> 	  "collection":"collection1",
[junit4:junit4]   2> 	  "node_name":"127.0.0.1:19730_vy",
[junit4:junit4]   2> 	  "base_url":"http://127.0.0.1:19730/vy"}
[junit4:junit4]   2> 6886 T3034 oasc.Overseer$ClusterStateUpdater.updateState Collection already exists with numShards=1
[junit4:junit4]   2> 6886 T3034 oasc.Overseer$ClusterStateUpdater.updateState Assigning new node to shard shard=shard1
[junit4:junit4]   2> 6907 T3033 oascc.ZkStateReader$2.process A cluster state change: WatchedEvent state:SyncConnected type:NodeDataChanged path:/clusterstate.json, has occurred - updating... (live nodes size: 3)
[junit4:junit4]   2> 6908 T3052 oascc.ZkStateReader$2.process A cluster state change: WatchedEvent state:SyncConnected type:NodeDataChanged path:/clusterstate.json, has occurred - updating... (live nodes size: 3)
[junit4:junit4]   2> 6907 T3067 oascc.ZkStateReader$2.process A cluster state change: WatchedEvent state:SyncConnected type:NodeDataChanged path:/clusterstate.json, has occurred - updating... (live nodes size: 3)
[junit4:junit4]   2> 6907 T3039 oascc.ZkStateReader$2.process A cluster state change: WatchedEvent state:SyncConnected type:NodeDataChanged path:/clusterstate.json, has occurred - updating... (live nodes size: 3)
[junit4:junit4]   2> 7113 T3068 oasc.CoreContainer.registerCore registering core: collection1
[junit4:junit4]   2> 7113 T3068 oasc.ZkController.register Register replica - core:collection1 address:http://127.0.0.1:19730/vy collection:collection1 shard:shard1
[junit4:junit4]   2> 7120 T3068 oasc.ZkController.register We are http://127.0.0.1:19730/vy/collection1/ and leader is http://127.0.0.1:16448/vy/collection1/
[junit4:junit4]   2> 7120 T3068 oasc.ZkController.register No LogReplay needed for core=collection1 baseURL=http://127.0.0.1:19730/vy
[junit4:junit4]   2> 7120 T3068 oasc.ZkController.checkRecovery Core needs to recover:collection1
[junit4:junit4]   2> 7120 T3068 oasu.DefaultSolrCoreState.doRecovery Running recovery - first canceling any ongoing recovery
[junit4:junit4]   2> ASYNC  NEW_CORE C183 name=collection1 org.apache.solr.core.SolrCore@50d9a22c url=http://127.0.0.1:19730/vy/collection1 node=127.0.0.1:19730_vy C183_STATE=coll:collection1 core:collection1 props:{shard=null, roles=null, state=down, core=collection1, collection=collection1, node_name=127.0.0.1:19730_vy, base_url=http://127.0.0.1:19730/vy}
[junit4:junit4]   2> 7121 T3070 C183 P19730 oasc.RecoveryStrategy.run Starting recovery process.  core=collection1 recoveringAfterStartup=true
[junit4:junit4]   2> 7121 T3068 oascc.ZkStateReader.updateClusterState Updating cloud state from ZooKeeper... 
[junit4:junit4]   2> 7122 T3070 C183 P19730 oasc.RecoveryStrategy.doRecovery ###### startupVersions=[]
[junit4:junit4]   2> 7123 T3070 C183 P19730 oasc.ZkController.publish publishing core=collection1 state=recovering
[junit4:junit4]   2> 7123 T3070 C183 P19730 oasc.ZkController.publish numShards not found on descriptor - reading it from system property
[junit4:junit4]   2> 7123 T3011 oass.SolrDispatchFilter.init user.dir=/usr/home/hudson/hudson-slave/workspace/Lucene-Solr-Tests-4.x-Java6/solr/build/solr-core/test/J1
[junit4:junit4]   2> 7124 T3070 C183 P19730 oasc.RecoveryStrategy.doRecovery Attempting to PeerSync from http://127.0.0.1:16448/vy/collection1/ core=collection1 - recoveringAfterStartup=true
[junit4:junit4]   2> 7124 T3011 oass.SolrDispatchFilter.init SolrDispatchFilter.init() done
[junit4:junit4]   2> 7125 T3070 C183 P19730 oasu.PeerSync.sync PeerSync: core=collection1 url=http://127.0.0.1:19730/vy START replicas=[http://127.0.0.1:16448/vy/collection1/] nUpdates=100
[junit4:junit4]   2> 7125 T3011 oascsi.HttpClientUtil.createClient Creating new http client, config:maxConnections=128&maxConnectionsPerHost=32&followRedirects=false
[junit4:junit4]   2> 7125 T3070 C183 P19730 oasu.PeerSync.sync WARNING no frame of reference to tell of we've missed updates
[junit4:junit4]   2> 7126 T3070 C183 P19730 oasc.RecoveryStrategy.doRecovery PeerSync Recovery was not successful - trying replication. core=collection1
[junit4:junit4]   2> 7126 T3070 C183 P19730 oasc.RecoveryStrategy.doRecovery Starting Replication Recovery. core=collection1
[junit4:junit4]   2> 7126 T3070 C183 P19730 oascsi.HttpClientUtil.createClient Creating new http client, config:maxConnections=128&maxConnectionsPerHost=32&followRedirects=false
[junit4:junit4]   2> ASYNC  NEW_CORE C184 name=collection1 org.apache.solr.core.SolrCore@4e06605a url=http://127.0.0.1:16448/vy/collection1 node=127.0.0.1:16448_vy C184_STATE=coll:collection1 core:collection1 props:{shard=shard1, roles=null, state=active, core=collection1, collection=collection1, node_name=127.0.0.1:16448_vy, base_url=http://127.0.0.1:16448/vy, leader=true}
[junit4:junit4]   2> 7136 T3042 C184 P16448 REQ /get {distrib=false&qt=/get&wt=javabin&version=2&getVersions=100} status=0 QTime=0 
[junit4:junit4]   2> 7307 T3011 oejs.Server.doStart jetty-8.1.8.v20121106
[junit4:junit4]   2> 7318 T3011 oejs.AbstractConnector.doStart Started SocketConnector@127.0.0.1:56215
[junit4:junit4]   2> 7319 T3011 oasc.SolrResourceLoader.locateSolrHome JNDI not configured for solr (NoInitialContextEx)
[junit4:junit4]   2> 7320 T3011 oasc.SolrResourceLoader.locateSolrHome using system property solr.solr.home: /usr/home/hudson/hudson-slave/workspace/Lucene-Solr-Tests-4.x-Java6/solr/build/solr-core/test/J1/./org.apache.solr.cloud.SyncSliceTest-jetty3-1355849597483
[junit4:junit4]   2> 7320 T3011 oasc.SolrResourceLoader.<init> new SolrResourceLoader for deduced Solr Home: '/usr/home/hudson/hudson-slave/workspace/Lucene-Solr-Tests-4.x-Java6/solr/build/solr-core/test/J1/./org.apache.solr.cloud.SyncSliceTest-jetty3-1355849597483/'
[junit4:junit4]   2> 7359 T3011 oass.SolrDispatchFilter.init SolrDispatchFilter.init()
[junit4:junit4]   2> 7360 T3011 oasc.SolrResourceLoader.locateSolrHome JNDI not configured for solr (NoInitialContextEx)
[junit4:junit4]   2> 7361 T3011 oasc.SolrResourceLoader.locateSolrHome using system property solr.solr.home: /usr/home/hudson/hudson-slave/workspace/Lucene-Solr-Tests-4.x-Java6/solr/build/solr-core/test/J1/./org.apache.solr.cloud.SyncSliceTest-jetty3-1355849597483
[junit4:junit4]   2> 7362 T3011 oasc.CoreContainer$Initializer.initialize looking for solr.xml: /usr/home/hudson/hudson-slave/workspace/Lucene-Solr-Tests-4.x-Java6/solr/build/solr-core/test/J1/./org.apache.solr.cloud.SyncSliceTest-jetty3-1355849597483/solr.xml
[junit4:junit4]   2> 7362 T3011 oasc.CoreContainer.<init> New CoreContainer 593895060
[junit4:junit4]   2> 7363 T3011 oasc.CoreContainer.load Loading CoreContainer using Solr Home: '/usr/home/hudson/hudson-slave/workspace/Lucene-Solr-Tests-4.x-Java6/solr/build/solr-core/test/J1/./org.apache.solr.cloud.SyncSliceTest-jetty3-1355849597483/'
[junit4:junit4]   2> 7364 T3011 oasc.SolrResourceLoader.<init> new SolrResourceLoader for directory: '/usr/home/hudson/hudson-slave/workspace/Lucene-Solr-Tests-4.x-Java6/solr/build/solr-core/test/J1/./org.apache.solr.cloud.SyncSliceTest-jetty3-1355849597483/'
[junit4:junit4]   2> 7389 T3011 oashc.HttpShardHandlerFactory.getParameter Setting socketTimeout to: 30000
[junit4:junit4]   2> 7391 T3011 oashc.HttpShardHandlerFactory.getParameter Setting urlScheme to: http://
[junit4:junit4]   2> 7391 T3011 oashc.HttpShardHandlerFactory.getParameter Setting connTimeout to: 15000
[junit4:junit4]   2> 7392 T3011 oashc.HttpShardHandlerFactory.getParameter Setting maxConnectionsPerHost to: 20
[junit4:junit4]   2> 7392 T3011 oashc.HttpShardHandlerFactory.getParameter Setting corePoolSize to: 0
[junit4:junit4]   2> 7393 T3011 oashc.HttpShardHandlerFactory.getParameter Setting maximumPoolSize to: 2147483647
[junit4:junit4]   2> 7394 T3011 oashc.HttpShardHandlerFactory.getParameter Setting maxThreadIdleTime to: 5
[junit4:junit4]   2> 7394 T3011 oashc.HttpShardHandlerFactory.getParameter Setting sizeOfQueue to: -1
[junit4:junit4]   2> 7395 T3011 oashc.HttpShardHandlerFactory.getParameter Setting fairnessPolicy to: false
[junit4:junit4]   2> 7395 T3011 oascsi.HttpClientUtil.createClient Creating new http client, config:maxConnectionsPerHost=20&maxConnections=10000&socketTimeout=30000&connTimeout=15000&retry=false
[junit4:junit4]   2> 7411 T3034 oascc.ZkStateReader.updateClusterState Updating cloud state from ZooKeeper... 
[junit4:junit4]   2> 7412 T3034 oasc.Overseer$ClusterStateUpdater.updateState Update state numShards=1 message={
[junit4:junit4]   2> 	  "operation":"state",
[junit4:junit4]   2> 	  "numShards":"1",
[junit4:junit4]   2> 	  "shard":"shard1",
[junit4:junit4]   2> 	  "roles":null,
[junit4:junit4]   2> 	  "state":"recovering",
[junit4:junit4]   2> 	  "core":"collection1",
[junit4:junit4]   2> 	  "collection":"collection1",
[junit4:junit4]   2> 	  "node_name":"127.0.0.1:19730_vy",
[junit4:junit4]   2> 	  "base_url":"http://127.0.0.1:19730/vy"}
[junit4:junit4]   2> 7414 T3011 oasc.CoreContainer.load Registering Log Listener
[junit4:junit4]   2> 7433 T3033 oascc.ZkStateReader$2.process A cluster state change: WatchedEvent state:SyncConnected type:NodeDataChanged path:/clusterstate.json, has occurred - updating... (live nodes size: 3)
[junit4:junit4]   2> 7433 T3039 oascc.ZkStateReader$2.process A cluster state change: WatchedEvent state:SyncConnected type:NodeDataChanged path:/clusterstate.json, has occurred - updating... (live nodes size: 3)
[junit4:junit4]   2> 7434 T3067 oascc.ZkStateReader$2.process A cluster state change: WatchedEvent state:SyncConnected type:NodeDataChanged path:/clusterstate.json, has occurred - updating... (live nodes size: 3)
[junit4:junit4]   2> 7433 T3052 oascc.ZkStateReader$2.process A cluster state change: WatchedEvent state:SyncConnected type:NodeDataChanged path:/clusterstate.json, has occurred - updating... (live nodes size: 3)
[junit4:junit4]   2> 7434 T3011 oasc.CoreContainer.initZooKeeper Zookeeper client=127.0.0.1:24624/solr
[junit4:junit4]   2> 7435 T3011 oasc.ZkController.checkChrootPath zkHost includes chroot
[junit4:junit4]   2> 7435 T3011 oaz.ZooKeeper.<init> Initiating client connection, connectString=127.0.0.1:24624 sessionTimeout=60000 watcher=org.apache.solr.common.cloud.ConnectionManager@4a70542e
[junit4:junit4]   2> 7437 T3011 oascc.ConnectionManager.waitForConnected Waiting for client to connect to ZooKeeper
[junit4:junit4]   2> 7437 T3081 oaz.ClientCnxn$SendThread.logStartConnect Opening socket connection to server localhost/127.0.0.1:24624. Will not attempt to authenticate using SASL (access denied (javax.security.auth.AuthPermission getLoginConfiguration))
[junit4:junit4]   2> 7438 T3081 oaz.ClientCnxn$SendThread.primeConnection Socket connection established to localhost/127.0.0.1:24624, initiating session
[junit4:junit4]   2> 7438 T3013 oazs.NIOServerCnxnFactory.run Accepted socket connection from /140.211.11.196:18973
[junit4:junit4]   2> 7438 T3013 oazs.ZooKeeperServer.processConnectRequest Client attempting to establish new session at /140.211.11.196:18973
[junit4:junit4]   2> 7441 T3015 oazs.ZooKeeperServer.finishSessionInit Established session 0x13baeeee6510009 with negotiated timeout 20000 for client /140.211.11.196:18973
[junit4:junit4]   2> 7441 T3081 oaz.ClientCnxn$SendThread.onConnected Session establishment complete on server localhost/127.0.0.1:24624, sessionid = 0x13baeeee6510009, negotiated timeout = 20000
[junit4:junit4]   2> 7442 T3082 oascc.ConnectionManager.process Watcher org.apache.solr.common.cloud.ConnectionManager@4a70542e name:ZooKeeperConnection Watcher:127.0.0.1:24624 got event WatchedEvent state:SyncConnected type:None path:null path:null type:None
[junit4:junit4]   2> 7442 T3011 oascc.ConnectionManager.waitForConnected Client is connected to ZooKeeper
[junit4:junit4]   2> 7444 T3016 oazs.PrepRequestProcessor.pRequest2Txn Processed session termination for sessionid: 0x13baeeee6510009
[junit4:junit4]   2> 7445 T3082 oaz.ClientCnxn$EventThread.run EventThread shut down
[junit4:junit4]   2> 7445 T3013 oazs.NIOServerCnxn.closeSock Closed socket connection for client /140.211.11.196:18973 which had sessionid 0x13baeeee6510009
[junit4:junit4]   2> 7445 T3011 oaz.ZooKeeper.close Session: 0x13baeeee6510009 closed
[junit4:junit4]   2> 7446 T3011 oascsi.HttpClientUtil.createClient Creating new http client, config:maxConnections=500&maxConnectionsPerHost=16&socketTimeout=15000&connTimeout=30000
[junit4:junit4]   2> 7455 T3011 oaz.ZooKeeper.<init> Initiating client connection, connectString=127.0.0.1:24624/solr sessionTimeout=30000 watcher=org.apache.solr.common.cloud.ConnectionManager@4217cef9
[junit4:junit4]   2> 7456 T3083 oaz.ClientCnxn$SendThread.logStartConnect Opening socket connection to server localhost/127.0.0.1:24624. Will not attempt to authenticate using SASL (access denied (javax.security.auth.AuthPermission getLoginConfiguration))
[junit4:junit4]   2> 7456 T3011 oascc.ConnectionManager.waitForConnected Waiting for client to connect to ZooKeeper
[junit4:junit4]   2> 7457 T3083 oaz.ClientCnxn$SendThread.primeConnection Socket connection established to localhost/127.0.0.1:24624, initiating session
[junit4:junit4]   2> 7457 T3013 oazs.NIOServerCnxnFactory.run Accepted socket connection from /140.211.11.196:61053
[junit4:junit4]   2> 7457 T3013 oazs.ZooKeeperServer.processConnectRequest Client attempting to establish new session at /140.211.11.196:61053
[junit4:junit4]   2> 7458 T3015 oazs.ZooKeeperServer.finishSessionInit Established session 0x13baeeee651000a with negotiated timeout 20000 for client /140.211.11.196:61053
[junit4:junit4]   2> 7458 T3083 oaz.ClientCnxn$SendThread.onConnected Session establishment complete on server localhost/127.0.0.1:24624, sessionid = 0x13baeeee651000a, negotiated timeout = 20000
[junit4:junit4]   2> 7459 T3084 oascc.ConnectionManager.process Watcher org.apache.solr.common.cloud.ConnectionManager@4217cef9 name:ZooKeeperConnection Watcher:127.0.0.1:24624/solr got event WatchedEvent state:SyncConnected type:None path:null path:null type:None
[junit4:junit4]   2> 7459 T3011 oascc.ConnectionManager.waitForConnected Client is connected to ZooKeeper
[junit4:junit4]   2> 7460 T3016 oazs.PrepRequestProcessor.pRequest Got user-level KeeperException when processing sessionid:0x13baeeee651000a type:create cxid:0x1 zxid:0x84 txntype:-1 reqpath:n/a Error Path:/solr/overseer Error:KeeperErrorCode = NodeExists for /solr/overseer
[junit4:junit4]   2> 7461 T3016 oazs.PrepRequestProcessor.pRequest Got user-level KeeperException when processing sessionid:0x13baeeee651000a type:create cxid:0x2 zxid:0x85 txntype:-1 reqpath:n/a Error Path:/solr/overseer Error:KeeperErrorCode = NodeExists for /solr/overseer
[junit4:junit4]   2> 7469 T3011 oasc.ZkController.createEphemeralLiveNode Register node as live in ZooKeeper:/live_nodes/127.0.0.1:56215_vy
[junit4:junit4]   2> 7470 T3016 oazs.PrepRequestProcessor.pRequest Got user-level KeeperException when processing sessionid:0x13baeeee651000a type:delete cxid:0x4 zxid:0x86 txntype:-1 reqpath:n/a Error Path:/solr/live_nodes/127.0.0.1:56215_vy Error:KeeperErrorCode = NoNode for /solr/live_nodes/127.0.0.1:56215_vy
[junit4:junit4]   2> 7470 T3011 oascc.SolrZkClient.makePath makePath: /live_nodes/127.0.0.1:56215_vy
[junit4:junit4]   2> 7473 T3067 oascc.ZkStateReader$2.process A cluster state change: WatchedEvent state:SyncConnected type:NodeChildrenChanged path:/live_nodes, has occurred - updating... (live nodes size: 3)
[junit4:junit4]   2> 7473 T3039 oascc.ZkStateReader$2.process A cluster state change: WatchedEvent state:SyncConnected type:NodeChildrenChanged path:/live_nodes, has occurred - updating... (live nodes size: 3)
[junit4:junit4]   2> 7473 T3033 oascc.ZkStateReader$3.process Updating live nodes... (4)
[junit4:junit4]   2> 7474 T3052 oascc.ZkStateReader$3.process Updating live nodes... (4)
[junit4:junit4]   2> 7474 T3033 oascc.ZkStateReader$2.process A cluster state change: WatchedEvent state:SyncConnected type:NodeChildrenChanged path:/live_nodes, has occurred - updating... (live nodes size: 4)
[junit4:junit4]   2> 7474 T3052 oascc.ZkStateReader$2.process A cluster state change: WatchedEvent state:SyncConnected type:NodeChildrenChanged path:/live_nodes, has occurred - updating... (live nodes size: 4)
[junit4:junit4]   2> 7475 T3067 oascc.ZkStateReader$3.process Updating live nodes... (4)
[junit4:junit4]   2> 7475 T3039 oascc.ZkStateReader$3.process Updating live nodes... (4)
[junit4:junit4]   2> 7477 T3011 oascc.ZkStateReader.createClusterStateWatchersAndUpdate Updating cluster state from ZooKeeper... 
[junit4:junit4]   2> 7485 T3085 oasc.CoreContainer.create Creating SolrCore 'collection1' using instanceDir: /usr/home/hudson/hudson-slave/workspace/Lucene-Solr-Tests-4.x-Java6/solr/build/solr-core/test/J1/./org.apache.solr.cloud.SyncSliceTest-jetty3-1355849597483/collection1
[junit4:junit4]   2> 7485 T3085 oasc.ZkController.createCollectionZkNode Check for collection zkNode:collection1
[junit4:junit4]   2> 7486 T3085 oasc.ZkController.createCollectionZkNode Collection zkNode exists
[junit4:junit4]   2> 7486 T3085 oasc.ZkController.readConfigName Load collection config from:/collections/collection1
[junit4:junit4]   2> 7488 T3085 oasc.SolrResourceLoader.<init> new SolrResourceLoader for directory: '/usr/home/hudson/hudson-slave/workspace/Lucene-Solr-Tests-4.x-Java6/solr/build/solr-core/test/J1/./org.apache.solr.cloud.SyncSliceTest-jetty3-1355849597483/collection1/'
[junit4:junit4]   2> 7489 T3085 oasc.SolrResourceLoader.replaceClassLoader Adding 'file:/usr/home/hudson/hudson-slave/workspace/Lucene-Solr-Tests-4.x-Java6/solr/build/solr-core/test/J1/org.apache.solr.cloud.SyncSliceTest-jetty3-1355849597483/collection1/lib/classes/' to classloader
[junit4:junit4]   2> 7490 T3085 oasc.SolrResourceLoader.replaceClassLoader Adding 'file:/usr/home/hudson/hudson-slave/workspace/Lucene-Solr-Tests-4.x-Java6/solr/build/solr-core/test/J1/org.apache.solr.cloud.SyncSliceTest-jetty3-1355849597483/collection1/lib/README' to classloader
[junit4:junit4]   2> 7548 T3085 oasc.SolrConfig.<init> Using Lucene MatchVersion: LUCENE_41
[junit4:junit4]   2> 7625 T3085 oasc.SolrConfig.<init> Loaded SolrConfig: solrconfig.xml
[junit4:junit4]   2> 7726 T3085 oass.IndexSchema.readSchema Reading Solr Schema
[junit4:junit4]   2> 7737 T3085 oass.IndexSchema.readSchema Schema name=test
[junit4:junit4]   2> 8554 T3085 oass.OpenExchangeRatesOrgProvider.init Initialized with rates=open-exchange-rates.json, refreshInterval=1440.
[junit4:junit4]   2> 8567 T3085 oass.IndexSchema.readSchema default search field in schema is text
[junit4:junit4]   2> 8572 T3085 oass.IndexSchema.readSchema unique key field: id
[junit4:junit4]   2> 8583 T3085 oass.FileExchangeRateProvider.reload Reloading exchange rates from file currency.xml
[junit4:junit4]   2> 8588 T3085 oass.FileExchangeRateProvider.reload Reloading exchange rates from file currency.xml
[junit4:junit4]   2> 8593 T3085 oass.OpenExchangeRatesOrgProvider.reload Reloading exchange rates from open-exchange-rates.json
[junit4:junit4]   2> 8594 T3085 oass.OpenExchangeRatesOrgProvider.reload Reloading exchange rates from open-exchange-rates.json
[junit4:junit4]   2> 8595 T3085 oasc.SolrCore.<init> [collection1] Opening new SolrCore at /usr/home/hudson/hudson-slave/workspace/Lucene-Solr-Tests-4.x-Java6/solr/build/solr-core/test/J1/./org.apache.solr.cloud.SyncSliceTest-jetty3-1355849597483/collection1/, dataDir=./org.apache.solr.cloud.SyncSliceTest-1355849590345/jetty3/
[junit4:junit4]   2> 8596 T3085 oasc.JmxMonitoredMap.<init> JMX monitoring is enabled. Adding Solr mbeans to JMX Server: com.sun.jmx.mbeanserver.JmxMBeanServer@26c1186f
[junit4:junit4]   2> 8596 T3085 oasc.SolrCore.initDirectoryFactory solr.NRTCachingDirectoryFactory
[junit4:junit4]   2> 8597 T3085 oasc.CachingDirectoryFactory.get return new directory for /usr/home/hudson/hudson-slave/workspace/Lucene-Solr-Tests-4.x-Java6/solr/build/solr-core/test/J1/./org.apache.solr.cloud.SyncSliceTest-1355849590345/jetty3 forceNew:false
[junit4:junit4]   2> 8598 T3085 oasc.CachingDirectoryFactory.close Releasing directory:/usr/home/hudson/hudson-slave/workspace/Lucene-Solr-Tests-4.x-Java6/solr/build/solr-core/test/J1/./org.apache.solr.cloud.SyncSliceTest-1355849590345/jetty3
[junit4:junit4]   2> 8598 T3085 oasc.SolrCore.getNewIndexDir New index directory detected: old=null new=./org.apache.solr.cloud.SyncSliceTest-1355849590345/jetty3/index/
[junit4:junit4]   2> 8599 T3085 oasc.SolrCore.initIndex WARNING [collection1] Solr index directory './org.apache.solr.cloud.SyncSliceTest-1355849590345/jetty3/index' doesn't exist. Creating new index...
[junit4:junit4]   2> 8600 T3085 oasc.CachingDirectoryFactory.get return new directory for /usr/home/hudson/hudson-slave/workspace/Lucene-Solr-Tests-4.x-Java6/solr/build/solr-core/test/J1/./org.apache.solr.cloud.SyncSliceTest-1355849590345/jetty3/index forceNew:false
[junit4:junit4]   2> 8631 T3085 oasc.SolrDeletionPolicy.onCommit SolrDeletionPolicy.onCommit: commits:num=1
[junit4:junit4]   2> 		commit{dir=RateLimitedDirectoryWrapper(NRTCachingDirectory(org.apache.lucene.store.NIOFSDirectory@/usr/home/hudson/hudson-slave/workspace/Lucene-Solr-Tests-4.x-Java6/solr/build/solr-core/test/J1/org.apache.solr.cloud.SyncSliceTest-1355849590345/jetty3/index lockFactory=org.apache.lucene.store.NativeFSLockFactory@68502a3e; maxCacheMB=48.0 maxMergeSizeMB=4.0)),segFN=segments_1,generation=1,filenames=[segments_1]
[junit4:junit4]   2> 8632 T3085 oasc.SolrDeletionPolicy.updateCommits newest commit = 1[segments_1]
[junit4:junit4]   2> 8633 T3085 oasc.CachingDirectoryFactory.close Releasing directory:/usr/home/hudson/hudson-slave/workspace/Lucene-Solr-Tests-4.x-Java6/solr/build/solr-core/test/J1/./org.apache.solr.cloud.SyncSliceTest-1355849590345/jetty3/index
[junit4:junit4]   2> 8633 T3085 oasc.SolrCore.initWriters created xml: solr.XMLResponseWriter
[junit4:junit4]   2> 8636 T3085 oasup.UpdateRequestProcessorChain.init inserting DistributedUpdateProcessorFactory into updateRequestProcessorChain "dedupe"
[junit4:junit4]   2> 8636 T3085 oasup.UpdateRequestProcessorChain.init inserting DistributedUpdateProcessorFactory into updateRequestProcessorChain "dedupe-allfields"
[junit4:junit4]   2> 8636 T3085 oasup.UpdateRequestProcessorChain.init inserting DistributedUpdateProcessorFactory into updateRequestProcessorChain "stored_sig"
[junit4:junit4]   2> 8637 T3085 oasup.UpdateRequestProcessorChain.init inserting DistributedUpdateProcessorFactory into updateRequestProcessorChain "uniq-fields"
[junit4:junit4]   2> 8637 T3085 oasup.UpdateRequestProcessorChain.init inserting DistributedUpdateProcessorFactory into updateRequestProcessorChain "distrib-dup-test-chain-implicit"
[junit4:junit4]   2> 8638 T3085 oasc.RequestHandlers.initHandlersFromConfig adding lazy requestHandler: solr.ReplicationHandler
[junit4:junit4]   2> 8638 T3085 oasc.RequestHandlers.initHandlersFromConfig created /replication: solr.ReplicationHandler
[junit4:junit4]   2> 8639 T3085 oasc.RequestHandlers.initHandlersFromConfig created standard: solr.StandardRequestHandler
[junit4:junit4]   2> 8640 T3085 oasc.RequestHandlers.initHandlersFromConfig created /get: solr.RealTimeGetHandler
[junit4:junit4]   2> 8641 T3085 oasc.RequestHandlers.initHandlersFromConfig created dismax: solr.SearchHandler
[junit4:junit4]   2> 8643 T3085 oasc.RequestHandlers.initHandlersFromConfig created mock: org.apache.solr.core.MockQuerySenderListenerReqHandler
[junit4:junit4]   2> 8643 T3085 oasc.RequestHandlers.initHandlersFromConfig created /admin/: org.apache.solr.handler.admin.AdminHandlers
[junit4:junit4]   2> 8644 T3085 oasc.RequestHandlers.initHandlersFromConfig created defaults: solr.StandardRequestHandler
[junit4:junit4]   2> 8644 T3085 oasc.RequestHandlers.initHandlersFromConfig adding lazy requestHandler: solr.StandardRequestHandler
[junit4:junit4]   2> 8645 T3085 oasc.RequestHandlers.initHandlersFromConfig created lazy: solr.StandardRequestHandler
[junit4:junit4]   2> 8646 T3085 oasc.RequestHandlers.initHandlersFromConfig created /update: solr.UpdateRequestHandler
[junit4:junit4]   2> 8647 T3085 oasc.RequestHandlers.initHandlersFromConfig created /terms: org.apache.solr.handler.component.SearchHandler
[junit4:junit4]   2> 8648 T3085 oasc.RequestHandlers.initHandlersFromConfig created spellCheckCompRH: org.apache.solr.handler.component.SearchHandler
[junit4:junit4]   2> 8649 T3085 oasc.RequestHandlers.initHandlersFromConfig created spellCheckCompRH_Direct: org.apache.solr.handler.component.SearchHandler
[junit4:junit4]   2> 8650 T3085 oasc.RequestHandlers.initHandlersFromConfig created spellCheckWithWordbreak: org.apache.solr.handler.component.SearchHandler
[junit4:junit4]   2> 8651 T3085 oasc.RequestHandlers.initHandlersFromConfig created spellCheckWithWordbreak_Direct: org.apache.solr.handler.component.SearchHandler
[junit4:junit4]   2> 8652 T3085 oasc.RequestHandlers.initHandlersFromConfig created spellCheckCompRH1: org.apache.solr.handler.component.SearchHandler
[junit4:junit4]   2> 8653 T3085 oasc.RequestHandlers.initHandlersFromConfig created mltrh: org.apache.solr.handler.component.SearchHandler
[junit4:junit4]   2> 8654 T3085 oasc.RequestHandlers.initHandlersFromConfig created tvrh: org.apache.solr.handler.component.SearchHandler
[junit4:junit4]   2> 8655 T3085 oasc.RequestHandlers.initHandlersFromConfig created /mlt: solr.MoreLikeThisHandler
[junit4:junit4]   2> 8656 T3085 oasc.RequestHandlers.initHandlersFromConfig created /debug/dump: solr.DumpRequestHandler
[junit4:junit4]   2> 8664 T3085 oashl.XMLLoader.init xsltCacheLifetimeSeconds=60
[junit4:junit4]   2> 8669 T3085 oasc.SolrCore.initDeprecatedSupport WARNING solrconfig.xml uses deprecated <admin/gettableFiles>, Please update your config to use the ShowFileRequestHandler.
[junit4:junit4]   2> 8671 T3085 oasc.SolrCore.initDeprecatedSupport WARNING adding ShowFileRequestHandler with hidden files: [SCHEMA.XML, OLD_SYNONYMS.TXT, STOPWORDS.TXT, PROTWORDS.TXT, OPEN-EXCHANGE-RATES.JSON, SYNONYMS.TXT, CURRENCY.XML, MAPPING-ISOLATIN1ACCENT.TXT]
[junit4:junit4]   2> 8673 T3085 oasc.CachingDirectoryFactory.close Releasing directory:/usr/home/hudson/hudson-slave/workspace/Lucene-Solr-Tests-4.x-Java6/solr/build/solr-core/test/J1/./org.apache.solr.cloud.SyncSliceTest-1355849590345/jetty3
[junit4:junit4]   2> 8675 T3085 oass.SolrIndexSearcher.<init> Opening Searcher@d34cf76 main
[junit4:junit4]   2> 8676 T3085 oasu.CommitTracker.<init> Hard AutoCommit: disabled
[junit4:junit4]   2> 8677 T3085 oasu.CommitTracker.<init> Soft AutoCommit: disabled
[junit4:junit4]   2> 8677 T3085 oashc.SpellCheckComponent.inform Initializing spell checkers
[junit4:junit4]   2> 8684 T3085 oass.DirectSolrSpellChecker.init init: {name=direct,classname=DirectSolrSpellChecker,field=lowerfilt,minQueryLength=3}
[junit4:junit4]   2> 8740 T3086 oasc.SolrCore.registerSearcher [collection1] Registered new searcher Searcher@d34cf76 main{StandardDirectoryReader(segments_1:1)}
[junit4:junit4]   2> 8744 T3085 oasc.ZkController.publish publishing core=collection1 state=down
[junit4:junit4]   2> 8745 T3085 oasc.ZkController.publish numShards not found on descriptor - reading it from system property
[junit4:junit4]   2> 8948 T3034 oascc.ZkStateReader.updateClusterState Updating cloud state from ZooKeeper... 
[junit4:junit4]   2> 8949 T3034 oasc.Overseer$ClusterStateUpdater.updateState Update state numShards=1 message={
[junit4:junit4]   2> 	  "operation":"state",
[junit4:junit4]   2> 	  "numShards":"1",
[junit4:junit4]   2> 	  "shard":null,
[junit4:junit4]   2> 	  "roles":null,
[junit4:junit4]   2> 	  "state":"down",
[junit4:junit4]   2> 	  "core":"collection1",
[junit4:junit4]   2> 	  "collection":"collection1",
[junit4:junit4]   2> 	  "node_name":"127.0.0.1:56215_vy",
[junit4:junit4]   2> 	  "base_url":"http://127.0.0.1:56215/vy"}
[junit4:junit4]   2> 8949 T3034 oasc.Overseer$ClusterStateUpdater.updateState Collection already exists with numShards=1
[junit4:junit4]   2> 8949 T3034 oasc.Overseer$ClusterStateUpdater.updateState Assigning new node to shard shard=shard1
[junit4:junit4]   2> 8965 T3033 oascc.ZkStateReader$2.process A cluster state change: WatchedEvent state:SyncConnected type:NodeDataChanged path:/clusterstate.json, has occurred - updating... (live nodes size: 4)
[junit4:junit4]   2> 8965 T3039 oascc.ZkStateReader$2.process A cluster state change: WatchedEvent state:SyncConnected type:NodeDataChanged path:/clusterstate.json, has occurred - updating... (live nodes size: 4)
[junit4:junit4]   2> 8965 T3084 oascc.ZkStateReader$2.process A cluster state change: WatchedEvent state:SyncConnected type:NodeDataChanged path:/clusterstate.json, has occurred - updating... (live nodes size: 4)
[junit4:junit4]   2> 8965 T3052 oascc.ZkStateReader$2.process A cluster state change: WatchedEvent state:SyncConnected type:NodeDataChanged path:/clusterstate.json, has occurred - updating... (live nodes size: 4)
[junit4:junit4]   2> 8965 T3067 oascc.ZkStateReader$2.process A cluster state change: WatchedEvent state:SyncConnected type:NodeDataChanged path:/clusterstate.json, has occurred - updating... (live nodes size: 4)
[junit4:junit4]   2> 9247 T3085 oasc.CoreContainer.registerCore registering core: collection1
[junit4:junit4]   2> 9247 T3085 oasc.ZkController.register Register replica - core:collection1 address:http://127.0.0.1:56215/vy collection:collection1 shard:shard1
[junit4:junit4]   2> 9250 T3085 oasc.ZkController.register We are http://127.0.0.1:56215/vy/collection1/ and leader is http://127.0.0.1:16448/vy/collection1/
[junit4:junit4]   2> 9250 T3085 oasc.ZkController.register No LogReplay needed for core=collection1 baseURL=http://127.0.0.1:56215/vy
[junit4:junit4]   2> 9251 T3085 oasc.ZkController.checkRecovery Core needs to recover:collection1
[junit4:junit4]   2> 9251 T3085 oasu.DefaultSolrCoreState.doRecovery Running recovery - first canceling any ongoing recovery
[junit4:junit4]   2> ASYNC  NEW_CORE C185 name=collection1 org.apache.solr.core.SolrCore@45a1546b url=http://127.0.0.1:56215/vy/collection1 node=127.0.0.1:56215_vy C185_STATE=coll:collection1 core:collection1 props:{shard=null, roles=null, state=down, core=collection1, collection=collection1, node_name=127.0.0.1:56215_vy, base_url=http://127.0.0.1:56215/vy}
[junit4:junit4]   2> 9251 T3087 C185 P56215 oasc.RecoveryStrategy.run Starting recovery process.  core=collection1 recoveringAfterStartup=true
[junit4:junit4]   2> 9252 T3085 oascc.ZkStateReader.updateClusterState Updating cloud state from ZooKeeper... 
[junit4:junit4]   2> 9252 T3087 C185 P56215 oasc.RecoveryStrategy.doRecovery ###### startupVersions=[]
[junit4:junit4]   2> 9252 T3087 C185 P56215 oasc.ZkController.publish publishing core=collection1 state=recovering
[junit4:junit4]   2> 9253 T3087 C185 P56215 oasc.ZkController.publish numShards not found on descriptor - reading it from system property
[junit4:junit4]   2> 9253 T3011 oass.SolrDispatchFilter.init user.dir=/usr/home/hudson/hudson-slave/workspace/Lucene-Solr-Tests-4.x-Java6/solr/build/solr-core/test/J1
[junit4:junit4]   2> 9254 T3087 C185 P56215 oasc.RecoveryStrategy.doRecovery Attempting to PeerSync from http://127.0.0.1:16448/vy/collection1/ core=collection1 - recoveringAfterStartup=true
[junit4:junit4]   2> 9254 T3011 oass.SolrDispatchFilter.init SolrDispatchFilter.init() done
[junit4:junit4]   2> 9254 T3087 C185 P56215 oasu.PeerSync.sync PeerSync: core=collection1 url=http://127.0.0.1:56215/vy START replicas=[http://127.0.0.1:16448/vy/collection1/] nUpdates=100
[junit4:junit4]   2> 9255 T3011 oascsi.HttpClientUtil.createClient Creating new http client, config:maxConnections=128&maxConnectionsPerHost=32&followRedirects=false
[junit4:junit4]   2> 9255 T3087 C185 P56215 oasu.PeerSync.sync WARNING no frame of reference to tell of we've missed updates
[junit4:junit4]   2> 9255 T3087 C185 P56215 oasc.RecoveryStrategy.doRecovery PeerSync Recovery was not successful - trying replication. core=collection1
[junit4:junit4]   2> 9256 T3087 C185 P56215 oasc.RecoveryStrategy.doRecovery Starting Replication Recovery. core=collection1
[junit4:junit4]   2> 9256 T3087 C185 P56215 oascsi.HttpClientUtil.createClient Creating new http client, config:maxConnections=128&maxConnectionsPerHost=32&followRedirects=false
[junit4:junit4]   2> 9257 T3042 C184 P16448 REQ /get {distrib=false&qt=/get&wt=javabin&version=2&getVersions=100} status=0 QTime=0 
[junit4:junit4]   2> 9438 T3011 oejs.Server.doStart jetty-8.1.8.v20121106
[junit4:junit4]   2> 9441 T3011 oejs.AbstractConnector.doStart Started SocketConnector@127.0.0.1:15322
[junit4:junit4]   2> 9442 T3011 oasc.SolrResourceLoader.locateSolrHome JNDI not configured for solr (NoInitialContextEx)
[junit4:junit4]   2> 9442 T3011 oasc.SolrResourceLoader.locateSolrHome using system property solr.solr.home: /usr/home/hudson/hudson-slave/workspace/Lucene-Solr-Tests-4.x-Java6/solr/build/solr-core/test/J1/./org.apache.solr.cloud.SyncSliceTest-jetty4-1355849599609
[junit4:junit4]   2> 9443 T3011 oasc.SolrResourceLoader.<init> new SolrResourceLoader for deduced Solr Home: '/usr/home/hudson/hudson-slave/workspace/Lucene-Solr-Tests-4.x-Java6/solr/build/solr-core/test/J1/./org.apache.solr.cloud.SyncSliceTest-jetty4-1355849599609/'
[junit4:junit4]   2> 9471 T3034 oascc.ZkStateReader.updateClusterState Updating cloud state from ZooKeeper... 
[junit4:junit4]   2> 9472 T3034 oasc.Overseer$ClusterStateUpdater.updateState Update state numShards=1 message={
[junit4:junit4]   2> 	  "operation":"state",
[junit4:junit4]   2> 	  "numShards":"1",
[junit4:junit4]   2> 	  "shard":"shard1",
[junit4:junit4]   2> 	  "roles":null,
[junit4:junit4]   2> 	  "state":"recovering",
[junit4:junit4]   2> 	  "core":"collection1",
[junit4:junit4]   2> 	  "collection":"collection1",
[junit4:junit4]   2> 	  "node_name":"127.0.0.1:56215_vy",
[junit4:junit4]   2> 	  "base_url":"http://127.0.0.1:56215/vy"}
[junit4:junit4]   2> 9489 T3011 oass.SolrDispatchFilter.init SolrDispatchFilter.init()
[junit4:junit4]   2> 9490 T3011 oasc.SolrResourceLoader.locateSolrHome JNDI not configured for solr (NoInitialContextEx)
[junit4:junit4]   2> 9491 T3011 oasc.SolrResourceLoader.locateSolrHome using system property solr.solr.home: /usr/home/hudson/hudson-slave/workspace/Lucene-Solr-Tests-4.x-Java6/solr/build/solr-core/test/J1/./org.apache.solr.cloud.SyncSliceTest-jetty4-1355849599609
[junit4:junit4]   2> 9492 T3011 oasc.CoreContainer$Initializer.initialize looking for solr.xml: /usr/home/hudson/hudson-slave/workspace/Lucene-Solr-Tests-4.x-Java6/solr/build/solr-core/test/J1/./org.apache.solr.cloud.SyncSliceTest-jetty4-1355849599609/solr.xml
[junit4:junit4]   2> 9493 T3084 oascc.ZkStateReader$2.process A cluster state change: WatchedEvent state:SyncConnected type:NodeDataChanged path:/clusterstate.json, has occurred - updating... (live nodes size: 4)
[junit4:junit4]   2> 9493 T3067 oascc.ZkStateReader$2.process A cluster state change: WatchedEvent state:SyncConnected type:NodeDataChanged path:/clusterstate.json, has occurred - updating... (live nodes size: 4)
[junit4:junit4]   2> 9493 T3039 oascc.ZkStateReader$2.process A cluster state change: WatchedEvent state:SyncConnected type:NodeDataChanged path:/clusterstate.json, has occurred - updating... (live nodes size: 4)
[junit4:junit4]   2> 9493 T3033 oascc.ZkStateReader$2.process A cluster state change: WatchedEvent state:SyncConnected type:NodeDataChanged path:/clusterstate.json, has occurred - updating... (live nodes size: 4)
[junit4:junit4]   2> 9493 T3052 oascc.ZkStateReader$2.process A cluster state change: WatchedEvent state:SyncConnected type:NodeDataChanged path:/clusterstate.json, has occurred - updating... (live nodes size: 4)
[junit4:junit4]   2> 9493 T3011 oasc.CoreContainer.<init> New CoreContainer 2016819417
[junit4:junit4]   2> 9496 T3011 oasc.CoreContainer.load Loading CoreContainer using Solr Home: '/usr/home/hudson/hudson-slave/workspace/Lucene-Solr-Tests-4.x-Java6/solr/build/solr-core/test/J1/./org.apache.solr.cloud.SyncSliceTest-jetty4-1355849599609/'
[junit4:junit4]   2> 9497 T3011 oasc.SolrResourceLoader.<init> new SolrResourceLoader for directory: '/usr/home/hudson/hudson-slave/workspace/Lucene-Solr-Tests-4.x-Java6/solr/build/solr-core/test/J1/./org.apache.solr.cloud.SyncSliceTest-jetty4-1355849599609/'
[junit4:junit4]   2> 9533 T3011 oashc.HttpShardHandlerFactory.getParameter Setting socketTimeout to: 30000
[junit4:junit4]   2> 9534 T3011 oashc.HttpShardHandlerFactory.getParameter Setting urlScheme to: http://
[junit4:junit4]   2> 9535 T3011 oashc.HttpShardHandlerFactory.getParameter Setting connTimeout to: 15000
[junit4:junit4]   2> 9536 T3011 oashc.HttpShardHandlerFactory.getParameter Setting maxConnectionsPerHost to: 20
[junit4:junit4]   2> 9536 T3011 oashc.HttpShardHandlerFactory.getParameter Setting corePoolSize to: 0
[junit4:junit4]   2> 9537 T3011 oashc.HttpShardHandlerFactory.getParameter Setting maximumPoolSize to: 2147483647
[junit4:junit4]   2> 9538 T3011 oashc.HttpShardHandlerFactory.getParameter Setting maxThreadIdleTime to: 5
[junit4:junit4]   2> 9539 T3011 oashc.HttpShardHandlerFactory.getParameter Setting sizeOfQueue to: -1
[junit4:junit4]   2> 9540 T3011 oashc.HttpShardHandlerFactory.getParameter Setting fairnessPolicy to: false
[junit4:junit4]   2> 9541 T3011 oascsi.HttpClientUtil.createClient Creating new http client, config:maxConnectionsPerHost=20&maxConnections=10000&socketTimeout=30000&connTimeout=15000&retry=false
[junit4:junit4]   2> 9574 T3011 oasc.CoreContainer.load Registering Log Listener
[junit4:junit4]   2> 9612 T3011 oasc.CoreContainer.initZooKeeper Zookeeper client=127.0.0.1:24624/solr
[junit4:junit4]   2> 9614 T3011 oasc.ZkController.checkChrootPath zkHost includes chroot
[junit4:junit4]   2> 9615 T3011 oaz.ZooKeeper.<init> Initiating client connection, connectString=127.0.0.1:24624 sessionTimeout=60000 watcher=org.apache.solr.common.cloud.ConnectionManager@1922a766
[junit4:junit4]   2> 9621 T3098 oaz.ClientCnxn$SendThread.logStartConnect Opening socket connection to server localhost/127.0.0.1:24624. Will not attempt to authenticate using SASL (access denied (javax.security.auth.AuthPermission getLoginConfiguration))
[junit4:junit4]   2> 9622 T3098 oaz.ClientCnxn$SendThread.primeConnection Socket connection established to localhost/127.0.0.1:24624, initiating session
[junit4:junit4]   2> 9623 T3013 oazs.NIOServerCnxnFactory.run Accepted socket connection from /140.211.11.196:35588
[junit4:junit4]   2> 9624 T3013 oazs.ZooKeeperServer.processConnectRequest Client attempting to establish new session at /140.211.11.196:35588
[junit4:junit4]   2> 9623 T3011 oascc.ConnectionManager.waitForConnected Waiting for client to connect to ZooKeeper
[junit4:junit4]   2> 9629 T3015 oazs.ZooKeeperServer.finishSessionInit Established session 0x13baeeee651000b with negotiated timeout 20000 for client /140.211.11.196:35588
[junit4:junit4]   2> 9630 T3098 oaz.ClientCnxn$SendThread.onConnected Session establishment complete on server localhost/127.0.0.1:24624, sessionid = 0x13baeeee651000b, negotiated timeout = 20000
[junit4:junit4]   2> 9630 T3099 oascc.ConnectionManager.process Watcher org.apache.solr.common.cloud.ConnectionManager@1922a766 name:ZooKeeperConnection Watcher:127.0.0.1:24624 got event WatchedEvent state:SyncConnected type:None path:null path:null type:None
[junit4:junit4]   2> 9632 T3011 oascc.ConnectionManager.waitForConnected Client is connected to ZooKeeper
[junit4:junit4]   2> 9649 T3016 oazs.PrepRequestProcessor.pRequest2Txn Processed session termination for sessionid: 0x13baeeee651000b
[junit4:junit4]   2> 9653 T3011 oaz.ZooKeeper.close Session: 0x13baeeee651000b closed
[junit4:junit4]   2> 9655 T3013 oazs.NIOServerCnxn.closeSock Closed socket connection for client /140.211.11.196:35588 which had sessionid 0x13baeeee651000b
[junit4:junit4]   2> 9659 T3099 oaz.ClientCnxn$EventThread.run EventThread shut down
[junit4:junit4]   2> 9659 T3011 oascsi.HttpClientUtil.createClient Creating new http client, config:maxConnections=500&maxConnectionsPerHost=16&socketTimeout=15000&connTimeout=30000
[junit4:junit4]   2> 9695 T3011 oaz.ZooKeeper.<init> Initiating client connection, connectString=127.0.0.1:24624/solr sessionTimeout=30000 watcher=org.apache.solr.common.cloud.ConnectionManager@3b92efa2
[junit4:junit4]   2> 9698 T3100 oaz.ClientCnxn$SendThread.logStartConnect Opening socket connection to server localhost/127.0.0.1:24624. Will not attempt to authenticate using SASL (access denied (javax.security.auth.AuthPermission getLoginConfiguration))
[junit4:junit4]   2> 9699 T3100 oaz.ClientCnxn$SendThread.primeConnection Socket connection established to localhost/127.0.0.1:24624, initiating session
[junit4:junit4]   2> 9699 T3011 oascc.ConnectionManager.waitForConnected Waiting for client to connect to ZooKeeper
[junit4:junit4]   2> 9699 T3013 oazs.NIOServerCnxnFactory.run Accepted socket connection from /140.211.11.196:35595
[junit4:junit4]   2> 9702 T3013 oazs.ZooKeeperServer.processConnectRequest Client attempting to establish new session at /140.211.11.196:35595
[junit4:junit4]   2> 9705 T3015 oazs.ZooKeeperServer.finishSessionInit Established session 0x13baeeee651000c with negotiated timeout 20000 for client /140.211.11.196:35595
[junit4:junit4]   2> 9705 T3100 oaz.ClientCnxn$SendThread.onConnected Session establishment complete on server localhost/127.0.0.1:24624, sessionid = 0x13baeeee651000c, negotiated timeout = 20000
[junit4:junit4]   2> 9706 T3101 oascc.ConnectionManager.process Watcher org.apache.solr.common.cloud.ConnectionManager@3b92efa2 name:ZooKeeperConnection Watcher:127.0.0.1:24624/solr got event WatchedEvent state:SyncConnected type:None path:null path:null type:None
[junit4:junit4]   2> 9707 T3011 oascc.ConnectionManager.waitForConnected Client is connected to ZooKeeper
[junit4:junit4]   2> 9709 T3016 oazs.PrepRequestProcessor.pRequest Got user-level KeeperException when processing sessionid:0x13baeeee651000c type:create cxid:0x1 zxid:0x97 txntype:-1 reqpath:n/a Error Path:/solr/overseer Error:KeeperErrorCode = NodeExists for /solr/overseer
[junit4:junit4]   2> 9727 T3016 oazs.PrepRequestProcessor.pRequest Got user-level KeeperException when processing sessionid:0x13baeeee651000c type:create cxid:0x2 zxid:0x98 txntype:-1 reqpath:n/a Error Path:/solr/overseer Error:KeeperErrorCode = NodeExists for /solr/overseer
[junit4:junit4]   2> 9733 T3011 oasc.ZkController.createEphemeralLiveNode Register node as live in ZooKeeper:/live_nodes/127.0.0.1:15322_vy
[junit4:junit4]   2> 9735 T3016 oazs.PrepRequestProcessor.pRequest Got user-level KeeperException when processing sessionid:0x13baeeee651000c type:delete cxid:0x4 zxid:0x99 txntype:-1 reqpath:n/a Error Path:/solr/live_nodes/127.0.0.1:15322_vy Error:KeeperErrorCode = NoNode for /solr/live_nodes/127.0.0.1:15322_vy
[junit4:junit4]   2> 9737 T3011 oascc.SolrZkClient.makePath makePath: /live_nodes/127.0.0.1:15322_vy
[junit4:junit4]   2> 9741 T3067 oascc.ZkStateReader$2.process A cluster state change: WatchedEvent state:SyncConnected type:NodeChildrenChanged path:/live_nodes, has occurred - updating... (live nodes size: 4)
[junit4:junit4]   2> 9741 T3084 oascc.ZkStateReader$2.process A cluster state change: WatchedEvent state:SyncConnected type:NodeChildrenChanged path:/live_nodes, has occurred - updating... (live nodes size: 4)
[junit4:junit4]   2> 9741 T3039 oascc.ZkStateReader$2.process A cluster state change: WatchedEvent state:SyncConnected type:NodeChildrenChanged path:/live_nodes, has occurred - updating... (live nodes size: 4)
[junit4:junit4]   2> 9742 T3033 oascc.ZkStateReader$3.process Updating live nodes... (5)
[junit4:junit4]   2> 9742 T3033 oascc.ZkStateReader$2.process A cluster state change: WatchedEvent state:SyncConnected type:NodeChildrenChanged path:/live_nodes, has occurred - updating... (live nodes size: 5)
[junit4:junit4]   2> 9742 T3052 oascc.ZkStateReader$3.process Updating live nodes... (5)
[junit4:junit4]   2> 9743 T3052 oascc.ZkStateReader$2.process A cluster state change: WatchedEvent state:SyncConnected type:NodeChildrenChanged path:/live_nodes, has occurred - updating... (live nodes size: 5)
[junit4:junit4]   2> 9744 T3067 oascc.ZkStateReader$3.process Updating live nodes... (5)
[junit4:junit4]   2> 9744 T3084 oascc.ZkStateReader$3.process Updating live nodes... (5)
[junit4:junit4]   2> 9745 T3039 oascc.ZkStateReader$3.process Updating live nodes... (5)
[junit4:junit4]   2> 9747 T3011 oascc.ZkStateReader.createClusterStateWatchersAndUpdate Updating cluster state from ZooKeeper... 
[junit4:junit4]   2> 9759 T3102 oasc.CoreContainer.create Creating SolrCore 'collection1' using instanceDir: /usr/home/hudson/hudson-slave/workspace/Lucene-Solr-Tests-4.x-Java6/solr/build/solr-core/test/J1/./org.apache.solr.cloud.SyncSliceTest-jetty4-1355849599609/collection1
[junit4:junit4]   2> 9759 T3102 oasc.ZkController.createCollectionZkNode Check for collection zkNode:collection1
[junit4:junit4]   2> 9760 T3102 oasc.ZkController.createCollectionZkNode Collection zkNode exists
[junit4:junit4]   2> 9760 T3102 oasc.ZkController.readConfigName Load collection config from:/collections/collection1
[junit4:junit4]   2> 9761 T3102 oasc.SolrResourceLoader.<init> new SolrResourceLoader for directory: '/usr/home/hudson/hudson-slave/workspace/Lucene-Solr-Tests-4.x-Java6/solr/build/solr-core/test/J1/./org.apache.solr.cloud.SyncSliceTest-jetty4-1355849599609/collection1/'
[junit4:junit4]   2> 9763 T3102 oasc.SolrResourceLoader.replaceClassLoader Adding 'file:/usr/home/hudson/hudson-slave/workspace/Lucene-Solr-Tests-4.x-Java6/solr/build/solr-core/test/J1/org.apache.solr.cloud.SyncSliceTest-jetty4-1355849599609/collection1/lib/classes/' to classloader
[junit4:junit4]   2> 9763 T3102 oasc.SolrResourceLoader.replaceClassLoader Adding 'file:/usr/home/hudson/hudson-slave/workspace/Lucene-Solr-Tests-4.x-Java6/solr/build/solr-core/test/J1/org.apache.solr.cloud.SyncSliceTest-jetty4-1355849599609/collection1/lib/README' to classloader
[junit4:junit4]   2> 9818 T3102 oasc.SolrConfig.<init> Using Lucene MatchVersion: LUCENE_41
[junit4:junit4]   2> 9889 T3102 oasc.SolrConfig.<init> Loaded SolrConfig: solrconfig.xml
[junit4:junit4]   2> 9990 T3102 oass.IndexSchema.readSchema Reading Solr Schema
[junit4:junit4]   2> 9997 T3102 oass.IndexSchema.readSchema Schema name=test
[junit4:junit4]   2>  C183_STATE=coll:collection1 core:collection1 props:{shard=shard1, roles=null, state=recovering, core=collection1, collection=collection1, node_name=127.0.0.1:19730_vy, base_url=http://127.0.0.1:19730/vy}
[junit4:junit4]   2> 10147 T3070 C183 P19730 oasc.RecoveryStrategy.doRecovery Begin buffering updates. core=collection1
[junit4:junit4]   2> 10147 T3070 C183 P19730 oasu.UpdateLog.bufferUpdates Starting to buffer updates. FSUpdateLog{state=ACTIVE, tlog=null}
[junit4:junit4]   2> 10147 T3070 C183 P19730 oasc.RecoveryStrategy.replicate Attempting to replicate from http://127.0.0.1:16448/vy/collection1/. core=collection1
[junit4:junit4]   2> 10148 T3070 C183 P19730 oascsi.HttpClientUtil.createClient Creating new http client, config:maxConnections=128&maxConnectionsPerHost=32&followRedirects=false
[junit4:junit4]   2> 10158 T3045 C184 P16448 oasu.DirectUpdateHandler2.commit start commit{flags=0,_version_=0,optimize=false,openSearcher=false,waitSearcher=true,expungeDeletes=false,softCommit=false}
[junit4:junit4]   2> 10160 T3045 C184 P16448 oasc.CachingDirectoryFactory.close Releasing directory:/usr/home/hudson/hudson-slave/workspace/Lucene-Solr-Tests-4.x-Java6/solr/build/solr-core/test/J1/./org.apache.solr.cloud.SyncSliceTest-1355849590345/jetty1
[junit4:junit4]   2> 10164 T3045 C184 P16448 oasc.SolrDeletionPolicy.onInit SolrDeletionPolicy.onInit: commits:num=1
[junit4:junit4]   2> 		commit{dir=RateLimitedDirectoryWrapper(NRTCachingDirectory(org.apache.lucene.store.NIOFSDirectory@/usr/home/hudson/hudson-slave/workspace/Lucene-Solr-Tests-4.x-Java6/solr/build/solr-core/test/J1/org.apache.solr.cloud.SyncSliceTest-1355849590345/jetty1/index lockFactory=org.apache.lucene.store.NativeFSLockFactory@6040e7c6; maxCacheMB=48.0 maxMergeSizeMB=4.0)),segFN=segments_1,generation=1,filenames=[segments_1]
[junit4:junit4]   2> 10165 T3045 C184 P16448 oasc.SolrDeletionPolicy.updateCommits newest commit = 1[segments_1]
[junit4:junit4]   2> 10170 T3045 C184 P16448 oasc.SolrDeletionPolicy.onCommit SolrDeletionPolicy.onCommit: commits:num=2
[junit4:junit4]   2> 		commit{dir=RateLimitedDirectoryWrapper(NRTCachingDirectory(org.apache.lucene.store.NIOFSDirectory@/usr/home/hudson/hudson-slave/workspace/Lucene-Solr-Tests-4.x-Java6/solr/build/solr-core/test/J1/org.apache.solr.cloud.SyncSliceTest-1355849590345/jetty1/index lockFactory=org.apache.lucene.store.NativeFSLockFactory@6040e7c6; maxCacheMB=48.0 maxMergeSizeMB=4.0)),segFN=segments_1,generation=1,filenames=[segments_1]
[junit4:junit4]   2> 		commit{dir=RateLimitedDirectoryWrapper(NRTCachingDirectory(org.apache.lucene.store.NIOFSDirectory@/usr/home/hudson/hudson-slave/workspace/Lucene-Solr-Tests-4.x-Java6/solr/build/solr-core/test/J1/org.apache.solr.cloud.SyncSliceTest-1355849590345/jetty1/index lockFactory=org.apache.lucene.store.NativeFSLockFactory@6040e7c6; maxCacheMB=48.0 maxMergeSizeMB=4.0)),segFN=segments_2,generation=2,filenames=[segments_2]
[junit4:junit4]   2> 10171 T3045 C184 P16448 oasc.SolrDeletionPolicy.updateCommits newest commit = 2[segments_2]
[junit4:junit4]   2> 10172 T3045 C184 P16448 oasc.CachingDirectoryFactory.close Releasing directory:/usr/home/hudson/hudson-slave/workspace/Lucene-Solr-Tests-4.x-Java6/solr/build/solr-core/test/J1/./org.apache.solr.cloud.SyncSliceTest-1355849590345/jetty1
[junit4:junit4]   2> 10173 T3045 C184 P16448 oass.SolrIndexSearcher.<init> Opening Searcher@1dd1be7c realtime
[junit4:junit4]   2> 10173 T3045 C184 P16448 oasu.DirectUpdateHandler2.commit end_commit_flush
[junit4:junit4]   2> 10173 T3045 C184 P16448 /update {waitSearcher=true&openSearcher=false&commit=true&commit_end_point=true&wt=javabin&softCommit=false&version=2} {commit=} 0 15
[junit4:junit4]   2> 10175 T3070 C183 P19730 oash.ReplicationHandler.inform Commits will be reserved for  10000
[junit4:junit4]   2> 10175 T3070 C183 P19730 oash.SnapPuller.<init>  No value set for 'pollInterval'. Timer Task not started.
[junit4:junit4]   2> 10177 T3046 C184 P16448 oash.ReplicationHandler.inform Commits will be reserved for  10000
[junit4:junit4]   2> 10178 T3046 C184 P16448 REQ /replication {command=indexversion&wt=javabin&qt=/replication&version=2} status=0 QTime=2 
[junit4:junit4]   2> 10178 T3070 C183 P19730 oash.SnapPuller.fetchLatestIndex Master's generation: 2
[junit4:junit4]   2> 10179 T3070 C183 P19730 oash.SnapPuller.fetchLatestIndex Slave's generation: 1
[junit4:junit4]   2> 10179 T3070 C183 P19730 oash.SnapPuller.fetchLatestIndex Starting replication process
[junit4:junit4]   2> 10181 T3046 C184 P16448 oasc.CachingDirectoryFactory.close Releasing directory:/usr/home/hudson/hudson-slave/workspace/Lucene-Solr-Tests-4.x-Java6/solr/build/solr-core/test/J1/./org.apache.solr.cloud.SyncSliceTest-1355849590345/jetty1
[junit4:junit4]   2> 10182 T3046 C184 P16448 oasc.CachingDirectoryFactory.close Releasing directory:/usr/home/hudson/hudson-slave/workspace/Lucene-Solr-Tests-4.x-Java6/solr/build/solr-core/test/J1/./org.apache.solr.cloud.SyncSliceTest-1355849590345/jetty1/index
[junit4:junit4]   2> 10182 T3046 C184 P16448 REQ /replication {command=filelist&generation=2&wt=javabin&qt=/replication&version=2} status=0 QTime=1 
[junit4:junit4]   2> 10183 T3070 C183 P19730 oash.SnapPuller.fetchLatestIndex Number of files in latest index in master: 1
[junit4:junit4]   2> 10185 T3070 C183 P19730 oasc.CachingDirectoryFactory.get return new directory for /usr/home/hudson/hudson-slave/workspace/Lucene-Solr-Tests-4.x-Java6/solr/build/solr-core/test/J1/./org.apache.solr.cloud.SyncSliceTest-1355849590345/jetty2/index.20121218222320522 forceNew:false
[junit4:junit4]   2> 10186 T3070 C183 P19730 oasc.CachingDirectoryFactory.close Releasing directory:/usr/home/hudson/hudson-slave/workspace/Lucene-Solr-Tests-4.x-Java6/solr/build/solr-core/test/J1/./org.apache.solr.cloud.SyncSliceTest-1355849590345/jetty2
[junit4:junit4]   2> 10187 T3070 C183 P19730 oash.SnapPuller.fetchLatestIndex Starting download to RateLimitedDirectoryWrapper(NRTCachingDirectory(org.apache.lucene.store.NIOFSDirectory@/usr/home/hudson/hudson-slave/workspace/Lucene-Solr-Tests-4.x-Java6/solr/build/solr-core/test/J1/org.apache.solr.cloud.SyncSliceTest-1355849590345/jetty2/index.20121218222320522 lockFactory=org.apache.lucene.store.NativeFSLockFactory@5bd331a1; maxCacheMB=48.0 maxMergeSizeMB=4.0)) fullCopy=true
[junit4:junit4]   2> 10190 T3046 C184 P16448 REQ /replication {file=segments_2&command=filecontent&checksum=true&generation=2&qt=/replication&wt=filestream} status=0 QTime=0 
[junit4:junit4]   2> 10192 T3070 C183 P19730 oasc.CachingDirectoryFactory.close Releasing directory:/usr/home/hudson/hudson-slave/workspace/Lucene-Solr-Tests-4.x-Java6/solr/build/solr-core/test/J1/./org.apache.solr.cloud.SyncSliceTest-1355849590345/jetty2/index
[junit4:junit4]   2> 10192 T3070 C183 P19730 oash.SnapPuller.fetchLatestIndex Total time taken for download : 0 secs
[junit4:junit4]   2> 10192 T3070 C183 P19730 oash.SnapPuller.modifyIndexProps New index installed. Updating index properties... index=index.20121218222320522
[junit4:junit4]   2> 10194 T3070 C183 P19730 oasc.CachingDirectoryFactory.close Releasing directory:/usr/home/hudson/hudson-slave/workspace/Lucene-Solr-Tests-4.x-Java6/solr/build/solr-core/test/J1/./org.apache.solr.cloud.SyncSliceTest-1355849590345/jetty2
[junit4:junit4]   2> 10194 T3070 C183 P19730 oasc.CachingDirectoryFactory.close Releasing directory:/usr/home/hudson/hudson-slave/workspace/Lucene-Solr-Tests-4.x-Java6/solr/build/solr-core/test/J1/./org.apache.solr.cloud.SyncSliceTest-1355849590345/jetty2
[junit4:junit4]   2> 10195 T3070 C183 P19730 oasc.SolrCore.getNewIndexDir New index directory detected: old=./org.apache.solr.cloud.SyncSliceTest-1355849590345/jetty2/index/ new=./org.apache.solr.cloud.SyncSliceTest-1355849590345/jetty2/index.20121218222320522
[junit4:junit4]   2> 10198 T3070 C183 P19730 oasc.SolrDeletionPolicy.onInit SolrDeletionPolicy.onInit: commits:num=1
[junit4:junit4]   2> 		commit{dir=RateLimitedDirectoryWrapper(NRTCachingDirectory(org.apache.lucene.store.NIOFSDirectory@/usr/home/hudson/hudson-slave/workspace/Lucene-Solr-Tests-4.x-Java6/solr/build/solr-core/test/J1/org.apache.solr.cloud.SyncSliceTest-1355849590345/jetty2/index.20121218222320522 lockFactory=org.apache.lucene.store.NativeFSLockFactory@5bd331a1; maxCacheMB=48.0 maxMergeSizeMB=4.0)),segFN=segments_2,generation=2,filenames=[segments_2]
[junit4:junit4]   2> 10199 T3070 C183 P19730 oasc.SolrDeletionPolicy.updateCommits newest commit = 2[segments_2]
[junit4:junit4]   2> 10201 T3070 C183 P19730 oasc.CachingDirectoryFactory.close Releasing directory:/usr/home/hudson/hudson-slave/workspace/Lucene-Solr-Tests-4.x-Java6/solr/build/solr-core/test/J1/./org.apache.solr.cloud.SyncSliceTest-1355849590345/jetty2
[junit4:junit4]   2> 10201 T3070 C183 P19730 oasu.DefaultSolrCoreState.newIndexWriter Creating new IndexWriter...
[junit4:junit4]   2> 10201 T3070 C183 P19730 oasu.DefaultSolrCoreState.newIndexWriter Waiting until IndexWriter is unused... core=collection1
[junit4:junit4]   2> 10201 T3070 C183 P19730 oasu.DefaultSolrCoreState.newIndexWriter Rollback old IndexWriter... core=collection1
[junit4:junit4]   2> 10202 T3070 C183 P19730 oasc.CachingDirectoryFactory.close Releasing directory:/usr/home/hudson/hudson-slave/workspace/Lucene-Solr-Tests-4.x-Java6/solr/build/solr-core/test/J1/./org.apache.solr.cloud.SyncSliceTest-1355849590345/jetty2/index.20121218222320522
[junit4:junit4]   2> 10203 T3070 C183 P19730 oasc.CachingDirectoryFactory.close Releasing directory:/usr/home/hudson/hudson-slave/workspace/Lucene-Solr-Tests-4.x-Java6/solr/build/solr-core/test/J1/./org.apache.solr.cloud.SyncSliceTest-1355849590345/jetty2
[junit4:junit4]   2> 10206 T3070 C183 P19730 oasc.SolrDeletionPolicy.onInit SolrDeletionPolicy.onInit: commits:num=1
[junit4:junit4]   2> 		commit{dir=RateLimitedDirectoryWrapper(NRTCachingDirectory(org.apache.lucene.store.NIOFSDirectory@/usr/home/hudson/hudson-slave/workspace/Lucene-Solr-Tests-4.x-Java6/solr/build/solr-core/test/J1/org.apache.solr.cloud.SyncSliceTest-1355849590345/jetty2/index.20121218222320522 lockFactory=org.apache.lucene.store.NativeFSLockFactory@5bd331a1; maxCacheMB=48.0 maxMergeSizeMB=4.0)),segFN=segments_2,generation=2,filenames=[segments_2]
[junit4:junit4]   2> 10207 T3070 C183 P19730 oasc.SolrDeletionPolicy.updateCommits newest commit = 2[segments_2]
[junit4:junit4]   2> 10207 T3070 C183 P19730 oasu.DefaultSolrCoreState.newIndexWriter New IndexWriter is ready to be used.
[junit4:junit4]   2> 10208 T3070 C183 P19730 oasc.CachingDirectoryFactory.close Releasing directory:/usr/home/hudson/hudson-slave/workspace/Lucene-Solr-Tests-4.x-Java6/solr/build/solr-core/test/J1/./org.apache.solr.cloud.SyncSliceTest-1355849590345/jetty2
[junit4:junit4]   2> 10208 T3070 C183 P19730 oass.SolrIndexSearcher.<init> Opening Searcher@e76279e main
[junit4:junit4]   2> 10210 T3069 oasc.SolrCore.registerSearcher [collection1] Registered new searcher Searcher@e76279e main{StandardDirectoryReader(segments_2:1:nrt)}
[junit4:junit4]   2> 10211 T3069 oasc.CachingDirectoryFactory.close Releasing directory:/usr/home/hudson/hudson-slave/workspace/Lucene-Solr-Tests-4.x-Java6/solr/build/solr-core/test/J1/./org.apache.solr.cloud.SyncSliceTest-1355849590345/jetty2/index
[junit4:junit4]   2> 10211 T3070 C183 P19730 oasu.DirectUpdateHandler2.commit start commit{flags=0,_version_=0,optimize=false,openSearcher=false,waitSearcher=false,expungeDeletes=false,softCommit=false}
[junit4:junit4]   2> 10215 T3070 C183 P19730 oasc.SolrDeletionPolicy.onCommit SolrDeletionPolicy.onCommit: commits:num=2
[junit4:junit4]   2> 		commit{dir=RateLimitedDirectoryWrapper(NRTCachingDirectory(org.apache.lucene.store.NIOFSDirectory@/usr/home/hudson/hudson-slave/workspace/Lucene-Solr-Tests-4.x-Java6/solr/build/solr-core/test/J1/org.apache.solr.cloud.SyncSliceTest-1355849590345/jetty2/index.20121218222320522 lockFactory=org.apache.lucene.store.NativeFSLockFactory@5bd331a1; maxCacheMB=48.0 maxMergeSizeMB=4.0)),segFN=segments_2,generation=2,filenames=[segments_2]
[junit4:junit4]   2> 		commit{dir=RateLimitedDirectoryWrapper(NRTCachingDirectory(org.apache.lucene.store.NIOFSDirectory@/usr/home/hudson/hudson-slave/workspace/Lucene-Solr-Tests-4.x-Java6/solr/build/solr-core/test/J1/org.apache.solr.cloud.SyncSliceTest-1355849590345/jetty2/index.20121218222320522 lockFactory=org.apache.lucene.store.NativeFSLockFactory@5bd331a1; maxCacheMB=48.0 maxMergeSizeMB=4.0)),segFN=segments_3,generation=3,filenames=[segments_3]
[junit4:junit4]   2> 10216 T3070 C183 P19730 oasc.SolrDeletionPolicy.updateCommits newest commit = 3[segments_3]
[junit4:junit4]   2> 10217 T3070 C183 P19730 oasc.CachingDirectoryFactory.close Releasing directory:/usr/home/hudson/hudson-slave/workspace/Lucene-Solr-Tests-4.x-Java6/solr/build/solr-core/test/J1/./org.apache.solr.cloud.SyncSliceTest-1355849590345/jetty2
[junit4:junit4]   2> 10217 T3070 C183 P19730 oasu.DirectUpdateHandler2.commit end_commit_flush
[junit4:junit4]   2> 10218 T3070 C183 P19730 oasc.CachingDirectoryFactory.close Releasing directory:/usr/home/hudson/hudson-slave/workspace/Lucene-Solr-Tests-4.x-Java6/solr/build/solr-core/test/J1/./org.apache.solr.cloud.SyncSliceTest-1355849590345/jetty2/index.20121218222320522
[junit4:junit4]   2> 10218 T3070 C183 P19730 oasc.CachingDirectoryFactory.close Releasing directory:/usr/home/hudson/hudson-slave/workspace/Lucene-Solr-Tests-4.x-Java6/solr/build/solr-core/test/J1/./org.apache.solr.cloud.SyncSliceTest-1355849590345/jetty2/index
[junit4:junit4]   2> 10218 T3070 C183 P19730 oasc.RecoveryStrategy.replay No replay needed. core=collection1
[junit4:junit4]   2> 10218 T3070 C183 P19730 oasc.RecoveryStrategy.doRecovery Replication Recovery was successful - registering as Active. core=collection1
[junit4:junit4]   2> 10219 T3070 C183 P19730 oasc.ZkController.publish publishing core=collection1 state=active
[junit4:junit4]   2> 10219 T3070 C183 P19730 oasc.ZkController.publish numShards not found on descriptor - reading it from system property
[junit4:junit4]   2> 10221 T3070 C183 P19730 oasc.RecoveryStrategy.doRecovery Finished recovery process. core=collection1
[junit4:junit4]   2> 10504 T3034 oascc.ZkStateReader.updateClusterState Updating cloud state from ZooKeeper... 
[junit4:junit4]   2> 10505 T3034 oasc.Overseer$ClusterStateUpdater.updateState Update state numShards=1 message={
[junit4:junit4]   2> 	  "operation":"state",
[junit4:junit4]   2> 	  "numShards":"1",
[junit4:junit4]   2> 	  "shard":"shard1",
[junit4:junit4]   2> 	  "roles":null,
[junit4:junit4]   2> 	  "state":"active",
[junit4:junit4]   2> 	  "core":"collection1",
[junit4:junit4]   2> 	  "collection":"collection1",
[junit4:junit4]   2> 	  "node_name":"127.0.0.1:19730_vy",
[junit4:junit4]   2> 	  "base_url":"http://127.0.0.1:19730/vy"}
[junit4:junit4]   2> 10519 T3101 oascc.ZkStateReader$2.process A cluster state change: WatchedEvent state:SyncConnected type:NodeDataChanged path:/clusterstate.json, has occurred - updating... (live nodes size: 5)
[junit4:junit4]   2> 10519 T3067 oascc.ZkStateReader$2.process A cluster state change: WatchedEvent state:SyncConnected type:NodeDataChanged path:/clusterstate.json, has occurred - updating... (live nodes size: 5)
[junit4:junit4]   2> 10519 T3033 oascc.ZkStateReader$2.process A cluster state change: WatchedEvent state:SyncConnected type:NodeDataChanged path:/clusterstate.json, has occurred - updating... (live nodes size: 5)
[junit4:junit4]   2> 10519 T3039 oascc.ZkStateReader$2.process A cluster state change: WatchedEvent state:SyncConnected type:NodeDataChanged path:/clusterstate.json, has occurred - updating... (live nodes size: 5)
[junit4:junit4]   2> 10519 T3052 oascc.ZkStateReader$2.process A cluster state change: WatchedEvent state:SyncConnected type:NodeDataChanged path:/clusterstate.json, has occurred - updating... (live nodes size: 5)
[junit4:junit4]   2> 10519 T3084 oascc.ZkStateReader$2.process A cluster state change: WatchedEvent state:SyncConnected type:NodeDataChanged path:/clusterstate.json, has occurred - updating... (live nodes size: 5)
[junit4:junit4]   2> 10649 T3102 oass.OpenExchangeRatesOrgProvider.init Initialized with rates=open-exchange-rates.json, refreshInterval=1440.
[junit4:junit4]   2> 10662 T3102 oass.IndexSchema.readSchema default search field in schema is text
[junit4:junit4]   2> 10666 T3102 oass.IndexSchema.readSchema unique key field: id
[junit4:junit4]   2> 10679 T3102 oass.FileExchangeRateProvider.reload Reloading exchange rates from file currency.xml
[junit4:junit4]   2> 10690 T3102 oass.FileExchangeRateProvider.reload Reloading exchange rates from file currency.xml
[junit4:junit4]   2> 10706 T3102 oass.OpenExchangeRatesOrgProvider.reload Reloading exchange rates from open-exchange-rates.json
[junit4:junit4]   2> 10707 T3102 oass.OpenExchangeRatesOrgProvider.reload Reloading exchange rates from open-exchange-rates.json
[junit4:junit4]   2> 10708 T3102 oasc.SolrCore.<init> [collection1] Opening new SolrCore at /usr/home/hudson/hudson-slave/workspace/Lucene-Solr-Tests-4.x-Java6/solr/build/solr-core/test/J1/./org.apache.solr.cloud.SyncSliceTest-jetty4-1355849599609/collection1/, dataDir=./org.apache.solr.cloud.SyncSliceTest-1355849590345/jetty4/
[junit4:junit4]   2> 10709 T3102 oasc.JmxMonitoredMap.<init> JMX monitoring is enabled. Adding Solr mbeans to JMX Server: com.sun.jmx.mbeanserver.JmxMBeanServer@26c1186f
[junit4:junit4]   2> 10709 T3102 oasc.SolrCore.initDirectoryFactory solr.NRTCachingDirectoryFactory
[junit4:junit4]   2> 10710 T3102 oasc.CachingDirectoryFactory.get return new directory for /usr/home/hudson/hudson-slave/workspace/Lucene-Solr-Tests-4.x-Java6/solr/build/solr-core/test/J1/./org.apache.solr.cloud.SyncSliceTest-1355849590345/jetty4 forceNew:false
[junit4:junit4]   2> 10711 T3102 oasc.CachingDirectoryFactory.close Releasing directory:/usr/home/hudson/hudson-slave/workspace/Lucene-Solr-Tests-4.x-Java6/solr/build/solr-core/test/J1/./org.apache.solr.cloud.SyncSliceTest-1355849590345/jetty4
[junit4:junit4]   2> 10711 T3102 oasc.SolrCore.getNewIndexDir New index directory detected: old=null new=./org.apache.solr.cloud.SyncSliceTest-1355849590345/jetty4/index/
[junit4:junit4]   2> 10712 T3102 oasc.SolrCore.initIndex WARNING [collection1] Solr index directory './org.apache.solr.cloud.SyncSliceTest-1355849590345/jetty4/index' doesn't exist. Creating new index...
[junit4:junit4]   2> 10713 T3102 oasc.CachingDirectoryFactory.get return new directory for /usr/home/hudson/hudson-slave/workspace/Lucene-Solr-Tests-4.x-Java6/solr/build/solr-core/test/J1/./org.apache.solr.cloud.SyncSliceTest-1355849590345/jetty4/index forceNew:false
[junit4:junit4]   2> 10719 T3102 oasc.SolrDeletionPolicy.onCommit SolrDeletionPolicy.onCommit: commits:num=1
[junit4:junit4]   2> 		commit{dir=RateLimitedDirectoryWrapper(NRTCachingDirectory(org.apache.lucene.store.NIOFSDirectory@/usr/home/hudson/hudson-slave/workspace/Lucene-Solr-Tests-4.x-Java6/solr/build/solr-core/test/J1/org.apache.solr.cloud.SyncSliceTest-1355849590345/jetty4/index lockFactory=org.apache.lucene.store.NativeFSLockFactory@5aac83ae; maxCacheMB=48.0 maxMergeSizeMB=4.0)),segFN=segments_1,generation=1,filenames=[segments_1]
[junit4:junit4]   2> 10719 T3102 oasc.SolrDeletionPolicy.updateCommits newest commit = 1[segments_1]
[junit4:junit4]   2> 10720 T3102 oasc.CachingDirectoryFactory.close Releasing directory:/usr/home/hudson/hudson-slave/workspace/Lucene-Solr-Tests-4.x-Java6/solr/build/solr-core/test/J1/./org.apache.solr.cloud.SyncSliceTest-1355849590345/jetty4/index
[junit4:junit4]   2> 10720 T3102 oasc.SolrCore.initWriters created xml: solr.XMLResponseWriter
[junit4:junit4]   2> 10723 T3102 oasup.UpdateRequestProcessorChain.init inserting DistributedUpdateProcessorFactory into updateRequestProcessorChain "dedupe"
[junit4:junit4]   2> 10723 T3102 oasup.UpdateRequestProcessorChain.init inserting DistributedUpdateProcessorFactory into updateRequestProcessorChain "dedupe-allfields"
[junit4:junit4]   2> 10723 T3102 oasup.UpdateRequestProcessorChain.init inserting DistributedUpdateProcessorFactory into updateRequestProcessorChain "stored_sig"
[junit4:junit4]   2> 10724 T3102 oasup.UpdateRequestProcessorChain.init inserting DistributedUpdateProcessorFactory into updateRequestProcessorChain "uniq-fields"
[junit4:junit4]   2> 10724 T3102 oasup.UpdateRequestProcessorChain.init inserting DistributedUpdateProcessorFactory into updateRequestProcessorChain "distrib-dup-test-chain-implicit"
[junit4:junit4]   2> 10725 T3102 oasc.RequestHandlers.initHandlersFromConfig adding lazy requestHandler: solr.ReplicationHandler
[junit4:junit4]   2> 10725 T3102 oasc.RequestHandlers.initHandlersFromConfig created /replication: solr.ReplicationHandler
[junit4:junit4]   2> 10726 T3102 oasc.RequestHandlers.initHandlersFromConfig created standard: solr.StandardRequestHandler
[junit4:junit4]   2> 10727 T3102 oasc.RequestHandlers.initHandlersFromConfig created /get: solr.RealTimeGetHandler
[junit4:junit4]   2> 10728 T3102 oasc.RequestHandlers.initHandlersFromConfig created dismax: solr.SearchHandler
[junit4:junit4]   2> 10729 T3102 oasc.RequestHandlers.initHandlersFromConfig created mock: org.apache.solr.core.MockQuerySenderListenerReqHandler
[junit4:junit4]   2> 10730 T3102 oasc.RequestHandlers.initHandlersFromConfig created /admin/: org.apache.solr.handler.admin.AdminHandlers
[junit4:junit4]   2> 10731 T3102 oasc.RequestHandlers.initHandlersFromConfig created defaults: solr.StandardRequestHandler
[junit4:junit4]   2> 10731 T3102 oasc.RequestHandlers.initHandlersFromConfig adding lazy requestHandler: solr.StandardRequestHandler
[junit4:junit4]   2> 10731 T3102 oasc.RequestHandlers.initHandlersFromConfig created lazy: solr.StandardRequestHandler
[junit4:junit4]   2> 10732 T3102 oasc.RequestHandlers.initHandlersFromConfig created /update: solr.UpdateRequestHandler
[junit4:junit4]   2> 10733 T3102 oasc.RequestHandlers.initHandlersFromConfig created /terms: org.apache.solr.handler.component.SearchHandler
[junit4:junit4]   2> 10734 T3102 oasc.RequestHandlers.initHandlersFromConfig created spellCheckCompRH: org.apache.solr.handler.component.SearchHandler
[junit4:junit4]   2> 10735 T3102 oasc.RequestHandlers.initHandlersFromConfig created spellCheckCompRH_Direct: org.apache.solr.handler.component.SearchHandler
[junit4:junit4]   2> 10736 T3102 oasc.RequestHandlers.initHandlersFromConfig created spellCheckWithWordbreak: org.apache.solr.handler.component.SearchHandler
[junit4:junit4]   2> 10737 T3102 oasc.RequestHandlers.initHandlersFromConfig created spellCheckWithWordbreak_Direct: org.apache.solr.handler.component.SearchHandler
[junit4:junit4]   2> 10738 T3102 oasc.RequestHandlers.initHandlersFromConfig created spellCheckCompRH1: org.apache.solr.handler.component.SearchHandler
[junit4:junit4]   2> 10739 T3102 oasc.RequestHandlers.initHandlersFromConfig created mltrh: org.apache.solr.handler.component.SearchHandler
[junit4:junit4]   2> 10740 T3102 oasc.RequestHandlers.initHandlersFromConfig created tvrh: org.apache.solr.handler.component.SearchHandler
[junit4:junit4]   2> 10741 T3102 oasc.RequestHandlers.initHandlersFromConfig created /mlt: solr.MoreLikeThisHandler
[junit4:junit4]   2> 10742 T3102 oasc.RequestHandlers.initHandlersFromConfig created /debug/dump: solr.DumpRequestHandler
[junit4:junit4]   2> 10750 T3102 oashl.XMLLoader.init xsltCacheLifetimeSeconds=60
[junit4:junit4]   2> 10755 T3102 oasc.SolrCore.initDeprecatedSupport WARNING solrconfig.xml uses deprecated <admin/gettableFiles>, Please update your config to use the ShowFileRequestHandler.
[junit4:junit4]   2> 10757 T3102 oasc.SolrCore.initDeprecatedSupport WARNING adding ShowFileRequestHandler with hidden files: [SCHEMA.XML, OLD_SYNONYMS.TXT, STOPWORDS.TXT, PROTWORDS.TXT, OPEN-EXCHANGE-RATES.JSON, SYNONYMS.TXT, CURRENCY.XML, MAPPING-ISOLATIN1ACCENT.TXT]
[junit4:junit4]   2> 10759 T3102 oasc.CachingDirectoryFactory.close Releasing directory:/usr/home/hudson/hudson-slave/workspace/Lucene-Solr-Tests-4.x-Java6/solr/build/solr-core/test/J1/./org.apache.solr.cloud.SyncSliceTest-1355849590345/jetty4
[junit4:junit4]   2> 10761 T3102 oass.SolrIndexSearcher.<init> Opening Searcher@3470e90e main
[junit4:junit4]   2> 10762 T3102 oasu.CommitTracker.<init> Hard AutoCommit: disabled
[junit4:junit4]   2> 10762 T3102 oasu.CommitTracker.<init> Soft AutoCommit: disabled
[junit4:junit4]   2> 10763 T3102 oashc.SpellCheckComponent.inform Initializing spell checkers
[junit4:junit4]   2> 10770 T3102 oass.DirectSolrSpellChecker.init init: {name=direct,classname=DirectSolrSpellChecker,field=lowerfilt,minQueryLength=3}
[junit4:junit4]   2> 10823 T3104 oasc.SolrCore.registerSearcher [collection1] Registered new searcher Searcher@3470e90e main{StandardDirectoryReader(segments_1:1)}
[junit4:junit4]   2> 10827 T3102 oasc.ZkController.publish publishing core=collection1 state=down
[junit4:junit4]   2> 10827 T3102 oasc.ZkController.publish numShards not found on descriptor - reading it from system property
[junit4:junit4]   2> 11023 T3034 oascc.ZkStateReader.updateClusterState Updating cloud state from ZooKeeper... 
[junit4:junit4]   2> 11024 T3034 oasc.Overseer$ClusterStateUpdater.updateState Update state numShards=1 message={
[junit4:junit4]   2> 	  "operation":"state",
[junit4:junit4]   2> 	  "numShards":"1",
[junit4:junit4]   2> 	  "shard":null,
[junit4:junit4]   2> 	  "roles":null,
[junit4:junit4]   2> 	  "state":"down",
[junit4:junit4]   2> 	  "core":"collection1",
[junit4:junit4]   2> 	  "collection":"collection1",
[junit4:junit4]   2> 	  "node_name":"127.0.0.1:15322_vy",
[junit4:junit4]   2> 	  "base_url":"http://127.0.0.1:15322/vy"}
[junit4:junit4]   2> 11025 T3034 oasc.Overseer$ClusterStateUpdater.updateState Collection already exists with numShards=1
[junit4:junit4]   2> 11025 T3034 oasc.Overseer$ClusterStateUpdater.updateState Assigning new node to shard shard=shard1
[junit4:junit4]   2> 11038 T3033 oascc.ZkStateReader$2.process A cluster state change: WatchedEvent state:SyncConnected type:NodeDataChanged path:/clusterstate.json, has occurred - updating... (live nodes size: 5)
[junit4:junit4]   2> 11038 T3067 oascc.ZkStateReader$2.process A cluster state change: WatchedEvent state:SyncConnected type:NodeDataChanged path:/clusterstate.json, has occurred - updating... (live nodes size: 5)
[junit4:junit4]   2> 11038 T3101 oascc.ZkStateReader$2.process A cluster state change: WatchedEvent state:SyncConnected type:NodeDataChanged path:/clusterstate.json, has occurred - updating... (live nodes size: 5)
[junit4:junit4]   2> 11038 T3084 oascc.ZkStateReader$2.process A cluster state change: WatchedEvent state:SyncConnected type:NodeDataChanged path:/clusterstate.json, has occurred - updating... (live nodes size: 5)
[junit4:junit4]   2> 11038 T3039 oascc.ZkStateReader$2.process A cluster state change: WatchedEvent state:SyncConnected type:NodeDataChanged path:/clusterstate.json, has occurred - updating... (live nodes size: 5)
[junit4:junit4]   2> 11038 T3052 oascc.ZkStateReader$2.process A cluster state change: WatchedEvent state:SyncConnected type:NodeDataChanged path:/clusterstate.json, has occurred - updating... (live nodes size: 5)
[junit4:junit4]   2> 11330 T3102 oasc.CoreContainer.registerCore registering core: collection1
[junit4:junit4]   2> 11330 T3102 oasc.ZkController.register Register replica - core:collection1 address:http://127.0.0.1:15322/vy collection:collection1 shard:shard1
[junit4:junit4]   2> 11340 T3102 oasc.ZkController.register We are http://127.0.0.1:15322/vy/collection1/ and leader is http://127.0.0.1:16448/vy/collection1/
[junit4:junit4]   2> 11340 T3102 oasc.ZkController.register No LogReplay needed for core=collection1 baseURL=http://127.0.0.1:15322/vy
[junit4:junit4]   2> 11340 T3102 oasc.ZkController.checkRecovery Core needs to recover:collection1
[junit4:junit4]   2> 11340 T3102 oasu.DefaultSolrCoreState.doRecovery Running recovery - first canceling any ongoing recovery
[junit4:junit4]   2> ASYNC  NEW_CORE C186 name=collection1 org.apache.solr.core.SolrCore@13d12328 url=http://127.0.0.1:15322/vy/collection1 node=127.0.0.1:15322_vy C186_STATE=coll:collection1 core:collection1 props:{shard=null, roles=null, state=down, core=collection1, collection=collection1, node_name=127.0.0.1:15322_vy, base_url=http://127.0.0.1:15322/vy}
[junit4:junit4]   2> 11341 T3105 C186 P15322 oasc.RecoveryStrategy.run Starting recovery process.  core=collection1 recoveringAfterStartup=true
[junit4:junit4]   2> 11341 T3102 oascc.ZkStateReader.updateClusterState Updating cloud state from ZooKeeper... 
[junit4:junit4]   2> 11342 T3105 C186 P15322 oasc.RecoveryStrategy.doRecovery ###### startupVersions=[]
[junit4:junit4]   2> 11343 T3105 C186 P15322 oasc.ZkController.publish publishing core=collection1 state=recovering
[junit4:junit4]   2> 11343 T3105 C186 P15322 oasc.ZkController.publish numShards not found on descriptor - reading it from system property
[junit4:junit4]   2> 11343 T3011 oass.SolrDispatchFilter.init user.dir=/usr/home/hudson/hudson-slave/workspace/Lucene-Solr-Tests-4.x-Java6/solr/build/solr-core/test/J1
[junit4:junit4]   2> 11344 T3105 C186 P15322 oasc.RecoveryStrategy.doRecovery Attempting to PeerSync from http://127.0.0.1:16448/vy/collection1/ core=collection1 - recoveringAfterStartup=true
[junit4:junit4]   2> 11344 T3011 oass.SolrDispatchFilter.init SolrDispatchFilter.init() done
[junit4:junit4]   2> 11345 T3105 C186 P15322 oasu.PeerSync.sync PeerSync: core=collection1 url=http://127.0.0.1:15322/vy START replicas=[http://127.0.0.1:16448/vy/collection1/] nUpdates=100
[junit4:junit4]   2> 11345 T3011 oascsi.HttpClientUtil.createClient Creating new http client, config:maxConnections=128&maxConnectionsPerHost=32&followRedirects=false
[junit4:junit4]   2> 11345 T3105 C186 P15322 oasu.PeerSync.sync WARNING no frame of reference to tell of we've missed updates
[junit4:junit4]   2> 11346 T3105 C186 P15322 oasc.RecoveryStrategy.doRecovery PeerSync Recovery was not successful - trying replication. core=collection1
[junit4:junit4]   2> 11346 T3105 C186 P15322 oasc.RecoveryStrategy.doRecovery Starting Replication Recovery. core=collection1
[junit4:junit4]   2> 11346 T3105 C186 P15322 oascsi.HttpClientUtil.createClient Creating new http client, config:maxConnections=128&maxConnectionsPerHost=32&followRedirects=false
[junit4:junit4]   2> 11347 T3042 C184 P16448 REQ /get {distrib=false&qt=/get&wt=javabin&version=2&getVersions=100} status=0 QTime=0 
[junit4:junit4]   2> 11366 T3011 oascc.ZkStateReader.updateClusterState Updating cloud state from ZooKeeper... 
[junit4:junit4]   2> 11367 T3011 oasc.AbstractFullDistribZkTestBase.waitForThingsToLevelOut Wait for recoveries to finish - wait 15 for each attempt
[junit4:junit4]   2> 11368 T3011 oasc.AbstractDistribZkTestBase.waitForRecoveriesToFinish Wait for recoveries to finish - collection: collection1 failOnTimeout:true timeout (sec):15
[junit4:junit4]   2> 11369 T3011 oascc.ZkStateReader.updateClusterState Updating cloud state from ZooKeeper... 
[junit4:junit4]   2> 11542 T3034 oascc.ZkStateReader.updateClusterState Updating cloud state from ZooKeeper... 
[junit4:junit4]   2> 11543 T3034 oasc.Overseer$ClusterStateUpdater.updateState Update state numShards=1 message={
[junit4:junit4]   2> 	  "operation":"state",
[junit4:junit4]   2> 	  "numShards":"1",
[junit4:junit4]   2> 	  "shard":"shard1",
[junit4:junit4]   2> 	  "roles":null,
[junit4:junit4]   2> 	  "state":"recovering",
[junit4:junit4]   2> 	  "core":"collection1",
[junit4:junit4]   2> 	  "collection":"collection1",
[junit4:junit4]   2> 	  "node_name":"127.0.0.1:15322_vy",
[junit4:junit4]   2> 	  "base_url":"http://127.0.0.1:15322/vy"}
[junit4:junit4]   2> 11574 T3067 oascc.ZkStateReader$2.process A cluster state change: WatchedEvent state:SyncConnected type:NodeDataChanged path:/clusterstate.json, has occurred - updating... (live nodes size: 5)
[junit4:junit4]   2> 11574 T3084 oascc.ZkStateReader$2.process A cluster state change: WatchedEvent state:SyncConnected type:NodeDataChanged path:/clusterstate.json, has occurred - updating... (live nodes size: 5)
[junit4:junit4]   2> 11574 T3101 oascc.ZkStateReader$2.process A cluster state change: WatchedEvent state:SyncConnected type:NodeDataChanged path:/clusterstate.json, has occurred - updating... (live nodes size: 5)
[junit4:junit4]   2> 11574 T3039 oascc.ZkStateReader$2.process A cluster state change: WatchedEvent state:SyncConnected type:NodeDataChanged path:/clusterstate.json, has occurred - updating... (live nodes size: 5)
[junit4:junit4]   2> 11574 T3052 oascc.ZkStateReader$2.process A cluster state change: WatchedEvent state:SyncConnected type:NodeDataChanged path:/clusterstate.json, has occurred - updating... (live nodes size: 5)
[junit4:junit4]   2> 11574 T3033 oascc.ZkStateReader$2.process A cluster state change: WatchedEvent state:SyncConnected type:NodeDataChanged path:/clusterstate.json, has occurred - updating... (live nodes size: 5)
[junit4:junit4]   2>  C185_STATE=coll:collection1 core:collection1 props:{shard=shard1, roles=null, state=recovering, core=collection1, collection=collection1, node_name=127.0.0.1:56215_vy, base_url=http://127.0.0.1:56215/vy}
[junit4:junit4]   2> 12273 T3087 C185 P56215 oasc.RecoveryStrategy.doRecovery Begin buffering updates. core=collection1
[junit4:junit4]   2> 12273 T3087 C185 P56215 oasu.UpdateLog.bufferUpdates Starting to buffer updates. FSUpdateLog{state=ACTIVE, tlog=null}
[junit4:junit4]   2> 12273 T3087 C185 P56215 oasc.RecoveryStrategy.replicate Attempting to replicate from http://127.0.0.1:16448/vy/collection1/. core=collection1
[junit4:junit4]   2> 12274 T3087 C185 P56215 oascsi.HttpClientUtil.createClient Creating new http client, config:maxConnections=128&maxConnectionsPerHost=32&followRedirects=false
[junit4:junit4]   2> 12284 T3048 C184 P16448 oasu.DirectUpdateHandler2.commit start commit{flags=0,_version_=0,optimize=false,openSearcher=false,waitSearcher=true,expungeDeletes=false,softCommit=false}
[junit4:junit4]   2> 12290 T3048 C184 P16448 oasc.SolrDeletionPolicy.onCommit SolrDeletionPolicy.onCommit: commits:num=2
[junit4:junit4]   2> 		commit{dir=RateLimitedDirectoryWrapper(NRTCachingDirectory(org.apache.lucene.store.NIOFSDirectory@/usr/home/hudson/hudson-slave/workspace/Lucene-Solr-Tests-4.x-Java6/solr/build/solr-core/test/J1/org.apache.solr.cloud.SyncSliceTest-1355849590345/jetty1/index lockFactory=org.apache.lucene.store.NativeFSLockFactory@6040e7c6; maxCacheMB=48.0 maxMergeSizeMB=4.0)),segFN=segments_2,generation=2,filenames=[segments_2]
[junit4:junit4]   2> 		commit{dir=RateLimitedDirectoryWrapper(NRTCachingDirectory(org.apache.lucene.store.NIOFSDirectory@/usr/home/hudson/hudson-slave/workspace/Lucene-Solr-Tests-4.x-Java6/solr/build/solr-core/test/J1/org.apache.solr.cloud.SyncSliceTest-1355849590345/jetty1/index lockFactory=org.apache.lucene.store.NativeFSLockFactory@6040e7c6; maxCacheMB=48.0 maxMergeSizeMB=4.0)),segFN=segments_3,generation=3,filenames=[segments_3]
[junit4:junit4]   2> 12291 T3048 C184 P16448 oasc.SolrDeletionPolicy.updateCommits newest commit = 3[segments_3]
[junit4:junit4]   2> 12291 T3048 C184 P16448 oasc.CachingDirectoryFactory.close Releasing directory:/usr/home/hudson/hudson-slave/workspace/Lucene-Solr-Tests-4.x-Java6/solr/build/solr-core/test/J1/./org.apache.solr.cloud.SyncSliceTest-1355849590345/jetty1
[junit4:junit4]   2> 12292 T3048 C184 P16448 oasu.DirectUpdateHandler2.commit end_commit_flush
[junit4:junit4]   2> 12292 T3048 C184 P16448 /update {waitSearcher=true&openSearcher=false&commit=true&commit_end_point=true&wt=javabin&softCommit=false&version=2} {commit=} 0 8
[junit4:junit4]   2> 12294 T3087 C185 P56215 oash.ReplicationHandler.inform Commits will be reserved for  10000
[junit4:junit4]   2> 12294 T3087 C185 P56215 oash.SnapPuller.<init>  No value set for 'pollInterval'. Timer Task not started.
[junit4:junit4]   2> 12296 T3046 C184 P16448 REQ /replication {command=indexversion&wt=javabin&qt=/replication&version=2} status=0 QTime=0 
[junit4:junit4]   2> 12297 T3087 C185 P56215 oash.SnapPuller.fetchLatestIndex Master's generation: 3
[junit4:junit4]   2> 12297 T3087 C185 P56215 oash.SnapPuller.fetchLatestIndex Slave's generation: 1
[junit4:junit4]   2> 12297 T3087 C185 P56215 oash.SnapPuller.fetchLatestIndex Starting replication process
[junit4:junit4]   2> 12300 T3046 C184 P16448 oasc.CachingDirectoryFactory.close Releasing directory:/usr/home/hudson/hudson-slave/workspace/Lucene-Solr-Tests-4.x-Java6/solr/build/solr-core/test/J1/./org.apache.solr.cloud.SyncSliceTest-1355849590345/jetty1
[junit4:junit4]   2> 12301 T3046 C184 P16448 oasc.CachingDirectoryFactory.close Releasing directory:/usr/home/hudson/hudson-slave/workspace/Lucene-Solr-Tests-4.x-Java6/solr/build/solr-core/test/J1/./org.apache.solr.cloud.SyncSliceTest-1355849590345/jetty1/index
[junit4:junit4]   2> 12301 T3046 C184 P16448 REQ /replication {command=filelist&generation=3&wt=javabin&qt=/replication&version=2} status=0 QTime=1 
[junit4:junit4]   2> 12302 T3087 C185 P56215 oash.SnapPuller.fetchLatestIndex Number of files in latest index in master: 1
[junit4:junit4]   2> 12303 T3087 C185 P56215 oasc.CachingDirectoryFactory.get return new directory for /usr/home/hudson/hudson-slave/workspace/Lucene-Solr-Tests-4.x-Java6/solr/build/solr-core/test/J1/./org.apache.solr.cloud.SyncSliceTest-1355849590345/jetty3/index.20121218222322641 forceNew:false
[junit4:junit4]   2> 12304 T3087 C185 P56215 oasc.CachingDirectoryFactory.close Releasing directory:/usr/home/hudson/hudson-slave/workspace/Lucene-Solr-Tests-4.x-Java6/solr/build/solr-core/test/J1/./org.apache.solr.cloud.SyncSliceTest-1355849590345/jetty3
[junit4:junit4]   2> 12305 T3087 C185 P56215 oash.SnapPuller.fetchLatestIndex Starting download to RateLimitedDirectoryWrapper(NRTCachingDirectory(org.apache.lucene.store.NIOFSDirectory@/usr/home/hudson/hudson-slave/workspace/Lucene-Solr-Tests-4.x-Java6/solr/build/solr-core/test/J1/org.apache.solr.cloud.SyncSliceTest-1355849590345/jetty3/index.20121218222322641 lockFactory=org.apache.lucene.store.NativeFSLockFactory@5c8a65e9; maxCacheMB=48.0 maxMergeSizeMB=4.0)) fullCopy=true
[junit4:junit4]   2> 12309 T3046 C184 P16448 REQ /replication {file=segments_3&command=filecontent&checksum=true&generation=3&qt=/replication&wt=filestream} status=0 QTime=0 
[junit4:junit4]   2> 12311 T3087 C185 P56215 oasc.CachingDirectoryFactory.close Releasing directory:/usr/home/hudson/hudson-slave/workspace/Lucene-Solr-Tests-4.x-Java6/solr/build/solr-core/test/J1/./org.apache.solr.cloud.SyncSliceTest-1355849590345/jetty3/index
[junit4:junit4]   2> 12311 T3087 C185 P56215 oash.SnapPuller.fetchLatestIndex Total time taken for download : 0 secs
[junit4:junit4]   2> 12311 T3087 C185 P56215 oash.SnapPuller.modifyIndexProps New index installed. Updating index properties... index=index.20121218222322641
[junit4:junit4]   2> 12312 T3087 C185 P56215 oasc.CachingDirectoryFactory.close Releasing directory:/usr/home/hudson/hudson-slave/workspace/Lucene-Solr-Tests-4.x-Java6/solr/build/solr-core/test/J1/./org.apache.solr.cloud.SyncSliceTest-1355849590345/jetty3
[junit4:junit4]   2> 12313 T3087 C185 P56215 oasc.CachingDirectoryFactory.close Releasing directory:/usr/home/hudson/hudson-slave/workspace/Lucene-Solr-Tests-4.x-Java6/solr/build/solr-core/test/J1/./org.apache.solr.cloud.SyncSliceTest-1355849590345/jetty3
[junit4:junit4]   2> 12313 T3087 C185 P56215 oasc.SolrCore.getNewIndexDir New index directory detected: old=./org.apache.solr.cloud.SyncSliceTest-1355849590345/jetty3/index/ new=./org.apache.solr.cloud.SyncSliceTest-1355849590345/jetty3/index.20121218222322641
[junit4:junit4]   2> 12317 T3087 C185 P56215 oasc.SolrDeletionPolicy.onInit SolrDeletionPolicy.onInit: commits:num=1
[junit4:junit4]   2> 		commit{dir=RateLimitedDirectoryWrapper(NRTCachingDirectory(org.apache.lucene.store.NIOFSDirectory@/usr/home/hudson/hudson-slave/workspace/Lucene-Solr-Tests-4.x-Java6/solr/build/solr-core/test/J1/org.apache.solr.cloud.SyncSliceTest-1355849590345/jetty3/index.20121218222322641 lockFactory=org.apache.lucene.store.NativeFSLockFactory@5c8a65e9; maxCacheMB=48.0 maxMergeSizeMB=4.0)),segFN=segments_3,generation=3,filenames=[segments_3]
[junit4:junit4]   2> 12379 T3087 C185 P56215 oasc.SolrDeletionPolicy.updateCommits newest commit = 3[segments_3]
[junit4:junit4]   2> 12380 T3011 oascc.ZkStateReader.updateClusterState Updating cloud state from ZooKeeper... 
[junit4:junit4]   2> 12381 T3087 C185 P56215 oasc.CachingDirectoryFactory.close Releasing directory:/usr/home/hudson/hudson-slave/workspace/Lucene-Solr-Tests-4.x-Java6/solr/build/solr-core/test/J1/./org.apache.solr.cloud.SyncSliceTest-1355849590345/jetty3
[junit4:junit4]   2> 12382 T3087 C185 P56215 oasu.DefaultSolrCoreState.newIndexWriter Creating new IndexWriter...
[junit4:junit4]   2> 12382 T3087 C185 P56215 oasu.DefaultSolrCoreState.newIndexWriter Waiting until IndexWriter is unused... core=collection1
[junit4:junit4]   2> 12382 T3087 C185 P56215 oasu.DefaultSolrCoreState.newIndexWriter Rollback old IndexWriter... core=collection1
[junit4:junit4]   2> 12383 T3087 C185 P56215 oasc.CachingDirectoryFactory.close Releasing directory:/usr/home/hudson/hudson-slave/workspace/Lucene-Solr-Tests-4.x-Java6/solr/build/solr-core/test/J1/./org.apache.solr.cloud.SyncSliceTest-1355849590345/jetty3/index.20121218222322641
[junit4:junit4]   2> 12384 T3087 C185 P56215 oasc.CachingDirectoryFactory.close Releasing directory:/usr/home/hudson/hudson-slave/workspace/Lucene-Solr-Tests-4.x-Java6/solr/build/solr-core/test/J1/./org.apache.solr.cloud.SyncSliceTest-1355849590345/jetty3
[junit4:junit4]   2> 12389 T3087 C185 P56215 oasc.SolrDeletionPolicy.onInit SolrDeletionPolicy.onInit: commits:num=1
[junit4:junit4]   2> 		commit{dir=RateLimitedDirectoryWrapper(NRTCachingDirectory(org.apache.lucene.store.NIOFSDirectory@/usr/home/hudson/hudson-slave/workspace/Lucene-Solr-Tests-4.x-Java6/solr/build/solr-core/test/J1/org.apache.solr.cloud.SyncSliceTest-1355849590345/jetty3/index.20121218222322641 lockFactory=org.apache.lucene.store.NativeFSLockFactory@5c8a65e9; maxCacheMB=48.0 maxMergeSizeMB=4.0)),segFN=segments_3,generation=3,filenames=[segments_3]
[junit4:junit4]   2> 12389 T3087 C185 P56215 oasc.SolrDeletionPolicy.updateCommits newest commit = 3[segments_3]
[junit4:junit4]   2> 12390 T3087 C185 P56215 oasu.DefaultSolrCoreState.newIndexWriter New IndexWriter is ready to be used.
[junit4:junit4]   2> 12390 T3087 C185 P56215 oasc.CachingDirectoryFactory.close Releasing directory:/usr/home/hudson/hudson-slave/workspace/Lucene-Solr-Tests-4.x-Java6/solr/build/solr-core/test/J1/./org.apache.solr.cloud.SyncSliceTest-1355849590345/jetty3
[junit4:junit4]   2> 12391 T3087 C185 P56215 oass.SolrIndexSearcher.<init> Opening Searcher@407c71d main
[junit4:junit4]   2> 12393 T3086 oasc.SolrCore.registerSearcher [collection1] Registered new searcher Searcher@407c71d main{StandardDirectoryReader(segments_3:1:nrt)}
[junit4:junit4]   2> 12602 T3086 oasc.CachingDirectoryFactory.close Releasing directory:/usr/home/hudson/hudson-slave/workspace/Lucene-Solr-Tests-4.x-Java6/solr/build/solr-core/test/J1/./org.apache.solr.cloud.SyncSliceTest-1355849590345/jetty3/index
[junit4:junit4]   2> 12603 T3087 C185 P56215 oasu.DirectUpdateHandler2.commit start commit{flags=0,_version_=0,optimize=false,openSearcher=false,waitSearcher=false,expungeDeletes=false,softCommit=false}
[junit4:junit4]   2> 12607 T3087 C185 P56215 oasc.SolrDeletionPolicy.onCommit SolrDeletionPolicy.onCommit: commits:num=2
[junit4:junit4]   2> 		commit{dir=RateLimitedDirectoryWrapper(NRTCachingDirectory(org.apache.lucene.store.NIOFSDirectory@/usr/home/hudson/hudson-slave/workspace/Lucene-Solr-Tests-4.x-Java6/solr/build/solr-core/test/J1/org.apache.solr.cloud.SyncSliceTest-1355849590345/jetty3/index.20121218222322641 lockFactory=org.apache.lucene.store.NativeFSLockFactory@5c8a65e9; maxCacheMB=48.0 maxMergeSizeMB=4.0)),segFN=segments_3,generation=3,filenames=[segments_3]
[junit4:junit4]   2> 		commit{dir=RateLimitedDirectoryWrapper(NRTCachingDirectory(org.apache.lucene.store.NIOFSDirectory@/usr/home/hudson/hudson-slave/workspace/Lucene-Solr-Tests-4.x-Java6/solr/build/solr-core/test/J1/org.apache.solr.cloud.SyncSliceTest-1355849590345/jetty3/index.20121218222322641 lockFactory=org.apache.lucene.store.NativeFSLockFactory@5c8a65e9; maxCacheMB=48.0 maxMergeSizeMB=4.0)),segFN=segments_4,generation=4,filenames=[segments_4]
[junit4:junit4]   2> 12608 T3087 C185 P56215 oasc.SolrDeletionPolicy.updateCommits newest commit = 4[segments_4]
[junit4:junit4]   2> 12609 T3087 C185 P56215 oasc.CachingDirectoryFactory.close Releasing directory:/usr/home/hudson/hudson-slave/workspace/Lucene-Solr-Tests-4.x-Java6/solr/build/solr-core/test/J1/./org.apache.solr.cloud.SyncSliceTest-1355849590345/jetty3
[junit4:junit4]   2> 12609 T3087 C185 P56215 oasu.DirectUpdateHandler2.commit end_commit_flush
[junit4:junit4]   2> 12609 T3087 C185 P56215 oasc.CachingDirectoryFactory.close Releasing directory:/usr/home/hudson/hudson-slave/workspace/Lucene-Solr-Tests-4.x-Java6/solr/build/solr-core/test/J1/./org.apache.solr.cloud.SyncSliceTest-1355849590345/jetty3/index.20121218222322641
[junit4:junit4]   2> 12610 T3087 C185 P56215 oasc.CachingDirectoryFactory.close Releasing directory:/usr/home/hudson/hudson-slave/workspace/Lucene-Solr-Tests-4.x-Java6/solr/build/solr-core/test/J1/./org.apache.solr.cloud.SyncSliceTest-1355849590345/jetty3/index
[junit4:junit4]   2> 12610 T3087 C185 P56215 oasc.RecoveryStrategy.replay No replay needed. core=collection1
[junit4:junit4]   2> 12610 T3087 C185 P56215 oasc.RecoveryStrategy.doRecovery Replication Recovery was successful - registering as Active. core=collection1
[junit4:junit4]   2> 12610 T3087 C185 P56215 oasc.ZkController.publish publishing core=collection1 state=active
[junit4:junit4]   2> 12610 T3087 C185 P56215 oasc.ZkController.publish numShards not found on descriptor - reading it from system property
[junit4:junit4]   2> 12618 T3087 C185 P56215 oasc.RecoveryStrategy.doRecovery Finished recovery process. core=collection1
[junit4:junit4]   2> 12627 T3034 oascc.ZkStateReader.updateClusterState Updating cloud state from ZooKeeper... 
[junit4:junit4]   2> 12628 T3034 oasc.Overseer$ClusterStateUpdater.updateState Update state numShards=1 message={
[junit4:junit4]   2> 	  "operation":"state",
[junit4:junit4]   2> 	  "numShards":"1",
[junit4:junit4]   2> 	  "shard":"shard1",
[junit4:junit4]   2> 	  "roles":null,
[junit4:junit4]   2> 	  "state":"active",
[junit4:junit4]   2> 	  "core":"collection1",
[junit4:junit4]   2> 	  "collection":"collection1",
[junit4:junit4]   2> 	  "node_name":"127.0.0.1:56215_vy",
[junit4:junit4]   2> 	  "base_url":"http://127.0.0.1:56215/vy"}
[junit4:junit4]   2> 12632 T3033 oascc.ZkStateReader$2.process A cluster state change: WatchedEvent state:SyncConnected type:NodeDataChanged path:/clusterstate.json, has occurred - updating... (live nodes size: 5)
[junit4:junit4]   2> 12632 T3101 oascc.ZkStateReader$2.process A cluster state change: WatchedEvent state:SyncConnected type:NodeDataChanged path:/clusterstate.json, has occurred - updating... (live nodes size: 5)
[junit4:junit4]   2> 12632 T3052 oascc.ZkStateReader$2.process A cluster state change: WatchedEvent state:SyncConnected type:NodeDataChanged path:/clusterstate.json, has occurred - updating... (live nodes size: 5)
[junit4:junit4]   2> 12632 T3084 oascc.ZkStateReader$2.process A cluster state change: WatchedEvent state:SyncConnected type:NodeDataChanged path:/clusterstate.json, has occurred - updating... (live nodes size: 5)
[junit4:junit4]   2> 12632 T3039 oascc.ZkStateReader$2.process A cluster state change: WatchedEvent state:SyncConnected type:NodeDataChanged path:/clusterstate.json, has occurred - updating... (live nodes size: 5)
[junit4:junit4]   2> 12632 T3067 oascc.ZkStateReader$2.process A cluster state change: WatchedEvent state:SyncConnected type:NodeDataChanged path:/clusterstate.json, has occurred - updating... (live nodes size: 5)
[junit4:junit4]   2> 13383 T3011 oascc.ZkStateReader.updateClusterState Updating cloud state from ZooKeeper... 
[junit4:junit4]   2>  C186_STATE=coll:collection1 core:collection1 props:{shard=shard1, roles=null, state=recovering, core=collection1, collection=collection1, node_name=127.0.0.1:15322_vy, base_url=http://127.0.0.1:15322/vy}
[junit4:junit4]   2> 14383 T3105 C186 P15322 oasc.RecoveryStrategy.doRecovery Begin buffering updates. core=collection1
[junit4:junit4]   2> 14383 T3105 C186 P15322 oasu.UpdateLog.bufferUpdates Starting to buffer updates. FSUpdateLog{state=ACTIVE, tlog=null}
[junit4:junit4]   2> 14383 T3105 C186 P15322 oasc.RecoveryStrategy.replicate Attempting to replicate from http://127.0.0.1:16448/vy/collection1/. core=collection1
[junit4:junit4]   2> 14384 T3105 C186 P15322 oascsi.HttpClientUtil.createClient Creating new http client, config:maxConnections=128&maxConnectionsPerHost=32&followRedirects=false
[junit4:junit4]   2> 14386 T3011 oascc.ZkStateReader.updateClusterState Updating cloud state from ZooKeeper... 
[junit4:junit4]   2> 14401 T3043 C184 P16448 oasu.DirectUpdateHandler2.commit start commit{flags=0,_version_=0,optimize=false,openSearcher=false,waitSearcher=true,expungeDeletes=false,softCommit=false}
[junit4:junit4]   2> 14411 T3043 C184 P16448 oasc.SolrDeletionPolicy.onCommit SolrDeletionPolicy.onCommit: commits:num=3
[junit4:junit4]   2> 		commit{dir=RateLimitedDirectoryWrapper(NRTCachingDirectory(org.apache.lucene.store.NIOFSDirectory@/usr/home/hudson/hudson-slave/workspace/Lucene-Solr-Tests-4.x-Java6/solr/build/solr-core/test/J1/org.apache.solr.cloud.SyncSliceTest-1355849590345/jetty1/index lockFactory=org.apache.lucene.store.NativeFSLockFactory@6040e7c6; maxCacheMB=48.0 maxMergeSizeMB=4.0)),segFN=segments_2,generation=2,filenames=[segments_2]
[junit4:junit4]   2> 		commit{dir=RateLimitedDirectoryWrapper(NRTCachingDirectory(org.apache.lucene.store.NIOFSDirectory@/usr/home/hudson/hudson-slave/workspace/Lucene-Solr-Tests-4.x-Java6/solr/build/solr-core/test/J1/org.apache.solr.cloud.SyncSliceTest-1355849590345/jetty1/index lockFactory=org.apache.lucene.store.NativeFSLockFactory@6040e7c6; maxCacheMB=48.0 maxMergeSizeMB=4.0)),segFN=segments_3,generation=3,filenames=[segments_3]
[junit4:junit4]   2> 		commit{dir=RateLimitedDirectoryWrapper(NRTCachingDirectory(org.apache.lucene.store.NIOFSDirectory@/usr/home/hudson/hudson-slave/workspace/Lucene-Solr-Tests-4.x-Java6/solr/build/solr-core/test/J1/org.apache.solr.cloud.SyncSliceTest-1355849590345/jetty1/index lockFactory=org.apache.lucene.store.NativeFSLockFactory@6040e7c6; maxCacheMB=48.0 maxMergeSizeMB=4.0)),segFN=segments_4,generation=4,filenames=[segments_4]
[junit4:junit4]   2> 14412 T3043 C184 P16448 oasc.SolrDeletionPolicy.updateCommits newest commit = 4[segments_4]
[junit4:junit4]   2> 14413 T3043 C184 P16448 oasc.CachingDirectoryFactory.close Releasing directory:/usr/home/hudson/hudson-slave/workspace/Lucene-Solr-Tests-4.x-Java6/solr/build/solr-core/test/J1/./org.apache.solr.cloud.SyncSliceTest-1355849590345/jetty1
[junit4:junit4]   2> 14414 T3043 C184 P16448 oasu.DirectUpdateHandler2.commit end_commit_flush
[junit4:junit4]   2> 14414 T3043 C184 P16448 /update {waitSearcher=true&openSearcher=false&commit=true&commit_end_point=true&wt=javabin&softCommit=false&version=2} {commit=} 0 14
[junit4:junit4]   2> 14416 T3105 C186 P15322 oash.ReplicationHandler.inform Commits will be reserved for  10000
[junit4:junit4]   2> 14416 T3105 C186 P15322 oash.SnapPuller.<init>  No value set for 'pollInterval'. Timer Task not started.
[junit4:junit4]   2> 14418 T3046 C184 P

[...truncated too long message...]

unit4:junit4]    > 	at com.carrotsearch.randomizedtesting.RandomizedRunner.invoke(RandomizedRunner.java:1559)
[junit4:junit4]    > 	at com.carrotsearch.randomizedtesting.RandomizedRunner.access$600(RandomizedRunner.java:79)
[junit4:junit4]    > 	at com.carrotsearch.randomizedtesting.RandomizedRunner$6.evaluate(RandomizedRunner.java:737)
[junit4:junit4]    > 	at com.carrotsearch.randomizedtesting.RandomizedRunner$7.evaluate(RandomizedRunner.java:773)
[junit4:junit4]    > 	at com.carrotsearch.randomizedtesting.RandomizedRunner$8.evaluate(RandomizedRunner.java:787)
[junit4:junit4]    > 	at com.carrotsearch.randomizedtesting.rules.SystemPropertiesRestoreRule$1.evaluate(SystemPropertiesRestoreRule.java:53)
[junit4:junit4]    > 	at org.apache.lucene.util.TestRuleSetupTeardownChained$1.evaluate(TestRuleSetupTeardownChained.java:50)
[junit4:junit4]    > 	at org.apache.lucene.util.TestRuleFieldCacheSanity$1.evaluate(TestRuleFieldCacheSanity.java:51)
[junit4:junit4]    > 	at org.apache.lucene.util.AbstractBeforeAfterRule$1.evaluate(AbstractBeforeAfterRule.java:46)
[junit4:junit4]    > 	at com.carrotsearch.randomizedtesting.rules.SystemPropertiesInvariantRule$1.evaluate(SystemPropertiesInvariantRule.java:55)
[junit4:junit4]    > 	at org.apache.lucene.util.TestRuleThreadAndTestName$1.evaluate(TestRuleThreadAndTestName.java:49)
[junit4:junit4]    > 	at org.apache.lucene.util.TestRuleIgnoreAfterMaxFailures$1.evaluate(TestRuleIgnoreAfterMaxFailures.java:70)
[junit4:junit4]    > 	at org.apache.lucene.util.TestRuleMarkFailure$1.evaluate(TestRuleMarkFailure.java:48)
[junit4:junit4]    > 	at com.carrotsearch.randomizedtesting.rules.StatementAdapter.evaluate(StatementAdapter.java:36)
[junit4:junit4]    > 	at com.carrotsearch.randomizedtesting.ThreadLeakControl$StatementRunner.run(ThreadLeakControl.java:358)
[junit4:junit4]    > 	at com.carrotsearch.randomizedtesting.ThreadLeakControl.forkTimeoutingTask(ThreadLeakControl.java:782)
[junit4:junit4]    > 	at com.carrotsearch.randomizedtesting.ThreadLeakControl$3.evaluate(ThreadLeakControl.java:442)
[junit4:junit4]    > 	at com.carrotsearch.randomizedtesting.RandomizedRunner.runSingleTest(RandomizedRunner.java:746)
[junit4:junit4]    > 	at com.carrotsearch.randomizedtesting.RandomizedRunner$3.evaluate(RandomizedRunner.java:648)
[junit4:junit4]    > 	at com.carrotsearch.randomizedtesting.RandomizedRunner$4.evaluate(RandomizedRunner.java:682)
[junit4:junit4]    > 	at com.carrotsearch.randomizedtesting.RandomizedRunner$5.evaluate(RandomizedRunner.java:693)
[junit4:junit4]    > 	at com.carrotsearch.randomizedtesting.rules.StatementAdapter.evaluate(StatementAdapter.java:36)
[junit4:junit4]    > 	at com.carrotsearch.randomizedtesting.rules.SystemPropertiesRestoreRule$1.evaluate(SystemPropertiesRestoreRule.java:53)
[junit4:junit4]    > 	at org.apache.lucene.util.AbstractBeforeAfterRule$1.evaluate(AbstractBeforeAfterRule.java:46)
[junit4:junit4]    > 	at org.apache.lucene.util.TestRuleStoreClassName$1.evaluate(TestRuleStoreClassName.java:42)
[junit4:junit4]    > 	at com.carrotsearch.randomizedtesting.rules.SystemPropertiesInvariantRule$1.evaluate(SystemPropertiesInvariantRule.java:55)
[junit4:junit4]    > 	at com.carrotsearch.randomizedtesting.rules.NoShadowingOrOverridesOnMethodsRule$1.evaluate(NoShadowingOrOverridesOnMethodsRule.java:39)
[junit4:junit4]    > 	at com.carrotsearch.randomizedtesting.rules.NoShadowingOrOverridesOnMethodsRule$1.evaluate(NoShadowingOrOverridesOnMethodsRule.java:39)
[junit4:junit4]    > 	at com.carrotsearch.randomizedtesting.rules.StatementAdapter.evaluate(StatementAdapter.java:36)
[junit4:junit4]    > 	at org.apache.lucene.util.TestRuleAssertionsRequired$1.evaluate(TestRuleAssertionsRequired.java:43)
[junit4:junit4]    > 	at org.apache.lucene.util.TestRuleMarkFailure$1.evaluate(TestRuleMarkFailure.java:48)
[junit4:junit4]    > 	at org.apache.lucene.util.TestRuleIgnoreAfterMaxFailures$1.evaluate(TestRuleIgnoreAfterMaxFailures.java:70)
[junit4:junit4]    > 	at org.apache.lucene.util.TestRuleIgnoreTestSuites$1.evaluate(TestRuleIgnoreTestSuites.java:55)
[junit4:junit4]    > 	at com.carrotsearch.randomizedtesting.rules.StatementAdapter.evaluate(StatementAdapter.java:36)
[junit4:junit4]    > 	at com.carrotsearch.randomizedtesting.ThreadLeakControl$StatementRunner.run(ThreadLeakControl.java:358)
[junit4:junit4]    > 	at java.lang.Thread.run(Thread.java:679)
[junit4:junit4]   2> 121181 T3011 oas.SolrTestCaseJ4.deleteCore ###deleteCore
[junit4:junit4]   2> NOTE: test params are: codec=Lucene41: {range_facet_l=PostingsFormat(name=MockRandom), text=PostingsFormat(name=Lucene41WithOrds), _version_=PostingsFormat(name=MockRandom), rnd_b=PostingsFormat(name=Memory doPackFST= true), intDefault=PostingsFormat(name=MockRandom), id=PostingsFormat(name=Memory doPackFST= true), timestamp=PostingsFormat(name=MockRandom), a_t=PostingsFormat(name=MockRandom), range_facet_sl=PostingsFormat(name=Lucene41WithOrds), range_facet_si=Lucene41(blocksize=128), other_tl1=PostingsFormat(name=MockRandom), multiDefault=Lucene41(blocksize=128), a_si=Lucene41(blocksize=128)}, sim=RandomSimilarityProvider(queryNorm=true,coord=crazy): {}, locale=in, timezone=Asia/Calcutta
[junit4:junit4]   2> NOTE: FreeBSD 9.0-RELEASE amd64/Sun Microsystems Inc. 1.6.0_32 (64-bit)/cpus=16,threads=2,free=190916416,total=494993408
[junit4:junit4]   2> NOTE: All tests run in this JVM: [ConvertedLegacyTest, URLClassifyProcessorTest, TestReversedWildcardFilterFactory, ZkSolrClientTest, FileUtilsTest, BasicZkTest, ZkCLITest, SchemaVersionSpecificBehaviorTest, TestBM25SimilarityFactory, TestRealTimeGet, DOMUtilTest, OverseerTest, LegacyHTMLStripCharFilterTest, TestJmxIntegration, TestSolrCoreProperties, TermVectorComponentTest, ReturnFieldsTest, PingRequestHandlerTest, SolrIndexConfigTest, TestWriterPerf, TestCodecSupport, ShowFileRequestHandlerTest, FieldMutatingUpdateProcessorTest, LukeRequestHandlerTest, TestQuerySenderListener, PolyFieldTest, TestSort, OverseerCollectionProcessorTest, RAMDirectoryFactoryTest, TestFunctionQuery, LeaderElectionTest, QueryEqualityTest, HighlighterTest, SuggesterTSTTest, XmlUpdateRequestHandlerTest, TestQueryUtils, MultiTermTest, TestReplicationHandler, EchoParamsTest, PeerSyncTest, TestSolrDeletionPolicy1, StandardRequestHandlerTest, TestDocumentBuilder, TestRecovery, DebugComponentTest, PrimitiveFieldTypeTest, TestUtils, TermVectorComponentDistributedTest, TestSolrIndexConfig, DirectUpdateHandlerTest, TestDistributedGrouping, TestCSVResponseWriter, TestDocSet, StatsComponentTest, TestSolrDeletionPolicy2, TestUpdate, RecoveryZkTest, TestArbitraryIndexDir, TestPropInject, SpellCheckComponentTest, FullSolrCloudDistribCmdsTest, DistributedSpellCheckComponentTest, ZkControllerTest, TestDistributedSearch, SoftAutoCommitTest, AutoCommitTest, TestFaceting, TestHashPartitioner, SolrCoreTest, IndexBasedSpellCheckerTest, TestMultiCoreConfBootstrap, SimpleFacetsTest, DirectSolrSpellCheckerTest, SortByFunctionTest, BasicFunctionalityTest, SignatureUpdateProcessorFactoryTest, TestBinaryResponseWriter, TestIndexSearcher, CoreAdminHandlerTest, TestTrie, SolrRequestParserTest, DirectSolrConnectionTest, TestRemoteStreaming, CacheHeaderTest, TestWordDelimiterFilterFactory, TestCSVLoader, SpatialFilterTest, DocumentBuilderTest, MBeansHandlerTest, DistributedQueryElevationComponentTest, CurrencyFieldTest, TestPseudoReturnFields, DisMaxRequestHandlerTest, IndexSchemaTest, BinaryUpdateRequestHandlerTest, QueryParsingTest, TermsComponentTest, DistanceFunctionTest, SolrInfoMBeanTest, XsltUpdateRequestHandlerTest, TestQueryTypes, TestPHPSerializedResponseWriter, JsonLoaderTest, TestSurroundQueryParser, DocumentAnalysisRequestHandlerTest, DirectUpdateHandlerOptimizeTest, IndexSchemaRuntimeFieldTest, TestValueSourceCache, FastVectorHighlighterTest, JSONWriterTest, RequestHandlersTest, RequiredFieldsTest, TestOmitPositions, SuggesterFSTTest, CopyFieldTest, UniqFieldsUpdateProcessorFactoryTest, UpdateParamsTest, SuggesterTest, CSVRequestHandlerTest, TestSearchPerf, BadIndexSchemaTest, TestFoldingMultitermQuery, SolrCoreCheckLockOnStartupTest, TestIndexingPerformance, AlternateDirectoryTest, BadComponentTest, TestBinaryField, SOLR749Test, TestPropInjectDefaults, TestMergePolicyConfig, TestXIncludeConfig, IndexReaderFactoryTest, NumericFieldsTest, OutputWriterTest, TestConfig, TestPhraseSuggestions, TestPerFieldSimilarity, TestPluginEnable, TestDFRSimilarityFactory, TestIBSimilarityFactory, TimeZoneUtilsTest, TestFastLRUCache, PluginInfoTest, PrimUtilsTest, OpenExchangeRatesOrgProviderTest, ResourceLoaderTest, TestSystemIdResolver, TestSolrXMLSerializer, SpellingQueryConverterTest, TestBadConfig, TestLRUCache, UUIDFieldTest, ZkNodePropsTest, CircularListTest, BasicDistributedZk2Test, ClusterStateUpdateTest, SyncSliceTest]
[junit4:junit4] Completed on J1 in 121.21s, 1 test, 1 failure <<< FAILURES!

[...truncated 37 lines...]
BUILD FAILED
/usr/home/hudson/hudson-slave/workspace/Lucene-Solr-Tests-4.x-Java6/build.xml:353: The following error occurred while executing this line:
/usr/home/hudson/hudson-slave/workspace/Lucene-Solr-Tests-4.x-Java6/build.xml:39: The following error occurred while executing this line:
/usr/home/hudson/hudson-slave/workspace/Lucene-Solr-Tests-4.x-Java6/solr/build.xml:178: The following error occurred while executing this line:
/usr/home/hudson/hudson-slave/workspace/Lucene-Solr-Tests-4.x-Java6/solr/common-build.xml:438: The following error occurred while executing this line:
/usr/home/hudson/hudson-slave/workspace/Lucene-Solr-Tests-4.x-Java6/lucene/common-build.xml:1175: The following error occurred while executing this line:
/usr/home/hudson/hudson-slave/workspace/Lucene-Solr-Tests-4.x-Java6/lucene/common-build.xml:840: There were test failures: 243 suites, 1010 tests, 1 failure, 21 ignored (3 assumptions)

Total time: 35 minutes 21 seconds
Build step 'Invoke Ant' marked build as failure
Archiving artifacts
Recording test results
Email was triggered for: Failure
Sending email for trigger: Failure



Mime
View raw message