lucene-dev mailing list archives

Site index · List index
Message view « Date » · « Thread »
Top « Date » · « Thread »
From Policeman Jenkins Server <jenk...@sd-datasolutions.de>
Subject [JENKINS] Lucene-Solr-4.x-Windows (32bit/jdk1.6.0_37) - Build # 2138 - Still Failing!
Date Wed, 12 Dec 2012 02:08:02 GMT
Build: http://jenkins.sd-datasolutions.de/job/Lucene-Solr-4.x-Windows/2138/
Java: 32bit/jdk1.6.0_37 -client -XX:+UseParallelGC

4 tests failed.
FAILED:  org.apache.solr.cloud.BasicDistributedZk2Test.testDistribSearch

Error Message:
There are still nodes recoverying - waited for 180 seconds

Stack Trace:
java.lang.AssertionError: There are still nodes recoverying - waited for 180 seconds
	at __randomizedtesting.SeedInfo.seed([1CA5C4A878D4FC3D:9D434AB00F8B9C01]:0)
	at org.junit.Assert.fail(Assert.java:93)
	at org.apache.solr.cloud.AbstractDistribZkTestBase.waitForRecoveriesToFinish(AbstractDistribZkTestBase.java:165)
	at org.apache.solr.cloud.AbstractDistribZkTestBase.waitForRecoveriesToFinish(AbstractDistribZkTestBase.java:115)
	at org.apache.solr.cloud.AbstractDistribZkTestBase.waitForRecoveriesToFinish(AbstractDistribZkTestBase.java:110)
	at org.apache.solr.cloud.AbstractFullDistribZkTestBase.waitForRecoveriesToFinish(AbstractFullDistribZkTestBase.java:563)
	at org.apache.solr.cloud.BasicDistributedZk2Test.brindDownShardIndexSomeDocsAndRecover(BasicDistributedZk2Test.java:321)
	at org.apache.solr.cloud.BasicDistributedZk2Test.doTest(BasicDistributedZk2Test.java:83)
	at org.apache.solr.BaseDistributedSearchTestCase.testDistribSearch(BaseDistributedSearchTestCase.java:697)
	at sun.reflect.NativeMethodAccessorImpl.invoke0(Native Method)
	at sun.reflect.NativeMethodAccessorImpl.invoke(NativeMethodAccessorImpl.java:39)
	at sun.reflect.DelegatingMethodAccessorImpl.invoke(DelegatingMethodAccessorImpl.java:25)
	at java.lang.reflect.Method.invoke(Method.java:597)
	at com.carrotsearch.randomizedtesting.RandomizedRunner.invoke(RandomizedRunner.java:1559)
	at com.carrotsearch.randomizedtesting.RandomizedRunner.access$600(RandomizedRunner.java:79)
	at com.carrotsearch.randomizedtesting.RandomizedRunner$6.evaluate(RandomizedRunner.java:737)
	at com.carrotsearch.randomizedtesting.RandomizedRunner$7.evaluate(RandomizedRunner.java:773)
	at com.carrotsearch.randomizedtesting.RandomizedRunner$8.evaluate(RandomizedRunner.java:787)
	at com.carrotsearch.randomizedtesting.rules.SystemPropertiesRestoreRule$1.evaluate(SystemPropertiesRestoreRule.java:53)
	at org.apache.lucene.util.TestRuleSetupTeardownChained$1.evaluate(TestRuleSetupTeardownChained.java:50)
	at org.apache.lucene.util.TestRuleFieldCacheSanity$1.evaluate(TestRuleFieldCacheSanity.java:51)
	at org.apache.lucene.util.AbstractBeforeAfterRule$1.evaluate(AbstractBeforeAfterRule.java:46)
	at com.carrotsearch.randomizedtesting.rules.SystemPropertiesInvariantRule$1.evaluate(SystemPropertiesInvariantRule.java:55)
	at org.apache.lucene.util.TestRuleThreadAndTestName$1.evaluate(TestRuleThreadAndTestName.java:49)
	at org.apache.lucene.util.TestRuleIgnoreAfterMaxFailures$1.evaluate(TestRuleIgnoreAfterMaxFailures.java:70)
	at org.apache.lucene.util.TestRuleMarkFailure$1.evaluate(TestRuleMarkFailure.java:48)
	at com.carrotsearch.randomizedtesting.rules.StatementAdapter.evaluate(StatementAdapter.java:36)
	at com.carrotsearch.randomizedtesting.ThreadLeakControl$StatementRunner.run(ThreadLeakControl.java:358)
	at com.carrotsearch.randomizedtesting.ThreadLeakControl.forkTimeoutingTask(ThreadLeakControl.java:782)
	at com.carrotsearch.randomizedtesting.ThreadLeakControl$3.evaluate(ThreadLeakControl.java:442)
	at com.carrotsearch.randomizedtesting.RandomizedRunner.runSingleTest(RandomizedRunner.java:746)
	at com.carrotsearch.randomizedtesting.RandomizedRunner$3.evaluate(RandomizedRunner.java:648)
	at com.carrotsearch.randomizedtesting.RandomizedRunner$4.evaluate(RandomizedRunner.java:682)
	at com.carrotsearch.randomizedtesting.RandomizedRunner$5.evaluate(RandomizedRunner.java:693)
	at com.carrotsearch.randomizedtesting.rules.StatementAdapter.evaluate(StatementAdapter.java:36)
	at com.carrotsearch.randomizedtesting.rules.SystemPropertiesRestoreRule$1.evaluate(SystemPropertiesRestoreRule.java:53)
	at org.apache.lucene.util.AbstractBeforeAfterRule$1.evaluate(AbstractBeforeAfterRule.java:46)
	at org.apache.lucene.util.TestRuleStoreClassName$1.evaluate(TestRuleStoreClassName.java:42)
	at com.carrotsearch.randomizedtesting.rules.SystemPropertiesInvariantRule$1.evaluate(SystemPropertiesInvariantRule.java:55)
	at com.carrotsearch.randomizedtesting.rules.NoShadowingOrOverridesOnMethodsRule$1.evaluate(NoShadowingOrOverridesOnMethodsRule.java:39)
	at com.carrotsearch.randomizedtesting.rules.NoShadowingOrOverridesOnMethodsRule$1.evaluate(NoShadowingOrOverridesOnMethodsRule.java:39)
	at com.carrotsearch.randomizedtesting.rules.StatementAdapter.evaluate(StatementAdapter.java:36)
	at org.apache.lucene.util.TestRuleAssertionsRequired$1.evaluate(TestRuleAssertionsRequired.java:43)
	at org.apache.lucene.util.TestRuleMarkFailure$1.evaluate(TestRuleMarkFailure.java:48)
	at org.apache.lucene.util.TestRuleIgnoreAfterMaxFailures$1.evaluate(TestRuleIgnoreAfterMaxFailures.java:70)
	at org.apache.lucene.util.TestRuleIgnoreTestSuites$1.evaluate(TestRuleIgnoreTestSuites.java:55)
	at com.carrotsearch.randomizedtesting.rules.StatementAdapter.evaluate(StatementAdapter.java:36)
	at com.carrotsearch.randomizedtesting.ThreadLeakControl$StatementRunner.run(ThreadLeakControl.java:358)
	at java.lang.Thread.run(Thread.java:662)


FAILED:  org.apache.solr.cloud.BasicDistributedZkTest.testDistribSearch

Error Message:
Server at http://127.0.0.1:50556/solr returned non ok status:500, message:Server Error

Stack Trace:
org.apache.solr.common.SolrException: Server at http://127.0.0.1:50556/solr returned non ok status:500, message:Server Error
	at __randomizedtesting.SeedInfo.seed([1CA5C4A878D4FC3D:9D434AB00F8B9C01]:0)
	at org.apache.solr.client.solrj.impl.HttpSolrServer.request(HttpSolrServer.java:372)
	at org.apache.solr.client.solrj.impl.HttpSolrServer.request(HttpSolrServer.java:181)
	at org.apache.solr.client.solrj.request.CoreAdminRequest.process(CoreAdminRequest.java:429)
	at org.apache.solr.client.solrj.request.CoreAdminRequest.getStatus(CoreAdminRequest.java:472)
	at org.apache.solr.cloud.BasicDistributedZkTest.collectStartTimes(BasicDistributedZkTest.java:959)
	at org.apache.solr.cloud.BasicDistributedZkTest.testCollectionsAPI(BasicDistributedZkTest.java:795)
	at org.apache.solr.cloud.BasicDistributedZkTest.doTest(BasicDistributedZkTest.java:343)
	at org.apache.solr.BaseDistributedSearchTestCase.testDistribSearch(BaseDistributedSearchTestCase.java:697)
	at sun.reflect.NativeMethodAccessorImpl.invoke0(Native Method)
	at sun.reflect.NativeMethodAccessorImpl.invoke(NativeMethodAccessorImpl.java:39)
	at sun.reflect.DelegatingMethodAccessorImpl.invoke(DelegatingMethodAccessorImpl.java:25)
	at java.lang.reflect.Method.invoke(Method.java:597)
	at com.carrotsearch.randomizedtesting.RandomizedRunner.invoke(RandomizedRunner.java:1559)
	at com.carrotsearch.randomizedtesting.RandomizedRunner.access$600(RandomizedRunner.java:79)
	at com.carrotsearch.randomizedtesting.RandomizedRunner$6.evaluate(RandomizedRunner.java:737)
	at com.carrotsearch.randomizedtesting.RandomizedRunner$7.evaluate(RandomizedRunner.java:773)
	at com.carrotsearch.randomizedtesting.RandomizedRunner$8.evaluate(RandomizedRunner.java:787)
	at com.carrotsearch.randomizedtesting.rules.SystemPropertiesRestoreRule$1.evaluate(SystemPropertiesRestoreRule.java:53)
	at org.apache.lucene.util.TestRuleSetupTeardownChained$1.evaluate(TestRuleSetupTeardownChained.java:50)
	at org.apache.lucene.util.TestRuleFieldCacheSanity$1.evaluate(TestRuleFieldCacheSanity.java:51)
	at org.apache.lucene.util.AbstractBeforeAfterRule$1.evaluate(AbstractBeforeAfterRule.java:46)
	at com.carrotsearch.randomizedtesting.rules.SystemPropertiesInvariantRule$1.evaluate(SystemPropertiesInvariantRule.java:55)
	at org.apache.lucene.util.TestRuleThreadAndTestName$1.evaluate(TestRuleThreadAndTestName.java:49)
	at org.apache.lucene.util.TestRuleIgnoreAfterMaxFailures$1.evaluate(TestRuleIgnoreAfterMaxFailures.java:70)
	at org.apache.lucene.util.TestRuleMarkFailure$1.evaluate(TestRuleMarkFailure.java:48)
	at com.carrotsearch.randomizedtesting.rules.StatementAdapter.evaluate(StatementAdapter.java:36)
	at com.carrotsearch.randomizedtesting.ThreadLeakControl$StatementRunner.run(ThreadLeakControl.java:358)
	at com.carrotsearch.randomizedtesting.ThreadLeakControl.forkTimeoutingTask(ThreadLeakControl.java:782)
	at com.carrotsearch.randomizedtesting.ThreadLeakControl$3.evaluate(ThreadLeakControl.java:442)
	at com.carrotsearch.randomizedtesting.RandomizedRunner.runSingleTest(RandomizedRunner.java:746)
	at com.carrotsearch.randomizedtesting.RandomizedRunner$3.evaluate(RandomizedRunner.java:648)
	at com.carrotsearch.randomizedtesting.RandomizedRunner$4.evaluate(RandomizedRunner.java:682)
	at com.carrotsearch.randomizedtesting.RandomizedRunner$5.evaluate(RandomizedRunner.java:693)
	at com.carrotsearch.randomizedtesting.rules.StatementAdapter.evaluate(StatementAdapter.java:36)
	at com.carrotsearch.randomizedtesting.rules.SystemPropertiesRestoreRule$1.evaluate(SystemPropertiesRestoreRule.java:53)
	at org.apache.lucene.util.AbstractBeforeAfterRule$1.evaluate(AbstractBeforeAfterRule.java:46)
	at org.apache.lucene.util.TestRuleStoreClassName$1.evaluate(TestRuleStoreClassName.java:42)
	at com.carrotsearch.randomizedtesting.rules.SystemPropertiesInvariantRule$1.evaluate(SystemPropertiesInvariantRule.java:55)
	at com.carrotsearch.randomizedtesting.rules.NoShadowingOrOverridesOnMethodsRule$1.evaluate(NoShadowingOrOverridesOnMethodsRule.java:39)
	at com.carrotsearch.randomizedtesting.rules.NoShadowingOrOverridesOnMethodsRule$1.evaluate(NoShadowingOrOverridesOnMethodsRule.java:39)
	at com.carrotsearch.randomizedtesting.rules.StatementAdapter.evaluate(StatementAdapter.java:36)
	at org.apache.lucene.util.TestRuleAssertionsRequired$1.evaluate(TestRuleAssertionsRequired.java:43)
	at org.apache.lucene.util.TestRuleMarkFailure$1.evaluate(TestRuleMarkFailure.java:48)
	at org.apache.lucene.util.TestRuleIgnoreAfterMaxFailures$1.evaluate(TestRuleIgnoreAfterMaxFailures.java:70)
	at org.apache.lucene.util.TestRuleIgnoreTestSuites$1.evaluate(TestRuleIgnoreTestSuites.java:55)
	at com.carrotsearch.randomizedtesting.rules.StatementAdapter.evaluate(StatementAdapter.java:36)
	at com.carrotsearch.randomizedtesting.ThreadLeakControl$StatementRunner.run(ThreadLeakControl.java:358)
	at java.lang.Thread.run(Thread.java:662)


FAILED:  org.apache.solr.cloud.SyncSliceTest.testDistribSearch

Error Message:
There are still nodes recoverying - waited for 180 seconds

Stack Trace:
java.lang.AssertionError: There are still nodes recoverying - waited for 180 seconds
	at __randomizedtesting.SeedInfo.seed([1CA5C4A878D4FC3D:9D434AB00F8B9C01]:0)
	at org.junit.Assert.fail(Assert.java:93)
	at org.apache.solr.cloud.AbstractDistribZkTestBase.waitForRecoveriesToFinish(AbstractDistribZkTestBase.java:165)
	at org.apache.solr.cloud.AbstractDistribZkTestBase.waitForRecoveriesToFinish(AbstractDistribZkTestBase.java:115)
	at org.apache.solr.cloud.AbstractDistribZkTestBase.waitForRecoveriesToFinish(AbstractDistribZkTestBase.java:110)
	at org.apache.solr.cloud.AbstractFullDistribZkTestBase.waitForRecoveriesToFinish(AbstractFullDistribZkTestBase.java:563)
	at org.apache.solr.cloud.SyncSliceTest.doTest(SyncSliceTest.java:224)
	at org.apache.solr.BaseDistributedSearchTestCase.testDistribSearch(BaseDistributedSearchTestCase.java:697)
	at sun.reflect.NativeMethodAccessorImpl.invoke0(Native Method)
	at sun.reflect.NativeMethodAccessorImpl.invoke(NativeMethodAccessorImpl.java:39)
	at sun.reflect.DelegatingMethodAccessorImpl.invoke(DelegatingMethodAccessorImpl.java:25)
	at java.lang.reflect.Method.invoke(Method.java:597)
	at com.carrotsearch.randomizedtesting.RandomizedRunner.invoke(RandomizedRunner.java:1559)
	at com.carrotsearch.randomizedtesting.RandomizedRunner.access$600(RandomizedRunner.java:79)
	at com.carrotsearch.randomizedtesting.RandomizedRunner$6.evaluate(RandomizedRunner.java:737)
	at com.carrotsearch.randomizedtesting.RandomizedRunner$7.evaluate(RandomizedRunner.java:773)
	at com.carrotsearch.randomizedtesting.RandomizedRunner$8.evaluate(RandomizedRunner.java:787)
	at com.carrotsearch.randomizedtesting.rules.SystemPropertiesRestoreRule$1.evaluate(SystemPropertiesRestoreRule.java:53)
	at org.apache.lucene.util.TestRuleSetupTeardownChained$1.evaluate(TestRuleSetupTeardownChained.java:50)
	at org.apache.lucene.util.TestRuleFieldCacheSanity$1.evaluate(TestRuleFieldCacheSanity.java:51)
	at org.apache.lucene.util.AbstractBeforeAfterRule$1.evaluate(AbstractBeforeAfterRule.java:46)
	at com.carrotsearch.randomizedtesting.rules.SystemPropertiesInvariantRule$1.evaluate(SystemPropertiesInvariantRule.java:55)
	at org.apache.lucene.util.TestRuleThreadAndTestName$1.evaluate(TestRuleThreadAndTestName.java:49)
	at org.apache.lucene.util.TestRuleIgnoreAfterMaxFailures$1.evaluate(TestRuleIgnoreAfterMaxFailures.java:70)
	at org.apache.lucene.util.TestRuleMarkFailure$1.evaluate(TestRuleMarkFailure.java:48)
	at com.carrotsearch.randomizedtesting.rules.StatementAdapter.evaluate(StatementAdapter.java:36)
	at com.carrotsearch.randomizedtesting.ThreadLeakControl$StatementRunner.run(ThreadLeakControl.java:358)
	at com.carrotsearch.randomizedtesting.ThreadLeakControl.forkTimeoutingTask(ThreadLeakControl.java:782)
	at com.carrotsearch.randomizedtesting.ThreadLeakControl$3.evaluate(ThreadLeakControl.java:442)
	at com.carrotsearch.randomizedtesting.RandomizedRunner.runSingleTest(RandomizedRunner.java:746)
	at com.carrotsearch.randomizedtesting.RandomizedRunner$3.evaluate(RandomizedRunner.java:648)
	at com.carrotsearch.randomizedtesting.RandomizedRunner$4.evaluate(RandomizedRunner.java:682)
	at com.carrotsearch.randomizedtesting.RandomizedRunner$5.evaluate(RandomizedRunner.java:693)
	at com.carrotsearch.randomizedtesting.rules.StatementAdapter.evaluate(StatementAdapter.java:36)
	at com.carrotsearch.randomizedtesting.rules.SystemPropertiesRestoreRule$1.evaluate(SystemPropertiesRestoreRule.java:53)
	at org.apache.lucene.util.AbstractBeforeAfterRule$1.evaluate(AbstractBeforeAfterRule.java:46)
	at org.apache.lucene.util.TestRuleStoreClassName$1.evaluate(TestRuleStoreClassName.java:42)
	at com.carrotsearch.randomizedtesting.rules.SystemPropertiesInvariantRule$1.evaluate(SystemPropertiesInvariantRule.java:55)
	at com.carrotsearch.randomizedtesting.rules.NoShadowingOrOverridesOnMethodsRule$1.evaluate(NoShadowingOrOverridesOnMethodsRule.java:39)
	at com.carrotsearch.randomizedtesting.rules.NoShadowingOrOverridesOnMethodsRule$1.evaluate(NoShadowingOrOverridesOnMethodsRule.java:39)
	at com.carrotsearch.randomizedtesting.rules.StatementAdapter.evaluate(StatementAdapter.java:36)
	at org.apache.lucene.util.TestRuleAssertionsRequired$1.evaluate(TestRuleAssertionsRequired.java:43)
	at org.apache.lucene.util.TestRuleMarkFailure$1.evaluate(TestRuleMarkFailure.java:48)
	at org.apache.lucene.util.TestRuleIgnoreAfterMaxFailures$1.evaluate(TestRuleIgnoreAfterMaxFailures.java:70)
	at org.apache.lucene.util.TestRuleIgnoreTestSuites$1.evaluate(TestRuleIgnoreTestSuites.java:55)
	at com.carrotsearch.randomizedtesting.rules.StatementAdapter.evaluate(StatementAdapter.java:36)
	at com.carrotsearch.randomizedtesting.ThreadLeakControl$StatementRunner.run(ThreadLeakControl.java:358)
	at java.lang.Thread.run(Thread.java:662)


FAILED:  junit.framework.TestSuite.org.apache.solr.cloud.SyncSliceTest

Error Message:
ERROR: SolrIndexSearcher opens=46 closes=45

Stack Trace:
java.lang.AssertionError: ERROR: SolrIndexSearcher opens=46 closes=45
	at __randomizedtesting.SeedInfo.seed([1CA5C4A878D4FC3D]:0)
	at org.junit.Assert.fail(Assert.java:93)
	at org.apache.solr.SolrTestCaseJ4.endTrackingSearchers(SolrTestCaseJ4.java:242)
	at org.apache.solr.SolrTestCaseJ4.afterClass(SolrTestCaseJ4.java:97)
	at sun.reflect.NativeMethodAccessorImpl.invoke0(Native Method)
	at sun.reflect.NativeMethodAccessorImpl.invoke(NativeMethodAccessorImpl.java:39)
	at sun.reflect.DelegatingMethodAccessorImpl.invoke(DelegatingMethodAccessorImpl.java:25)
	at java.lang.reflect.Method.invoke(Method.java:597)
	at com.carrotsearch.randomizedtesting.RandomizedRunner.invoke(RandomizedRunner.java:1559)
	at com.carrotsearch.randomizedtesting.RandomizedRunner.access$600(RandomizedRunner.java:79)
	at com.carrotsearch.randomizedtesting.RandomizedRunner$5.evaluate(RandomizedRunner.java:700)
	at com.carrotsearch.randomizedtesting.rules.StatementAdapter.evaluate(StatementAdapter.java:36)
	at com.carrotsearch.randomizedtesting.rules.SystemPropertiesRestoreRule$1.evaluate(SystemPropertiesRestoreRule.java:53)
	at org.apache.lucene.util.AbstractBeforeAfterRule$1.evaluate(AbstractBeforeAfterRule.java:46)
	at org.apache.lucene.util.TestRuleStoreClassName$1.evaluate(TestRuleStoreClassName.java:42)
	at com.carrotsearch.randomizedtesting.rules.SystemPropertiesInvariantRule$1.evaluate(SystemPropertiesInvariantRule.java:55)
	at com.carrotsearch.randomizedtesting.rules.NoShadowingOrOverridesOnMethodsRule$1.evaluate(NoShadowingOrOverridesOnMethodsRule.java:39)
	at com.carrotsearch.randomizedtesting.rules.NoShadowingOrOverridesOnMethodsRule$1.evaluate(NoShadowingOrOverridesOnMethodsRule.java:39)
	at com.carrotsearch.randomizedtesting.rules.StatementAdapter.evaluate(StatementAdapter.java:36)
	at org.apache.lucene.util.TestRuleAssertionsRequired$1.evaluate(TestRuleAssertionsRequired.java:43)
	at org.apache.lucene.util.TestRuleMarkFailure$1.evaluate(TestRuleMarkFailure.java:48)
	at org.apache.lucene.util.TestRuleIgnoreAfterMaxFailures$1.evaluate(TestRuleIgnoreAfterMaxFailures.java:70)
	at org.apache.lucene.util.TestRuleIgnoreTestSuites$1.evaluate(TestRuleIgnoreTestSuites.java:55)
	at com.carrotsearch.randomizedtesting.rules.StatementAdapter.evaluate(StatementAdapter.java:36)
	at com.carrotsearch.randomizedtesting.ThreadLeakControl$StatementRunner.run(ThreadLeakControl.java:358)
	at java.lang.Thread.run(Thread.java:662)




Build Log:
[...truncated 7845 lines...]
[junit4:junit4] Suite: org.apache.solr.cloud.SyncSliceTest
[junit4:junit4]   2> 4 T743 oas.SolrTestCaseJ4.setUp ###Starting testDistribSearch
[junit4:junit4]   2> Creating dataDir: C:\Users\JenkinsSlave\workspace\Lucene-Solr-4.x-Windows\solr\build\solr-core\test\J0\.\solrtest-SyncSliceTest-1355276546278
[junit4:junit4]   2> 6 T743 oasc.ZkTestServer.run STARTING ZK TEST SERVER
[junit4:junit4]   2> 7 T744 oasc.ZkTestServer$ZKServerMain.runFromConfig Starting server
[junit4:junit4]   2> 12 T744 oazs.ZooKeeperServer.setTickTime tickTime set to 1000
[junit4:junit4]   2> 12 T744 oazs.ZooKeeperServer.setMinSessionTimeout minSessionTimeout set to -1
[junit4:junit4]   2> 12 T744 oazs.ZooKeeperServer.setMaxSessionTimeout maxSessionTimeout set to -1
[junit4:junit4]   2> 21 T744 oazs.NIOServerCnxnFactory.configure binding to port 0.0.0.0/0.0.0.0:0
[junit4:junit4]   2> 22 T744 oazsp.FileTxnSnapLog.save Snapshotting: 0x0 to C:\Users\JenkinsSlave\workspace\Lucene-Solr-4.x-Windows\solr\build\solr-core\test\J0\.\org.apache.solr.cloud.SyncSliceTest-1355276546277\zookeeper\server1\data\version-2\snapshot.0
[junit4:junit4]   2> 118 T743 oasc.ZkTestServer.run start zk server on port:49924
[junit4:junit4]   2> 118 T743 oaz.ZooKeeper.<init> Initiating client connection, connectString=127.0.0.1:49924 sessionTimeout=10000 watcher=org.apache.solr.common.cloud.ConnectionManager@15e8db2
[junit4:junit4]   2> 120 T743 oascc.ConnectionManager.waitForConnected Waiting for client to connect to ZooKeeper
[junit4:junit4]   2> 121 T749 oaz.ClientCnxn$SendThread.logStartConnect Opening socket connection to server 127.0.0.1/127.0.0.1:49924. Will not attempt to authenticate using SASL (access denied (javax.security.auth.AuthPermission getLoginConfiguration))
[junit4:junit4]   2> 121 T749 oaz.ClientCnxn$SendThread.primeConnection Socket connection established to 127.0.0.1/127.0.0.1:49924, initiating session
[junit4:junit4]   2> 122 T745 oazs.NIOServerCnxnFactory.run Accepted socket connection from /127.0.0.1:49927
[junit4:junit4]   2> 122 T745 oazs.ZooKeeperServer.processConnectRequest Client attempting to establish new session at /127.0.0.1:49927
[junit4:junit4]   2> 122 T747 oazsp.FileTxnLog.append Creating new log file: log.1
[junit4:junit4]   2> 131 T747 oazs.ZooKeeperServer.finishSessionInit Established session 0x13b8cc6f0f80000 with negotiated timeout 10000 for client /127.0.0.1:49927
[junit4:junit4]   2> 132 T749 oaz.ClientCnxn$SendThread.onConnected Session establishment complete on server 127.0.0.1/127.0.0.1:49924, sessionid = 0x13b8cc6f0f80000, negotiated timeout = 10000
[junit4:junit4]   2> 132 T750 oascc.ConnectionManager.process Watcher org.apache.solr.common.cloud.ConnectionManager@15e8db2 name:ZooKeeperConnection Watcher:127.0.0.1:49924 got event WatchedEvent state:SyncConnected type:None path:null path:null type:None
[junit4:junit4]   2> 132 T743 oascc.ConnectionManager.waitForConnected Client is connected to ZooKeeper
[junit4:junit4]   2> 133 T743 oascc.SolrZkClient.makePath makePath: /solr
[junit4:junit4]   2> 137 T748 oazs.PrepRequestProcessor.pRequest2Txn Processed session termination for sessionid: 0x13b8cc6f0f80000
[junit4:junit4]   2> 139 T745 oazs.NIOServerCnxn.closeSock Closed socket connection for client /127.0.0.1:49927 which had sessionid 0x13b8cc6f0f80000
[junit4:junit4]   2> 139 T743 oaz.ZooKeeper.close Session: 0x13b8cc6f0f80000 closed
[junit4:junit4]   2> 139 T750 oaz.ClientCnxn$EventThread.run EventThread shut down
[junit4:junit4]   2> 141 T743 oaz.ZooKeeper.<init> Initiating client connection, connectString=127.0.0.1:49924/solr sessionTimeout=10000 watcher=org.apache.solr.common.cloud.ConnectionManager@bb2e5f
[junit4:junit4]   2> 142 T743 oascc.ConnectionManager.waitForConnected Waiting for client to connect to ZooKeeper
[junit4:junit4]   2> 143 T751 oaz.ClientCnxn$SendThread.logStartConnect Opening socket connection to server 127.0.0.1/127.0.0.1:49924. Will not attempt to authenticate using SASL (access denied (javax.security.auth.AuthPermission getLoginConfiguration))
[junit4:junit4]   2> 143 T751 oaz.ClientCnxn$SendThread.primeConnection Socket connection established to 127.0.0.1/127.0.0.1:49924, initiating session
[junit4:junit4]   2> 143 T745 oazs.NIOServerCnxnFactory.run Accepted socket connection from /127.0.0.1:49930
[junit4:junit4]   2> 144 T745 oazs.ZooKeeperServer.processConnectRequest Client attempting to establish new session at /127.0.0.1:49930
[junit4:junit4]   2> 146 T747 oazs.ZooKeeperServer.finishSessionInit Established session 0x13b8cc6f0f80001 with negotiated timeout 10000 for client /127.0.0.1:49930
[junit4:junit4]   2> 146 T751 oaz.ClientCnxn$SendThread.onConnected Session establishment complete on server 127.0.0.1/127.0.0.1:49924, sessionid = 0x13b8cc6f0f80001, negotiated timeout = 10000
[junit4:junit4]   2> 146 T752 oascc.ConnectionManager.process Watcher org.apache.solr.common.cloud.ConnectionManager@bb2e5f name:ZooKeeperConnection Watcher:127.0.0.1:49924/solr got event WatchedEvent state:SyncConnected type:None path:null path:null type:None
[junit4:junit4]   2> 146 T743 oascc.ConnectionManager.waitForConnected Client is connected to ZooKeeper
[junit4:junit4]   2> 146 T743 oascc.SolrZkClient.makePath makePath: /collections/collection1
[junit4:junit4]   2> 151 T743 oascc.SolrZkClient.makePath makePath: /collections/collection1/shards
[junit4:junit4]   2> 156 T743 oascc.SolrZkClient.makePath makePath: /collections/control_collection
[junit4:junit4]   2> 159 T743 oascc.SolrZkClient.makePath makePath: /collections/control_collection/shards
[junit4:junit4]   2> 163 T743 oasc.AbstractZkTestCase.putConfig put C:\Users\JenkinsSlave\workspace\Lucene-Solr-4.x-Windows\solr\build\solr-core\test-files\solr\collection1\conf\solrconfig.xml to /configs/conf1/solrconfig.xml
[junit4:junit4]   2> 164 T743 oascc.SolrZkClient.makePath makePath: /configs/conf1/solrconfig.xml
[junit4:junit4]   2> 173 T743 oasc.AbstractZkTestCase.putConfig put C:\Users\JenkinsSlave\workspace\Lucene-Solr-4.x-Windows\solr\build\solr-core\test-files\solr\collection1\conf\schema.xml to /configs/conf1/schema.xml
[junit4:junit4]   2> 174 T743 oascc.SolrZkClient.makePath makePath: /configs/conf1/schema.xml
[junit4:junit4]   2> 178 T743 oasc.AbstractZkTestCase.putConfig put C:\Users\JenkinsSlave\workspace\Lucene-Solr-4.x-Windows\solr\build\solr-core\test-files\solr\collection1\conf\solrconfig.xml to /configs/conf1/solrconfig.xml
[junit4:junit4]   2> 178 T743 oascc.SolrZkClient.makePath makePath: /configs/conf1/solrconfig.xml
[junit4:junit4]   2> 184 T743 oasc.AbstractZkTestCase.putConfig put C:\Users\JenkinsSlave\workspace\Lucene-Solr-4.x-Windows\solr\build\solr-core\test-files\solr\collection1\conf\stopwords.txt to /configs/conf1/stopwords.txt
[junit4:junit4]   2> 185 T743 oascc.SolrZkClient.makePath makePath: /configs/conf1/stopwords.txt
[junit4:junit4]   2> 190 T743 oasc.AbstractZkTestCase.putConfig put C:\Users\JenkinsSlave\workspace\Lucene-Solr-4.x-Windows\solr\build\solr-core\test-files\solr\collection1\conf\protwords.txt to /configs/conf1/protwords.txt
[junit4:junit4]   2> 191 T743 oascc.SolrZkClient.makePath makePath: /configs/conf1/protwords.txt
[junit4:junit4]   2> 195 T743 oasc.AbstractZkTestCase.putConfig put C:\Users\JenkinsSlave\workspace\Lucene-Solr-4.x-Windows\solr\build\solr-core\test-files\solr\collection1\conf\currency.xml to /configs/conf1/currency.xml
[junit4:junit4]   2> 195 T743 oascc.SolrZkClient.makePath makePath: /configs/conf1/currency.xml
[junit4:junit4]   2> 200 T743 oasc.AbstractZkTestCase.putConfig put C:\Users\JenkinsSlave\workspace\Lucene-Solr-4.x-Windows\solr\build\solr-core\test-files\solr\collection1\conf\open-exchange-rates.json to /configs/conf1/open-exchange-rates.json
[junit4:junit4]   2> 201 T743 oascc.SolrZkClient.makePath makePath: /configs/conf1/open-exchange-rates.json
[junit4:junit4]   2> 205 T743 oasc.AbstractZkTestCase.putConfig put C:\Users\JenkinsSlave\workspace\Lucene-Solr-4.x-Windows\solr\build\solr-core\test-files\solr\collection1\conf\mapping-ISOLatin1Accent.txt to /configs/conf1/mapping-ISOLatin1Accent.txt
[junit4:junit4]   2> 205 T743 oascc.SolrZkClient.makePath makePath: /configs/conf1/mapping-ISOLatin1Accent.txt
[junit4:junit4]   2> 209 T743 oasc.AbstractZkTestCase.putConfig put C:\Users\JenkinsSlave\workspace\Lucene-Solr-4.x-Windows\solr\build\solr-core\test-files\solr\collection1\conf\old_synonyms.txt to /configs/conf1/old_synonyms.txt
[junit4:junit4]   2> 210 T743 oascc.SolrZkClient.makePath makePath: /configs/conf1/old_synonyms.txt
[junit4:junit4]   2> 215 T743 oasc.AbstractZkTestCase.putConfig put C:\Users\JenkinsSlave\workspace\Lucene-Solr-4.x-Windows\solr\build\solr-core\test-files\solr\collection1\conf\synonyms.txt to /configs/conf1/synonyms.txt
[junit4:junit4]   2> 215 T743 oascc.SolrZkClient.makePath makePath: /configs/conf1/synonyms.txt
[junit4:junit4]   2> 220 T748 oazs.PrepRequestProcessor.pRequest2Txn Processed session termination for sessionid: 0x13b8cc6f0f80001
[junit4:junit4]   2> 221 T752 oaz.ClientCnxn$EventThread.run EventThread shut down
[junit4:junit4]   2> 221 T745 oazs.NIOServerCnxn.doIO WARNING caught end of stream exception EndOfStreamException: Unable to read additional data from client sessionid 0x13b8cc6f0f80001, likely client has closed socket
[junit4:junit4]   2> 	at org.apache.zookeeper.server.NIOServerCnxn.doIO(NIOServerCnxn.java:220)
[junit4:junit4]   2> 	at org.apache.zookeeper.server.NIOServerCnxnFactory.run(NIOServerCnxnFactory.java:208)
[junit4:junit4]   2> 	at java.lang.Thread.run(Thread.java:662)
[junit4:junit4]   2> 
[junit4:junit4]   2> 221 T745 oazs.NIOServerCnxn.closeSock Closed socket connection for client /127.0.0.1:49930 which had sessionid 0x13b8cc6f0f80001
[junit4:junit4]   2> 221 T743 oaz.ZooKeeper.close Session: 0x13b8cc6f0f80001 closed
[junit4:junit4]   2> 558 T743 oejs.Server.doStart jetty-8.1.8.v20121106
[junit4:junit4]   2> 565 T743 oejs.AbstractConnector.doStart Started SelectChannelConnector@0.0.0.0:49931
[junit4:junit4]   2> 565 T743 oasc.SolrResourceLoader.locateSolrHome JNDI not configured for solr (NoInitialContextEx)
[junit4:junit4]   2> 566 T743 oasc.SolrResourceLoader.locateSolrHome using system property solr.solr.home: C:\Users\JenkinsSlave\workspace\Lucene-Solr-4.x-Windows\solr\build\solr-core\test\J0\.\org.apache.solr.cloud.SyncSliceTest-controljetty-1355276546495
[junit4:junit4]   2> 566 T743 oasc.SolrResourceLoader.<init> new SolrResourceLoader for deduced Solr Home: 'C:\Users\JenkinsSlave\workspace\Lucene-Solr-4.x-Windows\solr\build\solr-core\test\J0\.\org.apache.solr.cloud.SyncSliceTest-controljetty-1355276546495\'
[junit4:junit4]   2> 599 T743 oass.SolrDispatchFilter.init SolrDispatchFilter.init()
[junit4:junit4]   2> 599 T743 oasc.SolrResourceLoader.locateSolrHome JNDI not configured for solr (NoInitialContextEx)
[junit4:junit4]   2> 600 T743 oasc.SolrResourceLoader.locateSolrHome using system property solr.solr.home: C:\Users\JenkinsSlave\workspace\Lucene-Solr-4.x-Windows\solr\build\solr-core\test\J0\.\org.apache.solr.cloud.SyncSliceTest-controljetty-1355276546495
[junit4:junit4]   2> 600 T743 oasc.CoreContainer$Initializer.initialize looking for solr.xml: C:\Users\JenkinsSlave\workspace\Lucene-Solr-4.x-Windows\solr\build\solr-core\test\J0\.\org.apache.solr.cloud.SyncSliceTest-controljetty-1355276546495\solr.xml
[junit4:junit4]   2> 600 T743 oasc.CoreContainer.<init> New CoreContainer 24468694
[junit4:junit4]   2> 601 T743 oasc.CoreContainer.load Loading CoreContainer using Solr Home: 'C:\Users\JenkinsSlave\workspace\Lucene-Solr-4.x-Windows\solr\build\solr-core\test\J0\.\org.apache.solr.cloud.SyncSliceTest-controljetty-1355276546495\'
[junit4:junit4]   2> 601 T743 oasc.SolrResourceLoader.<init> new SolrResourceLoader for directory: 'C:\Users\JenkinsSlave\workspace\Lucene-Solr-4.x-Windows\solr\build\solr-core\test\J0\.\org.apache.solr.cloud.SyncSliceTest-controljetty-1355276546495\'
[junit4:junit4]   2> 626 T743 oasc.CoreContainer.load Registering Log Listener
[junit4:junit4]   2> 648 T743 oasc.CoreContainer.initZooKeeper Zookeeper client=127.0.0.1:49924/solr
[junit4:junit4]   2> 649 T743 oasc.ZkController.checkChrootPath zkHost includes chroot
[junit4:junit4]   2> 649 T743 oaz.ZooKeeper.<init> Initiating client connection, connectString=127.0.0.1:49924 sessionTimeout=60000 watcher=org.apache.solr.common.cloud.ConnectionManager@20afcb
[junit4:junit4]   2> 651 T743 oascc.ConnectionManager.waitForConnected Waiting for client to connect to ZooKeeper
[junit4:junit4]   2> 652 T762 oaz.ClientCnxn$SendThread.logStartConnect Opening socket connection to server 127.0.0.1/127.0.0.1:49924. Will not attempt to authenticate using SASL (access denied (javax.security.auth.AuthPermission getLoginConfiguration))
[junit4:junit4]   2> 653 T762 oaz.ClientCnxn$SendThread.primeConnection Socket connection established to 127.0.0.1/127.0.0.1:49924, initiating session
[junit4:junit4]   2> 653 T745 oazs.NIOServerCnxnFactory.run Accepted socket connection from /127.0.0.1:49936
[junit4:junit4]   2> 654 T745 oazs.ZooKeeperServer.processConnectRequest Client attempting to establish new session at /127.0.0.1:49936
[junit4:junit4]   2> 663 T747 oazs.ZooKeeperServer.finishSessionInit Established session 0x13b8cc6f0f80002 with negotiated timeout 20000 for client /127.0.0.1:49936
[junit4:junit4]   2> 663 T762 oaz.ClientCnxn$SendThread.onConnected Session establishment complete on server 127.0.0.1/127.0.0.1:49924, sessionid = 0x13b8cc6f0f80002, negotiated timeout = 20000
[junit4:junit4]   2> 663 T763 oascc.ConnectionManager.process Watcher org.apache.solr.common.cloud.ConnectionManager@20afcb name:ZooKeeperConnection Watcher:127.0.0.1:49924 got event WatchedEvent state:SyncConnected type:None path:null path:null type:None
[junit4:junit4]   2> 663 T743 oascc.ConnectionManager.waitForConnected Client is connected to ZooKeeper
[junit4:junit4]   2> 665 T748 oazs.PrepRequestProcessor.pRequest2Txn Processed session termination for sessionid: 0x13b8cc6f0f80002
[junit4:junit4]   2> 666 T743 oaz.ZooKeeper.close Session: 0x13b8cc6f0f80002 closed
[junit4:junit4]   2> 666 T763 oaz.ClientCnxn$EventThread.run EventThread shut down
[junit4:junit4]   2> 666 T743 oaz.ZooKeeper.<init> Initiating client connection, connectString=127.0.0.1:49924/solr sessionTimeout=8000 watcher=org.apache.solr.common.cloud.ConnectionManager@14a1347
[junit4:junit4]   2> 666 T745 oazs.NIOServerCnxn.closeSock Closed socket connection for client /127.0.0.1:49936 which had sessionid 0x13b8cc6f0f80002
[junit4:junit4]   2> 668 T743 oascc.ConnectionManager.waitForConnected Waiting for client to connect to ZooKeeper
[junit4:junit4]   2> 669 T764 oaz.ClientCnxn$SendThread.logStartConnect Opening socket connection to server 127.0.0.1/127.0.0.1:49924. Will not attempt to authenticate using SASL (access denied (javax.security.auth.AuthPermission getLoginConfiguration))
[junit4:junit4]   2> 669 T764 oaz.ClientCnxn$SendThread.primeConnection Socket connection established to 127.0.0.1/127.0.0.1:49924, initiating session
[junit4:junit4]   2> 669 T745 oazs.NIOServerCnxnFactory.run Accepted socket connection from /127.0.0.1:49939
[junit4:junit4]   2> 670 T745 oazs.ZooKeeperServer.processConnectRequest Client attempting to establish new session at /127.0.0.1:49939
[junit4:junit4]   2> 671 T747 oazs.ZooKeeperServer.finishSessionInit Established session 0x13b8cc6f0f80003 with negotiated timeout 8000 for client /127.0.0.1:49939
[junit4:junit4]   2> 671 T764 oaz.ClientCnxn$SendThread.onConnected Session establishment complete on server 127.0.0.1/127.0.0.1:49924, sessionid = 0x13b8cc6f0f80003, negotiated timeout = 8000
[junit4:junit4]   2> 671 T765 oascc.ConnectionManager.process Watcher org.apache.solr.common.cloud.ConnectionManager@14a1347 name:ZooKeeperConnection Watcher:127.0.0.1:49924/solr got event WatchedEvent state:SyncConnected type:None path:null path:null type:None
[junit4:junit4]   2> 672 T743 oascc.ConnectionManager.waitForConnected Client is connected to ZooKeeper
[junit4:junit4]   2> 674 T748 oazs.PrepRequestProcessor.pRequest Got user-level KeeperException when processing sessionid:0x13b8cc6f0f80003 type:create cxid:0x2 zxid:0x1b txntype:-1 reqpath:n/a Error Path:/solr/overseer Error:KeeperErrorCode = NodeExists for /solr/overseer
[junit4:junit4]   2> 677 T743 oascc.SolrZkClient.makePath makePath: /live_nodes
[junit4:junit4]   2> 680 T743 oasc.ZkController.createEphemeralLiveNode Register node as live in ZooKeeper:/live_nodes/127.0.0.1:49931_solr
[junit4:junit4]   2> 681 T748 oazs.PrepRequestProcessor.pRequest Got user-level KeeperException when processing sessionid:0x13b8cc6f0f80003 type:delete cxid:0x7 zxid:0x1d txntype:-1 reqpath:n/a Error Path:/solr/live_nodes/127.0.0.1:49931_solr Error:KeeperErrorCode = NoNode for /solr/live_nodes/127.0.0.1:49931_solr
[junit4:junit4]   2> 682 T743 oascc.SolrZkClient.makePath makePath: /live_nodes/127.0.0.1:49931_solr
[junit4:junit4]   2> 686 T743 oashc.HttpShardHandlerFactory.getParameter Setting socketTimeout to: 0
[junit4:junit4]   2> 686 T743 oashc.HttpShardHandlerFactory.getParameter Setting urlScheme to: http://
[junit4:junit4]   2> 686 T743 oashc.HttpShardHandlerFactory.getParameter Setting connTimeout to: 0
[junit4:junit4]   2> 686 T743 oashc.HttpShardHandlerFactory.getParameter Setting maxConnectionsPerHost to: 20
[junit4:junit4]   2> 686 T743 oashc.HttpShardHandlerFactory.getParameter Setting corePoolSize to: 0
[junit4:junit4]   2> 688 T743 oashc.HttpShardHandlerFactory.getParameter Setting maximumPoolSize to: 2147483647
[junit4:junit4]   2> 688 T743 oashc.HttpShardHandlerFactory.getParameter Setting maxThreadIdleTime to: 5
[junit4:junit4]   2> 688 T743 oashc.HttpShardHandlerFactory.getParameter Setting sizeOfQueue to: -1
[junit4:junit4]   2> 688 T743 oashc.HttpShardHandlerFactory.getParameter Setting fairnessPolicy to: false
[junit4:junit4]   2> 689 T743 oascsi.HttpClientUtil.createClient Creating new http client, config:maxConnectionsPerHost=20&maxConnections=10000&socketTimeout=0&connTimeout=0&retry=false
[junit4:junit4]   2> 699 T743 oascc.SolrZkClient.makePath makePath: /overseer_elect/election
[junit4:junit4]   2> 707 T748 oazs.PrepRequestProcessor.pRequest Got user-level KeeperException when processing sessionid:0x13b8cc6f0f80003 type:delete cxid:0x15 zxid:0x22 txntype:-1 reqpath:n/a Error Path:/solr/overseer_elect/leader Error:KeeperErrorCode = NoNode for /solr/overseer_elect/leader
[junit4:junit4]   2> 709 T743 oascc.SolrZkClient.makePath makePath: /overseer_elect/leader
[junit4:junit4]   2> 712 T743 oasc.Overseer.start Overseer (id=88819403738054659-127.0.0.1:49931_solr-n_0000000000) starting
[junit4:junit4]   2> 713 T748 oazs.PrepRequestProcessor.pRequest Got user-level KeeperException when processing sessionid:0x13b8cc6f0f80003 type:create cxid:0x1a zxid:0x24 txntype:-1 reqpath:n/a Error Path:/solr/overseer Error:KeeperErrorCode = NodeExists for /solr/overseer
[junit4:junit4]   2> 714 T748 oazs.PrepRequestProcessor.pRequest Got user-level KeeperException when processing sessionid:0x13b8cc6f0f80003 type:create cxid:0x1b zxid:0x25 txntype:-1 reqpath:n/a Error Path:/solr/overseer Error:KeeperErrorCode = NodeExists for /solr/overseer
[junit4:junit4]   2> 716 T748 oazs.PrepRequestProcessor.pRequest Got user-level KeeperException when processing sessionid:0x13b8cc6f0f80003 type:create cxid:0x1c zxid:0x26 txntype:-1 reqpath:n/a Error Path:/solr/overseer Error:KeeperErrorCode = NodeExists for /solr/overseer
[junit4:junit4]   2> 717 T748 oazs.PrepRequestProcessor.pRequest Got user-level KeeperException when processing sessionid:0x13b8cc6f0f80003 type:create cxid:0x1d zxid:0x27 txntype:-1 reqpath:n/a Error Path:/solr/overseer Error:KeeperErrorCode = NodeExists for /solr/overseer
[junit4:junit4]   2> 720 T767 oasc.OverseerCollectionProcessor.run Process current queue of collection messages
[junit4:junit4]   2> 720 T743 oascc.SolrZkClient.makePath makePath: /clusterstate.json
[junit4:junit4]   2> 724 T743 oascc.ZkStateReader.createClusterStateWatchersAndUpdate Updating cluster state from ZooKeeper... 
[junit4:junit4]   2> 726 T766 oasc.Overseer$ClusterStateUpdater.run Starting to work on the main queue
[junit4:junit4]   2> 732 T768 oasc.CoreContainer.create Creating SolrCore 'collection1' using instanceDir: C:\Users\JenkinsSlave\workspace\Lucene-Solr-4.x-Windows\solr\build\solr-core\test\J0\.\org.apache.solr.cloud.SyncSliceTest-controljetty-1355276546495\collection1
[junit4:junit4]   2> 734 T768 oasc.ZkController.createCollectionZkNode Check for collection zkNode:control_collection
[junit4:junit4]   2> 734 T768 oasc.ZkController.createCollectionZkNode Collection zkNode exists
[junit4:junit4]   2> 734 T768 oasc.ZkController.readConfigName Load collection config from:/collections/control_collection
[junit4:junit4]   2> 737 T768 oasc.SolrResourceLoader.<init> new SolrResourceLoader for directory: 'C:\Users\JenkinsSlave\workspace\Lucene-Solr-4.x-Windows\solr\build\solr-core\test\J0\.\org.apache.solr.cloud.SyncSliceTest-controljetty-1355276546495\collection1\'
[junit4:junit4]   2> 737 T768 oasc.SolrResourceLoader.replaceClassLoader Adding 'file:/C:/Users/JenkinsSlave/workspace/Lucene-Solr-4.x-Windows/solr/build/solr-core/test/J0/org.apache.solr.cloud.SyncSliceTest-controljetty-1355276546495/collection1/lib/classes/' to classloader
[junit4:junit4]   2> 738 T768 oasc.SolrResourceLoader.replaceClassLoader Adding 'file:/C:/Users/JenkinsSlave/workspace/Lucene-Solr-4.x-Windows/solr/build/solr-core/test/J0/org.apache.solr.cloud.SyncSliceTest-controljetty-1355276546495/collection1/lib/README' to classloader
[junit4:junit4]   2> 803 T768 oasc.SolrConfig.<init> Using Lucene MatchVersion: LUCENE_41
[junit4:junit4]   2> 896 T768 oasc.SolrConfig.<init> Loaded SolrConfig: solrconfig.xml
[junit4:junit4]   2> 898 T768 oass.IndexSchema.readSchema Reading Solr Schema
[junit4:junit4]   2> 904 T768 oass.IndexSchema.readSchema Schema name=test
[junit4:junit4]   2> 1745 T768 oass.OpenExchangeRatesOrgProvider.init Initialized with rates=open-exchange-rates.json, refreshInterval=1440.
[junit4:junit4]   2> 1759 T768 oass.IndexSchema.readSchema default search field in schema is text
[junit4:junit4]   2> 1764 T768 oass.IndexSchema.readSchema unique key field: id
[junit4:junit4]   2> 1781 T768 oass.FileExchangeRateProvider.reload Reloading exchange rates from file currency.xml
[junit4:junit4]   2> 1786 T768 oass.FileExchangeRateProvider.reload Reloading exchange rates from file currency.xml
[junit4:junit4]   2> 1792 T768 oass.OpenExchangeRatesOrgProvider.reload Reloading exchange rates from open-exchange-rates.json
[junit4:junit4]   2> 1797 T768 oass.OpenExchangeRatesOrgProvider.reload Reloading exchange rates from open-exchange-rates.json
[junit4:junit4]   2> 1798 T768 oasc.SolrCore.<init> [collection1] Opening new SolrCore at C:\Users\JenkinsSlave\workspace\Lucene-Solr-4.x-Windows\solr\build\solr-core\test\J0\.\org.apache.solr.cloud.SyncSliceTest-controljetty-1355276546495\collection1\, dataDir=.\org.apache.solr.cloud.SyncSliceTest-1355276546277/control/data\
[junit4:junit4]   2> 1798 T768 oasc.JmxMonitoredMap.<init> JMX monitoring is enabled. Adding Solr mbeans to JMX Server: com.sun.jmx.mbeanserver.JmxMBeanServer@15c62bc
[junit4:junit4]   2> 1841 T768 oasc.SolrCore.getNewIndexDir New index directory detected: old=null new=.\org.apache.solr.cloud.SyncSliceTest-1355276546277/control/data\index/
[junit4:junit4]   2> 1842 T768 oasc.SolrCore.initIndex WARNING [collection1] Solr index directory '.\org.apache.solr.cloud.SyncSliceTest-1355276546277\control\data\index' doesn't exist. Creating new index...
[junit4:junit4]   2> 1843 T768 oasc.CachingDirectoryFactory.get return new directory for C:\Users\JenkinsSlave\workspace\Lucene-Solr-4.x-Windows\solr\build\solr-core\test\J0\.\org.apache.solr.cloud.SyncSliceTest-1355276546277\control\data\index forceNew:false
[junit4:junit4]   2> 1855 T768 oasc.SolrDeletionPolicy.onCommit SolrDeletionPolicy.onCommit: commits:num=1
[junit4:junit4]   2> 		commit{dir=RateLimitedDirectoryWrapper(org.apache.lucene.store.SimpleFSDirectory@C:\Users\JenkinsSlave\workspace\Lucene-Solr-4.x-Windows\solr\build\solr-core\test\J0\org.apache.solr.cloud.SyncSliceTest-1355276546277\control\data\index lockFactory=org.apache.lucene.store.NativeFSLockFactory@16eb0c3),segFN=segments_1,generation=1,filenames=[segments_1]
[junit4:junit4]   2> 1855 T768 oasc.SolrDeletionPolicy.updateCommits newest commit = 1
[junit4:junit4]   2> 1857 T768 oasc.SolrCore.initWriters created xml: solr.XMLResponseWriter
[junit4:junit4]   2> 1858 T768 oasup.UpdateRequestProcessorChain.init inserting DistributedUpdateProcessorFactory into updateRequestProcessorChain "dedupe"
[junit4:junit4]   2> 1858 T768 oasup.UpdateRequestProcessorChain.init inserting DistributedUpdateProcessorFactory into updateRequestProcessorChain "dedupe-allfields"
[junit4:junit4]   2> 1858 T768 oasup.UpdateRequestProcessorChain.init inserting DistributedUpdateProcessorFactory into updateRequestProcessorChain "stored_sig"
[junit4:junit4]   2> 1858 T768 oasup.UpdateRequestProcessorChain.init inserting DistributedUpdateProcessorFactory into updateRequestProcessorChain "uniq-fields"
[junit4:junit4]   2> 1859 T768 oasup.UpdateRequestProcessorChain.init inserting DistributedUpdateProcessorFactory into updateRequestProcessorChain "distrib-dup-test-chain-implicit"
[junit4:junit4]   2> 1859 T768 oasc.RequestHandlers.initHandlersFromConfig adding lazy requestHandler: solr.ReplicationHandler
[junit4:junit4]   2> 1860 T768 oasc.RequestHandlers.initHandlersFromConfig created /replication: solr.ReplicationHandler
[junit4:junit4]   2> 1861 T768 oasc.RequestHandlers.initHandlersFromConfig created standard: solr.StandardRequestHandler
[junit4:junit4]   2> 1861 T768 oasc.RequestHandlers.initHandlersFromConfig created /get: solr.RealTimeGetHandler
[junit4:junit4]   2> 1863 T768 oasc.RequestHandlers.initHandlersFromConfig created dismax: solr.SearchHandler
[junit4:junit4]   2> 1864 T768 oasc.RequestHandlers.initHandlersFromConfig created mock: org.apache.solr.core.MockQuerySenderListenerReqHandler
[junit4:junit4]   2> 1864 T768 oasc.RequestHandlers.initHandlersFromConfig created /admin/: org.apache.solr.handler.admin.AdminHandlers
[junit4:junit4]   2> 1864 T768 oasc.RequestHandlers.initHandlersFromConfig created defaults: solr.StandardRequestHandler
[junit4:junit4]   2> 1865 T768 oasc.RequestHandlers.initHandlersFromConfig adding lazy requestHandler: solr.StandardRequestHandler
[junit4:junit4]   2> 1865 T768 oasc.RequestHandlers.initHandlersFromConfig created lazy: solr.StandardRequestHandler
[junit4:junit4]   2> 1865 T768 oasc.RequestHandlers.initHandlersFromConfig created /update: solr.UpdateRequestHandler
[junit4:junit4]   2> 1867 T768 oasc.RequestHandlers.initHandlersFromConfig created /terms: org.apache.solr.handler.component.SearchHandler
[junit4:junit4]   2> 1868 T768 oasc.RequestHandlers.initHandlersFromConfig created spellCheckCompRH: org.apache.solr.handler.component.SearchHandler
[junit4:junit4]   2> 1868 T768 oasc.RequestHandlers.initHandlersFromConfig created spellCheckCompRH_Direct: org.apache.solr.handler.component.SearchHandler
[junit4:junit4]   2> 1869 T768 oasc.RequestHandlers.initHandlersFromConfig created spellCheckWithWordbreak: org.apache.solr.handler.component.SearchHandler
[junit4:junit4]   2> 1869 T768 oasc.RequestHandlers.initHandlersFromConfig created spellCheckWithWordbreak_Direct: org.apache.solr.handler.component.SearchHandler
[junit4:junit4]   2> 1870 T768 oasc.RequestHandlers.initHandlersFromConfig created spellCheckCompRH1: org.apache.solr.handler.component.SearchHandler
[junit4:junit4]   2> 1871 T768 oasc.RequestHandlers.initHandlersFromConfig created tvrh: org.apache.solr.handler.component.SearchHandler
[junit4:junit4]   2> 1871 T768 oasc.RequestHandlers.initHandlersFromConfig created /mlt: solr.MoreLikeThisHandler
[junit4:junit4]   2> 1872 T768 oasc.RequestHandlers.initHandlersFromConfig created /debug/dump: solr.DumpRequestHandler
[junit4:junit4]   2> 1881 T768 oashl.XMLLoader.init xsltCacheLifetimeSeconds=60
[junit4:junit4]   2> 1887 T768 oasc.SolrCore.initDeprecatedSupport WARNING solrconfig.xml uses deprecated <admin/gettableFiles>, Please update your config to use the ShowFileRequestHandler.
[junit4:junit4]   2> 1888 T768 oasc.SolrCore.initDeprecatedSupport WARNING adding ShowFileRequestHandler with hidden files: [SCHEMA.XML, OLD_SYNONYMS.TXT, STOPWORDS.TXT, PROTWORDS.TXT, OPEN-EXCHANGE-RATES.JSON, SYNONYMS.TXT, CURRENCY.XML, MAPPING-ISOLATIN1ACCENT.TXT]
[junit4:junit4]   2> 1895 T768 oass.SolrIndexSearcher.<init> Opening Searcher@847468 main
[junit4:junit4]   2> 1895 T768 oass.SolrIndexSearcher.getIndexDir WARNING WARNING: Directory impl does not support setting indexDir: org.apache.lucene.store.RateLimitedDirectoryWrapper
[junit4:junit4]   2> 1897 T768 oasu.CommitTracker.<init> Hard AutoCommit: disabled
[junit4:junit4]   2> 1897 T768 oasu.CommitTracker.<init> Soft AutoCommit: disabled
[junit4:junit4]   2> 1897 T768 oashc.SpellCheckComponent.inform Initializing spell checkers
[junit4:junit4]   2> 1909 T768 oass.DirectSolrSpellChecker.init init: {name=direct,classname=DirectSolrSpellChecker,field=lowerfilt,minQueryLength=3}
[junit4:junit4]   2> 1977 T769 oasc.SolrCore.registerSearcher [collection1] Registered new searcher Searcher@847468 main{StandardDirectoryReader(segments_1:1)}
[junit4:junit4]   2> 1984 T768 oasc.ZkController.publish publishing core=collection1 state=down
[junit4:junit4]   2> 1984 T768 oasc.ZkController.publish numShards not found on descriptor - reading it from system property
[junit4:junit4]   2> 1985 T748 oazs.PrepRequestProcessor.pRequest Got user-level KeeperException when processing sessionid:0x13b8cc6f0f80003 type:create cxid:0x56 zxid:0x2a txntype:-1 reqpath:n/a Error Path:/solr/overseer/queue Error:KeeperErrorCode = NoNode for /solr/overseer/queue
[junit4:junit4]   2> 1991 T768 oasc.CoreContainer.register registering core: collection1
[junit4:junit4]   2> 1991 T768 oasc.ZkController.register Register shard - core:collection1 address:http://127.0.0.1:49931/solr shardId:control_shard
[junit4:junit4]   2> 1992 T768 oascc.SolrZkClient.makePath makePath: /collections/control_collection/leader_elect/control_shard/election
[junit4:junit4]   2> 2003 T748 oazs.PrepRequestProcessor.pRequest Got user-level KeeperException when processing sessionid:0x13b8cc6f0f80003 type:delete cxid:0x65 zxid:0x31 txntype:-1 reqpath:n/a Error Path:/solr/collections/control_collection/leaders Error:KeeperErrorCode = NoNode for /solr/collections/control_collection/leaders
[junit4:junit4]   2> 2004 T768 oasc.ShardLeaderElectionContext.runLeaderProcess Running the leader process.
[junit4:junit4]   2> 2005 T748 oazs.PrepRequestProcessor.pRequest Got user-level KeeperException when processing sessionid:0x13b8cc6f0f80003 type:create cxid:0x66 zxid:0x32 txntype:-1 reqpath:n/a Error Path:/solr/overseer Error:KeeperErrorCode = NodeExists for /solr/overseer
[junit4:junit4]   2> 2391 T766 oascc.ZkStateReader.updateClusterState Updating cloud state from ZooKeeper... 
[junit4:junit4]   2> 2392 T766 oasc.Overseer$ClusterStateUpdater.updateState Update state numShards=null message={
[junit4:junit4]   2> 	  "operation":"state",
[junit4:junit4]   2> 	  "numShards":null,
[junit4:junit4]   2> 	  "shard":"control_shard",
[junit4:junit4]   2> 	  "roles":null,
[junit4:junit4]   2> 	  "state":"down",
[junit4:junit4]   2> 	  "core":"collection1",
[junit4:junit4]   2> 	  "collection":"control_collection",
[junit4:junit4]   2> 	  "node_name":"127.0.0.1:49931_solr",
[junit4:junit4]   2> 	  "base_url":"http://127.0.0.1:49931/solr"}
[junit4:junit4]   2> 2392 T748 oazs.PrepRequestProcessor.pRequest Got user-level KeeperException when processing sessionid:0x13b8cc6f0f80003 type:create cxid:0x6d zxid:0x34 txntype:-1 reqpath:n/a Error Path:/solr/overseer/queue-work Error:KeeperErrorCode = NoNode for /solr/overseer/queue-work
[junit4:junit4]   2> 2408 T765 oascc.ZkStateReader$2.process A cluster state change has occurred - updating... (1)
[junit4:junit4]   2> 2559 T768 oasc.ShardLeaderElectionContext.waitForReplicasToComeUp Enough replicas found to continue.
[junit4:junit4]   2> 2559 T768 oasc.ShardLeaderElectionContext.runLeaderProcess I may be the new leader - try and sync
[junit4:junit4]   2> 2559 T768 oasc.SyncStrategy.sync Sync replicas to http://127.0.0.1:49931/solr/collection1/
[junit4:junit4]   2> 2560 T768 oasc.SyncStrategy.syncReplicas Sync Success - now sync replicas to me
[junit4:junit4]   2> 2560 T768 oasc.SyncStrategy.syncToMe http://127.0.0.1:49931/solr/collection1/ has no replicas
[junit4:junit4]   2> 2560 T768 oasc.ShardLeaderElectionContext.runLeaderProcess I am the new leader: http://127.0.0.1:49931/solr/collection1/
[junit4:junit4]   2> 2560 T768 oascc.SolrZkClient.makePath makePath: /collections/control_collection/leaders/control_shard
[junit4:junit4]   2> 2567 T748 oazs.PrepRequestProcessor.pRequest Got user-level KeeperException when processing sessionid:0x13b8cc6f0f80003 type:create cxid:0x8c zxid:0x3f txntype:-1 reqpath:n/a Error Path:/solr/overseer Error:KeeperErrorCode = NodeExists for /solr/overseer
[junit4:junit4]   2> 2967 T766 oascc.ZkStateReader.updateClusterState Updating cloud state from ZooKeeper... 
[junit4:junit4]   2> 2974 T765 oascc.ZkStateReader$2.process A cluster state change has occurred - updating... (1)
[junit4:junit4]   2> 3018 T768 oasc.ZkController.register We are http://127.0.0.1:49931/solr/collection1/ and leader is http://127.0.0.1:49931/solr/collection1/
[junit4:junit4]   2> 3018 T768 oasc.ZkController.register No LogReplay needed for core=collection1 baseURL=http://127.0.0.1:49931/solr
[junit4:junit4]   2> 3018 T768 oasc.ZkController.checkRecovery I am the leader, no recovery necessary
[junit4:junit4]   2> 3018 T768 oasc.ZkController.publish publishing core=collection1 state=active
[junit4:junit4]   2> 3018 T768 oasc.ZkController.publish numShards not found on descriptor - reading it from system property
[junit4:junit4]   2> 3023 T768 oascc.ZkStateReader.updateClusterState Updating cloud state from ZooKeeper... 
[junit4:junit4]   2> 3024 T743 oass.SolrDispatchFilter.init user.dir=C:\Users\JenkinsSlave\workspace\Lucene-Solr-4.x-Windows\solr\build\solr-core\test\J0
[junit4:junit4]   2> 3024 T743 oass.SolrDispatchFilter.init SolrDispatchFilter.init() done
[junit4:junit4]   2> 3024 T743 oascsi.HttpClientUtil.createClient Creating new http client, config:maxConnections=128&maxConnectionsPerHost=32&followRedirects=false
[junit4:junit4]   2> 3409 T743 oejs.Server.doStart jetty-8.1.8.v20121106
[junit4:junit4]   2> 3413 T743 oejs.AbstractConnector.doStart Started SelectChannelConnector@0.0.0.0:49940
[junit4:junit4]   2> 3413 T743 oasc.SolrResourceLoader.locateSolrHome JNDI not configured for solr (NoInitialContextEx)
[junit4:junit4]   2> 3414 T743 oasc.SolrResourceLoader.locateSolrHome using system property solr.solr.home: C:\Users\JenkinsSlave\workspace\Lucene-Solr-4.x-Windows\solr\build\solr-core\test\J0\.\solrtest-jetty1-1355276549306
[junit4:junit4]   2> 3414 T743 oasc.SolrResourceLoader.<init> new SolrResourceLoader for deduced Solr Home: 'C:\Users\JenkinsSlave\workspace\Lucene-Solr-4.x-Windows\solr\build\solr-core\test\J0\.\solrtest-jetty1-1355276549306\'
[junit4:junit4]   2> 3458 T743 oass.SolrDispatchFilter.init SolrDispatchFilter.init()
[junit4:junit4]   2> 3459 T743 oasc.SolrResourceLoader.locateSolrHome JNDI not configured for solr (NoInitialContextEx)
[junit4:junit4]   2> 3459 T743 oasc.SolrResourceLoader.locateSolrHome using system property solr.solr.home: C:\Users\JenkinsSlave\workspace\Lucene-Solr-4.x-Windows\solr\build\solr-core\test\J0\.\solrtest-jetty1-1355276549306
[junit4:junit4]   2> 3459 T743 oasc.CoreContainer$Initializer.initialize looking for solr.xml: C:\Users\JenkinsSlave\workspace\Lucene-Solr-4.x-Windows\solr\build\solr-core\test\J0\.\solrtest-jetty1-1355276549306\solr.xml
[junit4:junit4]   2> 3459 T743 oasc.CoreContainer.<init> New CoreContainer 11375617
[junit4:junit4]   2> 3460 T743 oasc.CoreContainer.load Loading CoreContainer using Solr Home: 'C:\Users\JenkinsSlave\workspace\Lucene-Solr-4.x-Windows\solr\build\solr-core\test\J0\.\solrtest-jetty1-1355276549306\'
[junit4:junit4]   2> 3461 T743 oasc.SolrResourceLoader.<init> new SolrResourceLoader for directory: 'C:\Users\JenkinsSlave\workspace\Lucene-Solr-4.x-Windows\solr\build\solr-core\test\J0\.\solrtest-jetty1-1355276549306\'
[junit4:junit4]   2> 3486 T743 oasc.CoreContainer.load Registering Log Listener
[junit4:junit4]   2> 3514 T743 oasc.CoreContainer.initZooKeeper Zookeeper client=127.0.0.1:49924/solr
[junit4:junit4]   2> 3514 T743 oasc.ZkController.checkChrootPath zkHost includes chroot
[junit4:junit4]   2> 3514 T743 oaz.ZooKeeper.<init> Initiating client connection, connectString=127.0.0.1:49924 sessionTimeout=60000 watcher=org.apache.solr.common.cloud.ConnectionManager@8bda58
[junit4:junit4]   2> 3517 T743 oascc.ConnectionManager.waitForConnected Waiting for client to connect to ZooKeeper
[junit4:junit4]   2> 3519 T779 oaz.ClientCnxn$SendThread.logStartConnect Opening socket connection to server 127.0.0.1/127.0.0.1:49924. Will not attempt to authenticate using SASL (access denied (javax.security.auth.AuthPermission getLoginConfiguration))
[junit4:junit4]   2> 3519 T779 oaz.ClientCnxn$SendThread.primeConnection Socket connection established to 127.0.0.1/127.0.0.1:49924, initiating session
[junit4:junit4]   2> 3519 T745 oazs.NIOServerCnxnFactory.run Accepted socket connection from /127.0.0.1:49945
[junit4:junit4]   2> 3520 T745 oazs.ZooKeeperServer.processConnectRequest Client attempting to establish new session at /127.0.0.1:49945
[junit4:junit4]   2> 3531 T747 oazs.ZooKeeperServer.finishSessionInit Established session 0x13b8cc6f0f80004 with negotiated timeout 20000 for client /127.0.0.1:49945
[junit4:junit4]   2> 3531 T779 oaz.ClientCnxn$SendThread.onConnected Session establishment complete on server 127.0.0.1/127.0.0.1:49924, sessionid = 0x13b8cc6f0f80004, negotiated timeout = 20000
[junit4:junit4]   2> 3531 T780 oascc.ConnectionManager.process Watcher org.apache.solr.common.cloud.ConnectionManager@8bda58 name:ZooKeeperConnection Watcher:127.0.0.1:49924 got event WatchedEvent state:SyncConnected type:None path:null path:null type:None
[junit4:junit4]   2> 3533 T743 oascc.ConnectionManager.waitForConnected Client is connected to ZooKeeper
[junit4:junit4]   2> 3534 T748 oazs.PrepRequestProcessor.pRequest2Txn Processed session termination for sessionid: 0x13b8cc6f0f80004
[junit4:junit4]   2> 3535 T745 oazs.NIOServerCnxn.doIO WARNING caught end of stream exception EndOfStreamException: Unable to read additional data from client sessionid 0x13b8cc6f0f80004, likely client has closed socket
[junit4:junit4]   2> 	at org.apache.zookeeper.server.NIOServerCnxn.doIO(NIOServerCnxn.java:220)
[junit4:junit4]   2> 	at org.apache.zookeeper.server.NIOServerCnxnFactory.run(NIOServerCnxnFactory.java:208)
[junit4:junit4]   2> 	at java.lang.Thread.run(Thread.java:662)
[junit4:junit4]   2> 
[junit4:junit4]   2> 3535 T766 oascc.ZkStateReader.updateClusterState Updating cloud state from ZooKeeper... 
[junit4:junit4]   2> 3535 T743 oaz.ZooKeeper.close Session: 0x13b8cc6f0f80004 closed
[junit4:junit4]   2> 3535 T780 oaz.ClientCnxn$EventThread.run EventThread shut down
[junit4:junit4]   2> 3536 T745 oazs.NIOServerCnxn.closeSock Closed socket connection for client /127.0.0.1:49945 which had sessionid 0x13b8cc6f0f80004
[junit4:junit4]   2> 3537 T743 oaz.ZooKeeper.<init> Initiating client connection, connectString=127.0.0.1:49924/solr sessionTimeout=8000 watcher=org.apache.solr.common.cloud.ConnectionManager@170983a
[junit4:junit4]   2> 3537 T766 oasc.Overseer$ClusterStateUpdater.updateState Update state numShards=null message={
[junit4:junit4]   2> 	  "operation":"state",
[junit4:junit4]   2> 	  "numShards":null,
[junit4:junit4]   2> 	  "shard":"control_shard",
[junit4:junit4]   2> 	  "roles":null,
[junit4:junit4]   2> 	  "state":"active",
[junit4:junit4]   2> 	  "core":"collection1",
[junit4:junit4]   2> 	  "collection":"control_collection",
[junit4:junit4]   2> 	  "node_name":"127.0.0.1:49931_solr",
[junit4:junit4]   2> 	  "base_url":"http://127.0.0.1:49931/solr"}
[junit4:junit4]   2> 3538 T743 oascc.ConnectionManager.waitForConnected Waiting for client to connect to ZooKeeper
[junit4:junit4]   2> 3539 T781 oaz.ClientCnxn$SendThread.logStartConnect Opening socket connection to server 127.0.0.1/127.0.0.1:49924. Will not attempt to authenticate using SASL (access denied (javax.security.auth.AuthPermission getLoginConfiguration))
[junit4:junit4]   2> 3540 T781 oaz.ClientCnxn$SendThread.primeConnection Socket connection established to 127.0.0.1/127.0.0.1:49924, initiating session
[junit4:junit4]   2> 3540 T745 oazs.NIOServerCnxnFactory.run Accepted socket connection from /127.0.0.1:49948
[junit4:junit4]   2> 3541 T745 oazs.ZooKeeperServer.processConnectRequest Client attempting to establish new session at /127.0.0.1:49948
[junit4:junit4]   2> 3543 T747 oazs.ZooKeeperServer.finishSessionInit Established session 0x13b8cc6f0f80005 with negotiated timeout 8000 for client /127.0.0.1:49948
[junit4:junit4]   2> 3543 T781 oaz.ClientCnxn$SendThread.onConnected Session establishment complete on server 127.0.0.1/127.0.0.1:49924, sessionid = 0x13b8cc6f0f80005, negotiated timeout = 8000
[junit4:junit4]   2> 3543 T782 oascc.ConnectionManager.process Watcher org.apache.solr.common.cloud.ConnectionManager@170983a name:ZooKeeperConnection Watcher:127.0.0.1:49924/solr got event WatchedEvent state:SyncConnected type:None path:null path:null type:None
[junit4:junit4]   2> 3544 T743 oascc.ConnectionManager.waitForConnected Client is connected to ZooKeeper
[junit4:junit4]   2> 3544 T748 oazs.PrepRequestProcessor.pRequest Got user-level KeeperException when processing sessionid:0x13b8cc6f0f80005 type:create cxid:0x1 zxid:0x4a txntype:-1 reqpath:n/a Error Path:/solr/overseer Error:KeeperErrorCode = NodeExists for /solr/overseer
[junit4:junit4]   2> 3547 T748 oazs.PrepRequestProcessor.pRequest Got user-level KeeperException when processing sessionid:0x13b8cc6f0f80005 type:create cxid:0x2 zxid:0x4c txntype:-1 reqpath:n/a Error Path:/solr/overseer Error:KeeperErrorCode = NodeExists for /solr/overseer
[junit4:junit4]   2> 3549 T743 oasc.ZkController.createEphemeralLiveNode Register node as live in ZooKeeper:/live_nodes/127.0.0.1:49940_solr
[junit4:junit4]   2> 3549 T748 oazs.PrepRequestProcessor.pRequest Got user-level KeeperException when processing sessionid:0x13b8cc6f0f80005 type:delete cxid:0x4 zxid:0x4e txntype:-1 reqpath:n/a Error Path:/solr/live_nodes/127.0.0.1:49940_solr Error:KeeperErrorCode = NoNode for /solr/live_nodes/127.0.0.1:49940_solr
[junit4:junit4]   2> 3550 T765 oascc.ZkStateReader$2.process A cluster state change has occurred - updating... (1)
[junit4:junit4]   2> 3551 T743 oascc.SolrZkClient.makePath makePath: /live_nodes/127.0.0.1:49940_solr
[junit4:junit4]   2> 3558 T743 oashc.HttpShardHandlerFactory.getParameter Setting socketTimeout to: 0
[junit4:junit4]   2> 3558 T743 oashc.HttpShardHandlerFactory.getParameter Setting urlScheme to: http://
[junit4:junit4]   2> 3558 T765 oascc.ZkStateReader$2.process A cluster state change has occurred - updating... (1)
[junit4:junit4]   2> 3558 T743 oashc.HttpShardHandlerFactory.getParameter Setting connTimeout to: 0
[junit4:junit4]   2> 3560 T743 oashc.HttpShardHandlerFactory.getParameter Setting maxConnectionsPerHost to: 20
[junit4:junit4]   2> 3560 T743 oashc.HttpShardHandlerFactory.getParameter Setting corePoolSize to: 0
[junit4:junit4]   2> 3560 T743 oashc.HttpShardHandlerFactory.getParameter Setting maximumPoolSize to: 2147483647
[junit4:junit4]   2> 3561 T743 oashc.HttpShardHandlerFactory.getParameter Setting maxThreadIdleTime to: 5
[junit4:junit4]   2> 3561 T743 oashc.HttpShardHandlerFactory.getParameter Setting sizeOfQueue to: -1
[junit4:junit4]   2> 3561 T743 oashc.HttpShardHandlerFactory.getParameter Setting fairnessPolicy to: false
[junit4:junit4]   2> 3562 T765 oascc.ZkStateReader$3.process Updating live nodes... (2)
[junit4:junit4]   2> 3562 T743 oascsi.HttpClientUtil.createClient Creating new http client, config:maxConnectionsPerHost=20&maxConnections=10000&socketTimeout=0&connTimeout=0&retry=false
[junit4:junit4]   2> 3576 T743 oascc.ZkStateReader.createClusterStateWatchersAndUpdate Updating cluster state from ZooKeeper... 
[junit4:junit4]   2> 3586 T783 oasc.CoreContainer.create Creating SolrCore 'collection1' using instanceDir: C:\Users\JenkinsSlave\workspace\Lucene-Solr-4.x-Windows\solr\build\solr-core\test\J0\.\solrtest-jetty1-1355276549306\collection1
[junit4:junit4]   2> 3586 T783 oasc.ZkController.createCollectionZkNode Check for collection zkNode:collection1
[junit4:junit4]   2> 3587 T783 oasc.ZkController.createCollectionZkNode Collection zkNode exists
[junit4:junit4]   2> 3587 T783 oasc.ZkController.readConfigName Load collection config from:/collections/collection1
[junit4:junit4]   2> 3589 T783 oasc.SolrResourceLoader.<init> new SolrResourceLoader for directory: 'C:\Users\JenkinsSlave\workspace\Lucene-Solr-4.x-Windows\solr\build\solr-core\test\J0\.\solrtest-jetty1-1355276549306\collection1\'
[junit4:junit4]   2> 3590 T783 oasc.SolrResourceLoader.replaceClassLoader Adding 'file:/C:/Users/JenkinsSlave/workspace/Lucene-Solr-4.x-Windows/solr/build/solr-core/test/J0/solrtest-jetty1-1355276549306/collection1/lib/classes/' to classloader
[junit4:junit4]   2> 3590 T783 oasc.SolrResourceLoader.replaceClassLoader Adding 'file:/C:/Users/JenkinsSlave/workspace/Lucene-Solr-4.x-Windows/solr/build/solr-core/test/J0/solrtest-jetty1-1355276549306/collection1/lib/README' to classloader
[junit4:junit4]   2> 3652 T783 oasc.SolrConfig.<init> Using Lucene MatchVersion: LUCENE_41
[junit4:junit4]   2> 3740 T783 oasc.SolrConfig.<init> Loaded SolrConfig: solrconfig.xml
[junit4:junit4]   2> 3742 T783 oass.IndexSchema.readSchema Reading Solr Schema
[junit4:junit4]   2> 3749 T783 oass.IndexSchema.readSchema Schema name=test
[junit4:junit4]   2> 4583 T783 oass.OpenExchangeRatesOrgProvider.init Initialized with rates=open-exchange-rates.json, refreshInterval=1440.
[junit4:junit4]   2> 4596 T783 oass.IndexSchema.readSchema default search field in schema is text
[junit4:junit4]   2> 4601 T783 oass.IndexSchema.readSchema unique key field: id
[junit4:junit4]   2> 4621 T783 oass.FileExchangeRateProvider.reload Reloading exchange rates from file currency.xml
[junit4:junit4]   2> 4626 T783 oass.FileExchangeRateProvider.reload Reloading exchange rates from file currency.xml
[junit4:junit4]   2> 4632 T783 oass.OpenExchangeRatesOrgProvider.reload Reloading exchange rates from open-exchange-rates.json
[junit4:junit4]   2> 4634 T783 oass.OpenExchangeRatesOrgProvider.reload Reloading exchange rates from open-exchange-rates.json
[junit4:junit4]   2> 4636 T783 oasc.SolrCore.<init> [collection1] Opening new SolrCore at C:\Users\JenkinsSlave\workspace\Lucene-Solr-4.x-Windows\solr\build\solr-core\test\J0\.\solrtest-jetty1-1355276549306\collection1\, dataDir=.\org.apache.solr.cloud.SyncSliceTest-1355276546277/jetty1\
[junit4:junit4]   2> 4636 T783 oasc.JmxMonitoredMap.<init> JMX monitoring is enabled. Adding Solr mbeans to JMX Server: com.sun.jmx.mbeanserver.JmxMBeanServer@15c62bc
[junit4:junit4]   2> 4637 T783 oasc.SolrCore.getNewIndexDir New index directory detected: old=null new=.\org.apache.solr.cloud.SyncSliceTest-1355276546277/jetty1\index/
[junit4:junit4]   2> 4638 T783 oasc.SolrCore.initIndex WARNING [collection1] Solr index directory '.\org.apache.solr.cloud.SyncSliceTest-1355276546277\jetty1\index' doesn't exist. Creating new index...
[junit4:junit4]   2> 4639 T783 oasc.CachingDirectoryFactory.get return new directory for C:\Users\JenkinsSlave\workspace\Lucene-Solr-4.x-Windows\solr\build\solr-core\test\J0\.\org.apache.solr.cloud.SyncSliceTest-1355276546277\jetty1\index forceNew:false
[junit4:junit4]   2> 4650 T783 oasc.SolrDeletionPolicy.onCommit SolrDeletionPolicy.onCommit: commits:num=1
[junit4:junit4]   2> 		commit{dir=RateLimitedDirectoryWrapper(org.apache.lucene.store.SimpleFSDirectory@C:\Users\JenkinsSlave\workspace\Lucene-Solr-4.x-Windows\solr\build\solr-core\test\J0\org.apache.solr.cloud.SyncSliceTest-1355276546277\jetty1\index lockFactory=org.apache.lucene.store.NativeFSLockFactory@15731d6),segFN=segments_1,generation=1,filenames=[segments_1]
[junit4:junit4]   2> 4650 T783 oasc.SolrDeletionPolicy.updateCommits newest commit = 1
[junit4:junit4]   2> 4651 T783 oasc.SolrCore.initWriters created xml: solr.XMLResponseWriter
[junit4:junit4]   2> 4652 T783 oasup.UpdateRequestProcessorChain.init inserting DistributedUpdateProcessorFactory into updateRequestProcessorChain "dedupe"
[junit4:junit4]   2> 4652 T783 oasup.UpdateRequestProcessorChain.init inserting DistributedUpdateProcessorFactory into updateRequestProcessorChain "dedupe-allfields"
[junit4:junit4]   2> 4652 T783 oasup.UpdateRequestProcessorChain.init inserting DistributedUpdateProcessorFactory into updateRequestProcessorChain "stored_sig"
[junit4:junit4]   2> 4653 T783 oasup.UpdateRequestProcessorChain.init inserting DistributedUpdateProcessorFactory into updateRequestProcessorChain "uniq-fields"
[junit4:junit4]   2> 4654 T783 oasup.UpdateRequestProcessorChain.init inserting DistributedUpdateProcessorFactory into updateRequestProcessorChain "distrib-dup-test-chain-implicit"
[junit4:junit4]   2> 4654 T783 oasc.RequestHandlers.initHandlersFromConfig adding lazy requestHandler: solr.ReplicationHandler
[junit4:junit4]   2> 4654 T783 oasc.RequestHandlers.initHandlersFromConfig created /replication: solr.ReplicationHandler
[junit4:junit4]   2> 4655 T783 oasc.RequestHandlers.initHandlersFromConfig created standard: solr.StandardRequestHandler
[junit4:junit4]   2> 4655 T783 oasc.RequestHandlers.initHandlersFromConfig created /get: solr.RealTimeGetHandler
[junit4:junit4]   2> 4656 T783 oasc.RequestHandlers.initHandlersFromConfig created dismax: solr.SearchHandler
[junit4:junit4]   2> 4656 T783 oasc.RequestHandlers.initHandlersFromConfig created mock: org.apache.solr.core.MockQuerySenderListenerReqHandler
[junit4:junit4]   2> 4659 T783 oasc.RequestHandlers.initHandlersFromConfig created /admin/: org.apache.solr.handler.admin.AdminHandlers
[junit4:junit4]   2> 4659 T783 oasc.RequestHandlers.initHandlersFromConfig created defaults: solr.StandardRequestHandler
[junit4:junit4]   2> 4660 T783 oasc.RequestHandlers.initHandlersFromConfig adding lazy requestHandler: solr.StandardRequestHandler
[junit4:junit4]   2> 4660 T783 oasc.RequestHandlers.initHandlersFromConfig created lazy: solr.StandardRequestHandler
[junit4:junit4]   2> 4660 T783 oasc.RequestHandlers.initHandlersFromConfig created /update: solr.UpdateRequestHandler
[junit4:junit4]   2> 4661 T783 oasc.RequestHandlers.initHandlersFromConfig created /terms: org.apache.solr.handler.component.SearchHandler
[junit4:junit4]   2> 4662 T783 oasc.RequestHandlers.initHandlersFromConfig created spellCheckCompRH: org.apache.solr.handler.component.SearchHandler
[junit4:junit4]   2> 4663 T783 oasc.RequestHandlers.initHandlersFromConfig created spellCheckCompRH_Direct: org.apache.solr.handler.component.SearchHandler
[junit4:junit4]   2> 4664 T783 oasc.RequestHandlers.initHandlersFromConfig created spellCheckWithWordbreak: org.apache.solr.handler.component.SearchHandler
[junit4:junit4]   2> 4665 T783 oasc.RequestHandlers.initHandlersFromConfig created spellCheckWithWordbreak_Direct: org.apache.solr.handler.component.SearchHandler
[junit4:junit4]   2> 4665 T783 oasc.RequestHandlers.initHandlersFromConfig created spellCheckCompRH1: org.apache.solr.handler.component.SearchHandler
[junit4:junit4]   2> 4666 T783 oasc.RequestHandlers.initHandlersFromConfig created tvrh: org.apache.solr.handler.component.SearchHandler
[junit4:junit4]   2> 4667 T783 oasc.RequestHandlers.initHandlersFromConfig created /mlt: solr.MoreLikeThisHandler
[junit4:junit4]   2> 4668 T783 oasc.RequestHandlers.initHandlersFromConfig created /debug/dump: solr.DumpRequestHandler
[junit4:junit4]   2> 4677 T783 oashl.XMLLoader.init xsltCacheLifetimeSeconds=60
[junit4:junit4]   2> 4682 T783 oasc.SolrCore.initDeprecatedSupport WARNING solrconfig.xml uses deprecated <admin/gettableFiles>, Please update your config to use the ShowFileRequestHandler.
[junit4:junit4]   2> 4683 T783 oasc.SolrCore.initDeprecatedSupport WARNING adding ShowFileRequestHandler with hidden files: [SCHEMA.XML, OLD_SYNONYMS.TXT, STOPWORDS.TXT, PROTWORDS.TXT, OPEN-EXCHANGE-RATES.JSON, SYNONYMS.TXT, CURRENCY.XML, MAPPING-ISOLATIN1ACCENT.TXT]
[junit4:junit4]   2> 4690 T783 oass.SolrIndexSearcher.<init> Opening Searcher@19ec2d4 main
[junit4:junit4]   2> 4690 T783 oass.SolrIndexSearcher.getIndexDir WARNING WARNING: Directory impl does not support setting indexDir: org.apache.lucene.store.RateLimitedDirectoryWrapper
[junit4:junit4]   2> 4691 T783 oasu.CommitTracker.<init> Hard AutoCommit: disabled
[junit4:junit4]   2> 4692 T783 oasu.CommitTracker.<init> Soft AutoCommit: disabled
[junit4:junit4]   2> 4692 T783 oashc.SpellCheckComponent.inform Initializing spell checkers
[junit4:junit4]   2> 4704 T783 oass.DirectSolrSpellChecker.init init: {name=direct,classname=DirectSolrSpellChecker,field=lowerfilt,minQueryLength=3}
[junit4:junit4]   2> 4765 T784 oasc.SolrCore.registerSearcher [collection1] Registered new searcher Searcher@19ec2d4 main{StandardDirectoryReader(segments_1:1)}
[junit4:junit4]   2> 4770 T783 oasc.ZkController.publish publishing core=collection1 state=down
[junit4:junit4]   2> 4771 T783 oasc.ZkController.publish numShards not found on descriptor - reading it from system property
[junit4:junit4]   2> 5213 T766 oascc.ZkStateReader.updateClusterState Updating cloud state from ZooKeeper... 
[junit4:junit4]   2> 5214 T766 oasc.Overseer$ClusterStateUpdater.updateState Update state numShards=1 message={
[junit4:junit4]   2> 	  "operation":"state",
[junit4:junit4]   2> 	  "numShards":"1",
[junit4:junit4]   2> 	  "shard":null,
[junit4:junit4]   2> 	  "roles":null,
[junit4:junit4]   2> 	  "state":"down",
[junit4:junit4]   2> 	  "core":"collection1",
[junit4:junit4]   2> 	  "collection":"collection1",
[junit4:junit4]   2> 	  "node_name":"127.0.0.1:49940_solr",
[junit4:junit4]   2> 	  "base_url":"http://127.0.0.1:49940/solr"}
[junit4:junit4]   2> 5214 T766 oasc.Overseer$ClusterStateUpdater.createCollection Create collection collection1 with numShards 1
[junit4:junit4]   2> 5214 T766 oasc.Overseer$ClusterStateUpdater.updateState Assigning new node to shard shard=shard1
[junit4:junit4]   2> 5222 T782 oascc.ZkStateReader$2.process A cluster state change has occurred - updating... (2)
[junit4:junit4]   2> 5222 T765 oascc.ZkStateReader$2.process A cluster state change has occurred - updating... (2)
[junit4:junit4]   2> 5324 T783 oasc.CoreContainer.register registering core: collection1
[junit4:junit4]   2> 5324 T783 oasc.ZkController.register Register shard - core:collection1 address:http://127.0.0.1:49940/solr shardId:shard1
[junit4:junit4]   2> 5325 T783 oascc.SolrZkClient.makePath makePath: /collections/collection1/leader_elect/shard1/election
[junit4:junit4]   2> 5335 T748 oazs.PrepRequestProcessor.pRequest Got user-level KeeperException when processing sessionid:0x13b8cc6f0f80005 type:delete cxid:0x43 zxid:0x5b txntype:-1 reqpath:n/a Error Path:/solr/collections/collection1/leaders Error:KeeperErrorCode = NoNode for /solr/collections/collection1/leaders
[junit4:junit4]   2> 5336 T783 oasc.ShardLeaderElectionContext.runLeaderProcess Running the leader process.
[junit4:junit4]   2> 5336 T748 oazs.PrepRequestProcessor.pRequest Got user-level KeeperException when processing sessionid:0x13b8cc6f0f80005 type:create cxid:0x44 zxid:0x5c txntype:-1 reqpath:n/a Error Path:/solr/overseer Error:KeeperErrorCode = NodeExists for /solr/overseer
[junit4:junit4]   2> 5340 T783 oasc.ShardLeaderElectionContext.waitForReplicasToComeUp Enough replicas found to continue.
[junit4:junit4]   2> 5341 T783 oasc.ShardLeaderElectionContext.runLeaderProcess I may be the new leader - try and sync
[junit4:junit4]   2> 5341 T783 oasc.SyncStrategy.sync Sync replicas to http://127.0.0.1:49940/solr/collection1/
[junit4:junit4]   2> 5341 T783 oasc.SyncStrategy.syncReplicas Sync Success - now sync replicas to me
[junit4:junit4]   2> 5342 T783 oasc.SyncStrategy.syncToMe http://127.0.0.1:49940/solr/collection1/ has no replicas
[junit4:junit4]   2> 5342 T783 oasc.ShardLeaderElectionContext.runLeaderProcess I am the new leader: http://127.0.0.1:49940/solr/collection1/
[junit4:junit4]   2> 5342 T783 oascc.SolrZkClient.makePath makePath: /collections/collection1/leaders/shard1
[junit4:junit4]   2> 5348 T748 oazs.PrepRequestProcessor.pRequest Got user-level KeeperException when processing sessionid:0x13b8cc6f0f80005 type:create cxid:0x4e zxid:0x60 txntype:-1 reqpath:n/a Error Path:/solr/overseer Error:KeeperErrorCode = NodeExists for /solr/overseer
[junit4:junit4]   2> 5778 T766 oascc.ZkStateReader.updateClusterState Updating cloud state from ZooKeeper... 
[junit4:junit4]   2> 5795 T765 oascc.ZkStateReader$2.process A cluster state change has occurred - updating... (2)
[junit4:junit4]   2> 5795 T782 oascc.ZkStateReader$2.process A cluster state change has occurred - updating... (2)
[junit4:junit4]   2> 5801 T783 oasc.ZkController.register We are http://127.0.0.1:49940/solr/collection1/ and leader is http://127.0.0.1:49940/solr/collection1/
[junit4:junit4]   2> 5801 T783 oasc.ZkController.register No LogReplay needed for core=collection1 baseURL=http://127.0.0.1:49940/solr
[junit4:junit4]   2> 5801 T783 oasc.ZkController.checkRecovery I am the leader, no recovery necessary
[junit4:junit4]   2> 5801 T783 oasc.ZkController.publish publishing core=collection1 state=active
[junit4:junit4]   2> 5801 T783 oasc.ZkController.publish numShards not found on descriptor - reading it from system property
[junit4:junit4]   2> 5804 T783 oascc.ZkStateReader.updateClusterState Updating cloud state from ZooKeeper... 
[junit4:junit4]   2> 5805 T743 oass.SolrDispatchFilter.init user.dir=C:\Users\JenkinsSlave\workspace\Lucene-Solr-4.x-Windows\solr\build\solr-core\test\J0
[junit4:junit4]   2> 5805 T743 oass.SolrDispatchFilter.init SolrDispatchFilter.init() done
[junit4:junit4]   2> 5805 T743 oascsi.HttpClientUtil.createClient Creating new http client, config:maxConnections=128&maxConnectionsPerHost=32&followRedirects=false
[junit4:junit4]   2> 6134 T743 oejs.Server.doStart jetty-8.1.8.v20121106
[junit4:junit4]   2> 6137 T743 oejs.AbstractConnector.doStart Started SelectChannelConnector@0.0.0.0:49949
[junit4:junit4]   2> 6139 T743 oasc.SolrResourceLoader.locateSolrHome JNDI not configured for solr (NoInitialContextEx)
[junit4:junit4]   2> 6139 T743 oasc.SolrResourceLoader.locateSolrHome using system property solr.solr.home: C:\Users\JenkinsSlave\workspace\Lucene-Solr-4.x-Windows\solr\build\solr-core\test\J0\.\solrtest-jetty2-1355276552087
[junit4:junit4]   2> 6139 T743 oasc.SolrResourceLoader.<init> new SolrResourceLoader for deduced Solr Home: 'C:\Users\JenkinsSlave\workspace\Lucene-Solr-4.x-Windows\solr\build\solr-core\test\J0\.\solrtest-jetty2-1355276552087\'
[junit4:junit4]   2> 6174 T743 oass.SolrDispatchFilter.init SolrDispatchFilter.init()
[junit4:junit4]   2> 6175 T743 oasc.SolrResourceLoader.locateSolrHome JNDI not configured for solr (NoInitialContextEx)
[junit4:junit4]   2> 6175 T743 oasc.SolrResourceLoader.locateSolrHome using system property solr.solr.home: C:\Users\JenkinsSlave\workspace\Lucene-Solr-4.x-Windows\solr\build\solr-core\test\J0\.\solrtest-jetty2-1355276552087
[junit4:junit4]   2> 6175 T743 oasc.CoreContainer$Initializer.initialize looking for solr.xml: C:\Users\JenkinsSlave\workspace\Lucene-Solr-4.x-Windows\solr\build\solr-core\test\J0\.\solrtest-jetty2-1355276552087\solr.xml
[junit4:junit4]   2> 6176 T743 oasc.CoreContainer.<init> New CoreContainer 4580332
[junit4:junit4]   2> 6176 T743 oasc.CoreContainer.load Loading CoreContainer using Solr Home: 'C:\Users\JenkinsSlave\workspace\Lucene-Solr-4.x-Windows\solr\build\solr-core\test\J0\.\solrtest-jetty2-1355276552087\'
[junit4:junit4]   2> 6176 T743 oasc.SolrResourceLoader.<init> new SolrResourceLoader for directory: 'C:\Users\JenkinsSlave\workspace\Lucene-Solr-4.x-Windows\solr\build\solr-core\test\J0\.\solrtest-jetty2-1355276552087\'
[junit4:junit4]   2> 6203 T743 oasc.CoreContainer.load Registering Log Listener
[junit4:junit4]   2> 6232 T743 oasc.CoreContainer.initZooKeeper Zookeeper client=127.0.0.1:49924/solr
[junit4:junit4]   2> 6232 T743 oasc.ZkController.checkChrootPath zkHost includes chroot
[junit4:junit4]   2> 6232 T743 oaz.ZooKeeper.<init> Initiating client connection, connectString=127.0.0.1:49924 sessionTimeout=60000 watcher=org.apache.solr.common.cloud.ConnectionManager@89dee5
[junit4:junit4]   2> 6233 T743 oascc.ConnectionManager.waitForConnected Waiting for client to connect to ZooKeeper
[junit4:junit4]   2> 6234 T794 oaz.ClientCnxn$SendThread.logStartConnect Opening socket connection to server 127.0.0.1/127.0.0.1:49924. Will not attempt to authenticate using SASL (access denied (javax.security.auth.AuthPermission getLoginConfiguration))
[junit4:junit4]   2> 6236 T794 oaz.ClientCnxn$SendThread.primeConnection Socket connection established to 127.0.0.1/127.0.0.1:49924, initiating session
[junit4:junit4]   2> 6236 T745 oazs.NIOServerCnxnFactory.run Accepted socket connection from /127.0.0.1:49954
[junit4:junit4]   2> 6236 T745 oazs.ZooKeeperServer.processConnectRequest Client attempting to establish new session at /127.0.0.1:49954
[junit4:junit4]   2> 6253 T747 oazs.ZooKeeperServer.finishSessionInit Established session 0x13b8cc6f0f80006 with negotiated timeout 20000 for client /127.0.0.1:49954
[junit4:junit4]   2> 6253 T794 oaz.ClientCnxn$SendThread.onConnected Session establishment complete on server 127.0.0.1/127.0.0.1:49924, sessionid = 0x13b8cc6f0f80006, negotiated timeout = 20000
[junit4:junit4]   2> 6253 T795 oascc.ConnectionManager.process Watcher org.apache.solr.common.cloud.ConnectionManager@89dee5 name:ZooKeeperConnection Watcher:127.0.0.1:49924 got event WatchedEvent state:SyncConnected type:None path:null path:null type:None
[junit4:junit4]   2> 6254 T743 oascc.ConnectionManager.waitForConnected Client is connected to ZooKeeper
[junit4:junit4]   2> 6255 T748 oazs.PrepRequestProcessor.pRequest2Txn Processed session termination for sessionid: 0x13b8cc6f0f80006
[junit4:junit4]   2> 6257 T743 oaz.ZooKeeper.close Session: 0x13b8cc6f0f80006 closed
[junit4:junit4]   2> 6257 T743 oaz.ZooKeeper.<init> Initiating client connection, connectString=127.0.0.1:49924/solr sessionTimeout=8000 watcher=org.apache.solr.common.cloud.ConnectionManager@16062b
[junit4:junit4]   2> 6257 T795 oaz.ClientCnxn$EventThread.run EventThread shut down
[junit4:junit4]   2> 6257 T745 oazs.NIOServerCnxn.closeSock Closed socket connection for client /127.0.0.1:49954 which had sessionid 0x13b8cc6f0f80006
[junit4:junit4]   2> 6258 T743 oascc.ConnectionManager.waitForConnected Waiting for client to connect to ZooKeeper
[junit4:junit4]   2> 6259 T796 oaz.ClientCnxn$SendThread.logStartConnect Opening socket connection to server 127.0.0.1/127.0.0.1:49924. Will not attempt to authenticate using SASL (access denied (javax.security.auth.AuthPermission getLoginConfiguration))
[junit4:junit4]   2> 6259 T796 oaz.ClientCnxn$SendThread.primeConnection Socket connection established to 127.0.0.1/127.0.0.1:49924, initiating session
[junit4:junit4]   2> 6260 T745 oazs.NIOServerCnxnFactory.run Accepted socket connection from /127.0.0.1:49957
[junit4:junit4]   2> 6260 T745 oazs.ZooKeeperServer.processConnectRequest Client attempting to establish new session at /127.0.0.1:49957
[junit4:junit4]   2> 6262 T747 oazs.ZooKeeperServer.finishSessionInit Established session 0x13b8cc6f0f80007 with negotiated timeout 8000 for client /127.0.0.1:49957
[junit4:junit4]   2> 6262 T796 oaz.ClientCnxn$SendThread.onConnected Session establishment complete on server 127.0.0.1/127.0.0.1:49924, sessionid = 0x13b8cc6f0f80007, negotiated timeout = 8000
[junit4:junit4]   2> 6262 T797 oascc.ConnectionManager.process Watcher org.apache.solr.common.cloud.ConnectionManager@16062b name:ZooKeeperConnection Watcher:127.0.0.1:49924/solr got event WatchedEvent state:SyncConnected type:None path:null path:null type:None
[junit4:junit4]   2> 6262 T743 oascc.ConnectionManager.waitForConnected Client is connected to ZooKeeper
[junit4:junit4]   2> 6263 T748 oazs.PrepRequestProcessor.pRequest Got user-level KeeperException when processing sessionid:0x13b8cc6f0f80007 type:create cxid:0x1 zxid:0x6d txntype:-1 reqpath:n/a Error Path:/solr/overseer Error:KeeperErrorCode = NodeExists for /solr/overseer
[junit4:junit4]   2> 6265 T748 oazs.PrepRequestProcessor.pRequest Got user-level KeeperException when processing sessionid:0x13b8cc6f0f80007 type:create cxid:0x2 zxid:0x6e txntype:-1 reqpath:n/a Error Path:/solr/overseer Error:KeeperErrorCode = NodeExists for /solr/overseer
[junit4:junit4]   2> 6268 T743 oasc.ZkController.createEphemeralLiveNode Register node as live in ZooKeeper:/live_nodes/127.0.0.1:49949_solr
[junit4:junit4]   2> 6268 T748 oazs.PrepRequestProcessor.pRequest Got user-level KeeperException when processing sessionid:0x13b8cc6f0f80007 type:delete cxid:0x4 zxid:0x6f txntype:-1 reqpath:n/a Error Path:/solr/live_nodes/127.0.0.1:49949_solr Error:KeeperErrorCode = NoNode for /solr/live_nodes/127.0.0.1:49949_solr
[junit4:junit4]   2> 6270 T743 oascc.SolrZkClient.makePath makePath: /live_nodes/127.0.0.1:49949_solr
[junit4:junit4]   2> 6273 T765 oascc.ZkStateReader$2.process A cluster state change has occurred - updating... (2)
[junit4:junit4]   2> 6273 T782 oascc.ZkStateReader$3.process Updating live nodes... (3)
[junit4:junit4]   2> 6274 T782 oascc.ZkStateReader$2.process A cluster state change has occurred - updating... (3)
[junit4:junit4]   2> 6274 T743 oashc.HttpShardHandlerFactory.getParameter Setting socketTimeout to: 0
[junit4:junit4]   2> 6275 T743 oashc.HttpShardHandlerFactory.getParameter Setting urlScheme to: http://
[junit4:junit4]   2> 6275 T743 oashc.HttpShardHandlerFactory.getParameter Setting connTimeout to: 0
[junit4:junit4]   2> 6275 T743 oashc.HttpShardHandlerFactory.getParameter Setting maxConnectionsPerHost to: 20
[junit4:junit4]   2> 6275 T765 oascc.ZkStateReader$3.process Updating live nodes... (3)
[junit4:junit4]   2> 6276 T743 oashc.HttpShardHandlerFactory.getParameter Setting corePoolSize to: 0
[junit4:junit4]   2> 6276 T743 oashc.HttpShardHandlerFactory.getParameter Setting maximumPoolSize to: 2147483647
[junit4:junit4]   2> 6276 T743 oashc.HttpShardHandlerFactory.getParameter Setting maxThreadIdleTime to: 5
[junit4:junit4]   2> 6277 T743 oashc.HttpShardHandlerFactory.getParameter Setting sizeOfQueue to: -1
[junit4:junit4]   2> 6277 T743 oashc.HttpShardHandlerFactory.getParameter Setting fairnessPolicy to: false
[junit4:junit4]   2> 6277 T743 oascsi.HttpClientUtil.createClient Creating new http client, config:maxConnectionsPerHost=20&maxConnections=10000&socketTimeout=0&connTimeout=0&retry=false
[junit4:junit4]   2> 6290 T743 oascc.ZkStateReader.createClusterStateWatchersAndUpdate Updating cluster state from ZooKeeper... 
[junit4:junit4]   2> 6300 T798 oasc.CoreContainer.create Creating SolrCore 'collection1' using instanceDir: C:\Users\JenkinsSlave\workspace\Lucene-Solr-4.x-Windows\solr\build\solr-core\test\J0\.\solrtest-jetty2-1355276552087\collection1
[junit4:junit4]   2> 6300 T798 oasc.ZkController.createCollectionZkNode Check for collection zkNode:collection1
[junit4:junit4]   2> 6301 T798 oasc.ZkController.createCollectionZkNode Collection zkNode exists
[junit4:junit4]   2> 6301 T798 oasc.ZkController.readConfigName Load collection config from:/collections/collection1
[junit4:junit4]   2> 6303 T798 oasc.SolrResourceLoader.<init> new SolrResourceLoader for directory: 'C:\Users\JenkinsSlave\workspace\Lucene-Solr-4.x-Windows\solr\build\solr-core\test\J0\.\solrtest-jetty2-1355276552087\collection1\'
[junit4:junit4]   2> 6304 T798 oasc.SolrResourceLoader.replaceClassLoader Adding 'file:/C:/Users/JenkinsSlave/workspace/Lucene-Solr-4.x-Windows/solr/build/solr-core/test/J0/solrtest-jetty2-1355276552087/collection1/lib/classes/' to classloader
[junit4:junit4]   2> 6306 T798 oasc.SolrResourceLoader.replaceClassLoader Adding 'file:/C:/Users/JenkinsSlave/workspace/Lucene-Solr-4.x-Windows/solr/build/solr-core/test/J0/solrtest-jetty2-1355276552087/collection1/lib/README' to classloader
[junit4:junit4]   2> 6354 T766 oascc.ZkStateReader.updateClusterState Updating cloud state from ZooKeeper... 
[junit4:junit4]   2> 6355 T766 oasc.Overseer$ClusterStateUpdater.updateState Update state numShards=1 message={
[junit4:junit4]   2> 	  "operation":"state",
[junit4:junit4]   2> 	  "numShards":"1",
[junit4:junit4]   2> 	  "shard":"shard1",
[junit4:junit4]   2> 	  "roles":null,
[junit4:junit4]   2> 	  "state":"active",
[junit4:junit4]   2> 	  "core":"collection1",
[junit4:junit4]   2> 	  "collection":"collection1",
[junit4:junit4]   2> 	  "node_name":"127.0.0.1:49940_solr",
[junit4:junit4]   2> 	  "base_url":"http://127.0.0.1:49940/solr"}
[junit4:junit4]   2> 6362 T797 oascc.ZkStateReader$2.process A cluster state change has occurred - updating... (3)
[junit4:junit4]   2> 6362 T765 oascc.ZkStateReader$2.process A cluster state change has occurred - updating... (3)
[junit4:junit4]   2> 6362 T782 oascc.ZkStateReader$2.process A cluster state change has occurred - updating... (3)
[junit4:junit4]   2> 6368 T798 oasc.SolrConfig.<init> Using Lucene MatchVersion: LUCENE_41
[junit4:junit4]   2> 6456 T798 oasc.SolrConfig.<init> Loaded SolrConfig: solrconfig.xml
[junit4:junit4]   2> 6457 T798 oass.IndexSchema.readSchema Reading Solr Schema
[junit4:junit4]   2> 6463 T798 oass.IndexSchema.readSchema Schema name=test
[junit4:junit4]   2> 7315 T798 oass.OpenExchangeRatesOrgProvider.init Initialized with rates=open-exchange-rates.json, refreshInterval=1440.
[junit4:junit4]   2> 7328 T798 oass.IndexSchema.readSchema default search field in schema is text
[junit4:junit4]   2> 7334 T798 oass.IndexSchema.readSchema unique key field: id
[junit4:junit4]   2> 7355 T798 oass.FileExchangeRateProvider.reload Reloading exchange rates from file currency.xml
[junit4:junit4]   2> 7360 T798 oass.FileExchangeRateProvider.reload Reloading exchange rates from file currency.xml
[junit4:junit4]   2> 7367 T798 oass.OpenExchangeRatesOrgProvider.reload Reloading exchange rates from open-exchange-rates.json
[junit4:junit4]   2> 7369 T798 oass.OpenExchangeRatesOrgProvider.reload Reloading exchange rates from open-exchange-rates.json
[junit4:junit4]   2> 7370 T798 oasc.SolrCore.<init> [collection1] Opening new SolrCore at C:\Users\JenkinsSlave\workspace\Lucene-Solr-4.x-Windows\solr\build\solr-core\test\J0\.\solrtest-jetty2-1355276552087\collection1\, dataDir=.\org.apache.solr.cloud.SyncSliceTest-1355276546277/jetty2\
[junit4:junit4]   2> 7370 T798 oasc.JmxMonitoredMap.<init> JMX monitoring is enabled. Adding Solr mbeans to JMX Server: com.sun.jmx.mbeanserver.JmxMBeanServer@15c62bc
[junit4:junit4]   2> 7371 T798 oasc.SolrCore.getNewIndexDir New index directory detected: old=null new=.\org.apache.solr.cloud.SyncSliceTest-1355276546277/jetty2\index/
[junit4:junit4]   2> 7372 T798 oasc.SolrCore.initIndex WARNING [collection1] Solr index directory '.\org.apache.solr.cloud.SyncSliceTest-1355276546277\jetty2\index' doesn't exist. Creating new index...
[junit4:junit4]   2> 7373 T798 oasc.CachingDirectoryFactory.get return new directory for C:\Users\JenkinsSlave\workspace\Lucene-Solr-4.x-Windows\solr\build\solr-core\test\J0\.\org.apache.solr.cloud.SyncSliceTest-1355276546277\jetty2\index forceNew:false
[junit4:junit4]   2> 7389 T798 oasc.SolrDeletionPolicy.onCommit SolrDeletionPolicy.onCommit: commits:num=1
[junit4:junit4]   2> 		commit{dir=RateLimitedDirectoryWrapper(org.apache.lucene.store.SimpleFSDirectory@C:\Users\JenkinsSlave\workspace\Lucene-Solr-4.x-Windows\solr\build\solr-core\test\J0\org.apache.solr.cloud.SyncSliceTest-1355276546277\jetty2\index lockFactory=org.apache.lucene.store.NativeFSLockFactory@b097da),segFN=segments_1,generation=1,filenames=[segments_1]
[junit4:junit4]   2> 7389 T798 oasc.SolrDeletionPolicy.updateCommits newest commit = 1
[junit4:junit4]   2> 7390 T798 oasc.SolrCore.initWriters created xml: solr.XMLResponseWriter
[junit4:junit4]   2> 7390 T798 oasup.UpdateRequestProcessorChain.init inserting DistributedUpdateProcessorFactory into updateRequestProcessorChain "dedupe"
[junit4:junit4]   2> 7390 T798 oasup.UpdateRequestProcessorChain.init inserting DistributedUpdateProcessorFactory into updateRequestProcessorChain "dedupe-allfields"
[junit4:junit4]   2> 7391 T798 oasup.UpdateRequestProcessorChain.init inserting DistributedUpdateProcessorFactory into updateRequestProcessorChain "stored_sig"
[junit4:junit4]   2> 7392 T798 oasup.UpdateRequestProcessorChain.init inserting DistributedUpdateProcessorFactory into updateRequestProcessorChain "uniq-fields"
[junit4:junit4]   2> 7392 T798 oasup.UpdateRequestProcessorChain.init inserting DistributedUpdateProcessorFactory into updateRequestProcessorChain "distrib-dup-test-chain-implicit"
[junit4:junit4]   2> 7392 T798 oasc.RequestHandlers.initHandlersFromConfig adding lazy requestHandler: solr.ReplicationHandler
[junit4:junit4]   2> 7392 T798 oasc.RequestHandlers.initHandlersFromConfig created /replication: solr.ReplicationHandler
[junit4:junit4]   2> 7394 T798 oasc.RequestHandlers.initHandlersFromConfig created standard: solr.StandardRequestHandler
[junit4:junit4]   2> 7395 T798 oasc.RequestHandlers.initHandlersFromConfig created /get: solr.RealTimeGetHandler
[junit4:junit4]   2> 7396 T798 oasc.RequestHandlers.initHandlersFromConfig created dismax: solr.SearchHandler
[junit4:junit4]   2> 7396 T798 oasc.RequestHandlers.initHandlersFromConfig created mock: org.apache.solr.core.MockQuerySenderListenerReqHandler
[junit4:junit4]   2> 7396 T798 oasc.RequestHandlers.initHandlersFromConfig created /admin/: org.apache.solr.handler.admin.AdminHandlers
[junit4:junit4]   2> 7397 T798 oasc.RequestHandlers.initHandlersFromConfig created defaults: solr.StandardRequestHandler
[junit4:junit4]   2> 7397 T798 oasc.RequestHandlers.initHandlersFromConfig adding lazy requestHandler: solr.StandardRequestHandler
[junit4:junit4]   2> 7398 T798 oasc.RequestHandlers.initHandlersFromConfig created lazy: solr.StandardRequestHandler
[junit4:junit4]   2> 7399 T798 oasc.RequestHandlers.initHandlersFromConfig created /update: solr.UpdateRequestHandler
[junit4:junit4]   2> 7400 T798 oasc.RequestHandlers.initHandlersFromConfig created /terms: org.apache.solr.handler.component.SearchHandler
[junit4:junit4]   2> 7400 T798 oasc.RequestHandlers.initHandlersFromConfig created spellCheckCompRH: org.apache.solr.handler.component.SearchHandler
[junit4:junit4]   2> 7401 T798 oasc.RequestHandlers.initHandlersFromConfig created spellCheckCompRH_Direct: org.apache.solr.handler.component.SearchHandler
[junit4:junit4]   2> 7402 T798 oasc.RequestHandlers.initHandlersFromConfig created spellCheckWithWordbreak: org.apache.solr.handler.component.SearchHandler
[junit4:junit4]   2> 7403 T798 oasc.RequestHandlers.initHandlersFromConfig created spellCheckWithWordbreak_Direct: org.apache.solr.handler.component.SearchHandler
[junit4:junit4]   2> 7403 T798 oasc.RequestHandlers.initHandlersFromConfig created spellCheckCompRH1: org.apache.solr.handler.component.SearchHandler
[junit4:junit4]   2> 7405 T798 oasc.RequestHandlers.initHandlersFromConfig created tvrh: org.apache.solr.handler.component.SearchHandler
[junit4:junit4]   2> 7405 T798 oasc.RequestHandlers.initHandlersFromConfig created /mlt: solr.MoreLikeThisHandler
[junit4:junit4]   2> 7405 T798 oasc.RequestHandlers.initHandlersFromConfig created /debug/dump: solr.DumpRequestHandler
[junit4:junit4]   2> 7415 T798 oashl.XMLLoader.init xsltCacheLifetimeSeconds=60
[junit4:junit4]   2> 7421 T798 oasc.SolrCore.initDeprecatedSupport WARNING solrconfig.xml uses deprecated <admin/gettableFiles>, Please update your config to use the ShowFileRequestHandler.
[junit4:junit4]   2> 7424 T798 oasc.SolrCore.initDeprecatedSupport WARNING adding ShowFileRequestHandler with hidden files: [SCHEMA.XML, OLD_SYNONYMS.TXT, STOPWORDS.TXT, PROTWORDS.TXT, OPEN-EXCHANGE-RATES.JSON, SYNONYMS.TXT, CURRENCY.XML, MAPPING-ISOLATIN1ACCENT.TXT]
[junit4:junit4]   2> 7428 T798 oass.SolrIndexSearcher.<init> Opening Searcher@634bfa main
[junit4:junit4]   2> 7429 T798 oass.SolrIndexSearcher.getIndexDir WARNING WARNING: Directory impl does not support setting indexDir: org.apache.lucene.store.RateLimitedDirectoryWrapper
[junit4:junit4]   2> 7431 T798 oasu.CommitTracker.<init> Hard AutoCommit: disabled
[junit4:junit4]   2> 7431 T798 oasu.CommitTracker.<init> Soft AutoCommit: disabled
[junit4:junit4]   2> 7431 T798 oashc.SpellCheckComponent.inform Initializing spell checkers
[junit4:junit4]   2> 7443 T798 oass.DirectSolrSpellChecker.init init: {name=direct,classname=DirectSolrSpellChecker,field=lowerfilt,minQueryLength=3}
[junit4:junit4]   2> 7519 T799 oasc.SolrCore.registerSearcher [collection1] Registered new searcher Searcher@634bfa main{StandardDirectoryReader(segments_1:1)}
[junit4:junit4]   2> 7526 T798 oasc.ZkController.publish publishing core=collection1 state=down
[junit4:junit4]   2> 7526 T798 oasc.ZkController.publish numShards not found on descriptor - reading it from system property
[junit4:junit4]   2> 8008 T766 oascc.ZkStateReader.updateClusterState Updating cloud state from ZooKeeper... 
[junit4:junit4]   2> 8009 T766 oasc.Overseer$ClusterStateUpdater.updateState Update state numShards=1 message={
[junit4:junit4]   2> 	  "operation":"state",
[junit4:junit4]   2> 	  "numShards":"1",
[junit4:junit4]   2> 	  "shard":null,
[junit4:junit4]   2> 	  "roles":null,
[junit4:junit4]   2> 	  "state":"down",
[junit4:junit4]   2> 	  "core":"collection1",
[junit4:junit4]   2> 	  "collection":"collection1",
[junit4:junit4]   2> 	  "node_name":"127.0.0.1:49949_solr",
[junit4:junit4]   2> 	  "base_url":"http://127.0.0.1:49949/solr"}
[junit4:junit4]   2> 8009 T766 oasc.Overseer$ClusterStateUpdater.updateState Collection already exists with numShards=1
[junit4:junit4]   2> 8009 T766 oasc.Overseer$ClusterStateUpdater.updateState Assigning new node to shard shard=shard1
[junit4:junit4]   2> 8022 T797 oascc.ZkStateReader$2.process A cluster state change has occurred - updating... (3)
[junit4:junit4]   2> 8022 T782 oascc.ZkStateReader$2.process A cluster state change has occurred - updating... (3)
[junit4:junit4]   2> 8022 T765 oascc.ZkStateReader$2.process A cluster state change has occurred - updating... (3)
[junit4:junit4]   2> 8055 T798 oasc.CoreContainer.register registering core: collection1
[junit4:junit4]   2> 8055 T798 oasc.ZkController.register Register shard - core:collection1 address:http://127.0.0.1:49949/solr shardId:shard1
[junit4:junit4]   2> 8061 T798 oasc.ZkController.register We are http://127.0.0.1:49949/solr/collection1/ and leader is http://127.0.0.1:49940/solr/collection1/
[junit4:junit4]   2> 8061 T798 oasc.ZkController.register No LogReplay needed for core=collection1 baseURL=http://127.0.0.1:49949/solr
[junit4:junit4]   2> 8061 T798 oasc.ZkController.checkRecovery Core needs to recover:collection1
[junit4:junit4]   2> 8061 T798 oasu.DefaultSolrCoreState.doRecovery Running recovery - first canceling any ongoing recovery
[junit4:junit4]   2> ASYNC  NEW_CORE C18 name=collection1 org.apache.solr.core.SolrCore@bc2f14 url=http://127.0.0.1:49949/solr/collection1 node=127.0.0.1:49949_solr
[junit4:junit4]   2> 8068 T800 C18 P49949 oasc.RecoveryStrategy.run Starting recovery process.  core=collection1 recoveringAfterStartup=true
[junit4:junit4]   2> 8068 T798 oascc.ZkStateReader.updateClusterState Updating cloud state from ZooKeeper... 
[junit4:junit4]   2> 8069 T800 C18 P49949 oasc.RecoveryStrategy.doRecovery ###### startupVersions=[]
[junit4:junit4]   2> 8069 T800 C18 P49949 oasc.ZkController.publish publishing core=collection1 state=recovering
[junit4:junit4]   2> 8069 T800 C18 P49949 oasc.ZkController.publish numShards not found on descriptor - reading it from system property
[junit4:junit4]   2> 8070 T743 oass.SolrDispatchFilter.init user.dir=C:\Users\JenkinsSlave\workspace\Lucene-Solr-4.x-Windows\solr\build\solr-core\test\J0
[junit4:junit4]   2> 8070 T743 oass.SolrDispatchFilter.init SolrDispatchFilter.init() done
[junit4:junit4]   2> 8071 T743 oascsi.HttpClientUtil.createClient Creating new http client, config:maxConnections=128&maxConnectionsPerHost=32&followRedirects=false
[junit4:junit4]   2> 8071 T800 C18 P49949 oasc.RecoveryStrategy.doRecovery Attempting to PeerSync from http://127.0.0.1:49940/solr/collection1/ core=collection1 - recoveringAfterStartup=true
[junit4:junit4]   2> 8080 T800 C18 P49949 oascsi.HttpClientUtil.createClient Creating new http client, config:maxConnectionsPerHost=20&maxConnections=10000&connTimeout=30000&socketTimeout=30000&retry=false
[junit4:junit4]   2> 8090 T800 C18 P49949 oasu.PeerSync.sync PeerSync: core=collection1 url=http://127.0.0.1:49949/solr START replicas=[http://127.0.0.1:49940/solr/collection1/] nUpdates=100
[junit4:junit4]   2> 8090 T800 C18 P49949 oasu.PeerSync.sync WARNING no frame of reference to tell of we've missed updates
[junit4:junit4]   2> 8092 T800 C18 P49949 oasc.RecoveryStrategy.doRecovery PeerSync Recovery was not successful - trying replication. core=collection1
[junit4:junit4]   2> 8093 T800 C18 P49949 oasc.RecoveryStrategy.doRecovery Starting Replication Recovery. core=collection1
[junit4:junit4]   2> 8093 T800 C18 P49949 oascsi.HttpClientUtil.createClient Creating new http client, config:maxConnections=128&maxConnectionsPerHost=32&followRedirects=false
[junit4:junit4]   2> ASYNC  NEW_CORE C19 name=collection1 org.apache.solr.core.SolrCore@17082b6 url=http://127.0.0.1:49940/solr/collection1 node=127.0.0.1:49940_solr
[junit4:junit4]   2> 8114 T777 C19 P49940 REQ /get {distrib=false&qt=/get&wt=javabin&version=2&getVersions=100} status=0 QTime=1 
[junit4:junit4]   2> 8397 T743 oejs.Server.doStart jetty-8.1.8.v20121106
[junit4:junit4]   2> 8400 T743 oejs.AbstractConnector.doStart Started SelectChannelConnector@0.0.0.0:49960
[junit4:junit4]   2> 8403 T743 oasc.SolrResourceLoader.locateSolrHome JNDI not configured for solr (NoInitialContextEx)
[junit4:junit4]   2> 8403 T743 oasc.SolrResourceLoader.locateSolrHome using system property solr.solr.home: C:\Users\JenkinsSlave\workspace\Lucene-Solr-4.x-Windows\solr\build\solr-core\test\J0\.\solrtest-jetty3-1355276554353
[junit4:junit4]   2> 8403 T743 oasc.SolrResourceLoader.<init> new SolrResourceLoader for deduced Solr Home: 'C:\Users\JenkinsSlave\workspace\Lucene-Solr-4.x-Windows\solr\build\solr-core\test\J0\.\solrtest-jetty3-1355276554353\'
[junit4:junit4]   2> 8437 T743 oass.SolrDispatchFilter.init SolrDispatchFilter.init()
[junit4:junit4]   2> 8438 T743 oasc.SolrResourceLoader.locateSolrHome JNDI not configured for solr (NoInitialContextEx)
[junit4:junit4]   2> 8438 T743 oasc.SolrResourceLoader.locateSolrHome using system property solr.solr.home: C:\Users\JenkinsSlave\workspace\Lucene-Solr-4.x-Windows\solr\build\solr-core\test\J0\.\solrtest-jetty3-1355276554353
[junit4:junit4]   2> 8438 T743 oasc.CoreContainer$Initializer.initialize looking for solr.xml: C:\Users\JenkinsSlave\workspace\Lucene-Solr-4.x-Windows\solr\build\solr-core\test\J0\.\solrtest-jetty3-1355276554353\solr.xml
[junit4:junit4]   2> 8438 T743 oasc.CoreContainer.<init> New CoreContainer 25321800
[junit4:junit4]   2> 8439 T743 oasc.CoreContainer.load Loading CoreContainer using Solr Home: 'C:\Users\JenkinsSlave\workspace\Lucene-Solr-4.x-Windows\solr\build\solr-core\test\J0\.\solrtest-jetty3-1355276554353\'
[junit4:junit4]   2> 8440 T743 oasc.SolrResourceLoader.<init> new SolrResourceLoader for directory: 'C:\Users\JenkinsSlave\workspace\Lucene-Solr-4.x-Windows\solr\build\solr-core\test\J0\.\solrtest-jetty3-1355276554353\'
[junit4:junit4]   2> 8461 T743 oasc.CoreContainer.load Registering Log Listener
[junit4:junit4]   2> 8484 T743 oasc.CoreContainer.initZooKeeper Zookeeper client=127.0.0.1:49924/solr
[junit4:junit4]   2> 8484 T743 oasc.ZkController.checkChrootPath zkHost includes chroot
[junit4:junit4]   2> 8484 T743 oaz.ZooKeeper.<init> Initiating client connection, connectString=127.0.0.1:49924 sessionTimeout=60000 watcher=org.apache.solr.common.cloud.ConnectionManager@29ea9c
[junit4:junit4]   2> 8486 T743 oascc.ConnectionManager.waitForConnected Waiting for client to connect to ZooKeeper
[junit4:junit4]   2> 8487 T811 oaz.ClientCnxn$SendThread.logStartConnect Opening socket connection to server 127.0.0.1/127.0.0.1:49924. Will not attempt to authenticate using SASL (access denied (javax.security.auth.AuthPermission getLoginConfiguration))
[junit4:junit4]   2> 8488 T811 oaz.ClientCnxn$SendThread.primeConnection Socket connection established to 127.0.0.1/127.0.0.1:49924, initiating session
[junit4:junit4]   2> 8488 T745 oazs.NIOServerCnxnFactory.run Accepted socket connection from /127.0.0.1:49965
[junit4:junit4]   2> 8488 T745 oazs.ZooKeeperServer.processConnectRequest Client attempting to establish new session at /127.0.0.1:49965
[junit4:junit4]   2> 8499 T747 oazs.ZooKeeperServer.finishSessionInit Established session 0x13b8cc6f0f80008 with negotiated timeout 20000 for client /127.0.0.1:49965
[junit4:junit4]   2> 8499 T811 oaz.ClientCnxn$SendThread.onConnected Session establishment complete on server 127.0.0.1/127.0.0.1:49924, sessionid = 0x13b8cc6f0f80008, negotiated timeout = 20000
[junit4:junit4]   2> 8500 T812 oascc.ConnectionManager.process Watcher org.apache.solr.common.cloud.ConnectionManager@29ea9c name:ZooKeeperConnection Watcher:127.0.0.1:49924 got event WatchedEvent state:SyncConnected type:None path:null path:null type:None
[junit4:junit4]   2> 8500 T743 oascc.ConnectionManager.waitForConnected Client is connected to ZooKeeper
[junit4:junit4]   2> 8502 T748 oazs.PrepRequestProcessor.pRequest2Txn Processed session termination for sessionid: 0x13b8cc6f0f80008
[junit4:junit4]   2> 8503 T812 oaz.ClientCnxn$EventThread.run EventThread shut down
[junit4:junit4]   2> 8503 T745 oazs.NIOServerCnxn.doIO WARNING caught end of stream exception EndOfStreamException: Unable to read additional data from client sessionid 0x13b8cc6f0f80008, likely client has closed socket
[junit4:junit4]   2> 	at org.apache.zookeeper.server.NIOServerCnxn.doIO(NIOServerCnxn.java:220)
[junit4:junit4]   2> 	at org.apache.zookeeper.server.NIOServerCnxnFactory.run(NIOServerCnxnFactory.java:208)
[junit4:junit4]   2> 	at java.lang.Thread.run(Thread.java:662)
[junit4:junit4]   2> 
[junit4:junit4]   2> 8503 T743 oaz.ZooKeeper.close Session: 0x13b8cc6f0f80008 closed
[junit4:junit4]   2> 8504 T745 oazs.NIOServerCnxn.closeSock Closed socket connection for client /127.0.0.1:49965 which had sessionid 0x13b8cc6f0f80008
[junit4:junit4]   2> 8504 T743 oaz.ZooKeeper.<init> Initiating client connection, connectString=127.0.0.1:49924/solr sessionTimeout=8000 watcher=org.apache.solr.common.cloud.ConnectionManager@1161acd
[junit4:junit4]   2> 8505 T743 oascc.ConnectionManager.waitForConnected Waiting for client to connect to ZooKeeper
[junit4:junit4]   2> 8506 T813 oaz.ClientCnxn$SendThread.logStartConnect Opening socket connection to server 127.0.0.1/127.0.0.1:49924. Will not attempt to authenticate using SASL (access denied (javax.security.auth.AuthPermission getLoginConfiguration))
[junit4:junit4]   2> 8506 T813 oaz.ClientCnxn$SendThread.primeConnection Socket connection established to 127.0.0.1/127.0.0.1:49924, initiating session
[junit4:junit4]   2> 8507 T745 oazs.NIOServerCnxnFactory.run Accepted socket connection from /127.0.0.1:49968
[junit4:junit4]   2> 8507 T745 oazs.ZooKeeperServer.processConnectRequest Client attempting to establish new session at /127.0.0.1:49968
[junit4:junit4]   2> 8509 T747 oazs.ZooKeeperServer.finishSessionInit Established session 0x13b8cc6f0f80009 with negotiated timeout 8000 for client /127.0.0.1:49968
[junit4:junit4]   2> 8509 T813 oaz.ClientCnxn$SendThread.onConnected Session establishment complete on server 127.0.0.1/127.0.0.1:49924, sessionid = 0x13b8cc6f0f80009, negotiated timeout = 8000
[junit4:junit4]   2> 8509 T814 oascc.ConnectionManager.process Watcher org.apache.solr.common.cloud.ConnectionManager@1161acd name:ZooKeeperConnection Watcher:127.0.0.1:49924/solr got event WatchedEvent state:SyncConnected type:None path:null path:null type:None
[junit4:junit4]   2> 8510 T743 oascc.ConnectionManager.waitForConnected Client is connected to ZooKeeper
[junit4:junit4]   2> 8510 T748 oazs.PrepRequestProcessor.pRequest Got user-level KeeperException when processing sessionid:0x13b8cc6f0f80009 type:create cxid:0x1 zxid:0x80 txntype:-1 reqpath:n/a Error Path:/solr/overseer Error:KeeperErrorCode = NodeExists for /solr/overseer
[junit4:junit4]   2> 8512 T748 oazs.PrepRequestProcessor.pRequest Got user-level KeeperException when processing sessionid:0x13b8cc6f0f80009 type:create cxid:0x2 zxid:0x81 txntype:-1 reqpath:n/a Error Path:/solr/overseer Error:KeeperErrorCode = NodeExists for /solr/overseer
[junit4:junit4]   2> 8514 T743 oasc.ZkController.createEphemeralLiveNode Register node as live in ZooKeeper:/live_nodes/127.0.0.1:49960_solr
[junit4:junit4]   2> 8516 T748 oazs.PrepRequestProcessor.pRequest Got user-level KeeperException when processing sessionid:0x13b8cc6f0f80009 type:delete cxid:0x4 zxid:0x82 txntype:-1 reqpath:n/a Error Path:/solr/live_nodes/127.0.0.1:49960_solr Error:KeeperErrorCode = NoNode for /solr/live_nodes/127.0.0.1:49960_solr
[junit4:junit4]   2> 8517 T743 oascc.SolrZkClient.makePath makePath: /live_nodes/127.0.0.1:49960_solr
[junit4:junit4]   2> 8521 T765 oascc.ZkStateReader$2.process A cluster state change has occurred - updating... (3)
[junit4:junit4]   2> 8522 T782 oascc.ZkStateReader$3.process Updating live nodes... (4)
[junit4:junit4]   2> 8522 T782 oascc.ZkStateReader$2.process A cluster state change has occurred - updating... (4)
[junit4:junit4]   2> 8522 T797 oascc.ZkStateReader$3.process Updating live nodes... (4)
[junit4:junit4]   2> 8522 T797 oascc.ZkStateReader$2.process A cluster state change has occurred - updating... (4)
[junit4:junit4]   2> 8523 T743 oashc.HttpShardHandlerFactory.getParameter Setting socketTimeout to: 0
[junit4:junit4]   2> 8524 T743 oashc.HttpShardHandlerFactory.getParameter Setting urlScheme to: http://
[junit4:junit4]   2> 8524 T743 oashc.HttpShardHandlerFactory.getParameter Setting connTimeout to: 0
[junit4:junit4]   2> 8524 T743 oashc.HttpShardHandlerFactory.getParameter Setting maxConnectionsPerHost to: 20
[junit4:junit4]   2> 8524 T743 oashc.HttpShardHandlerFactory.getParameter Setting corePoolSize to: 0
[junit4:junit4]   2> 8524 T743 oashc.HttpShardHandlerFactory.getParameter Setting maximumPoolSize to: 2147483647
[junit4:junit4]   2> 8524 T743 oashc.HttpShardHandlerFactory.getParameter Setting maxThreadIdleTime to: 5
[junit4:junit4]   2> 8524 T743 oashc.HttpShardHandlerFactory.getParameter Setting sizeOfQueue to: -1
[junit4:junit4]   2> 8525 T765 oascc.ZkStateReader$3.process Updating live nodes... (4)
[junit4:junit4]   2> 8525 T743 oashc.HttpShardHandlerFactory.getParameter Setting fairnessPolicy to: false
[junit4:junit4]   2> 8525 T743 oascsi.HttpClientUtil.createClient Creating new http client, config:maxConnectionsPerHost=20&maxConnections=10000&socketTimeout=0&connTimeout=0&retry=false
[junit4:junit4]   2> 8527 T766 oascc.ZkStateReader.updateClusterState Updating cloud state from ZooKeeper... 
[junit4:junit4]   2> 8528 T766 oasc.Overseer$ClusterStateUpdater.updateState Update state numShards=1 message={
[junit4:junit4]   2> 	  "operation":"state",
[junit4:junit4]   2> 	  "numShards":"1",
[junit4:junit4]   2> 	  "shard":"shard1",
[junit4:junit4]   2> 	  "roles":null,
[junit4:junit4]   2> 	  "state":"recovering",
[junit4:junit4]   2> 	  "core":"collection1",
[junit4:junit4]   2> 	  "collection":"collection1",
[junit4:junit4]   2> 	  "node_name":"127.0.0.1:49949_solr",
[junit4:junit4]   2> 	  "base_url":"http://127.0.0.1:49949/solr"}
[junit4:junit4]   2> 8536 T782 oascc.ZkStateReader$2.process A cluster state change has occurred - updating... (4)
[junit4:junit4]   2> 8537 T797 oascc.ZkStateReader$2.process A cluster state change has occurred - updating... (4)
[junit4:junit4]   2> 8538 T765 oascc.ZkStateReader$2.process A cluster state change has occurred - updating... (4)
[junit4:junit4]   2> 8541 T743 oascc.ZkStateReader.createClusterStateWatchersAndUpdate Updating cluster state from ZooKeeper... 
[junit4:junit4]   2> 8549 T815 oasc.CoreContainer.create Creating SolrCore 'collection1' using instanceDir: C:\Users\JenkinsSlave\workspace\Lucene-Solr-4.x-Windows\solr\build\solr-core\test\J0\.\solrtest-jetty3-1355276554353\collection1
[junit4:junit4]   2> 8549 T815 oasc.ZkController.createCollectionZkNode Check for collection zkNode:collection1
[junit4:junit4]   2> 8551 T815 oasc.ZkController.createCollectionZkNode Collection zkNode exists
[junit4:junit4]   2> 8551 T815 oasc.ZkController.readConfigName Load collection config from:/collections/collection1
[junit4:junit4]   2> 8553 T815 oasc.SolrResourceLoader.<init> new SolrResourceLoader for directory: 'C:\Users\JenkinsSlave\workspace\Lucene-Solr-4.x-Windows\solr\build\solr-core\test\J0\.\solrtest-jetty3-1355276554353\collection1\'
[junit4:junit4]   2> 8554 T815 oasc.SolrResourceLoader.replaceClassLoader Adding 'file:/C:/Users/JenkinsSlave/workspace/Lucene-Solr-4.x-Windows/solr/build/solr-core/test/J0/solrtest-jetty3-1355276554353/collection1/lib/classes/' to classloader
[junit4:junit4]   2> 8555 T815 oasc.SolrResourceLoader.replaceClassLoader Adding 'file:/C:/Users/JenkinsSlave/workspace/Lucene-Solr-4.x-Windows/solr/build/solr-core/test/J0/solrtest-jetty3-1355276554353/collection1/lib/README' to classloader
[junit4:junit4]   2> 8607 T815 oasc.SolrConfig.<init> Using Lucene MatchVersion: LUCENE_41
[junit4:junit4]   2> 8687 T815 oasc.SolrConfig.<init> Loaded SolrConfig: solrconfig.xml
[junit4:junit4]   2> 8688 T815 oass.IndexSchema.readSchema Reading Solr Schema
[junit4:junit4]   2> 8694 T815 oass.IndexSchema.readSchema Schema name=test
[junit4:junit4]   2> 9523 T815 oass.OpenExchangeRatesOrgProvider.init Initialized with rates=open-exchange-rates.json, refreshInterval=1440.
[junit4:junit4]   2> 9536 T815 oass.IndexSchema.readSchema default search field in schema is text
[junit4:junit4]   2> 9541 T815 oass.IndexSchema.readSchema unique key field: id
[junit4:junit4]   2> 9556 T815 oass.FileExchangeRateProvider.reload Reloading exchange rates from file currency.xml
[junit4:junit4]   2> 9561 T815 oass.FileExchangeRateProvider.reload Reloading exchange rates from file currency.xml
[junit4:junit4]   2> 9566 T815 oass.OpenExchangeRatesOrgProvider.reload Reloading exchange rates from open-exchange-rates.json
[junit4:junit4]   2> 9568 T815 oass.OpenExchangeRatesOrgProvider.reload Reloading exchange rates from open-exchange-rates.json
[junit4:junit4]   2> 9570 T815 oasc.SolrCore.<init> [collection1] Opening new SolrCore at C:\Users\JenkinsSlave\workspace\Lucene-Solr-4.x-Windows\solr\build\solr-core\test\J0\.\solrtest-jetty3-1355276554353\collection1\, dataDir=.\org.apache.solr.cloud.SyncSliceTest-1355276546277/jetty3\
[junit4:junit4]   2> 9570 T815 oasc.JmxMonitoredMap.<init> JMX monitoring is enabled. Adding Solr mbeans to JMX Server: com.sun.jmx.mbeanserver.JmxMBeanServer@15c62bc
[junit4:junit4]   2> 9571 T815 oasc.SolrCore.getNewIndexDir New index directory detected: old=null new=.\org.apache.solr.cloud.SyncSliceTest-1355276546277/jetty3\index/
[junit4:junit4]   2> 9573 T815 oasc.SolrCore.initIndex WARNING [collection1] Solr index directory '.\org.apache.solr.cloud.SyncSliceTest-1355276546277\jetty3\index' doesn't exist. Creating new index...
[junit4:junit4]   2> 9573 T815 oasc.CachingDirectoryFactory.get return new directory for C:\Users\JenkinsSlave\workspace\Lucene-Solr-4.x-Windows\solr\build\solr-core\test\J0\.\org.apache.solr.cloud.SyncSliceTest-1355276546277\jetty3\index forceNew:false
[junit4:junit4]   2> 9581 T815 oasc.SolrDeletionPolicy.onCommit SolrDeletionPolicy.onCommit: commits:num=1
[junit4:junit4]   2> 		commit{dir=RateLimitedDirectoryWrapper(org.apache.lucene.store.SimpleFSDirectory@C:\Users\JenkinsSlave\workspace\Lucene-Solr-4.x-Windows\solr\build\solr-core\test\J0\org.apache.solr.cloud.SyncSliceTest-1355276546277\jetty3\index lockFactory=org.apache.lucene.store.NativeFSLockFactory@1205b8),segFN=segments_1,generation=1,filenames=[segments_1]
[junit4:junit4]   2> 9582 T815 oasc.SolrDeletionPolicy.updateCommits newest commit = 1
[junit4:junit4]   2> 9583 T815 oasc.SolrCore.initWriters created xml: solr.XMLResponseWriter
[junit4:junit4]   2> 9585 T815 oasup.UpdateRequestProcessorChain.init inserting DistributedUpdateProcessorFactory into updateRequestProcessorChain "dedupe"
[junit4:junit4]   2> 9585 T815 oasup.UpdateRequestProcessorChain.init inserting DistributedUpdateProcessorFactory into updateRequestProcessorChain "dedupe-allfields"
[junit4:junit4]   2> 9586 T815 oasup.UpdateRequestProcessorChain.init inserting DistributedUpdateProcessorFactory into updateRequestProcessorChain "stored_sig"
[junit4:junit4]   2> 9586 T815 oasup.UpdateRequestProcessorChain.init inserting DistributedUpdateProcessorFactory into updateRequestProcessorChain "uniq-fields"
[junit4:junit4]   2> 9587 T815 oasup.UpdateRequestProcessorChain.init inserting DistributedUpdateProcessorFactory into updateRequestProcessorChain "distrib-dup-test-chain-implicit"
[junit4:junit4]   2> 9587 T815 oasc.RequestHandlers.initHandlersFromConfig adding lazy requestHandler: solr.ReplicationHandler
[junit4:junit4]   2> 9587 T815 oasc.RequestHandlers.initHandlersFromConfig created /replication: solr.ReplicationHandler
[junit4:junit4]   2> 9588 T815 oasc.RequestHandlers.initHandlersFromConfig created standard: solr.StandardRequestHandler
[junit4:junit4]   2> 9589 T815 oasc.RequestHandlers.initHandlersFromConfig created /get: solr.RealTimeGetHandler
[junit4:junit4]   2> 9589 T815 oasc.RequestHandlers.initHandlersFromConfig created dismax: solr.SearchHandler
[junit4:junit4]   2> 9590 T815 oasc.RequestHandlers.initHandlersFromConfig created mock: org.apache.solr.core.MockQuerySenderListenerReqHandler
[junit4:junit4]   2> 9590 T815 oasc.RequestHandlers.initHandlersFromConfig created /admin/: org.apache.solr.handler.admin.AdminHandlers
[junit4:junit4]   2> 9591 T815 oasc.RequestHandlers.initHandlersFromConfig created defaults: solr.StandardRequestHandler
[junit4:junit4]   2> 9591 T815 oasc.RequestHandlers.initHandlersFromConfig adding lazy requestHandler: solr.StandardRequestHandler
[junit4:junit4]   2> 9592 T815 oasc.RequestHandlers.initHandlersFromConfig created lazy: solr.StandardRequestHandler
[junit4:junit4]   2> 9592 T815 oasc.RequestHandlers.initHandlersFromConfig created /update: solr.UpdateRequestHandler
[junit4:junit4]   2> 9593 T815 oasc.RequestHandlers.initHandlersFromConfig created /terms: org.apache.solr.handler.component.SearchHandler
[junit4:junit4]   2> 9594 T815 oasc.RequestHandlers.initHandlersFromConfig created spellCheckCompRH: org.apache.solr.handler.component.SearchHandler
[junit4:junit4]   2> 9595 T815 oasc.RequestHandlers.initHandlersFromConfig created spellCheckCompRH_Direct: org.apache.solr.handler.component.SearchHandler
[junit4:junit4]   2> 9595 T815 oasc.RequestHandlers.initHandlersFromConfig created spellCheckWithWordbreak: org.apache.solr.handler.component.SearchHandler
[junit4:junit4]   2> 9596 T815 oasc.RequestHandlers.initHandlersFromConfig created spellCheckWithWordbreak_Direct: org.apache.solr.handler.component.SearchHandler
[junit4:junit4]   2> 9597 T815 oasc.RequestHandlers.initHandlersFromConfig created spellCheckCompRH1: org.apache.solr.handler.component.SearchHandler
[junit4:junit4]   2> 9598 T815 oasc.RequestHandlers.initHandlersFromConfig created tvrh: org.apache.solr.handler.component.SearchHandler
[junit4:junit4]   2> 9599 T815 oasc.RequestHandlers.initHandlersFromConfig created /mlt: solr.MoreLikeThisHandler
[junit4:junit4]   2> 9600 T815 oasc.RequestHandlers.initHandlersFromConfig created /debug/dump: solr.DumpRequestHandler
[junit4:junit4]   2> 9608 T815 oashl.XMLLoader.init xsltCacheLifetimeSeconds=60
[junit4:junit4]   2> 9613 T815 oasc.SolrCore.initDeprecatedSupport WARNING solrconfig.xml uses deprecated <admin/gettableFiles>, Please update your config to use the ShowFileRequestHandler.
[junit4:junit4]   2> 9614 T815 oasc.SolrCore.initDeprecatedSupport WARNING adding ShowFileRequestHandler with hidden files: [SCHEMA.XML, OLD_SYNONYMS.TXT, STOPWORDS.TXT, PROTWORDS.TXT, OPEN-EXCHANGE-RATES.JSON, SYNONYMS.TXT, CURRENCY.XML, MAPPING-ISOLATIN1ACCENT.TXT]
[junit4:junit4]   2> 9620 T815 oass.SolrIndexSearcher.<init> Opening Searcher@6ccbb3 main
[junit4:junit4]   2> 9620 T815 oass.SolrIndexSearcher.getIndexDir WARNING WARNING: Directory impl does not support setting indexDir: org.apache.lucene.store.RateLimitedDirectoryWrapper
[junit4:junit4]   2> 9622 T815 oasu.CommitTracker.<init> Hard AutoCommit: disabled
[junit4:junit4]   2> 9622 T815 oasu.CommitTracker.<init> Soft AutoCommit: disabled
[junit4:junit4]   2> 9622 T815 oashc.SpellCheckComponent.inform Initializing spell checkers
[junit4:junit4]   2> 9632 T815 oass.DirectSolrSpellChecker.init init: {name=direct,classname=DirectSolrSpellChecker,field=lowerfilt,minQueryLength=3}
[junit4:junit4]   2> 9686 T816 oasc.SolrCore.registerSearcher [collection1] Registered new searcher Searcher@6ccbb3 main{StandardDirectoryReader(segments_1:1)}
[junit4:junit4]   2> 9691 T815 oasc.ZkController.publish publishing core=collection1 state=down
[junit4:junit4]   2> 9691 T815 oasc.ZkController.publish numShards not found on descriptor - reading it from system property
[junit4:junit4]   2> 10032 T766 oascc.ZkStateReader.updateClusterState Updating cloud state from ZooKeeper... 
[junit4:junit4]   2> 10033 T766 oasc.Overseer$ClusterStateUpdater.updateState Update state numShards=1 message={
[junit4:junit4]   2> 	  "operation":"state",
[junit4:junit4]   2> 	  "numShards":"1",
[junit4:junit4]   2> 	  "shard":null,
[junit4:junit4]   2> 	  "roles":null,
[junit4:junit4]   2> 	  "state":"down",
[junit4:junit4]   2> 	  "core":"collection1",
[junit4:junit4]   2> 	  "collection":"collection1",
[junit4:junit4]   2> 	  "node_name":"127.0.0.1:49960_solr",
[junit4:junit4]   2> 	  "base_url":"http://127.0.0.1:49960/solr"}
[junit4:junit4]   2> 10033 T766 oasc.Overseer$ClusterStateUpdater.updateState Collection already exists with numShards=1
[junit4:junit4]   2> 10033 T766 oasc.Overseer$ClusterStateUpdater.updateState Assigning new node to shard shard=shard1
[junit4:junit4]   2> 10044 T782 oascc.ZkStateReader$2.process A cluster state change has occurred - updating... (4)
[junit4:junit4]   2> 10044 T765 oascc.ZkStateReader$2.process A cluster state change has occurred - updating... (4)
[junit4:junit4]   2> 10045 T814 oascc.ZkStateReader$2.process A cluster state change has occurred - updating... (4)
[junit4:junit4]   2> 10045 T797 oascc.ZkStateReader$2.process A cluster state change has occurred - updating... (4)
[junit4:junit4]   2> 10190 T815 oasc.CoreContainer.register registering core: collection1
[junit4:junit4]   2> 10190 T815 oasc.ZkController.register Register shard - core:collection1 address:http://127.0.0.1:49960/solr shardId:shard1
[junit4:junit4]   2> 10195 T815 oasc.ZkController.register We are http://127.0.0.1:49960/solr/collection1/ and leader is http://127.0.0.1:49940/solr/collection1/
[junit4:junit4]   2> 10195 T815 oasc.ZkController.register No LogReplay needed for core=collection1 baseURL=http://127.0.0.1:49960/solr
[junit4:junit4]   2> 10196 T815 oasc.ZkController.checkRecovery Core needs to recover:collection1
[junit4:junit4]   2> 10196 T815 oasu.DefaultSolrCoreState.doRecovery Running recovery - first canceling any ongoing recovery
[junit4:junit4]   2> ASYNC  NEW_CORE C20 name=collection1 org.apache.solr.core.SolrCore@fcc563 url=http://127.0.0.1:49960/solr/collection1 node=127.0.0.1:49960_solr
[junit4:junit4]   2> 10196 T817 C20 P49960 oasc.RecoveryStrategy.run Starting recovery process.  core=collection1 recoveringAfterStartup=true
[junit4:junit4]   2> 10197 T815 oascc.ZkStateReader.updateClusterState Updating cloud state from ZooKeeper... 
[junit4:junit4]   2> 10198 T817 C20 P49960 oasc.RecoveryStrategy.doRecovery ###### startupVersions=[]
[junit4:junit4]   2> 10198 T817 C20 P49960 oasc.ZkController.publish publishing core=collection1 state=recovering
[junit4:junit4]   2> 10198 T817 C20 P49960 oasc.ZkController.publish numShards not found on descriptor - reading it from system property
[junit4:junit4]   2> 10199 T743 oass.SolrDispatchFilter.init user.dir=C:\Users\JenkinsSlave\workspace\Lucene-Solr-4.x-Windows\solr\build\solr-core\test\J0
[junit4:junit4]   2> 10200 T743 oass.SolrDispatchFilter.init SolrDispatchFilter.init() done
[junit4:junit4]   2> 10200 T743 oascsi.HttpClientUtil.createClient Creating new http client, config:maxConnections=128&maxConnectionsPerHost=32&followRedirects=false
[junit4:junit4]   2> 10201 T817 C20 P49960 oasc.RecoveryStrategy.doRecovery Attempting to PeerSync from http://127.0.0.1:49940/solr/collection1/ core=collection1 - recoveringAfterStartup=true
[junit4:junit4]   2> 10201 T817 C20 P49960 oasu.PeerSync.sync PeerSync: core=collection1 url=http://127.0.0.1:49960/solr START replicas=[http://127.0.0.1:49940/solr/collection1/] nUpdates=100
[junit4:junit4]   2> 10202 T817 C20 P49960 oasu.PeerSync.sync WARNING no frame of reference to tell of we've missed updates
[junit4:junit4]   2> 10202 T817 C20 P49960 oasc.RecoveryStrategy.doRecovery PeerSync Recovery was not successful - trying replication. core=collection1
[junit4:junit4]   2> 10202 T817 C20 P49960 oasc.RecoveryStrategy.doRecovery Starting Replication Recovery. core=collection1
[junit4:junit4]   2> 10202 T817 C20 P49960 oascsi.HttpClientUtil.createClient Creating new http client, config:maxConnections=128&maxConnectionsPerHost=32&followRedirects=false
[junit4:junit4]   2> 10216 T776 C19 P49940 REQ /get {distrib=false&qt=/get&wt=javabin&version=2&getVersions=100} status=0 QTime=0 
[junit4:junit4]   2> 10530 T743 oejs.Server.doStart jetty-8.1.8.v20121106
[junit4:junit4]   2> 10533 T743 oejs.AbstractConnector.doStart Started SelectChannelConnector@0.0.0.0:49970
[junit4:junit4]   2> 10533 T743 oasc.SolrResourceLoader.locateSolrHome JNDI not configured for solr (NoInitialContextEx)
[junit4:junit4]   2> 10534 T743 oasc.SolrResourceLoader.locateSolrHome using system property solr.solr.home: C:\Users\JenkinsSlave\workspace\Lucene-Solr-4.x-Windows\solr\build\solr-core\test\J0\.\solrtest-jetty4-1355276556486
[junit4:junit4]   2> 10534 T743 oasc.SolrResourceLoader.<init> new SolrResourceLoader for deduced Solr Home: 'C:\Users\JenkinsSlave\workspace\Lucene-Solr-4.x-Windows\solr\build\solr-core\test\J0\.\solrtest-jetty4-1355276556486\'
[junit4:junit4]   2> 10548 T766 oascc.ZkStateReader.updateClusterState Updating cloud state from ZooKeeper... 
[junit4:junit4]   2> 10548 T766 oasc.Overseer$ClusterStateUpdater.updateState Update state numShards=1 message={
[junit4:junit4]   2> 	  "operation":"state",
[junit4:junit4]   2> 	  "numShards":"1",
[junit4:junit4]   2> 	  "shard":"shard1",
[junit4:junit4]   2> 	  "roles":null,
[junit4:junit4]   2> 	  "state":"recovering",
[junit4:junit4]   2> 	  "core":"collection1",
[junit4:junit4]   2> 	  "collection":"collection1",
[junit4:junit4]   2> 	  "node_name":"127.0.0.1:49960_solr",
[junit4:junit4]   2> 	  "base_url":"http://127.0.0.1:49960/solr"}
[junit4:junit4]   2> 10568 T782 oascc.ZkStateReader$2.process A cluster state change has occurred - updating... (4)
[junit4:junit4]   2> 10568 T814 oascc.ZkStateReader$2.process A cluster state change has occurred - updating... (4)
[junit4:junit4]   2> 10569 T765 oascc.ZkStateReader$2.process A cluster state change has occurred - updating... (4)
[junit4:junit4]   2> 10569 T797 oascc.ZkStateReader$2.process A cluster state change has occurred - updating... (4)
[junit4:junit4]   2> 10573 T743 oass.SolrDispatchFilter.init SolrDispatchFilter.init()
[junit4:junit4]   2> 10574 T743 oasc.SolrResourceLoader.locateSolrHome JNDI not configured for solr (NoInitialContextEx)
[junit4:junit4]   2> 10574 T743 oasc.SolrResourceLoader.locateSolrHome using system property solr.solr.home: C:\Users\JenkinsSlave\workspace\Lucene-Solr-4.x-Windows\solr\build\solr-core\test\J0\.\solrtest-jetty4-1355276556486
[junit4:junit4]   2> 10575 T743 oasc.CoreContainer$Initializer.initialize looking for solr.xml: C:\Users\JenkinsSlave\workspace\Lucene-Solr-4.x-Windows\solr\build\solr-core\test\J0\.\solrtest-jetty4-1355276556486\solr.xml
[junit4:junit4]   2> 10575 T743 oasc.CoreContainer.<init> New CoreContainer 28791141
[junit4:junit4]   2> 10576 T743 oasc.CoreContainer.load Loading CoreContainer using Solr Home: 'C:\Users\JenkinsSlave\workspace\Lucene-Solr-4.x-Windows\solr\build\solr-core\test\J0\.\solrtest-jetty4-1355276556486\'
[junit4:junit4]   2> 10576 T743 oasc.SolrResourceLoader.<init> new SolrResourceLoader for directory: 'C:\Users\JenkinsSlave\workspace\Lucene-Solr-4.x-Windows\solr\build\solr-core\test\J0\.\solrtest-jetty4-1355276556486\'
[junit4:junit4]   2> 10604 T743 oasc.CoreContainer.load Registering Log Listener
[junit4:junit4]   2> 10642 T743 oasc.CoreContainer.initZooKeeper Zookeeper client=127.0.0.1:49924/solr
[junit4:junit4]   2> 10643 T743 oasc.ZkController.checkChrootPath zkHost includes chroot
[junit4:junit4]   2> 10644 T743 oaz.ZooKeeper.<init> Initiating client connection, connectString=127.0.0.1:49924 sessionTimeout=60000 watcher=org.apache.solr.common.cloud.ConnectionManager@845473
[junit4:junit4]   2> 10645 T743 oascc.ConnectionManager.waitForConnected Waiting for client to connect to ZooKeeper
[junit4:junit4]   2> 10646 T828 oaz.ClientCnxn$SendThread.logStartConnect Opening socket connection to server 127.0.0.1/127.0.0.1:49924. Will not attempt to authenticate using SASL (access denied (javax.security.auth.AuthPermission getLoginConfiguration))
[junit4:junit4]   2> 10647 T828 oaz.ClientCnxn$SendThread.primeConnection Socket connection established to 127.0.0.1/127.0.0.1:49924, initiating session
[junit4:junit4]   2> 10647 T745 oazs.NIOServerCnxnFactory.run Accepted socket connection from /127.0.0.1:49975
[junit4:junit4]   2> 10648 T745 oazs.ZooKeeperServer.processConnectRequest Client attempting to establish new session at /127.0.0.1:49975
[junit4:junit4]   2> 10649 T747 oazs.ZooKeeperServer.finishSessionInit Established session 0x13b8cc6f0f8000a with negotiated timeout 20000 for client /127.0.0.1:49975
[junit4:junit4]   2> 10649 T828 oaz.ClientCnxn$SendThread.onConnected Session establishment complete on server 127.0.0.1/127.0.0.1:49924, sessionid = 0x13b8cc6f0f8000a, negotiated timeout = 20000
[junit4:junit4]   2> 10650 T829 oascc.ConnectionManager.process Watcher org.apache.solr.common.cloud.ConnectionManager@845473 name:ZooKeeperConnection Watcher:127.0.0.1:49924 got event WatchedEvent state:SyncConnected type:None path:null path:null type:None
[junit4:junit4]   2> 10650 T743 oascc.ConnectionManager.waitForConnected Client is connected to ZooKeeper
[junit4:junit4]   2> 10650 T748 oazs.PrepRequestProcessor.pRequest2Txn Processed session termination for sessionid: 0x13b8cc6f0f8000a
[junit4:junit4]   2> 10652 T743 oaz.ZooKeeper.close Session: 0x13b8cc6f0f8000a closed
[junit4:junit4]   2> 10652 T829 oaz.ClientCnxn$EventThread.run EventThread shut down
[junit4:junit4]   2> 10652 T743 oaz.ZooKeeper.<init> Initiating client connection, connectString=127.0.0.1:49924/solr sessionTimeout=8000 watcher=org.apache.solr.common.cloud.ConnectionManager@ab4d96
[junit4:junit4]   2> 10652 T745 oazs.NIOServerCnxn.closeSock Closed socket connection for client /127.0.0.1:49975 which had sessionid 0x13b8cc6f0f8000a
[junit4:junit4]   2> 10653 T743 oascc.ConnectionManager.waitForConnected Waiting for client to connect to ZooKeeper
[junit4:junit4]   2> 10655 T830 oaz.ClientCnxn$SendThread.logStartConnect Opening socket connection to server 127.0.0.1/127.0.0.1:49924. Will not attempt to authenticate using SASL (access denied (javax.security.auth.AuthPermission getLoginConfiguration))
[junit4:junit4]   2> 10656 T830 oaz.ClientCnxn$SendThread.primeConnection Socket connection established to 127.0.0.1/127.0.0.1:49924, initiating session
[junit4:junit4]   2> 10656 T745 oazs.NIOServerCnxnFactory.run Accepted socket connection from /127.0.0.1:49978
[junit4:junit4]   2> 10656 T745 oazs.ZooKeeperServer.processConnectRequest Client attempting to establish new session at /127.0.0.1:49978
[junit4:junit4]   2> 10658 T747 oazs.ZooKeeperServer.finishSessionInit Established session 0x13b8cc6f0f8000b with negotiated timeout 8000 for client /127.0.0.1:49978
[junit4:junit4]   2> 10658 T830 oaz.ClientCnxn$SendThread.onConnected Session establishment complete on server 127.0.0.1/127.0.0.1:49924, sessionid = 0x13b8cc6f0f8000b, negotiated timeout = 8000
[junit4:junit4]   2> 10659 T831 oascc.ConnectionManager.process Watcher org.apache.solr.common.cloud.ConnectionManager@ab4d96 name:ZooKeeperConnection Watcher:127.0.0.1:49924/solr got event WatchedEvent state:SyncConnected type:None path:null path:null type:None
[junit4:junit4]   2> 10659 T743 oascc.ConnectionManager.waitForConnected Client is connected to ZooKeeper
[junit4:junit4]   2> 10660 T748 oazs.PrepRequestProcessor.pRequest Got user-level KeeperException when processing sessionid:0x13b8cc6f0f8000b type:create cxid:0x1 zxid:0x97 txntype:-1 reqpath:n/a Error Path:/solr/overseer Error:KeeperErrorCode = NodeExists for /solr/overseer
[junit4:junit4]   2> 10661 T748 oazs.PrepRequestProcessor.pRequest Got user-level KeeperException when processing sessionid:0x13b8cc6f0f8000b type:create cxid:0x2 zxid:0x98 txntype:-1 reqpath:n/a Error Path:/solr/overseer Error:KeeperErrorCode = NodeExists for /solr/overseer
[junit4:junit4]   2> 10663 T743 oasc.ZkController.createEphemeralLiveNode Register node as live in ZooKeeper:/live_nodes/127.0.0.1:49970_solr
[junit4:junit4]   2> 10664 T748 oazs.PrepRequestProcessor.pRequest Got user-level KeeperException when processing sessionid:0x13b8cc6f0f8000b type:delete cxid:0x4 zxid:0x99 txntype:-1 reqpath:n/a Error Path:/solr/live_nodes/127.0.0.1:49970_solr Error:KeeperErrorCode = NoNode for /solr/live_nodes/127.0.0.1:49970_solr
[junit4:junit4]   2> 10665 T743 oascc.SolrZkClient.makePath makePath: /live_nodes/127.0.0.1:49970_solr
[junit4:junit4]   2> 10668 T765 oascc.ZkStateReader$2.process A cluster state change has occurred - updating... (4)
[junit4:junit4]   2> 10669 T814 oascc.ZkStateReader$2.process A cluster state change has occurred - updating... (4)
[junit4:junit4]   2> 10669 T782 oascc.ZkStateReader$3.process Updating live nodes... (5)
[junit4:junit4]   2> 10669 T782 oascc.ZkStateReader$2.process A cluster state change has occurred - updating... (5)
[junit4:junit4]   2> 10670 T797 oascc.ZkStateReader$3.process Updating live nodes... (5)
[junit4:junit4]   2> 10670 T797 oascc.ZkStateReader$2.process A cluster state change has occurred - updating... (5)
[junit4:junit4]   2> 10671 T743 oashc.HttpShardHandlerFactory.getParameter Setting socketTimeout to: 0
[junit4:junit4]   2> 10672 T743 oashc.HttpShardHandlerFactory.getParameter Setting urlScheme to: http://
[junit4:junit4]   2> 10672 T743 oashc.HttpShardHandlerFactory.getParameter Setting connTimeout to: 0
[junit4:junit4]   2> 10673 T743 oashc.HttpShardHandlerFactory.getParameter Setting maxConnectionsPerHost to: 20
[junit4:junit4]   2> 10673 T743 oashc.HttpShardHandlerFactory.getParameter Setting corePoolSize to: 0
[junit4:junit4]   2> 10674 T743 oashc.HttpShardHandlerFactory.getParameter Setting maximumPoolSize to: 2147483647
[junit4:junit4]   2> 10674 T743 oashc.HttpShardHandlerFactory.getParameter Setting maxThreadIdleTime to: 5
[junit4:junit4]   2> 10674 T743 oashc.HttpShardHandlerFactory.getParameter Setting sizeOfQueue to: -1
[junit4:junit4]   2> 10674 T743 oashc.HttpShardHandlerFactory.getParameter Setting fairnessPolicy to: false
[junit4:junit4]   2> 10674 T743 oascsi.HttpClientUtil.createClient Creating new http client, config:maxConnectionsPerHost=20&maxConnections=10000&socketTimeout=0&connTimeout=0&retry=false
[junit4:junit4]   2> 10675 T814 oascc.ZkStateReader$3.process Updating live nodes... (5)
[junit4:junit4]   2> 10675 T765 oascc.ZkStateReader$3.process Updating live nodes... (5)
[junit4:junit4]   2> 10686 T743 oascc.ZkStateReader.createClusterStateWatchersAndUpdate Updating cluster state from ZooKeeper... 
[junit4:junit4]   2> 10695 T832 oasc.CoreContainer.create Creating SolrCore 'collection1' using instanceDir: C:\Users\JenkinsSlave\workspace\Lucene-Solr-4.x-Windows\solr\build\solr-core\test\J0\.\solrtest-jetty4-1355276556486\collection1
[junit4:junit4]   2> 10695 T832 oasc.ZkController.createCollectionZkNode Check for collection zkNode:collection1
[junit4:junit4]   2> 10696 T832 oasc.ZkController.createCollectionZkNode Collection zkNode exists
[junit4:junit4]   2> 10696 T832 oasc.ZkController.readConfigName Load collection config from:/collections/collection1
[junit4:junit4]   2> 10699 T832 oasc.SolrResourceLoader.<init> new SolrResourceLoader for directory: 'C:\Users\JenkinsSlave\workspace\Lucene-Solr-4.x-Windows\solr\build\solr-core\test\J0\.\solrtest-jetty4-1355276556486\collection1\'
[junit4:junit4]   2> 10700 T832 oasc.SolrResourceLoader.replaceClassLoader Adding 'file:/C:/Users/JenkinsSlave/workspace/Lucene-Solr-4.x-Windows/solr/build/solr-core/test/J0/solrtest-jetty4-1355276556486/collection1/lib/classes/' to classloader
[junit4:junit4]   2> 10701 T832 oasc.SolrResourceLoader.replaceClassLoader Adding 'file:/C:/Users/JenkinsSlave/workspace/Lucene-Solr-4.x-Windows/solr/build/solr-core/test/J0/solrtest-jetty4-1355276556486/collection1/lib/README' to classloader
[junit4:junit4]   2> 10768 T832 oasc.SolrConfig.<init> Using Lucene MatchVersion: LUCENE_41
[junit4:junit4]   2> 10859 T832 oasc.SolrConfig.<init> Loaded SolrConfig: solrconfig.xml
[junit4:junit4]   2> 10861 T832 oass.IndexSchema.readSchema Reading Solr Schema
[junit4:junit4]   2> 10868 T832 oass.IndexSchema.readSchema Schema name=test
[junit4:junit4]   2>  C18_STATE=coll:collection1 core:collection1 props:{shard=shard1, roles=null, state=recovering, core=collection1, collection=collection1, node_name=127.0.0.1:49949_solr, base_url=http://127.0.0.1:49949/solr}
[junit4:junit4]   2> 11075 T800 C18 P49949 oasc.RecoveryStrategy.doRecovery Begin buffering updates. core=collection1
[junit4:junit4]   2> 11075 T800 C18 P49949 oasu.UpdateLog.bufferUpdates Starting to buffer updates. FSUpdateLog{state=ACTIVE, tlog=null}
[junit4:junit4]   2> 11075 T800 C18 P49949 oasc.RecoveryStrategy.replicate Attempting to replicate from http://127.0.0.1:49940/solr/collection1/. core=collection1
[junit4:junit4]   2> 11075 T800 C18 P49949 oascsi.HttpClientUtil.createClient Creating new http client, config:maxConnections=128&maxConnectionsPerHost=32&followRedirects=false
[junit4:junit4]   2> 11089 T778 C19 P49940 oascsi.HttpClientUtil.createClient Creating new http client, config:maxConnections=500&maxConnectionsPerHost=16
[junit4:junit4]   2> 11097 T778 C19 P49940 oasu.DirectUpdateHandler2.commit start commit{flags=0,_version_=0,optimize=false,openSearcher=false,waitSearcher=true,expungeDeletes=false,softCommit=false}
[junit4:junit4]   2> 11106 T778 C19 P49940 oasc.SolrDeletionPolicy.onInit SolrDeletionPolicy.onInit: commits:num=1
[junit4:junit4]   2> 		commit{dir=RateLimitedDirectoryWrapper(org.apache.lucene.store.SimpleFSDirectory@C:\Users\JenkinsSlave\workspace\Lucene-Solr-4.x-Windows\solr\build\solr-core\test\J0\org.apache.solr.cloud.SyncSliceTest-1355276546277\jetty1\index lockFactory=org.apache.lucene.store.NativeFSLockFactory@15731d6),segFN=segments_1,generation=1,filenames=[segments_1]
[junit4:junit4]   2> 11108 T778 C19 P49940 oasc.SolrDeletionPolicy.updateCommits newest commit = 1
[junit4:junit4]   2> 11117 T778 C19 P49940 oasc.SolrDeletionPolicy.onCommit SolrDeletionPolicy.onCommit: commits:num=2
[junit4:junit4]   2> 		commit{dir=RateLimitedDirectoryWrapper(org.apache.lucene.store.SimpleFSDirectory@C:\Users\JenkinsSlave\workspace\Lucene-Solr-4.x-Windows\solr\build\solr-core\test\J0\org.apache.solr.cloud.SyncSliceTest-1355276546277\jetty1\index lockFactory=org.apache.lucene.store.NativeFSLockFactory@15731d6),segFN=segments_1,generation=1,filenames=[segments_1]
[junit4:junit4]   2> 		commit{dir=RateLimitedDirectoryWrapper(org.apache.lucene.store.SimpleFSDirectory@C:\Users\JenkinsSlave\workspace\Lucene-Solr-4.x-Windows\solr\build\solr-core\test\J0\org.apache.solr.cloud.SyncSliceTest-1355276546277\jetty1\index lockFactory=org.apache.lucene.store.NativeFSLockFactory@15731d6),segFN=segments_2,generation=2,filenames=[segments_2]
[junit4:junit4]   2> 11118 T778 C19 P49940 oasc.SolrDeletionPolicy.updateCommits newest commit = 2
[junit4:junit4]   2> 11119 T778 C19 P49940 oass.SolrIndexSearcher.<init> Opening Searcher@f8b79a realtime
[junit4:junit4]   2> 11119 T778 C19 P49940 oass.SolrIndexSearcher.getIndexDir WARNING WARNING: Directory impl does not support setting indexDir: org.apache.lucene.store.RateLimitedDirectoryWrapper
[junit4:junit4]   2> 11119 T778 C19 P49940 oasu.DirectUpdateHandler2.commit end_commit_flush
[junit4:junit4]   2> 11120 T778 C19 P49940 /update {waitSearcher=true&openSearcher=false&commit=true&commit_end_point=true&wt=javabin&softCommit=false&version=2} {commit=} 0 38
[junit4:junit4]   2> 11142 T800 C18 P49949 oash.ReplicationHandler.inform Commits will be reserved for  10000
[junit4:junit4]   2> 11143 T800 C18 P49949 oascsi.HttpClientUtil.createClient Creating new http client, config:connTimeout=5000&socketTimeout=20000&allowCompression=false&maxConnections=10000&maxConnectionsPerHost=10000
[junit4:junit4]   2> 11157 T800 C18 P49949 oash.SnapPuller.<init>  No value set for 'pollInterval'. Timer Task not started.
[junit4:junit4]   2> 11161 T777 C19 P49940 oash.ReplicationHandler.inform Commits will be reserved for  10000
[junit4:junit4]   2> 11162 T777 C19 P49940 REQ /replication {command=indexversion&wt=javabin&qt=/replication&version=2} status=0 QTime=3 
[junit4:junit4]   2> 11163 T800 C18 P49949 oash.SnapPuller.fetchLatestIndex Master's generation: 2
[junit4:junit4]   2> 11163 T800 C18 P49949 oash.SnapPuller.fetchLatestIndex Slave's generation: 1
[junit4:junit4]   2> 11163 T800 C18 P49949 oash.SnapPuller.fetchLatestIndex Starting replication process
[junit4:junit4]   2> 11168 T773 C19 P49940 REQ /replication {command=filelist&generation=2&wt=javabin&qt=/replication&version=2} status=0 QTime=2 
[junit4:junit4]   2> 11169 T800 C18 P49949 oash.SnapPuller.fetchLatestIndex Number of files in latest index in master: 1
[junit4:junit4]   2> 11170 T800 C18 P49949 oash.SnapPuller.fetchLatestIndex Starting download to .\org.apache.solr.cloud.SyncSliceTest-1355276546277\jetty2\index.20121212024237442 fullCopy=true
[junit4:junit4]   2> 11175 T774 C19 P49940 REQ /replication {file=segments_2&command=filecontent&checksum=true&generation=2&qt=/replication&wt=filestream} status=0 QTime=1 
[junit4:junit4]   2> 11184 T800 C18 P49949 oash.SnapPuller.fetchLatestIndex Total time taken for download : 0 secs
[junit4:junit4]   2> 11187 T800 C18 P49949 oash.SnapPuller.modifyIndexProps New index installed. Updating index properties... index=index.20121212024237442
[junit4:junit4]   2> 11188 T800 C18 P49949 oasc.SolrCore.getNewIndexDir New index directory detected: old=.\org.apache.solr.cloud.SyncSliceTest-1355276546277/jetty2\index/ new=.\org.apache.solr.cloud.SyncSliceTest-1355276546277/jetty2\index.20121212024237442
[junit4:junit4]   2> 11188 T800 C18 P49949 oasc.CachingDirectoryFactory.get return new directory for C:\Users\JenkinsSlave\workspace\Lucene-Solr-4.x-Windows\solr\build\solr-core\test\J0\.\org.apache.solr.cloud.SyncSliceTest-1355276546277\jetty2\index.20121212024237442 forceNew:false
[junit4:junit4]   2> 11192 T800 C18 P49949 oasc.SolrDeletionPolicy.onInit SolrDeletionPolicy.onInit: commits:num=1
[junit4:junit4]   2> 		commit{dir=RateLimitedDirectoryWrapper(org.apache.lucene.store.SimpleFSDirectory@C:\Users\JenkinsSlave\workspace\Lucene-Solr-4.x-Windows\solr\build\solr-core\test\J0\org.apache.solr.cloud.SyncSliceTest-1355276546277\jetty2\index.20121212024237442 lockFactory=org.apache.lucene.store.NativeFSLockFactory@61b3ff),segFN=segments_2,generation=2,filenames=[segments_2]
[junit4:junit4]   2> 11193 T800 C18 P49949 oasc.SolrDeletionPolicy.updateCommits newest commit = 2
[junit4:junit4]   2> 11206 T800 C18 P49949 oasu.DefaultSolrCoreState.newIndexWriter Creating new IndexWriter...
[junit4:junit4]   2> 11206 T800 C18 P49949 oasu.DefaultSolrCoreState.newIndexWriter Waiting until IndexWriter is unused... core=collection1
[junit4:junit4]   2> 11206 T800 C18 P49949 oasu.DefaultSolrCoreState.newIndexWriter Rollback old IndexWriter... core=collection1
[junit4:junit4]   2> 11207 T800 C18 P49949 oasc.CachingDirectoryFactory.close Closing directory:C:\Users\JenkinsSlave\workspace\Lucene-Solr-4.x-Windows\solr\build\solr-core\test\J0\.\org.apache.solr.cloud.SyncSliceTest-1355276546277\jetty2\index.20121212024237442
[junit4:junit4]   2> 11207 T800 C18 P49949 oash.SnapPuller$2.onClose removing old index directory .\org.apache.solr.cloud.SyncSliceTest-1355276546277\jetty2\index
[junit4:junit4]   2> 11214 T800 C18 P49949 oasc.CachingDirectoryFactory.get return new directory for C:\Users\JenkinsSlave\workspace\Lucene-Solr-4.x-Windows\solr\build\solr-core\test\J0\.\org.apache.solr.cloud.SyncSliceTest-1355276546277\jetty2\index.20121212024237442 forceNew:true
[junit4:junit4]   2> 11217 T800 C18 P49949 oasc.SolrDeletionPolicy.onInit SolrDeletionPolicy.onInit: commits:num=1
[junit4:junit4]   2> 		commit{dir=RateLimitedDirectoryWrapper(org.apache.lucene.store.SimpleFSDirectory@C:\Users\JenkinsSlave\workspace\Lucene-Solr-4.x-Windows\solr\build\solr-core\test\J0\org.apache.solr.cloud.SyncSliceTest-1355276546277\jetty2\index.20121212024237442 lockFactory=org.apache.lucene.store.NativeFSLockFactory@7192e4),segFN=segments_2,generation=2,filenames=[segments_2]
[junit4:junit4]   2> 11217 T800 C18 P49949 oasc.SolrDeletionPolicy.updateCommits newest commit = 2
[junit4:junit4]   2> 11218 T800 C18 P49949 oasu.DefaultSolrCoreState.newIndexWriter New IndexWriter is ready to be used.
[junit4:junit4]   2> 11218 T800 C18 P49949 oass.SolrIndexSearcher.<init> Opening Searcher@1e677c4 main
[junit4:junit4]   2> 11218 T800 C18 P49949 oass.SolrIndexSearcher.getIndexDir WARNING WARNING: Directory impl does not support setting indexDir: org.apache.lucene.store.RateLimitedDirectoryWrapper
[junit4:junit4]   2> 11221 T799 oasc.SolrCore.registerSearcher [collection1] Registered new searcher Searcher@1e677c4 main{StandardDirectoryReader(segments_2:1:nrt)}
[junit4:junit4]   2> 11223 T800 C18 P49949 oasu.DirectUpdateHandler2.commit start commit{flags=0,_version_=0,optimize=false,openSearcher=false,waitSearcher=false,expungeDeletes=false,softCommit=false}
[junit4:junit4]   2> 11227 T800 C18 P49949 oasc.SolrDeletionPolicy.onCommit SolrDeletionPolicy.onCommit: commits:num=2
[junit4:junit4]   2> 		commit{dir=RateLimitedDirectoryWrapper(org.apache.lucene.store.SimpleFSDirectory@C:\Users\JenkinsSlave\workspace\Lucene-Solr-4.x-Windows\solr\build\solr-core\test\J0\org.apache.solr.cloud.SyncSliceTest-1355276546277\jetty2\index.20121212024237442 lockFactory=org.apache.lucene.store.NativeFSLockFactory@7192e4),segFN=segments_2,generation=2,filenames=[segments_2]
[junit4:junit4]   2> 		commit{dir=RateLimitedDirectoryWrapper(org.apache.lucene.store.SimpleFSDirectory@C:\Users\JenkinsSlave\workspace\Lucene-Solr-4.x-Windows\solr\build\solr-core\test\J0\org.apache.solr.cloud.SyncSliceTest-1355276546277\jetty2\index.20121212024237442 lockFactory=org.apache.lucene.store.NativeFSLockFactory@7192e4),segFN=segments_3,generation=3,filenames=[segments_3]
[junit4:junit4]   2> 11227 T800 C18 P49949 oasc.SolrDeletionPolicy.updateCommits newest commit = 3
[junit4:junit4]   2> 11229 T800 C18 P49949 oasu.DirectUpdateHandler2.commit end_commit_flush
[junit4:junit4]   2> 11229 T800 C18 P49949 oasc.RecoveryStrategy.replay No replay needed. core=collection1
[junit4:junit4]   2> 11229 T800 C18 P49949 oasc.RecoveryStrategy.doRecovery Replication Recovery was successful - registering as Active. core=collection1
[junit4:junit4]   2> 11230 T800 C18 P49949 oasc.ZkController.publish publishing core=collection1 state=active
[junit4:junit4]   2> 11230 T800 C18 P49949 oasc.ZkController.publish numShards not found on descriptor - reading it from system property
[junit4:junit4]   2> 11232 T800 C18 P49949 oasc.RecoveryStrategy.doRecovery Finished recovery process. core=collection1
[junit4:junit4]   2> 11570 T766 oascc.ZkStateReader.updateClusterState Updating cloud state from ZooKeeper... 
[junit4:junit4]   2> 11572 T766 oasc.Overseer$ClusterStateUpdater.updateState Update state numShards=1 message={
[junit4:junit4]   2> 	  "operation":"state",
[junit4:junit4]   2> 	  "numShards":"1",
[junit4:junit4]   2> 	  "shard":"shard1",
[junit4:junit4]   2> 	  "roles":null,
[junit4:junit4]   2> 	  "state":"active",
[junit4:junit4]   2> 	  "core":"collection1",
[junit4:junit4]   2> 	  "collection":"collection1",
[junit4:junit4]   2> 	  "node_name":"127.0.0.1:49949_solr",
[junit4:junit4]   2> 	  "base_url":"http://127.0.0.1:49949/solr"}
[junit4:junit4]   2> 11623 T765 oascc.ZkStateReader$2.process A cluster state change has occurred - updating... (5)
[junit4:junit4]   2> 11624 T782 oascc.ZkStateReader$2.process A cluster state change has occurred - updating... (5)
[junit4:junit4]   2> 11624 T797 oascc.ZkStateReader$2.process A cluster state change has occurred - updating... (5)
[junit4:junit4]   2> 11624 T831 oascc.ZkStateReader$2.process A cluster state change has occurred - updating... (5)
[junit4:junit4]   2> 11624 T814 oascc.ZkStateReader$2.process A cluster state change has occurred - updating... (5)
[junit4:junit4]   2> 11703 T832 oass.OpenExchangeRatesOrgProvider.init Initialized with rates=open-exchange-rates.json, refreshInterval=1440.
[junit4:junit4]   2> 11715 T832 oass.IndexSchema.readSchema default search field in schema is text
[junit4:junit4]   2> 11720 T832 oass.IndexSchema.readSchema unique key field: id
[junit4:junit4]   2> 11737 T832 oass.FileExchangeRateProvider.reload Reloading exchange rates from file currency.xml
[junit4:junit4]   2> 11749 T832 oass.FileExchangeRateProvider.reload Reloading exchange rates from file currency.xml
[junit4:junit4]   2> 11754 T832 oass.OpenExchangeRatesOrgProvider.reload Reloading exchange rates from open-exchange-rates.json
[junit4:junit4]   2> 11756 T832 oass.OpenExchangeRatesOrgProvider.reload Reloading exchange rates from open-exchange-rates.json
[junit4:junit4]   2> 11757 T832 oasc.SolrCore.<init> [collection1] Opening new SolrCore at C:\Users\JenkinsSlave\workspace\Lucene-Solr-4.x-Windows\solr\build\solr-core\test\J0\.\solrtest-jetty4-1355276556486\collection1\, dataDir=.\org.apache.solr.cloud.SyncSliceTest-1355276546277/jetty4\
[junit4:junit4]   2> 11757 T832 oasc.JmxMonitoredMap.<init> JMX monitoring is enabled. Adding Solr mbeans to JMX Server: com.sun.jmx.mbeanserver.JmxMBeanServer@15c62bc
[junit4:junit4]   2> 11758 T832 oasc.SolrCore.getNewIndexDir New index directory detected: old=null new=.\org.apache.solr.cloud.SyncSliceTest-1355276546277/jetty4\index/
[junit4:junit4]   2> 11759 T832 oasc.SolrCore.initIndex WARNING [collection1] Solr index directory '.\org.apache.solr.cloud.SyncSliceTest-1355276546277\jetty4\index' doesn't exist. Creating new index...
[junit4:junit4]   2> 11759 T832 oasc.CachingDirectoryFactory.get return new directory for C:\Users\JenkinsSlave\workspace\Lucene-Solr-4.x-Windows\solr\build\solr-core\test\J0\.\org.apache.solr.cloud.SyncSliceTest-1355276546277\jetty4\index forceNew:false
[junit4:junit4]   2> 11770 T832 oasc.SolrDeletionPolicy.onCommit SolrDeletionPolicy.onCommit: commits:num=1
[junit4:junit4]   2> 		commit{dir=RateLimitedDirectoryWrapper(org.apache.lucene.store.SimpleFSDirectory@C:\Users\JenkinsSlave\workspace\Lucene-Solr-4.x-Windows\solr\build\solr-core\test\J0\org.apache.solr.cloud.SyncSliceTest-1355276546277\jetty4\index lockFactory=org.apache.lucene.store.NativeFSLockFactory@17a0b28),segFN=segments_1,generation=1,filenames=[segments_1]
[junit4:junit4]   2> 11770 T832 oasc.SolrDeletionPolicy.updateCommits newest commit = 1
[junit4:junit4]   2> 11771 T832 oasc.SolrCore.initWriters created xml: solr.XMLResponseWriter
[junit4:junit4]   2> 11772 T832 oasup.UpdateRequestProcessorChain.init inserting DistributedUpdateProcessorFactory into updateRequestProcessorChain "dedupe"
[junit4:junit4]   2> 11772 T832 oasup.UpdateRequestProcessorChain.init inserting DistributedUpdateProcessorFactory into updateRequestProcessorChain "dedupe-allfields"
[junit4:junit4]   2> 11774 T832 oasup.UpdateRequestProcessorChain.init inserting DistributedUpdateProcessorFactory into updateRequestProcessorChain "stored_sig"
[junit4:junit4]   2> 11774 T832 oasup.UpdateRequestProcessorChain.init inserting DistributedUpdateProcessorFactory into updateRequestProcessorChain "uniq-fields"
[junit4:junit4]   2> 11774 T832 oasup.UpdateRequestProcessorChain.init inserting DistributedUpdateProcessorFactory into updateRequestProcessorChain "distrib-dup-test-chain-implicit"
[junit4:junit4]   2> 11774 T832 oasc.RequestHandlers.initHandlersFromConfig adding lazy requestHandler: solr.ReplicationHandler
[junit4:junit4]   2> 11775 T832 oasc.RequestHandlers.initHandlersFromConfig created /replication: solr.ReplicationHandler
[junit4:junit4]   2> 11776 T832 oasc.RequestHandlers.initHandlersFromConfig created standard: solr.StandardRequestHandler
[junit4:junit4]   2> 11777 T832 oasc.RequestHandlers.initHandlersFromConfig created /get: solr.RealTimeGetHandler
[junit4:junit4]   2> 11779 T832 oasc.RequestHandlers.initHandlersFromConfig created dismax: solr.SearchHandler
[junit4:junit4]   2> 11780 T832 oasc.RequestHandlers.initHandlersFromConfig created mock: org.apache.solr.core.MockQuerySenderListenerReqHandler
[junit4:junit4]   2> 11781 T832 oasc.RequestHandlers.initHandlersFromConfig created /admin/: org.apache.solr.handler.admin.AdminHandlers
[junit4:junit4]   2> 11782 T832 oasc.RequestHandlers.initHandlersFromConfig created defaults: solr.StandardRequestHandler
[junit4:junit4]   2> 11782 T832 oasc.RequestHandlers.initHandlersFromConfig adding lazy requestHandler: solr.StandardRequestHandler
[junit4:junit4]   2> 11782 T832 oasc.RequestHandlers.initHandlersFromConfig created lazy: solr.StandardRequestHandler
[junit4:junit4]   2> 11784 T832 oasc.RequestHandlers.initHandlersFromConfig created /update: solr.UpdateRequestHandler
[junit4:junit4]   2> 11785 T832 oasc.RequestHandlers.initHandlersFromConfig created /terms: org.apache.solr.handler.component.SearchHandler
[junit4:junit4]   2> 11786 T832 oasc.RequestHandlers.initHandlersFromConfig created spellCheckCompRH: org.apache.solr.handler.component.SearchHandler
[junit4:junit4]   2> 11786 T832 oasc.RequestHandlers.initHandlersFromConfig created spellCheckCompRH_Direct: org.apache.solr.handler.component.SearchHandler
[junit4:junit4]   2> 11788 T832 oasc.RequestHandlers.initHandlersFromConfig created spellCheckWithWordbreak: org.apache.solr.handler.component.SearchHandler
[junit4:junit4]   2> 11790 T832 oasc.RequestHandlers.initHandlersFromConfig created spellCheckWithWordbreak_Direct: org.apache.solr.handler.component.SearchHandler
[junit4:junit4]   2> 11791 T832 oasc.RequestHandlers.initHandlersFromConfig created spellCheckCompRH1: org.apache.solr.handler.component.SearchHandler
[junit4:junit4]   2> 11793 T832 oasc.RequestHandlers.initHandlersFromConfig created tvrh: org.apache.solr.handler.component.SearchHandler
[junit4:junit4]   2> 11794 T832 oasc.RequestHandlers.initHandlersFromConfig created /mlt: solr.MoreLikeThisHandler
[junit4:junit4]   2> 11795 T832 oasc.RequestHandlers.initHandlersFromConfig created /debug/dump: solr.DumpRequestHandler
[junit4:junit4]   2> 11804 T832 oashl.XMLLoader.init xsltCacheLifetimeSeconds=60
[junit4:junit4]   2> 11809 T832 oasc.SolrCore.initDeprecatedSupport WARNING solrconfig.xml uses deprecated <admin/gettableFiles>, Please update your config to use the ShowFileRequestHandler.
[junit4:junit4]   2> 11811 T832 oasc.SolrCore.initDeprecatedSupport WARNING adding ShowFileRequestHandler with hidden files: [SCHEMA.XML, OLD_SYNONYMS.TXT, STOPWORDS.TXT, PROTWORDS.TXT, OPEN-EXCHANGE-RATES.JSON, SYNONYMS.TXT, CURRENCY.XML, MAPPING-ISOLATIN1ACCENT.TXT]
[junit4:junit4]   2> 11815 T832 oass.SolrIndexSearcher.<init> Opening Searcher@10878bc main
[junit4:junit4]   2> 11816 T832 oass.SolrIndexSearcher.getIndexDir WARNING WARNING: Directory impl does not support setting indexDir: org.apache.lucene.store.RateLimitedDirectoryWrapper
[junit4:junit4]   2> 11818 T832 oasu.CommitTracker.<init> Hard AutoCommit: disabled
[junit4:junit4]   2> 11818 T832 oasu.CommitTracker.<init> Soft AutoCommit: disabled
[junit4:junit4]   2> 11818 T832 oashc.SpellCheckComponent.inform Initializing spell checkers
[junit4:junit4]   2> 11830 T832 oass.DirectSolrSpellChecker.init init: {name=direct,classname=DirectSolrSpellChecker,field=lowerfilt,minQueryLength=3}
[junit4:junit4]   2> 11900 T834 oasc.SolrCore.registerSearcher [collection1] Registered new searcher Searcher@10878bc main{StandardDirectoryReader(segments_1:1)}
[junit4:junit4]   2> 11911 T832 oasc.ZkController.publish publishing core=collection1 state=down
[junit4:junit4]   2> 11911 T832 oasc.ZkController.publish numShards not found on descriptor - reading it from system property
[junit4:junit4]   2> 12126 T766 oascc.ZkStateReader.updateClusterState Updating cloud state from ZooKeeper... 
[junit4:junit4]   2> 12127 T766 oasc.Overseer$ClusterStateUpdater.updateState Update state numShards=1 message={
[junit4:junit4]   2> 	  "operation":"state",
[junit4:junit4]   2> 	  "numShards":"1",
[junit4:junit4]   2> 	  "shard":null,
[junit4:junit4]   2> 	  "roles":null,
[junit4:junit4]   2> 	  "state":"down",
[junit4:junit4]   2> 	  "core":"collection1",
[junit4:junit4]   2> 	  "collection":"collection1",
[junit4:junit4]   2> 	  "node_name":"127.0.0.1:49970_solr",
[junit4:junit4]   2> 	  "base_url":"http://127.0.0.1:49970/solr"}
[junit4:junit4]   2> 12127 T766 oasc.Overseer$ClusterStateUpdater.updateState Collection already exists with numShards=1
[junit4:junit4]   2> 12127 T766 oasc.Overseer$ClusterStateUpdater.updateState Assigning new node to shard shard=shard1
[junit4:junit4]   2> 12135 T765 oascc.ZkStateReader$2.process A cluster state change has occurred - updating... (5)
[junit4:junit4]   2> 12135 T782 oascc.ZkStateReader$2.process A cluster state change has occurred - updating... (5)
[junit4:junit4]   2> 12135 T797 oascc.ZkStateReader$2.process A cluster state change has occurred - updating... (5)
[junit4:junit4]   2> 12135 T831 oascc.ZkStateReader$2.process A cluster state change has occurred - updating... (5)
[junit4:junit4]   2> 12135 T814 oascc.ZkStateReader$2.process A cluster state change has occurred - updating... (5)
[junit4:junit4]   2> 12411 T832 oasc.CoreContainer.register registering core: collection1
[junit4:junit4]   2> 12411 T832 oasc.ZkController.register Register shard - core:collection1 address:http://127.0.0.1:49970/solr shardId:shard1
[junit4:junit4]   2> 12419 T832 oasc.ZkController.register We are http://127.0.0.1:49970/solr/collection1/ and leader is http://127.0.0.1:49940/solr/collection1/
[junit4:junit4]   2> 12419 T832 oasc.ZkController.register No LogReplay needed for core=collection1 baseURL=http://127.0.0.1:49970/solr
[junit4:junit4]   2> 12420 T832 oasc.ZkController.checkRecovery Core needs to recover:collection1
[junit4:junit4]   2> 12420 T832 oasu.DefaultSolrCoreState.doRecovery Running recovery - first canceling any ongoing recovery
[junit4:junit4]   2> ASYNC  NEW_CORE C21 name=collection1 org.apache.solr.core.SolrCore@1bb65ee url=http://127.0.0.1:49970/solr/collection1 node=127.0.0.1:49970_solr
[junit4:junit4]   2> 12421 T835 C21 P49970 oasc.RecoveryStrategy.run Starting recovery process.  core=collection1 recoveringAfterStartup=true
[junit4:junit4]   2> 12423 T835 C21 P49970 oasc.RecoveryStrategy.doRecovery ###### startupVersions=[]
[junit4:junit4]   2> 12424 T835 C21 P49970 oasc.ZkController.publish publishing core=collection1 state=recovering
[junit4:junit4]   2> 12424 T832 oascc.ZkStateReader.updateClusterState Updating cloud state from ZooKeeper... 
[junit4:junit4]   2> 12424 T835 C21 P49970 oasc.ZkController.publish numShards not found on descriptor - reading it from system property
[junit4:junit4]   2> 12426 T743 oass.SolrDispatchFilter.init user.dir=C:\Users\JenkinsSlave\workspace\Lucene-Solr-4.x-Windows\solr\build\solr-core\test\J0
[junit4:junit4]   2> 12427 T743 oass.SolrDispatchFilter.init SolrDispatchFilter.init() done
[junit4:junit4]   2> 12428 T835 C21 P49970 oasc.RecoveryStrategy.doRecovery Attempting to PeerSync from http://127.0.0.1:49940/solr/collection1/ core=collection1 - recoveringAfterStartup=true
[junit4:junit4]   2> 12429 T835 C21 P49970 oasu.PeerSync.sync PeerSync: core=collection1 url=http://127.0.0.1:49970/solr START replicas=[http://127.0.0.1:49940/solr/collection1/] nUpdates=100
[junit4:junit4]   2> 12429 T743 oascsi.HttpClientUtil.createClient Creating new http client, config:maxConnections=128&maxConnectionsPerHost=32&followRedirects=false
[junit4:junit4]   2> 12430 T835 C21 P49970 oasu.PeerSync.sync WARNING no frame of reference to tell of we've missed updates
[junit4:junit4]   2> 12430 T835 C21 P49970 oasc.RecoveryStrategy.doRecovery PeerSync Recovery was not successful - trying replication. core=collection1
[junit4:junit4]   2> 12430 T835 C21 P49970 oasc.RecoveryStrategy.doRecovery Starting Replication Recovery. core=collection1
[junit4:junit4]   2> 12431 T835 C21 P49970 oascsi.HttpClientUtil.createClient Creating new http client, config:maxConnections=128&maxConnectionsPerHost=32&followRedirects=false
[junit4:junit4]   2> 12434 T777 C19 P49940 REQ /get {distrib=false&qt=/get&wt=javabin&version=2&getVersions=100} status=0 QTime=0 
[junit4:junit4]   2> 12451 T743 oaz.ZooKeeper.<init> Initiating client connection, connectString=127.0.0.1:49924/solr sessionTimeout=10000 watcher=org.apache.solr.common.cloud.ConnectionManager@1ac7d31
[junit4:junit4]   2> 12453 T743 oascc.ConnectionManager.waitForConnected Waiting for client to connect to ZooKeeper
[junit4:junit4]   2> 12453 T837 oaz.ClientCnxn$SendThread.logStartConnect Opening socket connection to server 127.0.0.1/127.0.0.1:49924. Will not attempt to authenticate using SASL (access denied (javax.security.auth.AuthPermission getLoginConfiguration))
[junit4:junit4]   2> 12454 T837 oaz.ClientCnxn$SendThread.primeConnection Socket connection established to 127.0.0.1/127.0.0.1:49924, initiating session
[junit4:junit4]   2> 12454 T745 oazs.NIOServerCnxnFactory.run Accepted socket connection from /127.0.0.1:49984
[junit4:junit4]   2> 12454 T745 oazs.ZooKeeperServer.processConnectRequest Client attempting to establish new session at /127.0.0.1:49984
[junit4:junit4]   2> 12456 T747 oazs.ZooKeeperServer.finishSessionInit Established session 0x13b8cc6f0f8000c with negotiated timeout 10000 for client /127.0.0.1:49984
[junit4:junit4]   2> 12456 T837 oaz.ClientCnxn$SendThread.onConnected Session establishment complete on server 127.0.0.1/127.0.0.1:49924, sessionid = 0x13b8cc6f0f8000c, negotiated timeout = 10000
[junit4:junit4]   2> 12456 T838 oascc.ConnectionManager.process Watcher org.apache.solr.common.cloud.ConnectionManager@1ac7d31 name:ZooKeeperConnection Watcher:127.0.0.1:49924/solr got event WatchedEvent state:SyncConnected type:None path:null path:null type:None
[junit4:junit4]   2> 12457 T743 oascc.ConnectionManager.waitForConnected Client is connected to ZooKeeper
[junit4:junit4]   2> 12457 T743 oascc.ZkStateReader.createClusterStateWatchersAndUpdate Updating cluster state from ZooKeeper... 
[junit4:junit4]   2> 12459 T743 oasc.ChaosMonkey.monkeyLog monkey: init - expire sessions:true cause connection loss:true
[junit4:junit4]   2> 12460 T743 oascsi.HttpClientUtil.createClient Creating new http client, config:
[junit4:junit4]   2> 12465 T743 oascc.ZkStateReader.updateClusterState Updating cloud state from ZooKeeper... 
[junit4:junit4]   2> 12466 T743 oasc.AbstractFullDistribZkTestBase.waitForThingsToLevelOut Wait for recoveries to finish - wait 15 for each attempt
[junit4:junit4]   2> 12467 T743 oasc.AbstractDistribZkTestBase.waitForRecoveriesToFinish Wait for recoveries to finish - collection: collection1 failOnTimeout:true timeout (sec):15
[junit4:junit4]   2> 12468 T743 oascc.ZkStateReader.updateClusterState Updating cloud state from ZooKeeper... 
[junit4:junit4]   2> 12641 T766 oascc.ZkStateReader.updateClusterState Updating cloud state from ZooKeeper... 
[junit4:junit4]   2> 12643 T766 oasc.Overseer$ClusterStateUpdater.updateState Update state numShards=1 message={
[junit4:junit4]   2> 	  "operation":"state",
[junit4:junit4]   2> 	  "numShards":"1",
[junit4:junit4]   2> 	  "shard":"shard1",
[junit4:junit4]   2> 	  "roles":null,
[junit4:junit4]   2> 	  "state":"recovering",
[junit4:junit4]   2> 	  "core":"collection1",
[junit4:junit4]   2> 	  "collection":"collection1",
[junit4:junit4]   2> 	  "node_name":"127.0.0.1:49970_solr",
[junit4:junit4]   2> 	  "base_url":"http://127.0.0.1:49970/solr"}
[junit4:junit4]   2> 12655 T838 oascc.ZkStateReader$2.process A cluster state change has occurred - updating... (5)
[junit4:junit4]   2> 12656 T782 oascc.ZkStateReader$2.process A cluster state change has occurred - updating... (5)
[junit4:junit4]   2> 12657 T814 oascc.ZkStateReader$2.process A cluster state change has occurred - updating... (5)
[junit4:junit4]   2> 12659 T765 oascc.ZkStateReader$2.process A cluster state change has occurred - updating... (5)
[junit4:junit4]   2> 12660 T831 oascc.ZkStateReader$2.process A cluster state change has occurred - updating... (5)
[junit4:junit4]   2> 12660 T797 oascc.ZkStateReader$2.process A cluster state change has occurred - updating... (5)
[junit4:junit4]   2>  C20_STATE=coll:collection1 core:collection1 props:{shard=shard1, roles=null, state=recovering, core=collection1, collection=collection1, node_name=127.0.0.1:49960_solr, base_url=http://127.0.0.1:49960/solr}
[junit4:junit4]   2> 13200 T817 C20 P49960 oasc.RecoveryStrategy.doRecovery Begin buffering updates. core=collection1
[junit4:junit4]   2> 13200 T817 C20 P49960 oasu.UpdateLog.bufferUpdates Starting to buffer updates. FSUpdateLog{state=ACTIVE, tlog=null}
[junit4:junit4]   2> 13201 T817 C20 P49960 oasc.RecoveryStrategy.replicate Attempting to replicate from http://127.0.0.1:49940/solr/collection1/. core=collection1
[junit4:junit4]   2> 13201 T817 C20 P49960 oascsi.HttpClientUtil.createClient Creating new http client, config:maxConnections=128&maxConnectionsPerHost=32&followRedirects=false
[junit4:junit4]   2> 13211 T776 C19 P49940 oasu.DirectUpdateHandler2.commit start commit{flags=0,_version_=0,optimize=false,openSearcher=false,waitSearcher=true,expungeDeletes=false,softCommit=false}
[junit4:junit4]   2> 13217 T776 C19 P49940 oasc.SolrDeletionPolicy.onCommit SolrDeletionPolicy.onCommit: commits:num=2
[junit4:junit4]   2> 		commit{dir=RateLimitedDirectoryWrapper(org.apache.lucene.store.SimpleFSDirectory@C:\Users\JenkinsSlave\workspace\Lucene-Solr-4.x-Windows\solr\build\solr-core\test\J0\org.apache.solr.cloud.SyncSliceTest-1355276546277\jetty1\index lockFactory=org.apache.lucene.store.NativeFSLockFactory@15731d6),segFN=segments_2,generation=2,filenames=[segments_2]
[junit4:junit4]   2> 		commit{dir=RateLimitedDirectoryWrapper(org.apache.lucene.store.SimpleFSDirectory@C:\Users\JenkinsSlave\workspace\Lucene-Solr-4.x-Windows\solr\build\solr-core\test\J0\org.apache.solr.cloud.SyncSliceTest-1355276546277\jetty1\index lockFactory=org.apache.lucene.store.NativeFSLockFactory@15731d6),segFN=segments_3,generation=3,filenames=[segments_3]
[junit4:junit4]   2> 13217 T776 C19 P49940 oasc.SolrDeletionPolicy.updateCommits newest commit = 3
[junit4:junit4]   2> 13220 T776 C19 P49940 oasu.DirectUpdateHandler2.commit end_commit_flush
[junit4:junit4]   2> 13220 T776 C19 P49940 /update {waitSearcher=true&openSearcher=false&commit=true&commit_end_point=true&wt=javabin&softCommit=false&version=2} {commit=} 0 10
[junit4:junit4]   2> 13221 T817 C20 P49960 oash.ReplicationHandler.inform Commits will be reserved for  10000
[junit4:junit4]   2> 13222 T817 C20 P49960 oash.SnapPuller.<init>  No value set for 'pollInterval'. Timer Task not started.
[junit4:junit4]   2> 13225 T775 C19 P49940 REQ /replication {command=indexversion&wt=javabin&qt=/replication&version=2} status=0 QTime=0 
[junit4:junit4]   2> 13226 T817 C20 P49960 oash.SnapPuller.fetchLatestIndex Master's generation: 3
[junit4:junit4]   2> 13226 T817 C20 P49960 oash.SnapPuller.fetchLatestIndex Slave's generation: 1
[junit4:junit4]   2> 13226 T817 C20 P49960 oash.SnapPuller.fetchLatestIndex Starting replication process
[junit4:junit4]   2> 13229 T777 C19 P49940 REQ /replication {command=filelist&generation=3&wt=javabin&qt=/replication&version=2} status=0 QTime=1 
[junit4:junit4]   2> 13230 T817 C20 P49960 oash.SnapPuller.fetchLatestIndex Number of files in latest index in master: 1
[junit4:junit4]   2> 13232 T817 C20 P49960 oash.SnapPuller.fetchLatestIndex Starting download to .\org.apache.solr.cloud.SyncSliceTest-1355276546277\jetty3\index.20121212024239503 fullCopy=true
[junit4:junit4]   2> 13237 T774 C19 P49940 REQ /replication {file=segments_3&command=filecontent&checksum=true&generation=3&qt=/replication&wt=filestream} status=0 QTime=0 
[junit4:junit4]   2> 13238 T817 C20 P49960 oash.SnapPuller.fetchLatestIndex Total time taken for download : 0 secs
[junit4:junit4]   2> 13240 T817 C20 P49960 oash.SnapPuller.modifyIndexProps New index installed. Updating index properties... index=index.20121212024239503
[junit4:junit4]   2> 13241 T817 C20 P49960 oasc.SolrCore.getNewIndexDir New index directory detected: old=.\org.apache.solr.cloud.SyncSliceTest-1355276546277/jetty3\index/ new=.\org.apache.solr.cloud.SyncSliceTest-1355276546277/jetty3\index.20121212024239503
[junit4:junit4]   2> 13241 T817 C20 P49960 oasc.CachingDirectoryFactory.get return new directory for C:\Users\JenkinsSlave\workspace\Lucene-Solr-4.x-Windows\solr\build\solr-core\test\J0\.\org.apache.solr.cloud.SyncSliceTest-1355276546277\jetty3\index.20121212024239503 forceNew:false
[junit4:junit4]   2> 13244 T817 C20 P49960 oasc.SolrDeletionPolicy.onInit SolrDeletionPolicy.onInit: commits:num=1
[junit4:junit4]   2> 		commit{dir=RateLimitedDirectoryWrapper(org.apache.lucene.store.SimpleFSDirectory@C:\Users\JenkinsSlave\workspace\Lucene-Solr-4.x-Windows\solr\build\solr-core\test\J0\org.apache.solr.cloud.SyncSliceTest-1355276546277\jetty3\index.20121212024239503 lockFactory=org.apache.lucene.store.NativeFSLockFactory@aaabfc),segFN=segments_3,generation=3,filenames=[segments_3]
[junit4:junit4]   2> 13245 T817 C20 P49960 oasc.SolrDeletionPolicy.updateCommits newest commit = 3
[junit4:junit4]   2> 13247 T817 C20 P49960 oasu.DefaultSolrCoreState.newIndexWriter Creating new IndexWriter...
[junit4:junit4]   2> 13247 T817 C20 P49960 oasu.DefaultSolrCoreState.newIndexWriter Waiting until IndexWriter is unused... core=collection1
[junit4:junit4]   2> 13247 T817 C20 P49960 oasu.DefaultSolrCoreState.newIndexWriter Rollback old IndexWriter... core=collection1
[junit4:junit4]   2> 13248 T817 C20 P49960 oasc.CachingDirectoryFactory.close Closing directory:C:\Users\JenkinsSlave\workspace\Lucene-Solr-4.x-Windows\solr\build\solr-core\test\J0\.\org.apache.solr.cloud.SyncSliceTest-1355276546277\jetty3\index.20121212024239503
[junit4:junit4]   2> 13249 T817 C20 P49960 oash.SnapPuller$2.onClose removing old index directory .\org.apache.solr.cloud.SyncSliceTest-1355276546277\jetty3\index
[junit4:junit4]   2> 13255 T817 C20 P49960 oasc.CachingDirectoryFactory.get return new directory for C:\Users\JenkinsSlave\workspace\Lucene-Solr-4.x-Windows\solr\build\solr-core\test\J0\.\org.apache.solr.cloud.SyncSliceTest-1355276546277\jetty3\index.20121212024239503 forceNew:true
[junit4:junit4]   2> 13258 T817 C20 P49960 oasc.SolrDeletionPolicy.onInit SolrDeletionPolicy.onInit: commits:num=1
[junit4:junit4]   2> 		commit{dir=RateLimitedDirectoryWrapper(org.apache.lucene.store.SimpleFSDirectory@C:\Users\JenkinsSlave\workspace\Lucene-Solr-4.x-Windows\solr\build\solr-core\test\J0\org.apache.solr.cloud.SyncSliceTest-1355276546277\jetty3\index.20121212024239503 lockFactory=org.apache.lucene.store.NativeFSLockFactory@8a408d),segFN=segments_3,generation=3,filenames=[segments_3]
[junit4:junit4]   2> 13258 T817 C20 P49960 oasc.SolrDeletionPolicy.updateCommits newest commit = 3
[junit4:junit4]   2> 13259 T817 C20 P49960 oasu.DefaultSolrCoreState.newIndexWriter New IndexWriter is ready to be used.
[junit4:junit4]   2> 13259 T817 C20 P49960 oass.SolrIndexSearcher.<init> Opening Searcher@12203aa main
[junit4:junit4]   2> 13260 T817 C20 P49960 oass.SolrIndexSearcher.getIndexDir WARNING WARNING: Directory impl does not support setting indexDir: org.apache.lucene.store.RateLimitedDirectoryWrapper
[junit4:junit4]   2> 13262 T816 oasc.SolrCore.registerSearcher [collection1] Registered new searcher Searcher@12203aa main{StandardDirectoryReader(segments_3:1:nrt)}
[junit4:junit4]   2> 13262 T817 C20 P49960 oasu.DirectUpdateHandler2.commit start commit{flags=0,_version_=0,optimize=false,openSearcher=false,waitSearcher=false,expungeDeletes=false,softCommit=false}
[junit4:junit4]   2> 13267 T817 C20 P49960 oasc.SolrDeletionPolicy.onCommit SolrDeletionPolicy.onCommit: commits:num=2
[junit4:junit4]   2> 		commit{dir=RateLimitedDirectoryWrapper(org.apache.lucene.store.SimpleFSDirectory@C:\Users\JenkinsSlave\workspace\Lucene-Solr-4.x-Windows\solr\build\solr-core\test\J0\org.apache.solr.cloud.SyncSliceTest-1355276546277\jetty3\index.20121212024239503 lockFactory=org.apache.lucene.store.NativeFSLockFactory@8a408d),segFN=segments_3,generation=3,filenames=[segments_3]
[junit4:junit4]   2> 		commit{dir=RateLimitedDirectoryWrapper(org.apache.lucene.store.SimpleFSDirectory@C:\Users\JenkinsSlave\workspace\Lucene-Solr-4.x-Windows\solr\build\solr-core\test\J0\org.apache.solr.cloud.SyncSliceTest-1355276546277\jetty3\index.20121212024239503 lockFactory=org.apache.lucene.store.NativeFSLockFactory@8a408d),segFN=segments_4,generation=4,filenames=[segments_4]
[junit4:junit4]   2> 13268 T817 C20 P49960 oasc.SolrDeletionPolicy.updateCommits newest commit = 4
[junit4:junit4]   2> 13270 T817 C20 P49960 oasu.DirectUpdateHandler2.commit end_commit_flush
[junit4:junit4]   2> 13270 T817 C20 P49960 oasc.RecoveryStrategy.replay No replay needed. core=collection1
[junit4:junit4]   2> 13270 T817 C20 P49960 oasc.RecoveryStrategy.doRecovery Replication Recovery was successful - registering as Active. core=collection1
[junit4:junit4]   2> 13271 T817 C20 P49960 oasc.ZkController.publish publishing core=collection1 state=active
[junit4:junit4]   2> 13271 T817 C20 P49960 oasc.ZkController.publish numShards not found on descriptor - reading it from system property
[junit4:junit4]   2> 13272 T817 C20 P49960 oasc.RecoveryStrategy.doRecovery Finished recovery process. core=collection1
[junit4:junit4]   2> 13459 T743 oascc.ZkStateReader.updateClusterState Updating cloud state from ZooKeeper... 
[junit4:junit4]   2> 13661 T766 oascc.ZkStateReader.updateClusterState Updating cloud state from ZooKeeper... 
[junit4:junit4]   2> 13664 T766 oasc.Overseer$ClusterStateUpdater.updateState Update state numShards=1 message={
[junit4:junit4]   2> 	  "operation":"state",
[junit4:junit4]   2> 	  "numShards":"1",
[junit4:junit4]   2> 	  "shard":"shard1",
[junit4:junit4]   2> 	  "roles":null,
[junit4:junit4]   2> 	  "state":"active",
[junit4:junit4]   2> 	  "core":"collection1",
[junit4:junit4]   2> 	  "collection":"collection1",
[junit4:junit4]   2> 	  "node_name":"127.0.0.1:49960_solr",
[junit4:junit4]   2> 	  "base_url":"http://127.0.0.1:49960/solr"}
[junit4:junit4]   2> 13672 T765 oascc.ZkStateReader$2.process A cluster state change has occurred - updating... (5)
[junit4:junit4]   2> 13672 T838 oascc.ZkStateReader$2.process A cluster state change has occurred - updating... (5)
[junit4:junit4]   2> 13672 T797 oascc.ZkStateReader$2.process A cluster state change has occurred - updating... (5)
[junit4:junit4]   2> 13672 T782 oascc.ZkStateReader$2.process A cluster state change has occurred - updating... (5)
[junit4:junit4]   2> 13673 T831 oascc.ZkStateReader$2.process A cluster state change has occurred - updating... (5)
[junit4:junit4]   2> 13673 T814 oascc.ZkStateReader$2.process A cluster state change has occurred - updating... (5)
[junit4:junit4]   2> 14451 T743 oascc.ZkStateReader.updateClusterState Updating cloud state from ZooKeeper... 
[junit4:junit4]   2>  C21_STATE=coll:collection1 core:collection1 props:{shard=shard1, roles=null, state=recovering, core=collection1, collection=collection1, node_name=127.0.0.1:49970_solr, base_url=http://127.0.0.1:49970/solr}
[junit4:junit4]   2> 15419 T835 C21 P49970 oasc.RecoveryStrategy.doRecovery Begin buffering updates. core=collection1
[junit4:junit4]   2> 15419 T835 C21 P49970 oasu.UpdateLog.bufferUpdates Starting to buffer updates. FSUpdateLog{state=ACTIVE, tlog=null}
[junit4:junit4]   2> 15420 T835 C21 P49970 oasc.RecoveryStrategy.replicate Attempting to replicate from http://127.0.0.1:49940/solr/collection1/. core=collection1
[junit4:junit4]   2> 15420 T835 C21 P49970 oascsi.HttpClientUtil.createClient Creating new http client, config:maxConnections=128&maxConnectionsPerHost=32&followRedirects=false
[junit4:junit4]   2> 15441 T773 C19 P49940 oasu.DirectUpdateHandler2.commit start commit{flags=0,_version_=0,optimize=false,openSearcher=false,waitSearcher=true,expungeDeletes=false,softCommit=false}
[junit4:junit4]   2> 15445 T743 oascc.ZkStateReader.updateClusterState Updating cloud state from ZooKeeper... 
[junit4:junit4]   2> 15457 T773 C19 P49940 oasc.SolrDeletionPolicy.onCommit SolrDeletionPolicy.onCommit: commits:num=3
[junit4:junit4]   2> 		commit{dir=RateLimitedDirectoryWrapper(org.apache.lucene.store.SimpleFSDirectory@C:\Users\JenkinsSlave\workspace\Lucene-Solr-4.x-Windows\solr\build\solr-core\test\J0\org.apache.solr.cloud.SyncSliceTest-1355276546277\jetty1\index lockFactory=org.apache.lucene.store.NativeFSLockFactory@15731d6),segFN=segments_2,generation=2,filenames=[segments_2]
[junit4:junit4]   2> 		commit{dir=RateLimitedDirectoryWrapper(org.apache.lucene.store.SimpleFSDirectory@C:\Users\JenkinsSlave\workspace\Lucene-Solr-4.x-Windows\solr\build\solr-core\test\J0\org.apache.solr.cloud.SyncSliceTest-1355276546277\jetty1\index lockFactory=org.apache.lucene.store.NativeFSLockFactory@15731d6),segFN=segments_3,generation=3,filenames=[segments_3]
[junit4:junit4]   2> 		commit{dir=RateLimitedDirectoryWrapper(org.apache.lucene.store.SimpleFSDirectory@C:\Users\JenkinsSlave\workspace\Lucene-Solr-4.x-Windows\solr\build\solr-core\test\J0\org.apache.solr.cloud.SyncSliceTest-1355276546277\jetty1\index lockFactory=org.apache.lucene.store.NativeFSLockFactory@15731d6),segFN=segments_4,generation=4,filenames=[segments_4]
[junit4:junit4]   2> 15458 T773 C19 P49940 oasc.SolrDeletionPolicy.updateCommits newest commit = 4
[junit4:junit4]   2> 15460 T773 C19 P49940 oasu.DirectUpdateHandler2.commit end_commit_flush
[junit4:junit4]   2> 15461 T773 C19 P49940 /update {waitSearcher=true&openSearcher=false&commit=true&commit_end_point=true&wt=javabin&softCommit=false&version=2} {commit=} 0 20
[junit4:junit4]   2> 15462 T835 C21 P49970 oash.ReplicationHandler.inform Commits will be reserved for  10000
[junit4:junit4]   2> 15463 T835 C21 P49970 oash.SnapPuller.<init>  No value set for 'pollInterval'. Timer Task not started.
[junit4:junit4]   2> 15465 T776 C19 P49940 REQ /replication {command=indexversion&wt=javabin&qt=/replication&version=2} status=0 QTime=0 
[junit4:junit4]   2> 15466 T835 C21 P49970 oash.SnapPuller.fetchLatestIndex Master's generation: 4
[junit4:junit4]   2> 15466 T835 C21 P49970 oash.SnapPuller.fetchLatestIndex Slave's generation: 1
[junit4:junit4]   2> 15466 T835 C21 P49970 oash.SnapPuller.fetchLatestIndex Starting replication process
[junit4:junit4]   2> 15469 T775 C19 P49940 REQ /replication {command=filelist&generation=4&wt=javabin&qt=/replication&version=2} status=0 QTime=1 
[junit4:junit4]   2> 15470 T835 C21 P49970 oash.SnapPuller.fetchLatestIndex Number of files in latest index in master: 1
[junit4:junit4]   2> 15471 T835 C21 P49970 oash.SnapPuller.fetchLatestIndex Starting download to .\org.apache.solr.cloud.SyncSliceTest-1355276546277\jetty4\index.20121212024241743 fullCopy=true
[junit4:junit4]   2> 15476 T777 C19 P49940 REQ /replication {file=segments_4&command=filecontent&checksum=true&generation=4&qt=/replication&wt=filestream} status=0 QTime=0 
[junit4:junit4]   2> 15478 T835 C21 P49970 oash.SnapPuller.fetchLatestIndex Total time taken for download : 0 secs
[junit4:junit4]   2> 15481 T835 C21 P49970 oash.SnapPuller.modifyIndexProps New index installed. Updating index properties... index=index.20121212024241743
[junit4:junit4]   2> 15481 T835 C21 P49970 oasc.SolrCore.getNewIndexDir New index directory detected: old=.\org.apache.solr.cloud.SyncSliceTest-1355276546277/jetty4\index/ new=.\org.apache.solr.cloud.SyncSliceTest-1355276546277/jetty4\index.20121212024241743
[junit4:junit4]   2> 15482 T835 C21 P49970 oasc.CachingDirectoryFactory.get return new directory for C:\Users\JenkinsSlave\workspace\Lucene-Solr-4.x-Windows\solr\build\solr-core\test\J0\.\org.apache.solr.cloud.SyncSliceTest-1355276546277\jetty4\index.20121212024241743 forceNew:false
[junit4:junit4]   2> 15484 T835 C21 P49970 oasc.SolrDeletionPolicy.onInit SolrDeletionPolicy.onInit: commits:num=1
[junit4:junit4]   2> 		commit{dir=RateLimitedDirectoryWrapper(org.apache.lucene.store.SimpleFSDirectory@C:\Users\JenkinsSlave\workspace\Lucene-Solr-4.x-Windows\solr\build\solr-core\test\J0\org.apache.solr.cloud.SyncSliceTest-1355276546277\jetty4\index.20121212024241743 lockFactory=org.apache.lucene.store.NativeFSLockFactory@da6874),segFN=segments_4,generation=4,filenames=[segments_4]
[junit4:junit4]   2> 15485 T835 C21 P49970 oasc.SolrDeletionPolicy.updateCommits newest commit = 4
[junit4:junit4]   2> 15487 T835 C21 P49970 oasu.DefaultSolrCoreState.newIndexWriter Creating new IndexWriter...
[junit4:junit4]   2> 15487 T835 C21 P49970 oasu.DefaultSolrCoreState.newIndexWriter Waiting until IndexWriter is unused... core=collection1
[junit4:junit4]   2> 15487 T835 C21 P49970 oasu.DefaultSolrCoreState.newIndexWriter Rollback old IndexWriter... core=collection1
[junit4:junit4]   2> 15489 T835 C21 P49970 oasc.CachingDirectoryFactory.close Closing directory:C:\Users\JenkinsSlave\workspace\Lucene-Solr-4.x-Windows\solr\build\solr-core\test\J0\.\org.apache.solr.cloud.SyncSliceTest-1355276546277\jetty4\index.20121212024241743
[junit4:junit4]   2> 15489 T835 C21 P49970 oash.SnapPuller$2.onClose removing old index directory .\org.apache.solr.cloud.SyncSliceTest-1355276546277\jetty4\index
[junit4:junit4]   2> 15494 T835 C21 P49970 oasc.CachingDirectoryFactory.get return new directory for C:\Users\JenkinsSlave\workspace\Lucene-Solr-4.x-Windows\solr\build\solr-core\test\J0\.\org.apache.solr.cloud.SyncSliceTest-1355276546277\jetty4\index.20121212024241743 forceNew:true
[junit4:junit4]   2> 15498 T835 C21 P49970 oasc.SolrDeletionPolicy.onInit SolrDeletionPolicy.onInit: commits:num=1
[junit4:junit4]   2> 		commit{dir=RateLimitedDirectoryWrapper(org.apache.lucene.store.SimpleFSDirectory@C:\Users\JenkinsSlave\workspace\Lucene-Solr-4.x-Windows\solr\build\solr-core\test\J0\org.apache.solr.cloud.SyncSliceTest-1355276546277\jetty4\index.20121212024241743 lockFactory=org.apache.lucene.store.NativeFSLockFactory@1fe3515),segFN=segments_4,generation=4,filenames=[segments_4]
[junit4:junit4]   2> 15498 T835 C21 P49970 oasc.SolrDeletionPolicy.updateCommits newest commit = 4
[junit4:junit4]   2> 15499 T835 C21 P49970 oasu.DefaultSolrCoreState.newIndexWriter New IndexWriter is ready to be used.
[junit4:junit4]   2> 15499 T835 C21 P49970 oass.SolrIndexSearcher.<init> Opening Searcher@e417e7 main
[junit4:junit4]   2> 15500 T835 C21 P49970 oass.SolrIndexSearcher.getIndexDir WARNING WARNING: Directory impl does not support setting indexDir: org.apache.lucene.store.RateLimitedDirectoryWrapper
[junit4:junit4]   2> 15502 T834 oasc.SolrCore.registerSearcher [collection1] Registered new searcher Searcher@e417e7 main{StandardDirectoryReader(segments_4:1:nrt)}
[junit4:junit4]   2> 15503 T835 C21 P49970 oasu.DirectUpdateHandler2.commit start commit{flags=0,_version_=0,optimize=false,openSearcher=false,waitSearcher=false,expungeDeletes=false,softCommit=false}
[junit4:junit4]   2> 15507 T835 C21 P49970 oasc.SolrDeletionPolicy.onCommit SolrDeletionPolicy.onCommit: commits:num=2
[junit4:junit4]   2> 		commit{dir=RateLimitedDirectoryWrapper(org.apache.lucene.store.SimpleFSDirectory@C:\Users\JenkinsSlave\workspace\Lucene-Solr-4.x-Windows\solr\build\solr-core\test\J0\org.apache.solr.cloud.SyncSliceTest-1355276546277\jetty4\index.20121212024241743 lockFactory=org.apache.lucene.store.NativeFSLockFactory@1fe3515),segFN=segments_4,generation=4,filenames=[segments_4]
[junit4:junit4]   2> 		commit{dir=RateLimitedDirectoryWrapper(org.apache.lucene.store.SimpleFSDirectory@C:\Users\JenkinsSlave\workspace\Lucene-Solr-4.x-Windows\solr\build\solr-core\test\J0\org.apache.solr.cloud.SyncSliceTest-1355276546277\jetty4\index.20121212024241743 lockFactory=org.apache.lucene.store.NativeFSLockFactory@1fe3515),segFN=segments_5,generation=5,filenames=[segments_5]
[junit4:junit4]   2> 15507 T835 C21 P49970 oasc.SolrDeletionPolicy.updateCommits newest commit = 5
[junit4:junit4]   2> 15509 T835 C21 P49970 oasu.DirectUpdateHandler2.commit end_commit_flush
[junit4:junit4]   2> 15509 T835 C21 P49970 oasc.RecoveryStrategy.replay No replay needed. core=collection1
[junit4:junit4]   2> 15509 T835 C21 P49970 oasc.RecoveryStrategy.doRecovery Replication Recovery was successful - registering as Active. core=collection1
[junit4:junit4]   2> 15509 T835 C21 P49970 oasc.ZkController.publish publishing core=collection1 state=active
[junit4:junit4]   2> 15509 T835 C21 P49970 oasc.ZkController.publish numShards not found on descriptor - reading it from system property
[junit4:junit4]   2> 15512 T835 C21 P49970 oasc.RecoveryStrategy.doRecovery Finished recovery process. core=collection1
[junit4:junit4]   2> 15669 T766 oascc.ZkStateReader.updateClusterState Updating cloud state from ZooKeeper... 
[junit4:junit4]   2> 15670 T766 oasc.Overseer$ClusterStateUpdater.updateState Update state numShards=1 message={
[junit4:junit4]   2> 	  "operation":"state",
[junit4:junit4]   2> 	  "numShards":"1",
[junit4:junit4]   2> 	  "shard":"shard1",
[junit4:junit4]   2> 	  "roles":null,
[junit4:junit4]   2> 	  "state":"active",
[junit4:junit4]   2> 	  "core":"collection1",
[junit4:junit4]   2> 	  "collection":"collection1",
[junit4:junit4]   2> 	  "node_name":"127.0.0.1:49970_solr",
[junit4:junit4]   2> 	  "base_url":"http://127.0.0.1:49970/solr"}
[junit4:junit4]   2> 15681 T765 oascc.ZkStateReader$2.process A cluster state change has occurred - updating... (5)
[junit4:junit4]   2> 15681 T831 oascc.ZkStateReader$2.process A cluster state change has occurred - updating... (5)
[junit4:junit4]   2> 15682 T782 oascc.ZkStateReader$2.process A cluster state change has occurred - updating... (5)
[junit4:junit4]   2> 15683 T814 oascc.ZkStateReader$2.process A cluster state change has occurred - updating... (5)
[junit4:junit4]   2> 15681 T838 oascc.ZkStateReader$2.process A cluster state change has occurred - updating... (5)
[junit4:junit4]   2> 15683 T797 oascc.ZkStateReader$2.process A cluster state change has occurred - updating... (5)
[junit4:junit4]   2> 16437 T743 oascc.ZkStateReader.updateClusterState Updating cloud state from ZooKeeper... 
[junit4:junit4]   2> ASYNC  NEW_CORE C22 name=collection1 org.apache.solr.core.SolrCore@1f16424 url=http://127.0.0.1:49931/solr/collection1 node=127.0.0.1:49931_solr
[junit4:junit4]   2> 16458 T760 C22 P49931 oasu.DirectUpdateHandler2.commit start commit{flags=0,_version_=0,optimize=false,openSearcher=true,waitSearcher=true,expungeDeletes=false,softCommit=false}
[junit4:junit4]   2> 16464 T760 C22 P49931 oasc.SolrDeletionPolicy.onInit SolrDeletionPolicy.onInit: commits:num=1
[junit4:junit4]   2> 		commit{dir=RateLimitedDirectoryWrapper(org.apache.lucene.store.SimpleFSDirectory@C:\Users\JenkinsSlave\workspace\Lucene-Solr-4.x-Windows\solr\build\solr-core\test\J0\org.apache.solr.cloud.SyncSliceTest-1355276546277\control\data\index lockFactory=org.apache.lucene.store.NativeFSLockFactory@16eb0c3),segFN=segments_1,generation=1,filenames=[segments_1]
[junit4:junit4]   2> 16466 T760 C22 P49931 oasc.SolrDeletionPolicy.updateCommits newest commit = 1
[junit4:junit4]   2> 16476 T760 C22 P49931 oasc.SolrDeletionPolicy.onCommit SolrDeletionPolicy.onCommit: commits:num=2
[junit4:junit4]   2> 		commit{dir=RateLimitedDirectoryWrapper(org.apache.lucene.store.SimpleFSDirectory@C:\Users\JenkinsSlave\workspace\Lucene-Solr-4.x-Windows\solr\build\solr-core\test\J0\org.apache.solr.cloud.SyncSliceTest-1355276546277\control\data\index lockFactory=org.apache.lucene.store.NativeFSLockFactory@16eb0c3),segFN=segments_1,generation=1,filenames=[segments_1]
[junit4:junit4]   2> 		commit{dir=RateLimitedDirectoryWrapper(org.apache.lucene.store.SimpleFSDirectory@C:\Users\JenkinsSlave\workspace\Lucene-Solr-4.x-Windows\solr\build\solr-core\test\J0\org.apache.solr.cloud.SyncSliceTest-1355276546277\control\data\index lockFactory=org.apache.lucene.store.NativeFSLockFactory@16eb0c3),segFN=segments_2,generation=2,filenames=[segments_2]
[junit4:junit4]   2> 16476 T760 C22 P49931 oasc.SolrDeletionPolicy.updateCommits newest commit = 2
[junit4:junit4]   2> 16481 T760 C22 P49931 oass.SolrIndexSearcher.<init> Opening Searcher@f3a5a5 main
[junit4:junit4]   2> 16481 T760 C22 P49931 oass.SolrIndexSearcher.getIndexDir WARNING WARNING: Directory impl does not support setting indexDir: org.apache.lucene.store.RateLimitedDirectoryWrapper
[junit4:junit4]   2> 16482 T760 C22 P49931 oasu.DirectUpdateHandler2.commit end_commit_flush
[junit4:junit4]   2> 16483 T769 oasc.SolrCore.registerSearcher [collection1] Registered new searcher Searcher@f3a5a5 main{StandardDirectoryReader(segments_1:1)}
[junit4:junit4]   2> 16484 T760 C22 P49931 /update {waitSearcher=true&wt=javabin&commit=true&softCommit=false&version=2} {commit=} 0 26
[junit4:junit4]   2> 16486 T743 oaz.ZooKeeper.<init> Initiating client connection, connectString=127.0.0.1:49924/solr sessionTimeout=10000 watcher=org.apache.solr.common.cloud.ConnectionManager@14f3
[junit4:junit4]   2> 16489 T743 oascc.ConnectionManager.waitForConnected Waiting for client to connect to ZooKeeper
[junit4:junit4]   2> 16490 T841 oaz.ClientCnxn$SendTh

[...truncated too long message...]

tRuleSetupTeardownChained$1.evaluate(TestRuleSetupTeardownChained.java:50)
[junit4:junit4]    > 	at org.apache.lucene.util.TestRuleFieldCacheSanity$1.evaluate(TestRuleFieldCacheSanity.java:51)
[junit4:junit4]    > 	at org.apache.lucene.util.AbstractBeforeAfterRule$1.evaluate(AbstractBeforeAfterRule.java:46)
[junit4:junit4]    > 	at com.carrotsearch.randomizedtesting.rules.SystemPropertiesInvariantRule$1.evaluate(SystemPropertiesInvariantRule.java:55)
[junit4:junit4]    > 	at org.apache.lucene.util.TestRuleThreadAndTestName$1.evaluate(TestRuleThreadAndTestName.java:49)
[junit4:junit4]    > 	at org.apache.lucene.util.TestRuleIgnoreAfterMaxFailures$1.evaluate(TestRuleIgnoreAfterMaxFailures.java:70)
[junit4:junit4]    > 	at org.apache.lucene.util.TestRuleMarkFailure$1.evaluate(TestRuleMarkFailure.java:48)
[junit4:junit4]    > 	at com.carrotsearch.randomizedtesting.rules.StatementAdapter.evaluate(StatementAdapter.java:36)
[junit4:junit4]    > 	at com.carrotsearch.randomizedtesting.ThreadLeakControl$StatementRunner.run(ThreadLeakControl.java:358)
[junit4:junit4]    > 	at com.carrotsearch.randomizedtesting.ThreadLeakControl.forkTimeoutingTask(ThreadLeakControl.java:782)
[junit4:junit4]    > 	at com.carrotsearch.randomizedtesting.ThreadLeakControl$3.evaluate(ThreadLeakControl.java:442)
[junit4:junit4]    > 	at com.carrotsearch.randomizedtesting.RandomizedRunner.runSingleTest(RandomizedRunner.java:746)
[junit4:junit4]    > 	at com.carrotsearch.randomizedtesting.RandomizedRunner$3.evaluate(RandomizedRunner.java:648)
[junit4:junit4]    > 	at com.carrotsearch.randomizedtesting.RandomizedRunner$4.evaluate(RandomizedRunner.java:682)
[junit4:junit4]    > 	at com.carrotsearch.randomizedtesting.RandomizedRunner$5.evaluate(RandomizedRunner.java:693)
[junit4:junit4]    > 	at com.carrotsearch.randomizedtesting.rules.StatementAdapter.evaluate(StatementAdapter.java:36)
[junit4:junit4]    > 	at com.carrotsearch.randomizedtesting.rules.SystemPropertiesRestoreRule$1.evaluate(SystemPropertiesRestoreRule.java:53)
[junit4:junit4]    > 	at org.apache.lucene.util.AbstractBeforeAfterRule$1.evaluate(AbstractBeforeAfterRule.java:46)
[junit4:junit4]    > 	at org.apache.lucene.util.TestRuleStoreClassName$1.evaluate(TestRuleStoreClassName.java:42)
[junit4:junit4]    > 	at com.carrotsearch.randomizedtesting.rules.SystemPropertiesInvariantRule$1.evaluate(SystemPropertiesInvariantRule.java:55)
[junit4:junit4]    > 	at com.carrotsearch.randomizedtesting.rules.NoShadowingOrOverridesOnMethodsRule$1.evaluate(NoShadowingOrOverridesOnMethodsRule.java:39)
[junit4:junit4]    > 	at com.carrotsearch.randomizedtesting.rules.NoShadowingOrOverridesOnMethodsRule$1.evaluate(NoShadowingOrOverridesOnMethodsRule.java:39)
[junit4:junit4]    > 	at com.carrotsearch.randomizedtesting.rules.StatementAdapter.evaluate(StatementAdapter.java:36)
[junit4:junit4]    > 	at org.apache.lucene.util.TestRuleAssertionsRequired$1.evaluate(TestRuleAssertionsRequired.java:43)
[junit4:junit4]    > 	at org.apache.lucene.util.TestRuleMarkFailure$1.evaluate(TestRuleMarkFailure.java:48)
[junit4:junit4]    > 	at org.apache.lucene.util.TestRuleIgnoreAfterMaxFailures$1.evaluate(TestRuleIgnoreAfterMaxFailures.java:70)
[junit4:junit4]    > 	at org.apache.lucene.util.TestRuleIgnoreTestSuites$1.evaluate(TestRuleIgnoreTestSuites.java:55)
[junit4:junit4]    > 	at com.carrotsearch.randomizedtesting.rules.StatementAdapter.evaluate(StatementAdapter.java:36)
[junit4:junit4]    > 	at com.carrotsearch.randomizedtesting.ThreadLeakControl$StatementRunner.run(ThreadLeakControl.java:358)
[junit4:junit4]    > 	at java.lang.Thread.run(Thread.java:662)
[junit4:junit4]   2> 227260 T3813 oas.SolrTestCaseJ4.deleteCore ###deleteCore
[junit4:junit4]   2> NOTE: test params are: codec=SimpleText, sim=RandomSimilarityProvider(queryNorm=false,coord=no): {}, locale=ar_QA, timezone=Canada/Pacific
[junit4:junit4]   2> NOTE: Windows 7 6.1 x86/Sun Microsystems Inc. 1.6.0_37 (32-bit)/cpus=2,threads=2,free=62250416,total=367591424
[junit4:junit4]   2> NOTE: All tests run in this JVM: [CircularListTest, MBeansHandlerTest, FileUtilsTest, CopyFieldTest, TestCSVResponseWriter, TestPluginEnable, TestSurroundQueryParser, TestFastLRUCache, SolrInfoMBeanTest, TestCodecSupport, HighlighterConfigTest, LegacyHTMLStripCharFilterTest, OpenExchangeRatesOrgProviderTest, TestCollationField, OverseerTest, SystemInfoHandlerTest, TestDistributedSearch, TestAnalyzedSuggestions, OverseerCollectionProcessorTest, IndexSchemaTest, TestStressReorder, LeaderElectionIntegrationTest, ResourceLoaderTest, SyncSliceTest, ZkCLITest, TestStressVersions, CurrencyFieldTest, TermsComponentTest, SortByFunctionTest, TestRemoteStreaming, BasicZkTest, FullSolrCloudDistribCmdsTest, TestIndexSearcher, TestJoin, HighlighterTest, NoCacheHeaderTest, FieldAnalysisRequestHandlerTest, DirectSolrSpellCheckerTest, StatsComponentTest, BasicFunctionalityTest, SuggesterWFSTTest, FieldMutatingUpdateProcessorTest, ReturnFieldsTest, TestValueSourceCache, LoggingHandlerTest, StatelessScriptUpdateProcessorFactoryTest, CoreContainerCoreInitFailuresTest, ResponseLogComponentTest, TestDocumentBuilder, TestMergePolicyConfig, TestQueryUtils, SampleTest, TestCharFilters, TestRealTimeGet, TestFoldingMultitermQuery, SuggesterFSTTest, SearchHandlerTest, TestSolr4Spatial, TestPhraseSuggestions, BinaryUpdateRequestHandlerTest, TestBinaryField, TestBadConfig, CoreAdminHandlerTest, SpellingQueryConverterTest, TestCollationKeyRangeQueries, SuggesterTSTTest, WordBreakSolrSpellCheckerTest, EchoParamsTest, UUIDFieldTest, DirectSolrConnectionTest, TestLRUCache, TestExtendedDismaxParser, TestNumberUtils, UniqFieldsUpdateProcessorFactoryTest, NotRequiredUniqueKeyTest, TestWriterPerf, TestSolrDeletionPolicy2, TestUtils, StandardRequestHandlerTest, DistanceFunctionTest, PluginInfoTest, TestBM25SimilarityFactory, TestReversedWildcardFilterFactory, DistributedSpellCheckComponentTest, ScriptEngineTest, TestFiltering, TestSystemIdResolver, DefaultValueUpdateProcessorTest, DistributedQueryElevationComponentTest, SpellCheckComponentTest, TestSolrCoreProperties, SolrCmdDistributorTest, NumericFieldsTest, PreAnalyzedFieldTest, RequestHandlersTest, PolyFieldTest, TestIndexingPerformance, SolrRequestParserTest, SolrCoreTest, PrimUtilsTest, JSONWriterTest, TestQuerySenderNoQuery, URLClassifyProcessorTest, TestRecovery, SolrPluginUtilsTest, PingRequestHandlerTest, BadComponentTest, DateFieldTest, SchemaVersionSpecificBehaviorTest, TestQuerySenderListener, ZkSolrClientTest, MoreLikeThisHandlerTest, DocumentAnalysisRequestHandlerTest, TestUpdate, BasicDistributedZkTest, RecoveryZkTest, TestReplicationHandler, LeaderElectionTest, ZkControllerTest, TestDistributedGrouping, TestRandomFaceting, SpellCheckCollatorTest, SoftAutoCommitTest, AutoCommitTest, TestFaceting, TestHashPartitioner, DistributedTermsComponentTest, IndexBasedSpellCheckerTest, TestRangeQuery, DirectUpdateHandlerTest, TestMultiCoreConfBootstrap, SimpleFacetsTest, TestCoreContainer, LukeRequestHandlerTest, TestSort, TestGroupingSearch, FileBasedSpellCheckerTest, ConvertedLegacyTest, PeerSyncTest, QueryElevationComponentTest, SignatureUpdateProcessorFactoryTest, TestBinaryResponseWriter, TestJmxIntegration, TestFunctionQuery, TestTrie, CacheHeaderTest, QueryEqualityTest, TestWordDelimiterFilterFactory, TestCSVLoader, SpatialFilterTest, DocumentBuilderTest, TestPseudoReturnFields, DisMaxRequestHandlerTest, QueryParsingTest, XsltUpdateRequestHandlerTest, MinimalSchemaTest, TestQueryTypes, TestPHPSerializedResponseWriter, XmlUpdateRequestHandlerTest, TermVectorComponentTest, JsonLoaderTest, DirectUpdateHandlerOptimizeTest, IndexSchemaRuntimeFieldTest, TestSolrQueryParser, FastVectorHighlighterTest, DebugComponentTest, RequiredFieldsTest, TestOmitPositions, TestArbitraryIndexDir, UpdateParamsTest, SuggesterTest, CSVRequestHandlerTest, ShowFileRequestHandlerTest, TestSearchPerf, BadIndexSchemaTest, SolrCoreCheckLockOnStartupTest, TestSolrDeletionPolicy1, TestLuceneMatchVersion, UpdateRequestProcessorFactoryTest, TestPropInject, PrimitiveFieldTypeTest, AlternateDirectoryTest, SOLR749Test, TestPropInjectDefaults, TestXIncludeConfig, TestDocSet, TestLFUCache, SolrIndexConfigTest, IndexReaderFactoryTest, OutputWriterTest, MultiTermTest, TestJmxMonitoredMap, TestConfig, SpellPossibilityIteratorTest, TestLMDirichletSimilarityFactory, TestPerFieldSimilarity, TestLMJelinekMercerSimilarityFactory, TestDFRSimilarityFactory, TestIBSimilarityFactory, TestDefaultSimilarityFactory, TimeZoneUtilsTest, DateMathParserTest, TestSolrXMLSerializer, TestSuggestSpellingConverter, DOMUtilTest, RAMDirectoryFactoryTest, ZkNodePropsTest, AnalysisAfterCoreReloadTest, PathHierarchyTokenizerFactoryTest, BasicDistributedZk2Test]
[junit4:junit4] Completed in 227.29s, 1 test, 1 failure <<< FAILURES!

[...truncated 65 lines...]
BUILD FAILED
C:\Users\JenkinsSlave\workspace\Lucene-Solr-4.x-Windows\build.xml:352: The following error occurred while executing this line:
C:\Users\JenkinsSlave\workspace\Lucene-Solr-4.x-Windows\build.xml:39: The following error occurred while executing this line:
C:\Users\JenkinsSlave\workspace\Lucene-Solr-4.x-Windows\solr\build.xml:178: The following error occurred while executing this line:
C:\Users\JenkinsSlave\workspace\Lucene-Solr-4.x-Windows\solr\common-build.xml:438: The following error occurred while executing this line:
C:\Users\JenkinsSlave\workspace\Lucene-Solr-4.x-Windows\lucene\common-build.xml:1171: The following error occurred while executing this line:
C:\Users\JenkinsSlave\workspace\Lucene-Solr-4.x-Windows\lucene\common-build.xml:835: There were test failures: 239 suites, 994 tests, 1 suite-level error, 1 error, 2 failures, 12 ignored (7 assumptions)

Total time: 47 minutes 25 seconds
Build step 'Invoke Ant' marked build as failure
Archiving artifacts
Recording test results
Description set: Java: 32bit/jdk1.6.0_37 -client -XX:+UseParallelGC
Email was triggered for: Failure
Sending email for trigger: Failure



Mime
View raw message