lucene-dev mailing list archives

Site index · List index
Message view « Date » · « Thread »
Top « Date » · « Thread »
From Apache Jenkins Server <jenk...@builds.apache.org>
Subject [JENKINS] Lucene-Solr-Tests-4.x-java7 - Build # 807 - Still Failing
Date Mon, 17 Dec 2012 22:05:37 GMT
Build: https://builds.apache.org/job/Lucene-Solr-Tests-4.x-java7/807/

1 tests failed.
REGRESSION:  org.apache.solr.cloud.SyncSliceTest.testDistribSearch

Error Message:


Stack Trace:
java.lang.AssertionError
	at __randomizedtesting.SeedInfo.seed([BF39A2C09A4432F:8A1514347EFB2313]:0)
	at org.junit.Assert.fail(Assert.java:92)
	at org.junit.Assert.assertTrue(Assert.java:43)
	at org.junit.Assert.assertNotNull(Assert.java:526)
	at org.junit.Assert.assertNotNull(Assert.java:537)
	at org.apache.solr.cloud.SyncSliceTest.doTest(SyncSliceTest.java:211)
	at org.apache.solr.BaseDistributedSearchTestCase.testDistribSearch(BaseDistributedSearchTestCase.java:794)
	at sun.reflect.NativeMethodAccessorImpl.invoke0(Native Method)
	at sun.reflect.NativeMethodAccessorImpl.invoke(NativeMethodAccessorImpl.java:57)
	at sun.reflect.DelegatingMethodAccessorImpl.invoke(DelegatingMethodAccessorImpl.java:43)
	at java.lang.reflect.Method.invoke(Method.java:601)
	at com.carrotsearch.randomizedtesting.RandomizedRunner.invoke(RandomizedRunner.java:1559)
	at com.carrotsearch.randomizedtesting.RandomizedRunner.access$600(RandomizedRunner.java:79)
	at com.carrotsearch.randomizedtesting.RandomizedRunner$6.evaluate(RandomizedRunner.java:737)
	at com.carrotsearch.randomizedtesting.RandomizedRunner$7.evaluate(RandomizedRunner.java:773)
	at com.carrotsearch.randomizedtesting.RandomizedRunner$8.evaluate(RandomizedRunner.java:787)
	at com.carrotsearch.randomizedtesting.rules.SystemPropertiesRestoreRule$1.evaluate(SystemPropertiesRestoreRule.java:53)
	at org.apache.lucene.util.TestRuleSetupTeardownChained$1.evaluate(TestRuleSetupTeardownChained.java:50)
	at org.apache.lucene.util.TestRuleFieldCacheSanity$1.evaluate(TestRuleFieldCacheSanity.java:51)
	at org.apache.lucene.util.AbstractBeforeAfterRule$1.evaluate(AbstractBeforeAfterRule.java:46)
	at com.carrotsearch.randomizedtesting.rules.SystemPropertiesInvariantRule$1.evaluate(SystemPropertiesInvariantRule.java:55)
	at org.apache.lucene.util.TestRuleThreadAndTestName$1.evaluate(TestRuleThreadAndTestName.java:49)
	at org.apache.lucene.util.TestRuleIgnoreAfterMaxFailures$1.evaluate(TestRuleIgnoreAfterMaxFailures.java:70)
	at org.apache.lucene.util.TestRuleMarkFailure$1.evaluate(TestRuleMarkFailure.java:48)
	at com.carrotsearch.randomizedtesting.rules.StatementAdapter.evaluate(StatementAdapter.java:36)
	at com.carrotsearch.randomizedtesting.ThreadLeakControl$StatementRunner.run(ThreadLeakControl.java:358)
	at com.carrotsearch.randomizedtesting.ThreadLeakControl.forkTimeoutingTask(ThreadLeakControl.java:782)
	at com.carrotsearch.randomizedtesting.ThreadLeakControl$3.evaluate(ThreadLeakControl.java:442)
	at com.carrotsearch.randomizedtesting.RandomizedRunner.runSingleTest(RandomizedRunner.java:746)
	at com.carrotsearch.randomizedtesting.RandomizedRunner$3.evaluate(RandomizedRunner.java:648)
	at com.carrotsearch.randomizedtesting.RandomizedRunner$4.evaluate(RandomizedRunner.java:682)
	at com.carrotsearch.randomizedtesting.RandomizedRunner$5.evaluate(RandomizedRunner.java:693)
	at com.carrotsearch.randomizedtesting.rules.StatementAdapter.evaluate(StatementAdapter.java:36)
	at com.carrotsearch.randomizedtesting.rules.SystemPropertiesRestoreRule$1.evaluate(SystemPropertiesRestoreRule.java:53)
	at org.apache.lucene.util.AbstractBeforeAfterRule$1.evaluate(AbstractBeforeAfterRule.java:46)
	at org.apache.lucene.util.TestRuleStoreClassName$1.evaluate(TestRuleStoreClassName.java:42)
	at com.carrotsearch.randomizedtesting.rules.SystemPropertiesInvariantRule$1.evaluate(SystemPropertiesInvariantRule.java:55)
	at com.carrotsearch.randomizedtesting.rules.NoShadowingOrOverridesOnMethodsRule$1.evaluate(NoShadowingOrOverridesOnMethodsRule.java:39)
	at com.carrotsearch.randomizedtesting.rules.NoShadowingOrOverridesOnMethodsRule$1.evaluate(NoShadowingOrOverridesOnMethodsRule.java:39)
	at com.carrotsearch.randomizedtesting.rules.StatementAdapter.evaluate(StatementAdapter.java:36)
	at org.apache.lucene.util.TestRuleAssertionsRequired$1.evaluate(TestRuleAssertionsRequired.java:43)
	at org.apache.lucene.util.TestRuleMarkFailure$1.evaluate(TestRuleMarkFailure.java:48)
	at org.apache.lucene.util.TestRuleIgnoreAfterMaxFailures$1.evaluate(TestRuleIgnoreAfterMaxFailures.java:70)
	at org.apache.lucene.util.TestRuleIgnoreTestSuites$1.evaluate(TestRuleIgnoreTestSuites.java:55)
	at com.carrotsearch.randomizedtesting.rules.StatementAdapter.evaluate(StatementAdapter.java:36)
	at com.carrotsearch.randomizedtesting.ThreadLeakControl$StatementRunner.run(ThreadLeakControl.java:358)
	at java.lang.Thread.run(Thread.java:722)




Build Log:
[...truncated 9254 lines...]
[junit4:junit4] Suite: org.apache.solr.cloud.SyncSliceTest
[junit4:junit4]   2> 0 T2533 oas.BaseDistributedSearchTestCase.initHostContext Setting hostContext system property: /hh_ov/xj
[junit4:junit4]   2> 3 T2533 oas.SolrTestCaseJ4.setUp ###Starting testDistribSearch
[junit4:junit4]   2> Creating dataDir: /usr/home/hudson/hudson-slave/workspace/Lucene-Solr-Tests-4.x-java7/solr/build/solr-core/test/J1/./solrtest-SyncSliceTest-1355781770504
[junit4:junit4]   2> 4 T2533 oasc.ZkTestServer.run STARTING ZK TEST SERVER
[junit4:junit4]   2> 5 T2534 oasc.ZkTestServer$ZKServerMain.runFromConfig Starting server
[junit4:junit4]   2> 7 T2534 oazs.ZooKeeperServer.setTickTime tickTime set to 1000
[junit4:junit4]   2> 7 T2534 oazs.ZooKeeperServer.setMinSessionTimeout minSessionTimeout set to -1
[junit4:junit4]   2> 7 T2534 oazs.ZooKeeperServer.setMaxSessionTimeout maxSessionTimeout set to -1
[junit4:junit4]   2> 8 T2534 oazs.NIOServerCnxnFactory.configure binding to port 0.0.0.0/0.0.0.0:0
[junit4:junit4]   2> 8 T2534 oazsp.FileTxnSnapLog.save Snapshotting: 0x0 to /usr/home/hudson/hudson-slave/workspace/Lucene-Solr-Tests-4.x-java7/solr/build/solr-core/test/J1/./org.apache.solr.cloud.SyncSliceTest-1355781770504/zookeeper/server1/data/version-2/snapshot.0
[junit4:junit4]   2> 106 T2533 oasc.ZkTestServer.run start zk server on port:32005
[junit4:junit4]   2> 106 T2533 oaz.ZooKeeper.<init> Initiating client connection, connectString=127.0.0.1:32005 sessionTimeout=10000 watcher=org.apache.solr.common.cloud.ConnectionManager@549bd478
[junit4:junit4]   2> 107 T2533 oascc.ConnectionManager.waitForConnected Waiting for client to connect to ZooKeeper
[junit4:junit4]   2> 107 T2539 oaz.ClientCnxn$SendThread.logStartConnect Opening socket connection to server localhost/127.0.0.1:32005. Will not attempt to authenticate using SASL (access denied ("javax.security.auth.AuthPermission" "getLoginConfiguration"))
[junit4:junit4]   2> 108 T2539 oaz.ClientCnxn$SendThread.primeConnection Socket connection established to localhost/127.0.0.1:32005, initiating session
[junit4:junit4]   2> 108 T2535 oazs.NIOServerCnxnFactory.run Accepted socket connection from /140.211.11.196:32006
[junit4:junit4]   2> 109 T2535 oazs.ZooKeeperServer.processConnectRequest Client attempting to establish new session at /140.211.11.196:32006
[junit4:junit4]   2> 109 T2537 oazsp.FileTxnLog.append Creating new log file: log.1
[junit4:junit4]   2> 110 T2537 oazs.ZooKeeperServer.finishSessionInit Established session 0x13baae40d0d0000 with negotiated timeout 10000 for client /140.211.11.196:32006
[junit4:junit4]   2> 111 T2539 oaz.ClientCnxn$SendThread.onConnected Session establishment complete on server localhost/127.0.0.1:32005, sessionid = 0x13baae40d0d0000, negotiated timeout = 10000
[junit4:junit4]   2> 111 T2540 oascc.ConnectionManager.process Watcher org.apache.solr.common.cloud.ConnectionManager@549bd478 name:ZooKeeperConnection Watcher:127.0.0.1:32005 got event WatchedEvent state:SyncConnected type:None path:null path:null type:None
[junit4:junit4]   2> 111 T2533 oascc.ConnectionManager.waitForConnected Client is connected to ZooKeeper
[junit4:junit4]   2> 112 T2533 oascc.SolrZkClient.makePath makePath: /solr
[junit4:junit4]   2> 114 T2538 oazs.PrepRequestProcessor.pRequest2Txn Processed session termination for sessionid: 0x13baae40d0d0000
[junit4:junit4]   2> 122 T2540 oaz.ClientCnxn$EventThread.run EventThread shut down
[junit4:junit4]   2> 122 T2535 oazs.NIOServerCnxn.closeSock Closed socket connection for client /140.211.11.196:32006 which had sessionid 0x13baae40d0d0000
[junit4:junit4]   2> 122 T2533 oaz.ZooKeeper.close Session: 0x13baae40d0d0000 closed
[junit4:junit4]   2> 122 T2533 oaz.ZooKeeper.<init> Initiating client connection, connectString=127.0.0.1:32005/solr sessionTimeout=10000 watcher=org.apache.solr.common.cloud.ConnectionManager@59e4a54a
[junit4:junit4]   2> 123 T2533 oascc.ConnectionManager.waitForConnected Waiting for client to connect to ZooKeeper
[junit4:junit4]   2> 123 T2541 oaz.ClientCnxn$SendThread.logStartConnect Opening socket connection to server localhost/127.0.0.1:32005. Will not attempt to authenticate using SASL (access denied ("javax.security.auth.AuthPermission" "getLoginConfiguration"))
[junit4:junit4]   2> 124 T2541 oaz.ClientCnxn$SendThread.primeConnection Socket connection established to localhost/127.0.0.1:32005, initiating session
[junit4:junit4]   2> 124 T2535 oazs.NIOServerCnxnFactory.run Accepted socket connection from /140.211.11.196:32007
[junit4:junit4]   2> 124 T2535 oazs.ZooKeeperServer.processConnectRequest Client attempting to establish new session at /140.211.11.196:32007
[junit4:junit4]   2> 125 T2537 oazs.ZooKeeperServer.finishSessionInit Established session 0x13baae40d0d0001 with negotiated timeout 10000 for client /140.211.11.196:32007
[junit4:junit4]   2> 125 T2541 oaz.ClientCnxn$SendThread.onConnected Session establishment complete on server localhost/127.0.0.1:32005, sessionid = 0x13baae40d0d0001, negotiated timeout = 10000
[junit4:junit4]   2> 125 T2542 oascc.ConnectionManager.process Watcher org.apache.solr.common.cloud.ConnectionManager@59e4a54a name:ZooKeeperConnection Watcher:127.0.0.1:32005/solr got event WatchedEvent state:SyncConnected type:None path:null path:null type:None
[junit4:junit4]   2> 126 T2533 oascc.ConnectionManager.waitForConnected Client is connected to ZooKeeper
[junit4:junit4]   2> 126 T2533 oascc.SolrZkClient.makePath makePath: /collections/collection1
[junit4:junit4]   2> 136 T2533 oascc.SolrZkClient.makePath makePath: /collections/collection1/shards
[junit4:junit4]   2> 138 T2533 oascc.SolrZkClient.makePath makePath: /collections/control_collection
[junit4:junit4]   2> 140 T2533 oascc.SolrZkClient.makePath makePath: /collections/control_collection/shards
[junit4:junit4]   2> 142 T2533 oasc.AbstractZkTestCase.putConfig put /usr/home/hudson/hudson-slave/workspace/Lucene-Solr-Tests-4.x-java7/solr/build/solr-core/test-files/solr/collection1/conf/solrconfig.xml to /configs/conf1/solrconfig.xml
[junit4:junit4]   2> 143 T2533 oascc.SolrZkClient.makePath makePath: /configs/conf1/solrconfig.xml
[junit4:junit4]   2> 160 T2533 oasc.AbstractZkTestCase.putConfig put /usr/home/hudson/hudson-slave/workspace/Lucene-Solr-Tests-4.x-java7/solr/build/solr-core/test-files/solr/collection1/conf/schema.xml to /configs/conf1/schema.xml
[junit4:junit4]   2> 162 T2533 oascc.SolrZkClient.makePath makePath: /configs/conf1/schema.xml
[junit4:junit4]   2> 266 T2533 oasc.AbstractZkTestCase.putConfig put /usr/home/hudson/hudson-slave/workspace/Lucene-Solr-Tests-4.x-java7/solr/build/solr-core/test-files/solr/collection1/conf/stopwords.txt to /configs/conf1/stopwords.txt
[junit4:junit4]   2> 268 T2533 oascc.SolrZkClient.makePath makePath: /configs/conf1/stopwords.txt
[junit4:junit4]   2> 271 T2533 oasc.AbstractZkTestCase.putConfig put /usr/home/hudson/hudson-slave/workspace/Lucene-Solr-Tests-4.x-java7/solr/build/solr-core/test-files/solr/collection1/conf/protwords.txt to /configs/conf1/protwords.txt
[junit4:junit4]   2> 272 T2533 oascc.SolrZkClient.makePath makePath: /configs/conf1/protwords.txt
[junit4:junit4]   2> 281 T2533 oasc.AbstractZkTestCase.putConfig put /usr/home/hudson/hudson-slave/workspace/Lucene-Solr-Tests-4.x-java7/solr/build/solr-core/test-files/solr/collection1/conf/currency.xml to /configs/conf1/currency.xml
[junit4:junit4]   2> 281 T2533 oascc.SolrZkClient.makePath makePath: /configs/conf1/currency.xml
[junit4:junit4]   2> 285 T2533 oasc.AbstractZkTestCase.putConfig put /usr/home/hudson/hudson-slave/workspace/Lucene-Solr-Tests-4.x-java7/solr/build/solr-core/test-files/solr/collection1/conf/open-exchange-rates.json to /configs/conf1/open-exchange-rates.json
[junit4:junit4]   2> 285 T2533 oascc.SolrZkClient.makePath makePath: /configs/conf1/open-exchange-rates.json
[junit4:junit4]   2> 295 T2533 oasc.AbstractZkTestCase.putConfig put /usr/home/hudson/hudson-slave/workspace/Lucene-Solr-Tests-4.x-java7/solr/build/solr-core/test-files/solr/collection1/conf/mapping-ISOLatin1Accent.txt to /configs/conf1/mapping-ISOLatin1Accent.txt
[junit4:junit4]   2> 296 T2533 oascc.SolrZkClient.makePath makePath: /configs/conf1/mapping-ISOLatin1Accent.txt
[junit4:junit4]   2> 306 T2533 oasc.AbstractZkTestCase.putConfig put /usr/home/hudson/hudson-slave/workspace/Lucene-Solr-Tests-4.x-java7/solr/build/solr-core/test-files/solr/collection1/conf/old_synonyms.txt to /configs/conf1/old_synonyms.txt
[junit4:junit4]   2> 307 T2533 oascc.SolrZkClient.makePath makePath: /configs/conf1/old_synonyms.txt
[junit4:junit4]   2> 311 T2533 oasc.AbstractZkTestCase.putConfig put /usr/home/hudson/hudson-slave/workspace/Lucene-Solr-Tests-4.x-java7/solr/build/solr-core/test-files/solr/collection1/conf/synonyms.txt to /configs/conf1/synonyms.txt
[junit4:junit4]   2> 311 T2533 oascc.SolrZkClient.makePath makePath: /configs/conf1/synonyms.txt
[junit4:junit4]   2> 315 T2538 oazs.PrepRequestProcessor.pRequest2Txn Processed session termination for sessionid: 0x13baae40d0d0001
[junit4:junit4]   2> 318 T2542 oaz.ClientCnxn$EventThread.run EventThread shut down
[junit4:junit4]   2> 318 T2535 oazs.NIOServerCnxn.closeSock Closed socket connection for client /140.211.11.196:32007 which had sessionid 0x13baae40d0d0001
[junit4:junit4]   2> 318 T2533 oaz.ZooKeeper.close Session: 0x13baae40d0d0001 closed
[junit4:junit4]   2> 432 T2533 oejs.Server.doStart jetty-8.1.8.v20121106
[junit4:junit4]   2> 437 T2533 oejs.AbstractConnector.doStart Started SocketConnector@127.0.0.1:32009
[junit4:junit4]   2> 438 T2533 oasc.SolrResourceLoader.locateSolrHome JNDI not configured for solr (NoInitialContextEx)
[junit4:junit4]   2> 439 T2533 oasc.SolrResourceLoader.locateSolrHome using system property solr.solr.home: /usr/home/hudson/hudson-slave/workspace/Lucene-Solr-Tests-4.x-java7/solr/build/solr-core/test/J1/./org.apache.solr.cloud.SyncSliceTest-controljetty-1355781770819
[junit4:junit4]   2> 439 T2533 oasc.SolrResourceLoader.<init> new SolrResourceLoader for deduced Solr Home: '/usr/home/hudson/hudson-slave/workspace/Lucene-Solr-Tests-4.x-java7/solr/build/solr-core/test/J1/./org.apache.solr.cloud.SyncSliceTest-controljetty-1355781770819/'
[junit4:junit4]   2> 468 T2533 oass.SolrDispatchFilter.init SolrDispatchFilter.init()
[junit4:junit4]   2> 468 T2533 oasc.SolrResourceLoader.locateSolrHome JNDI not configured for solr (NoInitialContextEx)
[junit4:junit4]   2> 469 T2533 oasc.SolrResourceLoader.locateSolrHome using system property solr.solr.home: /usr/home/hudson/hudson-slave/workspace/Lucene-Solr-Tests-4.x-java7/solr/build/solr-core/test/J1/./org.apache.solr.cloud.SyncSliceTest-controljetty-1355781770819
[junit4:junit4]   2> 469 T2533 oasc.CoreContainer$Initializer.initialize looking for solr.xml: /usr/home/hudson/hudson-slave/workspace/Lucene-Solr-Tests-4.x-java7/solr/build/solr-core/test/J1/./org.apache.solr.cloud.SyncSliceTest-controljetty-1355781770819/solr.xml
[junit4:junit4]   2> 470 T2533 oasc.CoreContainer.<init> New CoreContainer 273795367
[junit4:junit4]   2> 470 T2533 oasc.CoreContainer.load Loading CoreContainer using Solr Home: '/usr/home/hudson/hudson-slave/workspace/Lucene-Solr-Tests-4.x-java7/solr/build/solr-core/test/J1/./org.apache.solr.cloud.SyncSliceTest-controljetty-1355781770819/'
[junit4:junit4]   2> 471 T2533 oasc.SolrResourceLoader.<init> new SolrResourceLoader for directory: '/usr/home/hudson/hudson-slave/workspace/Lucene-Solr-Tests-4.x-java7/solr/build/solr-core/test/J1/./org.apache.solr.cloud.SyncSliceTest-controljetty-1355781770819/'
[junit4:junit4]   2> 491 T2533 oashc.HttpShardHandlerFactory.getParameter Setting socketTimeout to: 30000
[junit4:junit4]   2> 492 T2533 oashc.HttpShardHandlerFactory.getParameter Setting urlScheme to: http://
[junit4:junit4]   2> 492 T2533 oashc.HttpShardHandlerFactory.getParameter Setting connTimeout to: 15000
[junit4:junit4]   2> 493 T2533 oashc.HttpShardHandlerFactory.getParameter Setting maxConnectionsPerHost to: 20
[junit4:junit4]   2> 493 T2533 oashc.HttpShardHandlerFactory.getParameter Setting corePoolSize to: 0
[junit4:junit4]   2> 493 T2533 oashc.HttpShardHandlerFactory.getParameter Setting maximumPoolSize to: 2147483647
[junit4:junit4]   2> 494 T2533 oashc.HttpShardHandlerFactory.getParameter Setting maxThreadIdleTime to: 5
[junit4:junit4]   2> 494 T2533 oashc.HttpShardHandlerFactory.getParameter Setting sizeOfQueue to: -1
[junit4:junit4]   2> 495 T2533 oashc.HttpShardHandlerFactory.getParameter Setting fairnessPolicy to: false
[junit4:junit4]   2> 495 T2533 oascsi.HttpClientUtil.createClient Creating new http client, config:maxConnectionsPerHost=20&maxConnections=10000&socketTimeout=30000&connTimeout=15000&retry=false
[junit4:junit4]   2> 510 T2533 oasc.CoreContainer.load Registering Log Listener
[junit4:junit4]   2> 525 T2533 oasc.CoreContainer.initZooKeeper Zookeeper client=127.0.0.1:32005/solr
[junit4:junit4]   2> 526 T2533 oasc.ZkController.checkChrootPath zkHost includes chroot
[junit4:junit4]   2> 526 T2533 oaz.ZooKeeper.<init> Initiating client connection, connectString=127.0.0.1:32005 sessionTimeout=60000 watcher=org.apache.solr.common.cloud.ConnectionManager@5c056be6
[junit4:junit4]   2> 527 T2533 oascc.ConnectionManager.waitForConnected Waiting for client to connect to ZooKeeper
[junit4:junit4]   2> 527 T2552 oaz.ClientCnxn$SendThread.logStartConnect Opening socket connection to server localhost/127.0.0.1:32005. Will not attempt to authenticate using SASL (access denied ("javax.security.auth.AuthPermission" "getLoginConfiguration"))
[junit4:junit4]   2> 528 T2552 oaz.ClientCnxn$SendThread.primeConnection Socket connection established to localhost/127.0.0.1:32005, initiating session
[junit4:junit4]   2> 528 T2535 oazs.NIOServerCnxnFactory.run Accepted socket connection from /140.211.11.196:32010
[junit4:junit4]   2> 529 T2535 oazs.ZooKeeperServer.processConnectRequest Client attempting to establish new session at /140.211.11.196:32010
[junit4:junit4]   2> 574 T2537 oazs.ZooKeeperServer.finishSessionInit Established session 0x13baae40d0d0002 with negotiated timeout 20000 for client /140.211.11.196:32010
[junit4:junit4]   2> 574 T2552 oaz.ClientCnxn$SendThread.onConnected Session establishment complete on server localhost/127.0.0.1:32005, sessionid = 0x13baae40d0d0002, negotiated timeout = 20000
[junit4:junit4]   2> 575 T2553 oascc.ConnectionManager.process Watcher org.apache.solr.common.cloud.ConnectionManager@5c056be6 name:ZooKeeperConnection Watcher:127.0.0.1:32005 got event WatchedEvent state:SyncConnected type:None path:null path:null type:None
[junit4:junit4]   2> 575 T2533 oascc.ConnectionManager.waitForConnected Client is connected to ZooKeeper
[junit4:junit4]   2> 576 T2538 oazs.PrepRequestProcessor.pRequest2Txn Processed session termination for sessionid: 0x13baae40d0d0002
[junit4:junit4]   2> 578 T2553 oaz.ClientCnxn$EventThread.run EventThread shut down
[junit4:junit4]   2> 578 T2535 oazs.NIOServerCnxn.closeSock Closed socket connection for client /140.211.11.196:32010 which had sessionid 0x13baae40d0d0002
[junit4:junit4]   2> 578 T2533 oaz.ZooKeeper.close Session: 0x13baae40d0d0002 closed
[junit4:junit4]   2> 578 T2533 oascsi.HttpClientUtil.createClient Creating new http client, config:maxConnections=500&maxConnectionsPerHost=16&socketTimeout=15000&connTimeout=30000
[junit4:junit4]   2> 585 T2533 oaz.ZooKeeper.<init> Initiating client connection, connectString=127.0.0.1:32005/solr sessionTimeout=30000 watcher=org.apache.solr.common.cloud.ConnectionManager@22ac0088
[junit4:junit4]   2> 586 T2533 oascc.ConnectionManager.waitForConnected Waiting for client to connect to ZooKeeper
[junit4:junit4]   2> 586 T2554 oaz.ClientCnxn$SendThread.logStartConnect Opening socket connection to server localhost/127.0.0.1:32005. Will not attempt to authenticate using SASL (access denied ("javax.security.auth.AuthPermission" "getLoginConfiguration"))
[junit4:junit4]   2> 587 T2554 oaz.ClientCnxn$SendThread.primeConnection Socket connection established to localhost/127.0.0.1:32005, initiating session
[junit4:junit4]   2> 587 T2535 oazs.NIOServerCnxnFactory.run Accepted socket connection from /140.211.11.196:32011
[junit4:junit4]   2> 587 T2535 oazs.ZooKeeperServer.processConnectRequest Client attempting to establish new session at /140.211.11.196:32011
[junit4:junit4]   2> 602 T2537 oazs.ZooKeeperServer.finishSessionInit Established session 0x13baae40d0d0003 with negotiated timeout 20000 for client /140.211.11.196:32011
[junit4:junit4]   2> 602 T2554 oaz.ClientCnxn$SendThread.onConnected Session establishment complete on server localhost/127.0.0.1:32005, sessionid = 0x13baae40d0d0003, negotiated timeout = 20000
[junit4:junit4]   2> 602 T2555 oascc.ConnectionManager.process Watcher org.apache.solr.common.cloud.ConnectionManager@22ac0088 name:ZooKeeperConnection Watcher:127.0.0.1:32005/solr got event WatchedEvent state:SyncConnected type:None path:null path:null type:None
[junit4:junit4]   2> 603 T2533 oascc.ConnectionManager.waitForConnected Client is connected to ZooKeeper
[junit4:junit4]   2> 639 T2538 oazs.PrepRequestProcessor.pRequest Got user-level KeeperException when processing sessionid:0x13baae40d0d0003 type:create cxid:0x2 zxid:0x1a txntype:-1 reqpath:n/a Error Path:/solr/overseer Error:KeeperErrorCode = NodeExists for /solr/overseer
[junit4:junit4]   2> 664 T2533 oascc.SolrZkClient.makePath makePath: /live_nodes
[junit4:junit4]   2> 667 T2533 oasc.ZkController.createEphemeralLiveNode Register node as live in ZooKeeper:/live_nodes/127.0.0.1:32009_hh_ov%2Fxj
[junit4:junit4]   2> 667 T2538 oazs.PrepRequestProcessor.pRequest Got user-level KeeperException when processing sessionid:0x13baae40d0d0003 type:delete cxid:0x7 zxid:0x1c txntype:-1 reqpath:n/a Error Path:/solr/live_nodes/127.0.0.1:32009_hh_ov%2Fxj Error:KeeperErrorCode = NoNode for /solr/live_nodes/127.0.0.1:32009_hh_ov%2Fxj
[junit4:junit4]   2> 669 T2533 oascc.SolrZkClient.makePath makePath: /live_nodes/127.0.0.1:32009_hh_ov%2Fxj
[junit4:junit4]   2> 672 T2533 oascc.SolrZkClient.makePath makePath: /overseer_elect/election
[junit4:junit4]   2> 712 T2538 oazs.PrepRequestProcessor.pRequest Got user-level KeeperException when processing sessionid:0x13baae40d0d0003 type:delete cxid:0x15 zxid:0x21 txntype:-1 reqpath:n/a Error Path:/solr/overseer_elect/leader Error:KeeperErrorCode = NoNode for /solr/overseer_elect/leader
[junit4:junit4]   2> 713 T2533 oascc.SolrZkClient.makePath makePath: /overseer_elect/leader
[junit4:junit4]   2> 716 T2533 oasc.Overseer.start Overseer (id=88852514112077827-127.0.0.1:32009_hh_ov%2Fxj-n_0000000000) starting
[junit4:junit4]   2> 716 T2538 oazs.PrepRequestProcessor.pRequest Got user-level KeeperException when processing sessionid:0x13baae40d0d0003 type:create cxid:0x1a zxid:0x23 txntype:-1 reqpath:n/a Error Path:/solr/overseer Error:KeeperErrorCode = NodeExists for /solr/overseer
[junit4:junit4]   2> 724 T2538 oazs.PrepRequestProcessor.pRequest Got user-level KeeperException when processing sessionid:0x13baae40d0d0003 type:create cxid:0x1b zxid:0x24 txntype:-1 reqpath:n/a Error Path:/solr/overseer Error:KeeperErrorCode = NodeExists for /solr/overseer
[junit4:junit4]   2> 726 T2538 oazs.PrepRequestProcessor.pRequest Got user-level KeeperException when processing sessionid:0x13baae40d0d0003 type:create cxid:0x1c zxid:0x25 txntype:-1 reqpath:n/a Error Path:/solr/overseer Error:KeeperErrorCode = NodeExists for /solr/overseer
[junit4:junit4]   2> 727 T2538 oazs.PrepRequestProcessor.pRequest Got user-level KeeperException when processing sessionid:0x13baae40d0d0003 type:create cxid:0x1d zxid:0x26 txntype:-1 reqpath:n/a Error Path:/solr/overseer Error:KeeperErrorCode = NodeExists for /solr/overseer
[junit4:junit4]   2> 743 T2557 oasc.OverseerCollectionProcessor.run Process current queue of collection messages
[junit4:junit4]   2> 744 T2533 oascc.SolrZkClient.makePath makePath: /clusterstate.json
[junit4:junit4]   2> 762 T2533 oascc.ZkStateReader.createClusterStateWatchersAndUpdate Updating cluster state from ZooKeeper... 
[junit4:junit4]   2> 763 T2556 oasc.Overseer$ClusterStateUpdater.run Starting to work on the main queue
[junit4:junit4]   2> 768 T2558 oasc.CoreContainer.create Creating SolrCore 'collection1' using instanceDir: /usr/home/hudson/hudson-slave/workspace/Lucene-Solr-Tests-4.x-java7/solr/build/solr-core/test/J1/./org.apache.solr.cloud.SyncSliceTest-controljetty-1355781770819/collection1
[junit4:junit4]   2> 769 T2558 oasc.ZkController.createCollectionZkNode Check for collection zkNode:control_collection
[junit4:junit4]   2> 769 T2558 oasc.ZkController.createCollectionZkNode Collection zkNode exists
[junit4:junit4]   2> 769 T2558 oasc.ZkController.readConfigName Load collection config from:/collections/control_collection
[junit4:junit4]   2> 771 T2558 oasc.SolrResourceLoader.<init> new SolrResourceLoader for directory: '/usr/home/hudson/hudson-slave/workspace/Lucene-Solr-Tests-4.x-java7/solr/build/solr-core/test/J1/./org.apache.solr.cloud.SyncSliceTest-controljetty-1355781770819/collection1/'
[junit4:junit4]   2> 772 T2558 oasc.SolrResourceLoader.replaceClassLoader Adding 'file:/usr/home/hudson/hudson-slave/workspace/Lucene-Solr-Tests-4.x-java7/solr/build/solr-core/test/J1/org.apache.solr.cloud.SyncSliceTest-controljetty-1355781770819/collection1/lib/classes/' to classloader
[junit4:junit4]   2> 773 T2558 oasc.SolrResourceLoader.replaceClassLoader Adding 'file:/usr/home/hudson/hudson-slave/workspace/Lucene-Solr-Tests-4.x-java7/solr/build/solr-core/test/J1/org.apache.solr.cloud.SyncSliceTest-controljetty-1355781770819/collection1/lib/README' to classloader
[junit4:junit4]   2> 827 T2558 oasc.SolrConfig.<init> Using Lucene MatchVersion: LUCENE_41
[junit4:junit4]   2> 902 T2558 oasc.SolrConfig.<init> Loaded SolrConfig: solrconfig.xml
[junit4:junit4]   2> 1003 T2558 oass.IndexSchema.readSchema Reading Solr Schema
[junit4:junit4]   2> 1010 T2558 oass.IndexSchema.readSchema Schema name=test
[junit4:junit4]   2> 1698 T2558 oass.OpenExchangeRatesOrgProvider.init Initialized with rates=open-exchange-rates.json, refreshInterval=1440.
[junit4:junit4]   2> 1711 T2558 oass.IndexSchema.readSchema default search field in schema is text
[junit4:junit4]   2> 1715 T2558 oass.IndexSchema.readSchema unique key field: id
[junit4:junit4]   2> 1728 T2558 oass.FileExchangeRateProvider.reload Reloading exchange rates from file currency.xml
[junit4:junit4]   2> 1733 T2558 oass.FileExchangeRateProvider.reload Reloading exchange rates from file currency.xml
[junit4:junit4]   2> 1737 T2558 oass.OpenExchangeRatesOrgProvider.reload Reloading exchange rates from open-exchange-rates.json
[junit4:junit4]   2> 1739 T2558 oass.OpenExchangeRatesOrgProvider.reload Reloading exchange rates from open-exchange-rates.json
[junit4:junit4]   2> 1740 T2558 oasc.SolrCore.<init> [collection1] Opening new SolrCore at /usr/home/hudson/hudson-slave/workspace/Lucene-Solr-Tests-4.x-java7/solr/build/solr-core/test/J1/./org.apache.solr.cloud.SyncSliceTest-controljetty-1355781770819/collection1/, dataDir=./org.apache.solr.cloud.SyncSliceTest-1355781770504/control/data/
[junit4:junit4]   2> 1740 T2558 oasc.JmxMonitoredMap.<init> JMX monitoring is enabled. Adding Solr mbeans to JMX Server: com.sun.jmx.mbeanserver.JmxMBeanServer@1afa578a
[junit4:junit4]   2> 1741 T2558 oasc.SolrCore.initDirectoryFactory solr.NRTCachingDirectoryFactory
[junit4:junit4]   2> 1742 T2558 oasc.CachingDirectoryFactory.get return new directory for /usr/home/hudson/hudson-slave/workspace/Lucene-Solr-Tests-4.x-java7/solr/build/solr-core/test/J1/./org.apache.solr.cloud.SyncSliceTest-1355781770504/control/data forceNew:false
[junit4:junit4]   2> 1743 T2558 oasc.CachingDirectoryFactory.close Releasing directory:/usr/home/hudson/hudson-slave/workspace/Lucene-Solr-Tests-4.x-java7/solr/build/solr-core/test/J1/./org.apache.solr.cloud.SyncSliceTest-1355781770504/control/data
[junit4:junit4]   2> 1743 T2558 oasc.SolrCore.getNewIndexDir New index directory detected: old=null new=./org.apache.solr.cloud.SyncSliceTest-1355781770504/control/data/index/
[junit4:junit4]   2> 1744 T2558 oasc.SolrCore.initIndex WARNING [collection1] Solr index directory './org.apache.solr.cloud.SyncSliceTest-1355781770504/control/data/index' doesn't exist. Creating new index...
[junit4:junit4]   2> 1745 T2558 oasc.CachingDirectoryFactory.get return new directory for /usr/home/hudson/hudson-slave/workspace/Lucene-Solr-Tests-4.x-java7/solr/build/solr-core/test/J1/./org.apache.solr.cloud.SyncSliceTest-1355781770504/control/data/index forceNew:false
[junit4:junit4]   2> 1770 T2558 oasc.SolrDeletionPolicy.onCommit SolrDeletionPolicy.onCommit: commits:num=1
[junit4:junit4]   2> 		commit{dir=RateLimitedDirectoryWrapper(NRTCachingDirectory(org.apache.lucene.store.NIOFSDirectory@/usr/home/hudson/hudson-slave/workspace/Lucene-Solr-Tests-4.x-java7/solr/build/solr-core/test/J1/org.apache.solr.cloud.SyncSliceTest-1355781770504/control/data/index lockFactory=org.apache.lucene.store.NativeFSLockFactory@331c755c; maxCacheMB=48.0 maxMergeSizeMB=4.0)),segFN=segments_1,generation=1,filenames=[segments_1]
[junit4:junit4]   2> 1771 T2558 oasc.SolrDeletionPolicy.updateCommits newest commit = 1[segments_1]
[junit4:junit4]   2> 1772 T2558 oasc.CachingDirectoryFactory.close Releasing directory:/usr/home/hudson/hudson-slave/workspace/Lucene-Solr-Tests-4.x-java7/solr/build/solr-core/test/J1/./org.apache.solr.cloud.SyncSliceTest-1355781770504/control/data/index
[junit4:junit4]   2> 1772 T2558 oasc.SolrCore.initWriters created xml: solr.XMLResponseWriter
[junit4:junit4]   2> 1774 T2558 oasup.UpdateRequestProcessorChain.init inserting DistributedUpdateProcessorFactory into updateRequestProcessorChain "dedupe"
[junit4:junit4]   2> 1774 T2558 oasup.UpdateRequestProcessorChain.init inserting DistributedUpdateProcessorFactory into updateRequestProcessorChain "dedupe-allfields"
[junit4:junit4]   2> 1775 T2558 oasup.UpdateRequestProcessorChain.init inserting DistributedUpdateProcessorFactory into updateRequestProcessorChain "stored_sig"
[junit4:junit4]   2> 1775 T2558 oasup.UpdateRequestProcessorChain.init inserting DistributedUpdateProcessorFactory into updateRequestProcessorChain "uniq-fields"
[junit4:junit4]   2> 1776 T2558 oasup.UpdateRequestProcessorChain.init inserting DistributedUpdateProcessorFactory into updateRequestProcessorChain "distrib-dup-test-chain-implicit"
[junit4:junit4]   2> 1776 T2558 oasc.RequestHandlers.initHandlersFromConfig adding lazy requestHandler: solr.ReplicationHandler
[junit4:junit4]   2> 1776 T2558 oasc.RequestHandlers.initHandlersFromConfig created /replication: solr.ReplicationHandler
[junit4:junit4]   2> 1777 T2558 oasc.RequestHandlers.initHandlersFromConfig created standard: solr.StandardRequestHandler
[junit4:junit4]   2> 1778 T2558 oasc.RequestHandlers.initHandlersFromConfig created /get: solr.RealTimeGetHandler
[junit4:junit4]   2> 1779 T2558 oasc.RequestHandlers.initHandlersFromConfig created dismax: solr.SearchHandler
[junit4:junit4]   2> 1780 T2558 oasc.RequestHandlers.initHandlersFromConfig created mock: org.apache.solr.core.MockQuerySenderListenerReqHandler
[junit4:junit4]   2> 1780 T2558 oasc.RequestHandlers.initHandlersFromConfig created /admin/: org.apache.solr.handler.admin.AdminHandlers
[junit4:junit4]   2> 1781 T2558 oasc.RequestHandlers.initHandlersFromConfig created defaults: solr.StandardRequestHandler
[junit4:junit4]   2> 1782 T2558 oasc.RequestHandlers.initHandlersFromConfig adding lazy requestHandler: solr.StandardRequestHandler
[junit4:junit4]   2> 1782 T2558 oasc.RequestHandlers.initHandlersFromConfig created lazy: solr.StandardRequestHandler
[junit4:junit4]   2> 1783 T2558 oasc.RequestHandlers.initHandlersFromConfig created /update: solr.UpdateRequestHandler
[junit4:junit4]   2> 1784 T2558 oasc.RequestHandlers.initHandlersFromConfig created /terms: org.apache.solr.handler.component.SearchHandler
[junit4:junit4]   2> 1784 T2558 oasc.RequestHandlers.initHandlersFromConfig created spellCheckCompRH: org.apache.solr.handler.component.SearchHandler
[junit4:junit4]   2> 1785 T2558 oasc.RequestHandlers.initHandlersFromConfig created spellCheckCompRH_Direct: org.apache.solr.handler.component.SearchHandler
[junit4:junit4]   2> 1786 T2558 oasc.RequestHandlers.initHandlersFromConfig created spellCheckWithWordbreak: org.apache.solr.handler.component.SearchHandler
[junit4:junit4]   2> 1787 T2558 oasc.RequestHandlers.initHandlersFromConfig created spellCheckWithWordbreak_Direct: org.apache.solr.handler.component.SearchHandler
[junit4:junit4]   2> 1788 T2558 oasc.RequestHandlers.initHandlersFromConfig created spellCheckCompRH1: org.apache.solr.handler.component.SearchHandler
[junit4:junit4]   2> 1789 T2558 oasc.RequestHandlers.initHandlersFromConfig created mltrh: org.apache.solr.handler.component.SearchHandler
[junit4:junit4]   2> 1789 T2558 oasc.RequestHandlers.initHandlersFromConfig created tvrh: org.apache.solr.handler.component.SearchHandler
[junit4:junit4]   2> 1790 T2558 oasc.RequestHandlers.initHandlersFromConfig created /mlt: solr.MoreLikeThisHandler
[junit4:junit4]   2> 1791 T2558 oasc.RequestHandlers.initHandlersFromConfig created /debug/dump: solr.DumpRequestHandler
[junit4:junit4]   2> 1804 T2558 oashl.XMLLoader.init xsltCacheLifetimeSeconds=60
[junit4:junit4]   2> 1809 T2558 oasc.SolrCore.initDeprecatedSupport WARNING solrconfig.xml uses deprecated <admin/gettableFiles>, Please update your config to use the ShowFileRequestHandler.
[junit4:junit4]   2> 1810 T2558 oasc.SolrCore.initDeprecatedSupport WARNING adding ShowFileRequestHandler with hidden files: [SCHEMA.XML, OLD_SYNONYMS.TXT, STOPWORDS.TXT, PROTWORDS.TXT, OPEN-EXCHANGE-RATES.JSON, SYNONYMS.TXT, CURRENCY.XML, MAPPING-ISOLATIN1ACCENT.TXT]
[junit4:junit4]   2> 1813 T2558 oasc.CachingDirectoryFactory.close Releasing directory:/usr/home/hudson/hudson-slave/workspace/Lucene-Solr-Tests-4.x-java7/solr/build/solr-core/test/J1/./org.apache.solr.cloud.SyncSliceTest-1355781770504/control/data
[junit4:junit4]   2> 1815 T2558 oass.SolrIndexSearcher.<init> Opening Searcher@7c87b903 main
[junit4:junit4]   2> 1816 T2558 oasu.CommitTracker.<init> Hard AutoCommit: disabled
[junit4:junit4]   2> 1817 T2558 oasu.CommitTracker.<init> Soft AutoCommit: disabled
[junit4:junit4]   2> 1817 T2558 oashc.SpellCheckComponent.inform Initializing spell checkers
[junit4:junit4]   2> 1824 T2558 oass.DirectSolrSpellChecker.init init: {name=direct,classname=DirectSolrSpellChecker,field=lowerfilt,minQueryLength=3}
[junit4:junit4]   2> 1877 T2559 oasc.SolrCore.registerSearcher [collection1] Registered new searcher Searcher@7c87b903 main{StandardDirectoryReader(segments_1:1)}
[junit4:junit4]   2> 1881 T2558 oasc.ZkController.publish publishing core=collection1 state=down
[junit4:junit4]   2> 1881 T2558 oasc.ZkController.publish numShards not found on descriptor - reading it from system property
[junit4:junit4]   2> 1882 T2538 oazs.PrepRequestProcessor.pRequest Got user-level KeeperException when processing sessionid:0x13baae40d0d0003 type:create cxid:0x56 zxid:0x29 txntype:-1 reqpath:n/a Error Path:/solr/overseer/queue Error:KeeperErrorCode = NoNode for /solr/overseer/queue
[junit4:junit4]   2> 2271 T2556 oascc.ZkStateReader.updateClusterState Updating cloud state from ZooKeeper... 
[junit4:junit4]   2> 2272 T2556 oasc.Overseer$ClusterStateUpdater.updateState Update state numShards=1 message={
[junit4:junit4]   2> 	  "operation":"state",
[junit4:junit4]   2> 	  "numShards":"1",
[junit4:junit4]   2> 	  "shard":null,
[junit4:junit4]   2> 	  "roles":null,
[junit4:junit4]   2> 	  "state":"down",
[junit4:junit4]   2> 	  "core":"collection1",
[junit4:junit4]   2> 	  "collection":"control_collection",
[junit4:junit4]   2> 	  "node_name":"127.0.0.1:32009_hh_ov%2Fxj",
[junit4:junit4]   2> 	  "base_url":"http://127.0.0.1:32009/hh_ov/xj"}
[junit4:junit4]   2> 2272 T2556 oasc.Overseer$ClusterStateUpdater.createCollection Create collection control_collection with numShards 1
[junit4:junit4]   2> 2272 T2556 oasc.Overseer$ClusterStateUpdater.updateState Assigning new node to shard shard=shard1
[junit4:junit4]   2> 2273 T2538 oazs.PrepRequestProcessor.pRequest Got user-level KeeperException when processing sessionid:0x13baae40d0d0003 type:create cxid:0x5e zxid:0x2c txntype:-1 reqpath:n/a Error Path:/solr/overseer/queue-work Error:KeeperErrorCode = NoNode for /solr/overseer/queue-work
[junit4:junit4]   2> 2287 T2555 oascc.ZkStateReader$2.process A cluster state change: WatchedEvent state:SyncConnected type:NodeDataChanged path:/clusterstate.json, has occurred - updating... (live nodes size: 1)
[junit4:junit4]   2> 2395 T2558 oasc.CoreContainer.registerCore registering core: collection1
[junit4:junit4]   2> 2395 T2558 oasc.ZkController.register Register shard - core:collection1 address:http://127.0.0.1:32009/hh_ov/xj shardId:shard1
[junit4:junit4]   2> 2396 T2558 oascc.SolrZkClient.makePath makePath: /collections/control_collection/leader_elect/shard1/election
[junit4:junit4]   2> 2411 T2538 oazs.PrepRequestProcessor.pRequest Got user-level KeeperException when processing sessionid:0x13baae40d0d0003 type:delete cxid:0x78 zxid:0x36 txntype:-1 reqpath:n/a Error Path:/solr/collections/control_collection/leaders Error:KeeperErrorCode = NoNode for /solr/collections/control_collection/leaders
[junit4:junit4]   2> 2412 T2558 oasc.ShardLeaderElectionContext.runLeaderProcess Running the leader process.
[junit4:junit4]   2> 2413 T2538 oazs.PrepRequestProcessor.pRequest Got user-level KeeperException when processing sessionid:0x13baae40d0d0003 type:create cxid:0x79 zxid:0x37 txntype:-1 reqpath:n/a Error Path:/solr/overseer Error:KeeperErrorCode = NodeExists for /solr/overseer
[junit4:junit4]   2> 2425 T2558 oasc.ShardLeaderElectionContext.waitForReplicasToComeUp Enough replicas found to continue.
[junit4:junit4]   2> 2426 T2558 oasc.ShardLeaderElectionContext.runLeaderProcess I may be the new leader - try and sync
[junit4:junit4]   2> 2426 T2558 oasc.SyncStrategy.sync Sync replicas to http://127.0.0.1:32009/hh_ov/xj/collection1/
[junit4:junit4]   2> 2426 T2558 oasc.SyncStrategy.syncReplicas Sync Success - now sync replicas to me
[junit4:junit4]   2> 2426 T2558 oasc.SyncStrategy.syncToMe http://127.0.0.1:32009/hh_ov/xj/collection1/ has no replicas
[junit4:junit4]   2> 2426 T2558 oasc.ShardLeaderElectionContext.runLeaderProcess I am the new leader: http://127.0.0.1:32009/hh_ov/xj/collection1/
[junit4:junit4]   2> 2427 T2558 oascc.SolrZkClient.makePath makePath: /collections/control_collection/leaders/shard1
[junit4:junit4]   2> 2436 T2538 oazs.PrepRequestProcessor.pRequest Got user-level KeeperException when processing sessionid:0x13baae40d0d0003 type:create cxid:0x83 zxid:0x3b txntype:-1 reqpath:n/a Error Path:/solr/overseer Error:KeeperErrorCode = NodeExists for /solr/overseer
[junit4:junit4]   2> 2791 T2556 oascc.ZkStateReader.updateClusterState Updating cloud state from ZooKeeper... 
[junit4:junit4]   2> 2808 T2555 oascc.ZkStateReader$2.process A cluster state change: WatchedEvent state:SyncConnected type:NodeDataChanged path:/clusterstate.json, has occurred - updating... (live nodes size: 1)
[junit4:junit4]   2> 2846 T2558 oasc.ZkController.register We are http://127.0.0.1:32009/hh_ov/xj/collection1/ and leader is http://127.0.0.1:32009/hh_ov/xj/collection1/
[junit4:junit4]   2> 2846 T2558 oasc.ZkController.register No LogReplay needed for core=collection1 baseURL=http://127.0.0.1:32009/hh_ov/xj
[junit4:junit4]   2> 2846 T2558 oasc.ZkController.checkRecovery I am the leader, no recovery necessary
[junit4:junit4]   2> 2847 T2558 oasc.ZkController.publish publishing core=collection1 state=active
[junit4:junit4]   2> 2847 T2558 oasc.ZkController.publish numShards not found on descriptor - reading it from system property
[junit4:junit4]   2> 2849 T2558 oascc.ZkStateReader.updateClusterState Updating cloud state from ZooKeeper... 
[junit4:junit4]   2> 2850 T2533 oass.SolrDispatchFilter.init user.dir=/usr/home/hudson/hudson-slave/workspace/Lucene-Solr-Tests-4.x-java7/solr/build/solr-core/test/J1
[junit4:junit4]   2> 2851 T2533 oass.SolrDispatchFilter.init SolrDispatchFilter.init() done
[junit4:junit4]   2> 2851 T2533 oascsi.HttpClientUtil.createClient Creating new http client, config:maxConnections=128&maxConnectionsPerHost=32&followRedirects=false
[junit4:junit4]   2> 2860 T2533 oascsi.HttpClientUtil.createClient Creating new http client, config:
[junit4:junit4]   2> 2867 T2533 oaz.ZooKeeper.<init> Initiating client connection, connectString=127.0.0.1:32005/solr sessionTimeout=10000 watcher=org.apache.solr.common.cloud.ConnectionManager@1616bfe2
[junit4:junit4]   2> 2867 T2533 oascc.ConnectionManager.waitForConnected Waiting for client to connect to ZooKeeper
[junit4:junit4]   2> 2868 T2560 oaz.ClientCnxn$SendThread.logStartConnect Opening socket connection to server localhost/127.0.0.1:32005. Will not attempt to authenticate using SASL (access denied ("javax.security.auth.AuthPermission" "getLoginConfiguration"))
[junit4:junit4]   2> 2868 T2560 oaz.ClientCnxn$SendThread.primeConnection Socket connection established to localhost/127.0.0.1:32005, initiating session
[junit4:junit4]   2> 2869 T2535 oazs.NIOServerCnxnFactory.run Accepted socket connection from /140.211.11.196:32012
[junit4:junit4]   2> 2869 T2535 oazs.ZooKeeperServer.processConnectRequest Client attempting to establish new session at /140.211.11.196:32012
[junit4:junit4]   2> 2870 T2537 oazs.ZooKeeperServer.finishSessionInit Established session 0x13baae40d0d0004 with negotiated timeout 10000 for client /140.211.11.196:32012
[junit4:junit4]   2> 2870 T2560 oaz.ClientCnxn$SendThread.onConnected Session establishment complete on server localhost/127.0.0.1:32005, sessionid = 0x13baae40d0d0004, negotiated timeout = 10000
[junit4:junit4]   2> 2870 T2561 oascc.ConnectionManager.process Watcher org.apache.solr.common.cloud.ConnectionManager@1616bfe2 name:ZooKeeperConnection Watcher:127.0.0.1:32005/solr got event WatchedEvent state:SyncConnected type:None path:null path:null type:None
[junit4:junit4]   2> 2871 T2533 oascc.ConnectionManager.waitForConnected Client is connected to ZooKeeper
[junit4:junit4]   2> 2872 T2533 oascc.ZkStateReader.createClusterStateWatchersAndUpdate Updating cluster state from ZooKeeper... 
[junit4:junit4]   2> 2873 T2533 oasc.ChaosMonkey.monkeyLog monkey: init - expire sessions:true cause connection loss:true
[junit4:junit4]   2> 2983 T2533 oejs.Server.doStart jetty-8.1.8.v20121106
[junit4:junit4]   2> 2985 T2533 oejs.AbstractConnector.doStart Started SocketConnector@127.0.0.1:32013
[junit4:junit4]   2> 2986 T2533 oasc.SolrResourceLoader.locateSolrHome JNDI not configured for solr (NoInitialContextEx)
[junit4:junit4]   2> 2987 T2533 oasc.SolrResourceLoader.locateSolrHome using system property solr.solr.home: /usr/home/hudson/hudson-slave/workspace/Lucene-Solr-Tests-4.x-java7/solr/build/solr-core/test/J1/./org.apache.solr.cloud.SyncSliceTest-jetty1-1355781773373
[junit4:junit4]   2> 2987 T2533 oasc.SolrResourceLoader.<init> new SolrResourceLoader for deduced Solr Home: '/usr/home/hudson/hudson-slave/workspace/Lucene-Solr-Tests-4.x-java7/solr/build/solr-core/test/J1/./org.apache.solr.cloud.SyncSliceTest-jetty1-1355781773373/'
[junit4:junit4]   2> 3015 T2533 oass.SolrDispatchFilter.init SolrDispatchFilter.init()
[junit4:junit4]   2> 3015 T2533 oasc.SolrResourceLoader.locateSolrHome JNDI not configured for solr (NoInitialContextEx)
[junit4:junit4]   2> 3016 T2533 oasc.SolrResourceLoader.locateSolrHome using system property solr.solr.home: /usr/home/hudson/hudson-slave/workspace/Lucene-Solr-Tests-4.x-java7/solr/build/solr-core/test/J1/./org.apache.solr.cloud.SyncSliceTest-jetty1-1355781773373
[junit4:junit4]   2> 3016 T2533 oasc.CoreContainer$Initializer.initialize looking for solr.xml: /usr/home/hudson/hudson-slave/workspace/Lucene-Solr-Tests-4.x-java7/solr/build/solr-core/test/J1/./org.apache.solr.cloud.SyncSliceTest-jetty1-1355781773373/solr.xml
[junit4:junit4]   2> 3017 T2533 oasc.CoreContainer.<init> New CoreContainer 222631496
[junit4:junit4]   2> 3017 T2533 oasc.CoreContainer.load Loading CoreContainer using Solr Home: '/usr/home/hudson/hudson-slave/workspace/Lucene-Solr-Tests-4.x-java7/solr/build/solr-core/test/J1/./org.apache.solr.cloud.SyncSliceTest-jetty1-1355781773373/'
[junit4:junit4]   2> 3018 T2533 oasc.SolrResourceLoader.<init> new SolrResourceLoader for directory: '/usr/home/hudson/hudson-slave/workspace/Lucene-Solr-Tests-4.x-java7/solr/build/solr-core/test/J1/./org.apache.solr.cloud.SyncSliceTest-jetty1-1355781773373/'
[junit4:junit4]   2> 3037 T2533 oashc.HttpShardHandlerFactory.getParameter Setting socketTimeout to: 30000
[junit4:junit4]   2> 3038 T2533 oashc.HttpShardHandlerFactory.getParameter Setting urlScheme to: http://
[junit4:junit4]   2> 3039 T2533 oashc.HttpShardHandlerFactory.getParameter Setting connTimeout to: 15000
[junit4:junit4]   2> 3039 T2533 oashc.HttpShardHandlerFactory.getParameter Setting maxConnectionsPerHost to: 20
[junit4:junit4]   2> 3039 T2533 oashc.HttpShardHandlerFactory.getParameter Setting corePoolSize to: 0
[junit4:junit4]   2> 3040 T2533 oashc.HttpShardHandlerFactory.getParameter Setting maximumPoolSize to: 2147483647
[junit4:junit4]   2> 3040 T2533 oashc.HttpShardHandlerFactory.getParameter Setting maxThreadIdleTime to: 5
[junit4:junit4]   2> 3041 T2533 oashc.HttpShardHandlerFactory.getParameter Setting sizeOfQueue to: -1
[junit4:junit4]   2> 3041 T2533 oashc.HttpShardHandlerFactory.getParameter Setting fairnessPolicy to: false
[junit4:junit4]   2> 3041 T2533 oascsi.HttpClientUtil.createClient Creating new http client, config:maxConnectionsPerHost=20&maxConnections=10000&socketTimeout=30000&connTimeout=15000&retry=false
[junit4:junit4]   2> 3055 T2533 oasc.CoreContainer.load Registering Log Listener
[junit4:junit4]   2> 3069 T2533 oasc.CoreContainer.initZooKeeper Zookeeper client=127.0.0.1:32005/solr
[junit4:junit4]   2> 3070 T2533 oasc.ZkController.checkChrootPath zkHost includes chroot
[junit4:junit4]   2> 3070 T2533 oaz.ZooKeeper.<init> Initiating client connection, connectString=127.0.0.1:32005 sessionTimeout=60000 watcher=org.apache.solr.common.cloud.ConnectionManager@5b38e98a
[junit4:junit4]   2> 3071 T2533 oascc.ConnectionManager.waitForConnected Waiting for client to connect to ZooKeeper
[junit4:junit4]   2> 3072 T2571 oaz.ClientCnxn$SendThread.logStartConnect Opening socket connection to server localhost/127.0.0.1:32005. Will not attempt to authenticate using SASL (access denied ("javax.security.auth.AuthPermission" "getLoginConfiguration"))
[junit4:junit4]   2> 3072 T2571 oaz.ClientCnxn$SendThread.primeConnection Socket connection established to localhost/127.0.0.1:32005, initiating session
[junit4:junit4]   2> 3072 T2535 oazs.NIOServerCnxnFactory.run Accepted socket connection from /140.211.11.196:32014
[junit4:junit4]   2> 3073 T2535 oazs.ZooKeeperServer.processConnectRequest Client attempting to establish new session at /140.211.11.196:32014
[junit4:junit4]   2> 3075 T2537 oazs.ZooKeeperServer.finishSessionInit Established session 0x13baae40d0d0005 with negotiated timeout 20000 for client /140.211.11.196:32014
[junit4:junit4]   2> 3075 T2571 oaz.ClientCnxn$SendThread.onConnected Session establishment complete on server localhost/127.0.0.1:32005, sessionid = 0x13baae40d0d0005, negotiated timeout = 20000
[junit4:junit4]   2> 3075 T2572 oascc.ConnectionManager.process Watcher org.apache.solr.common.cloud.ConnectionManager@5b38e98a name:ZooKeeperConnection Watcher:127.0.0.1:32005 got event WatchedEvent state:SyncConnected type:None path:null path:null type:None
[junit4:junit4]   2> 3076 T2533 oascc.ConnectionManager.waitForConnected Client is connected to ZooKeeper
[junit4:junit4]   2> 3077 T2538 oazs.PrepRequestProcessor.pRequest2Txn Processed session termination for sessionid: 0x13baae40d0d0005
[junit4:junit4]   2> 3088 T2572 oaz.ClientCnxn$EventThread.run EventThread shut down
[junit4:junit4]   2> 3088 T2535 oazs.NIOServerCnxn.closeSock Closed socket connection for client /140.211.11.196:32014 which had sessionid 0x13baae40d0d0005
[junit4:junit4]   2> 3088 T2533 oaz.ZooKeeper.close Session: 0x13baae40d0d0005 closed
[junit4:junit4]   2> 3089 T2533 oascsi.HttpClientUtil.createClient Creating new http client, config:maxConnections=500&maxConnectionsPerHost=16&socketTimeout=15000&connTimeout=30000
[junit4:junit4]   2> 3095 T2533 oaz.ZooKeeper.<init> Initiating client connection, connectString=127.0.0.1:32005/solr sessionTimeout=30000 watcher=org.apache.solr.common.cloud.ConnectionManager@6b70339c
[junit4:junit4]   2> 3096 T2533 oascc.ConnectionManager.waitForConnected Waiting for client to connect to ZooKeeper
[junit4:junit4]   2> 3096 T2573 oaz.ClientCnxn$SendThread.logStartConnect Opening socket connection to server localhost/127.0.0.1:32005. Will not attempt to authenticate using SASL (access denied ("javax.security.auth.AuthPermission" "getLoginConfiguration"))
[junit4:junit4]   2> 3097 T2573 oaz.ClientCnxn$SendThread.primeConnection Socket connection established to localhost/127.0.0.1:32005, initiating session
[junit4:junit4]   2> 3097 T2535 oazs.NIOServerCnxnFactory.run Accepted socket connection from /140.211.11.196:32015
[junit4:junit4]   2> 3098 T2535 oazs.ZooKeeperServer.processConnectRequest Client attempting to establish new session at /140.211.11.196:32015
[junit4:junit4]   2> 3099 T2537 oazs.ZooKeeperServer.finishSessionInit Established session 0x13baae40d0d0006 with negotiated timeout 20000 for client /140.211.11.196:32015
[junit4:junit4]   2> 3099 T2573 oaz.ClientCnxn$SendThread.onConnected Session establishment complete on server localhost/127.0.0.1:32005, sessionid = 0x13baae40d0d0006, negotiated timeout = 20000
[junit4:junit4]   2> 3099 T2574 oascc.ConnectionManager.process Watcher org.apache.solr.common.cloud.ConnectionManager@6b70339c name:ZooKeeperConnection Watcher:127.0.0.1:32005/solr got event WatchedEvent state:SyncConnected type:None path:null path:null type:None
[junit4:junit4]   2> 3099 T2533 oascc.ConnectionManager.waitForConnected Client is connected to ZooKeeper
[junit4:junit4]   2> 3100 T2538 oazs.PrepRequestProcessor.pRequest Got user-level KeeperException when processing sessionid:0x13baae40d0d0006 type:create cxid:0x1 zxid:0x49 txntype:-1 reqpath:n/a Error Path:/solr/overseer Error:KeeperErrorCode = NodeExists for /solr/overseer
[junit4:junit4]   2> 3101 T2538 oazs.PrepRequestProcessor.pRequest Got user-level KeeperException when processing sessionid:0x13baae40d0d0006 type:create cxid:0x2 zxid:0x4a txntype:-1 reqpath:n/a Error Path:/solr/overseer Error:KeeperErrorCode = NodeExists for /solr/overseer
[junit4:junit4]   2> 3111 T2533 oasc.ZkController.createEphemeralLiveNode Register node as live in ZooKeeper:/live_nodes/127.0.0.1:32013_hh_ov%2Fxj
[junit4:junit4]   2> 3111 T2538 oazs.PrepRequestProcessor.pRequest Got user-level KeeperException when processing sessionid:0x13baae40d0d0006 type:delete cxid:0x4 zxid:0x4b txntype:-1 reqpath:n/a Error Path:/solr/live_nodes/127.0.0.1:32013_hh_ov%2Fxj Error:KeeperErrorCode = NoNode for /solr/live_nodes/127.0.0.1:32013_hh_ov%2Fxj
[junit4:junit4]   2> 3112 T2533 oascc.SolrZkClient.makePath makePath: /live_nodes/127.0.0.1:32013_hh_ov%2Fxj
[junit4:junit4]   2> 3115 T2555 oascc.ZkStateReader$3.process Updating live nodes... (2)
[junit4:junit4]   2> 3115 T2561 oascc.ZkStateReader$3.process Updating live nodes... (2)
[junit4:junit4]   2> 3116 T2555 oascc.ZkStateReader$2.process A cluster state change: WatchedEvent state:SyncConnected type:NodeChildrenChanged path:/live_nodes, has occurred - updating... (live nodes size: 2)
[junit4:junit4]   2> 3119 T2533 oascc.ZkStateReader.createClusterStateWatchersAndUpdate Updating cluster state from ZooKeeper... 
[junit4:junit4]   2> 3125 T2575 oasc.CoreContainer.create Creating SolrCore 'collection1' using instanceDir: /usr/home/hudson/hudson-slave/workspace/Lucene-Solr-Tests-4.x-java7/solr/build/solr-core/test/J1/./org.apache.solr.cloud.SyncSliceTest-jetty1-1355781773373/collection1
[junit4:junit4]   2> 3125 T2575 oasc.ZkController.createCollectionZkNode Check for collection zkNode:collection1
[junit4:junit4]   2> 3126 T2575 oasc.ZkController.createCollectionZkNode Collection zkNode exists
[junit4:junit4]   2> 3126 T2575 oasc.ZkController.readConfigName Load collection config from:/collections/collection1
[junit4:junit4]   2> 3127 T2575 oasc.SolrResourceLoader.<init> new SolrResourceLoader for directory: '/usr/home/hudson/hudson-slave/workspace/Lucene-Solr-Tests-4.x-java7/solr/build/solr-core/test/J1/./org.apache.solr.cloud.SyncSliceTest-jetty1-1355781773373/collection1/'
[junit4:junit4]   2> 3129 T2575 oasc.SolrResourceLoader.replaceClassLoader Adding 'file:/usr/home/hudson/hudson-slave/workspace/Lucene-Solr-Tests-4.x-java7/solr/build/solr-core/test/J1/org.apache.solr.cloud.SyncSliceTest-jetty1-1355781773373/collection1/lib/README' to classloader
[junit4:junit4]   2> 3129 T2575 oasc.SolrResourceLoader.replaceClassLoader Adding 'file:/usr/home/hudson/hudson-slave/workspace/Lucene-Solr-Tests-4.x-java7/solr/build/solr-core/test/J1/org.apache.solr.cloud.SyncSliceTest-jetty1-1355781773373/collection1/lib/classes/' to classloader
[junit4:junit4]   2> 3182 T2575 oasc.SolrConfig.<init> Using Lucene MatchVersion: LUCENE_41
[junit4:junit4]   2> 3254 T2575 oasc.SolrConfig.<init> Loaded SolrConfig: solrconfig.xml
[junit4:junit4]   2> 3321 T2556 oascc.ZkStateReader.updateClusterState Updating cloud state from ZooKeeper... 
[junit4:junit4]   2> 3322 T2556 oasc.Overseer$ClusterStateUpdater.updateState Update state numShards=1 message={
[junit4:junit4]   2> 	  "operation":"state",
[junit4:junit4]   2> 	  "numShards":"1",
[junit4:junit4]   2> 	  "shard":"shard1",
[junit4:junit4]   2> 	  "roles":null,
[junit4:junit4]   2> 	  "state":"active",
[junit4:junit4]   2> 	  "core":"collection1",
[junit4:junit4]   2> 	  "collection":"control_collection",
[junit4:junit4]   2> 	  "node_name":"127.0.0.1:32009_hh_ov%2Fxj",
[junit4:junit4]   2> 	  "base_url":"http://127.0.0.1:32009/hh_ov/xj"}
[junit4:junit4]   2> 3335 T2555 oascc.ZkStateReader$2.process A cluster state change: WatchedEvent state:SyncConnected type:NodeDataChanged path:/clusterstate.json, has occurred - updating... (live nodes size: 2)
[junit4:junit4]   2> 3335 T2561 oascc.ZkStateReader$2.process A cluster state change: WatchedEvent state:SyncConnected type:NodeDataChanged path:/clusterstate.json, has occurred - updating... (live nodes size: 2)
[junit4:junit4]   2> 3355 T2575 oass.IndexSchema.readSchema Reading Solr Schema
[junit4:junit4]   2> 3355 T2574 oascc.ZkStateReader$2.process A cluster state change: WatchedEvent state:SyncConnected type:NodeDataChanged path:/clusterstate.json, has occurred - updating... (live nodes size: 2)
[junit4:junit4]   2> 3362 T2575 oass.IndexSchema.readSchema Schema name=test
[junit4:junit4]   2> 3996 T2575 oass.OpenExchangeRatesOrgProvider.init Initialized with rates=open-exchange-rates.json, refreshInterval=1440.
[junit4:junit4]   2> 4008 T2575 oass.IndexSchema.readSchema default search field in schema is text
[junit4:junit4]   2> 4012 T2575 oass.IndexSchema.readSchema unique key field: id
[junit4:junit4]   2> 4025 T2575 oass.FileExchangeRateProvider.reload Reloading exchange rates from file currency.xml
[junit4:junit4]   2> 4030 T2575 oass.FileExchangeRateProvider.reload Reloading exchange rates from file currency.xml
[junit4:junit4]   2> 4035 T2575 oass.OpenExchangeRatesOrgProvider.reload Reloading exchange rates from open-exchange-rates.json
[junit4:junit4]   2> 4036 T2575 oass.OpenExchangeRatesOrgProvider.reload Reloading exchange rates from open-exchange-rates.json
[junit4:junit4]   2> 4037 T2575 oasc.SolrCore.<init> [collection1] Opening new SolrCore at /usr/home/hudson/hudson-slave/workspace/Lucene-Solr-Tests-4.x-java7/solr/build/solr-core/test/J1/./org.apache.solr.cloud.SyncSliceTest-jetty1-1355781773373/collection1/, dataDir=./org.apache.solr.cloud.SyncSliceTest-1355781770504/jetty1/
[junit4:junit4]   2> 4038 T2575 oasc.JmxMonitoredMap.<init> JMX monitoring is enabled. Adding Solr mbeans to JMX Server: com.sun.jmx.mbeanserver.JmxMBeanServer@1afa578a
[junit4:junit4]   2> 4038 T2575 oasc.SolrCore.initDirectoryFactory solr.NRTCachingDirectoryFactory
[junit4:junit4]   2> 4039 T2575 oasc.CachingDirectoryFactory.get return new directory for /usr/home/hudson/hudson-slave/workspace/Lucene-Solr-Tests-4.x-java7/solr/build/solr-core/test/J1/./org.apache.solr.cloud.SyncSliceTest-1355781770504/jetty1 forceNew:false
[junit4:junit4]   2> 4040 T2575 oasc.CachingDirectoryFactory.close Releasing directory:/usr/home/hudson/hudson-slave/workspace/Lucene-Solr-Tests-4.x-java7/solr/build/solr-core/test/J1/./org.apache.solr.cloud.SyncSliceTest-1355781770504/jetty1
[junit4:junit4]   2> 4040 T2575 oasc.SolrCore.getNewIndexDir New index directory detected: old=null new=./org.apache.solr.cloud.SyncSliceTest-1355781770504/jetty1/index/
[junit4:junit4]   2> 4041 T2575 oasc.SolrCore.initIndex WARNING [collection1] Solr index directory './org.apache.solr.cloud.SyncSliceTest-1355781770504/jetty1/index' doesn't exist. Creating new index...
[junit4:junit4]   2> 4042 T2575 oasc.CachingDirectoryFactory.get return new directory for /usr/home/hudson/hudson-slave/workspace/Lucene-Solr-Tests-4.x-java7/solr/build/solr-core/test/J1/./org.apache.solr.cloud.SyncSliceTest-1355781770504/jetty1/index forceNew:false
[junit4:junit4]   2> 4064 T2575 oasc.SolrDeletionPolicy.onCommit SolrDeletionPolicy.onCommit: commits:num=1
[junit4:junit4]   2> 		commit{dir=RateLimitedDirectoryWrapper(NRTCachingDirectory(org.apache.lucene.store.NIOFSDirectory@/usr/home/hudson/hudson-slave/workspace/Lucene-Solr-Tests-4.x-java7/solr/build/solr-core/test/J1/org.apache.solr.cloud.SyncSliceTest-1355781770504/jetty1/index lockFactory=org.apache.lucene.store.NativeFSLockFactory@59130c74; maxCacheMB=48.0 maxMergeSizeMB=4.0)),segFN=segments_1,generation=1,filenames=[segments_1]
[junit4:junit4]   2> 4065 T2575 oasc.SolrDeletionPolicy.updateCommits newest commit = 1[segments_1]
[junit4:junit4]   2> 4065 T2575 oasc.CachingDirectoryFactory.close Releasing directory:/usr/home/hudson/hudson-slave/workspace/Lucene-Solr-Tests-4.x-java7/solr/build/solr-core/test/J1/./org.apache.solr.cloud.SyncSliceTest-1355781770504/jetty1/index
[junit4:junit4]   2> 4066 T2575 oasc.SolrCore.initWriters created xml: solr.XMLResponseWriter
[junit4:junit4]   2> 4068 T2575 oasup.UpdateRequestProcessorChain.init inserting DistributedUpdateProcessorFactory into updateRequestProcessorChain "dedupe"
[junit4:junit4]   2> 4068 T2575 oasup.UpdateRequestProcessorChain.init inserting DistributedUpdateProcessorFactory into updateRequestProcessorChain "dedupe-allfields"
[junit4:junit4]   2> 4068 T2575 oasup.UpdateRequestProcessorChain.init inserting DistributedUpdateProcessorFactory into updateRequestProcessorChain "stored_sig"
[junit4:junit4]   2> 4069 T2575 oasup.UpdateRequestProcessorChain.init inserting DistributedUpdateProcessorFactory into updateRequestProcessorChain "uniq-fields"
[junit4:junit4]   2> 4070 T2575 oasup.UpdateRequestProcessorChain.init inserting DistributedUpdateProcessorFactory into updateRequestProcessorChain "distrib-dup-test-chain-implicit"
[junit4:junit4]   2> 4070 T2575 oasc.RequestHandlers.initHandlersFromConfig adding lazy requestHandler: solr.ReplicationHandler
[junit4:junit4]   2> 4070 T2575 oasc.RequestHandlers.initHandlersFromConfig created /replication: solr.ReplicationHandler
[junit4:junit4]   2> 4071 T2575 oasc.RequestHandlers.initHandlersFromConfig created standard: solr.StandardRequestHandler
[junit4:junit4]   2> 4072 T2575 oasc.RequestHandlers.initHandlersFromConfig created /get: solr.RealTimeGetHandler
[junit4:junit4]   2> 4073 T2575 oasc.RequestHandlers.initHandlersFromConfig created dismax: solr.SearchHandler
[junit4:junit4]   2> 4074 T2575 oasc.RequestHandlers.initHandlersFromConfig created mock: org.apache.solr.core.MockQuerySenderListenerReqHandler
[junit4:junit4]   2> 4075 T2575 oasc.RequestHandlers.initHandlersFromConfig created /admin/: org.apache.solr.handler.admin.AdminHandlers
[junit4:junit4]   2> 4076 T2575 oasc.RequestHandlers.initHandlersFromConfig created defaults: solr.StandardRequestHandler
[junit4:junit4]   2> 4076 T2575 oasc.RequestHandlers.initHandlersFromConfig adding lazy requestHandler: solr.StandardRequestHandler
[junit4:junit4]   2> 4076 T2575 oasc.RequestHandlers.initHandlersFromConfig created lazy: solr.StandardRequestHandler
[junit4:junit4]   2> 4077 T2575 oasc.RequestHandlers.initHandlersFromConfig created /update: solr.UpdateRequestHandler
[junit4:junit4]   2> 4078 T2575 oasc.RequestHandlers.initHandlersFromConfig created /terms: org.apache.solr.handler.component.SearchHandler
[junit4:junit4]   2> 4079 T2575 oasc.RequestHandlers.initHandlersFromConfig created spellCheckCompRH: org.apache.solr.handler.component.SearchHandler
[junit4:junit4]   2> 4080 T2575 oasc.RequestHandlers.initHandlersFromConfig created spellCheckCompRH_Direct: org.apache.solr.handler.component.SearchHandler
[junit4:junit4]   2> 4081 T2575 oasc.RequestHandlers.initHandlersFromConfig created spellCheckWithWordbreak: org.apache.solr.handler.component.SearchHandler
[junit4:junit4]   2> 4082 T2575 oasc.RequestHandlers.initHandlersFromConfig created spellCheckWithWordbreak_Direct: org.apache.solr.handler.component.SearchHandler
[junit4:junit4]   2> 4083 T2575 oasc.RequestHandlers.initHandlersFromConfig created spellCheckCompRH1: org.apache.solr.handler.component.SearchHandler
[junit4:junit4]   2> 4084 T2575 oasc.RequestHandlers.initHandlersFromConfig created mltrh: org.apache.solr.handler.component.SearchHandler
[junit4:junit4]   2> 4084 T2575 oasc.RequestHandlers.initHandlersFromConfig created tvrh: org.apache.solr.handler.component.SearchHandler
[junit4:junit4]   2> 4085 T2575 oasc.RequestHandlers.initHandlersFromConfig created /mlt: solr.MoreLikeThisHandler
[junit4:junit4]   2> 4086 T2575 oasc.RequestHandlers.initHandlersFromConfig created /debug/dump: solr.DumpRequestHandler
[junit4:junit4]   2> 4099 T2575 oashl.XMLLoader.init xsltCacheLifetimeSeconds=60
[junit4:junit4]   2> 4104 T2575 oasc.SolrCore.initDeprecatedSupport WARNING solrconfig.xml uses deprecated <admin/gettableFiles>, Please update your config to use the ShowFileRequestHandler.
[junit4:junit4]   2> 4105 T2575 oasc.SolrCore.initDeprecatedSupport WARNING adding ShowFileRequestHandler with hidden files: [SCHEMA.XML, OLD_SYNONYMS.TXT, STOPWORDS.TXT, PROTWORDS.TXT, OPEN-EXCHANGE-RATES.JSON, SYNONYMS.TXT, CURRENCY.XML, MAPPING-ISOLATIN1ACCENT.TXT]
[junit4:junit4]   2> 4108 T2575 oasc.CachingDirectoryFactory.close Releasing directory:/usr/home/hudson/hudson-slave/workspace/Lucene-Solr-Tests-4.x-java7/solr/build/solr-core/test/J1/./org.apache.solr.cloud.SyncSliceTest-1355781770504/jetty1
[junit4:junit4]   2> 4110 T2575 oass.SolrIndexSearcher.<init> Opening Searcher@6db1bcee main
[junit4:junit4]   2> 4111 T2575 oasu.CommitTracker.<init> Hard AutoCommit: disabled
[junit4:junit4]   2> 4111 T2575 oasu.CommitTracker.<init> Soft AutoCommit: disabled
[junit4:junit4]   2> 4112 T2575 oashc.SpellCheckComponent.inform Initializing spell checkers
[junit4:junit4]   2> 4119 T2575 oass.DirectSolrSpellChecker.init init: {name=direct,classname=DirectSolrSpellChecker,field=lowerfilt,minQueryLength=3}
[junit4:junit4]   2> 4192 T2576 oasc.SolrCore.registerSearcher [collection1] Registered new searcher Searcher@6db1bcee main{StandardDirectoryReader(segments_1:1)}
[junit4:junit4]   2> 4197 T2575 oasc.ZkController.publish publishing core=collection1 state=down
[junit4:junit4]   2> 4197 T2575 oasc.ZkController.publish numShards not found on descriptor - reading it from system property
[junit4:junit4]   2> 4360 T2556 oascc.ZkStateReader.updateClusterState Updating cloud state from ZooKeeper... 
[junit4:junit4]   2> 4361 T2556 oasc.Overseer$ClusterStateUpdater.updateState Update state numShards=1 message={
[junit4:junit4]   2> 	  "operation":"state",
[junit4:junit4]   2> 	  "numShards":"1",
[junit4:junit4]   2> 	  "shard":null,
[junit4:junit4]   2> 	  "roles":null,
[junit4:junit4]   2> 	  "state":"down",
[junit4:junit4]   2> 	  "core":"collection1",
[junit4:junit4]   2> 	  "collection":"collection1",
[junit4:junit4]   2> 	  "node_name":"127.0.0.1:32013_hh_ov%2Fxj",
[junit4:junit4]   2> 	  "base_url":"http://127.0.0.1:32013/hh_ov/xj"}
[junit4:junit4]   2> 4361 T2556 oasc.Overseer$ClusterStateUpdater.createCollection Create collection collection1 with numShards 1
[junit4:junit4]   2> 4361 T2556 oasc.Overseer$ClusterStateUpdater.updateState Assigning new node to shard shard=shard1
[junit4:junit4]   2> 4374 T2574 oascc.ZkStateReader$2.process A cluster state change: WatchedEvent state:SyncConnected type:NodeDataChanged path:/clusterstate.json, has occurred - updating... (live nodes size: 2)
[junit4:junit4]   2> 4374 T2561 oascc.ZkStateReader$2.process A cluster state change: WatchedEvent state:SyncConnected type:NodeDataChanged path:/clusterstate.json, has occurred - updating... (live nodes size: 2)
[junit4:junit4]   2> 4374 T2555 oascc.ZkStateReader$2.process A cluster state change: WatchedEvent state:SyncConnected type:NodeDataChanged path:/clusterstate.json, has occurred - updating... (live nodes size: 2)
[junit4:junit4]   2> 4700 T2575 oasc.CoreContainer.registerCore registering core: collection1
[junit4:junit4]   2> 4700 T2575 oasc.ZkController.register Register shard - core:collection1 address:http://127.0.0.1:32013/hh_ov/xj shardId:shard1
[junit4:junit4]   2> 4701 T2575 oascc.SolrZkClient.makePath makePath: /collections/collection1/leader_elect/shard1/election
[junit4:junit4]   2> 4717 T2538 oazs.PrepRequestProcessor.pRequest Got user-level KeeperException when processing sessionid:0x13baae40d0d0006 type:delete cxid:0x45 zxid:0x5b txntype:-1 reqpath:n/a Error Path:/solr/collections/collection1/leaders Error:KeeperErrorCode = NoNode for /solr/collections/collection1/leaders
[junit4:junit4]   2> 4717 T2575 oasc.ShardLeaderElectionContext.runLeaderProcess Running the leader process.
[junit4:junit4]   2> 4718 T2538 oazs.PrepRequestProcessor.pRequest Got user-level KeeperException when processing sessionid:0x13baae40d0d0006 type:create cxid:0x46 zxid:0x5c txntype:-1 reqpath:n/a Error Path:/solr/overseer Error:KeeperErrorCode = NodeExists for /solr/overseer
[junit4:junit4]   2> 4729 T2575 oasc.ShardLeaderElectionContext.waitForReplicasToComeUp Enough replicas found to continue.
[junit4:junit4]   2> 4729 T2575 oasc.ShardLeaderElectionContext.runLeaderProcess I may be the new leader - try and sync
[junit4:junit4]   2> 4730 T2575 oasc.SyncStrategy.sync Sync replicas to http://127.0.0.1:32013/hh_ov/xj/collection1/
[junit4:junit4]   2> 4730 T2575 oasc.SyncStrategy.syncReplicas Sync Success - now sync replicas to me
[junit4:junit4]   2> 4730 T2575 oasc.SyncStrategy.syncToMe http://127.0.0.1:32013/hh_ov/xj/collection1/ has no replicas
[junit4:junit4]   2> 4730 T2575 oasc.ShardLeaderElectionContext.runLeaderProcess I am the new leader: http://127.0.0.1:32013/hh_ov/xj/collection1/
[junit4:junit4]   2> 4731 T2575 oascc.SolrZkClient.makePath makePath: /collections/collection1/leaders/shard1
[junit4:junit4]   2> 4734 T2538 oazs.PrepRequestProcessor.pRequest Got user-level KeeperException when processing sessionid:0x13baae40d0d0006 type:create cxid:0x50 zxid:0x60 txntype:-1 reqpath:n/a Error Path:/solr/overseer Error:KeeperErrorCode = NodeExists for /solr/overseer
[junit4:junit4]   2> 4878 T2556 oascc.ZkStateReader.updateClusterState Updating cloud state from ZooKeeper... 
[junit4:junit4]   2> 4893 T2574 oascc.ZkStateReader$2.process A cluster state change: WatchedEvent state:SyncConnected type:NodeDataChanged path:/clusterstate.json, has occurred - updating... (live nodes size: 2)
[junit4:junit4]   2> 4893 T2555 oascc.ZkStateReader$2.process A cluster state change: WatchedEvent state:SyncConnected type:NodeDataChanged path:/clusterstate.json, has occurred - updating... (live nodes size: 2)
[junit4:junit4]   2> 4893 T2561 oascc.ZkStateReader$2.process A cluster state change: WatchedEvent state:SyncConnected type:NodeDataChanged path:/clusterstate.json, has occurred - updating... (live nodes size: 2)
[junit4:junit4]   2> 4941 T2575 oasc.ZkController.register We are http://127.0.0.1:32013/hh_ov/xj/collection1/ and leader is http://127.0.0.1:32013/hh_ov/xj/collection1/
[junit4:junit4]   2> 4941 T2575 oasc.ZkController.register No LogReplay needed for core=collection1 baseURL=http://127.0.0.1:32013/hh_ov/xj
[junit4:junit4]   2> 4941 T2575 oasc.ZkController.checkRecovery I am the leader, no recovery necessary
[junit4:junit4]   2> 4942 T2575 oasc.ZkController.publish publishing core=collection1 state=active
[junit4:junit4]   2> 4942 T2575 oasc.ZkController.publish numShards not found on descriptor - reading it from system property
[junit4:junit4]   2> 4944 T2575 oascc.ZkStateReader.updateClusterState Updating cloud state from ZooKeeper... 
[junit4:junit4]   2> 4945 T2533 oass.SolrDispatchFilter.init user.dir=/usr/home/hudson/hudson-slave/workspace/Lucene-Solr-Tests-4.x-java7/solr/build/solr-core/test/J1
[junit4:junit4]   2> 4946 T2533 oass.SolrDispatchFilter.init SolrDispatchFilter.init() done
[junit4:junit4]   2> 4946 T2533 oascsi.HttpClientUtil.createClient Creating new http client, config:maxConnections=128&maxConnectionsPerHost=32&followRedirects=false
[junit4:junit4]   2> 5065 T2533 oejs.Server.doStart jetty-8.1.8.v20121106
[junit4:junit4]   2> 5068 T2533 oejs.AbstractConnector.doStart Started SocketConnector@127.0.0.1:32019
[junit4:junit4]   2> 5068 T2533 oasc.SolrResourceLoader.locateSolrHome JNDI not configured for solr (NoInitialContextEx)
[junit4:junit4]   2> 5069 T2533 oasc.SolrResourceLoader.locateSolrHome using system property solr.solr.home: /usr/home/hudson/hudson-slave/workspace/Lucene-Solr-Tests-4.x-java7/solr/build/solr-core/test/J1/./org.apache.solr.cloud.SyncSliceTest-jetty2-1355781775456
[junit4:junit4]   2> 5069 T2533 oasc.SolrResourceLoader.<init> new SolrResourceLoader for deduced Solr Home: '/usr/home/hudson/hudson-slave/workspace/Lucene-Solr-Tests-4.x-java7/solr/build/solr-core/test/J1/./org.apache.solr.cloud.SyncSliceTest-jetty2-1355781775456/'
[junit4:junit4]   2> 5097 T2533 oass.SolrDispatchFilter.init SolrDispatchFilter.init()
[junit4:junit4]   2> 5098 T2533 oasc.SolrResourceLoader.locateSolrHome JNDI not configured for solr (NoInitialContextEx)
[junit4:junit4]   2> 5098 T2533 oasc.SolrResourceLoader.locateSolrHome using system property solr.solr.home: /usr/home/hudson/hudson-slave/workspace/Lucene-Solr-Tests-4.x-java7/solr/build/solr-core/test/J1/./org.apache.solr.cloud.SyncSliceTest-jetty2-1355781775456
[junit4:junit4]   2> 5099 T2533 oasc.CoreContainer$Initializer.initialize looking for solr.xml: /usr/home/hudson/hudson-slave/workspace/Lucene-Solr-Tests-4.x-java7/solr/build/solr-core/test/J1/./org.apache.solr.cloud.SyncSliceTest-jetty2-1355781775456/solr.xml
[junit4:junit4]   2> 5099 T2533 oasc.CoreContainer.<init> New CoreContainer 483790259
[junit4:junit4]   2> 5100 T2533 oasc.CoreContainer.load Loading CoreContainer using Solr Home: '/usr/home/hudson/hudson-slave/workspace/Lucene-Solr-Tests-4.x-java7/solr/build/solr-core/test/J1/./org.apache.solr.cloud.SyncSliceTest-jetty2-1355781775456/'
[junit4:junit4]   2> 5100 T2533 oasc.SolrResourceLoader.<init> new SolrResourceLoader for directory: '/usr/home/hudson/hudson-slave/workspace/Lucene-Solr-Tests-4.x-java7/solr/build/solr-core/test/J1/./org.apache.solr.cloud.SyncSliceTest-jetty2-1355781775456/'
[junit4:junit4]   2> 5120 T2533 oashc.HttpShardHandlerFactory.getParameter Setting socketTimeout to: 30000
[junit4:junit4]   2> 5121 T2533 oashc.HttpShardHandlerFactory.getParameter Setting urlScheme to: http://
[junit4:junit4]   2> 5121 T2533 oashc.HttpShardHandlerFactory.getParameter Setting connTimeout to: 15000
[junit4:junit4]   2> 5122 T2533 oashc.HttpShardHandlerFactory.getParameter Setting maxConnectionsPerHost to: 20
[junit4:junit4]   2> 5122 T2533 oashc.HttpShardHandlerFactory.getParameter Setting corePoolSize to: 0
[junit4:junit4]   2> 5123 T2533 oashc.HttpShardHandlerFactory.getParameter Setting maximumPoolSize to: 2147483647
[junit4:junit4]   2> 5123 T2533 oashc.HttpShardHandlerFactory.getParameter Setting maxThreadIdleTime to: 5
[junit4:junit4]   2> 5123 T2533 oashc.HttpShardHandlerFactory.getParameter Setting sizeOfQueue to: -1
[junit4:junit4]   2> 5124 T2533 oashc.HttpShardHandlerFactory.getParameter Setting fairnessPolicy to: false
[junit4:junit4]   2> 5124 T2533 oascsi.HttpClientUtil.createClient Creating new http client, config:maxConnectionsPerHost=20&maxConnections=10000&socketTimeout=30000&connTimeout=15000&retry=false
[junit4:junit4]   2> 5138 T2533 oasc.CoreContainer.load Registering Log Listener
[junit4:junit4]   2> 5152 T2533 oasc.CoreContainer.initZooKeeper Zookeeper client=127.0.0.1:32005/solr
[junit4:junit4]   2> 5152 T2533 oasc.ZkController.checkChrootPath zkHost includes chroot
[junit4:junit4]   2> 5153 T2533 oaz.ZooKeeper.<init> Initiating client connection, connectString=127.0.0.1:32005 sessionTimeout=60000 watcher=org.apache.solr.common.cloud.ConnectionManager@401e2ff6
[junit4:junit4]   2> 5154 T2533 oascc.ConnectionManager.waitForConnected Waiting for client to connect to ZooKeeper
[junit4:junit4]   2> 5154 T2586 oaz.ClientCnxn$SendThread.logStartConnect Opening socket connection to server localhost/127.0.0.1:32005. Will not attempt to authenticate using SASL (access denied ("javax.security.auth.AuthPermission" "getLoginConfiguration"))
[junit4:junit4]   2> 5155 T2586 oaz.ClientCnxn$SendThread.primeConnection Socket connection established to localhost/127.0.0.1:32005, initiating session
[junit4:junit4]   2> 5155 T2535 oazs.NIOServerCnxnFactory.run Accepted socket connection from /140.211.11.196:32020
[junit4:junit4]   2> 5156 T2535 oazs.ZooKeeperServer.processConnectRequest Client attempting to establish new session at /140.211.11.196:32020
[junit4:junit4]   2> 5158 T2537 oazs.ZooKeeperServer.finishSessionInit Established session 0x13baae40d0d0007 with negotiated timeout 20000 for client /140.211.11.196:32020
[junit4:junit4]   2> 5158 T2586 oaz.ClientCnxn$SendThread.onConnected Session establishment complete on server localhost/127.0.0.1:32005, sessionid = 0x13baae40d0d0007, negotiated timeout = 20000
[junit4:junit4]   2> 5158 T2587 oascc.ConnectionManager.process Watcher org.apache.solr.common.cloud.ConnectionManager@401e2ff6 name:ZooKeeperConnection Watcher:127.0.0.1:32005 got event WatchedEvent state:SyncConnected type:None path:null path:null type:None
[junit4:junit4]   2> 5158 T2533 oascc.ConnectionManager.waitForConnected Client is connected to ZooKeeper
[junit4:junit4]   2> 5159 T2538 oazs.PrepRequestProcessor.pRequest2Txn Processed session termination for sessionid: 0x13baae40d0d0007
[junit4:junit4]   2> 5172 T2587 oaz.ClientCnxn$EventThread.run EventThread shut down
[junit4:junit4]   2> 5172 T2535 oazs.NIOServerCnxn.closeSock Closed socket connection for client /140.211.11.196:32020 which had sessionid 0x13baae40d0d0007
[junit4:junit4]   2> 5172 T2533 oaz.ZooKeeper.close Session: 0x13baae40d0d0007 closed
[junit4:junit4]   2> 5173 T2533 oascsi.HttpClientUtil.createClient Creating new http client, config:maxConnections=500&maxConnectionsPerHost=16&socketTimeout=15000&connTimeout=30000
[junit4:junit4]   2> 5179 T2533 oaz.ZooKeeper.<init> Initiating client connection, connectString=127.0.0.1:32005/solr sessionTimeout=30000 watcher=org.apache.solr.common.cloud.ConnectionManager@115a7e6a
[junit4:junit4]   2> 5180 T2533 oascc.ConnectionManager.waitForConnected Waiting for client to connect to ZooKeeper
[junit4:junit4]   2> 5181 T2588 oaz.ClientCnxn$SendThread.logStartConnect Opening socket connection to server localhost/127.0.0.1:32005. Will not attempt to authenticate using SASL (access denied ("javax.security.auth.AuthPermission" "getLoginConfiguration"))
[junit4:junit4]   2> 5181 T2588 oaz.ClientCnxn$SendThread.primeConnection Socket connection established to localhost/127.0.0.1:32005, initiating session
[junit4:junit4]   2> 5181 T2535 oazs.NIOServerCnxnFactory.run Accepted socket connection from /140.211.11.196:32021
[junit4:junit4]   2> 5182 T2535 oazs.ZooKeeperServer.processConnectRequest Client attempting to establish new session at /140.211.11.196:32021
[junit4:junit4]   2> 5183 T2537 oazs.ZooKeeperServer.finishSessionInit Established session 0x13baae40d0d0008 with negotiated timeout 20000 for client /140.211.11.196:32021
[junit4:junit4]   2> 5183 T2588 oaz.ClientCnxn$SendThread.onConnected Session establishment complete on server localhost/127.0.0.1:32005, sessionid = 0x13baae40d0d0008, negotiated timeout = 20000
[junit4:junit4]   2> 5184 T2589 oascc.ConnectionManager.process Watcher org.apache.solr.common.cloud.ConnectionManager@115a7e6a name:ZooKeeperConnection Watcher:127.0.0.1:32005/solr got event WatchedEvent state:SyncConnected type:None path:null path:null type:None
[junit4:junit4]   2> 5184 T2533 oascc.ConnectionManager.waitForConnected Client is connected to ZooKeeper
[junit4:junit4]   2> 5185 T2538 oazs.PrepRequestProcessor.pRequest Got user-level KeeperException when processing sessionid:0x13baae40d0d0008 type:create cxid:0x1 zxid:0x6d txntype:-1 reqpath:n/a Error Path:/solr/overseer Error:KeeperErrorCode = NodeExists for /solr/overseer
[junit4:junit4]   2> 5186 T2538 oazs.PrepRequestProcessor.pRequest Got user-level KeeperException when processing sessionid:0x13baae40d0d0008 type:create cxid:0x2 zxid:0x6e txntype:-1 reqpath:n/a Error Path:/solr/overseer Error:KeeperErrorCode = NodeExists for /solr/overseer
[junit4:junit4]   2> 5187 T2533 oasc.ZkController.createEphemeralLiveNode Register node as live in ZooKeeper:/live_nodes/127.0.0.1:32019_hh_ov%2Fxj
[junit4:junit4]   2> 5188 T2538 oazs.PrepRequestProcessor.pRequest Got user-level KeeperException when processing sessionid:0x13baae40d0d0008 type:delete cxid:0x4 zxid:0x6f txntype:-1 reqpath:n/a Error Path:/solr/live_nodes/127.0.0.1:32019_hh_ov%2Fxj Error:KeeperErrorCode = NoNode for /solr/live_nodes/127.0.0.1:32019_hh_ov%2Fxj
[junit4:junit4]   2> 5197 T2533 oascc.SolrZkClient.makePath makePath: /live_nodes/127.0.0.1:32019_hh_ov%2Fxj
[junit4:junit4]   2> 5200 T2574 oascc.ZkStateReader$3.process Updating live nodes... (3)
[junit4:junit4]   2> 5200 T2555 oascc.ZkStateReader$3.process Updating live nodes... (3)
[junit4:junit4]   2> 5200 T2561 oascc.ZkStateReader$3.process Updating live nodes... (3)
[junit4:junit4]   2> 5200 T2574 oascc.ZkStateReader$2.process A cluster state change: WatchedEvent state:SyncConnected type:NodeChildrenChanged path:/live_nodes, has occurred - updating... (live nodes size: 3)
[junit4:junit4]   2> 5200 T2561 oascc.ZkStateReader$2.process A cluster state change: WatchedEvent state:SyncConnected type:NodeChildrenChanged path:/live_nodes, has occurred - updating... (live nodes size: 3)
[junit4:junit4]   2> 5200 T2555 oascc.ZkStateReader$2.process A cluster state change: WatchedEvent state:SyncConnected type:NodeChildrenChanged path:/live_nodes, has occurred - updating... (live nodes size: 3)
[junit4:junit4]   2> 5203 T2533 oascc.ZkStateReader.createClusterStateWatchersAndUpdate Updating cluster state from ZooKeeper... 
[junit4:junit4]   2> 5209 T2590 oasc.CoreContainer.create Creating SolrCore 'collection1' using instanceDir: /usr/home/hudson/hudson-slave/workspace/Lucene-Solr-Tests-4.x-java7/solr/build/solr-core/test/J1/./org.apache.solr.cloud.SyncSliceTest-jetty2-1355781775456/collection1
[junit4:junit4]   2> 5209 T2590 oasc.ZkController.createCollectionZkNode Check for collection zkNode:collection1
[junit4:junit4]   2> 5210 T2590 oasc.ZkController.createCollectionZkNode Collection zkNode exists
[junit4:junit4]   2> 5210 T2590 oasc.ZkController.readConfigName Load collection config from:/collections/collection1
[junit4:junit4]   2> 5211 T2590 oasc.SolrResourceLoader.<init> new SolrResourceLoader for directory: '/usr/home/hudson/hudson-slave/workspace/Lucene-Solr-Tests-4.x-java7/solr/build/solr-core/test/J1/./org.apache.solr.cloud.SyncSliceTest-jetty2-1355781775456/collection1/'
[junit4:junit4]   2> 5212 T2590 oasc.SolrResourceLoader.replaceClassLoader Adding 'file:/usr/home/hudson/hudson-slave/workspace/Lucene-Solr-Tests-4.x-java7/solr/build/solr-core/test/J1/org.apache.solr.cloud.SyncSliceTest-jetty2-1355781775456/collection1/lib/classes/' to classloader
[junit4:junit4]   2> 5213 T2590 oasc.SolrResourceLoader.replaceClassLoader Adding 'file:/usr/home/hudson/hudson-slave/workspace/Lucene-Solr-Tests-4.x-java7/solr/build/solr-core/test/J1/org.apache.solr.cloud.SyncSliceTest-jetty2-1355781775456/collection1/lib/README' to classloader
[junit4:junit4]   2> 5266 T2590 oasc.SolrConfig.<init> Using Lucene MatchVersion: LUCENE_41
[junit4:junit4]   2> 5344 T2590 oasc.SolrConfig.<init> Loaded SolrConfig: solrconfig.xml
[junit4:junit4]   2> 5398 T2556 oascc.ZkStateReader.updateClusterState Updating cloud state from ZooKeeper... 
[junit4:junit4]   2> 5399 T2556 oasc.Overseer$ClusterStateUpdater.updateState Update state numShards=1 message={
[junit4:junit4]   2> 	  "operation":"state",
[junit4:junit4]   2> 	  "numShards":"1",
[junit4:junit4]   2> 	  "shard":"shard1",
[junit4:junit4]   2> 	  "roles":null,
[junit4:junit4]   2> 	  "state":"active",
[junit4:junit4]   2> 	  "core":"collection1",
[junit4:junit4]   2> 	  "collection":"collection1",
[junit4:junit4]   2> 	  "node_name":"127.0.0.1:32013_hh_ov%2Fxj",
[junit4:junit4]   2> 	  "base_url":"http://127.0.0.1:32013/hh_ov/xj"}
[junit4:junit4]   2> 5406 T2555 oascc.ZkStateReader$2.process A cluster state change: WatchedEvent state:SyncConnected type:NodeDataChanged path:/clusterstate.json, has occurred - updating... (live nodes size: 3)
[junit4:junit4]   2> 5406 T2561 oascc.ZkStateReader$2.process A cluster state change: WatchedEvent state:SyncConnected type:NodeDataChanged path:/clusterstate.json, has occurred - updating... (live nodes size: 3)
[junit4:junit4]   2> 5406 T2574 oascc.ZkStateReader$2.process A cluster state change: WatchedEvent state:SyncConnected type:NodeDataChanged path:/clusterstate.json, has occurred - updating... (live nodes size: 3)
[junit4:junit4]   2> 5445 T2589 oascc.ZkStateReader$2.process A cluster state change: WatchedEvent state:SyncConnected type:NodeDataChanged path:/clusterstate.json, has occurred - updating... (live nodes size: 3)
[junit4:junit4]   2> 5445 T2590 oass.IndexSchema.readSchema Reading Solr Schema
[junit4:junit4]   2> 5452 T2590 oass.IndexSchema.readSchema Schema name=test
[junit4:junit4]   2> 6104 T2590 oass.OpenExchangeRatesOrgProvider.init Initialized with rates=open-exchange-rates.json, refreshInterval=1440.
[junit4:junit4]   2> 6117 T2590 oass.IndexSchema.readSchema default search field in schema is text
[junit4:junit4]   2> 6121 T2590 oass.IndexSchema.readSchema unique key field: id
[junit4:junit4]   2> 6134 T2590 oass.FileExchangeRateProvider.reload Reloading exchange rates from file currency.xml
[junit4:junit4]   2> 6138 T2590 oass.FileExchangeRateProvider.reload Reloading exchange rates from file currency.xml
[junit4:junit4]   2> 6143 T2590 oass.OpenExchangeRatesOrgProvider.reload Reloading exchange rates from open-exchange-rates.json
[junit4:junit4]   2> 6144 T2590 oass.OpenExchangeRatesOrgProvider.reload Reloading exchange rates from open-exchange-rates.json
[junit4:junit4]   2> 6145 T2590 oasc.SolrCore.<init> [collection1] Opening new SolrCore at /usr/home/hudson/hudson-slave/workspace/Lucene-Solr-Tests-4.x-java7/solr/build/solr-core/test/J1/./org.apache.solr.cloud.SyncSliceTest-jetty2-1355781775456/collection1/, dataDir=./org.apache.solr.cloud.SyncSliceTest-1355781770504/jetty2/
[junit4:junit4]   2> 6146 T2590 oasc.JmxMonitoredMap.<init> JMX monitoring is enabled. Adding Solr mbeans to JMX Server: com.sun.jmx.mbeanserver.JmxMBeanServer@1afa578a
[junit4:junit4]   2> 6146 T2590 oasc.SolrCore.initDirectoryFactory solr.NRTCachingDirectoryFactory
[junit4:junit4]   2> 6147 T2590 oasc.CachingDirectoryFactory.get return new directory for /usr/home/hudson/hudson-slave/workspace/Lucene-Solr-Tests-4.x-java7/solr/build/solr-core/test/J1/./org.apache.solr.cloud.SyncSliceTest-1355781770504/jetty2 forceNew:false
[junit4:junit4]   2> 6148 T2590 oasc.CachingDirectoryFactory.close Releasing directory:/usr/home/hudson/hudson-slave/workspace/Lucene-Solr-Tests-4.x-java7/solr/build/solr-core/test/J1/./org.apache.solr.cloud.SyncSliceTest-1355781770504/jetty2
[junit4:junit4]   2> 6148 T2590 oasc.SolrCore.getNewIndexDir New index directory detected: old=null new=./org.apache.solr.cloud.SyncSliceTest-1355781770504/jetty2/index/
[junit4:junit4]   2> 6149 T2590 oasc.SolrCore.initIndex WARNING [collection1] Solr index directory './org.apache.solr.cloud.SyncSliceTest-1355781770504/jetty2/index' doesn't exist. Creating new index...
[junit4:junit4]   2> 6150 T2590 oasc.CachingDirectoryFactory.get return new directory for /usr/home/hudson/hudson-slave/workspace/Lucene-Solr-Tests-4.x-java7/solr/build/solr-core/test/J1/./org.apache.solr.cloud.SyncSliceTest-1355781770504/jetty2/index forceNew:false
[junit4:junit4]   2> 6160 T2590 oasc.SolrDeletionPolicy.onCommit SolrDeletionPolicy.onCommit: commits:num=1
[junit4:junit4]   2> 		commit{dir=RateLimitedDirectoryWrapper(NRTCachingDirectory(org.apache.lucene.store.NIOFSDirectory@/usr/home/hudson/hudson-slave/workspace/Lucene-Solr-Tests-4.x-java7/solr/build/solr-core/test/J1/org.apache.solr.cloud.SyncSliceTest-1355781770504/jetty2/index lockFactory=org.apache.lucene.store.NativeFSLockFactory@40375d54; maxCacheMB=48.0 maxMergeSizeMB=4.0)),segFN=segments_1,generation=1,filenames=[segments_1]
[junit4:junit4]   2> 6160 T2590 oasc.SolrDeletionPolicy.updateCommits newest commit = 1[segments_1]
[junit4:junit4]   2> 6161 T2590 oasc.CachingDirectoryFactory.close Releasing directory:/usr/home/hudson/hudson-slave/workspace/Lucene-Solr-Tests-4.x-java7/solr/build/solr-core/test/J1/./org.apache.solr.cloud.SyncSliceTest-1355781770504/jetty2/index
[junit4:junit4]   2> 6161 T2590 oasc.SolrCore.initWriters created xml: solr.XMLResponseWriter
[junit4:junit4]   2> 6163 T2590 oasup.UpdateRequestProcessorChain.init inserting DistributedUpdateProcessorFactory into updateRequestProcessorChain "dedupe"
[junit4:junit4]   2> 6163 T2590 oasup.UpdateRequestProcessorChain.init inserting DistributedUpdateProcessorFactory into updateRequestProcessorChain "dedupe-allfields"
[junit4:junit4]   2> 6164 T2590 oasup.UpdateRequestProcessorChain.init inserting DistributedUpdateProcessorFactory into updateRequestProcessorChain "stored_sig"
[junit4:junit4]   2> 6164 T2590 oasup.UpdateRequestProcessorChain.init inserting DistributedUpdateProcessorFactory into updateRequestProcessorChain "uniq-fields"
[junit4:junit4]   2> 6165 T2590 oasup.UpdateRequestProcessorChain.init inserting DistributedUpdateProcessorFactory into updateRequestProcessorChain "distrib-dup-test-chain-implicit"
[junit4:junit4]   2> 6165 T2590 oasc.RequestHandlers.initHandlersFromConfig adding lazy requestHandler: solr.ReplicationHandler
[junit4:junit4]   2> 6165 T2590 oasc.RequestHandlers.initHandlersFromConfig created /replication: solr.ReplicationHandler
[junit4:junit4]   2> 6166 T2590 oasc.RequestHandlers.initHandlersFromConfig created standard: solr.StandardRequestHandler
[junit4:junit4]   2> 6167 T2590 oasc.RequestHandlers.initHandlersFromConfig created /get: solr.RealTimeGetHandler
[junit4:junit4]   2> 6168 T2590 oasc.RequestHandlers.initHandlersFromConfig created dismax: solr.SearchHandler
[junit4:junit4]   2> 6169 T2590 oasc.RequestHandlers.initHandlersFromConfig created mock: org.apache.solr.core.MockQuerySenderListenerReqHandler
[junit4:junit4]   2> 6169 T2590 oasc.RequestHandlers.initHandlersFromConfig created /admin/: org.apache.solr.handler.admin.AdminHandlers
[junit4:junit4]   2> 6170 T2590 oasc.RequestHandlers.initHandlersFromConfig created defaults: solr.StandardRequestHandler
[junit4:junit4]   2> 6171 T2590 oasc.RequestHandlers.initHandlersFromConfig adding lazy requestHandler: solr.StandardRequestHandler
[junit4:junit4]   2> 6171 T2590 oasc.RequestHandlers.initHandlersFromConfig created lazy: solr.StandardRequestHandler
[junit4:junit4]   2> 6172 T2590 oasc.RequestHandlers.initHandlersFromConfig created /update: solr.UpdateRequestHandler
[junit4:junit4]   2> 6173 T2590 oasc.RequestHandlers.initHandlersFromConfig created /terms: org.apache.solr.handler.component.SearchHandler
[junit4:junit4]   2> 6173 T2590 oasc.RequestHandlers.initHandlersFromConfig created spellCheckCompRH: org.apache.solr.handler.component.SearchHandler
[junit4:junit4]   2> 6174 T2590 oasc.RequestHandlers.initHandlersFromConfig created spellCheckCompRH_Direct: org.apache.solr.handler.component.SearchHandler
[junit4:junit4]   2> 6175 T2590 oasc.RequestHandlers.initHandlersFromConfig created spellCheckWithWordbreak: org.apache.solr.handler.component.SearchHandler
[junit4:junit4]   2> 6176 T2590 oasc.RequestHandlers.initHandlersFromConfig created spellCheckWithWordbreak_Direct: org.apache.solr.handler.component.SearchHandler
[junit4:junit4]   2> 6177 T2590 oasc.RequestHandlers.initHandlersFromConfig created spellCheckCompRH1: org.apache.solr.handler.component.SearchHandler
[junit4:junit4]   2> 6178 T2590 oasc.RequestHandlers.initHandlersFromConfig created mltrh: org.apache.solr.handler.component.SearchHandler
[junit4:junit4]   2> 6179 T2590 oasc.RequestHandlers.initHandlersFromConfig created tvrh: org.apache.solr.handler.component.SearchHandler
[junit4:junit4]   2> 6179 T2590 oasc.RequestHandlers.initHandlersFromConfig created /mlt: solr.MoreLikeThisHandler
[junit4:junit4]   2> 6180 T2590 oasc.RequestHandlers.initHandlersFromConfig created /debug/dump: solr.DumpRequestHandler
[junit4:junit4]   2> 6192 T2590 oashl.XMLLoader.init xsltCacheLifetimeSeconds=60
[junit4:junit4]   2> 6197 T2590 oasc.SolrCore.initDeprecatedSupport WARNING solrconfig.xml uses deprecated <admin/gettableFiles>, Please update your config to use the ShowFileRequestHandler.
[junit4:junit4]   2> 6198 T2590 oasc.SolrCore.initDeprecatedSupport WARNING adding ShowFileRequestHandler with hidden files: [SCHEMA.XML, OLD_SYNONYMS.TXT, STOPWORDS.TXT, PROTWORDS.TXT, OPEN-EXCHANGE-RATES.JSON, SYNONYMS.TXT, CURRENCY.XML, MAPPING-ISOLATIN1ACCENT.TXT]
[junit4:junit4]   2> 6200 T2590 oasc.CachingDirectoryFactory.close Releasing directory:/usr/home/hudson/hudson-slave/workspace/Lucene-Solr-Tests-4.x-java7/solr/build/solr-core/test/J1/./org.apache.solr.cloud.SyncSliceTest-1355781770504/jetty2
[junit4:junit4]   2> 6202 T2590 oass.SolrIndexSearcher.<init> Opening Searcher@30b72e44 main
[junit4:junit4]   2> 6203 T2590 oasu.CommitTracker.<init> Hard AutoCommit: disabled
[junit4:junit4]   2> 6203 T2590 oasu.CommitTracker.<init> Soft AutoCommit: disabled
[junit4:junit4]   2> 6204 T2590 oashc.SpellCheckComponent.inform Initializing spell checkers
[junit4:junit4]   2> 6211 T2590 oass.DirectSolrSpellChecker.init init: {name=direct,classname=DirectSolrSpellChecker,field=lowerfilt,minQueryLength=3}
[junit4:junit4]   2> 6264 T2591 oasc.SolrCore.registerSearcher [collection1] Registered new searcher Searcher@30b72e44 main{StandardDirectoryReader(segments_1:1)}
[junit4:junit4]   2> 6268 T2590 oasc.ZkController.publish publishing core=collection1 state=down
[junit4:junit4]   2> 6268 T2590 oasc.ZkController.publish numShards not found on descriptor - reading it from system property
[junit4:junit4]   2> 6451 T2556 oascc.ZkStateReader.updateClusterState Updating cloud state from ZooKeeper... 
[junit4:junit4]   2> 6452 T2556 oasc.Overseer$ClusterStateUpdater.updateState Update state numShards=1 message={
[junit4:junit4]   2> 	  "operation":"state",
[junit4:junit4]   2> 	  "numShards":"1",
[junit4:junit4]   2> 	  "shard":null,
[junit4:junit4]   2> 	  "roles":null,
[junit4:junit4]   2> 	  "state":"down",
[junit4:junit4]   2> 	  "core":"collection1",
[junit4:junit4]   2> 	  "collection":"collection1",
[junit4:junit4]   2> 	  "node_name":"127.0.0.1:32019_hh_ov%2Fxj",
[junit4:junit4]   2> 	  "base_url":"http://127.0.0.1:32019/hh_ov/xj"}
[junit4:junit4]   2> 6452 T2556 oasc.Overseer$ClusterStateUpdater.updateState Collection already exists with numShards=1
[junit4:junit4]   2> 6452 T2556 oasc.Overseer$ClusterStateUpdater.updateState Assigning new node to shard shard=shard1
[junit4:junit4]   2> 6468 T2589 oascc.ZkStateReader$2.process A cluster state change: WatchedEvent state:SyncConnected type:NodeDataChanged path:/clusterstate.json, has occurred - updating... (live nodes size: 3)
[junit4:junit4]   2> 6468 T2574 oascc.ZkStateReader$2.process A cluster state change: WatchedEvent state:SyncConnected type:NodeDataChanged path:/clusterstate.json, has occurred - updating... (live nodes size: 3)
[junit4:junit4]   2> 6468 T2555 oascc.ZkStateReader$2.process A cluster state change: WatchedEvent state:SyncConnected type:NodeDataChanged path:/clusterstate.json, has occurred - updating... (live nodes size: 3)
[junit4:junit4]   2> 6468 T2561 oascc.ZkStateReader$2.process A cluster state change: WatchedEvent state:SyncConnected type:NodeDataChanged path:/clusterstate.json, has occurred - updating... (live nodes size: 3)
[junit4:junit4]   2> 6771 T2590 oasc.CoreContainer.registerCore registering core: collection1
[junit4:junit4]   2> 6771 T2590 oasc.ZkController.register Register shard - core:collection1 address:http://127.0.0.1:32019/hh_ov/xj shardId:shard1
[junit4:junit4]   2> 6774 T2590 oasc.ZkController.register We are http://127.0.0.1:32019/hh_ov/xj/collection1/ and leader is http://127.0.0.1:32013/hh_ov/xj/collection1/
[junit4:junit4]   2> 6774 T2590 oasc.ZkController.register No LogReplay needed for core=collection1 baseURL=http://127.0.0.1:32019/hh_ov/xj
[junit4:junit4]   2> 6774 T2590 oasc.ZkController.checkRecovery Core needs to recover:collection1
[junit4:junit4]   2> 6775 T2590 oasu.DefaultSolrCoreState.doRecovery Running recovery - first canceling any ongoing recovery
[junit4:junit4]   2> ASYNC  NEW_CORE C158 name=collection1 org.apache.solr.core.SolrCore@2c3c0497 url=http://127.0.0.1:32019/hh_ov/xj/collection1 node=127.0.0.1:32019_hh_ov%2Fxj
[junit4:junit4]   2> 6775 T2592 C158 P32019 oasc.RecoveryStrategy.run Starting recovery process.  core=collection1 recoveringAfterStartup=true
[junit4:junit4]   2> 6775 T2590 oascc.ZkStateReader.updateClusterState Updating cloud state from ZooKeeper... 
[junit4:junit4]   2> 6776 T2592 C158 P32019 oasc.RecoveryStrategy.doRecovery ###### startupVersions=[]
[junit4:junit4]   2> 6777 T2592 C158 P32019 oasc.ZkController.publish publishing core=collection1 state=recovering
[junit4:junit4]   2> 6777 T2592 C158 P32019 oasc.ZkController.publish numShards not found on descriptor - reading it from system property
[junit4:junit4]   2> 6777 T2533 oass.SolrDispatchFilter.init user.dir=/usr/home/hudson/hudson-slave/workspace/Lucene-Solr-Tests-4.x-java7/solr/build/solr-core/test/J1
[junit4:junit4]   2> 6778 T2533 oass.SolrDispatchFilter.init SolrDispatchFilter.init() done
[junit4:junit4]   2> 6778 T2533 oascsi.HttpClientUtil.createClient Creating new http client, config:maxConnections=128&maxConnectionsPerHost=32&followRedirects=false
[junit4:junit4]   2> 6782 T2592 C158 P32019 oasc.RecoveryStrategy.doRecovery Attempting to PeerSync from http://127.0.0.1:32013/hh_ov/xj/collection1/ core=collection1 - recoveringAfterStartup=true
[junit4:junit4]   2> 6783 T2592 C158 P32019 oasu.PeerSync.sync PeerSync: core=collection1 url=http://127.0.0.1:32019/hh_ov/xj START replicas=[http://127.0.0.1:32013/hh_ov/xj/collection1/] nUpdates=100
[junit4:junit4]   2> 6783 T2592 C158 P32019 oasu.PeerSync.sync WARNING no frame of reference to tell of we've missed updates
[junit4:junit4]   2> 6783 T2592 C158 P32019 oasc.RecoveryStrategy.doRecovery PeerSync Recovery was not successful - trying replication. core=collection1
[junit4:junit4]   2> 6784 T2592 C158 P32019 oasc.RecoveryStrategy.doRecovery Starting Replication Recovery. core=collection1
[junit4:junit4]   2> 6784 T2592 C158 P32019 oascsi.HttpClientUtil.createClient Creating new http client, config:maxConnections=128&maxConnectionsPerHost=32&followRedirects=false
[junit4:junit4]   2> ASYNC  NEW_CORE C159 name=collection1 org.apache.solr.core.SolrCore@64ef42b1 url=http://127.0.0.1:32013/hh_ov/xj/collection1 node=127.0.0.1:32013_hh_ov%2Fxj
[junit4:junit4]   2> 6799 T2564 C159 P32013 REQ /get {distrib=false&qt=/get&wt=javabin&version=2&getVersions=100} status=0 QTime=0 
[junit4:junit4]   2> 6900 T2533 oejs.Server.doStart jetty-8.1.8.v20121106
[junit4:junit4]   2> 6903 T2533 oejs.AbstractConnector.doStart Started SocketConnector@127.0.0.1:32024
[junit4:junit4]   2> 6904 T2533 oasc.SolrResourceLoader.locateSolrHome JNDI not configured for solr (NoInitialContextEx)
[junit4:junit4]   2> 6904 T2533 oasc.SolrResourceLoader.locateSolrHome using system property solr.solr.home: /usr/home/hudson/hudson-slave/workspace/Lucene-Solr-Tests-4.x-java7/solr/build/solr-core/test/J1/./org.apache.solr.cloud.SyncSliceTest-jetty3-1355781777289
[junit4:junit4]   2> 6905 T2533 oasc.SolrResourceLoader.<init> new SolrResourceLoader for deduced Solr Home: '/usr/home/hudson/hudson-slave/workspace/Lucene-Solr-Tests-4.x-java7/solr/build/solr-core/test/J1/./org.apache.solr.cloud.SyncSliceTest-jetty3-1355781777289/'
[junit4:junit4]   2> 6932 T2533 oass.SolrDispatchFilter.init SolrDispatchFilter.init()
[junit4:junit4]   2> 6933 T2533 oasc.SolrResourceLoader.locateSolrHome JNDI not configured for solr (NoInitialContextEx)
[junit4:junit4]   2> 6933 T2533 oasc.SolrResourceLoader.locateSolrHome using system property solr.solr.home: /usr/home/hudson/hudson-slave/workspace/Lucene-Solr-Tests-4.x-java7/solr/build/solr-core/test/J1/./org.apache.solr.cloud.SyncSliceTest-jetty3-1355781777289
[junit4:junit4]   2> 6934 T2533 oasc.CoreContainer$Initializer.initialize looking for solr.xml: /usr/home/hudson/hudson-slave/workspace/Lucene-Solr-Tests-4.x-java7/solr/build/solr-core/test/J1/./org.apache.solr.cloud.SyncSliceTest-jetty3-1355781777289/solr.xml
[junit4:junit4]   2> 6934 T2533 oasc.CoreContainer.<init> New CoreContainer 490078543
[junit4:junit4]   2> 6935 T2533 oasc.CoreContainer.load Loading CoreContainer using Solr Home: '/usr/home/hudson/hudson-slave/workspace/Lucene-Solr-Tests-4.x-java7/solr/build/solr-core/test/J1/./org.apache.solr.cloud.SyncSliceTest-jetty3-1355781777289/'
[junit4:junit4]   2> 6935 T2533 oasc.SolrResourceLoader.<init> new SolrResourceLoader for directory: '/usr/home/hudson/hudson-slave/workspace/Lucene-Solr-Tests-4.x-java7/solr/build/solr-core/test/J1/./org.apache.solr.cloud.SyncSliceTest-jetty3-1355781777289/'
[junit4:junit4]   2> 6955 T2533 oashc.HttpShardHandlerFactory.getParameter Setting socketTimeout to: 30000
[junit4:junit4]   2> 6956 T2533 oashc.HttpShardHandlerFactory.getParameter Setting urlScheme to: http://
[junit4:junit4]   2> 6956 T2533 oashc.HttpShardHandlerFactory.getParameter Setting connTimeout to: 15000
[junit4:junit4]   2> 6957 T2533 oashc.HttpShardHandlerFactory.getParameter Setting maxConnectionsPerHost to: 20
[junit4:junit4]   2> 6957 T2533 oashc.HttpShardHandlerFactory.getParameter Setting corePoolSize to: 0
[junit4:junit4]   2> 6958 T2533 oashc.HttpShardHandlerFactory.getParameter Setting maximumPoolSize to: 2147483647
[junit4:junit4]   2> 6958 T2533 oashc.HttpShardHandlerFactory.getParameter Setting maxThreadIdleTime to: 5
[junit4:junit4]   2> 6958 T2533 oashc.HttpShardHandlerFactory.getParameter Setting sizeOfQueue to: -1
[junit4:junit4]   2> 6959 T2533 oashc.HttpShardHandlerFactory.getParameter Setting fairnessPolicy to: false
[junit4:junit4]   2> 6959 T2533 oascsi.HttpClientUtil.createClient Creating new http client, config:maxConnectionsPerHost=20&maxConnections=10000&socketTimeout=30000&connTimeout=15000&retry=false
[junit4:junit4]   2> 6972 T2556 oascc.ZkStateReader.updateClusterState Updating cloud state from ZooKeeper... 
[junit4:junit4]   2> 6973 T2556 oasc.Overseer$ClusterStateUpdater.updateState Update state numShards=1 message={
[junit4:junit4]   2> 	  "operation":"state",
[junit4:junit4]   2> 	  "numShards":"1",
[junit4:junit4]   2> 	  "shard":"shard1",
[junit4:junit4]   2> 	  "roles":null,
[junit4:junit4]   2> 	  "state":"recovering",
[junit4:junit4]   2> 	  "core":"collection1",
[junit4:junit4]   2> 	  "collection":"collection1",
[junit4:junit4]   2> 	  "node_name":"127.0.0.1:32019_hh_ov%2Fxj",
[junit4:junit4]   2> 	  "base_url":"http://127.0.0.1:32019/hh_ov/xj"}
[junit4:junit4]   2> 6973 T2533 oasc.CoreContainer.load Registering Log Listener
[junit4:junit4]   2> 6987 T2533 oasc.CoreContainer.initZooKeeper Zookeeper client=127.0.0.1:32005/solr
[junit4:junit4]   2> 6988 T2533 oasc.ZkController.checkChrootPath zkHost includes chroot
[junit4:junit4]   2> 6989 T2533 oaz.ZooKeeper.<init> Initiating client connection, connectString=127.0.0.1:32005 sessionTimeout=60000 watcher=org.apache.solr.common.cloud.ConnectionManager@70e8b66a
[junit4:junit4]   2> 6989 T2533 oascc.ConnectionManager.waitForConnected Waiting for client to connect to ZooKeeper
[junit4:junit4]   2> 6990 T2603 oaz.ClientCnxn$SendThread.logStartConnect Opening socket connection to server localhost/127.0.0.1:32005. Will not attempt to authenticate using SASL (access denied ("javax.security.auth.AuthPermission" "getLoginConfiguration"))
[junit4:junit4]   2> 6990 T2603 oaz.ClientCnxn$SendThread.primeConnection Socket connection established to localhost/127.0.0.1:32005, initiating session
[junit4:junit4]   2> 6991 T2535 oazs.NIOServerCnxnFactory.run Accepted socket connection from /140.211.11.196:32025
[junit4:junit4]   2> 6991 T2535 oazs.ZooKeeperServer.processConnectRequest Client attempting to establish new session at /140.211.11.196:32025
[junit4:junit4]   2> 6992 T2555 oascc.ZkStateReader$2.process A cluster state change: WatchedEvent state:SyncConnected type:NodeDataChanged path:/clusterstate.json, has occurred - updating... (live nodes size: 3)
[junit4:junit4]   2> 6992 T2574 oascc.ZkStateReader$2.process A cluster state change: WatchedEvent state:SyncConnected type:NodeDataChanged path:/clusterstate.json, has occurred - updating... (live nodes size: 3)
[junit4:junit4]   2> 6992 T2589 oascc.ZkStateReader$2.process A cluster state change: WatchedEvent state:SyncConnected type:NodeDataChanged path:/clusterstate.json, has occurred - updating... (live nodes size: 3)
[junit4:junit4]   2> 6992 T2561 oascc.ZkStateReader$2.process A cluster state change: WatchedEvent state:SyncConnected type:NodeDataChanged path:/clusterstate.json, has occurred - updating... (live nodes size: 3)
[junit4:junit4]   2> 6999 T2537 oazs.ZooKeeperServer.finishSessionInit Established session 0x13baae40d0d0009 with negotiated timeout 20000 for client /140.211.11.196:32025
[junit4:junit4]   2> 6999 T2603 oaz.ClientCnxn$SendThread.onConnected Session establishment complete on server localhost/127.0.0.1:32005, sessionid = 0x13baae40d0d0009, negotiated timeout = 20000
[junit4:junit4]   2> 7000 T2604 oascc.ConnectionManager.process Watcher org.apache.solr.common.cloud.ConnectionManager@70e8b66a name:ZooKeeperConnection Watcher:127.0.0.1:32005 got event WatchedEvent state:SyncConnected type:None path:null path:null type:None
[junit4:junit4]   2> 7000 T2533 oascc.ConnectionManager.waitForConnected Client is connected to ZooKeeper
[junit4:junit4]   2> 7002 T2538 oazs.PrepRequestProcessor.pRequest2Txn Processed session termination for sessionid: 0x13baae40d0d0009
[junit4:junit4]   2> 7002 T2535 oazs.NIOServerCnxn.closeSock Closed socket connection for client /140.211.11.196:32025 which had sessionid 0x13baae40d0d0009
[junit4:junit4]   2> 7002 T2604 oaz.ClientCnxn$EventThread.run EventThread shut down
[junit4:junit4]   2> 7002 T2533 oaz.ZooKeeper.close Session: 0x13baae40d0d0009 closed
[junit4:junit4]   2> 7003 T2533 oascsi.HttpClientUtil.createClient Creating new http client, config:maxConnections=500&maxConnectionsPerHost=16&socketTimeout=15000&connTimeout=30000
[junit4:junit4]   2> 7013 T2533 oaz.ZooKeeper.<init> Initiating client connection, connectString=127.0.0.1:32005/solr sessionTimeout=30000 watcher=org.apache.solr.common.cloud.ConnectionManager@24498d6e
[junit4:junit4]   2> 7014 T2533 oascc.ConnectionManager.waitForConnected Waiting for client to connect to ZooKeeper
[junit4:junit4]   2> 7014 T2605 oaz.ClientCnxn$SendThread.logStartConnect Opening socket connection to server localhost/127.0.0.1:32005. Will not attempt to authenticate using SASL (access denied ("javax.security.auth.AuthPermission" "getLoginConfiguration"))
[junit4:junit4]   2> 7015 T2605 oaz.ClientCnxn$SendThread.primeConnection Socket connection established to localhost/127.0.0.1:32005, initiating session
[junit4:junit4]   2> 7015 T2535 oazs.NIOServerCnxnFactory.run Accepted socket connection from /140.211.11.196:32026
[junit4:junit4]   2> 7015 T2535 oazs.ZooKeeperServer.processConnectRequest Client attempting to establish new session at /140.211.11.196:32026
[junit4:junit4]   2> 7016 T2537 oazs.ZooKeeperServer.finishSessionInit Established session 0x13baae40d0d000a with negotiated timeout 20000 for client /140.211.11.196:32026
[junit4:junit4]   2> 7016 T2605 oaz.ClientCnxn$SendThread.onConnected Session establishment complete on server localhost/127.0.0.1:32005, sessionid = 0x13baae40d0d000a, negotiated timeout = 20000
[junit4:junit4]   2> 7017 T2606 oascc.ConnectionManager.process Watcher org.apache.solr.common.cloud.ConnectionManager@24498d6e name:ZooKeeperConnection Watcher:127.0.0.1:32005/solr got event WatchedEvent state:SyncConnected type:None path:null path:null type:None
[junit4:junit4]   2> 7017 T2533 oascc.ConnectionManager.waitForConnected Client is connected to ZooKeeper
[junit4:junit4]   2> 7018 T2538 oazs.PrepRequestProcessor.pRequest Got user-level KeeperException when processing sessionid:0x13baae40d0d000a type:create cxid:0x1 zxid:0x84 txntype:-1 reqpath:n/a Error Path:/solr/overseer Error:KeeperErrorCode = NodeExists for /solr/overseer
[junit4:junit4]   2> 7019 T2538 oazs.PrepRequestProcessor.pRequest Got user-level KeeperException when processing sessionid:0x13baae40d0d000a type:create cxid:0x2 zxid:0x85 txntype:-1 reqpath:n/a Error Path:/solr/overseer Error:KeeperErrorCode = NodeExists for /solr/overseer
[junit4:junit4]   2> 7027 T2533 oasc.ZkController.createEphemeralLiveNode Register node as live in ZooKeeper:/live_nodes/127.0.0.1:32024_hh_ov%2Fxj
[junit4:junit4]   2> 7028 T2538 oazs.PrepRequestProcessor.pRequest Got user-level KeeperException when processing sessionid:0x13baae40d0d000a type:delete cxid:0x4 zxid:0x86 txntype:-1 reqpath:n/a Error Path:/solr/live_nodes/127.0.0.1:32024_hh_ov%2Fxj Error:KeeperErrorCode = NoNode for /solr/live_nodes/127.0.0.1:32024_hh_ov%2Fxj
[junit4:junit4]   2> 7029 T2533 oascc.SolrZkClient.makePath makePath: /live_nodes/127.0.0.1:32024_hh_ov%2Fxj
[junit4:junit4]   2> 7032 T2561 oascc.ZkStateReader$3.process Updating live nodes... (4)
[junit4:junit4]   2> 7032 T2555 oascc.ZkStateReader$3.process Updating live nodes... (4)
[junit4:junit4]   2> 7032 T2574 oascc.ZkStateReader$3.process Updating live nodes... (4)
[junit4:junit4]   2> 7032 T2589 oascc.ZkStateReader$3.process Updating live nodes... (4)
[junit4:junit4]   2> 7032 T2555 oascc.ZkStateReader$2.process A cluster state change: WatchedEvent state:SyncConnected type:NodeChildrenChanged path:/live_nodes, has occurred - updating... (live nodes size: 4)
[junit4:junit4]   2> 7032 T2561 oascc.ZkStateReader$2.process A cluster state change: WatchedEvent state:SyncConnected type:NodeChildrenChanged path:/live_nodes, has occurred - updating... (live nodes size: 4)
[junit4:junit4]   2> 7032 T2589 oascc.ZkStateReader$2.process A cluster state change: WatchedEvent state:SyncConnected type:NodeChildrenChanged path:/live_nodes, has occurred - updating... (live nodes size: 4)
[junit4:junit4]   2> 7032 T2574 oascc.ZkStateReader$2.process A cluster state change: WatchedEvent state:SyncConnected type:NodeChildrenChanged path:/live_nodes, has occurred - updating... (live nodes size: 4)
[junit4:junit4]   2> 7040 T2533 oascc.ZkStateReader.createClusterStateWatchersAndUpdate Updating cluster state from ZooKeeper... 
[junit4:junit4]   2> 7047 T2607 oasc.CoreContainer.create Creating SolrCore 'collection1' using instanceDir: /usr/home/hudson/hudson-slave/workspace/Lucene-Solr-Tests-4.x-java7/solr/build/solr-core/test/J1/./org.apache.solr.cloud.SyncSliceTest-jetty3-1355781777289/collection1
[junit4:junit4]   2> 7047 T2607 oasc.ZkController.createCollectionZkNode Check for collection zkNode:collection1
[junit4:junit4]   2> 7048 T2607 oasc.ZkController.createCollectionZkNode Collection zkNode exists
[junit4:junit4]   2> 7048 T2607 oasc.ZkController.readConfigName Load collection config from:/collections/collection1
[junit4:junit4]   2> 7050 T2607 oasc.SolrResourceLoader.<init> new SolrResourceLoader for directory: '/usr/home/hudson/hudson-slave/workspace/Lucene-Solr-Tests-4.x-java7/solr/build/solr-core/test/J1/./org.apache.solr.cloud.SyncSliceTest-jetty3-1355781777289/collection1/'
[junit4:junit4]   2> 7051 T2607 oasc.SolrResourceLoader.replaceClassLoader Adding 'file:/usr/home/hudson/hudson-slave/workspace/Lucene-Solr-Tests-4.x-java7/solr/build/solr-core/test/J1/org.apache.solr.cloud.SyncSliceTest-jetty3-1355781777289/collection1/lib/classes/' to classloader
[junit4:junit4]   2> 7051 T2607 oasc.SolrResourceLoader.replaceClassLoader Adding 'file:/usr/home/hudson/hudson-slave/workspace/Lucene-Solr-Tests-4.x-java7/solr/build/solr-core/test/J1/org.apache.solr.cloud.SyncSliceTest-jetty3-1355781777289/collection1/lib/README' to classloader
[junit4:junit4]   2> 7100 T2607 oasc.SolrConfig.<init> Using Lucene MatchVersion: LUCENE_41
[junit4:junit4]   2> 7168 T2607 oasc.SolrConfig.<init> Loaded SolrConfig: solrconfig.xml
[junit4:junit4]   2> 7269 T2607 oass.IndexSchema.readSchema Reading Solr Schema
[junit4:junit4]   2> 7275 T2607 oass.IndexSchema.readSchema Schema name=test
[junit4:junit4]   2> 7890 T2607 oass.OpenExchangeRatesOrgProvider.init Initialized with rates=open-exchange-rates.json, refreshInterval=1440.
[junit4:junit4]   2> 7902 T2607 oass.IndexSchema.readSchema default search field in schema is text
[junit4:junit4]   2> 7906 T2607 oass.IndexSchema.readSchema unique key field: id
[junit4:junit4]   2> 7919 T2607 oass.FileExchangeRateProvider.reload Reloading exchange rates from file currency.xml
[junit4:junit4]   2> 7924 T2607 oass.FileExchangeRateProvider.reload Reloading exchange rates from file currency.xml
[junit4:junit4]   2> 7928 T2607 oass.OpenExchangeRatesOrgProvider.reload Reloading exchange rates from open-exchange-rates.json
[junit4:junit4]   2> 7930 T2607 oass.OpenExchangeRatesOrgProvider.reload Reloading exchange rates from open-exchange-rates.json
[junit4:junit4]   2> 7931 T2607 oasc.SolrCore.<init> [collection1] Opening new SolrCore at /usr/home/hudson/hudson-slave/workspace/Lucene-Solr-Tests-4.x-java7/solr/build/solr-core/test/J1/./org.apache.solr.cloud.SyncSliceTest-jetty3-1355781777289/collection1/, dataDir=./org.apache.solr.cloud.SyncSliceTest-1355781770504/jetty3/
[junit4:junit4]   2> 7931 T2607 oasc.JmxMonitoredMap.<init> JMX monitoring is enabled. Adding Solr mbeans to JMX Server: com.sun.jmx.mbeanserver.JmxMBeanServer@1afa578a
[junit4:junit4]   2> 7932 T2607 oasc.SolrCore.initDirectoryFactory solr.NRTCachingDirectoryFactory
[junit4:junit4]   2> 7933 T2607 oasc.CachingDirectoryFactory.get return new directory for /usr/home/hudson/hudson-slave/workspace/Lucene-Solr-Tests-4.x-java7/solr/build/solr-core/test/J1/./org.apache.solr.cloud.SyncSliceTest-1355781770504/jetty3 forceNew:false
[junit4:junit4]   2> 7933 T2607 oasc.CachingDirectoryFactory.close Releasing directory:/usr/home/hudson/hudson-slave/workspace/Lucene-Solr-Tests-4.x-java7/solr/build/solr-core/test/J1/./org.apache.solr.cloud.SyncSliceTest-1355781770504/jetty3
[junit4:junit4]   2> 7934 T2607 oasc.SolrCore.getNewIndexDir New index directory detected: old=null new=./org.apache.solr.cloud.SyncSliceTest-1355781770504/jetty3/index/
[junit4:junit4]   2> 7934 T2607 oasc.SolrCore.initIndex WARNING [collection1] Solr index directory './org.apache.solr.cloud.SyncSliceTest-1355781770504/jetty3/index' doesn't exist. Creating new index...
[junit4:junit4]   2> 7935 T2607 oasc.CachingDirectoryFactory.get return new directory for /usr/home/hudson/hudson-slave/workspace/Lucene-Solr-Tests-4.x-java7/solr/build/solr-core/test/J1/./org.apache.solr.cloud.SyncSliceTest-1355781770504/jetty3/index forceNew:false
[junit4:junit4]   2> 7969 T2607 oasc.SolrDeletionPolicy.onCommit SolrDeletionPolicy.onCommit: commits:num=1
[junit4:junit4]   2> 		commit{dir=RateLimitedDirectoryWrapper(NRTCachingDirectory(org.apache.lucene.store.NIOFSDirectory@/usr/home/hudson/hudson-slave/workspace/Lucene-Solr-Tests-4.x-java7/solr/build/solr-core/test/J1/org.apache.solr.cloud.SyncSliceTest-1355781770504/jetty3/index lockFactory=org.apache.lucene.store.NativeFSLockFactory@5c2ed547; maxCacheMB=48.0 maxMergeSizeMB=4.0)),segFN=segments_1,generation=1,filenames=[segments_1]
[junit4:junit4]   2> 7970 T2607 oasc.SolrDeletionPolicy.updateCommits newest commit = 1[segments_1]
[junit4:junit4]   2> 7971 T2607 oasc.CachingDirectoryFactory.close Releasing directory:/usr/home/hudson/hudson-slave/workspace/Lucene-Solr-Tests-4.x-java7/solr/build/solr-core/test/J1/./org.apache.solr.cloud.SyncSliceTest-1355781770504/jetty3/index
[junit4:junit4]   2> 7971 T2607 oasc.SolrCore.initWriters created xml: solr.XMLResponseWriter
[junit4:junit4]   2> 7973 T2607 oasup.UpdateRequestProcessorChain.init inserting DistributedUpdateProcessorFactory into updateRequestProcessorChain "dedupe"
[junit4:junit4]   2> 7973 T2607 oasup.UpdateRequestProcessorChain.init inserting DistributedUpdateProcessorFactory into updateRequestProcessorChain "dedupe-allfields"
[junit4:junit4]   2> 7974 T2607 oasup.UpdateRequestProcessorChain.init inserting DistributedUpdateProcessorFactory into updateRequestProcessorChain "stored_sig"
[junit4:junit4]   2> 7974 T2607 oasup.UpdateRequestProcessorChain.init inserting DistributedUpdateProcessorFactory into updateRequestProcessorChain "uniq-fields"
[junit4:junit4]   2> 7975 T2607 oasup.UpdateRequestProcessorChain.init inserting DistributedUpdateProcessorFactory into updateRequestProcessorChain "distrib-dup-test-chain-implicit"
[junit4:junit4]   2> 7975 T2607 oasc.RequestHandlers.initHandlersFromConfig adding lazy requestHandler: solr.ReplicationHandler
[junit4:junit4]   2> 7976 T2607 oasc.RequestHandlers.initHandlersFromConfig created /replication: solr.ReplicationHandler
[junit4:junit4]   2> 7977 T2607 oasc.RequestHandlers.initHandlersFromConfig created standard: solr.StandardRequestHandler
[junit4:junit4]   2> 7978 T2607 oasc.RequestHandlers.initHandlersFromConfig created /get: solr.RealTimeGetHandler
[junit4:junit4]   2> 8000 T2607 oasc.RequestHandlers.initHandlersFromConfig created dismax: solr.SearchHandler
[junit4:junit4]   2> 8001 T2607 oasc.RequestHandlers.initHandlersFromConfig created mock: org.apache.solr.core.MockQuerySenderListenerReqHandler
[junit4:junit4]   2> 8001 T2607 oasc.RequestHandlers.initHandlersFromConfig created /admin/: org.apache.solr.handler.admin.AdminHandlers
[junit4:junit4]   2> 8002 T2607 oasc.RequestHandlers.initHandlersFromConfig created defaults: solr.StandardRequestHandler
[junit4:junit4]   2> 8003 T2607 oasc.RequestHandlers.initHandlersFromConfig adding lazy requestHandler: solr.StandardRequestHandler
[junit4:junit4]   2> 8003 T2607 oasc.RequestHandlers.initHandlersFromConfig created lazy: solr.StandardRequestHandler
[junit4:junit4]   2> 8004 T2607 oasc.RequestHandlers.initHandlersFromConfig created /update: solr.UpdateRequestHandler
[junit4:junit4]   2> 8005 T2607 oasc.RequestHandlers.initHandlersFromConfig created /terms: org.apache.solr.handler.component.SearchHandler
[junit4:junit4]   2> 8006 T2607 oasc.RequestHandlers.initHandlersFromConfig created spellCheckCompRH: org.apache.solr.handler.component.SearchHandler
[junit4:junit4]   2> 8007 T2607 oasc.RequestHandlers.initHandlersFromConfig created spellCheckCompRH_Direct: org.apache.solr.handler.component.SearchHandler
[junit4:junit4]   2> 8008 T2607 oasc.RequestHandlers.initHandlersFromConfig created spellCheckWithWordbreak: org.apache.solr.handler.component.SearchHandler
[junit4:junit4]   2> 8008 T2607 oasc.RequestHandlers.initHandlersFromConfig created spellCheckWithWordbreak_Direct: org.apache.solr.handler.component.SearchHandler
[junit4:junit4]   2> 8009 T2607 oasc.RequestHandlers.initHandlersFromConfig created spellCheckCompRH1: org.apache.solr.handler.component.SearchHandler
[junit4:junit4]   2> 8010 T2607 oasc.RequestHandlers.initHandlersFromConfig created mltrh: org.apache.solr.handler.component.SearchHandler
[junit4:junit4]   2> 8011 T2607 oasc.RequestHandlers.initHandlersFromConfig created tvrh: org.apache.solr.handler.component.SearchHandler
[junit4:junit4]   2> 8012 T2607 oasc.RequestHandlers.initHandlersFromConfig created /mlt: solr.MoreLikeThisHandler
[junit4:junit4]   2> 8013 T2607 oasc.RequestHandlers.initHandlersFromConfig created /debug/dump: solr.DumpRequestHandler
[junit4:junit4]   2> 8026 T2607 oashl.XMLLoader.init xsltCacheLifetimeSeconds=60
[junit4:junit4]   2> 8031 T2607 oasc.SolrCore.initDeprecatedSupport WARNING solrconfig.xml uses deprecated <admin/gettableFiles>, Please update your config to use the ShowFileRequestHandler.
[junit4:junit4]   2> 8032 T2607 oasc.SolrCore.initDeprecatedSupport WARNING adding ShowFileRequestHandler with hidden files: [SCHEMA.XML, OLD_SYNONYMS.TXT, STOPWORDS.TXT, PROTWORDS.TXT, OPEN-EXCHANGE-RATES.JSON, SYNONYMS.TXT, CURRENCY.XML, MAPPING-ISOLATIN1ACCENT.TXT]
[junit4:junit4]   2> 8035 T2607 oasc.CachingDirectoryFactory.close Releasing directory:/usr/home/hudson/hudson-slave/workspace/Lucene-Solr-Tests-4.x-java7/solr/build/solr-core/test/J1/./org.apache.solr.cloud.SyncSliceTest-1355781770504/jetty3
[junit4:junit4]   2> 8037 T2607 oass.SolrIndexSearcher.<init> Opening Searcher@4eaad417 main
[junit4:junit4]   2> 8038 T2607 oasu.CommitTracker.<init> Hard AutoCommit: disabled
[junit4:junit4]   2> 8038 T2607 oasu.CommitTracker.<init> Soft AutoCommit: disabled
[junit4:junit4]   2> 8039 T2607 oashc.SpellCheckComponent.inform Initializing spell checkers
[junit4:junit4]   2> 8046 T2607 oass.DirectSolrSpellChecker.init init: {name=direct,classname=DirectSolrSpellChecker,field=lowerfilt,minQueryLength=3}
[junit4:junit4]   2> 8112 T2608 oasc.SolrCore.registerSearcher [collection1] Registered new searcher Searcher@4eaad417 main{StandardDirectoryReader(segments_1:1)}
[junit4:junit4]   2> 8116 T2607 oasc.ZkController.publish publishing core=collection1 state=down
[junit4:junit4]   2> 8116 T2607 oasc.ZkController.publish numShards not found on descriptor - reading it from system property
[junit4:junit4]   2> 8507 T2556 oascc.ZkStateReader.updateClusterState Updating cloud state from ZooKeeper... 
[junit4:junit4]   2> 8508 T2556 oasc.Overseer$ClusterStateUpdater.updateState Update state numShards=1 message={
[junit4:junit4]   2> 	  "operation":"state",
[junit4:junit4]   2> 	  "numShards":"1",
[junit4:junit4]   2> 	  "shard":null,
[junit4:junit4]   2> 	  "roles":null,
[junit4:junit4]   2> 	  "state":"down",
[junit4:junit4]   2> 	  "core":"collection1",
[junit4:junit4]   2> 	  "collection":"collection1",
[junit4:junit4]   2> 	  "node_name":"127.0.0.1:32024_hh_ov%2Fxj",
[junit4:junit4]   2> 	  "base_url":"http://127.0.0.1:32024/hh_ov/xj"}
[junit4:junit4]   2> 8509 T2556 oasc.Overseer$ClusterStateUpdater.updateState Collection already exists with numShards=1
[junit4:junit4]   2> 8509 T2556 oasc.Overseer$ClusterStateUpdater.updateState Assigning new node to shard shard=shard1
[junit4:junit4]   2> 8525 T2574 oascc.ZkStateReader$2.process A cluster state change: WatchedEvent state:SyncConnected type:NodeDataChanged path:/clusterstate.json, has occurred - updating... (live nodes size: 4)
[junit4:junit4]   2> 8525 T2589 oascc.ZkStateReader$2.process A cluster state change: WatchedEvent state:SyncConnected type:NodeDataChanged path:/clusterstate.json, has occurred - updating... (live nodes size: 4)
[junit4:junit4]   2> 8525 T2606 oascc.ZkStateReader$2.process A cluster state change: WatchedEvent state:SyncConnected type:NodeDataChanged path:/clusterstate.json, has occurred - updating... (live nodes size: 4)
[junit4:junit4]   2> 8525 T2561 oascc.ZkStateReader$2.process A cluster state change: WatchedEvent state:SyncConnected type:NodeDataChanged path:/clusterstate.json, has occurred - updating... (live nodes size: 4)
[junit4:junit4]   2> 8525 T2555 oascc.ZkStateReader$2.process A cluster state change: WatchedEvent state:SyncConnected type:NodeDataChanged path:/clusterstate.json, has occurred - updating... (live nodes size: 4)
[junit4:junit4]   2> 8619 T2607 oasc.CoreContainer.registerCore registering core: collection1
[junit4:junit4]   2> 8619 T2607 oasc.ZkController.register Register shard - core:collection1 address:http://127.0.0.1:32024/hh_ov/xj shardId:shard1
[junit4:junit4]   2> 8622 T2607 oasc.ZkController.register We are http://127.0.0.1:32024/hh_ov/xj/collection1/ and leader is http://127.0.0.1:32013/hh_ov/xj/collection1/
[junit4:junit4]   2> 8622 T2607 oasc.ZkController.register No LogReplay needed for core=collection1 baseURL=http://127.0.0.1:32024/hh_ov/xj
[junit4:junit4]   2> 8623 T2607 oasc.ZkController.checkRecovery Core needs to recover:collection1
[junit4:junit4]   2> 8623 T2607 oasu.DefaultSolrCoreState.doRecovery Running recovery - first canceling any ongoing recovery
[junit4:junit4]   2> ASYNC  NEW_CORE C160 name=collection1 org.apache.solr.core.SolrCore@3b11331 url=http://127.0.0.1:32024/hh_ov/xj/collection1 node=127.0.0.1:32024_hh_ov%2Fxj
[junit4:junit4]   2> 8623 T2609 C160 P32024 oasc.RecoveryStrategy.run Starting recovery process.  core=collection1 recoveringAfterStartup=true
[junit4:junit4]   2> 8624 T2607 oascc.ZkStateReader.updateClusterState Updating cloud state from ZooKeeper... 
[junit4:junit4]   2> 8624 T2609 C160 P32024 oasc.RecoveryStrategy.doRecovery ###### startupVersions=[]
[junit4:junit4]   2> 8624 T2609 C160 P32024 oasc.ZkController.publish publishing core=collection1 state=recovering
[junit4:junit4]   2> 8625 T2609 C160 P32024 oasc.ZkController.publish numShards not found on descriptor - reading it from system property
[junit4:junit4]   2> 8625 T2533 oass.SolrDispatchFilter.init user.dir=/usr/home/hudson/hudson-slave/workspace/Lucene-Solr-Tests-4.x-java7/solr/build/solr-core/test/J1
[junit4:junit4]   2> 8626 T2533 oass.SolrDispatchFilter.init SolrDispatchFilter.init() done
[junit4:junit4]   2> 8626 T2609 C160 P32024 oasc.RecoveryStrategy.doRecovery Attempting to PeerSync from http://127.0.0.1:32013/hh_ov/xj/collection1/ core=collection1 - recoveringAfterStartup=true
[junit4:junit4]   2> 8627 T2609 C160 P32024 oasu.PeerSync.sync PeerSync: core=collection1 url=http://127.0.0.1:32024/hh_ov/xj START replicas=[http://127.0.0.1:32013/hh_ov/xj/collection1/] nUpdates=100
[junit4:junit4]   2> 8627 T2533 oascsi.HttpClientUtil.createClient Creating new http client, config:maxConnections=128&maxConnectionsPerHost=32&followRedirects=false
[junit4:junit4]   2> 8627 T2609 C160 P32024 oasu.PeerSync.sync WARNING no frame of reference to tell of we've missed updates
[junit4:junit4]   2> 8627 T2609 C160 P32024 oasc.RecoveryStrategy.doRecovery PeerSync Recovery was not successful - trying replication. core=collection1
[junit4:junit4]   2> 8628 T2609 C160 P32024 oasc.RecoveryStrategy.doRecovery Starting Replication Recovery. core=collection1
[junit4:junit4]   2> 8628 T2609 C160 P32024 oascsi.HttpClientUtil.createClient Creating new http client, config:maxConnections=128&maxConnectionsPerHost=32&followRedirects=false
[junit4:junit4]   2> 8629 T2564 C159 P32013 REQ /get {distrib=false&qt=/get&wt=javabin&version=2&getVersions=100} status=0 QTime=0 
[junit4:junit4]   2> 8810 T2533 oejs.Server.doStart jetty-8.1.8.v20121106
[junit4:junit4]   2> 8813 T2533 oejs.AbstractConnector.doStart Started SocketConnector@127.0.0.1:32029
[junit4:junit4]   2> 8814 T2533 oasc.SolrResourceLoader.locateSolrHome JNDI not configured for solr (NoInitialContextEx)
[junit4:junit4]   2> 8815 T2533 oasc.SolrResourceLoader.locateSolrHome using system property solr.solr.home: /usr/home/hudson/hudson-slave/workspace/Lucene-Solr-Tests-4.x-java7/solr/build/solr-core/test/J1/./org.apache.solr.cloud.SyncSliceTest-jetty4-1355781779145
[junit4:junit4]   2> 8816 T2533 oasc.SolrResourceLoader.<init> new SolrResourceLoader for deduced Solr Home: '/usr/home/hudson/hudson-slave/workspace/Lucene-Solr-Tests-4.x-java7/solr/build/solr-core/test/J1/./org.apache.solr.cloud.SyncSliceTest-jetty4-1355781779145/'
[junit4:junit4]   2> 8857 T2533 oass.SolrDispatchFilter.init SolrDispatchFilter.init()
[junit4:junit4]   2> 8858 T2533 oasc.SolrResourceLoader.locateSolrHome JNDI not configured for solr (NoInitialContextEx)
[junit4:junit4]   2> 8859 T2533 oasc.SolrResourceLoader.locateSolrHome using system property solr.solr.home: /usr/home/hudson/hudson-slave/workspace/Lucene-Solr-Tests-4.x-java7/solr/build/solr-core/test/J1/./org.apache.solr.cloud.SyncSliceTest-jetty4-1355781779145
[junit4:junit4]   2> 8859 T2533 oasc.CoreContainer$Initializer.initialize looking for solr.xml: /usr/home/hudson/hudson-slave/workspace/Lucene-Solr-Tests-4.x-java7/solr/build/solr-core/test/J1/./org.apache.solr.cloud.SyncSliceTest-jetty4-1355781779145/solr.xml
[junit4:junit4]   2> 8860 T2533 oasc.CoreContainer.<init> New CoreContainer 2095860063
[junit4:junit4]   2> 8860 T2533 oasc.CoreContainer.load Loading CoreContainer using Solr Home: '/usr/home/hudson/hudson-slave/workspace/Lucene-Solr-Tests-4.x-java7/solr/build/solr-core/test/J1/./org.apache.solr.cloud.SyncSliceTest-jetty4-1355781779145/'
[junit4:junit4]   2> 8861 T2533 oasc.SolrResourceLoader.<init> new SolrResourceLoader for directory: '/usr/home/hudson/hudson-slave/workspace/Lucene-Solr-Tests-4.x-java7/solr/build/solr-core/test/J1/./org.apache.solr.cloud.SyncSliceTest-jetty4-1355781779145/'
[junit4:junit4]   2> 8891 T2533 oashc.HttpShardHandlerFactory.getParameter Setting socketTimeout to: 30000
[junit4:junit4]   2> 8892 T2533 oashc.HttpShardHandlerFactory.getParameter Setting urlScheme to: http://
[junit4:junit4]   2> 8893 T2533 oashc.HttpShardHandlerFactory.getParameter Setting connTimeout to: 15000
[junit4:junit4]   2> 8894 T2533 oashc.HttpShardHandlerFactory.getParameter Setting maxConnectionsPerHost to: 20
[junit4:junit4]   2> 8894 T2533 oashc.HttpShardHandlerFactory.getParameter Setting corePoolSize to: 0
[junit4:junit4]   2> 8895 T2533 oashc.HttpShardHandlerFactory.getParameter Setting maximumPoolSize to: 2147483647
[junit4:junit4]   2> 8895 T2533 oashc.HttpShardHandlerFactory.getParameter Setting maxThreadIdleTime to: 5
[junit4:junit4]   2> 8896 T2533 oashc.HttpShardHandlerFactory.getParameter Setting sizeOfQueue to: -1
[junit4:junit4]   2> 8897 T2533 oashc.HttpShardHandlerFactory.getParameter Setting fairnessPolicy to: false
[junit4:junit4]   2> 8897 T2533 oascsi.HttpClientUtil.createClient Creating new http client, config:maxConnectionsPerHost=20&maxConnections=10000&socketTimeout=30000&connTimeout=15000&retry=false
[junit4:junit4]   2> 8919 T2533 oasc.CoreContainer.load Registering Log Listener
[junit4:junit4]   2> 8940 T2533 oasc.CoreContainer.initZooKeeper Zookeeper client=127.0.0.1:32005/solr
[junit4:junit4]   2> 8941 T2533 oasc.ZkController.checkChrootPath zkHost includes chroot
[junit4:junit4]   2> 8941 T2533 oaz.ZooKeeper.<init> Initiating client connection, connectString=127.0.0.1:32005 sessionTimeout=60000 watcher=org.apache.solr.common.cloud.ConnectionManager@4cc2f00
[junit4:junit4]   2> 8942 T2533 oascc.ConnectionManager.waitForConnected Waiting for client to connect to ZooKeeper
[junit4:junit4]   2> 8943 T2620 oaz.ClientCnxn$SendThread.logStartConnect Opening socket connection to server localhost/127.0.0.1:32005. Will not attempt to authenticate using SASL (access denied ("javax.security.auth.AuthPermission" "getLoginConfiguration"))
[junit4:junit4]   2> 8944 T2620 oaz.ClientCnxn$SendThread.primeConnection Socket connection established to localhost/127.0.0.1:32005, initiating session
[junit4:junit4]   2> 8944 T2535 oazs.NIOServerCnxnFactory.run Accepted socket connection from /140.211.11.196:32030
[junit4:junit4]   2> 8944 T2535 oazs.ZooKeeperServer.processConnectRequest Client attempting to establish new session at /140.211.11.196:32030
[junit4:junit4]   2> 8946 T2537 oazs.ZooKeeperServer.finishSessionInit Established session 0x13baae40d0d000b with negotiated timeout 20000 for client /140.211.11.196:32030
[junit4:junit4]   2> 8946 T2620 oaz.ClientCnxn$SendThread.onConnected Session establishment complete on server localhost/127.0.0.1:32005, sessionid = 0x13baae40d0d000b, negotiated timeout = 20000
[junit4:junit4]   2> 8947 T2621 oascc.ConnectionManager.process Watcher org.apache.solr.common.cloud.ConnectionManager@4cc2f00 name:ZooKeeperConnection Watcher:127.0.0.1:32005 got event WatchedEvent state:SyncConnected type:None path:null path:null type:None
[junit4:junit4]   2> 8947 T2533 oascc.ConnectionManager.waitForConnected Client is connected to ZooKeeper
[junit4:junit4]   2> 8948 T2538 oazs.PrepRequestProcessor.pRequest2Txn Processed session termination for sessionid: 0x13baae40d0d000b
[junit4:junit4]   2> 8966 T2621 oaz.ClientCnxn$EventThread.run EventThread shut down
[junit4:junit4]   2> 8966 T2535 oazs.NIOServerCnxn.closeSock Closed socket connection for client /140.211.11.196:32030 which had sessionid 0x13baae40d0d000b
[junit4:junit4]   2> 8966 T2533 oaz.ZooKeeper.close Session: 0x13baae40d0d000b closed
[junit4:junit4]   2> 8966 T2533 oascsi.HttpClientUtil.createClient Creating new http client, config:maxConnections=500&maxConnectionsPerHost=16&socketTimeout=15000&connTimeout=30000
[junit4:junit4]   2> 8978 T2533 oaz.ZooKeeper.<init> Initiating client connection, connectString=127.0.0.1:32005/solr sessionTimeout=30000 watcher=org.apache.solr.common.cloud.ConnectionManager@42a21c77
[junit4:junit4]   2> 8980 T2533 oascc.ConnectionManager.waitForConnected Waiting for client to connect to ZooKeeper
[junit4:junit4]   2> 8980 T2622 oaz.ClientCnxn$SendThread.logStartConnect Opening socket connection to server localhost/127.0.0.1:32005. Will not attempt to authenticate using SASL (access denied ("javax.security.auth.AuthPermission" "getLoginConfiguration"))
[junit4:junit4]   2> 8981 T2622 oaz.ClientCnxn$SendThread.primeConnection Socket connection established to localhost/127.0.0.1:32005, initiating session
[junit4:junit4]   2> 8981 T2535 oazs.NIOServerCnxnFactory.run Accepted socket connection from /140.211.11.196:32032
[junit4:junit4]   2> 8981 T2535 oazs.ZooKeeperServer.processConnectRequest Client attempting to establish new session at /140.211.11.196:32032
[junit4:junit4]   2> 8983 T2537 oazs.ZooKeeperServer.finishSessionInit Established session 0x13baae40d0d000c with negotiated timeout 20000 for client /140.211.11.196:32032
[junit4:junit4]   2> 8983 T2622 oaz.ClientCnxn$SendThread.onConnected Session establishment complete on server localhost/127.0.0.1:32005, sessionid = 0x13baae40d0d000c, negotiated timeout = 20000
[junit4:junit4]   2> 8983 T2623 oascc.ConnectionManager.process Watcher org.apache.solr.common.cloud.ConnectionManager@42a21c77 name:ZooKeeperConnection Watcher:127.0.0.1:32005/solr got event WatchedEvent state:SyncConnected type:None path:null path:null type:None
[junit4:junit4]   2> 8984 T2533 oascc.ConnectionManager.waitForConnected Client is connected to ZooKeeper
[junit4:junit4]   2> 8984 T2538 oazs.PrepRequestProcessor.pRequest Got user-level KeeperException when processing sessionid:0x13baae40d0d000c type:create cxid:0x1 zxid:0x93 txntype:-1 reqpath:n/a Error Path:/solr/overseer Error:KeeperErrorCode = NodeExists for /solr/overseer
[junit4:junit4]   2> 8986 T2538 oazs.PrepRequestProcessor.pRequest Got user-level KeeperException when processing sessionid:0x13baae40d0d000c type:create cxid:0x2 zxid:0x94 txntype:-1 reqpath:n/a Error Path:/solr/overseer Error:KeeperErrorCode = NodeExists for /solr/overseer
[junit4:junit4]   2> 8987 T2533 oasc.ZkController.createEphemeralLiveNode Register node as live in ZooKeeper:/live_nodes/127.0.0.1:32029_hh_ov%2Fxj
[junit4:junit4]   2> 8988 T2538 oazs.PrepRequestProcessor.pRequest Got user-level KeeperException when processing sessionid:0x13baae40d0d000c type:delete cxid:0x4 zxid:0x95 txntype:-1 reqpath:n/a Error Path:/solr/live_nodes/127.0.0.1:32029_hh_ov%2Fxj Error:KeeperErrorCode = NoNode for /solr/live_nodes/127.0.0.1:32029_hh_ov%2Fxj
[junit4:junit4]   2> 8990 T2533 oascc.SolrZkClient.makePath makePath: /live_nodes/127.0.0.1:32029_hh_ov%2Fxj
[junit4:junit4]   2> 8998 T2606 oascc.ZkStateReader$2.process A cluster state change: WatchedEvent state:SyncConnected type:NodeChildrenChanged path:/live_nodes, has occurred - updating... (live nodes size: 4)
[junit4:junit4]   2> 8998 T2561 oascc.ZkStateReader$3.process Updating live nodes... (5)
[junit4:junit4]   2> 8998 T2574 oascc.ZkStateReader$3.process Updating live nodes... (5)
[junit4:junit4]   2> 8998 T2555 oascc.ZkStateReader$3.process Updating live nodes... (5)
[junit4:junit4]   2> 8998 T2589 oascc.ZkStateReader$3.process Updating live nodes... (5)
[junit4:junit4]   2> 8999 T2574 oascc.ZkStateReader$2.process A cluster state change: WatchedEvent state:SyncConnected type:NodeChildrenChanged path:/live_nodes, has occurred - updating... (live nodes size: 5)
[junit4:junit4]   2> 8998 T2561 oascc.ZkStateReader$2.process A cluster state change: WatchedEvent state:SyncConnected type:NodeChildrenChanged path:/live_nodes, has occurred - updating... (live nodes size: 5)
[junit4:junit4]   2> 8999 T2589 oascc.ZkStateReader$2.process A cluster state change: WatchedEvent state:SyncConnected type:NodeChildrenChanged path:/live_nodes, has occurred - updating... (live nodes size: 5)
[junit4:junit4]   2> 8999 T2555 oascc.ZkStateReader$2.process A cluster state change: WatchedEvent state:SyncConnected type:NodeChildrenChanged path:/live_nodes, has occurred - updating... (live nodes size: 5)
[junit4:junit4]   2> 9000 T2606 oascc.ZkStateReader$3.process Updating live nodes... (5)
[junit4:junit4]   2> 9002 T2533 oascc.ZkStateReader.createClusterStateWatchersAndUpdate Updating cluster state from ZooKeeper... 
[junit4:junit4]   2> 9010 T2624 oasc.CoreContainer.create Creating SolrCore 'collection1' using instanceDir: /usr/home/hudson/hudson-slave/workspace/Lucene-Solr-Tests-4.x-java7/solr/build/solr-core/test/J1/./org.apache.solr.cloud.SyncSliceTest-jetty4-1355781779145/collection1
[junit4:junit4]   2> 9010 T2624 oasc.ZkController.createCollectionZkNode Check for collection zkNode:collection1
[junit4:junit4]   2> 9011 T2624 oasc.ZkController.createCollectionZkNode Collection zkNode exists
[junit4:junit4]   2> 9011 T2624 oasc.ZkController.readConfigName Load collection config from:/collections/collection1
[junit4:junit4]   2> 9013 T2624 oasc.SolrResourceLoader.<init> new SolrResourceLoader for directory: '/usr/home/hudson/hudson-slave/workspace/Lucene-Solr-Tests-4.x-java7/solr/build/solr-core/test/J1/./org.apache.solr.cloud.SyncSliceTest-jetty4-1355781779145/collection1/'
[junit4:junit4]   2> 9014 T2624 oasc.SolrResourceLoader.replaceClassLoader Adding 'file:/usr/home/hudson/hudson-slave/workspace/Lucene-Solr-Tests-4.x-java7/solr/build/solr-core/test/J1/org.apache.solr.cloud.SyncSliceTest-jetty4-1355781779145/collection1/lib/README' to classloader
[junit4:junit4]   2> 9015 T2624 oasc.SolrResourceLoader.replaceClassLoader Adding 'file:/usr/home/hudson/hudson-slave/workspace/Lucene-Solr-Tests-4.x-java7/solr/build/solr-core/test/J1/org.apache.solr.cloud.SyncSliceTest-jetty4-1355781779145/collection1/lib/classes/' to classloader
[junit4:junit4]   2> 9030 T2556 oascc.ZkStateReader.updateClusterState Updating cloud state from ZooKeeper... 
[junit4:junit4]   2> 9031 T2556 oasc.Overseer$ClusterStateUpdater.updateState Update state numShards=1 message={
[junit4:junit4]   2> 	  "operation":"state",
[junit4:junit4]   2> 	  "numShards":"1",
[junit4:junit4]   2> 	  "shard":"shard1",
[junit4:junit4]   2> 	  "roles":null,
[junit4:junit4]   2> 	  "state":"recovering",
[junit4:junit4]   2> 	  "core":"collection1",
[junit4:junit4]   2> 	  "collection":"collection1",
[junit4:junit4]   2> 	  "node_name":"127.0.0.1:32024_hh_ov%2Fxj",
[junit4:junit4]   2> 	  "base_url":"http://127.0.0.1:32024/hh_ov/xj"}
[junit4:junit4]   2> 9044 T2574 oascc.ZkStateReader$2.process A cluster state change: WatchedEvent state:SyncConnected type:NodeDataChanged path:/clusterstate.json, has occurred - updating... (live nodes size: 5)
[junit4:junit4]   2> 9044 T2606 oascc.ZkStateReader$2.process A cluster state change: WatchedEvent state:SyncConnected type:NodeDataChanged path:/clusterstate.json, has occurred - updating... (live nodes size: 5)
[junit4:junit4]   2> 9044 T2561 oascc.ZkStateReader$2.process A cluster state change: WatchedEvent state:SyncConnected type:NodeDataChanged path:/clusterstate.json, has occurred - updating... (live nodes size: 5)
[junit4:junit4]   2> 9044 T2555 oascc.ZkStateReader$2.process A cluster state change: WatchedEvent state:SyncConnected type:NodeDataChanged path:/clusterstate.json, has occurred - updating... (live nodes size: 5)
[junit4:junit4]   2> 9044 T2623 oascc.ZkStateReader$2.process A cluster state change: WatchedEvent state:SyncConnected type:NodeDataChanged path:/clusterstate.json, has occurred - updating... (live nodes size: 5)
[junit4:junit4]   2> 9044 T2589 oascc.ZkStateReader$2.process A cluster state change: WatchedEvent state:SyncConnected type:NodeDataChanged path:/clusterstate.json, has occurred - updating... (live nodes size: 5)
[junit4:junit4]   2> 9070 T2624 oasc.SolrConfig.<init> Using Lucene MatchVersion: LUCENE_41
[junit4:junit4]   2> 9142 T2624 oasc.SolrConfig.<init> Loaded SolrConfig: solrconfig.xml
[junit4:junit4]   2> 9243 T2624 oass.IndexSchema.readSchema Reading Solr Schema
[junit4:junit4]   2> 9250 T2624 oass.IndexSchema.readSchema Schema name=test
[junit4:junit4]   2>  C158_STATE=coll:collection1 core:collection1 props:{shard=shard1, roles=null, state=recovering, core=collection1, collection=collection1, node_name=127.0.0.1:32019_hh_ov%2Fxj, base_url=http://127.0.0.1:32019/hh_ov/xj}
[junit4:junit4]   2> 9802 T2592 C158 P32019 oasc.RecoveryStrategy.doRecovery Begin buffering updates. core=collection1
[junit4:junit4]   2> 9802 T2592 C158 P32019 oasu.UpdateLog.bufferUpdates Starting to buffer updates. FSUpdateLog{state=ACTIVE, tlog=null}
[junit4:junit4]   2> 9802 T2592 C158 P32019 oasc.RecoveryStrategy.replicate Attempting to replicate from http://127.0.0.1:32013/hh_ov/xj/collection1/. core=collection1
[junit4:junit4]   2> 9802 T2592 C158 P32019 oascsi.HttpClientUtil.createClient Creating new http client, config:maxConnections=128&maxConnectionsPerHost=32&followRedirects=false
[junit4:junit4]   2> 9810 T2567 C159 P32013 oasu.DirectUpdateHandler2.commit start commit{flags=0,_version_=0,optimize=false,openSearcher=false,waitSearcher=true,expungeDeletes=false,softCommit=false}
[junit4:junit4]   2> 9813 T2567 C159 P32013 oasc.CachingDirectoryFactory.close Releasing directory:/usr/home/hudson/hudson-slave/workspace/Lucene-Solr-Tests-4.x-java7/solr/build/solr-core/test/J1/./org.apache.solr.cloud.SyncSliceTest-1355781770504/jetty1
[junit4:junit4]   2> 9819 T2567 C159 P32013 oasc.SolrDeletionPolicy.onInit SolrDeletionPolicy.onInit: commits:num=1
[junit4:junit4]   2> 		commit{dir=RateLimitedDirectoryWrapper(NRTCachingDirectory(org.apache.lucene.store.NIOFSDirectory@/usr/home/hudson/hudson-slave/workspace/Lucene-Solr-Tests-4.x-java7/solr/build/solr-core/test/J1/org.apache.solr.cloud.SyncSliceTest-1355781770504/jetty1/index lockFactory=org.apache.lucene.store.NativeFSLockFactory@59130c74; maxCacheMB=48.0 maxMergeSizeMB=4.0)),segFN=segments_1,generation=1,filenames=[segments_1]
[junit4:junit4]   2> 9821 T2567 C159 P32013 oasc.SolrDeletionPolicy.updateCommits newest commit = 1[segments_1]
[junit4:junit4]   2> 9852 T2567 C159 P32013 oasc.SolrDeletionPolicy.onCommit SolrDeletionPolicy.onCommit: commits:num=2
[junit4:junit4]   2> 		commit{dir=RateLimitedDirectoryWrapper(NRTCachingDirectory(org.apache.lucene.store.NIOFSDirectory@/usr/home/hudson/hudson-slave/workspace/Lucene-Solr-Tests-4.x-java7/solr/build/solr-core/test/J1/org.apache.solr.cloud.SyncSliceTest-1355781770504/jetty1/index lockFactory=org.apache.lucene.store.NativeFSLockFactory@59130c74; maxCacheMB=48.0 maxMergeSizeMB=4.0)),segFN=segments_1,generation=1,filenames=[segments_1]
[junit4:junit4]   2> 		commit{dir=RateLimitedDirectoryWrapper(NRTCachingDirectory(org.apache.lucene.store.NIOFSDirectory@/usr/home/hudson/hudson-slave/workspace/Lucene-Solr-Tests-4.x-java7/solr/build/solr-core/test/J1/org.apache.solr.cloud.SyncSliceTest-1355781770504/jetty1/index lockFactory=org.apache.lucene.store.NativeFSLockFactory@59130c74; maxCacheMB=48.0 maxMergeSizeMB=4.0)),segFN=segments_2,generation=2,filenames=[segments_2]
[junit4:junit4]   2> 9853 T2567 C159 P32013 oasc.SolrDeletionPolicy.updateCommits newest commit = 2[segments_2]
[junit4:junit4]   2> 9855 T2567 C159 P32013 oasc.CachingDirectoryFactory.close Releasing directory:/usr/home/hudson/hudson-slave/workspace/Lucene-Solr-Tests-4.x-java7/solr/build/solr-core/test/J1/./org.apache.solr.cloud.SyncSliceTest-1355781770504/jetty1
[junit4:junit4]   2> 9856 T2567 C159 P32013 oass.SolrIndexSearcher.<init> Opening Searcher@76dedcad realtime
[junit4:junit4]   2> 9857 T2567 C159 P32013 oasu.DirectUpdateHandler2.commit end_commit_flush
[junit4:junit4]   2> 9857 T2567 C159 P32013 /update {waitSearcher=true&openSearcher=false&commit=true&commit_end_point=true&wt=javabin&softCommit=false&version=2} {commit=} 0 47
[junit4:junit4]   2> 9859 T2592 C158 P32019 oash.ReplicationHandler.inform Commits will be reserved for  10000
[junit4:junit4]   2> 9859 T2592 C158 P32019 oash.SnapPuller.<init>  No value set for 'pollInterval'. Timer Task not started.
[junit4:junit4]   2> 9862 T2568 C159 P32013 oash.ReplicationHandler.inform Commits will be reserved for  10000
[junit4:junit4]   2> 9863 T2568 C159 P32013 REQ /replication {command=indexversion&wt=javabin&qt=/replication&version=2} status=0 QTime=3 
[junit4:junit4]   2> 9864 T2592 C158 P32019 oash.SnapPuller.fetchLatestIndex Master's generation: 2
[junit4:junit4]   2> 9864 T2592 C158 P32019 oash.SnapPuller.fetchLatestIndex Slave's generation: 1
[junit4:junit4]   2> 9864 T2592 C158 P32019 oash.SnapPuller.fetchLatestIndex Starting replication process
[junit4:junit4]   2> 9866 T2568 C159 P32013 oasc.CachingDirectoryFactory.close Releasing directory:/usr/home/hudson/hudson-slave/workspace/Lucene-Solr-Tests-4.x-java7/solr/build/solr-core/test/J1/./org.apache.solr.cloud.SyncSliceTest-1355781770504/jetty1
[junit4:junit4]   2> 9867 T2568 C159 P32013 oasc.CachingDirectoryFactory.close Releasing directory:/usr/home/hudson/hudson-slave/workspace/Lucene-Solr-Tests-4.x-java7/solr/build/solr-core/test/J1/./org.apache.solr.cloud.SyncSliceTest-1355781770504/jetty1/index
[junit4:junit4]   2> 9868 T2568 C159 P32013 REQ /replication {command=filelist&generation=2&wt=javabin&qt=/replication&version=2} status=0 QTime=2 
[junit4:junit4]   2> 9868 T2592 C158 P32019 oash.SnapPuller.fetchLatestIndex Number of files in latest index in master: 1
[junit4:junit4]   2> 9869 T2592 C158 P32019 oasc.CachingDirectoryFactory.get return new directory for /usr/home/hudson/hudson-slave/workspace/Lucene-Solr-Tests-4.x-java7/solr/build/solr-core/test/J1/./org.apache.solr.cloud.SyncSliceTest-1355781770504/jetty2/index.20121217160300369 forceNew:false
[junit4:junit4]   2> 9870 T2592 C158 P32019 oasc.CachingDirectoryFactory.close Releasing directory:/usr/home/hudson/hudson-slave/workspace/Lucene-Solr-Tests-4.x-java7/solr/build/solr-core/test/J1/./org.apache.solr.cloud.SyncSliceTest-1355781770504/jetty2
[junit4:junit4]   2> 9871 T2592 C158 P32019 oash.SnapPuller.fetchLatestIndex Starting download to RateLimitedDirectoryWrapper(NRTCachingDirectory(org.apache.lucene.store.NIOFSDirectory@/usr/home/hudson/hudson-slave/workspace/Lucene-Solr-Tests-4.x-java7/solr/build/solr-core/test/J1/org.apache.solr.cloud.SyncSliceTest-1355781770504/jetty2/index.20121217160300369 lockFactory=org.apache.lucene.store.NativeFSLockFactory@360ad7ac; maxCacheMB=48.0 maxMergeSizeMB=4.0)) fullCopy=true
[junit4:junit4]   2> 9874 T2568 C159 P32013 REQ /replication {file=segments_2&command=filecontent&checksum=true&generation=2&qt=/replication&wt=filestream} status=0 QTime=0 
[junit4:junit4]   2> 9876 T2592 C158 P32019 oasc.CachingDirectoryFactory.close Releasing directory:/usr/home/hudson/hudson-slave/workspace/Lucene-Solr-Tests-4.x-java7/solr/build/solr-core/test/J1/./org.apache.solr.cloud.SyncSliceTest-1355781770504/jetty2/index
[junit4:junit4]   2> 9876 T2592 C158 P32019 oash.SnapPuller.fetchLatestIndex Total time taken for download : 0 secs
[junit4:junit4]   2> 9876 T2592 C158 P32019 oash.SnapPuller.modifyIndexProps New index installed. Updating index properties... index=index.20121217160300369
[junit4:junit4]   2> 9878 T2592 C158 P32019 oasc.CachingDirectoryFactory.close Releasing directory:/usr/home/hudson/hudson-slave/workspace/Lucene-Solr-Tests-4.x-java7/solr/build/solr-core/test/J1/./org.apache.solr.cloud.SyncSliceTest-1355781770504/jetty2
[junit4:junit4]   2> 9878 T2592 C158 P32019 oasc.CachingDirectoryFactory.close Releasing directory:/usr/home/hudson/hudson-slave/workspace/Lucene-Solr-Tests-4.x-java7/solr/build/solr-core/test/J1/./org.apache.solr.cloud.SyncSliceTest-1355781770504/jetty2
[junit4:junit4]   2> 9878 T2592 C158 P32019 oasc.SolrCore.getNewIndexDir New index directory detected: old=./org.apache.solr.cloud.SyncSliceTest-1355781770504/jetty2/index/ new=./org.apache.solr.cloud.SyncSliceTest-1355781770504/jetty2/index.20121217160300369
[junit4:junit4]   2> 9881 T2592 C158 P32019 oasc.SolrDeletionPolicy.onInit SolrDeletionPolicy.onInit: commits:num=1
[junit4:junit4]   2> 		commit{dir=RateLimitedDirectoryWrapper(NRTCachingDirectory(org.apache.lucene.store.NIOFSDirectory@/usr/home/hudson/hudson-slave/workspace/Lucene-Solr-Tests-4.x-java7/solr/build/solr-core/test/J1/org.apache.solr.cloud.SyncSliceTest-1355781770504/jetty2/index.20121217160300369 lockFactory=org.apache.lucene.store.NativeFSLockFactory@360ad7ac; maxCacheMB=48.0 maxMergeSizeMB=4.0)),segFN=segments_2,generation=2,filenames=[segments_2]
[junit4:junit4]   2> 9883 T2592 C158 P32019 oasc.SolrDeletionPolicy.updateCommits newest commit = 2[segments_2]
[junit4:junit4]   2> 9884 T2592 C158 P32019 oasc.CachingDirectoryFactory.close Releasing directory:/usr/home/hudson/hudson-slave/workspace/Lucene-Solr-Tests-4.x-java7/solr/build/solr-core/test/J1/./org.apache.solr.cloud.SyncSliceTest-1355781770504/jetty2
[junit4:junit4]   2> 9884 T2592 C158 P32019 oasu.DefaultSolrCoreState.newIndexWriter Creating new IndexWriter...
[junit4:junit4]   2> 9884 T2592 C158 P32019 oasu.DefaultSolrCoreState.newIndexWriter Waiting until IndexWriter is unused... core=collection1
[junit4:junit4]   2> 9884 T2592 C158 P32019 oasu.DefaultSolrCoreState.newIndexWriter Rollback old IndexWriter... core=collection1
[junit4:junit4]   2> 9905 T2592 C158 P32019 oasc.CachingDirectoryFactory.close Releasing directory:/usr/home/hudson/hudson-slave/workspace/Lucene-Solr-Tests-4.x-java7/solr/build/solr-core/test/J1/./org.apache.solr.cloud.SyncSliceTest-1355781770504/jetty2/index.20121217160300369
[junit4:junit4]   2> 9906 T2592 C158 P32019 oasc.CachingDirectoryFactory.close Releasing directory:/usr/home/hudson/hudson-slave/workspace/Lucene-Solr-Tests-4.x-java7/solr/build/solr-core/test/J1/./org.apache.solr.cloud.SyncSliceTest-1355781770504/jetty2
[junit4:junit4]   2> 9909 T2592 C158 P32019 oasc.SolrDeletionPolicy.onInit SolrDeletionPolicy.onInit: commits:num=1
[junit4:junit4]   2> 		commit{dir=RateLimitedDirectoryWrapper(NRTCachingDirectory(org.apache.lucene.store.NIOFSDirectory@/usr/home/hudson/hudson-slave/workspace/Lucene-Solr-Tests-4.x-java7/solr/build/solr-core/test/J1/org.apache.solr.cloud.SyncSliceTest-1355781770504/jetty2/index.20121217160300369 lockFactory=org.apache.lucene.store.NativeFSLockFactory@360ad7ac; maxCacheMB=48.0 maxMergeSizeMB=4.0)),segFN=segments_2,generation=2,filenames=[segments_2]
[junit4:junit4]   2> 9909 T2592 C158 P32019 oasc.SolrDeletionPolicy.updateCommits newest commit = 2[segments_2]
[junit4:junit4]   2> 9909 T2592 C158 P32019 oasu.DefaultSolrCoreState.newIndexWriter New IndexWriter is ready to be used.
[junit4:junit4]   2> 9909 T2592 C158 P32019 oasc.CachingDirectoryFactory.close Releasing directory:/usr/home/hudson/hudson-slave/workspace/Lucene-Solr-Tests-4.x-java7/solr/build/solr-core/test/J1/./org.apache.solr.cloud.SyncSliceTest-1355781770504/jetty2
[junit4:junit4]   2> 9910 T2592 C158 P32019 oass.SolrIndexSearcher.<init> Opening Searcher@5dae3bf7 main
[junit4:junit4]   2> 9912 T2591 oasc.SolrCore.registerSearcher [collection1] Registered new searcher Searcher@5dae3bf7 main{StandardDirectoryReader(segments_2:1:nrt)}
[junit4:junit4]   2> 9912 T2591 oasc.CachingDirectoryFactory.close Releasing directory:/usr/home/hudson/hudson-slave/workspace/Lucene-Solr-Tests-4.x-java7/solr/build/solr-core/test/J1/./org.apache.solr.cloud.SyncSliceTest-1355781770504/jetty2/index
[junit4:junit4]   2> 9913 T2592 C158 P32019 oasu.DirectUpdateHandler2.commit start commit{flags=0,_version_=0,optimize=false,openSearcher=false,waitSearcher=false,expungeDeletes=false,softCommit=false}
[junit4:junit4]   2> 9916 T2592 C158 P32019 oasc.SolrDeletionPolicy.onCommit SolrDeletionPolicy.onCommit: commits:num=2
[junit4:junit4]   2> 		commit{dir=RateLimitedDirectoryWrapper(NRTCachingDirectory(org.apache.lucene.store.NIOFSDirectory@/usr/home/hudson/hudson-slave/workspace/Lucene-Solr-Tests-4.x-java7/solr/build/solr-core/test/J1/org.apache.solr.cloud.SyncSliceTest-1355781770504/jetty2/index.20121217160300369 lockFactory=org.apache.lucene.store.NativeFSLockFactory@360ad7ac; maxCacheMB=48.0 maxMergeSizeMB=4.0)),segFN=segments_2,generation=2,filenames=[segments_2]
[junit4:junit4]   2> 		commit{dir=RateLimitedDirectoryWrapper(NRTCachingDirectory(org.apache.lucene.store.NIOFSDirectory@/usr/home/hudson/hudson-slave/workspace/Lucene-Solr-Tests-4.x-java7/solr/build/solr-core/test/J1/org.apache.solr.cloud.SyncSliceTest-1355781770504/jetty2/index.20121217160300369 lockFactory=org.apache.lucene.store.NativeFSLockFactory@360ad7ac; maxCacheMB=48.0 maxMergeSizeMB=4.0)),segFN=segments_3,generation=3,filenames=[segments_3]
[junit4:junit4]   2> 9916 T2592 C158 P32019 oasc.SolrDeletionPolicy.updateCommits newest commit = 3[segments_3]
[junit4:junit4]   2> 9917 T2592 C158 P32019 oasc.CachingDirectoryFactory.close Releasing directory:/usr/home/hudson/hudson-slave/workspace/Lucene-Solr-Tests-4.x-java7/solr/build/solr-core/test/J1/./org.apache.solr.cloud.SyncSliceTest-1355781770504/jetty2
[junit4:junit4]   2> 9918 T2592 C158 P32019 oasu.DirectUpdateHandler2.commit end_commit_flush
[junit4:junit4]   2> 9918 T2592 C158 P32019 oasc.CachingDirectoryFactory.close Releasing directory:/usr/home/hudson/hudson-slave/workspace/Lucene-Solr-Tests-4.x-java7/solr/build/solr-core/test/J1/./org.apache.solr.cloud.SyncSliceTest-1355781770504/jetty2/index.20121217160300369
[junit4:junit4]   2> 9918 T2592 C158 P32019 oasc.CachingDirectoryFactory.close Releasing directory:/usr/home/hudson/hudson-slave/workspace/Lucene-Solr-Tests-4.x-java7/solr/build/solr-core/test/J1/./org.apache.solr.cloud.SyncSliceTest-1355781770504/jetty2/index
[junit4:junit4]   2> 9918 T2592 C158 P32019 oasc.RecoveryStrategy.replay No replay needed. core=collection1
[junit4:junit4]   2> 9918 T2592 C158 P32019 oasc.RecoveryStrategy.doRecovery Replication Recovery was successful - registering as Active. core=collection1
[junit4:junit4]   2> 9918 T2592 C158 P32019 oasc.ZkController.publish publishing core=collection1 state=active
[junit4:junit4]   2> 9919 T2592 C158 P32019 oasc.ZkController.publish numShards not found on descriptor - reading it from system property
[junit4:junit4]   2> 9920 T2592 C158 P32019 oasc.RecoveryStrategy.doRecovery Finished recovery process. core=collection1
[junit4:junit4]   2> 9923 T2624 oass.OpenExchangeRatesOrgProvider.init Initialized with rates=open-exchange-rates.json, refreshInterval=1440.
[junit4:junit4]   2> 9935 T2624 oass.IndexSchema.readSchema default search field in schema is text
[junit4:junit4]   2> 9939 T2624 oass.IndexSchema.readSchema unique key field: id
[junit4:junit4]   2> 9952 T2624 oass.FileExchangeRateProvider.reload Reloading exchange rates from file currency.xml
[junit4:junit4]   2> 9968 T2624 oass.FileExchangeRateProvider.reload Reloading exchange rates from file currency.xml
[junit4:junit4]   2> 9973 T2624 oass.OpenExchangeRatesOrgProvider.reload Reloading exchange rates from open-exchange-rates.json
[junit4:junit4]   2> 9974 T2624 oass.OpenExchangeRatesOrgProvider.reload Reloading exchange rates from open-exchange-rates.json
[junit4:junit4]   2> 9975 T2624 oasc.SolrCore.<init> [collection1] Opening new SolrCore at /usr/home/hudson/hudson-slave/workspace/Lucene-Solr-Tests-4.x-java7/solr/build/solr-core/test/J1/./org.apache.solr.cloud.SyncSliceTest-jetty4-1355781779145/collection1/, dataDir=./org.apache.solr.cloud.SyncSliceTest-1355781770504/jetty4/
[junit4:junit4]   2> 9975 T2624 oasc.JmxMonitoredMap.<init> JMX monitoring is enabled. Adding Solr mbeans to JMX Server: com.sun.jmx.mbeanserver.JmxMBeanServer@1afa578a
[junit4:junit4]   2> 9976 T2624 oasc.SolrCore.initDirectoryFactory solr.NRTCachingDirectoryFactory
[junit4:junit4]   2> 9977 T2624 oasc.CachingDirectoryFactory.get return new directory for /usr/home/hudson/hudson-slave/workspace/Lucene-Solr-Tests-4.x-java7/solr/build/solr-core/test/J1/./org.apache.solr.cloud.SyncSliceTest-1355781770504/jetty4 forceNew:false
[junit4:junit4]   2> 9978 T2624 oasc.CachingDirectoryFactory.close Releasing directory:/usr/home/hudson/hudson-slave/workspace/Lucene-Solr-Tests-4.x-java7/solr/build/solr-core/test/J1/./org.apache.solr.cloud.SyncSliceTest-1355781770504/jetty4
[junit4:junit4]   2> 9978 T2624 oasc.SolrCore.getNewIndexDir New index directory detected: old=null new=./org.apache.solr.cloud.SyncSliceTest-1355781770504/jetty4/index/
[junit4:junit4]   2> 9979 T2624 oasc.SolrCore.initIndex WARNING [collection1] Solr index directory './org.apache.solr.cloud.SyncSliceTest-1355781770504/jetty4/index' doesn't exist. Creating new index...
[junit4:junit4]   2> 9979 T2624 oasc.CachingDirectoryFactory.get return new directory for /usr/home/hudson/hudson-slave/workspace/Lucene-Solr-Tests-4.x-java7/solr/build/solr-core/test/J1/./org.apache.solr.cloud.SyncSliceTest-1355781770504/jetty4/index forceNew:false
[junit4:junit4]   2> 9985 T2624 oasc.SolrDeletionPolicy.onCommit SolrDeletionPolicy.onCommit: commits:num=1
[junit4:junit4]   2> 		commit{dir=RateLimitedDirectoryWrapper(NRTCachingDirectory(org.apache.lucene.store.NIOFSDirectory@/usr/home/hudson/hudson-slave/workspace/Lucene-Solr-Tests-4.x-java7/solr/build/solr-core/test/J1/org.apache.solr.cloud.SyncSliceTest-1355781770504/jetty4/index lockFactory=org.apache.lucene.store.NativeFSLockFactory@5b3490e0; maxCacheMB=48.0 maxMergeSizeMB=4.0)),segFN=segments_1,generation=1,filenames=[segments_1]
[junit4:junit4]   2> 9986 T2624 oasc.SolrDeletionPolicy.updateCommits newest commit = 1[segments_1]
[junit4:junit4]   2> 9987 T2624 oasc.CachingDirectoryFactory.close Releasing directory:/usr/home/hudson/hudson-slave/workspace/Lucene-Solr-Tests-4.x-java7/solr/build/solr-core/test/J1/./org.apache.solr.cloud.SyncSliceTest-1355781770504/jetty4/index
[junit4:junit4]   2> 9987 T2624 oasc.SolrCore.initWriters created xml: solr.XMLResponseWriter
[junit4:junit4]   2> 9989 T2624 oasup.UpdateRequestProcessorChain.init inserting DistributedUpdateProcessorFactory into updateRequestProcessorChain "dedupe"
[junit4:junit4]   2> 9989 T2624 oasup.UpdateRequestProcessorChain.init inserting DistributedUpdateProcessorFactory into updateRequestProcessorChain "dedupe-allfields"
[junit4:junit4]   2> 9990 T2624 oasup.UpdateRequestProcessorChain.init inserting DistributedUpdateProcessorFactory into updateRequestProcessorChain "stored_sig"
[junit4:junit4]   2> 9990 T2624 oasup.UpdateRequestProcessorChain.init inserting DistributedUpdateProcessorFactory into updateRequestProcessorChain "uniq-fields"
[junit4:junit4]   2> 9991 T2624 oasup.UpdateRequestProcessorChain.init inserting DistributedUpdateProcessorFactory into updateRequestProcessorChain "distrib-dup-test-chain-implicit"
[junit4:junit4]   2> 9991 T2624 oasc.RequestHandlers.initHandlersFromConfig adding lazy requestHandler: solr.ReplicationHandler
[junit4:junit4]   2> 9992 T2624 oasc.RequestHandlers.initHandlersFromConfig created /replication: solr.ReplicationHandler
[junit4:junit4]   2> 9993 T2624 oasc.RequestHandlers.initHandlersFromConfig created standard: solr.StandardRequestHandler
[junit4:junit4]   2> 9994 T2624 oasc.RequestHandlers.initHandlersFromConfig created /get: solr.RealTimeGetHandler
[junit4:junit4]   2> 9995 T2624 oasc.RequestHandlers.initHandlersFromConfig created dismax: solr.SearchHandler
[junit4:junit4]   2> 9996 T2624 oasc.RequestHandlers.initHandlersFromConfig created mock: org.apache.solr.core.MockQuerySenderListenerReqHandler
[junit4:junit4]   2> 9996 T2624 oasc.RequestHandlers.initHandlersFromConfig created /admin/: org.apache.solr.handler.admin.AdminHandlers
[junit4:junit4]   2> 9997 T2624 oasc.RequestHandlers.initHandlersFromConfig created defaults: solr.StandardRequestHandler
[junit4:junit4]   2> 9997 T2624 oasc.RequestHandlers.initHandlersFromConfig adding lazy requestHandler: solr.StandardRequestHandler
[junit4:junit4]   2> 9998 T2624 oasc.RequestHandlers.initHandlersFromConfig created lazy: solr.StandardRequestHandler
[junit4:junit4]   2> 9999 T2624 oasc.RequestHandlers.initHandlersFromConfig created /update: solr.UpdateRequestHandler
[junit4:junit4]   2> 9999 T2624 oasc.RequestHandlers.initHandlersFromConfig created /terms: org.apache.solr.handler.component.SearchHandler
[junit4:junit4]   2> 10000 T2624 oasc.RequestHandlers.initHandlersFromConfig created spellCheckCompRH: org.apache.solr.handler.component.SearchHandler
[junit4:junit4]   2> 10001 T2624 oasc.RequestHandlers.initHandlersFromConfig created spellCheckCompRH_Direct: org.apache.solr.handler.component.SearchHandler
[junit4:junit4]   2> 10002 T2624 oasc.RequestHandlers.initHandlersFromConfig created spellCheckWithWordbreak: org.apache.solr.handler.component.SearchHandler
[junit4:junit4]   2> 10003 T2624 oasc.RequestHandlers.initHandlersFromConfig created spellCheckWithWordbreak_Direct: org.apache.solr.handler.component.SearchHandler
[junit4:junit4]   2> 10004 T2624 oasc.RequestHandlers.initHandlersFromConfig created spellCheckCompRH1: org.apache.solr.handler.component.SearchHandler
[junit4:junit4]   2> 10005 T2624 oasc.RequestHandlers.initHandlersFromConfig created mltrh: org.apache.solr.handler.component.SearchHandler
[junit4:junit4]   2> 10006 T2624 oasc.RequestHandlers.initHandlersFromConfig created tvrh: org.apache.solr.handler.component.SearchHandler
[junit4:junit4]   2> 10007 T2624 oasc.RequestHandlers.initHandlersFromConfig created /mlt: solr.MoreLikeThisHandler
[junit4:junit4]   2> 10008 T2624 oasc.RequestHandlers.initHandlersFromConfig created /debug/dump: solr.DumpRequestHandler
[junit4:junit4]   2> 10021 T2624 oashl.XMLLoader.init xsltCacheLifetimeSeconds=60
[junit4:junit4]   2> 10026 T2624 oasc.SolrCore.initDeprecatedSupport WARNING solrconfig.xml uses deprecated <admin/gettableFiles>, Please update your config to use the ShowFileRequestHandler.
[junit4:junit4]   2> 10027 T2624 oasc.SolrCore.initDeprecatedSupport WARNING adding ShowFileRequestHandler with hidden files: [SCHEMA.XML, OLD_SYNONYMS.TXT, STOPWORDS.TXT, PROTWORDS.TXT, OPEN-EXCHANGE-RATES.JSON, SYNONYMS.TXT, CURRENCY.XML, MAPPING-ISOLATIN1ACCENT.TXT]
[junit4:junit4]   2> 10030 T2624 oasc.CachingDirectoryFactory.close Releasing directory:/usr/home/hudson/hudson-slave/workspace/Lucene-Solr-Tests-4.x-java7/solr/build/solr-core/test/J1/./org.apache.solr.cloud.SyncSliceTest-1355781770504/jetty4
[junit4:junit4]   2> 10032 T2624 oass.SolrIndexSearcher.<init> Opening Searcher@40bcad31 main
[junit4:junit4]   2> 10033 T2624 oasu.CommitTracker.<init> Hard AutoCommit: disabled
[junit4:junit4]   2> 10033 T2624 oasu.CommitTracker.<init> Soft AutoCommit: disabled
[junit4:junit4]   2> 10034 T2624 oashc.SpellCheckComponent.inform Initializing spell checkers
[junit4:junit4]   2> 10040 T2624 oass.DirectSolrSpellChecker.init init: {name=direct,classname=DirectSolrSpellChecker,field=lowerfilt,minQueryLength=3}
[junit4:junit4]   2> 10052 T2556 oascc.ZkStateReader.updateClusterState Updating cloud state from ZooKeeper... 
[junit4:junit4]   2> 10053 T2556 oasc.Overseer$ClusterStateUpdater.updateState Update state numShards=1 message={
[junit4:junit4]   2> 	  "operation":"state",
[junit4:junit4]   2> 	  "numShards":"1",
[junit4:junit4]   2> 	  "shard":"shard1",
[junit4:junit4]   2> 	  "roles":null,
[junit4:junit4]   2> 	  "state":"active",
[junit4:junit4]   2> 	  "core":"collection1",
[junit4:junit4]   2> 	  "collection":"collection1",
[junit4:junit4]   2> 	  "node_name":"127.0.0.1:32019_hh_ov%2Fxj",
[junit4:junit4]   2> 	  "base_url":"http://127.0.0.1:32019/hh_ov/xj"}
[junit4:junit4]   2> 10078 T2606 oascc.ZkStateReader$2.process A cluster state change: WatchedEvent state:SyncConnected type:NodeDataChanged path:/clusterstate.json, has occurred - updating... (live nodes size: 5)
[junit4:junit4]   2> 10078 T2589 oascc.ZkStateReader$2.process A cluster state change: WatchedEvent state:SyncConnected type:NodeDataChanged path:/clusterstate.json, has occurred - updating... (live nodes size: 5)
[junit4:junit4]   2> 10078 T2561 oascc.ZkStateReader$2.process A cluster state change: WatchedEvent state:SyncConnected type:NodeDataChanged path:/clusterstate.json, has occurred - updating... (live nodes size: 5)
[junit4:junit4]   2> 10078 T2623 oascc.ZkStateReader$2.process A cluster state change: WatchedEvent state:SyncConnected type:NodeDataChanged path:/clusterstate.json, has occurred - updating... (live nodes size: 5)
[junit4:junit4]   2> 10078 T2574 oascc.ZkStateReader$2.process A cluster state change: WatchedEvent state:SyncConnected type:NodeDataChanged path:/clusterstate.json, has occurred - updating... (live nodes size: 5)
[junit4:junit4]   2> 10078 T2555 oascc.ZkStateReader$2.process A cluster state change: WatchedEvent state:SyncConnected type:NodeDataChanged path:/clusterstate.json, has occurred - updating... (live nodes size: 5)
[junit4:junit4]   2> 10102 T2626 oasc.SolrCore.registerSearcher [collection1] Registered new searcher Searcher@40bcad31 main{StandardDirectoryReader(segments_1:1)}
[junit4:junit4]   2> 10107 T2624 oasc.ZkController.publish publishing core=collection1 state=down
[junit4:junit4]   2> 10107 T2624 oasc.ZkController.publish numShards not found on descriptor - reading it from system property
[junit4:junit4]   2> 10582 T2556 oascc.ZkStateReader.updateClusterState Updating cloud state from ZooKeeper... 
[junit4:junit4]   2> 10583 T2556 oasc.Overseer$ClusterStateUpdater.updateState Update state numShards=1 message={
[junit4:junit4]   2> 	  "operation":"state",
[junit4:junit4]   2> 	  "numShards":"1",
[junit4:junit4]   2> 	  "shard":null,
[junit4:junit4]   2> 	  "roles":null,
[junit4:junit4]   2> 	  "state":"down",
[junit4:junit4]   2> 	  "core":"collection1",
[junit4:junit4]   2> 	  "collection":"collection1",
[junit4:junit4]   2> 	  "node_name":"127.0.0.1:32029_hh_ov%2Fxj",
[junit4:junit4]   2> 	  "base_url":"http://127.0.0.1:32029/hh_ov/xj"}
[junit4:junit4]   2> 10584 T2556 oasc.Overseer$ClusterStateUpdater.updateState Collection already exists with numShards=1
[junit4:junit4]   2> 10584 T2556 oasc.Overseer$ClusterStateUpdater.updateState Assigning new node to shard shard=shard1
[junit4:junit4]   2> 10631 T2561 oascc.ZkStateReader$2.process A cluster state change: WatchedEvent state:SyncConnected type:NodeDataChanged path:/clusterstate.json, has occurred - updating... (live nodes size: 5)
[junit4:junit4]   2> 10631 T2555 oascc.ZkStateReader$2.process A cluster state change: WatchedEvent state:SyncConnected type:NodeDataChanged path:/clusterstate.json, has occurred - updating... (live nodes size: 5)
[junit4:junit4]   2> 10631 T2574 oascc.ZkStateReader$2.process A cluster state change: WatchedEvent state:SyncConnected type:NodeDataChanged path:/clusterstate.json, has occurred - updating... (live nodes size: 5)
[junit4:junit4]   2> 10631 T2606 oascc.ZkStateReader$2.process A cluster state change: WatchedEvent state:SyncConnected type:NodeDataChanged path:/clusterstate.json, has occurred - updating... (live nodes size: 5)
[junit4:junit4]   2> 10631 T2589 oascc.ZkStateReader$2.process A cluster state change: WatchedEvent state:SyncConnected type:NodeDataChanged path:/clusterstate.json, has occurred - updating... (live nodes size: 5)
[junit4:junit4]   2> 10632 T2623 oascc.ZkStateReader$2.process A cluster state change: WatchedEvent state:SyncConnected type:NodeDataChanged path:/clusterstate.json, has occurred - updating... (live nodes size: 5)
[junit4:junit4]   2> 11110 T2624 oasc.CoreContainer.registerCore registering core: collection1
[junit4:junit4]   2> 11110 T2624 oasc.ZkController.register Register shard - core:collection1 address:http://127.0.0.1:32029/hh_ov/xj shardId:shard1
[junit4:junit4]   2> 11114 T2624 oasc.ZkController.register We are http://127.0.0.1:32029/hh_ov/xj/collection1/ and leader is http://127.0.0.1:32013/hh_ov/xj/collection1/
[junit4:junit4]   2> 11114 T2624 oasc.ZkController.register No LogReplay needed for core=collection1 baseURL=http://127.0.0.1:32029/hh_ov/xj
[junit4:junit4]   2> 11114 T2624 oasc.ZkController.checkRecovery Core needs to recover:collection1
[junit4:junit4]   2> 11114 T2624 oasu.DefaultSolrCoreState.doRecovery Running recovery - first canceling any ongoing recovery
[junit4:junit4]   2> ASYNC  NEW_CORE C161 name=collection1 org.apache.solr.core.SolrCore@6787f74a url=http://127.0.0.1:32029/hh_ov/xj/collection1 node=127.0.0.1:32029_hh_ov%2Fxj
[junit4:junit4]   2> 11115 T2627 C161 P32029 oasc.RecoveryStrategy.run Starting recovery process.  core=collection1 recoveringAfterStartup=true
[junit4:junit4]   2> 11115 T2624 oascc.ZkStateReader.updateClusterState Updating cloud state from ZooKeeper... 
[junit4:junit4]   2> 11116 T2627 C161 P32029 oasc.RecoveryStrategy.doRecovery ###### startupVersions=[]
[junit4:junit4]   2> 11116 T2627 C161 P32029 oasc.ZkController.publish publishing core=collection1 state=recovering
[junit4:junit4]   2> 11116 T2627 C161 P32029 oasc.ZkController.publish numShards not found on descriptor - reading it from system property
[junit4:junit4]   2> 11116 T2533 oass.SolrDispatchFilter.init user.dir=/usr/home/hudson/hudson-slave/workspace/Lucene-Solr-Tests-4.x-java7/solr/build/solr-core/test/J1
[junit4:junit4]   2> 11118 T2627 C161 P32029 oasc.RecoveryStrategy.doRecovery Attempting to PeerSync from http://127.0.0.1:32013/hh_ov/xj/collection1/ core=collection1 - recoveringAfterStartup=true
[junit4:junit4]   2> 11117 T2533 oass.SolrDispatchFilter.init SolrDispatchFilter.init() done
[junit4:junit4]   2> 11118 T2627 C161 P32029 oasu.PeerSync.sync PeerSync: core=collection1 url=http://127.0.0.1:32029/hh_ov/xj START replicas=[http://127.0.0.1:32013/hh_ov/xj/collection1/] nUpdates=100
[junit4:junit4]   2> 11118 T2533 oascsi.HttpClientUtil.createClient Creating new http client, config:maxConnections=128&maxConnectionsPerHost=32&followRedirects=false
[junit4:junit4]   2> 11119 T2627 C161 P32029 oasu.PeerSync.sync WARNING no frame of reference to tell of we've missed updates
[junit4:junit4]   2> 11119 T2627 C161 P32029 oasc.RecoveryStrategy.doRecovery PeerSync Recovery was not successful - trying replication. core=collection1
[junit4:junit4]   2> 11119 T2627 C161 P32029 oasc.RecoveryStrategy.doRecovery Starting Replication Recovery. core=collection1
[junit4:junit4]   2> 11119 T2627 C161 P32029 oascsi.HttpClientUtil.createClient Creating new http client, config:maxConnections=128&maxConnectionsPerHost=32&followRedirects=false
[junit4:junit4]   2> 11121 T2564 C159 P32013 REQ /get {distrib=false&qt=/get&wt=javabin&version=2&getVersions=100} status=0 QTime=0 
[junit4:junit4]   2> 11136 T2533 oascc.ZkStateReader.updateClusterState Updating cloud state from ZooKeeper... 
[junit4:junit4]   2> 11137 T2533 oasc.AbstractFullDistribZkTestBase.waitForThingsToLevelOut Wait for recoveries to finish - wait 15 for each attempt
[junit4:junit4]   2> 11138 T2533 oasc.AbstractDistribZkTestBase.waitForRecoveriesToFinish Wait for recoveries to finish - collection: collection1 failOnTimeout:true timeout (sec):15
[junit4:junit4]   2> 11138 T2533 oascc.ZkStateReader.updateClusterState Updating cloud state from ZooKeeper... 
[junit4:junit4]   2> 11164 T2556 oascc.ZkStateReader.updateClusterState Updating cloud state from ZooKeeper... 
[junit4:junit4]   2> 11232 T2556 oasc.Overseer$ClusterStateUpdater.updateState Update state numShards=1 message={
[junit4:junit4]   2> 	  "operation":"state",
[junit4:junit4]   2> 	  "numShards":"1",
[junit4:junit4]   2> 	  "shard":"shard1",
[junit4:junit4]   2> 	  "roles":null,
[junit4:junit4]   2> 	  "state":"recovering",
[junit4:junit4]   2> 	  "core":"collection1",
[junit4:junit4]   2> 	  "collection":"collection1",
[junit4:junit4]   2> 	  "node_name":"127.0.0.1:32029_hh_ov%2Fxj",
[junit4:junit4]   2> 	  "base_url":"http://127.0.0.1:32029/hh_ov/xj"}
[junit4:junit4]   2> 11255 T2561 oascc.ZkStateReader$2.process A cluster state change: WatchedEvent state:SyncConnected type:NodeDataChanged path:/clusterstate.json, has occurred - updating... (live nodes size: 5)
[junit4:junit4]   2> 11255 T2589 oascc.ZkStateReader$2.process A cluster state change: WatchedEvent state:SyncConnected type:NodeDataChanged path:/clusterstate.json, has occurred - updating... (live nodes size: 5)
[junit4:junit4]   2> 11255 T2574 oascc.ZkStateReader$2.process A cluster state change: WatchedEvent state:SyncConnected type:NodeDataChanged path:/clusterstate.json, has occurred - updating... (live nodes size: 5)
[junit4:junit4]   2> 11255 T2555 oascc.ZkStateReader$2.process A cluster state change: WatchedEvent state:SyncConnected type:NodeDataChanged path:/clusterstate.json, has occurred - updating... (live nodes size: 5)
[junit4:junit4]   2> 11255 T2606 oascc.ZkStateReader$2.process A cluster state change: WatchedEvent state:SyncConnected type:NodeDataChanged path:/clusterstate.json, has occurred - updating... (live nodes size: 5)
[junit4:junit4]   2> 11255 T2623 oascc.ZkStateReader$2.process A cluster state change: WatchedEvent state:SyncConnected type:NodeDataChanged path:/clusterstate.json, has occurred - updating... (live nodes size: 5)
[junit4:junit4]   2>  C160_STATE=coll:collection1 core:collection1 props:{shard=shard1, roles=null, state=recovering, core=collection1, collection=collection1, node_name=127.0.0.1:32024_hh_ov%2Fxj, base_url=http://127.0.0.1:32024/hh_ov/xj}
[junit4:junit4]   2> 11648 T2609 C160 P32024 oasc.RecoveryStrategy.doRecovery Begin buffering updates. core=collection1
[junit4:junit4]   2> 11648 T2609 C160 P32024 oasu.UpdateLog.bufferUpdates Starting to buffer updates. FSUpdateLog{state=ACTIVE, tlog=null}
[junit4:junit4]   2> 11648 T2609 C160 P32024 oasc.RecoveryStrategy.replicate Attempting to replicate from http://127.0.0.1:32013/hh_ov/xj/collection1/. core=collection1
[junit4:junit4]   2> 11649 T2609 C160 P32024 oascsi.HttpClientUtil.createClient Creating new http client, config:maxConnections=128&maxConnectionsPerHost=32&followRedirects=false
[junit4:junit4]   2> 11658 T2570 C159 P32013 oasu.DirectUpdateHandler2.commit start commit{flags=0,_version_=0,optimize=false,openSearcher=false,waitSearcher=true,expungeDeletes=false,softCommit=false}
[junit4:junit4]   2> 11663 T2570 C159 P32013 oasc.SolrDeletionPolicy.onCommit SolrDeletionPolicy.onCommit: commits:num=2
[junit4:junit4]   2> 		commit{dir=RateLimitedDirectoryWrapper(NRTCachingDirectory(org.apache.lucene.store.NIOFSDirectory@/usr/home/hudson/hudson-slave/workspace/Lucene-Solr-Tests-4.x-java7/solr/build/solr-core/test/J1/org.apache.solr.cloud.SyncSliceTest-1355781770504/jetty1/index lockFactory=org.apache.lucene.store.NativeFSLockFactory@59130c74; maxCacheMB=48.0 maxMergeSizeMB=4.0)),segFN=segments_2,generation=2,filenames=[segments_2]
[junit4:junit4]   2> 		commit{dir=RateLimitedDirectoryWrapper(NRTCachingDirectory(org.apache.lucene.store.NIOFSDirectory@/usr/home/hudson/hudson-slave/workspace/Lucene-Solr-Tests-4.x-java7/solr/build/solr-core/test/J1/org.apache.solr.cloud.SyncSliceTest-1355781770504/jetty1/index lockFactory=org.apache.lucene.store.NativeFSLockFactory@59130c74; maxCacheMB=48.0 maxMergeSizeMB=4.0)),segFN=segments_3,generation=3,filenames=[segments_3]
[junit4:junit4]   2> 11664 T2570 C159 P32013 oasc.SolrDeletionPolicy.updateCommits newest commit = 3[segments_3]
[junit4:junit4]   2> 11664 T2570 C159 P32013 oasc.CachingDirectoryFactory.close Releasing directory:/usr/home/hudson/hudson-slave/workspace/Lucene-Solr-Tests-4.x-java7/solr/build/solr-core/test/J1/./org.apache.solr.cloud.SyncSliceTest-1355781770504/jetty1
[junit4:junit4]   2> 11665 T2570 C159 P32013 oasu.DirectUpdateHandler2.commit end_commit_flush
[junit4:junit4]   2> 11665 T2570 C159 P32013 /update {waitSearcher=true&openSearcher=false&commit=true&commit_end_point=true&wt=javabin&softCommit=false&version=2} {commit=} 0 7
[junit4:junit4]   2> 11666 T2609 C160 P32024 oash.ReplicationHandler.inform Commits will be reserved for  10000
[junit4:junit4]   2> 11667 T2609 C160 P32024 oash.SnapPuller.<init>  No value set for 'pollInterval'. Timer Task not started.
[junit4:junit4]   2> 11669 T2568 C159 P32013 REQ /replication {command=indexversion&wt=javabin&qt=/replication&version=2} status=0 QTime=0 
[junit4:junit4]   2> 11670 T2609 C160 P32024 oash.SnapPuller.fetchLatestIndex Master's generation: 3
[junit4:junit4]   2> 11670 T2609 C160 P32024 oash.SnapPuller.fetchLatestIndex Slave's generation: 1
[junit4:junit4]   2> 11671 T2609 C160 P32024 oash.SnapPuller.fetchLatestIndex Starting replication process
[junit4:junit4]   2> 11673 T2568 C159 P32013 oasc.CachingDirectoryFactory.close Releasing directory:/usr/home/hudson/hudson-slave/workspace/Lucene-Solr-Tests-4.x-java7/solr/build/solr-core/test/J1/./org.apache.solr.cloud.SyncSliceTest-1355781770504/jetty1
[junit4:junit4]   2> 11674 T2568 C159 P32013 oasc.CachingDirectoryFactory.close Releasing directory:/usr/home/hudson/hudson-slave/workspace/Lucene-Solr-Tests-4.x-java7/solr/build/solr-core/test/J1/./org.apache.solr.cloud.SyncSliceTest-1355781770504/jetty1/index
[junit4:junit4]   2> 11674 T2568 C159 P32013 REQ /replication {command=filelist&generation=3&wt=javabin&qt=/replication&version=2} status=0 QTime=1 
[junit4:junit4]   2> 11675 T2609 C160 P32024 oash.SnapPuller.fetchLatestIndex Number of files in latest index in master: 1
[junit4:junit4]   2> 11676 T2609 C160 P32024 oasc.CachingDirectoryFactory.get return new directory for /usr/home/hudson/hudson-slave/workspace/Lucene-Solr-Tests-4.x-java7/solr/build/solr-core/test/J1/./org.apache.solr.cloud.SyncSliceTest-1355781770504/jetty3/index.20121217160302176 forceNew:false
[junit4:junit4]   2> 11677 T2609 C160 P32024 oasc.CachingDirectoryFactory.close Releasing directory:/usr/home/hudson/hudson-slave/workspace/Lucene-Solr-Tests-4.x-java7/solr/build/solr-core/test/J1/./org.apache.solr.cloud.SyncSliceTest-1355781770504/jetty3
[junit4:junit4]   2> 11677 T2609 C160 P32024 oash.SnapPuller.fetchLatestIndex Starting download to RateLimitedDirectoryWrapper(NRTCachingDirectory(org.apache.lucene.store.NIOFSDirectory@/usr/home/hudson/hudson-slave/workspace/Lucene-Solr-Tests-4.x-java7/solr/build/solr-core/test/J1/org.apache.solr.cloud.SyncSliceTest-1355781770504/jetty3/index.20121217160302176 lockFactory=org.apache.lucene.store.NativeFSLockFactory@1665e0f5; maxCacheMB=48.0 maxMergeSizeMB=4.0)) fullCopy=true
[junit4:junit4]   2> 11681 T2568 C159 P32013 REQ /replication {file=segments_3&command=filecontent&checksum=true&generation=3&qt=/replication&wt=filestream} status=0 QTime=0 
[junit4:junit4]   2> 11683 T2609 C160 P32024 oasc.CachingDirectoryFactory.close Releasing directory:/usr/home/hudson/hudson-slave/workspace/Lucene-Solr-Tests-4.x-java7/solr/build/solr-core/test/J1/./org.apache.solr.cloud.SyncSliceTest-1355781770504/jetty3/index
[junit4:junit4]   2> 11683 T2609 C160 P32024 oash.SnapPuller.fetchLatestIndex Total time taken for download : 0 secs
[junit4:junit4]   2> 11684 T2609 C160 P32024 oash.SnapPuller.modifyIndexProps New index installed. Updating index properties... index=index.20121217160302176
[junit4:junit4]   2> 11685 T2609 C160 P32024 oasc.CachingDirectoryFactory.close Releasing directory:/usr/home/hudson/hudson-slave/workspace/Lucene-Solr-Tests-4.x-java7/solr/build/solr-core/test/J1/./org.apache.solr.cloud.SyncSliceTest-1355781770504/jetty3
[junit4:junit4]   2> 11685 T2609 C160 P32024 oasc.CachingDirectoryFactory.close Releasing directory:/usr/home/hudson/hudson-slave/workspace/Lucene-Solr-Tests-4.x-java7/solr/build/solr-core/test/J1/./org.apache.solr.cloud.SyncSliceTest-1355781770504/jetty3
[junit4:junit4]   2> 11686 T2609 C160 P32024 oasc.SolrCore.getNewIndexDir New index directory detected: old=./org.apache.solr.cloud.SyncSliceTest-1355781770504/jetty3/index/ new=./org.apache.solr.cloud.SyncSliceTest-1355781770504/jetty3/index.20121217160302176
[junit4:junit4]   2> 11689 T2609 C160 P32024 oasc.SolrDeletionPolicy.onInit SolrDeletionPolicy.onInit: commits:num=1
[junit4:junit4]   2> 		commit{dir=RateLimitedDirectoryWrapper(NRTCachingDirectory(org.apache.lucene.store.NIOFSDirectory@/usr/home/hudson/hudson-slave/workspace/Lucene-Solr-Tests-4.x-java7/solr/build/solr-core/test/J1/org.apache.solr.cloud.SyncSliceTest-1355781770504/jetty3/index.20121217160302176 lockFactory=org.apache.lucene.store.NativeFSLockFactory@1665e0f5; maxCacheMB=48.0 maxMergeSizeMB=4.0)),segFN=segments_3,generation=3,filenames=[segments_3]
[junit4:junit4]   2> 11690 T2609 C160 P32024 oasc.SolrDeletionPolicy.updateCommits newest commit = 3[segments_3]
[junit4:junit4]   2> 11691 T2609 C160 P32024 oasc.CachingDirectoryFactory.close Releasing directory:/usr/home/hudson/hudson-slave/workspace/Lucene-Solr-Tests-4.x-java7/solr/build/solr-core/test/J1/./org.apache.solr.cloud.SyncSliceTest-1355781770504/jetty3
[junit4:junit4]   2> 11691 T2609 C160 P32024 oasu.DefaultSolrCoreState.newIndexWriter Creating new IndexWriter...
[junit4:junit4]   2> 11692 T2609 C160 P32024 oasu.DefaultSolrCoreState.newIndexWriter Waiting until IndexWriter is unused... core=collection1
[junit4:junit4]   2> 11692 T2609 C160 P32024 oasu.DefaultSolrCoreState.newIndexWriter Rollback old IndexWriter... core=collection1
[junit4:junit4]   2> 11693 T2609 C160 P32024 oasc.CachingDirectoryFactory.close Releasing directory:/usr/home/hudson/hudson-slave/workspace/Lucene-Solr-Tests-4.x-java7/solr/build/solr-core/test/J1/./org.apache.solr.cloud.SyncSliceTest-1355781770504/jetty3/index.20121217160302176
[junit4:junit4]   2> 11693 T2609 C160 P32024 oasc.CachingDirectoryFactory.close Releasing directory:/usr/home/hudson/hudson-slave/workspace/Lucene-Solr-Tests-4.x-java7/solr/build/solr-core/test/J1/./org.apache.solr.cloud.SyncSliceTest-1355781770504/jetty3
[junit4:junit4]   2> 11697 T2609 C160 P32024 oasc.SolrDeletionPolicy.onInit SolrDeletionPolicy.onInit: commits:num=1
[junit4:junit4]   2> 		commit{dir=RateLimitedDirectoryWrapper(NRTCachingDirectory(org.apache.lucene.store.NIOFSDirectory@/usr/home/hudson/hudson-slave/workspace/Lucene-Solr-Tests-4.x-java7/solr/build/solr-core/test/J1/org.apache.solr.cloud.SyncSliceTest-1355781770504/jetty3/index.20121217160302176 lockFactory=org.apache.lucene.store.NativeFSLockFactory@1665e0f5; maxCacheMB=48.0 maxMergeSizeMB=4.0)),segFN=segments_3,generation=3,filenames=[segments_3]
[junit4:junit4]   2> 11697 T2609 C160 P32024 oasc.SolrDeletionPolicy.updateCommits newest commit = 3[segments_3]
[junit4:junit4]   2> 11697 T2609 C160 P32024 oasu.DefaultSolrCoreState.newIndexWriter New IndexWriter is ready to be used.
[junit4:junit4]   2> 11698 T2609 C160 P32024 oasc.CachingDirectoryFactory.close Releasing directory:/usr/home/hudson/hudson-slave/workspace/Lucene-Solr-Tests-4.x-java7/solr/build/solr-core/test/J1/./org.apache.solr.cloud.SyncSliceTest-1355781770504/jetty3
[junit4:junit4]   2> 11698 T2609 C160 P32024 oass.SolrIndexSearcher.<init> Opening Searcher@cc13c52 main
[junit4:junit4]   2> 11700 T2608 oasc.SolrCore.registerSearcher [collection1] Registered new searcher Searcher@cc13c52 main{StandardDirectoryReader(segments_3:1:nrt)}
[junit4:junit4]   2> 11700 T2608 oasc.CachingDirectoryFactory.close Releasing directory:/usr/home/hudson/hudson-slave/workspace/Lucene-Solr-Tests-4.x-java7/solr/build/solr-core/test/J1/./org.apache.solr.cloud.SyncSliceTest-1355781770504/jetty3/index
[junit4:junit4]   2> 11700 T2609 C160 P32024 oasu.DirectUpdateHandler2.commit start commit{flags=0,_version_=0,optimize=false,openSearcher=false,waitSearcher=false,expungeDeletes=false,softCommit=false}
[junit4:junit4]   2> 11704 T2609 C160 P32024 oasc.SolrDeletionPolicy.onCommit SolrDeletionPolicy.onCommit: commits:num=2
[junit4:junit4]   2> 		commit{dir=RateLimitedDirectoryWrapper(NRTCachingDirectory(org.apache.lucene.store.NIOFSDirectory@/usr/home/hudson/hudson-slave/workspace/Lucene-Solr-Tests-4.x-java7/solr/build/solr-core/test/J1/org.apache.solr.cloud.SyncSliceTest-1355781770504/jetty3/index.20121217160302176 lockFactory=org.apache.lucene.store.NativeFSLockFactory@1665e0f5; maxCacheMB=48.0 maxMergeSizeMB=4.0)),segFN=segments_3,generation=3,filenames=[segments_3]
[junit4:junit4]   2> 		commit{dir=RateLimitedDirectoryWrapper(NRTCachingDirectory(org.apache.lucene.store.NIOFSDirectory@/usr/home/hudson/hudson-slave/workspace/Lucene-Solr-Tests-4.x-java7/solr/build/solr-core/test/J1/org.apache.solr.cloud.SyncSliceTest-1355781770504/jetty3/index.20121217160302176 lockFactory=org.apache.lucene.store.NativeFSLockFactory@1665e0f5; maxCacheMB=48.0 maxMergeSizeMB=4.0)),segFN=segments_4,generation=4,filenames=[segments_4]
[junit4:junit4]   2> 11704 T2609 C160 P32024 oasc.SolrDeletionPolicy.updateCommits newest commit = 4[segments_4]
[junit4:junit4]   2> 11706 T2609 C160 P32024 oasc.CachingDirectoryFactory.close Releasing directory:/usr/home/hudson/hudson-slave/workspace/Lucene-Solr-Tests-4.x-java7/solr/build/solr-core/test/J1/./org.apache.solr.cloud.SyncSliceTest-1355781770504/jetty3
[junit4:junit4]   2> 11706 T2609 C160 P32024 oasu.DirectUpdateHandler2.commit end_commit_flush
[junit4:junit4]   2> 11706 T2609 C160 P32024 oasc.CachingDirectoryFactory.close Releasing directory:/usr/home/hudson/hudson-slave/workspace/Lucene-Solr-Tests-4.x-java7/solr/build/solr-core/test/J1/./org.apache.solr.cloud.SyncSliceTest-1355781770504/jetty3/index.20121217160302176
[junit4:junit4]   2> 11707 T2609 C160 P32024 oasc.CachingDirectoryFactory.close Releasing directory:/usr/home/hudson/hudson-slave/workspace/Lucene-Solr-Tests-4.x-java7/solr/build/solr-core/test/J1/./org.apache.solr.cloud.SyncSliceTest-1355781770504/jetty3/index
[junit4:junit4]   2> 11707 T2609 C160 P32024 oasc.RecoveryStrategy.replay No replay needed. core=collection1
[junit4:junit4]   2> 11707 T2609 C160 P32024 oasc.RecoveryStrategy.doRecovery Replication Recovery was successful - registering as Active. core=collection1
[junit4:junit4]   2> 11707 T2609 C160 P32024 oasc.ZkController.publish publishing core=collection1 state=active
[junit4:junit4]   2> 11707 T2609 C160 P32024 oasc.ZkController.publish numShards not found on descriptor - reading it from system property
[junit4:junit4]   2> 11714 T2609 C160 P32024 oasc.RecoveryStrategy.doRecovery Finished recovery process. core=collection1
[junit4:junit4]   2> 11760 T2556 oascc.ZkStateReader.updateClusterState Updating cloud state from ZooKeeper... 
[junit4:junit4]   2> 11761 T2556 oasc.Overseer$ClusterStateUpdater.updateState Update state numShards=1 message={
[junit4:junit4]   2> 	  "operation":"state",
[junit4:junit4]   2> 	  "numShards":"1",
[junit4:junit4]   2> 	  "shard":"shard1",
[junit4:junit4]   2> 	  "roles":null,
[junit4:junit4]   2> 	  "state":"active",
[junit4:junit4]   2> 	  "core":"collection1",
[junit4:junit4]   2> 	  "collection":"collection1",
[junit4:junit4]   2> 	  "node_name":"127.0.0.1:32024_hh_ov%2Fxj",
[junit4:junit4]   2> 	  "base_url":"http://127.0.0.1:32024/hh_ov/xj"}
[junit4:junit4]   2> 11775 T2561 oascc.ZkStateReader$2.process A cluster state change: WatchedEvent state:SyncConnected type:NodeDataChanged path:/clusterstate.json, has occurred - updating... (live nodes size: 5)
[junit4:junit4]   2> 11775 T2623 oascc.ZkStateReader$2.process A cluster state change: WatchedEvent state:SyncConnected type:NodeDataChanged path:/clusterstate.json, has occurred - updating... (live nodes size: 5)
[junit4:junit4]   2> 11775 T2589 oascc.ZkStateReader$2.process A cluster state change: WatchedEvent state:SyncConnected type:NodeDataChanged path:/clusterstate.json, has occurred - updating... (live nodes size: 5)
[junit4:junit4]   2> 11775 T2606 oascc.ZkStateReader$2.process A cluster state change: WatchedEvent state:SyncConnected type:NodeDataChanged path:/clusterstate.json, has occurred - updating... (live nodes size: 5)
[junit4:junit4]   2> 11775 T2574 oascc.ZkStateReader$2.process A cluster state change: WatchedEvent state:SyncConnected type:NodeDataChanged path:/clusterstate.json, has occurred - updating... (live nodes size: 5)
[junit4:junit4]   2> 11775 T2555 oascc.ZkStateReader$2.process A cluster state change: WatchedEvent state:SyncConnected type:NodeDataChanged path:/clusterstate.json, has occurred - updating... (live nodes size: 5)
[junit4:junit4]   2> 12140 T2533 oascc.ZkStateReader.updateClusterState Updating cloud state from ZooKeeper... 
[junit4:junit4]   2> 13142 T2533 oascc.ZkStateReader.updateClusterState Updating cloud state from ZooKeeper... 
[junit4:junit4]   2>  C161_STATE=coll:collection1 core:collection1 props:{shard=shard1, roles=null, state=recovering, core=collection1, collection=collection1, node_name=127.0.0.1:32029_hh_ov%2Fxj, base_url=http://127.0.0.1:32029/hh_ov/xj}
[junit4:junit4]   2> 14138 T2627 C161 P32029 oasc.RecoveryStrategy.doRecovery Begin buffering updates. core=collection1
[junit4:junit4]   2> 14138 T2627 C161 P32029 oasu.UpdateLog.bufferUpdates Starting to buffer updates. FSUpdateLog{state=ACTIVE, tlog=null}
[junit4:junit4]   2> 14138 T2627 C161 P32029 oasc.RecoveryStrategy.replicate Attempting to replicate from http://127.0.0.1:32013/hh_ov/xj/collection1/. core=collection1
[junit4:junit4]   2> 14139 T2627 C161 P32029 oascsi.HttpClientUtil.createClient Creating new http client, config:maxConnections=128&maxConnectionsPerHost=32&followRedirects=false
[junit4:junit4]   2> 14145 T2533 oascc.ZkStateReader.updateClusterState Updating cloud state from ZooKeeper... 
[junit4:junit4]   2> 14154 T2565 C159 P32013 oasu.DirectUpdateHandler2.commit start commit{flags=0,_version_=0,optimize=false,openSearcher=false,waitSearcher=true,expungeDeletes=false,softCommit=false}
[junit4:junit4]   2> 14201 T2565 C159 P32013 oasc.SolrDeletionPolicy.onCommit SolrDeletionPolicy.onCommit: commits:num=3
[junit4:junit4]   2> 		commit{dir=RateLimitedDirectoryWrapper(NRTCachingDirectory(org.apache.lucene.store.NIOFSDirectory@/usr/home/hudson/hudson-slave/workspace/Lucene-Solr-Tests-4.x-java7/solr/build/solr-core/test/J1/org.apache.solr.cloud.SyncSliceTest-1355781770504/jetty1/index lockFactory=org.apache.lucene.store.NativeFSLockFactory@59130c74; maxCacheMB=48.0 maxMergeSizeMB=4.0)),segFN=segments_2,generation=2,filenames=[segments_2]
[junit4:junit4]   2> 		commit{dir=RateLimitedDirectoryWrapper(NRTCachingDirectory(org.apache.lucene.store.NIOFSDirectory@/usr/home/hudson/hudson-slave/workspace/Lucene-Solr-Tests-4.x-java7/solr/build/solr-core/test/J1/org.apache.solr.cloud.SyncSliceTest-1355781770504/jetty1/index lockFactory=org.apache.lucene.store.NativeFSLockFactory@59130c74; maxCacheMB=48.0 maxMergeSizeMB=4.0)),segFN=segments_3,generation=3,filenames=[segments_3]
[junit4:junit4]   2> 		commit{dir=RateLimitedDirectoryWrapper(NRTCachingDirectory(org.apache.lucene.store.NIOFSDirectory@/usr/home/hudson/hudson-slave/workspace/Lucene-Solr-Tests-4.x-java7/solr/build/solr-core/test/J1/org.apache.solr.cloud.SyncSliceTest-1355781770504/jetty1/index lockFactory=org.apache.lucene.store.NativeFSLockFactory@59130c74; maxCacheMB=48.0 maxMergeSizeMB=4.0)),segFN=segments_4,generation=4,filenames=[segments_4]
[junit4:junit4]   2> 14202 T2565 C159 P32013 oasc.SolrDeletionPolicy.updateCommits newest commit = 4[segments_4]
[junit4:junit4]   2> 14204 T2565 C159 P32013 oasc.CachingDirectoryFactory.close Releasing directory:/usr/home/hudson/hudson-slave/workspace/Lucene-Solr-Tests-4.x-java7/solr/build/solr-core/test/J1/./org.apache.solr.cloud.SyncSliceTest-1355781770504/jetty1
[junit4:junit4]   2> 14205 T2565 C159 P32013 oasu.DirectUpdateHandler2.commit end_commit_flush
[junit4:junit4]   2> 14205 T2565 C159 P32013 /update {waitSearcher=true&openSearcher=false&commit=true&commit_end_point=true&wt=javabin&softCommit=false&version=2} {commit=} 0 51
[junit4:junit4]   2> 14207 T2627 C161 P32029 oash.ReplicationHandler.inform Commits will be reserved for  10000
[junit4:junit4]   2> 14207 T2627 C161 P32029 oash.SnapPuller.<init>  No value set for 'pollInterval'. Timer Task not started.
[junit4:junit4]   2> 14210 T2568 C159 P32013 REQ /replication {command=indexversion&wt=javabin&qt=/replication&version=2} status=0

[...truncated too long message...]

tCnxn$EventThread.run EventThread shut down
[junit4:junit4]   2> 118970 T2533 oaz.ZooKeeper.close Session: 0x13baae40d0d000c closed
[junit4:junit4]   2> 118971 T2533 oejsh.ContextHandler.doStop stopped o.e.j.s.ServletContextHandler{/hh_ov/xj,null}
[junit4:junit4]   2> 119136 T2533 oas.SolrTestCaseJ4.tearDown ###Ending testDistribSearch
[junit4:junit4]   1> client port:0.0.0.0/0.0.0.0:0
[junit4:junit4]   2> NOTE: reproduce with: ant test  -Dtestcase=SyncSliceTest -Dtests.method=testDistribSearch -Dtests.seed=BF39A2C09A4432F -Dtests.multiplier=3 -Dtests.slow=true -Dtests.locale=no_NO_NY -Dtests.timezone=America/Mexico_City -Dtests.file.encoding=UTF-8
[junit4:junit4] FAILURE  119s J1 | SyncSliceTest.testDistribSearch <<<
[junit4:junit4]    > Throwable #1: java.lang.AssertionError
[junit4:junit4]    > 	at __randomizedtesting.SeedInfo.seed([BF39A2C09A4432F:8A1514347EFB2313]:0)
[junit4:junit4]    > 	at org.junit.Assert.fail(Assert.java:92)
[junit4:junit4]    > 	at org.junit.Assert.assertTrue(Assert.java:43)
[junit4:junit4]    > 	at org.junit.Assert.assertNotNull(Assert.java:526)
[junit4:junit4]    > 	at org.junit.Assert.assertNotNull(Assert.java:537)
[junit4:junit4]    > 	at org.apache.solr.cloud.SyncSliceTest.doTest(SyncSliceTest.java:211)
[junit4:junit4]    > 	at org.apache.solr.BaseDistributedSearchTestCase.testDistribSearch(BaseDistributedSearchTestCase.java:794)
[junit4:junit4]    > 	at sun.reflect.NativeMethodAccessorImpl.invoke0(Native Method)
[junit4:junit4]    > 	at sun.reflect.NativeMethodAccessorImpl.invoke(NativeMethodAccessorImpl.java:57)
[junit4:junit4]    > 	at sun.reflect.DelegatingMethodAccessorImpl.invoke(DelegatingMethodAccessorImpl.java:43)
[junit4:junit4]    > 	at java.lang.reflect.Method.invoke(Method.java:601)
[junit4:junit4]    > 	at com.carrotsearch.randomizedtesting.RandomizedRunner.invoke(RandomizedRunner.java:1559)
[junit4:junit4]    > 	at com.carrotsearch.randomizedtesting.RandomizedRunner.access$600(RandomizedRunner.java:79)
[junit4:junit4]    > 	at com.carrotsearch.randomizedtesting.RandomizedRunner$6.evaluate(RandomizedRunner.java:737)
[junit4:junit4]    > 	at com.carrotsearch.randomizedtesting.RandomizedRunner$7.evaluate(RandomizedRunner.java:773)
[junit4:junit4]    > 	at com.carrotsearch.randomizedtesting.RandomizedRunner$8.evaluate(RandomizedRunner.java:787)
[junit4:junit4]    > 	at com.carrotsearch.randomizedtesting.rules.SystemPropertiesRestoreRule$1.evaluate(SystemPropertiesRestoreRule.java:53)
[junit4:junit4]    > 	at org.apache.lucene.util.TestRuleSetupTeardownChained$1.evaluate(TestRuleSetupTeardownChained.java:50)
[junit4:junit4]    > 	at org.apache.lucene.util.TestRuleFieldCacheSanity$1.evaluate(TestRuleFieldCacheSanity.java:51)
[junit4:junit4]    > 	at org.apache.lucene.util.AbstractBeforeAfterRule$1.evaluate(AbstractBeforeAfterRule.java:46)
[junit4:junit4]    > 	at com.carrotsearch.randomizedtesting.rules.SystemPropertiesInvariantRule$1.evaluate(SystemPropertiesInvariantRule.java:55)
[junit4:junit4]    > 	at org.apache.lucene.util.TestRuleThreadAndTestName$1.evaluate(TestRuleThreadAndTestName.java:49)
[junit4:junit4]    > 	at org.apache.lucene.util.TestRuleIgnoreAfterMaxFailures$1.evaluate(TestRuleIgnoreAfterMaxFailures.java:70)
[junit4:junit4]    > 	at org.apache.lucene.util.TestRuleMarkFailure$1.evaluate(TestRuleMarkFailure.java:48)
[junit4:junit4]    > 	at com.carrotsearch.randomizedtesting.rules.StatementAdapter.evaluate(StatementAdapter.java:36)
[junit4:junit4]    > 	at com.carrotsearch.randomizedtesting.ThreadLeakControl$StatementRunner.run(ThreadLeakControl.java:358)
[junit4:junit4]    > 	at com.carrotsearch.randomizedtesting.ThreadLeakControl.forkTimeoutingTask(ThreadLeakControl.java:782)
[junit4:junit4]    > 	at com.carrotsearch.randomizedtesting.ThreadLeakControl$3.evaluate(ThreadLeakControl.java:442)
[junit4:junit4]    > 	at com.carrotsearch.randomizedtesting.RandomizedRunner.runSingleTest(RandomizedRunner.java:746)
[junit4:junit4]    > 	at com.carrotsearch.randomizedtesting.RandomizedRunner$3.evaluate(RandomizedRunner.java:648)
[junit4:junit4]    > 	at com.carrotsearch.randomizedtesting.RandomizedRunner$4.evaluate(RandomizedRunner.java:682)
[junit4:junit4]    > 	at com.carrotsearch.randomizedtesting.RandomizedRunner$5.evaluate(RandomizedRunner.java:693)
[junit4:junit4]    > 	at com.carrotsearch.randomizedtesting.rules.StatementAdapter.evaluate(StatementAdapter.java:36)
[junit4:junit4]    > 	at com.carrotsearch.randomizedtesting.rules.SystemPropertiesRestoreRule$1.evaluate(SystemPropertiesRestoreRule.java:53)
[junit4:junit4]    > 	at org.apache.lucene.util.AbstractBeforeAfterRule$1.evaluate(AbstractBeforeAfterRule.java:46)
[junit4:junit4]    > 	at org.apache.lucene.util.TestRuleStoreClassName$1.evaluate(TestRuleStoreClassName.java:42)
[junit4:junit4]    > 	at com.carrotsearch.randomizedtesting.rules.SystemPropertiesInvariantRule$1.evaluate(SystemPropertiesInvariantRule.java:55)
[junit4:junit4]    > 	at com.carrotsearch.randomizedtesting.rules.NoShadowingOrOverridesOnMethodsRule$1.evaluate(NoShadowingOrOverridesOnMethodsRule.java:39)
[junit4:junit4]    > 	at com.carrotsearch.randomizedtesting.rules.NoShadowingOrOverridesOnMethodsRule$1.evaluate(NoShadowingOrOverridesOnMethodsRule.java:39)
[junit4:junit4]    > 	at com.carrotsearch.randomizedtesting.rules.StatementAdapter.evaluate(StatementAdapter.java:36)
[junit4:junit4]    > 	at org.apache.lucene.util.TestRuleAssertionsRequired$1.evaluate(TestRuleAssertionsRequired.java:43)
[junit4:junit4]    > 	at org.apache.lucene.util.TestRuleMarkFailure$1.evaluate(TestRuleMarkFailure.java:48)
[junit4:junit4]    > 	at org.apache.lucene.util.TestRuleIgnoreAfterMaxFailures$1.evaluate(TestRuleIgnoreAfterMaxFailures.java:70)
[junit4:junit4]    > 	at org.apache.lucene.util.TestRuleIgnoreTestSuites$1.evaluate(TestRuleIgnoreTestSuites.java:55)
[junit4:junit4]    > 	at com.carrotsearch.randomizedtesting.rules.StatementAdapter.evaluate(StatementAdapter.java:36)
[junit4:junit4]    > 	at com.carrotsearch.randomizedtesting.ThreadLeakControl$StatementRunner.run(ThreadLeakControl.java:358)
[junit4:junit4]    > 	at java.lang.Thread.run(Thread.java:722)
[junit4:junit4]   2> 119157 T2533 oas.SolrTestCaseJ4.deleteCore ###deleteCore
[junit4:junit4]   2> NOTE: test params are: codec=Asserting, sim=DefaultSimilarity, locale=no_NO_NY, timezone=America/Mexico_City
[junit4:junit4]   2> NOTE: FreeBSD 9.0-RELEASE amd64/Oracle Corporation 1.7.0_09 (64-bit)/cpus=16,threads=2,free=135720144,total=497025024
[junit4:junit4]   2> NOTE: All tests run in this JVM: [TestDocSet, FieldMutatingUpdateProcessorTest, OpenExchangeRatesOrgProviderTest, RecoveryZkTest, ClusterStateUpdateTest, XmlUpdateRequestHandlerTest, TestSolrXMLSerializer, ZkSolrClientTest, BasicFunctionalityTest, SolrInfoMBeanTest, ZkCLITest, SoftAutoCommitTest, ReturnFieldsTest, TestStressRecovery, PrimitiveFieldTypeTest, StatelessScriptUpdateProcessorFactoryTest, TestRealTimeGet, SignatureUpdateProcessorFactoryTest, TestReplicationHandler, TestBinaryField, DirectUpdateHandlerTest, SuggesterTest, TestSolrIndexConfig, FullSolrCloudDistribCmdsTest, LukeRequestHandlerTest, LeaderElectionTest, TestReversedWildcardFilterFactory, PolyFieldTest, TestSolrDeletionPolicy2, EchoParamsTest, DisMaxRequestHandlerTest, ZkNodePropsTest, TestFastWriter, UpdateParamsTest, DistributedQueryElevationComponentTest, TestUpdate, StatsComponentTest, ScriptEngineTest, TestCodecSupport, TestSurroundQueryParser, TestPropInject, IndexSchemaRuntimeFieldTest, UUIDFieldTest, TestTrie, PeerSyncTest, XsltUpdateRequestHandlerTest, TestStressVersions, IndexSchemaTest, SolrCoreTest, TestOmitPositions, TestSolrCoreProperties, TestDistributedSearch, TestQuerySenderListener, ResponseLogComponentTest, TestPluginEnable, TestElisionMultitermQuery, TestJmxIntegration, BasicDistributedZkTest, TestMultiCoreConfBootstrap, TestSort, DirectSolrSpellCheckerTest, TestFiltering, TestIndexSearcher, TestFunctionQuery, DirectSolrConnectionTest, QueryEqualityTest, TestCSVLoader, TestCSVResponseWriter, DocumentBuilderTest, BinaryUpdateRequestHandlerTest, QueryParsingTest, StandardRequestHandlerTest, TestPHPSerializedResponseWriter, PingRequestHandlerTest, JsonLoaderTest, DocumentAnalysisRequestHandlerTest, TestValueSourceCache, SearchHandlerTest, SuggesterFSTTest, TestQueryUtils, SuggesterTSTTest, TestSearchPerf, BadIndexSchemaTest, TestLuceneMatchVersion, TestWriterPerf, TestPropInjectDefaults, TestCollationField, IndexReaderFactoryTest, OutputWriterTest, MultiTermTest, SpellPossibilityIteratorTest, TestPerFieldSimilarity, TestDFRSimilarityFactory, TimeZoneUtilsTest, DateMathParserTest, PluginInfoTest, ResourceLoaderTest, DateFieldTest, TestBadConfig, PathHierarchyTokenizerFactoryTest, OverseerCollectionProcessorTest, ShardRoutingTest, SyncSliceTest]
[junit4:junit4] Completed on J1 in 119.18s, 1 test, 1 failure <<< FAILURES!

[...truncated 36 lines...]
BUILD FAILED
/usr/home/hudson/hudson-slave/workspace/Lucene-Solr-Tests-4.x-java7/build.xml:353: The following error occurred while executing this line:
/usr/home/hudson/hudson-slave/workspace/Lucene-Solr-Tests-4.x-java7/build.xml:39: The following error occurred while executing this line:
/usr/home/hudson/hudson-slave/workspace/Lucene-Solr-Tests-4.x-java7/solr/build.xml:178: The following error occurred while executing this line:
/usr/home/hudson/hudson-slave/workspace/Lucene-Solr-Tests-4.x-java7/solr/common-build.xml:438: The following error occurred while executing this line:
/usr/home/hudson/hudson-slave/workspace/Lucene-Solr-Tests-4.x-java7/lucene/common-build.xml:1175: The following error occurred while executing this line:
/usr/home/hudson/hudson-slave/workspace/Lucene-Solr-Tests-4.x-java7/lucene/common-build.xml:840: There were test failures: 243 suites, 1010 tests, 1 failure, 21 ignored (3 assumptions)

Total time: 36 minutes 28 seconds
Build step 'Invoke Ant' marked build as failure
Archiving artifacts
Recording test results
Email was triggered for: Failure
Sending email for trigger: Failure



Mime
View raw message