lucene-dev mailing list archives

Site index · List index
Message view « Date » · « Thread »
Top « Date » · « Thread »
From Apache Jenkins Server <jenk...@builds.apache.org>
Subject [JENKINS] Lucene-Solr-Tests-trunk-java7 - Build # 3563 - Still Failing
Date Wed, 19 Dec 2012 19:38:47 GMT
Build: https://builds.apache.org/job/Lucene-Solr-Tests-trunk-java7/3563/

3 tests failed.
FAILED:  junit.framework.TestSuite.org.apache.solr.cloud.BasicDistributedZkTest

Error Message:
Suite timeout exceeded (>= 7200000 msec).

Stack Trace:
java.lang.Exception: Suite timeout exceeded (>= 7200000 msec).
	at __randomizedtesting.SeedInfo.seed([1E97D968F8B57EAE]:0)


REGRESSION:  org.apache.solr.handler.component.DistributedMLTComponentTest.testDistribSearch

Error Message:
Server at http://127.0.0.1:10589 returned non ok status:500, message:Server Error

Stack Trace:
org.apache.solr.common.SolrException: Server at http://127.0.0.1:10589 returned non ok status:500, message:Server Error
	at __randomizedtesting.SeedInfo.seed([1E97D968F8B57EAE:9F7157708FEA1E92]:0)
	at org.apache.solr.client.solrj.impl.HttpSolrServer.request(HttpSolrServer.java:372)
	at org.apache.solr.client.solrj.impl.HttpSolrServer.request(HttpSolrServer.java:181)
	at org.apache.solr.client.solrj.request.QueryRequest.process(QueryRequest.java:90)
	at org.apache.solr.client.solrj.SolrServer.query(SolrServer.java:301)
	at org.apache.solr.BaseDistributedSearchTestCase.queryServer(BaseDistributedSearchTestCase.java:470)
	at org.apache.solr.BaseDistributedSearchTestCase.query(BaseDistributedSearchTestCase.java:493)
	at org.apache.solr.BaseDistributedSearchTestCase.query(BaseDistributedSearchTestCase.java:475)
	at org.apache.solr.handler.component.DistributedMLTComponentTest.doTest(DistributedMLTComponentTest.java:119)
	at org.apache.solr.BaseDistributedSearchTestCase.testDistribSearch(BaseDistributedSearchTestCase.java:794)
	at sun.reflect.NativeMethodAccessorImpl.invoke0(Native Method)
	at sun.reflect.NativeMethodAccessorImpl.invoke(NativeMethodAccessorImpl.java:57)
	at sun.reflect.DelegatingMethodAccessorImpl.invoke(DelegatingMethodAccessorImpl.java:43)
	at java.lang.reflect.Method.invoke(Method.java:601)
	at com.carrotsearch.randomizedtesting.RandomizedRunner.invoke(RandomizedRunner.java:1559)
	at com.carrotsearch.randomizedtesting.RandomizedRunner.access$600(RandomizedRunner.java:79)
	at com.carrotsearch.randomizedtesting.RandomizedRunner$6.evaluate(RandomizedRunner.java:737)
	at com.carrotsearch.randomizedtesting.RandomizedRunner$7.evaluate(RandomizedRunner.java:773)
	at com.carrotsearch.randomizedtesting.RandomizedRunner$8.evaluate(RandomizedRunner.java:787)
	at com.carrotsearch.randomizedtesting.rules.SystemPropertiesRestoreRule$1.evaluate(SystemPropertiesRestoreRule.java:53)
	at org.apache.lucene.util.TestRuleSetupTeardownChained$1.evaluate(TestRuleSetupTeardownChained.java:50)
	at org.apache.lucene.util.TestRuleFieldCacheSanity$1.evaluate(TestRuleFieldCacheSanity.java:51)
	at org.apache.lucene.util.AbstractBeforeAfterRule$1.evaluate(AbstractBeforeAfterRule.java:46)
	at com.carrotsearch.randomizedtesting.rules.SystemPropertiesInvariantRule$1.evaluate(SystemPropertiesInvariantRule.java:55)
	at org.apache.lucene.util.TestRuleThreadAndTestName$1.evaluate(TestRuleThreadAndTestName.java:49)
	at org.apache.lucene.util.TestRuleIgnoreAfterMaxFailures$1.evaluate(TestRuleIgnoreAfterMaxFailures.java:70)
	at org.apache.lucene.util.TestRuleMarkFailure$1.evaluate(TestRuleMarkFailure.java:48)
	at com.carrotsearch.randomizedtesting.rules.StatementAdapter.evaluate(StatementAdapter.java:36)
	at com.carrotsearch.randomizedtesting.ThreadLeakControl$StatementRunner.run(ThreadLeakControl.java:358)
	at com.carrotsearch.randomizedtesting.ThreadLeakControl.forkTimeoutingTask(ThreadLeakControl.java:782)
	at com.carrotsearch.randomizedtesting.ThreadLeakControl$3.evaluate(ThreadLeakControl.java:442)
	at com.carrotsearch.randomizedtesting.RandomizedRunner.runSingleTest(RandomizedRunner.java:746)
	at com.carrotsearch.randomizedtesting.RandomizedRunner$3.evaluate(RandomizedRunner.java:648)
	at com.carrotsearch.randomizedtesting.RandomizedRunner$4.evaluate(RandomizedRunner.java:682)
	at com.carrotsearch.randomizedtesting.RandomizedRunner$5.evaluate(RandomizedRunner.java:693)
	at com.carrotsearch.randomizedtesting.rules.StatementAdapter.evaluate(StatementAdapter.java:36)
	at com.carrotsearch.randomizedtesting.rules.SystemPropertiesRestoreRule$1.evaluate(SystemPropertiesRestoreRule.java:53)
	at org.apache.lucene.util.AbstractBeforeAfterRule$1.evaluate(AbstractBeforeAfterRule.java:46)
	at org.apache.lucene.util.TestRuleStoreClassName$1.evaluate(TestRuleStoreClassName.java:42)
	at com.carrotsearch.randomizedtesting.rules.SystemPropertiesInvariantRule$1.evaluate(SystemPropertiesInvariantRule.java:55)
	at com.carrotsearch.randomizedtesting.rules.NoShadowingOrOverridesOnMethodsRule$1.evaluate(NoShadowingOrOverridesOnMethodsRule.java:39)
	at com.carrotsearch.randomizedtesting.rules.NoShadowingOrOverridesOnMethodsRule$1.evaluate(NoShadowingOrOverridesOnMethodsRule.java:39)
	at com.carrotsearch.randomizedtesting.rules.StatementAdapter.evaluate(StatementAdapter.java:36)
	at org.apache.lucene.util.TestRuleAssertionsRequired$1.evaluate(TestRuleAssertionsRequired.java:43)
	at org.apache.lucene.util.TestRuleMarkFailure$1.evaluate(TestRuleMarkFailure.java:48)
	at org.apache.lucene.util.TestRuleIgnoreAfterMaxFailures$1.evaluate(TestRuleIgnoreAfterMaxFailures.java:70)
	at org.apache.lucene.util.TestRuleIgnoreTestSuites$1.evaluate(TestRuleIgnoreTestSuites.java:55)
	at com.carrotsearch.randomizedtesting.rules.StatementAdapter.evaluate(StatementAdapter.java:36)
	at com.carrotsearch.randomizedtesting.ThreadLeakControl$StatementRunner.run(ThreadLeakControl.java:358)
	at java.lang.Thread.run(Thread.java:722)


FAILED:  org.apache.solr.cloud.BasicDistributedZkTest.testDistribSearch

Error Message:
Test abandoned because suite timeout was reached.

Stack Trace:
java.lang.Exception: Test abandoned because suite timeout was reached.
	at __randomizedtesting.SeedInfo.seed([1E97D968F8B57EAE]:0)




Build Log:
[...truncated 8710 lines...]
[junit4:junit4] Suite: org.apache.solr.handler.component.DistributedMLTComponentTest
[junit4:junit4]   2> 0 T226 oas.BaseDistributedSearchTestCase.initHostContext Setting hostContext system property: /
[junit4:junit4]   2> 5 T226 oas.SolrTestCaseJ4.setUp ###Starting testDistribSearch
[junit4:junit4]   2> 7 T226 oejs.Server.doStart jetty-8.1.8.v20121106
[junit4:junit4]   2> 11 T226 oejs.AbstractConnector.doStart Started SocketConnector@127.0.0.1:10587
[junit4:junit4]   2> 12 T226 oasc.SolrResourceLoader.locateSolrHome JNDI not configured for solr (NoInitialContextEx)
[junit4:junit4]   2> 12 T226 oasc.SolrResourceLoader.locateSolrHome using system property solr.solr.home: /usr/home/hudson/hudson-slave/workspace/Lucene-Solr-Tests-trunk-java7/solr/build/solr-core/test-files/solr
[junit4:junit4]   2> 13 T226 oasc.SolrResourceLoader.<init> new SolrResourceLoader for deduced Solr Home: '/usr/home/hudson/hudson-slave/workspace/Lucene-Solr-Tests-trunk-java7/solr/build/solr-core/test-files/solr/'
[junit4:junit4]   2> 48 T226 oass.SolrDispatchFilter.init SolrDispatchFilter.init()
[junit4:junit4]   2> 49 T226 oasc.SolrResourceLoader.locateSolrHome JNDI not configured for solr (NoInitialContextEx)
[junit4:junit4]   2> 50 T226 oasc.SolrResourceLoader.locateSolrHome using system property solr.solr.home: /usr/home/hudson/hudson-slave/workspace/Lucene-Solr-Tests-trunk-java7/solr/build/solr-core/test-files/solr
[junit4:junit4]   2> 50 T226 oasc.CoreContainer$Initializer.initialize looking for solr.xml: /usr/home/hudson/hudson-slave/workspace/Lucene-Solr-Tests-trunk-java7/solr/build/solr-core/test-files/solr/solr.xml
[junit4:junit4]   2> 50 T226 oasc.CoreContainer.<init> New CoreContainer 1664420707
[junit4:junit4]   2> 51 T226 oasc.CoreContainer.load Loading CoreContainer using Solr Home: '/usr/home/hudson/hudson-slave/workspace/Lucene-Solr-Tests-trunk-java7/solr/build/solr-core/test-files/solr/'
[junit4:junit4]   2> 52 T226 oasc.SolrResourceLoader.<init> new SolrResourceLoader for directory: '/usr/home/hudson/hudson-slave/workspace/Lucene-Solr-Tests-trunk-java7/solr/build/solr-core/test-files/solr/'
[junit4:junit4]   2> 78 T226 oashc.HttpShardHandlerFactory.getParameter Setting socketTimeout to: 30000
[junit4:junit4]   2> 79 T226 oashc.HttpShardHandlerFactory.getParameter Setting urlScheme to: http://
[junit4:junit4]   2> 79 T226 oashc.HttpShardHandlerFactory.getParameter Setting connTimeout to: 15000
[junit4:junit4]   2> 80 T226 oashc.HttpShardHandlerFactory.getParameter Setting maxConnectionsPerHost to: 20
[junit4:junit4]   2> 80 T226 oashc.HttpShardHandlerFactory.getParameter Setting corePoolSize to: 0
[junit4:junit4]   2> 80 T226 oashc.HttpShardHandlerFactory.getParameter Setting maximumPoolSize to: 2147483647
[junit4:junit4]   2> 81 T226 oashc.HttpShardHandlerFactory.getParameter Setting maxThreadIdleTime to: 5
[junit4:junit4]   2> 81 T226 oashc.HttpShardHandlerFactory.getParameter Setting sizeOfQueue to: -1
[junit4:junit4]   2> 82 T226 oashc.HttpShardHandlerFactory.getParameter Setting fairnessPolicy to: false
[junit4:junit4]   2> 82 T226 oascsi.HttpClientUtil.createClient Creating new http client, config:maxConnectionsPerHost=20&maxConnections=10000&socketTimeout=30000&connTimeout=15000&retry=false
[junit4:junit4]   2> 103 T226 oasc.CoreContainer.load Registering Log Listener
[junit4:junit4]   2> 126 T236 oasc.CoreContainer.create Creating SolrCore 'collection1' using instanceDir: /usr/home/hudson/hudson-slave/workspace/Lucene-Solr-Tests-trunk-java7/solr/build/solr-core/test-files/solr/collection1
[junit4:junit4]   2> 127 T236 oasc.SolrResourceLoader.<init> new SolrResourceLoader for directory: '/usr/home/hudson/hudson-slave/workspace/Lucene-Solr-Tests-trunk-java7/solr/build/solr-core/test-files/solr/collection1/'
[junit4:junit4]   2> 128 T236 oasc.SolrResourceLoader.replaceClassLoader Adding 'file:/usr/home/hudson/hudson-slave/workspace/Lucene-Solr-Tests-trunk-java7/solr/build/solr-core/test-files/solr/collection1/lib/classes/' to classloader
[junit4:junit4]   2> 129 T236 oasc.SolrResourceLoader.replaceClassLoader Adding 'file:/usr/home/hudson/hudson-slave/workspace/Lucene-Solr-Tests-trunk-java7/solr/build/solr-core/test-files/solr/collection1/lib/README' to classloader
[junit4:junit4]   2> 175 T236 oasc.SolrConfig.<init> Using Lucene MatchVersion: LUCENE_50
[junit4:junit4]   2> 234 T236 oasc.SolrConfig.<init> Loaded SolrConfig: solrconfig.xml
[junit4:junit4]   2> 234 T236 oass.IndexSchema.readSchema Reading Solr Schema
[junit4:junit4]   2> 241 T236 oass.IndexSchema.readSchema Schema name=test
[junit4:junit4]   2> 771 T236 oass.OpenExchangeRatesOrgProvider.init Initialized with rates=open-exchange-rates.json, refreshInterval=1440.
[junit4:junit4]   2> 782 T236 oass.IndexSchema.readSchema default search field in schema is text
[junit4:junit4]   2> 785 T236 oass.IndexSchema.readSchema unique key field: id
[junit4:junit4]   2> 797 T236 oass.FileExchangeRateProvider.reload Reloading exchange rates from file currency.xml
[junit4:junit4]   2> 801 T236 oass.FileExchangeRateProvider.reload Reloading exchange rates from file currency.xml
[junit4:junit4]   2> 804 T236 oass.OpenExchangeRatesOrgProvider.reload Reloading exchange rates from open-exchange-rates.json
[junit4:junit4]   2> 806 T236 oass.OpenExchangeRatesOrgProvider.reload Reloading exchange rates from open-exchange-rates.json
[junit4:junit4]   2> 807 T236 oasc.SolrCore.<init> [collection1] Opening new SolrCore at /usr/home/hudson/hudson-slave/workspace/Lucene-Solr-Tests-trunk-java7/solr/build/solr-core/test-files/solr/collection1/, dataDir=./org.apache.solr.handler.component.DistributedMLTComponentTest-1355938373313/control/data/
[junit4:junit4]   2> 808 T236 oasc.JmxMonitoredMap.<init> JMX monitoring is enabled. Adding Solr mbeans to JMX Server: com.sun.jmx.mbeanserver.JmxMBeanServer@410b0419
[junit4:junit4]   2> 808 T236 oasc.SolrCore.initDirectoryFactory org.apache.solr.core.MockDirectoryFactory
[junit4:junit4]   2> 809 T236 oasc.CachingDirectoryFactory.get return new directory for /usr/home/hudson/hudson-slave/workspace/Lucene-Solr-Tests-trunk-java7/solr/build/solr-core/test/J0/./org.apache.solr.handler.component.DistributedMLTComponentTest-1355938373313/control/data forceNew:false
[junit4:junit4]   2> 809 T236 oasc.CachingDirectoryFactory.close Releasing directory:/usr/home/hudson/hudson-slave/workspace/Lucene-Solr-Tests-trunk-java7/solr/build/solr-core/test/J0/./org.apache.solr.handler.component.DistributedMLTComponentTest-1355938373313/control/data
[junit4:junit4]   2> 809 T236 oasc.SolrCore.getNewIndexDir New index directory detected: old=null new=./org.apache.solr.handler.component.DistributedMLTComponentTest-1355938373313/control/data/index/
[junit4:junit4]   2> 810 T236 oasc.SolrCore.initIndex WARNING [collection1] Solr index directory './org.apache.solr.handler.component.DistributedMLTComponentTest-1355938373313/control/data/index' doesn't exist. Creating new index...
[junit4:junit4]   2> 811 T236 oasc.CachingDirectoryFactory.get return new directory for /usr/home/hudson/hudson-slave/workspace/Lucene-Solr-Tests-trunk-java7/solr/build/solr-core/test/J0/./org.apache.solr.handler.component.DistributedMLTComponentTest-1355938373313/control/data/index forceNew:false
[junit4:junit4]   2> 813 T236 oasc.SolrDeletionPolicy.onCommit SolrDeletionPolicy.onCommit: commits:num=1
[junit4:junit4]   2> 		commit{dir=RateLimitedDirectoryWrapper(MockDirWrapper(org.apache.lucene.store.RAMDirectory@4b710474 lockFactory=org.apache.lucene.store.NativeFSLockFactory@234bdd73)),segFN=segments_1,generation=1,filenames=[segments_1]
[junit4:junit4]   2> 814 T236 oasc.SolrDeletionPolicy.updateCommits newest commit = 1[segments_1]
[junit4:junit4]   2> 814 T236 oasc.CachingDirectoryFactory.close Releasing directory:/usr/home/hudson/hudson-slave/workspace/Lucene-Solr-Tests-trunk-java7/solr/build/solr-core/test/J0/./org.apache.solr.handler.component.DistributedMLTComponentTest-1355938373313/control/data/index
[junit4:junit4]   2> 815 T236 oasc.SolrCore.initWriters created xml: solr.XMLResponseWriter
[junit4:junit4]   2> 817 T236 oasup.UpdateRequestProcessorChain.init inserting DistributedUpdateProcessorFactory into updateRequestProcessorChain "dedupe"
[junit4:junit4]   2> 817 T236 oasup.UpdateRequestProcessorChain.init inserting DistributedUpdateProcessorFactory into updateRequestProcessorChain "dedupe-allfields"
[junit4:junit4]   2> 817 T236 oasup.UpdateRequestProcessorChain.init inserting DistributedUpdateProcessorFactory into updateRequestProcessorChain "stored_sig"
[junit4:junit4]   2> 818 T236 oasup.UpdateRequestProcessorChain.init inserting DistributedUpdateProcessorFactory into updateRequestProcessorChain "uniq-fields"
[junit4:junit4]   2> 819 T236 oasup.UpdateRequestProcessorChain.init inserting DistributedUpdateProcessorFactory into updateRequestProcessorChain "distrib-dup-test-chain-implicit"
[junit4:junit4]   2> 819 T236 oasc.RequestHandlers.initHandlersFromConfig adding lazy requestHandler: solr.ReplicationHandler
[junit4:junit4]   2> 819 T236 oasc.RequestHandlers.initHandlersFromConfig created /replication: solr.ReplicationHandler
[junit4:junit4]   2> 820 T236 oasc.RequestHandlers.initHandlersFromConfig created standard: solr.StandardRequestHandler
[junit4:junit4]   2> 821 T236 oasc.RequestHandlers.initHandlersFromConfig created /get: solr.RealTimeGetHandler
[junit4:junit4]   2> 822 T236 oasc.RequestHandlers.initHandlersFromConfig created dismax: solr.SearchHandler
[junit4:junit4]   2> 823 T236 oasc.RequestHandlers.initHandlersFromConfig created mock: org.apache.solr.core.MockQuerySenderListenerReqHandler
[junit4:junit4]   2> 823 T236 oasc.RequestHandlers.initHandlersFromConfig created /admin/: org.apache.solr.handler.admin.AdminHandlers
[junit4:junit4]   2> 824 T236 oasc.RequestHandlers.initHandlersFromConfig created defaults: solr.StandardRequestHandler
[junit4:junit4]   2> 825 T236 oasc.RequestHandlers.initHandlersFromConfig adding lazy requestHandler: solr.StandardRequestHandler
[junit4:junit4]   2> 825 T236 oasc.RequestHandlers.initHandlersFromConfig created lazy: solr.StandardRequestHandler
[junit4:junit4]   2> 826 T236 oasc.RequestHandlers.initHandlersFromConfig created /update: solr.UpdateRequestHandler
[junit4:junit4]   2> 827 T236 oasc.RequestHandlers.initHandlersFromConfig created /terms: org.apache.solr.handler.component.SearchHandler
[junit4:junit4]   2> 828 T236 oasc.RequestHandlers.initHandlersFromConfig created spellCheckCompRH: org.apache.solr.handler.component.SearchHandler
[junit4:junit4]   2> 829 T236 oasc.RequestHandlers.initHandlersFromConfig created spellCheckCompRH_Direct: org.apache.solr.handler.component.SearchHandler
[junit4:junit4]   2> 830 T236 oasc.RequestHandlers.initHandlersFromConfig created spellCheckWithWordbreak: org.apache.solr.handler.component.SearchHandler
[junit4:junit4]   2> 831 T236 oasc.RequestHandlers.initHandlersFromConfig created spellCheckWithWordbreak_Direct: org.apache.solr.handler.component.SearchHandler
[junit4:junit4]   2> 831 T236 oasc.RequestHandlers.initHandlersFromConfig created spellCheckCompRH1: org.apache.solr.handler.component.SearchHandler
[junit4:junit4]   2> 832 T236 oasc.RequestHandlers.initHandlersFromConfig created mltrh: org.apache.solr.handler.component.SearchHandler
[junit4:junit4]   2> 833 T236 oasc.RequestHandlers.initHandlersFromConfig created tvrh: org.apache.solr.handler.component.SearchHandler
[junit4:junit4]   2> 834 T236 oasc.RequestHandlers.initHandlersFromConfig created /mlt: solr.MoreLikeThisHandler
[junit4:junit4]   2> 835 T236 oasc.RequestHandlers.initHandlersFromConfig created /debug/dump: solr.DumpRequestHandler
[junit4:junit4]   2> 846 T236 oashl.XMLLoader.init xsltCacheLifetimeSeconds=60
[junit4:junit4]   2> 851 T236 oasc.SolrCore.initDeprecatedSupport WARNING solrconfig.xml uses deprecated <admin/gettableFiles>, Please update your config to use the ShowFileRequestHandler.
[junit4:junit4]   2> 853 T236 oasc.SolrCore.initDeprecatedSupport WARNING adding ShowFileRequestHandler with hidden files: [THROW.ERROR.ON.ADD.UPDATEPROCESSOR.JS, SOLRCONFIG-HIGHLIGHT.XML, SCHEMA-REQUIRED-FIELDS.XML, BAD-SCHEMA-DUP-DYNAMICFIELD.XML, SCHEMA-REPLICATION2.XML, TRIVIAL.UPDATEPROCESSOR1.JS, SCHEMA-MINIMAL.XML, SOLRCONFIG-CACHING.XML, SOLRCONFIG-REPEATER.XML, BAD-SCHEMA-NONTEXT-ANALYZER.XML, SOLRCONFIG-MERGEPOLICY.XML, CURRENCY.XML, SOLRCONFIG-TLOG.XML, SOLRCONFIG-MASTER.XML, BAD-SCHEMA-UNIQUEKEY-MULTIVALUED.XML, SCHEMA11.XML, SOLRCONFIG-BASIC.XML, DA_COMPOUNDDICTIONARY.TXT, MISSLEADING.EXTENSION.UPDATEPROCESSOR.JS.TXT, SCHEMA-COPYFIELD-TEST.XML, SOLRCONFIG-SLAVE.XML, SOLRCONFIG-PROPINJECT-INDEXDEFAULT.XML, ELEVATE.XML, TRIVIAL.UPDATEPROCESSOR0.JS, BAD-SOLRCONFIG-BOGUS-SCRIPTENGINE-NAME.XML, SCHEMA-IB.XML, SCHEMA-CHARFILTERS.XML, SOLRCONFIG-QUERYSENDER.XML, DA_UTF8.XML, SCHEMA-REPLICATION1.XML, SOLRCONFIG-SNIPPET-PROCESSOR.XML, CONDITIONAL.UPDATEPROCESSOR.JS, MISSING.FUNCTIONS.UPDATEPROCESSOR.JS, SOLRCONFIG-ENABLEPLUGIN.XML, HYPHENATION.DTD, SCHEMA-PHRASESUGGEST.XML, STEMDICT.TXT, HUNSPELL-TEST.AFF, SCHEMA-SNIPPET-TYPE.XML, STOPTYPES-1.TXT, STOPWORDSWRONGENCODING.TXT, SCHEMA-NUMERIC.XML, SOLRCONFIG-TRANSFORMERS.XML, SOLRCONFIG-PROPINJECT.XML, BAD-SCHEMA-NOT-INDEXED-BUT-TF.XML, SOLRCONFIG-SIMPLELOCK.XML, WDFTYPES.TXT, SCHEMA-REVERSED.XML, STOPTYPES-2.TXT, BAD-SCHEMA-CURRENCY-FT-MULTIVALUED.XML, SOLRCONFIG-SPELLCHECKCOMPONENT.XML, SCHEMA-DFR.XML, SOLRCONFIG-PHRASESUGGEST.XML, BAD-SCHEMA-CURRENCY-MULTIVALUED.XML, BAD-SCHEMA-NOT-INDEXED-BUT-POS.XML, KEEP-1.TXT, OPEN-EXCHANGE-RATES.JSON, SCHEMA-SPATIAL.XML, STOPWITHBOM.TXT, SCHEMA-BINARYFIELD.XML, SOLRCONFIG-SPELLCHECKER.XML, SOLRCONFIG-UPDATE-PROCESSOR-CHAINS.XML, BAD-SCHEMA-OMIT-TF-BUT-NOT-POS.XML, BAD-SCHEMA-DUP-FIELDTYPE.XML, SCHEMA-XINCLUDE.XML, SOLRCONFIG-MASTER1.XML, SCHEMA-BEHAVIOR.XML, SYNONYMS.TXT, BAD-SCHEMA-CURRENCY-DYNAMIC-MULTIVALUED.XML, SCHEMA_CODEC.XML, SCHEMA.XML, SOLRCONFIG-SOLR-749.XML, SCHEMA-EFF.XML, SOLRCONFIG-MASTER1-KEEPONEBACKUP.XML, SOLRCONFIG-FUNCTIONQUERY.XML, STOP-2.TXT, SOLRCONFIG-TERMINDEX.XML, SCHEMA-LMDIRICHLET.XML, SOLRCONFIG-ELEVATE.XML, STOPWORDS.TXT, SCHEMA-FOLDING.XML, SCHEMA-STOP-KEEP.XML, FUZZYSUGGEST.TXT, BAD-SCHEMA-NOT-INDEXED-BUT-NORMS.XML, SOLRCONFIG-SOLCOREPROPERTIES.XML, STOP-1.TXT, SOLRCONFIG-MASTER2.XML, SCHEMA-SPELLCHECKER.XML, SOLRCONFIG-RESPONSE-LOG-COMPONENT.XML, SOLRCONFIG-LAZYWRITER.XML, SCHEMA-LUCENEMATCHVERSION.XML, BAD-MP-SOLRCONFIG.XML, FRENCHARTICLES.TXT, SCHEMA15.XML, SOLRCONFIG-REQHANDLER.INCL, SCHEMASURROUND.XML, SOLRCONFIG-MASTER3.XML, HUNSPELL-TEST.DIC, SOLRCONFIG-XINCLUDE.XML, BAD-SCHEMA-CODEC-GLOBAL-VS-FT-MISMATCH.XML, SOLRCONFIG-SLAVE1.XML, SOLRCONFIG-DELPOLICY1.XML, SCHEMA-SIM.XML, SCHEMA-SNIPPET-FIELD.XML, SCHEMA-COLLATE.XML, STOP-SNOWBALL.TXT, BAD-SCHEMA-SIM-GLOBAL-VS-FT-MISMATCH.XML, PROTWORDS.TXT, SCHEMA-TRIE.XML, SOLRCONFIG_CODEC.XML, BAD-SOLRCONFIG-INVALID-SCRIPTFILE.XML, JASUGGEST.TXT, SCHEMA-TFIDF.XML, SOLRCONFIG-SCRIPT-UPDATEPROCESSOR.XML, SCHEMA-LMJELINEKMERCER.XML, PHRASESUGGEST.TXT, BAD-SOLRCONFIG-MISSING-SCRIPTFILE.XML, BAD-SCHEMA-UNIQUEKEY-USES-DEFAULT.XML, OLD_SYNONYMS.TXT, SOLRCONFIG-DELPOLICY2.XML, XSLT, SOLRCONFIG-NATIVELOCK.XML, BAD-SCHEMA-DUP-FIELD.XML, SOLRCONFIG-NOCACHE.XML, SCHEMA-BM25.XML, ADDFIELDS.UPDATEPROCESSOR.JS, SOLRCONFIG-ALTDIRECTORY.XML, SOLRCONFIG-QUERYSENDER-NOQUERY.XML, COMPOUNDDICTIONARY.TXT, SOLRCONFIG_PERF.XML, SOLRCONFIG-INDEXCONFIG.XML, SCHEMA-NOT-REQUIRED-UNIQUE-KEY.XML, BAD-SCHEMA-ANALYZER-CLASS-AND-NESTED.XML, KEEP-2.TXT, BAD-SCHEMA-UNIQUEKEY-IS-COPYFIELD-DEST.XML, SCHEMA12.XML, MAPPING-ISOLATIN1ACCENT.TXT, BAD_SOLRCONFIG.XML, BAD-SCHEMA-EXTERNAL-FILEFIELD.XML]
[junit4:junit4]   2> 855 T236 oasc.CachingDirectoryFactory.close Releasing directory:/usr/home/hudson/hudson-slave/workspace/Lucene-Solr-Tests-trunk-java7/solr/build/solr-core/test/J0/./org.apache.solr.handler.component.DistributedMLTComponentTest-1355938373313/control/data
[junit4:junit4]   2> 855 T236 oass.SolrIndexSearcher.<init> Opening Searcher@2c6462f1 main
[junit4:junit4]   2> 856 T236 oasu.CommitTracker.<init> Hard AutoCommit: disabled
[junit4:junit4]   2> 856 T236 oasu.CommitTracker.<init> Soft AutoCommit: disabled
[junit4:junit4]   2> 857 T236 oashc.SpellCheckComponent.inform Initializing spell checkers
[junit4:junit4]   2> 888 T236 oass.DirectSolrSpellChecker.init init: {name=direct,classname=DirectSolrSpellChecker,field=lowerfilt,minQueryLength=3}
[junit4:junit4]   2> 943 T237 oasc.SolrCore.registerSearcher [collection1] Registered new searcher Searcher@2c6462f1 main{StandardDirectoryReader(segments_1:1)}
[junit4:junit4]   2> 948 T236 oasc.CoreContainer.registerCore registering core: collection1
[junit4:junit4]   2> 948 T226 oass.SolrDispatchFilter.init user.dir=/usr/home/hudson/hudson-slave/workspace/Lucene-Solr-Tests-trunk-java7/solr/build/solr-core/test/J0
[junit4:junit4]   2> 949 T226 oass.SolrDispatchFilter.init SolrDispatchFilter.init() done
[junit4:junit4]   2> 949 T226 oascsi.HttpClientUtil.createClient Creating new http client, config:maxConnections=128&maxConnectionsPerHost=32&followRedirects=false
[junit4:junit4]   2> 962 T226 oejs.Server.doStart jetty-8.1.8.v20121106
[junit4:junit4]   2> 964 T226 oejs.AbstractConnector.doStart Started SocketConnector@127.0.0.1:10588
[junit4:junit4]   2> 965 T226 oasc.SolrResourceLoader.locateSolrHome JNDI not configured for solr (NoInitialContextEx)
[junit4:junit4]   2> 966 T226 oasc.SolrResourceLoader.locateSolrHome using system property solr.solr.home: /usr/home/hudson/hudson-slave/workspace/Lucene-Solr-Tests-trunk-java7/solr/build/solr-core/test-files/solr
[junit4:junit4]   2> 966 T226 oasc.SolrResourceLoader.<init> new SolrResourceLoader for deduced Solr Home: '/usr/home/hudson/hudson-slave/workspace/Lucene-Solr-Tests-trunk-java7/solr/build/solr-core/test-files/solr/'
[junit4:junit4]   2> 999 T226 oass.SolrDispatchFilter.init SolrDispatchFilter.init()
[junit4:junit4]   2> 999 T226 oasc.SolrResourceLoader.locateSolrHome JNDI not configured for solr (NoInitialContextEx)
[junit4:junit4]   2> 1000 T226 oasc.SolrResourceLoader.locateSolrHome using system property solr.solr.home: /usr/home/hudson/hudson-slave/workspace/Lucene-Solr-Tests-trunk-java7/solr/build/solr-core/test-files/solr
[junit4:junit4]   2> 1000 T226 oasc.CoreContainer$Initializer.initialize looking for solr.xml: /usr/home/hudson/hudson-slave/workspace/Lucene-Solr-Tests-trunk-java7/solr/build/solr-core/test-files/solr/solr.xml
[junit4:junit4]   2> 1000 T226 oasc.CoreContainer.<init> New CoreContainer 1727801177
[junit4:junit4]   2> 1001 T226 oasc.CoreContainer.load Loading CoreContainer using Solr Home: '/usr/home/hudson/hudson-slave/workspace/Lucene-Solr-Tests-trunk-java7/solr/build/solr-core/test-files/solr/'
[junit4:junit4]   2> 1001 T226 oasc.SolrResourceLoader.<init> new SolrResourceLoader for directory: '/usr/home/hudson/hudson-slave/workspace/Lucene-Solr-Tests-trunk-java7/solr/build/solr-core/test-files/solr/'
[junit4:junit4]   2> 1025 T226 oashc.HttpShardHandlerFactory.getParameter Setting socketTimeout to: 30000
[junit4:junit4]   2> 1026 T226 oashc.HttpShardHandlerFactory.getParameter Setting urlScheme to: http://
[junit4:junit4]   2> 1027 T226 oashc.HttpShardHandlerFactory.getParameter Setting connTimeout to: 15000
[junit4:junit4]   2> 1027 T226 oashc.HttpShardHandlerFactory.getParameter Setting maxConnectionsPerHost to: 20
[junit4:junit4]   2> 1027 T226 oashc.HttpShardHandlerFactory.getParameter Setting corePoolSize to: 0
[junit4:junit4]   2> 1028 T226 oashc.HttpShardHandlerFactory.getParameter Setting maximumPoolSize to: 2147483647
[junit4:junit4]   2> 1028 T226 oashc.HttpShardHandlerFactory.getParameter Setting maxThreadIdleTime to: 5
[junit4:junit4]   2> 1029 T226 oashc.HttpShardHandlerFactory.getParameter Setting sizeOfQueue to: -1
[junit4:junit4]   2> 1029 T226 oashc.HttpShardHandlerFactory.getParameter Setting fairnessPolicy to: false
[junit4:junit4]   2> 1030 T226 oascsi.HttpClientUtil.createClient Creating new http client, config:maxConnectionsPerHost=20&maxConnections=10000&socketTimeout=30000&connTimeout=15000&retry=false
[junit4:junit4]   2> 1042 T226 oasc.CoreContainer.load Registering Log Listener
[junit4:junit4]   2> 1074 T247 oasc.CoreContainer.create Creating SolrCore 'collection1' using instanceDir: /usr/home/hudson/hudson-slave/workspace/Lucene-Solr-Tests-trunk-java7/solr/build/solr-core/test-files/solr/collection1
[junit4:junit4]   2> 1075 T247 oasc.SolrResourceLoader.<init> new SolrResourceLoader for directory: '/usr/home/hudson/hudson-slave/workspace/Lucene-Solr-Tests-trunk-java7/solr/build/solr-core/test-files/solr/collection1/'
[junit4:junit4]   2> 1076 T247 oasc.SolrResourceLoader.replaceClassLoader Adding 'file:/usr/home/hudson/hudson-slave/workspace/Lucene-Solr-Tests-trunk-java7/solr/build/solr-core/test-files/solr/collection1/lib/classes/' to classloader
[junit4:junit4]   2> 1077 T247 oasc.SolrResourceLoader.replaceClassLoader Adding 'file:/usr/home/hudson/hudson-slave/workspace/Lucene-Solr-Tests-trunk-java7/solr/build/solr-core/test-files/solr/collection1/lib/README' to classloader
[junit4:junit4]   2> 1119 T247 oasc.SolrConfig.<init> Using Lucene MatchVersion: LUCENE_50
[junit4:junit4]   2> 1174 T247 oasc.SolrConfig.<init> Loaded SolrConfig: solrconfig.xml
[junit4:junit4]   2> 1175 T247 oass.IndexSchema.readSchema Reading Solr Schema
[junit4:junit4]   2> 1182 T247 oass.IndexSchema.readSchema Schema name=test
[junit4:junit4]   2> 1674 T247 oass.OpenExchangeRatesOrgProvider.init Initialized with rates=open-exchange-rates.json, refreshInterval=1440.
[junit4:junit4]   2> 1684 T247 oass.IndexSchema.readSchema default search field in schema is text
[junit4:junit4]   2> 1687 T247 oass.IndexSchema.readSchema unique key field: id
[junit4:junit4]   2> 1698 T247 oass.FileExchangeRateProvider.reload Reloading exchange rates from file currency.xml
[junit4:junit4]   2> 1703 T247 oass.FileExchangeRateProvider.reload Reloading exchange rates from file currency.xml
[junit4:junit4]   2> 1706 T247 oass.OpenExchangeRatesOrgProvider.reload Reloading exchange rates from open-exchange-rates.json
[junit4:junit4]   2> 1707 T247 oass.OpenExchangeRatesOrgProvider.reload Reloading exchange rates from open-exchange-rates.json
[junit4:junit4]   2> 1708 T247 oasc.SolrCore.<init> [collection1] Opening new SolrCore at /usr/home/hudson/hudson-slave/workspace/Lucene-Solr-Tests-trunk-java7/solr/build/solr-core/test-files/solr/collection1/, dataDir=./org.apache.solr.handler.component.DistributedMLTComponentTest-1355938373313/shard0/data/
[junit4:junit4]   2> 1708 T247 oasc.JmxMonitoredMap.<init> JMX monitoring is enabled. Adding Solr mbeans to JMX Server: com.sun.jmx.mbeanserver.JmxMBeanServer@410b0419
[junit4:junit4]   2> 1709 T247 oasc.SolrCore.initDirectoryFactory org.apache.solr.core.MockDirectoryFactory
[junit4:junit4]   2> 1710 T247 oasc.CachingDirectoryFactory.get return new directory for /usr/home/hudson/hudson-slave/workspace/Lucene-Solr-Tests-trunk-java7/solr/build/solr-core/test/J0/./org.apache.solr.handler.component.DistributedMLTComponentTest-1355938373313/shard0/data forceNew:false
[junit4:junit4]   2> 1710 T247 oasc.CachingDirectoryFactory.close Releasing directory:/usr/home/hudson/hudson-slave/workspace/Lucene-Solr-Tests-trunk-java7/solr/build/solr-core/test/J0/./org.apache.solr.handler.component.DistributedMLTComponentTest-1355938373313/shard0/data
[junit4:junit4]   2> 1710 T247 oasc.SolrCore.getNewIndexDir New index directory detected: old=null new=./org.apache.solr.handler.component.DistributedMLTComponentTest-1355938373313/shard0/data/index/
[junit4:junit4]   2> 1711 T247 oasc.SolrCore.initIndex WARNING [collection1] Solr index directory './org.apache.solr.handler.component.DistributedMLTComponentTest-1355938373313/shard0/data/index' doesn't exist. Creating new index...
[junit4:junit4]   2> 1712 T247 oasc.CachingDirectoryFactory.get return new directory for /usr/home/hudson/hudson-slave/workspace/Lucene-Solr-Tests-trunk-java7/solr/build/solr-core/test/J0/./org.apache.solr.handler.component.DistributedMLTComponentTest-1355938373313/shard0/data/index forceNew:false
[junit4:junit4]   2> 1714 T247 oasc.SolrDeletionPolicy.onCommit SolrDeletionPolicy.onCommit: commits:num=1
[junit4:junit4]   2> 		commit{dir=RateLimitedDirectoryWrapper(MockDirWrapper(org.apache.lucene.store.RAMDirectory@3ec5c781 lockFactory=org.apache.lucene.store.NativeFSLockFactory@457bd2f2)),segFN=segments_1,generation=1,filenames=[segments_1]
[junit4:junit4]   2> 1715 T247 oasc.SolrDeletionPolicy.updateCommits newest commit = 1[segments_1]
[junit4:junit4]   2> 1715 T247 oasc.CachingDirectoryFactory.close Releasing directory:/usr/home/hudson/hudson-slave/workspace/Lucene-Solr-Tests-trunk-java7/solr/build/solr-core/test/J0/./org.apache.solr.handler.component.DistributedMLTComponentTest-1355938373313/shard0/data/index
[junit4:junit4]   2> 1715 T247 oasc.SolrCore.initWriters created xml: solr.XMLResponseWriter
[junit4:junit4]   2> 1717 T247 oasup.UpdateRequestProcessorChain.init inserting DistributedUpdateProcessorFactory into updateRequestProcessorChain "dedupe"
[junit4:junit4]   2> 1718 T247 oasup.UpdateRequestProcessorChain.init inserting DistributedUpdateProcessorFactory into updateRequestProcessorChain "dedupe-allfields"
[junit4:junit4]   2> 1718 T247 oasup.UpdateRequestProcessorChain.init inserting DistributedUpdateProcessorFactory into updateRequestProcessorChain "stored_sig"
[junit4:junit4]   2> 1719 T247 oasup.UpdateRequestProcessorChain.init inserting DistributedUpdateProcessorFactory into updateRequestProcessorChain "uniq-fields"
[junit4:junit4]   2> 1719 T247 oasup.UpdateRequestProcessorChain.init inserting DistributedUpdateProcessorFactory into updateRequestProcessorChain "distrib-dup-test-chain-implicit"
[junit4:junit4]   2> 1719 T247 oasc.RequestHandlers.initHandlersFromConfig adding lazy requestHandler: solr.ReplicationHandler
[junit4:junit4]   2> 1720 T247 oasc.RequestHandlers.initHandlersFromConfig created /replication: solr.ReplicationHandler
[junit4:junit4]   2> 1721 T247 oasc.RequestHandlers.initHandlersFromConfig created standard: solr.StandardRequestHandler
[junit4:junit4]   2> 1722 T247 oasc.RequestHandlers.initHandlersFromConfig created /get: solr.RealTimeGetHandler
[junit4:junit4]   2> 1723 T247 oasc.RequestHandlers.initHandlersFromConfig created dismax: solr.SearchHandler
[junit4:junit4]   2> 1724 T247 oasc.RequestHandlers.initHandlersFromConfig created mock: org.apache.solr.core.MockQuerySenderListenerReqHandler
[junit4:junit4]   2> 1725 T247 oasc.RequestHandlers.initHandlersFromConfig created /admin/: org.apache.solr.handler.admin.AdminHandlers
[junit4:junit4]   2> 1726 T247 oasc.RequestHandlers.initHandlersFromConfig created defaults: solr.StandardRequestHandler
[junit4:junit4]   2> 1726 T247 oasc.RequestHandlers.initHandlersFromConfig adding lazy requestHandler: solr.StandardRequestHandler
[junit4:junit4]   2> 1726 T247 oasc.RequestHandlers.initHandlersFromConfig created lazy: solr.StandardRequestHandler
[junit4:junit4]   2> 1727 T247 oasc.RequestHandlers.initHandlersFromConfig created /update: solr.UpdateRequestHandler
[junit4:junit4]   2> 1728 T247 oasc.RequestHandlers.initHandlersFromConfig created /terms: org.apache.solr.handler.component.SearchHandler
[junit4:junit4]   2> 1729 T247 oasc.RequestHandlers.initHandlersFromConfig created spellCheckCompRH: org.apache.solr.handler.component.SearchHandler
[junit4:junit4]   2> 1730 T247 oasc.RequestHandlers.initHandlersFromConfig created spellCheckCompRH_Direct: org.apache.solr.handler.component.SearchHandler
[junit4:junit4]   2> 1732 T247 oasc.RequestHandlers.initHandlersFromConfig created spellCheckWithWordbreak: org.apache.solr.handler.component.SearchHandler
[junit4:junit4]   2> 1733 T247 oasc.RequestHandlers.initHandlersFromConfig created spellCheckWithWordbreak_Direct: org.apache.solr.handler.component.SearchHandler
[junit4:junit4]   2> 1734 T247 oasc.RequestHandlers.initHandlersFromConfig created spellCheckCompRH1: org.apache.solr.handler.component.SearchHandler
[junit4:junit4]   2> 1735 T247 oasc.RequestHandlers.initHandlersFromConfig created mltrh: org.apache.solr.handler.component.SearchHandler
[junit4:junit4]   2> 1736 T247 oasc.RequestHandlers.initHandlersFromConfig created tvrh: org.apache.solr.handler.component.SearchHandler
[junit4:junit4]   2> 1737 T247 oasc.RequestHandlers.initHandlersFromConfig created /mlt: solr.MoreLikeThisHandler
[junit4:junit4]   2> 1738 T247 oasc.RequestHandlers.initHandlersFromConfig created /debug/dump: solr.DumpRequestHandler
[junit4:junit4]   2> 1747 T247 oashl.XMLLoader.init xsltCacheLifetimeSeconds=60
[junit4:junit4]   2> 1751 T247 oasc.SolrCore.initDeprecatedSupport WARNING solrconfig.xml uses deprecated <admin/gettableFiles>, Please update your config to use the ShowFileRequestHandler.
[junit4:junit4]   2> 1753 T247 oasc.SolrCore.initDeprecatedSupport WARNING adding ShowFileRequestHandler with hidden files: [THROW.ERROR.ON.ADD.UPDATEPROCESSOR.JS, SOLRCONFIG-HIGHLIGHT.XML, SCHEMA-REQUIRED-FIELDS.XML, BAD-SCHEMA-DUP-DYNAMICFIELD.XML, SCHEMA-REPLICATION2.XML, TRIVIAL.UPDATEPROCESSOR1.JS, SCHEMA-MINIMAL.XML, SOLRCONFIG-CACHING.XML, SOLRCONFIG-REPEATER.XML, BAD-SCHEMA-NONTEXT-ANALYZER.XML, SOLRCONFIG-MERGEPOLICY.XML, CURRENCY.XML, SOLRCONFIG-TLOG.XML, SOLRCONFIG-MASTER.XML, BAD-SCHEMA-UNIQUEKEY-MULTIVALUED.XML, SCHEMA11.XML, SOLRCONFIG-BASIC.XML, DA_COMPOUNDDICTIONARY.TXT, MISSLEADING.EXTENSION.UPDATEPROCESSOR.JS.TXT, SCHEMA-COPYFIELD-TEST.XML, SOLRCONFIG-SLAVE.XML, SOLRCONFIG-PROPINJECT-INDEXDEFAULT.XML, ELEVATE.XML, TRIVIAL.UPDATEPROCESSOR0.JS, BAD-SOLRCONFIG-BOGUS-SCRIPTENGINE-NAME.XML, SCHEMA-IB.XML, SCHEMA-CHARFILTERS.XML, SOLRCONFIG-QUERYSENDER.XML, DA_UTF8.XML, SCHEMA-REPLICATION1.XML, SOLRCONFIG-SNIPPET-PROCESSOR.XML, CONDITIONAL.UPDATEPROCESSOR.JS, MISSING.FUNCTIONS.UPDATEPROCESSOR.JS, SOLRCONFIG-ENABLEPLUGIN.XML, HYPHENATION.DTD, SCHEMA-PHRASESUGGEST.XML, STEMDICT.TXT, HUNSPELL-TEST.AFF, SCHEMA-SNIPPET-TYPE.XML, STOPTYPES-1.TXT, STOPWORDSWRONGENCODING.TXT, SCHEMA-NUMERIC.XML, SOLRCONFIG-TRANSFORMERS.XML, SOLRCONFIG-PROPINJECT.XML, BAD-SCHEMA-NOT-INDEXED-BUT-TF.XML, SOLRCONFIG-SIMPLELOCK.XML, WDFTYPES.TXT, SCHEMA-REVERSED.XML, STOPTYPES-2.TXT, BAD-SCHEMA-CURRENCY-FT-MULTIVALUED.XML, SOLRCONFIG-SPELLCHECKCOMPONENT.XML, SCHEMA-DFR.XML, SOLRCONFIG-PHRASESUGGEST.XML, BAD-SCHEMA-CURRENCY-MULTIVALUED.XML, BAD-SCHEMA-NOT-INDEXED-BUT-POS.XML, KEEP-1.TXT, OPEN-EXCHANGE-RATES.JSON, SCHEMA-SPATIAL.XML, STOPWITHBOM.TXT, SCHEMA-BINARYFIELD.XML, SOLRCONFIG-SPELLCHECKER.XML, SOLRCONFIG-UPDATE-PROCESSOR-CHAINS.XML, BAD-SCHEMA-OMIT-TF-BUT-NOT-POS.XML, BAD-SCHEMA-DUP-FIELDTYPE.XML, SCHEMA-XINCLUDE.XML, SOLRCONFIG-MASTER1.XML, SCHEMA-BEHAVIOR.XML, SYNONYMS.TXT, BAD-SCHEMA-CURRENCY-DYNAMIC-MULTIVALUED.XML, SCHEMA_CODEC.XML, SCHEMA.XML, SOLRCONFIG-SOLR-749.XML, SCHEMA-EFF.XML, SOLRCONFIG-MASTER1-KEEPONEBACKUP.XML, SOLRCONFIG-FUNCTIONQUERY.XML, STOP-2.TXT, SOLRCONFIG-TERMINDEX.XML, SCHEMA-LMDIRICHLET.XML, SOLRCONFIG-ELEVATE.XML, STOPWORDS.TXT, SCHEMA-FOLDING.XML, SCHEMA-STOP-KEEP.XML, FUZZYSUGGEST.TXT, BAD-SCHEMA-NOT-INDEXED-BUT-NORMS.XML, SOLRCONFIG-SOLCOREPROPERTIES.XML, STOP-1.TXT, SOLRCONFIG-MASTER2.XML, SCHEMA-SPELLCHECKER.XML, SOLRCONFIG-RESPONSE-LOG-COMPONENT.XML, SOLRCONFIG-LAZYWRITER.XML, SCHEMA-LUCENEMATCHVERSION.XML, BAD-MP-SOLRCONFIG.XML, FRENCHARTICLES.TXT, SCHEMA15.XML, SOLRCONFIG-REQHANDLER.INCL, SCHEMASURROUND.XML, SOLRCONFIG-MASTER3.XML, HUNSPELL-TEST.DIC, SOLRCONFIG-XINCLUDE.XML, BAD-SCHEMA-CODEC-GLOBAL-VS-FT-MISMATCH.XML, SOLRCONFIG-SLAVE1.XML, SOLRCONFIG-DELPOLICY1.XML, SCHEMA-SIM.XML, SCHEMA-SNIPPET-FIELD.XML, SCHEMA-COLLATE.XML, STOP-SNOWBALL.TXT, BAD-SCHEMA-SIM-GLOBAL-VS-FT-MISMATCH.XML, PROTWORDS.TXT, SCHEMA-TRIE.XML, SOLRCONFIG_CODEC.XML, BAD-SOLRCONFIG-INVALID-SCRIPTFILE.XML, JASUGGEST.TXT, SCHEMA-TFIDF.XML, SOLRCONFIG-SCRIPT-UPDATEPROCESSOR.XML, SCHEMA-LMJELINEKMERCER.XML, PHRASESUGGEST.TXT, BAD-SOLRCONFIG-MISSING-SCRIPTFILE.XML, BAD-SCHEMA-UNIQUEKEY-USES-DEFAULT.XML, OLD_SYNONYMS.TXT, SOLRCONFIG-DELPOLICY2.XML, XSLT, SOLRCONFIG-NATIVELOCK.XML, BAD-SCHEMA-DUP-FIELD.XML, SOLRCONFIG-NOCACHE.XML, SCHEMA-BM25.XML, ADDFIELDS.UPDATEPROCESSOR.JS, SOLRCONFIG-ALTDIRECTORY.XML, SOLRCONFIG-QUERYSENDER-NOQUERY.XML, COMPOUNDDICTIONARY.TXT, SOLRCONFIG_PERF.XML, SOLRCONFIG-INDEXCONFIG.XML, SCHEMA-NOT-REQUIRED-UNIQUE-KEY.XML, BAD-SCHEMA-ANALYZER-CLASS-AND-NESTED.XML, KEEP-2.TXT, BAD-SCHEMA-UNIQUEKEY-IS-COPYFIELD-DEST.XML, SCHEMA12.XML, MAPPING-ISOLATIN1ACCENT.TXT, BAD_SOLRCONFIG.XML, BAD-SCHEMA-EXTERNAL-FILEFIELD.XML]
[junit4:junit4]   2> 1755 T247 oasc.CachingDirectoryFactory.close Releasing directory:/usr/home/hudson/hudson-slave/workspace/Lucene-Solr-Tests-trunk-java7/solr/build/solr-core/test/J0/./org.apache.solr.handler.component.DistributedMLTComponentTest-1355938373313/shard0/data
[junit4:junit4]   2> 1756 T247 oass.SolrIndexSearcher.<init> Opening Searcher@6d144e3a main
[junit4:junit4]   2> 1756 T247 oasu.CommitTracker.<init> Hard AutoCommit: disabled
[junit4:junit4]   2> 1757 T247 oasu.CommitTracker.<init> Soft AutoCommit: disabled
[junit4:junit4]   2> 1757 T247 oashc.SpellCheckComponent.inform Initializing spell checkers
[junit4:junit4]   2> 1763 T247 oass.DirectSolrSpellChecker.init init: {name=direct,classname=DirectSolrSpellChecker,field=lowerfilt,minQueryLength=3}
[junit4:junit4]   2> 1822 T248 oasc.SolrCore.registerSearcher [collection1] Registered new searcher Searcher@6d144e3a main{StandardDirectoryReader(segments_1:1)}
[junit4:junit4]   2> 1827 T247 oasc.CoreContainer.registerCore registering core: collection1
[junit4:junit4]   2> 1828 T226 oass.SolrDispatchFilter.init user.dir=/usr/home/hudson/hudson-slave/workspace/Lucene-Solr-Tests-trunk-java7/solr/build/solr-core/test/J0
[junit4:junit4]   2> 1828 T226 oass.SolrDispatchFilter.init SolrDispatchFilter.init() done
[junit4:junit4]   2> 1829 T226 oascsi.HttpClientUtil.createClient Creating new http client, config:maxConnections=128&maxConnectionsPerHost=32&followRedirects=false
[junit4:junit4]   2> 1842 T226 oejs.Server.doStart jetty-8.1.8.v20121106
[junit4:junit4]   2> 1844 T226 oejs.AbstractConnector.doStart Started SocketConnector@127.0.0.1:10589
[junit4:junit4]   2> 1845 T226 oasc.SolrResourceLoader.locateSolrHome JNDI not configured for solr (NoInitialContextEx)
[junit4:junit4]   2> 1845 T226 oasc.SolrResourceLoader.locateSolrHome using system property solr.solr.home: /usr/home/hudson/hudson-slave/workspace/Lucene-Solr-Tests-trunk-java7/solr/build/solr-core/test-files/solr
[junit4:junit4]   2> 1846 T226 oasc.SolrResourceLoader.<init> new SolrResourceLoader for deduced Solr Home: '/usr/home/hudson/hudson-slave/workspace/Lucene-Solr-Tests-trunk-java7/solr/build/solr-core/test-files/solr/'
[junit4:junit4]   2> 1879 T226 oass.SolrDispatchFilter.init SolrDispatchFilter.init()
[junit4:junit4]   2> 1880 T226 oasc.SolrResourceLoader.locateSolrHome JNDI not configured for solr (NoInitialContextEx)
[junit4:junit4]   2> 1880 T226 oasc.SolrResourceLoader.locateSolrHome using system property solr.solr.home: /usr/home/hudson/hudson-slave/workspace/Lucene-Solr-Tests-trunk-java7/solr/build/solr-core/test-files/solr
[junit4:junit4]   2> 1880 T226 oasc.CoreContainer$Initializer.initialize looking for solr.xml: /usr/home/hudson/hudson-slave/workspace/Lucene-Solr-Tests-trunk-java7/solr/build/solr-core/test-files/solr/solr.xml
[junit4:junit4]   2> 1881 T226 oasc.CoreContainer.<init> New CoreContainer 2030810868
[junit4:junit4]   2> 1881 T226 oasc.CoreContainer.load Loading CoreContainer using Solr Home: '/usr/home/hudson/hudson-slave/workspace/Lucene-Solr-Tests-trunk-java7/solr/build/solr-core/test-files/solr/'
[junit4:junit4]   2> 1882 T226 oasc.SolrResourceLoader.<init> new SolrResourceLoader for directory: '/usr/home/hudson/hudson-slave/workspace/Lucene-Solr-Tests-trunk-java7/solr/build/solr-core/test-files/solr/'
[junit4:junit4]   2> 1905 T226 oashc.HttpShardHandlerFactory.getParameter Setting socketTimeout to: 30000
[junit4:junit4]   2> 1905 T226 oashc.HttpShardHandlerFactory.getParameter Setting urlScheme to: http://
[junit4:junit4]   2> 1906 T226 oashc.HttpShardHandlerFactory.getParameter Setting connTimeout to: 15000
[junit4:junit4]   2> 1906 T226 oashc.HttpShardHandlerFactory.getParameter Setting maxConnectionsPerHost to: 20
[junit4:junit4]   2> 1906 T226 oashc.HttpShardHandlerFactory.getParameter Setting corePoolSize to: 0
[junit4:junit4]   2> 1907 T226 oashc.HttpShardHandlerFactory.getParameter Setting maximumPoolSize to: 2147483647
[junit4:junit4]   2> 1907 T226 oashc.HttpShardHandlerFactory.getParameter Setting maxThreadIdleTime to: 5
[junit4:junit4]   2> 1908 T226 oashc.HttpShardHandlerFactory.getParameter Setting sizeOfQueue to: -1
[junit4:junit4]   2> 1908 T226 oashc.HttpShardHandlerFactory.getParameter Setting fairnessPolicy to: false
[junit4:junit4]   2> 1909 T226 oascsi.HttpClientUtil.createClient Creating new http client, config:maxConnectionsPerHost=20&maxConnections=10000&socketTimeout=30000&connTimeout=15000&retry=false
[junit4:junit4]   2> 1923 T226 oasc.CoreContainer.load Registering Log Listener
[junit4:junit4]   2> 1950 T258 oasc.CoreContainer.create Creating SolrCore 'collection1' using instanceDir: /usr/home/hudson/hudson-slave/workspace/Lucene-Solr-Tests-trunk-java7/solr/build/solr-core/test-files/solr/collection1
[junit4:junit4]   2> 1952 T258 oasc.SolrResourceLoader.<init> new SolrResourceLoader for directory: '/usr/home/hudson/hudson-slave/workspace/Lucene-Solr-Tests-trunk-java7/solr/build/solr-core/test-files/solr/collection1/'
[junit4:junit4]   2> 1953 T258 oasc.SolrResourceLoader.replaceClassLoader Adding 'file:/usr/home/hudson/hudson-slave/workspace/Lucene-Solr-Tests-trunk-java7/solr/build/solr-core/test-files/solr/collection1/lib/classes/' to classloader
[junit4:junit4]   2> 1953 T258 oasc.SolrResourceLoader.replaceClassLoader Adding 'file:/usr/home/hudson/hudson-slave/workspace/Lucene-Solr-Tests-trunk-java7/solr/build/solr-core/test-files/solr/collection1/lib/README' to classloader
[junit4:junit4]   2> 1994 T258 oasc.SolrConfig.<init> Using Lucene MatchVersion: LUCENE_50
[junit4:junit4]   2> 2055 T258 oasc.SolrConfig.<init> Loaded SolrConfig: solrconfig.xml
[junit4:junit4]   2> 2056 T258 oass.IndexSchema.readSchema Reading Solr Schema
[junit4:junit4]   2> 2062 T258 oass.IndexSchema.readSchema Schema name=test
[junit4:junit4]   2> 2726 T258 oass.OpenExchangeRatesOrgProvider.init Initialized with rates=open-exchange-rates.json, refreshInterval=1440.
[junit4:junit4]   2> 2740 T258 oass.IndexSchema.readSchema default search field in schema is text
[junit4:junit4]   2> 2752 T258 oass.IndexSchema.readSchema unique key field: id
[junit4:junit4]   2> 2771 T258 oass.FileExchangeRateProvider.reload Reloading exchange rates from file currency.xml
[junit4:junit4]   2> 2780 T258 oass.FileExchangeRateProvider.reload Reloading exchange rates from file currency.xml
[junit4:junit4]   2> 2785 T258 oass.OpenExchangeRatesOrgProvider.reload Reloading exchange rates from open-exchange-rates.json
[junit4:junit4]   2> 2787 T258 oass.OpenExchangeRatesOrgProvider.reload Reloading exchange rates from open-exchange-rates.json
[junit4:junit4]   2> 2788 T258 oasc.SolrCore.<init> [collection1] Opening new SolrCore at /usr/home/hudson/hudson-slave/workspace/Lucene-Solr-Tests-trunk-java7/solr/build/solr-core/test-files/solr/collection1/, dataDir=./org.apache.solr.handler.component.DistributedMLTComponentTest-1355938373313/shard1/data/
[junit4:junit4]   2> 2789 T258 oasc.JmxMonitoredMap.<init> JMX monitoring is enabled. Adding Solr mbeans to JMX Server: com.sun.jmx.mbeanserver.JmxMBeanServer@410b0419
[junit4:junit4]   2> 2790 T258 oasc.SolrCore.initDirectoryFactory org.apache.solr.core.MockDirectoryFactory
[junit4:junit4]   2> 2791 T258 oasc.CachingDirectoryFactory.get return new directory for /usr/home/hudson/hudson-slave/workspace/Lucene-Solr-Tests-trunk-java7/solr/build/solr-core/test/J0/./org.apache.solr.handler.component.DistributedMLTComponentTest-1355938373313/shard1/data forceNew:false
[junit4:junit4]   2> 2791 T258 oasc.CachingDirectoryFactory.close Releasing directory:/usr/home/hudson/hudson-slave/workspace/Lucene-Solr-Tests-trunk-java7/solr/build/solr-core/test/J0/./org.apache.solr.handler.component.DistributedMLTComponentTest-1355938373313/shard1/data
[junit4:junit4]   2> 2792 T258 oasc.SolrCore.getNewIndexDir New index directory detected: old=null new=./org.apache.solr.handler.component.DistributedMLTComponentTest-1355938373313/shard1/data/index/
[junit4:junit4]   2> 2793 T258 oasc.SolrCore.initIndex WARNING [collection1] Solr index directory './org.apache.solr.handler.component.DistributedMLTComponentTest-1355938373313/shard1/data/index' doesn't exist. Creating new index...
[junit4:junit4]   2> 2793 T258 oasc.CachingDirectoryFactory.get return new directory for /usr/home/hudson/hudson-slave/workspace/Lucene-Solr-Tests-trunk-java7/solr/build/solr-core/test/J0/./org.apache.solr.handler.component.DistributedMLTComponentTest-1355938373313/shard1/data/index forceNew:false
[junit4:junit4]   2> 2797 T258 oasc.SolrDeletionPolicy.onCommit SolrDeletionPolicy.onCommit: commits:num=1
[junit4:junit4]   2> 		commit{dir=RateLimitedDirectoryWrapper(MockDirWrapper(org.apache.lucene.store.RAMDirectory@413c978a lockFactory=org.apache.lucene.store.NativeFSLockFactory@7a50af32)),segFN=segments_1,generation=1,filenames=[segments_1]
[junit4:junit4]   2> 2798 T258 oasc.SolrDeletionPolicy.updateCommits newest commit = 1[segments_1]
[junit4:junit4]   2> 2798 T258 oasc.CachingDirectoryFactory.close Releasing directory:/usr/home/hudson/hudson-slave/workspace/Lucene-Solr-Tests-trunk-java7/solr/build/solr-core/test/J0/./org.apache.solr.handler.component.DistributedMLTComponentTest-1355938373313/shard1/data/index
[junit4:junit4]   2> 2799 T258 oasc.SolrCore.initWriters created xml: solr.XMLResponseWriter
[junit4:junit4]   2> 2802 T258 oasup.UpdateRequestProcessorChain.init inserting DistributedUpdateProcessorFactory into updateRequestProcessorChain "dedupe"
[junit4:junit4]   2> 2802 T258 oasup.UpdateRequestProcessorChain.init inserting DistributedUpdateProcessorFactory into updateRequestProcessorChain "dedupe-allfields"
[junit4:junit4]   2> 2803 T258 oasup.UpdateRequestProcessorChain.init inserting DistributedUpdateProcessorFactory into updateRequestProcessorChain "stored_sig"
[junit4:junit4]   2> 2803 T258 oasup.UpdateRequestProcessorChain.init inserting DistributedUpdateProcessorFactory into updateRequestProcessorChain "uniq-fields"
[junit4:junit4]   2> 2804 T258 oasup.UpdateRequestProcessorChain.init inserting DistributedUpdateProcessorFactory into updateRequestProcessorChain "distrib-dup-test-chain-implicit"
[junit4:junit4]   2> 2805 T258 oasc.RequestHandlers.initHandlersFromConfig adding lazy requestHandler: solr.ReplicationHandler
[junit4:junit4]   2> 2805 T258 oasc.RequestHandlers.initHandlersFromConfig created /replication: solr.ReplicationHandler
[junit4:junit4]   2> 2807 T258 oasc.RequestHandlers.initHandlersFromConfig created standard: solr.StandardRequestHandler
[junit4:junit4]   2> 2808 T258 oasc.RequestHandlers.initHandlersFromConfig created /get: solr.RealTimeGetHandler
[junit4:junit4]   2> 2810 T258 oasc.RequestHandlers.initHandlersFromConfig created dismax: solr.SearchHandler
[junit4:junit4]   2> 2812 T258 oasc.RequestHandlers.initHandlersFromConfig created mock: org.apache.solr.core.MockQuerySenderListenerReqHandler
[junit4:junit4]   2> 2812 T258 oasc.RequestHandlers.initHandlersFromConfig created /admin/: org.apache.solr.handler.admin.AdminHandlers
[junit4:junit4]   2> 2814 T258 oasc.RequestHandlers.initHandlersFromConfig created defaults: solr.StandardRequestHandler
[junit4:junit4]   2> 2814 T258 oasc.RequestHandlers.initHandlersFromConfig adding lazy requestHandler: solr.StandardRequestHandler
[junit4:junit4]   2> 2815 T258 oasc.RequestHandlers.initHandlersFromConfig created lazy: solr.StandardRequestHandler
[junit4:junit4]   2> 2816 T258 oasc.RequestHandlers.initHandlersFromConfig created /update: solr.UpdateRequestHandler
[junit4:junit4]   2> 2818 T258 oasc.RequestHandlers.initHandlersFromConfig created /terms: org.apache.solr.handler.component.SearchHandler
[junit4:junit4]   2> 2819 T258 oasc.RequestHandlers.initHandlersFromConfig created spellCheckCompRH: org.apache.solr.handler.component.SearchHandler
[junit4:junit4]   2> 2821 T258 oasc.RequestHandlers.initHandlersFromConfig created spellCheckCompRH_Direct: org.apache.solr.handler.component.SearchHandler
[junit4:junit4]   2> 2822 T258 oasc.RequestHandlers.initHandlersFromConfig created spellCheckWithWordbreak: org.apache.solr.handler.component.SearchHandler
[junit4:junit4]   2> 2824 T258 oasc.RequestHandlers.initHandlersFromConfig created spellCheckWithWordbreak_Direct: org.apache.solr.handler.component.SearchHandler
[junit4:junit4]   2> 2825 T258 oasc.RequestHandlers.initHandlersFromConfig created spellCheckCompRH1: org.apache.solr.handler.component.SearchHandler
[junit4:junit4]   2> 2827 T258 oasc.RequestHandlers.initHandlersFromConfig created mltrh: org.apache.solr.handler.component.SearchHandler
[junit4:junit4]   2> 2828 T258 oasc.RequestHandlers.initHandlersFromConfig created tvrh: org.apache.solr.handler.component.SearchHandler
[junit4:junit4]   2> 2830 T258 oasc.RequestHandlers.initHandlersFromConfig created /mlt: solr.MoreLikeThisHandler
[junit4:junit4]   2> 2831 T258 oasc.RequestHandlers.initHandlersFromConfig created /debug/dump: solr.DumpRequestHandler
[junit4:junit4]   2> 2848 T258 oashl.XMLLoader.init xsltCacheLifetimeSeconds=60
[junit4:junit4]   2> 2854 T258 oasc.SolrCore.initDeprecatedSupport WARNING solrconfig.xml uses deprecated <admin/gettableFiles>, Please update your config to use the ShowFileRequestHandler.
[junit4:junit4]   2> 2857 T258 oasc.SolrCore.initDeprecatedSupport WARNING adding ShowFileRequestHandler with hidden files: [THROW.ERROR.ON.ADD.UPDATEPROCESSOR.JS, SOLRCONFIG-HIGHLIGHT.XML, SCHEMA-REQUIRED-FIELDS.XML, BAD-SCHEMA-DUP-DYNAMICFIELD.XML, SCHEMA-REPLICATION2.XML, TRIVIAL.UPDATEPROCESSOR1.JS, SCHEMA-MINIMAL.XML, SOLRCONFIG-CACHING.XML, SOLRCONFIG-REPEATER.XML, BAD-SCHEMA-NONTEXT-ANALYZER.XML, SOLRCONFIG-MERGEPOLICY.XML, CURRENCY.XML, SOLRCONFIG-TLOG.XML, SOLRCONFIG-MASTER.XML, BAD-SCHEMA-UNIQUEKEY-MULTIVALUED.XML, SCHEMA11.XML, SOLRCONFIG-BASIC.XML, DA_COMPOUNDDICTIONARY.TXT, MISSLEADING.EXTENSION.UPDATEPROCESSOR.JS.TXT, SCHEMA-COPYFIELD-TEST.XML, SOLRCONFIG-SLAVE.XML, SOLRCONFIG-PROPINJECT-INDEXDEFAULT.XML, ELEVATE.XML, TRIVIAL.UPDATEPROCESSOR0.JS, BAD-SOLRCONFIG-BOGUS-SCRIPTENGINE-NAME.XML, SCHEMA-IB.XML, SCHEMA-CHARFILTERS.XML, SOLRCONFIG-QUERYSENDER.XML, DA_UTF8.XML, SCHEMA-REPLICATION1.XML, SOLRCONFIG-SNIPPET-PROCESSOR.XML, CONDITIONAL.UPDATEPROCESSOR.JS, MISSING.FUNCTIONS.UPDATEPROCESSOR.JS, SOLRCONFIG-ENABLEPLUGIN.XML, HYPHENATION.DTD, SCHEMA-PHRASESUGGEST.XML, STEMDICT.TXT, HUNSPELL-TEST.AFF, SCHEMA-SNIPPET-TYPE.XML, STOPTYPES-1.TXT, STOPWORDSWRONGENCODING.TXT, SCHEMA-NUMERIC.XML, SOLRCONFIG-TRANSFORMERS.XML, SOLRCONFIG-PROPINJECT.XML, BAD-SCHEMA-NOT-INDEXED-BUT-TF.XML, SOLRCONFIG-SIMPLELOCK.XML, WDFTYPES.TXT, SCHEMA-REVERSED.XML, STOPTYPES-2.TXT, BAD-SCHEMA-CURRENCY-FT-MULTIVALUED.XML, SOLRCONFIG-SPELLCHECKCOMPONENT.XML, SCHEMA-DFR.XML, SOLRCONFIG-PHRASESUGGEST.XML, BAD-SCHEMA-CURRENCY-MULTIVALUED.XML, BAD-SCHEMA-NOT-INDEXED-BUT-POS.XML, KEEP-1.TXT, OPEN-EXCHANGE-RATES.JSON, SCHEMA-SPATIAL.XML, STOPWITHBOM.TXT, SCHEMA-BINARYFIELD.XML, SOLRCONFIG-SPELLCHECKER.XML, SOLRCONFIG-UPDATE-PROCESSOR-CHAINS.XML, BAD-SCHEMA-OMIT-TF-BUT-NOT-POS.XML, BAD-SCHEMA-DUP-FIELDTYPE.XML, SCHEMA-XINCLUDE.XML, SOLRCONFIG-MASTER1.XML, SCHEMA-BEHAVIOR.XML, SYNONYMS.TXT, BAD-SCHEMA-CURRENCY-DYNAMIC-MULTIVALUED.XML, SCHEMA_CODEC.XML, SCHEMA.XML, SOLRCONFIG-SOLR-749.XML, SCHEMA-EFF.XML, SOLRCONFIG-MASTER1-KEEPONEBACKUP.XML, SOLRCONFIG-FUNCTIONQUERY.XML, STOP-2.TXT, SOLRCONFIG-TERMINDEX.XML, SCHEMA-LMDIRICHLET.XML, SOLRCONFIG-ELEVATE.XML, STOPWORDS.TXT, SCHEMA-FOLDING.XML, SCHEMA-STOP-KEEP.XML, FUZZYSUGGEST.TXT, BAD-SCHEMA-NOT-INDEXED-BUT-NORMS.XML, SOLRCONFIG-SOLCOREPROPERTIES.XML, STOP-1.TXT, SOLRCONFIG-MASTER2.XML, SCHEMA-SPELLCHECKER.XML, SOLRCONFIG-RESPONSE-LOG-COMPONENT.XML, SOLRCONFIG-LAZYWRITER.XML, SCHEMA-LUCENEMATCHVERSION.XML, BAD-MP-SOLRCONFIG.XML, FRENCHARTICLES.TXT, SCHEMA15.XML, SOLRCONFIG-REQHANDLER.INCL, SCHEMASURROUND.XML, SOLRCONFIG-MASTER3.XML, HUNSPELL-TEST.DIC, SOLRCONFIG-XINCLUDE.XML, BAD-SCHEMA-CODEC-GLOBAL-VS-FT-MISMATCH.XML, SOLRCONFIG-SLAVE1.XML, SOLRCONFIG-DELPOLICY1.XML, SCHEMA-SIM.XML, SCHEMA-SNIPPET-FIELD.XML, SCHEMA-COLLATE.XML, STOP-SNOWBALL.TXT, BAD-SCHEMA-SIM-GLOBAL-VS-FT-MISMATCH.XML, PROTWORDS.TXT, SCHEMA-TRIE.XML, SOLRCONFIG_CODEC.XML, BAD-SOLRCONFIG-INVALID-SCRIPTFILE.XML, JASUGGEST.TXT, SCHEMA-TFIDF.XML, SOLRCONFIG-SCRIPT-UPDATEPROCESSOR.XML, SCHEMA-LMJELINEKMERCER.XML, PHRASESUGGEST.TXT, BAD-SOLRCONFIG-MISSING-SCRIPTFILE.XML, BAD-SCHEMA-UNIQUEKEY-USES-DEFAULT.XML, OLD_SYNONYMS.TXT, SOLRCONFIG-DELPOLICY2.XML, XSLT, SOLRCONFIG-NATIVELOCK.XML, BAD-SCHEMA-DUP-FIELD.XML, SOLRCONFIG-NOCACHE.XML, SCHEMA-BM25.XML, ADDFIELDS.UPDATEPROCESSOR.JS, SOLRCONFIG-ALTDIRECTORY.XML, SOLRCONFIG-QUERYSENDER-NOQUERY.XML, COMPOUNDDICTIONARY.TXT, SOLRCONFIG_PERF.XML, SOLRCONFIG-INDEXCONFIG.XML, SCHEMA-NOT-REQUIRED-UNIQUE-KEY.XML, BAD-SCHEMA-ANALYZER-CLASS-AND-NESTED.XML, KEEP-2.TXT, BAD-SCHEMA-UNIQUEKEY-IS-COPYFIELD-DEST.XML, SCHEMA12.XML, MAPPING-ISOLATIN1ACCENT.TXT, BAD_SOLRCONFIG.XML, BAD-SCHEMA-EXTERNAL-FILEFIELD.XML]
[junit4:junit4]   2> 2860 T258 oasc.CachingDirectoryFactory.close Releasing directory:/usr/home/hudson/hudson-slave/workspace/Lucene-Solr-Tests-trunk-java7/solr/build/solr-core/test/J0/./org.apache.solr.handler.component.DistributedMLTComponentTest-1355938373313/shard1/data
[junit4:junit4]   2> 2861 T258 oass.SolrIndexSearcher.<init> Opening Searcher@295b89f9 main
[junit4:junit4]   2> 2862 T258 oasu.CommitTracker.<init> Hard AutoCommit: disabled
[junit4:junit4]   2> 2862 T258 oasu.CommitTracker.<init> Soft AutoCommit: disabled
[junit4:junit4]   2> 2863 T258 oashc.SpellCheckComponent.inform Initializing spell checkers
[junit4:junit4]   2> 2872 T258 oass.DirectSolrSpellChecker.init init: {name=direct,classname=DirectSolrSpellChecker,field=lowerfilt,minQueryLength=3}
[junit4:junit4]   2> 2942 T259 oasc.SolrCore.registerSearcher [collection1] Registered new searcher Searcher@295b89f9 main{StandardDirectoryReader(segments_1:1)}
[junit4:junit4]   2> 2952 T258 oasc.CoreContainer.registerCore registering core: collection1
[junit4:junit4]   2> 2953 T226 oass.SolrDispatchFilter.init user.dir=/usr/home/hudson/hudson-slave/workspace/Lucene-Solr-Tests-trunk-java7/solr/build/solr-core/test/J0
[junit4:junit4]   2> 2954 T226 oass.SolrDispatchFilter.init SolrDispatchFilter.init() done
[junit4:junit4]   2> 2954 T226 oascsi.HttpClientUtil.createClient Creating new http client, config:maxConnections=128&maxConnectionsPerHost=32&followRedirects=false
[junit4:junit4]   2> ASYNC  NEW_CORE C10 name=collection1 org.apache.solr.core.SolrCore@5ddaee61
[junit4:junit4]   2> 2977 T229 C10 oasu.DirectUpdateHandler2.deleteAll [collection1] REMOVING ALL DOCUMENTS FROM INDEX
[junit4:junit4]   2> 2978 T229 C10 oasc.CachingDirectoryFactory.close Releasing directory:/usr/home/hudson/hudson-slave/workspace/Lucene-Solr-Tests-trunk-java7/solr/build/solr-core/test/J0/./org.apache.solr.handler.component.DistributedMLTComponentTest-1355938373313/control/data
[junit4:junit4]   2> 2981 T229 C10 oasc.SolrDeletionPolicy.onInit SolrDeletionPolicy.onInit: commits:num=1
[junit4:junit4]   2> 		commit{dir=RateLimitedDirectoryWrapper(MockDirWrapper(org.apache.lucene.store.RAMDirectory@4b710474 lockFactory=org.apache.lucene.store.NativeFSLockFactory@234bdd73)),segFN=segments_1,generation=1,filenames=[segments_1]
[junit4:junit4]   2> 2982 T229 C10 oasc.SolrDeletionPolicy.updateCommits newest commit = 1[segments_1]
[junit4:junit4]   2> 2983 T229 C10 UPDATE [collection1] webapp= path=/update params={wt=javabin&version=2} {deleteByQuery=*:*} 0 7
[junit4:junit4]   2> ASYNC  NEW_CORE C11 name=collection1 org.apache.solr.core.SolrCore@4a7437e4
[junit4:junit4]   2> 2989 T240 C11 oasu.DirectUpdateHandler2.deleteAll [collection1] REMOVING ALL DOCUMENTS FROM INDEX
[junit4:junit4]   2> 2990 T240 C11 oasc.CachingDirectoryFactory.close Releasing directory:/usr/home/hudson/hudson-slave/workspace/Lucene-Solr-Tests-trunk-java7/solr/build/solr-core/test/J0/./org.apache.solr.handler.component.DistributedMLTComponentTest-1355938373313/shard0/data
[junit4:junit4]   2> 2992 T240 C11 oasc.SolrDeletionPolicy.onInit SolrDeletionPolicy.onInit: commits:num=1
[junit4:junit4]   2> 		commit{dir=RateLimitedDirectoryWrapper(MockDirWrapper(org.apache.lucene.store.RAMDirectory@3ec5c781 lockFactory=org.apache.lucene.store.NativeFSLockFactory@457bd2f2)),segFN=segments_1,generation=1,filenames=[segments_1]
[junit4:junit4]   2> 2993 T240 C11 oasc.SolrDeletionPolicy.updateCommits newest commit = 1[segments_1]
[junit4:junit4]   2> 2993 T240 C11 UPDATE [collection1] webapp= path=/update params={wt=javabin&version=2} {deleteByQuery=*:*} 0 4
[junit4:junit4]   2> ASYNC  NEW_CORE C12 name=collection1 org.apache.solr.core.SolrCore@4ddb1499
[junit4:junit4]   2> 3002 T251 C12 oasu.DirectUpdateHandler2.deleteAll [collection1] REMOVING ALL DOCUMENTS FROM INDEX
[junit4:junit4]   2> 3003 T251 C12 oasc.CachingDirectoryFactory.close Releasing directory:/usr/home/hudson/hudson-slave/workspace/Lucene-Solr-Tests-trunk-java7/solr/build/solr-core/test/J0/./org.apache.solr.handler.component.DistributedMLTComponentTest-1355938373313/shard1/data
[junit4:junit4]   2> 3005 T251 C12 oasc.SolrDeletionPolicy.onInit SolrDeletionPolicy.onInit: commits:num=1
[junit4:junit4]   2> 		commit{dir=RateLimitedDirectoryWrapper(MockDirWrapper(org.apache.lucene.store.RAMDirectory@413c978a lockFactory=org.apache.lucene.store.NativeFSLockFactory@7a50af32)),segFN=segments_1,generation=1,filenames=[segments_1]
[junit4:junit4]   2> 3006 T251 C12 oasc.SolrDeletionPolicy.updateCommits newest commit = 1[segments_1]
[junit4:junit4]   2> 3007 T251 C12 UPDATE [collection1] webapp= path=/update params={wt=javabin&version=2} {deleteByQuery=*:*} 0 6
[junit4:junit4]   2> 3026 T229 C10 UPDATE [collection1] webapp= path=/update params={wt=javabin&version=2} {add=[1]} 0 16
[junit4:junit4]   2> 3033 T251 C12 UPDATE [collection1] webapp= path=/update params={wt=javabin&version=2} {add=[1]} 0 3
[junit4:junit4]   2> 3038 T229 C10 UPDATE [collection1] webapp= path=/update params={wt=javabin&version=2} {add=[2]} 0 0
[junit4:junit4]   2> 3044 T240 C11 UPDATE [collection1] webapp= path=/update params={wt=javabin&version=2} {add=[2]} 0 2
[junit4:junit4]   2> 3048 T229 C10 UPDATE [collection1] webapp= path=/update params={wt=javabin&version=2} {add=[3]} 0 1
[junit4:junit4]   2> 3053 T251 C12 UPDATE [collection1] webapp= path=/update params={wt=javabin&version=2} {add=[3]} 0 1
[junit4:junit4]   2> 3057 T229 C10 UPDATE [collection1] webapp= path=/update params={wt=javabin&version=2} {add=[4]} 0 1
[junit4:junit4]   2> 3061 T240 C11 UPDATE [collection1] webapp= path=/update params={wt=javabin&version=2} {add=[4]} 0 1
[junit4:junit4]   2> 3065 T229 C10 UPDATE [collection1] webapp= path=/update params={wt=javabin&version=2} {add=[5]} 0 1
[junit4:junit4]   2> 3068 T251 C12 UPDATE [collection1] webapp= path=/update params={wt=javabin&version=2} {add=[5]} 0 1
[junit4:junit4]   2> 3072 T229 C10 UPDATE [collection1] webapp= path=/update params={wt=javabin&version=2} {add=[6]} 0 1
[junit4:junit4]   2> 3076 T240 C11 UPDATE [collection1] webapp= path=/update params={wt=javabin&version=2} {add=[6]} 0 1
[junit4:junit4]   2> 3080 T229 C10 UPDATE [collection1] webapp= path=/update params={wt=javabin&version=2} {add=[7]} 0 1
[junit4:junit4]   2> 3084 T251 C12 UPDATE [collection1] webapp= path=/update params={wt=javabin&version=2} {add=[7]} 0 1
[junit4:junit4]   2> 3088 T229 C10 UPDATE [collection1] webapp= path=/update params={wt=javabin&version=2} {add=[8]} 0 1
[junit4:junit4]   2> 3092 T240 C11 UPDATE [collection1] webapp= path=/update params={wt=javabin&version=2} {add=[8]} 0 1
[junit4:junit4]   2> 3097 T229 C10 UPDATE [collection1] webapp= path=/update params={wt=javabin&version=2} {add=[9]} 0 2
[junit4:junit4]   2> 3102 T251 C12 UPDATE [collection1] webapp= path=/update params={wt=javabin&version=2} {add=[9]} 0 2
[junit4:junit4]   2> 3120 T229 C10 UPDATE [collection1] webapp= path=/update params={wt=javabin&version=2} {add=[10]} 0 15
[junit4:junit4]   2> 3124 T251 C12 UPDATE [collection1] webapp= path=/update params={wt=javabin&version=2} {add=[10]} 0 1
[junit4:junit4]   2> 3129 T229 C10 UPDATE [collection1] webapp= path=/update params={wt=javabin&version=2} {add=[12]} 0 2
[junit4:junit4]   2> 3133 T251 C12 UPDATE [collection1] webapp= path=/update params={wt=javabin&version=2} {add=[12]} 0 1
[junit4:junit4]   2> 3137 T229 C10 UPDATE [collection1] webapp= path=/update params={wt=javabin&version=2} {add=[13]} 0 1
[junit4:junit4]   2> 3143 T240 C11 UPDATE [collection1] webapp= path=/update params={wt=javabin&version=2} {add=[13]} 0 2
[junit4:junit4]   2> 3148 T229 C10 UPDATE [collection1] webapp= path=/update params={wt=javabin&version=2} {add=[14]} 0 2
[junit4:junit4]   2> 3153 T251 C12 UPDATE [collection1] webapp= path=/update params={wt=javabin&version=2} {add=[14]} 0 1
[junit4:junit4]   2> 3158 T229 C10 UPDATE [collection1] webapp= path=/update params={wt=javabin&version=2} {add=[15]} 0 2
[junit4:junit4]   2> 3162 T240 C11 UPDATE [collection1] webapp= path=/update params={wt=javabin&version=2} {add=[15]} 0 1
[junit4:junit4]   2> 3168 T229 C10 UPDATE [collection1] webapp= path=/update params={wt=javabin&version=2} {add=[16]} 0 2
[junit4:junit4]   2> 3173 T251 C12 UPDATE [collection1] webapp= path=/update params={wt=javabin&version=2} {add=[16]} 0 1
[junit4:junit4]   2> 3178 T229 C10 UPDATE [collection1] webapp= path=/update params={wt=javabin&version=2} {add=[17]} 0 2
[junit4:junit4]   2> 3183 T240 C11 UPDATE [collection1] webapp= path=/update params={wt=javabin&version=2} {add=[17]} 0 2
[junit4:junit4]   2> 3188 T229 C10 UPDATE [collection1] webapp= path=/update params={wt=javabin&version=2} {add=[18]} 0 2
[junit4:junit4]   2> 3195 T251 C12 UPDATE [collection1] webapp= path=/update params={wt=javabin&version=2} {add=[18]} 0 4
[junit4:junit4]   2> 3201 T229 C10 UPDATE [collection1] webapp= path=/update params={wt=javabin&version=2} {add=[19]} 0 2
[junit4:junit4]   2> 3206 T240 C11 UPDATE [collection1] webapp= path=/update params={wt=javabin&version=2} {add=[19]} 0 2
[junit4:junit4]   2> 3211 T229 C10 UPDATE [collection1] webapp= path=/update params={wt=javabin&version=2} {add=[20]} 0 2
[junit4:junit4]   2> 3216 T240 C11 UPDATE [collection1] webapp= path=/update params={wt=javabin&version=2} {add=[20]} 0 2
[junit4:junit4]   2> 3225 T229 C10 UPDATE [collection1] webapp= path=/update params={wt=javabin&version=2} {add=[21]} 0 6
[junit4:junit4]   2> 3231 T251 C12 UPDATE [collection1] webapp= path=/update params={wt=javabin&version=2} {add=[21]} 0 3
[junit4:junit4]   2> 3238 T229 C10 UPDATE [collection1] webapp= path=/update params={wt=javabin&version=2} {add=[22]} 0 2
[junit4:junit4]   2> 3247 T240 C11 UPDATE [collection1] webapp= path=/update params={wt=javabin&version=2} {add=[22]} 0 6
[junit4:junit4]   2> 3252 T229 C10 UPDATE [collection1] webapp= path=/update params={wt=javabin&version=2} {add=[23]} 0 2
[junit4:junit4]   2> 3257 T251 C12 UPDATE [collection1] webapp= path=/update params={wt=javabin&version=2} {add=[23]} 0 1
[junit4:junit4]   2> 3263 T229 C10 UPDATE [collection1] webapp= path=/update params={wt=javabin&version=2} {add=[24]} 0 2
[junit4:junit4]   2> 3268 T240 C11 UPDATE [collection1] webapp= path=/update params={wt=javabin&version=2} {add=[24]} 0 2
[junit4:junit4]   2> 3272 T229 C10 UPDATE [collection1] webapp= path=/update params={wt=javabin&version=2} {add=[25]} 0 1
[junit4:junit4]   2> 3276 T251 C12 UPDATE [collection1] webapp= path=/update params={wt=javabin&version=2} {add=[25]} 0 1
[junit4:junit4]   2> 3280 T229 C10 oasu.DirectUpdateHandler2.commit start commit{flags=0,_version_=0,optimize=false,openSearcher=true,waitSearcher=true,expungeDeletes=false,softCommit=false}
[junit4:junit4]   2> 3315 T229 C10 oasc.SolrDeletionPolicy.onCommit SolrDeletionPolicy.onCommit: commits:num=2
[junit4:junit4]   2> 		commit{dir=RateLimitedDirectoryWrapper(MockDirWrapper(org.apache.lucene.store.RAMDirectory@4b710474 lockFactory=org.apache.lucene.store.NativeFSLockFactory@234bdd73)),segFN=segments_1,generation=1,filenames=[segments_1]
[junit4:junit4]   2> 		commit{dir=RateLimitedDirectoryWrapper(MockDirWrapper(org.apache.lucene.store.RAMDirectory@4b710474 lockFactory=org.apache.lucene.store.NativeFSLockFactory@234bdd73)),segFN=segments_2,generation=2,filenames=[_1_Lucene40_0.tim, _2.si, _0_Lucene40_0.prx, _1.fnm, _1_Lucene40_0.tip, _2_Lucene40_0.tip, _2_nrm.cfe, _0_Lucene40_0.frq, _2_Lucene40_0.tim, _2_nrm.cfs, _0.si, _1_nrm.cfs, _0_Lucene40_0.tim, _0.fnm, _1_Lucene40_0.frq, _2.fdt, _0_nrm.cfs, _2.fdx, _2.fnm, _0_Lucene40_0.tip, _1_nrm.cfe, _1_Lucene40_0.prx, _1.fdx, _1.fdt, _2_Lucene40_0.frq, _2_Lucene40_0.prx, _1.si, _0_nrm.cfe, segments_2, _0.fdx, _0.fdt]
[junit4:junit4]   2> 3316 T229 C10 oasc.SolrDeletionPolicy.updateCommits newest commit = 2[_1_Lucene40_0.tim, _2.si, _0_Lucene40_0.prx, _1.fnm, _1_Lucene40_0.tip, _2_Lucene40_0.tip, _2_nrm.cfe, _0_Lucene40_0.frq, _2_Lucene40_0.tim, _2_nrm.cfs, _0.si, _1_nrm.cfs, _0_Lucene40_0.tim, _0.fnm, _1_Lucene40_0.frq, _2.fdt, _0_nrm.cfs, _2.fdx, _2.fnm, _0_Lucene40_0.tip, _1_nrm.cfe, _1_Lucene40_0.prx, _1.fdx, _1.fdt, _2_Lucene40_0.frq, _2_Lucene40_0.prx, _1.si, _0_nrm.cfe, segments_2, _0.fdx, _0.fdt]
[junit4:junit4]   2> 3317 T229 C10 oasc.CachingDirectoryFactory.close Releasing directory:/usr/home/hudson/hudson-slave/workspace/Lucene-Solr-Tests-trunk-java7/solr/build/solr-core/test/J0/./org.apache.solr.handler.component.DistributedMLTComponentTest-1355938373313/control/data
[junit4:junit4]   2> 3324 T229 C10 oass.SolrIndexSearcher.<init> Opening Searcher@6f4d11cc main
[junit4:junit4]   2> 3325 T229 C10 oasu.DirectUpdateHandler2.commit end_commit_flush
[junit4:junit4]   2> 3327 T237 oasc.SolrCore.registerSearcher [collection1] Registered new searcher Searcher@6f4d11cc main{StandardDirectoryReader(segments_2:8 _0(5.0):C10 _1(5.0):C10 _2(5.0):C4)}
[junit4:junit4]   2> 3327 T237 oasc.CachingDirectoryFactory.close Releasing directory:/usr/home/hudson/hudson-slave/workspace/Lucene-Solr-Tests-trunk-java7/solr/build/solr-core/test/J0/./org.apache.solr.handler.component.DistributedMLTComponentTest-1355938373313/control/data/index
[junit4:junit4]   2> 3328 T229 C10 UPDATE [collection1] webapp= path=/update params={waitSearcher=true&wt=javabin&commit=true&softCommit=false&version=2} {commit=} 0 48
[junit4:junit4]   2> 3332 T240 C11 oasu.DirectUpdateHandler2.commit start commit{flags=0,_version_=0,optimize=false,openSearcher=true,waitSearcher=true,expungeDeletes=false,softCommit=false}
[junit4:junit4]   2> 3338 T240 C11 oasc.SolrDeletionPolicy.onCommit SolrDeletionPolicy.onCommit: commits:num=2
[junit4:junit4]   2> 		commit{dir=RateLimitedDirectoryWrapper(MockDirWrapper(org.apache.lucene.store.RAMDirectory@3ec5c781 lockFactory=org.apache.lucene.store.NativeFSLockFactory@457bd2f2)),segFN=segments_1,generation=1,filenames=[segments_1]
[junit4:junit4]   2> 		commit{dir=RateLimitedDirectoryWrapper(MockDirWrapper(org.apache.lucene.store.RAMDirectory@3ec5c781 lockFactory=org.apache.lucene.store.NativeFSLockFactory@457bd2f2)),segFN=segments_2,generation=2,filenames=[_1_Lucene40_0.tim, _1_nrm.cfs, _0_Lucene40_0.tim, _0.fnm, _1_Lucene40_0.frq, _0_nrm.cfs, _0_Lucene40_0.prx, _1.fnm, _1_Lucene40_0.prx, _1_Lucene40_0.tip, _1_nrm.cfe, _0_Lucene40_0.tip, _1.fdx, _0_Lucene40_0.frq, _1.fdt, _1.si, _0_nrm.cfe, segments_2, _0.fdx, _0.si, _0.fdt]
[junit4:junit4]   2> 3339 T240 C11 oasc.SolrDeletionPolicy.updateCommits newest commit = 2[_1_Lucene40_0.tim, _1_nrm.cfs, _0_Lucene40_0.tim, _0.fnm, _1_Lucene40_0.frq, _0_nrm.cfs, _0_Lucene40_0.prx, _1.fnm, _1_Lucene40_0.prx, _1_Lucene40_0.tip, _1_nrm.cfe, _0_Lucene40_0.tip, _1.fdx, _0_Lucene40_0.frq, _1.fdt, _1.si, _0_nrm.cfe, segments_2, _0.fdx, _0.si, _0.fdt]
[junit4:junit4]   2> 3339 T240 C11 oasc.CachingDirectoryFactory.close Releasing directory:/usr/home/hudson/hudson-slave/workspace/Lucene-Solr-Tests-trunk-java7/solr/build/solr-core/test/J0/./org.apache.solr.handler.component.DistributedMLTComponentTest-1355938373313/shard0/data
[junit4:junit4]   2> 3344 T240 C11 oass.SolrIndexSearcher.<init> Opening Searcher@6aeea245 main
[junit4:junit4]   2> 3345 T240 C11 oasu.DirectUpdateHandler2.commit end_commit_flush
[junit4:junit4]   2> 3347 T248 oasc.SolrCore.registerSearcher [collection1] Registered new searcher Searcher@6aeea245 main{StandardDirectoryReader(segments_2:6 _0(5.0):C10 _1(5.0):C1)}
[junit4:junit4]   2> 3348 T248 oasc.CachingDirectoryFactory.close Releasing directory:/usr/home/hudson/hudson-slave/workspace/Lucene-Solr-Tests-trunk-java7/solr/build/solr-core/test/J0/./org.apache.solr.handler.component.DistributedMLTComponentTest-1355938373313/shard0/data/index
[junit4:junit4]   2> 3348 T240 C11 UPDATE [collection1] webapp= path=/update params={waitSearcher=true&wt=javabin&commit=true&softCommit=false&version=2} {commit=} 0 16
[junit4:junit4]   2> 3353 T251 C12 oasu.DirectUpdateHandler2.commit start commit{flags=0,_version_=0,optimize=false,openSearcher=true,waitSearcher=true,expungeDeletes=false,softCommit=false}
[junit4:junit4]   2> 3357 T251 C12 oasc.SolrDeletionPolicy.onCommit SolrDeletionPolicy.onCommit: commits:num=2
[junit4:junit4]   2> 		commit{dir=RateLimitedDirectoryWrapper(MockDirWrapper(org.apache.lucene.store.RAMDirectory@413c978a lockFactory=org.apache.lucene.store.NativeFSLockFactory@7a50af32)),segFN=segments_1,generation=1,filenames=[segments_1]
[junit4:junit4]   2> 		commit{dir=RateLimitedDirectoryWrapper(MockDirWrapper(org.apache.lucene.store.RAMDirectory@413c978a lockFactory=org.apache.lucene.store.NativeFSLockFactory@7a50af32)),segFN=segments_2,generation=2,filenames=[_1_Lucene40_0.tim, _1_nrm.cfs, _0_Lucene40_0.tim, _0.fnm, _1_Lucene40_0.frq, _0_nrm.cfs, _0_Lucene40_0.prx, _1.fnm, _1_Lucene40_0.prx, _1_Lucene40_0.tip, _1_nrm.cfe, _0_Lucene40_0.tip, _1.fdx, _0_Lucene40_0.frq, _1.fdt, _1.si, _0_nrm.cfe, segments_2, _0.fdx, _0.si, _0.fdt]
[junit4:junit4]   2> 3358 T251 C12 oasc.SolrDeletionPolicy.updateCommits newest commit = 2[_1_Lucene40_0.tim, _1_nrm.cfs, _0_Lucene40_0.tim, _0.fnm, _1_Lucene40_0.frq, _0_nrm.cfs, _0_Lucene40_0.prx, _1.fnm, _1_Lucene40_0.prx, _1_Lucene40_0.tip, _1_nrm.cfe, _0_Lucene40_0.tip, _1.fdx, _0_Lucene40_0.frq, _1.fdt, _1.si, _0_nrm.cfe, segments_2, _0.fdx, _0.si, _0.fdt]
[junit4:junit4]   2> 3358 T251 C12 oasc.CachingDirectoryFactory.close Releasing directory:/usr/home/hudson/hudson-slave/workspace/Lucene-Solr-Tests-trunk-java7/solr/build/solr-core/test/J0/./org.apache.solr.handler.component.DistributedMLTComponentTest-1355938373313/shard1/data
[junit4:junit4]   2> 3362 T251 C12 oass.SolrIndexSearcher.<init> Opening Searcher@414bb5f7 main
[junit4:junit4]   2> 3363 T251 C12 oasu.DirectUpdateHandler2.commit end_commit_flush
[junit4:junit4]   2> 3365 T259 oasc.SolrCore.registerSearcher [collection1] Registered new searcher Searcher@414bb5f7 main{StandardDirectoryReader(segments_2:6 _0(5.0):C10 _1(5.0):C3)}
[junit4:junit4]   2> 3366 T259 oasc.CachingDirectoryFactory.close Releasing directory:/usr/home/hudson/hudson-slave/workspace/Lucene-Solr-Tests-trunk-java7/solr/build/solr-core/test/J0/./org.apache.solr.handler.component.DistributedMLTComponentTest-1355938373313/shard1/data/index
[junit4:junit4]   2> 3367 T251 C12 UPDATE [collection1] webapp= path=/update params={waitSearcher=true&wt=javabin&commit=true&softCommit=false&version=2} {commit=} 0 15
[junit4:junit4]   2> 3395 T229 C10 REQ [collection1] webapp= path=/select params={mlt.fl=lowerfilt&shards.qt=mltrh&q=match_none&mlt=true&distrib=false&qt=mltrh&wt=javabin&version=2} hits=0 status=0 QTime=25 
[junit4:junit4]   2> 3592 T252 C12 REQ [collection1] webapp= path=/select params={mlt.fl=lowerfilt&shards.qt=mltrh&mlt=true&distrib=false&wt=javabin&rows=10&version=2&shard.url=[ff01::083]:33332/|[ff01::114]:33332/|127.0.0.1:10589/|[ff01::213]:33332/&fl=id,score&NOW=1355938376707&start=0&q=match_none&isShard=true&qt=mltrh&fsv=true} hits=0 status=0 QTime=63 
[junit4:junit4]   2> 3592 T241 C11 REQ [collection1] webapp= path=/select params={mlt.fl=lowerfilt&shards.qt=mltrh&mlt=true&distrib=false&wt=javabin&rows=10&version=2&shard.url=127.0.0.1:10588/&fl=id,score&NOW=1355938376707&start=0&q=match_none&isShard=true&qt=mltrh&fsv=true} hits=0 status=0 QTime=163 
[junit4:junit4]   2> 3612 T240 C11 REQ [collection1] webapp= path=/select params={mlt.fl=lowerfilt&shards=127.0.0.1:10588/,[ff01::083]:33332/|[ff01::114]:33332/|127.0.0.1:10589/|[ff01::213]:33332/&shards.qt=mltrh&q=match_none&mlt=true&qt=mltrh&wt=javabin&version=2} hits=0 status=0 QTime=213 
[junit4:junit4]   2> 3665 T229 C10 REQ [collection1] webapp= path=/select params={mlt.fl=lowerfilt&shards.qt=mltrh&q=lowerfilt:sonata&mlt=true&distrib=false&qt=mltrh&wt=javabin&version=2} hits=1 status=0 QTime=50 
[junit4:junit4]   2> 3678 T242 C11 REQ [collection1] webapp= path=/select params={mlt.fl=lowerfilt&shards.qt=mltrh&mlt=true&distrib=false&wt=javabin&rows=10&version=2&shard.url=[ff01::114]:33332/|127.0.0.1:10588/&fl=id,score&NOW=1355938376977&start=0&q=lowerfilt:sonata&isShard=true&qt=mltrh&fsv=true} hits=1 status=0 QTime=2 
[junit4:junit4]   2> 3680 T253 C12 REQ [collection1] webapp= path=/select params={mlt.fl=lowerfilt&shards.qt=mltrh&mlt=true&distrib=false&wt=javabin&rows=10&version=2&shard.url=[ff01::114]:33332/|127.0.0.1:10589/|[ff01::213]:33332/&fl=id,score&NOW=1355938376977&start=0&q=lowerfilt:sonata&isShard=true&qt=mltrh&fsv=true} hits=0 status=0 QTime=1 
[junit4:junit4]   2> 3697 T242 C11 REQ [collection1] webapp= path=/select params={mlt.fl=lowerfilt&shards.qt=mltrh&ids=8&mlt=true&distrib=false&wt=javabin&version=2&shard.url=[ff01::114]:33332/|127.0.0.1:10588/&NOW=1355938376977&q=lowerfilt:sonata&qt=mltrh&isShard=true} status=0 QTime=1 
[junit4:junit4]   2> 3698 T251 C12 REQ [collection1] webapp= path=/select params={mlt.fl=lowerfilt&shards=[ff01::114]:33332/|127.0.0.1:10588/,[ff01::114]:33332/|127.0.0.1:10589/|[ff01::213]:33332/&shards.qt=mltrh&q=lowerfilt:sonata&mlt=true&qt=mltrh&wt=javabin&version=2} hits=1 status=0 QTime=29 
[junit4:junit4]   2> 3868 T229 C10 REQ [collection1] webapp= path=/select params={fl=id&sort=id+desc&mlt.fl=lowerfilt&shards.qt=mltrh&q=lowerfilt:moon&mlt=true&distrib=false&qt=mltrh&wt=javabin&version=2} hits=2 status=0 QTime=165 
[junit4:junit4]   2> 3881 T252 C12 REQ [collection1] webapp= path=/select params={sort=id+desc&mlt.fl=lowerfilt&shards.qt=mltrh&mlt=true&distrib=false&wt=javabin&rows=10&version=2&fl=id&shard.url=[ff01::114]:33332/|127.0.0.1:10589/|[ff01::213]:33332/|[ff01::083]:33332/&NOW=1355938377181&start=0&q=lowerfilt:moon&qt=mltrh&isShard=true&fsv=true} hits=1 status=0 QTime=2 
[junit4:junit4]   2> 3888 T241 C11 REQ [collection1] webapp= path=/select params={sort=id+desc&mlt.fl=lowerfilt&shards.qt=mltrh&mlt=true&distrib=false&wt=javabin&rows=10&version=2&fl=id&shard.url=127.0.0.1:10588/|[ff01::213]:33332/|[ff01::114]:33332/&NOW=1355938377181&start=0&q=lowerfilt:moon&qt=mltrh&isShard=true&fsv=true} hits=1 status=0 QTime=10 
[junit4:junit4]   2> 3916 T241 C11 REQ [collection1] webapp= path=/select params={sort=score+desc&mlt.fl=lowerfilt&shards.qt=mltrh&mlt.dist.id=17&mlt=true&distrib=false&wt=javabin&rows=20&version=2&fl=score,id&shard.url=127.0.0.1:10588/|[ff01::213]:33332/|[ff01::114]:33332/&NOW=1355938377181&start=0&q=%2B(lowerfilt:the)+-id:17&qt=mltrh&isShard=true} hits=6 status=0 QTime=12 
[junit4:junit4]   2> 3921 T252 C12 REQ [collection1] webapp= path=/select params={sort=score+desc&mlt.fl=lowerfilt&shards.qt=mltrh&mlt.dist.id=17&mlt=true&distrib=false&wt=javabin&rows=20&version=2&fl=score,id&shard.url=[ff01::114]:33332/|127.0.0.1:10589/|[ff01::213]:33332/|[ff01::083]:33332/&NOW=1355938377181&start=0&q=%2B(lowerfilt:the)+-id:17&qt=mltrh&isShard=true} hits=7 status=0 QTime=16 
[junit4:junit4]   2> 3923 T240 C11 oashc.MoreLikeThisComponent.handleResponses MLT Query returned: {responseHeader={status=0,QTime=12},response={numFound=6,start=0,maxScore=0.58267975,docs=[SolrDocument{id=13, score=0.58267975}, SolrDocument{id=15, score=0.58267975}, SolrDocument{id=19, score=0.58267975}, SolrDocument{id=20, score=0.58267975}, SolrDocument{id=22, score=0.58267975}, SolrDocument{id=24, score=0.58267975}]},moreLikeThis={13={numFound=6,start=0,docs=[SolrDocument{id=15}, SolrDocument{id=19}, SolrDocument{id=20}, SolrDocument{id=22}, SolrDocument{id=24}, SolrDocument{id=17}]},15={numFound=6,start=0,docs=[SolrDocument{id=13}, SolrDocument{id=19}, SolrDocument{id=20}, SolrDocument{id=22}, SolrDocument{id=24}, SolrDocument{id=17}]},19={numFound=6,start=0,docs=[SolrDocument{id=13}, SolrDocument{id=15}, SolrDocument{id=20}, SolrDocument{id=22}, SolrDocument{id=24}, SolrDocument{id=17}]},20={numFound=6,start=0,docs=[SolrDocument{id=13}, SolrDocument{id=15}, SolrDocument{id=19}, SolrDocument{id=22}, SolrDocument{id=24}, SolrDocument{id=17}]},22={numFound=6,start=0,docs=[SolrDocument{id=13}, SolrDocument{id=15}, SolrDocument{id=19}, SolrDocument{id=20}, SolrDocument{id=24}, SolrDocument{id=17}]},24={numFound=6,start=0,docs=[SolrDocument{id=13}, SolrDocument{id=15}, SolrDocument{id=19}, SolrDocument{id=20}, SolrDocument{id=22}, SolrDocument{id=17}]}}}
[junit4:junit4]   2> 3924 T240 C11 oashc.MoreLikeThisComponent.handleResponses MLT Query returned: {responseHeader={status=0,QTime=16},response={numFound=7,start=0,maxScore=0.6565079,docs=[SolrDocument{id=14, score=0.6565079}, SolrDocument{id=16, score=0.6565079}, SolrDocument{id=18, score=0.6565079}, SolrDocument{id=21, score=0.6565079}, SolrDocument{id=23, score=0.6565079}, SolrDocument{id=7, score=0.5570654}, SolrDocument{id=9, score=0.5252063}]},moreLikeThis={14={numFound=6,start=0,docs=[SolrDocument{id=16}, SolrDocument{id=18}, SolrDocument{id=21}, SolrDocument{id=23}, SolrDocument{id=7}, SolrDocument{id=9}]},16={numFound=6,start=0,docs=[SolrDocument{id=14}, SolrDocument{id=18}, SolrDocument{id=21}, SolrDocument{id=23}, SolrDocument{id=7}, SolrDocument{id=9}]},18={numFound=6,start=0,docs=[SolrDocument{id=14}, SolrDocument{id=16}, SolrDocument{id=21}, SolrDocument{id=23}, SolrDocument{id=7}, SolrDocument{id=9}]},21={numFound=6,start=0,docs=[SolrDocument{id=14}, SolrDocument{id=16}, SolrDocument{id=18}, SolrDocument{id=23}, SolrDocument{id=7}, SolrDocument{id=9}]},23={numFound=6,start=0,docs=[SolrDocument{id=14}, SolrDocument{id=16}, SolrDocument{id=18}, SolrDocument{id=21}, SolrDocument{id=7}, SolrDocument{id=9}]},7={numFound=0,start=0,docs=[]},9={numFound=6,start=0,docs=[SolrDocument{id=14}, SolrDocument{id=16}, SolrDocument{id=18}, SolrDocument{id=21}, SolrDocument{id=23}, SolrDocument{id=7}]}}}
[junit4:junit4]   2> 3931 T252 C12 REQ [collection1] webapp= path=/select params={mlt.fl=lowerfilt&shards.qt=mltrh&ids=7&mlt=true&distrib=false&wt=javabin&version=2&fl=id&shard.url=[ff01::114]:33332/|127.0.0.1:10589/|[ff01::213]:33332/|[ff01::083]:33332/&NOW=1355938377181&q=lowerfilt:moon&qt=mltrh&isShard=true} status=0 QTime=1 
[junit4:junit4]   2> 3932 T241 C11 REQ [collection1] webapp= path=/select params={mlt.fl=lowerfilt&shards.qt=mltrh&ids=17&mlt=true&distrib=false&wt=javabin&version=2&fl=id&shard.url=127.0.0.1:10588/|[ff01::213]:33332/|[ff01::114]:33332/&NOW=1355938377181&q=lowerfilt:moon&qt=mltrh&isShard=true} status=0 QTime=2 
[junit4:junit4]   2> 3933 T240 C11 oashc.MoreLikeThisComponent.finishStage MLT: results added for key: 17 documents: {numFound=6,start=0,maxScore=0.58267975,docs=[SolrDocument{id=13, score=0.58267975}, SolrDocument{id=15, score=0.58267975}, SolrDocument{id=19, score=0.58267975}, SolrDocument{id=20, score=0.58267975}, SolrDocument{id=22, score=0.58267975}, SolrDocument{id=24, score=0.58267975}]}
[junit4:junit4]   2> 3933 T240 C11 oashc.MoreLikeThisComponent.finishStage MLT: results added for key: 17 documents: {numFound=7,start=0,maxScore=0.6565079,docs=[SolrDocument{id=14, score=0.6565079}, SolrDocument{id=16, score=0.6565079}, SolrDocument{id=18, score=0.6565079}, SolrDocument{id=21, score=0.6565079}, SolrDocument{id=23, score=0.6565079}, SolrDocument{id=7, score=0.5570654}, SolrDocument{id=9, score=0.5252063}]}
[junit4:junit4]   2> 3938 T240 C11 REQ [collection1] webapp= path=/select params={fl=id&sort=id+desc&mlt.fl=lowerfilt&shards=127.0.0.1:10588/|[ff01::213]:33332/|[ff01::114]:33332/,[ff01::114]:33332/|127.0.0.1:10589/|[ff01::213]:33332/|[ff01::083]:33332/&shards.qt=mltrh&q=lowerfilt:moon&mlt=true&qt=mltrh&wt=javabin&version=2} hits=2 status=0 QTime=65 
[junit4:junit4]   2> 3966 T229 C10 REQ [collection1] webapp= path=/select params={fl=id&sort=id+desc&mlt.fl=lowerfilt&shards.qt=mltrh&q=lowerfilt:fox&mlt=true&distrib=false&qt=mltrh&wt=javabin&version=2} hits=13 status=0 QTime=22 
[junit4:junit4]   2> 3986 T253 C12 REQ [collection1] webapp= path=/select params={sort=id+desc&mlt.fl=lowerfilt&shards.qt=mltrh&mlt=true&distrib=false&wt=javabin&rows=10&version=2&fl=id&shard.url=[ff01::083]:33332/|127.0.0.1:10589/|[ff01::114]:33332/|[ff01::213]:33332/&NOW=1355938377282&start=0&q=lowerfilt:fox&qt=mltrh&isShard=true&fsv=true} hits=6 status=0 QTime=7 
[junit4:junit4]   2> 3986 T242 C11 REQ [collection1] webapp= path=/select params={sort=id+desc&mlt.fl=lowerfilt&shards.qt=mltrh&mlt=true&distrib=false&wt=javabin&rows=10&version=2&fl=id&shard.url=[ff01::083]:33332/|[ff01::114]:33332/|127.0.0.1:10588/&NOW=1355938377282&start=0&q=lowerfilt:fox&qt=mltrh&isShard=true&fsv=true} hits=7 status=0 QTime=7 
[junit4:junit4]   2> 4000 T243 C11 REQ [collection1] webapp= path=/select params={mlt.fl=lowerfilt&sort=score+desc&shards.qt=mltrh&mlt.dist.id=21&mlt=true&distrib=false&wt=javabin&rows=20&version=2&fl=score,id&shard.url=[ff01::083]:33332/|[ff01::114]:33332/|127.0.0.1:10588/&NOW=1355938377282&start=0&q=%2B(lowerfilt:the)+-id:21&isShard=true&qt=mltrh} hits=7 status=0 QTime=7 
[junit4:junit4]   2> 4004 T242 C11 REQ [collection1] webapp= path=/select params={sort=score+desc&mlt.fl=lowerfilt&shards.qt=mltrh&mlt.dist.id=23&mlt=true&distrib=false&wt=javabin&rows=20&version=2&fl=score,id&shard.url=[ff01::083]:33332/|[ff01::114]:33332/|127.0.0.1:10588/&NOW=1355938377282&start=0&q=%2B(lowerfilt:the)+-id:23&qt=mltrh&isShard=true} hits=7 status=0 QTime=11 
[junit4:junit4]   2> 4007 T253 C12 REQ [collection1] webapp= path=/select params={sort=score+desc&mlt.fl=lowerfilt&shards.qt=mltrh&mlt.dist.id=23&mlt=true&distrib=false&wt=javabin&rows=20&version=2&fl=score,id&shard.url=[ff01::083]:33332/|127.0.0.1:10589/|[ff01::114]:33332/|[ff01::213]:33332/&NOW=1355938377282&start=0&q=%2B(lowerfilt:the)+-id:23&qt=mltrh&isShard=true} hits=6 status=0 QTime=13 
[junit4:junit4]   2> 4008 T254 C12 REQ [collection1] webapp= path=/select params={mlt.fl=lowerfilt&sort=score+desc&shards.qt=mltrh&mlt.dist.id=21&mlt=true&distrib=false&wt=javabin&rows=20&version=2&fl=score,id&shard.url=[ff01::083]:33332/|127.0.0.1:10589/|[ff01::114]:33332/|[ff01::213]:33332/&NOW=1355938377282&start=0&q=%2B(lowerfilt:the)+-id:21&isShard=true&qt=mltrh} hits=6 status=0 QTime=14 
[junit4:junit4]   2> 4009 T255 C12 REQ [collection1] webapp= path=/select params={mlt.fl=lowerfilt&sort=score+desc&shards.qt=mltrh&mlt.dist.id=14&mlt=true&distrib=false&wt=javabin&rows=20&version=2&fl=score,id&shard.url=[ff01::083]:33332/|127.0.0.1:10589/|[ff01::114]:33332/|[ff01::213]:33332/&NOW=1355938377282&start=0&q=%2B(lowerfilt:the)+-id:14&isShard=true&qt=mltrh} hits=6 status=0 QTime=9 
[junit4:junit4]   2> 4009 T292 C11 REQ [collection1] webapp= path=/select params={mlt.fl=lowerfilt&sort=score+desc&shards.qt=mltrh&mlt.dist.id=22&mlt=true&distrib=false&wt=javabin&rows=20&version=2&fl=score,id&shard.url=[ff01::083]:33332/|[ff01::114]:33332/|127.0.0.1:10588/&NOW=1355938377282&start=0&q=%2B(lowerfilt:the)+-id:22&isShard=true&qt=mltrh} hits=6 status=0 QTime=8 
[junit4:junit4]   2> 4010 T297 C11 REQ [collection1] webapp= path=/select params={mlt.fl=lowerfilt&sort=score+desc&shards.qt=mltrh&mlt.dist.id=17&mlt=true&distrib=false&wt=javabin&rows=20&version=2&fl=score,id&shard.url=[ff01::083]:33332/|[ff01::114]:33332/|127.0.0.1:10588/&NOW=1355938377282&start=0&q=%2B(lowerfilt:the)+-id:17&isShard=true&qt=mltrh} hits=6 status=0 QTime=7 
[junit4:junit4]   2> 4011 T244 C11 REQ [collection1] webapp= path=/select params={mlt.fl=lowerfilt&sort=score+desc&shards.qt=mltrh&mlt.dist.id=18&mlt=true&distrib=false&wt=javabin&rows=20&version=2&fl=score,id&shard.url=[ff01::083]:33332/|[ff01::114]:33332/|127.0.0.1:10588/&NOW=1355938377282&start=0&q=%2B(lowerfilt:the)+-id:18&isShard=true&qt=mltrh} hits=7 status=0 QTime=17 
[junit4:junit4]   2> 4011 T295 C11 REQ [collection1] webapp= path=/select params={mlt.fl=lowerfilt&sort=score+desc&shards.qt=mltrh&mlt.dist.id=13&mlt=true&distrib=false&wt=javabin&rows=20&version=2&fl=score,id&shard.url=[ff01::083]:33332/|[ff01::114]:33332/|127.0.0.1:10588/&NOW=1355938377282&start=0&q=%2B(lowerfilt:the)+-id:13&isShard=true&qt=mltrh} hits=6 status=0 QTime=8 
[junit4:junit4]   2> 4013 T256 C12 REQ [collection1] webapp= path=/select params={mlt.fl=lowerfilt&sort=score+desc&shards.qt=mltrh&mlt.dist.id=16&mlt=true&distrib=false&wt=javabin&rows=20&version=2&fl=score,id&shard.url=[ff01::083]:33332/|127.0.0.1:10589/|[ff01::114]:33332/|[ff01::213]:33332/&NOW=1355938377282&start=0&q=%2B(lowerfilt:the)+-id:16&isShard=true&qt=mltrh} hits=6 status=0 QTime=12 
[junit4:junit4]   2> 4013 T251 C12 oashc.MoreLikeThisComponent.handleResponses MLT Query returned: {responseHeader={status=0,QTime=11},response={numFound=7,start=0,maxScore=0.58267975,docs=[SolrDocument{id=13, score=0.58267975}, SolrDocument{id=15, score=0.58267975}, SolrDocument{id=19, score=0.58267975}, SolrDocument{id=20, score=0.58267975}, SolrDocument{id=22, score=0.58267975}, SolrDocument{id=24, score=0.58267975}, SolrDocument{id=17, score=0.4661438}]},moreLikeThis={13={numFound=6,start=0,docs=[SolrDocument{id=15}, SolrDocument{id=19}, SolrDocument{id=20}, SolrDocument{id=22}, SolrDocument{id=24}, SolrDocument{id=17}]},15={numFound=6,start=0,docs=[SolrDocument{id=13}, SolrDocument{id=19}, SolrDocument{id=20}, SolrDocument{id=22}, SolrDocument{id=24}, SolrDocument{id=17}]},19={numFound=6,start=0,docs=[SolrDocument{id=13}, SolrDocument{id=15}, SolrDocument{id=20}, SolrDocument{id=22}, SolrDocument{id=24}, SolrDocument{id=17}]},20={numFound=6,start=0,docs=[SolrDocument{id=13}, SolrDocument{id=15}, SolrDocument{id=19}, SolrDocument{id=22}, SolrDocument{id=24}, SolrDocument{id=17}]},22={numFound=6,start=0,docs=[SolrDocument{id=13}, SolrDocument{id=15}, SolrDocument{id=19}, SolrDocument{id=20}, SolrDocument{id=24}, SolrDocument{id=17}]},24={numFound=6,start=0,docs=[SolrDocument{id=13}, SolrDocument{id=15}, SolrDocument{id=19}, SolrDocument{id=20}, SolrDocument{id=22}, SolrDocument{id=17}]},17={numFound=6,start=0,docs=[SolrDocument{id=13}, SolrDocument{id=15}, SolrDocument{id=19}, SolrDocument{id=20}, SolrDocument{id=22}, SolrDocument{id=24}]}}}
[junit4:junit4]   2> 4013 T291 C11 REQ [collection1] webapp= path=/select params={mlt.fl=lowerfilt&sort=score+desc&shards.qt=mltrh&mlt.dist.id=24&mlt=true&distrib=false&wt=javabin&rows=20&version=2&fl=score,id&shard.url=[ff01::083]:33332/|[ff01::114]:33332/|127.0.0.1:10588/&NOW=1355938377282&start=0&q=%2B(lowerfilt:the)+-id:24&isShard=true&qt=mltrh} hits=6 status=0 QTime=12 
[junit4:junit4]   2> 4014 T282 C11 REQ [collection1] webapp= path=/select params={mlt.fl=lowerfilt&sort=score+desc&shards.qt=mltrh&mlt.dist.id=9&mlt=true&distrib=false&wt=javabin&rows=20&version=2&fl=score,id&shard.url=[ff01::083]:33332/|[ff01::114]:33332/|127.0.0.1:10588/&NOW=1355938377282&start=0&q=%2B(lowerfilt:the)+-id:9&isShard=true&qt=mltrh} hits=7 status=0 QTime=17 
[junit4:junit4]   2> 4015 T251 C12 oashc.MoreLikeThisComponent.handleResponses MLT Query returned: {responseHeader={status=0,QTime=13},response={numFound=6,start=0,maxScore=0.6565079,docs=[SolrDocument{id=14, score=0.6565079}, SolrDocument{id=16, score=0.6565079}, SolrDocument{id=18, score=0.6565079}, SolrDocument{id=21, score=0.6565079}, SolrDocument{id=7, score=0.5570654}, SolrDocument{id=9, score=0.5252063}]},moreLikeThis={14={numFound=6,start=0,docs=[SolrDocument{id=16}, SolrDocument{id=18}, SolrDocument{id=21}, SolrDocument{id=23}, SolrDocument{id=7}, SolrDocument{id=9}]},16={numFound=6,start=0,docs=[SolrDocument{id=14}, SolrDocument{id=18}, SolrDocument{id=21}, SolrDocument{id=23}, SolrDocument{id=7}, SolrDocument{id=9}]},18={numFound=6,start=0,docs=[SolrDocument{id=14}, SolrDocument{id=16}, SolrDocument{id=21}, SolrDocument{id=23}, SolrDocument{id=7}, SolrDocument{id=9}]},21={numFound=6,start=0,docs=[SolrDocument{id=14}, SolrDocument{id=16}, SolrDocument{id=18}, SolrDocument{id=23}, SolrDocument{id=7}, SolrDocument{id=9}]},7={numFound=0,start=0,docs=[]},9={numFound=6,start=0,docs=[SolrDocument{id=14}, SolrDocument{id=16}, SolrDocument{id=18}, SolrDocument{id=21}, SolrDocument{id=23}, SolrDocument{id=7}]}}}
[junit4:junit4]   2> 4016 T257 C12 REQ [collection1] webapp= path=/select params={mlt.fl=lowerfilt&sort=score+desc&shards.qt=mltrh&mlt.dist.id=18&mlt=true&distrib=false&wt=javabin&rows=20&version=2&fl=score,id&shard.url=[ff01::083]:33332/|127.0.0.1:10589/|[ff01::114]:33332/|[ff01::213]:33332/&NOW=1355938377282&start=0&q=%2B(lowerfilt:the)+-id:18&isShard=true&qt=mltrh} hits=6 status=0 QTime=14 
[junit4:junit4]   2> 4016 T245 C11 REQ [collection1] webapp= path=/select params={mlt.fl=lowerfilt&sort=score+desc&shards.qt=mltrh&mlt.dist.id=16&mlt=true&distrib=false&wt=javabin&rows=20&version=2&fl=score,id&shard.url=[ff01::083]:33332/|[ff01::114]:33332/|127.0.0.1:10588/&NOW=1355938377282&start=0&q=%2B(lowerfilt:the)+-id:16&isShard=true&qt=mltrh} hits=7 status=0 QTime=22 
[junit4:junit4]   2> 4017 T251 C12 oashc.MoreLikeThisComponent.handleResponses MLT Query returned: {responseHeader={status=0,QTime=7},response={numFound=7,start=0,maxScore=0.58267975,docs=[SolrDocument{id=13, score=0.58267975}, SolrDocument{id=15, score=0.58267975}, SolrDocument{id=19, score=0.58267975}, SolrDocument{id=20, score=0.58267975}, SolrDocument{id=22, score=0.58267975}, SolrDocument{id=24, score=0.58267975}, SolrDocument{id=17, score=0.4661438}]},moreLikeThis={13={numFound=6,start=0,docs=[SolrDocument{id=15}, SolrDocument{id=19}, SolrDocument{id=20}, SolrDocument{id=22}, SolrDocument{id=24}, SolrDocument{id=17}]},15={numFound=6,start=0,docs=[SolrDocument{id=13}, SolrDocument{id=19}, SolrDocument{id=20}, SolrDocument{id=22}, SolrDocument{id=24}, SolrDocument{id=17}]},19={numFound=6,start=0,docs=[SolrDocument{id=13}, SolrDocument{id=15}, SolrDocument{id=20}, SolrDocument{id=22}, SolrDocument{id=24}, SolrDocument{id=17}]},20={numFound=6,start=0,docs=[SolrDocument{id=13}, SolrDocument{id=15}, SolrDocument{id=19}, SolrDocument{id=22}, SolrDocument{id=24}, SolrDocument{id=17}]},22={numFound=6,start=0,docs=[SolrDocument{id=13}, SolrDocument{id=15}, SolrDocument{id=19}, SolrDocument{id=20}, SolrDocument{id=24}, SolrDocument{id=17}]},24={numFound=6,start=0,docs=[SolrDocument{id=13}, SolrDocument{id=15}, SolrDocument{id=19}, SolrDocument{id=20}, SolrDocument{id=22}, SolrDocument{id=17}]},17={numFound=6,start=0,docs=[SolrDocument{id=13}, SolrDocument{id=15}, SolrDocument{id=19}, SolrDocument{id=20}, SolrDocument{id=22}, SolrDocument{id=24}]}}}
[junit4:junit4]   2> 4018 T296 C12 REQ [collection1] webapp= path=/select params={mlt.fl=lowerfilt&sort=score+desc&shards.qt=mltrh&mlt.dist.id=24&mlt=true&distrib=false&wt=javabin&rows=20&version=2&fl=score,id&shard.url=[ff01::083]:33332/|127.0.0.1:10589/|[ff01::114]:33332/|[ff01::213]:33332/&NOW=1355938377282&start=0&q=%2B(lowerfilt:the)+-id:24&isShard=true&qt=mltrh} hits=7 status=0 QTime=11 
[junit4:junit4]   2> 4019 T251 C12 oashc.MoreLikeThisComponent.handleResponses MLT Query returned: {responseHeader={status=0,QTime=14},response={numFound=6,start=0,maxScore=0.6565079,docs=[SolrDocument{id=14, score=0.6565079}, SolrDocument{id=16, score=0.6565079}, SolrDocument{id=18, score=0.6565079}, SolrDocument{id=23, score=0.6565079}, SolrDocument{id=7, score=0.5570654}, SolrDocument{id=9, score=0.5252063}]},moreLikeThis={14={numFound=6,start=0,docs=[SolrDocument{id=16}, SolrDocument{id=18}, SolrDocument{id=21}, SolrDocument{id=23}, SolrDocument{id=7}, SolrDocument{id=9}]},16={numFound=6,start=0,docs=[SolrDocument{id=14}, SolrDocument{id=18}, SolrDocument{id=21}, SolrDocument{id=23}, SolrDocument{id=7}, SolrDocument{id=9}]},18={numFound=6,start=0,docs=[SolrDocument{id=14}, SolrDocument{id=16}, SolrDocument{id=21}, SolrDocument{id=23}, SolrDocument{id=7}, SolrDocument{id=9}]},23={numFound=6,start=0,docs=[SolrDocument{id=14}, SolrDocument{id=16}, SolrDocument{id=18}, SolrDocument{id=21}, SolrDocument{id=7}, SolrDocument{id=9}]},7={numFound=0,start=0,docs=[]},9={numFound=6,start=0,docs=[SolrDocument{id=14}, SolrDocument{id=16}, SolrDocument{id=18}, SolrDocument{id=21}, SolrDocument{id=23}, SolrDocument{id=7}]}}}
[junit4:junit4]   2> 4019 T294 C12 REQ [collection1] webapp= path=/select params={mlt.fl=lowerfilt&sort=score+desc&shards.qt=mltrh&mlt.dist.id=9&mlt=true&distrib=false&wt=javabin&rows=20&version=2&fl=score,id&shard.url=[ff01::083]:33332/|127.0.0.1:10589/|[ff01::114]:33332/|[ff01::213]:33332/&NOW=1355938377282&start=0&q=%2B(lowerfilt:the)+-id:9&isShard=true&qt=mltrh} hits=6 status=0 QTime=16 
[junit4:junit4]   2> 4020 T251 C12 oashc.MoreLikeThisComponent.handleResponses MLT Query returned: {responseHeader={status=0,QTime=17},response={numFound=7,start=0,maxScore=0.58267975,docs=[SolrDocument{id=13, score=0.58267975}, SolrDocument{id=15, score=0.58267975}, SolrDocument{id=19, score=0.58267975}, SolrDocument{id=20, score=0.58267975}, SolrDocument{id=22, score=0.58267975}, SolrDocument{id=24, score=0.58267975}, SolrDocument{id=17, score=0.4661438}]},moreLikeThis={13={numFound=6,start=0,docs=[SolrDocument{id=15}, SolrDocument{id=19}, SolrDocument{id=20}, SolrDocument{id=22}, SolrDocument{id=24}, SolrDocument{id=17}]},15={numFound=6,start=0,docs=[SolrDocument{id=13}, SolrDocument{id=19}, SolrDocument{id=20}, SolrDocument{id=22}, SolrDocument{id=24}, SolrDocument{id=17}]},19={numFound=6,start=0,docs=[SolrDocument{id=13}, SolrDocument{id=15}, SolrDocument{id=20}, SolrDocument{id=22}, SolrDocument{id=24}, SolrDocument{id=17}]},20={numFound=6,start=0,docs=[SolrDocument{id=13}, SolrDocument{id=15}, SolrDocument{id=19}, SolrDocument{id=22}, SolrDocument{id=24}, SolrDocument{id=17}]},22={numFound=6,start=0,docs=[SolrDocument{id=13}, SolrDocument{id=15}, SolrDocument{id=19}, SolrDocument{id=20}, SolrDocument{id=24}, SolrDocument{id=17}]},24={numFound=6,start=0,docs=[SolrDocument{id=13}, SolrDocument{id=15}, SolrDocument{id=19}, SolrDocument{id=20}, SolrDocument{id=22}, SolrDocument{id=17}]},17={numFound=6,start=0,docs=[SolrDocument{id=13}, SolrDocument{id=15}, SolrDocument{id=19}, SolrDocument{id=20}, SolrDocument{id=22}, SolrDocument{id=24}]}}}
[junit4:junit4]   2> 4022 T251 C12 oashc.MoreLikeThisComponent.handleResponses MLT Query returned: {responseHeader={status=0,QTime=14},response={numFound=6,start=0,maxScore=0.6565079,docs=[SolrDocument{id=14, score=0.6565079}, SolrDocument{id=16, score=0.6565079}, SolrDocument{id=21, score=0.6565079}, SolrDocument{id=23, score=0.6565079}, SolrDocument{id=7, score=0.5570654}, SolrDocument{id=9, score=0.5252063}]},moreLikeThis={14={numFound=6,start=0,docs=[SolrDocument{id=16}, SolrDocument{id=18}, SolrDocument{id=21}, SolrDocument{id=23}, SolrDocument{id=7}, SolrDocument{id=9}]},16={numFound=6,start=0,docs=[SolrDocument{id=14}, SolrDocument{id=18}, SolrDocument{id=21}, SolrDocument{id=23}, SolrDocument{id=7}, SolrDocument{id=9}]},21={numFound=6,start=0,docs=[SolrDocument{id=14}, SolrDocument{id=16}, SolrDocument{id=18}, SolrDocument{id=23}, SolrDocument{id=7}, SolrDocument{id=9}]},23={numFound=6,start=0,docs=[SolrDocument{id=14}, SolrDocument{id=16}, SolrDocument{id=18}, SolrDocument{id=21}, SolrDocument{id=7}, SolrDocument{id=9}]},7={numFound=0,start=0,docs=[]},9={numFound=6,start=0,docs=[SolrDocument{id=14}, SolrDocument{id=16}, SolrDocument{id=18}, SolrDocument{id=21}, SolrDocument{id=23}, SolrDocument{id=7}]}}}
[junit4:junit4]   2> 4023 T299 C11 REQ [collection1] webapp= path=/select params={mlt.fl=lowerfilt&sort=score+desc&shards.qt=mltrh&mlt.dist.id=15&mlt=true&distrib=false&wt=javabin&rows=20&version=2&fl=score,id&shard.url=[ff01::083]:33332/|[ff01::114]:33332/|127.0.0.1:10588/&NOW=1355938377282&start=0&q=%2B(lowerfilt:the)+-id:15&isShard=true&qt=mltrh} hits=6 status=0 QTime=7 
[junit4:junit4]   2> 4023 T300 C12 REQ [collection1] webapp= path=/select params={mlt.fl=lowerfilt&sort=score+desc&shards.qt=mltrh&mlt.dist.id=22&mlt=true&distrib=false&wt=javabin&rows=20&version=2&fl=score,id&shard.url=[ff01::083]:33332/|127.0.0.1:10589/|[ff01::114]:33332/|[ff01::213]:33332/&NOW=1355938377282&start=0&q=%2B(lowerfilt:the)+-id:22&isShard=true&qt=mltrh} hits=7 status=0 QTime=8 
[junit4:junit4]   2> 4023 T251 C12 oashc.MoreLikeThisComponent.handleResponses MLT Query returned: {responseHeader={status=0,QTime=12},response={numFound=6,start=0,maxScore=0.6565079,docs=[SolrDocument{id=14, score=0.6565079}, SolrDocument{id=18, score=0.6565079}, SolrDocument{id=21, score=0.6565079}, SolrDocument{id=23, score=0.6565079}, SolrDocument{id=7, score=0.5570654}, SolrDocument{id=9, score=0.5252063}]},moreLikeThis={14={numFound=6,start=0,docs=[SolrDocument{id=16}, SolrDocument{id=18}, SolrDocument{id=21}, SolrDocument{id=23}, SolrDocument{id=7}, SolrDocument{id=9}]},18={numFound=6,start=0,docs=[SolrDocument{id=14}, SolrDocument{id=16}, SolrDocument{id=21}, SolrDocument{id=23}, SolrDocument{id=7}, SolrDocument{id=9}]},21={numFound=6,start=0,docs=[SolrDocument{id=14}, SolrDocument{id=16}, SolrDocument{id=18}, SolrDocument{id=23}, SolrDocument{id=7}, SolrDocument{id=9}]},23={numFound=6,start=0,docs=[SolrDocument{id=14}, SolrDocument{id=16}, SolrDocument{id=18}, SolrDocument{id=21}, SolrDocument{id=7}, SolrDocument{id=9}]},7={numFound=0,start=0,docs=[]},9={numFound=6,start=0,docs=[SolrDocument{id=14}, SolrDocument{id=16}, SolrDocument{id=18}, SolrDocument{id=21}, SolrDocument{id=23}, SolrDocument{id=7}]}}}
[junit4:junit4]   2> 4024 T251 C12 oashc.MoreLikeThisComponent.handleResponses MLT Query returned: {responseHeader={status=0,QTime=22},response={numFound=7,start=0,maxScore=0.58267975,docs=[SolrDocument{id=13, score=0.58267975}, SolrDocument{id=15, score=0.58267975}, SolrDocument{id=19, score=0.58267975}, SolrDocument{id=20, score=0.58267975}, SolrDocument{id=22, score=0.58267975}, SolrDocument{id=24, score=0.58267975}, SolrDocument{id=17, score=0.4661438}]},moreLikeThis={13={numFound=6,start=0,docs=[SolrDocument{id=15}, SolrDocument{id=19}, SolrDocument{id=20}, SolrDocument{id=22}, SolrDocument{id=24}, SolrDocument{id=17}]},15={numFound=6,start=0,docs=[SolrDocument{id=13}, SolrDocument{id=19}, SolrDocument{id=20}, SolrDocument{id=22}, SolrDocument{id=24}, SolrDocument{id=17}]},19={numFound=6,start=0,docs=[SolrDocument{id=13}, SolrDocument{id=15}, SolrDocument{id=20}, SolrDocument{id=22}, SolrDocument{id=24}, SolrDocument{id=17}]},20={numFound=6,start=0,docs=[SolrDocument{id=13}, SolrDocument{id=15}, SolrDocument{id=19}, SolrDocument{id=22}, SolrDocument{id=24}, SolrDocument{id=17}]},22={numFound=6,start=0,docs=[SolrDocument{id=13}, SolrDocument{id=15}, SolrDocument{id=19}, SolrDocument{id=20}, SolrDocument{id=24}, SolrDocument{id=17}]},24={numFound=6,start=0,docs=[SolrDocument{id=13}, SolrDocument{id=15}, SolrDocument{id=19}, SolrDocument{id=20}, SolrDocument{id=22}, SolrDocument{id=17}]},17={numFound=6,start=0,docs=[SolrDocument{id=13}, SolrDocument{id=15}, SolrDocument{id=19}, SolrDocument{id=20}, SolrDocument{id=22}, SolrDocument{id=24}]}}}
[junit4:junit4]   2> 4026 T251 C12 oashc.MoreLikeThisComponent.handleResponses MLT Query returned: {responseHeader={status=0,QTime=12},response={numFound=6,start=0,maxScore=0.58267975,docs=[SolrDocument{id=13, score=0.58267975}, SolrDocument{id=15, score=0.58267975}, SolrDocument{id=19, score=0.58267975}, SolrDocument{id=20, score=0.58267975}, SolrDocument{id=22, score=0.58267975}, SolrDocument{id=17, score=0.4661438}]},moreLikeThis={13={numFound=6,start=0,docs=[SolrDocument{id=15}, SolrDocument{id=19}, SolrDocument{id=20}, SolrDocument{id=22}, SolrDocument{id=24}, SolrDocument{id=17}]},15={numFound=6,start=0,docs=[SolrDocument{id=13}, SolrDocument{id=19}, SolrDocument{id=20}, SolrDocument{id=22}, SolrDocument{id=24}, SolrDocument{id=17}]},19={numFound=6,start=0,docs=[SolrDocument{id=13}, SolrDocument{id=15}, SolrDocument{id=20}, SolrDocument{id=22}, SolrDocument{id=24}, SolrDocument{id=17}]},20={numFound=6,start=0,docs=[SolrDocument{id=13}, SolrDocument{id=15}, SolrDocument{id=19}, SolrDocument{id=22}, SolrDocument{id=24}, SolrDocument{id=17}]},22={numFound=6,start=0,docs=[SolrDocument{id=13}, SolrDocument{id=15}, SolrDocument{id=19}, SolrDocument{id=20}, SolrDocument{id=24}, SolrDocument{id=17}]},17={numFound=6,start=0,docs=[SolrDocument{id=13}, SolrDocument{id=15}, SolrDocument{id=19}, SolrDocument{id=20}, SolrDocument{id=22}, SolrDocument{id=24}]}}}
[junit4:junit4]   2> 4026 T298 C12 REQ [collection1] webapp= path=/select params={mlt.fl=lowerfilt&sort=score+desc&shards.qt=mltrh&mlt.dist.id=13&mlt=true&distrib=false&wt=javabin&rows=20&version=2&fl=score,id&shard.url=[ff01::083]:33332/|127.0.0.1:10589/|[ff01::114]:33332/|[ff01::213]:33332/&NOW=1355938377282&start=0&q=%2B(lowerfilt:the)+-id:13&isShard=true&qt=mltrh} hits=7 status=0 QTime=9 
[junit4:junit4]   2> 4027 T303 C12 REQ [collection1] webapp= path=/select params={mlt.fl=lowerfilt&sort=score+desc&shards.qt=mltrh&mlt.dist.id=19&mlt=true&distrib=false&wt=javabin&rows=20&version=2&fl=score,id&shard.url=[ff01::083]:33332/|127.0.0.1:10589/|[ff01::114]:33332/|[ff01::213]:33332/&NOW=1355938377282&start=0&q=%2B(lowerfilt:the)+-id:19&isShard=true&qt=mltrh} hits=7 status=0 QTime=9 
[junit4:junit4]   2> 4027 T301 C12 REQ [collection1] webapp= path=/select params={mlt.fl=lowerfilt&sort=score+desc&shards.qt=mltrh&mlt.dist.id=17&mlt=true&distrib=false&wt=javabin&rows=20&version=2&fl=score,id&shard.url=[ff01::083]:33332/|127.0.0.1:10589/|[ff01::114]:33332/|[ff01::213]:33332/&NOW=1355938377282&start=0&q=%2B(lowerfilt:the)+-id:17&isShard=true&qt=mltrh} hits=7 status=0 QTime=11 
[junit4:junit4]   2> 4028 T251 C12 oashc.MoreLikeThisComponent.handleResponses MLT Query returned: {responseHeader={status=0,QTime=11},response={numFound=7,start=0,maxScore=0.6565079,docs=[SolrDocument{id=14, score=0.6565079}, SolrDocument{id=16, score=0.6565079}, SolrDocument{id=18, score=0.6565079}, SolrDocument{id=21, score=0.6565079}, SolrDocument{id=23, score=0.6565079}, SolrDocument{id=7, score=0.5570654}, SolrDocument{id=9, score=0.5252063}]},moreLikeThis={14={numFound=6,start=0,docs=[SolrDocument{id=16}, SolrDocument{id=18}, SolrDocument{id=21}, SolrDocument{id=23}, SolrDocument{id=7}, SolrDocument{id=9}]},16={numFound=6,start=0,docs=[SolrDocument{id=14}, SolrDocument{id=18}, SolrDocument{id=21}, SolrDocument{id=23}, SolrDocument{id=7}, SolrDocument{id=9}]},18={numFound=6,start=0,docs=[SolrDocument{id=14}, SolrDocument{id=16}, SolrDocument{id=21}, SolrDocument{id=23}, SolrDocument{id=7}, SolrDocument{id=9}]},21={numFound=6,start=0,docs=[SolrDocument{id=14}, SolrDocument{id=16}, SolrDocument{id=18}, SolrDocument{id=23}, SolrDocument{id=7}, SolrDocument{id=9}]},23={numFound=6,start=0,docs=[SolrDocument{id=14}, SolrDocument{id=16}, SolrDocument{id=18}, SolrDocument{id=21}, SolrDocument{id=7}, SolrDocument{id=9}]},7={numFound=0,start=0,docs=[]},9={numFound=6,start=0,docs=[SolrDocument{id=14}, SolrDocument{id=16}, SolrDocument{id=18}, SolrDocument{id=21}, SolrDocument{id=23}, SolrDocument{id=7}]}}}
[junit4:junit4]   2> 4029 T293 C11 REQ [collection1] webapp= path=/select params={mlt.fl=lowerfilt&sort=score+desc&shards.qt=mltrh&mlt.dist.id=20&mlt=true&distrib=false&wt=javabin&rows=20&version=2&fl=score,id&shard.url=[ff01::083]:33332/|[ff01::114]:33332/|127.0.0.1:10588/&NOW=1355938377282&start=0&q=%2B(lowerfilt:the)+-id:20&isShard=true&qt=mltrh} hits=6 status=0 QTime=27 
[junit4:junit4]   2> 4029 T251 C12 oashc.MoreLikeThisComponent.handleResponses MLT Query returned: {responseHeader={status=0,QTime=17},response={numFound=7,start=0,maxScore=0.58267975,docs=[SolrDocument{id=13, score=0.58267975}, SolrDocument{id=15, score=0.58267975}, SolrDocument{id=19, score=0.58267975}, SolrDocument{id=20, score=0.58267975}, SolrDocument{id=22, score=0.58267975}, SolrDocument{id=24, score=0.58267975}, SolrDocument{id=17, score=0.4661438}]},moreLikeThis={13={numFound=6,start=0,docs=[SolrDocument{id=15}, SolrDocument{id=19}, SolrDocument{id=20}, SolrDocument{id=22}, SolrDocument{id=24}, SolrDocument{id=17}]},15={numFound=6,start=0,docs=[SolrDocument{id=13}, SolrDocument{id=19}, SolrDocument{id=20}, SolrDocument{id=22}, SolrDocument{id=24}, SolrDocument{id=17}]},19={numFound=6,start=0,docs=[SolrDocument{id=13}, SolrDocument{id=15}, SolrDocument{id=20}, SolrDocument{id=22}, SolrDocument{id=24}, SolrDocument{id=17}]},20={numFound=6,start=0,docs=[SolrDocument{id=13}, SolrDocument{id=15}, SolrDocument{id=19}, SolrDocument{id=22}, SolrDocument{id=24}, SolrDocument{id=17}]},22={numFound=6,start=0,docs=[SolrDocument{id=13}, SolrDocument{id=15}, SolrDocument{id=19}, SolrDocument{id=20}, SolrDocument{id=24}, SolrDocument{id=17}]},24={numFound=6,start=0,docs=[SolrDocument{id=13}, SolrDocument{id=15}, SolrDocument{id=19}, SolrDocument{id=20}, SolrDocument{id=22}, SolrDocument{id=17}]},17={numFound=6,start=0,docs=[SolrDocument{id=13}, SolrDocument{id=15}, SolrDocument{id=19}, SolrDocument{id=20}, SolrDocument{id=22}, SolrDocument{id=24}]}}}
[junit4:junit4]   2> 4029 T302 C12 REQ [collection1] webapp= path=/select params={mlt.fl=lowerfilt&sort=score+desc&shards.qt=mltrh&mlt.dist.id=15&mlt=true&distrib=false&wt=javabin&rows=20&version=2&fl=score,id&shard.url=[ff01::083]:33332/|127.0.0.1:10589/|[ff01::114]:33332/|[ff01::213]:33332/&NOW=1355938377282&start=0&q=%2B(lowerfilt:the)+-id:15&isShard=true&qt=mltrh} hits=7 status=0 QTime=12 
[junit4:junit4]   2> 4031 T251 C12 oashc.MoreLikeThisComponent.handleResponses MLT Query returned: {responseHeader={status=0,QTime=16},response={numFound=6,start=0,maxScore=0.6565079,docs=[SolrDocument{id=14, score=0.6565079}, SolrDocument{id=16, score=0.6565079}, SolrDocument{id=18, score=0.6565079}, SolrDocument{id=21, score=0.6565079}, SolrDocument{id=23, score=0.6565079}, SolrDocument{id=7, score=0.5570654}]},moreLikeThis={14={numFound=6,start=0,docs=[SolrDocument{id=16}, SolrDocument{id=18}, SolrDocument{id=21}, SolrDocument{id=23}, SolrDocument{id=7}, SolrDocument{id=9}]},16={numFound=6,start=0,docs=[SolrDocument{id=14}, SolrDocument{id=18}, SolrDocument{id=21}, SolrDocument{id=23}, SolrDocument{id=7}, SolrDocument{id=9}]},18={numFound=6,start=0,docs=[SolrDocument{id=14}, SolrDocument{id=16}, SolrDocument{id=21}, SolrDocument{id=23}, SolrDocument{id=7}, SolrDocument{id=9}]},21={numFound=6,start=0,docs=[SolrDocument{id=14}, SolrDocument{id=16}, SolrDocument{id=18}, SolrDocument{id=23}, SolrDocument{id=7}, SolrDocument{id=9}]},23={numFound=6,start=0,docs=[SolrDocument{id=14}, SolrDocument{id=16}, SolrDocument{id=18}, SolrDocument{id=21}, SolrDocument{id=7}, SolrDocument{id=9}]},7={numFound=0,start=0,docs=[]}}}
[junit4:junit4]   2> 4031 T304 C12 REQ [collection1] webapp= path=/select params={mlt.fl=lowerfilt&sort=score+desc&shards.qt=mltrh&mlt.dist.id=20&mlt=true&distrib=false&wt=javabin&rows=20&version=2&fl=score,id&shard.url=[ff01::083]:33332/|127.0.0.1:10589/|[ff01::114]:33332/|[ff01::213]:33332/&NOW=1355938377282&start=0&q=%2B(lowerfilt:the)+-id:20&isShard=true&qt=mltrh} hits=7 status=0 QTime=11 
[junit4:junit4]   2> 4032 T251 C12 oashc.MoreLikeThisComponent.handleResponses MLT Query returned: {responseHeader={status=0,QTime=8},response={numFound=6,start=0,maxScore=0.58267975,docs=[SolrDocument{id=13, score=0.58267975}, SolrDocument{id=15, score=0.58267975}, SolrDocument{id=19, score=0.58267975}, SolrDocument{id=20, score=0.58267975}, SolrDocument{id=24, score=0.58267975}, SolrDocument{id=17, score=0.4661438}]},moreLikeThis={13={numFound=6,start=0,docs=[SolrDocument{id=15}, SolrDocument{id=19}, SolrDocument{id=20}, SolrDocument{id=22}, SolrDocument{id=24}, SolrDocument{id=17}]},15={numFound=6,start=0,docs=[SolrDocument{id=13}, SolrDocument{id=19}, SolrDocument{id=20}, SolrDocument{id=22}, SolrDocument{id=24}, SolrDocument{id=17}]},19={numFound=6,start=0,docs=[SolrDocument{id=13}, SolrDocument{id=15}, SolrDocument{id=20}, SolrDocument{id=22}, SolrDocument{id=24}, SolrDocument{id=17}]},20={numFound=6,start=0,docs=[SolrDocument{id=13}, SolrDocument{id=15}, SolrDocument{id=19}, SolrDocument{id=22}, SolrDocument{id=24}, SolrDocument{id=17}]},24={numFound=6,start=0,docs=[SolrDocument{id=13}, SolrDocument{id=15}, SolrDocument{id=19}, SolrDocument{id=20}, SolrDocument{id=22}, SolrDocument{id=17}]},17={numFound=6,start=0,docs=[SolrDocument{id=13}, SolrDocument{id=15}, SolrDocument{id=19}, SolrDocument{id=20}, SolrDocument{id=22}, SolrDocument{id=24}]}}}
[junit4:junit4]   2> 4033 T251 C12 oashc.MoreLikeThisComponent.handleResponses MLT Query returned: {responseHeader={status=0,QTime=8},response={numFound=7,start=0,maxScore=0.6565079,docs=[SolrDocument{id=14, score=0.6565079}, SolrDocument{id=16, score=0.6565079}, SolrDocument{id=18, score=0.6565079}, SolrDocument{id=21, score=0.6565079}, SolrDocument{id=23, score=0.6565079}, SolrDocument{id=7, score=0.5570654}, SolrDocument{id=9, score=0.5252063}]},moreLikeThis={14={numFound=6,start=0,docs=[SolrDocument{id=16}, SolrDocument{id=18}, SolrDocument{id=21}, SolrDocument{id=23}, SolrDocument{id=7}, SolrDocument{id=9}]},16={numFound=6,start=0,docs=[SolrDocument{id=14}, SolrDocument{id=18}, SolrDocument{id=21}, SolrDocument{id=23}, SolrDocument{id=7}, SolrDocument{id=9}]},18={numFound=6,start=0,docs=[SolrDocument{id=14}, SolrDocument{id=16}, SolrDocument{id=21}, SolrDocument{id=23}, SolrDocument{id=7}, SolrDocument{id=9}]},21={numFound=6,start=0,docs=[SolrDocument{id=14}, SolrDocument{id=16}, SolrDocument{id=18}, SolrDocument{id=23}, SolrDocument{id=7}, SolrDocument{id=9}]},23={numFound=6,start=0,docs=[SolrDocument{id=14}, SolrDocument{id=16}, SolrDocument{id=18}, SolrDocument{id=21}, SolrDocument{id=7}, SolrDocument{id=9}]},7={numFound=0,start=0,docs=[]},9={numFound=6,start=0,docs=[SolrDocument{id=14}, SolrDocument{id=16}, SolrDocument{id=18}, SolrDocument{id=21}, SolrDocument{id=23}, SolrDocument{id=7}]}}}
[junit4:junit4]   2> 4034 T246 C11 REQ [collection1] webapp= path=/select params={mlt.fl=lowerfilt&sort=score+desc&shards.qt=mltrh&mlt.dist.id=14&mlt=true&distrib=false&wt=javabin&rows=20&version=2&fl=score,id&shard.url=[ff01::083]:33332/|[ff01::114]:33332/|127.0.0.1:10588/&NOW=1355938377282&start=0&q=%2B(lowerfilt:the)+-id:14&isShard=true&qt=mltrh} hits=7 status=0 QTime=40 
[junit4:junit4]   2> 4034 T251 C12 oashc.MoreLikeThisComponent.handleResponses MLT Query returned: {responseHeader={status=0,QTime=8},response={numFound=6,start=0,maxScore=0.58267975,docs=[SolrDocument{id=15, score=0.58267975}, SolrDocument{id=19, score=0.58267975}, SolrDocument{id=20, score=0.58267975}, SolrDocument{id=22, score=0.58267975}, SolrDocument{id=24, score=0.58267975}, SolrDocument{id=17, score=0.4661438}]},moreLikeThis={15={numFound=6,start=0,docs=[SolrDocument{id=13}, SolrDocument{id=19}, SolrDocument{id=20}, SolrDocument{id=22}, SolrDocument{id=24}, SolrDocument{id=17}]},19={numFound=6,start=0,docs=[SolrDocument{id=13}, SolrDocument{id=15}, SolrDocument{id=20}, SolrDocument{id=22}, SolrDocument{id=24}, SolrDocument{id=17}]},20={numFound=6,start=0,docs=[SolrDocument{id=13}, SolrDocument{id=15}, SolrDocument{id=19}, SolrDocument{id=22}, SolrDocument{id=24}, SolrDocument{id=17}]},22={numFound=6,start=0,docs=[SolrDocument{id=13}, SolrDocument{id=15}, SolrDocument{id=19}, SolrDocument{id=20}, SolrDocument{id=24}, SolrDocument{id=17}]},24={numFound=6,start=0,docs=[SolrDocument{id=13}, SolrDocument{id=15}, SolrDocument{id=19}, SolrDocument{id=20}, SolrDocument{id=22}, SolrDocument{id=17}]},17={numFound=6,start=0,docs=[SolrDocument{id=13}, SolrDocument{id=15}, SolrDocument{id=19}, SolrDocument{id=20}, SolrDocument{id=22}, SolrDocument{id=24}]}}}
[junit4:junit4]   2> 4035 T251 C12 oashc.MoreLikeThisComponent.handleResponses MLT Query returned: {responseHeader={status=0,QTime=9},response={numFound=7,start=0,maxScore=0.6565079,docs=[SolrDocument{id=14, score=0.6565079}, SolrDocument{id=16, score=0.6565079}, SolrDocument{id=18, score=0.6565079}, SolrDocument{id=21, score=0.6565079}, SolrDocument{id=23, score=0.6565079}, SolrDocument{id=7, score=0.5570654}, SolrDocument{id=9, score=0.5252063}]},moreLikeThis={14={numFound=6,start=0,docs=[SolrDocument{id=16}, SolrDocument{id=18}, SolrDocument{id=21}, SolrDocument{id=23}, SolrDocument{id=7}, SolrDocument{id=9}]},16={numFound=6,start=0,docs=[SolrDocument{id=14}, SolrDocument{id=18}, SolrDocument{id=21}, SolrDocument{id=23}, SolrDocument{id=7}, SolrDocument{id=9}]},18={numFound=6,start=0,docs=[SolrDocument{id=14}, SolrDocument{id=16}, SolrDocument{id=21}, SolrDocument{id=23}, SolrDocument{id=7}, SolrDocument{id=9}]},21={numFound=6,start=0,docs=[SolrDocument{id=14}, SolrDocument{id=16}, SolrDocument{id=18}, SolrDocument{id=23}, SolrDocument{id=7}, SolrDocument{id=9}]},23={numFound=6,start=0,docs=[SolrDocument{id=14}, SolrDocument{id=16}, SolrDocument{id=18}, SolrDocument{id=21}, SolrDocument{id=7}, SolrDocument{id=9}]},7={numFound=0,start=0,docs=[]},9={numFound=6,start=0,docs=[SolrDocument{id=14}, SolrDocument{id=16}, SolrDocument{id=18}, SolrDocument{id=21}, SolrDocument{id=23}, SolrDocument{id=7}]}}}
[junit4:junit4]   2> 4036 T251 C12 oashc.MoreLikeThisComponent.handleResponses MLT Query returned: {responseHeader={status=0,QTime=7},response={numFound=6,start=0,maxScore=0.58267975,docs=[SolrDocument{id=13, score=0.58267975}, SolrDocument{id=15, score=0.58267975}, SolrDocument{id=19, score=0.58267975}, SolrDocument{id=20, score=0.58267975}, SolrDocument{id=22, score=0.58267975}, SolrDocument{id=24, score=0.58267975}]},moreLikeThis={13={numFound=6,start=0,docs=[SolrDocument{id=15}, SolrDocument{id=19}, SolrDocument{id=20}, SolrDocument{id=22}, SolrDocument{id=24}, SolrDocument{id=17}]},15={numFound=6,start=0,docs=[SolrDocument{id=13}, SolrDocument{id=19}, SolrDocument{id=20}, SolrDocument{id=22}, SolrDocument{id=24}, SolrDocument{id=17}]},19={numFound=6,start=0,docs=[SolrDocument{id=13}, SolrDocument{id=15}, SolrDocument{id=20}, SolrDocument{id=22}, SolrDocument{id=24}, SolrDocument{id=17}]},20={numFound=6,start=0,docs=[SolrDocument{id=13}, SolrDocument{id=15}, SolrDocument{id=19}, SolrDocument{id=22}, SolrDocument{id=24}, SolrDocument{id=17}]},22={numFound=6,start=0,docs=[SolrDocument{id=13}, SolrDocument{id=15}, SolrDocument{id=19}, SolrDocument{id=20}, SolrDocument{id=24}, SolrDocument{id=17}]},24={numFound=6,start=0,docs=[SolrDocument{id=13}, SolrDocument{id=15}, SolrDocument{id=19}, SolrDocument{id=20}, SolrDocument{id=22}, SolrDocument{id=17}]}}}
[junit4:junit4]   2> 4037 T251 C12 oashc.MoreLikeThisComponent.handleResponses MLT Query returned: {responseHeader={status=0,QTime=11},response={numFound=7,start=0,maxScore=0.6565079,docs=[SolrDocument{id=14, score=0.6565079}, SolrDocument{id=16, score=0.6565079}, SolrDocument{id=18, score=0.6565079}, SolrDocument{id=21, score=0.6565079}, SolrDocument{id=23, score=0.6565079}, SolrDocument{id=7, score=0.5570654}, SolrDocument{id=9, score=0.5252063}]},moreLikeThis={14={numFound=6,start=0,docs=[SolrDocument{id=16}, SolrDocument{id=18}, SolrDocument{id=21}, SolrDocument{id=23}, SolrDocument{id=7}, SolrDocument{id=9}]},16={numFound=6,start=0,docs=[SolrDocument{id=14}, SolrDocument{id=18}, SolrDocument{id=21}, SolrDocument{id=23}, SolrDocument{id=7}, SolrDocument{id=9}]},18={numFound=6,start=0,docs=[SolrDocument{id=14}, SolrDocument{id=16}, SolrDocument{id=21}, SolrDocument{id=23}, SolrDocument{id=7}, SolrDocument{id=9}]},21={numFound=6,start=0,docs=[SolrDocument{id=14}, SolrDocument{id=16}, SolrDocument{id=18}, SolrDocument{id=23}, SolrDocument{id=7}, SolrDocument{id=9}]},23={numFound=6,start=0,docs=[SolrDocument{id=14}, SolrDocument{id=16}, SolrDocument{id=18}, SolrDocument{id=21}, SolrDocument{id=7}, SolrDocument{id=9}]},7={numFound=0,start=0,docs=[]},9={numFound=6,start=0,docs=[SolrDocument{id=14}, SolrDocument{id=16}, SolrDocument{id=18}, SolrDocument{id=21}, SolrDocument{id=23}, SolrDocument{id=7}]}}}
[junit4:junit4]   2> 4039 T251 C12 oashc.MoreLikeThisComponent.handleResponses MLT Query returned: {responseHeader={status=0,QTime=7},response={numFound=6,start=0,maxScore=0.58267975,docs=[SolrDocument{id=13, score=0.58267975}, SolrDocument{id=19, score=0.58267975}, SolrDocument{id=20, score=0.58267975}, SolrDocument{id=22, score=0.58267975}, SolrDocument{id=24, score=0.58267975}, SolrDocument{id=17, score=0.4661438}]},moreLikeThis={13={numFound=6,start=0,docs=[SolrDocument{id=15}, SolrDocument{id=19}, SolrDocument{id=20}, SolrDocument{id=22}, SolrDocument{id=24}, SolrDocument{id=17}]},19={numFound=6,start=0,docs=[SolrDocument{id=13}, SolrDocument{id=15}, SolrDocument{id=20}, SolrDocument{id=22}, SolrDocument{id=24}, SolrDocument{id=17}]},20={numFound=6,start=0,docs=[SolrDocument{id=13}, SolrDocument{id=15}, SolrDocument{id=19}, SolrDocument{id=22}, SolrDocument{id=24}, SolrDocument{id=17}]},22={numFound=6,start=0,docs=[SolrDocument{id=13}, SolrDocument{id=15}, SolrDocument{id=19}, SolrDocument{id=20}, SolrDocument{id=24}, SolrDocument{id=17}]},24={numFound=6,start=0,docs=[SolrDocument{id=13}, SolrDocument{id=15}, SolrDocument{id=19}, SolrDocument{id=20}, SolrDocument{id=22}, SolrDocument{id=17}]},17={numFound=6,start=0,docs=[SolrDocument{id=13}, SolrDocument{id=15}, SolrDocument{id=19}, SolrDocument{id=20}, SolrDocument{id=22}, SolrDocument{id=24}]}}}
[junit4:junit4]   2> 4040 T251 C12 oashc.MoreLikeThisComponent.handleResponses MLT Query returned: {responseHeader={status=0,QTime=12},response={numFound=7,start=0,maxScore=0.6565079,docs=[SolrDocument{id=14, score=0.6565079}, SolrDocument{id=16, score=0.6565079}, SolrDocument{id=18, score=0.6565079}, SolrDocument{id=21, score=0.6565079}, SolrDocument{id=23, score=0.6565079}, SolrDocument{id=7, score=0.5570654}, SolrDocument{id=9, score=0.5252063}]},moreLikeThis={14={numFound=6,start=0,docs=[SolrDocument{id=16}, SolrDocument{id=18}, SolrDocument{id=21}, SolrDocument{id=23}, SolrDocument{id=7}, SolrDocument{id=9}]},16={numFound=6,start=0,docs=[SolrDocument{id=14}, SolrDocument{id=18}, SolrDocument{id=21}, SolrDocument{id=23}, SolrDocument{id=7}, SolrDocument{id=9}]},18={numFound=6,start=0,docs=[SolrDocument{id=14}, SolrDocument{id=16}, SolrDocument{id=21}, SolrDocument{id=23}, SolrDocument{id=7}, SolrDocument{id=9}]},21={numFound=6,start=0,docs=[SolrDocument{id=14}, SolrDocument{id=16}, SolrDocument{id=18}, SolrDocument{id=23}, SolrDocument{id=7}, SolrDocument{id=9}]},23={numFound=6,start=0,docs=[SolrDocument{id=14}, SolrDocument{id=16}, SolrDocument{id=18}, SolrDocument{id=21}, SolrDocument{id=7}, SolrDocument{id=9}]},7={numFound=0,start=0,docs=[]},9={numFound=6,start=0,docs=[SolrDocument{id=14}, SolrDocument{id=16}, SolrDocument{id=18}, SolrDocument{id=21}, SolrDocument{id=23}, SolrDocument{id=7}]}}}
[junit4:junit4]   2> 4041 T251 C12 oashc.MoreLikeThisComponent.handleResponses MLT Query returned: {responseHeader={status=0,QTime=27},response={numFound=6,start=0,maxScore=0.58267975,docs=[SolrDocument{id=13, score=0.58267975}, SolrDocument{id=15, score=0.58267975}, SolrDocument{id=19, score=0.58267975}, SolrDocument{id=22, score=0.58267975}, SolrDocument{id=24, score=0.58267975}, SolrDocument{id=17, score=0.4661438}]},moreLikeThis={13={numFound=6,start=0,docs=[SolrDocument{id=15}, SolrDocument{id=19}, SolrDocument{id=20}, SolrDocument{id=22}, SolrDocument{id=24}, SolrDocument{id=17}]},15={numFound=6,start=0,docs=[SolrDocument{id=13}, SolrDocument{id=19}, SolrDocument{id=20}, SolrDocument{id=22}, SolrDocument{id=24}, SolrDocument{id=17}]},19={numFound=6,start=0,docs=[SolrDocument{id=13}, SolrDocument{id=15}, SolrDocument{id=20}, SolrDocument{id=22}, SolrDocument{id=24}, SolrDocument{id=17}]},22={numFound=6,start=0,docs=[SolrDocument{id=13}, SolrDocument{id=15}, SolrDocument{id=19}, SolrDocument{id=20}, SolrDocument{id=24}, SolrDocument{id=17}]},24={numFound=6,start=0,docs=[SolrDocument{id=13}, SolrDocument{id=15}, SolrDocument{id=19}, SolrDocument{id=20}, SolrDocument{id=22}, SolrDocument{id=17}]},17={numFound=6,start=0,docs=[SolrDocument{id=13}, SolrDocument{id=15}, SolrDocument{id=19}, SolrDocument{id=20}, SolrDocument{id=22}, SolrDocument{id=24}]}}}
[junit4:junit4]   2> 4042 T251 C12 oashc.MoreLikeThisComponent.handleResponses MLT Query returned: {responseHeader={status=0,QTime=11},response={numFound=7,start=0,maxScore=0.6565079,docs=[SolrDocument{id=14, score=0.6565079}, SolrDocument{id=16, score=0.6565079}, SolrDocument{id=18, score=0.6565079}, SolrDocument{id=21, score=0.6565079}, SolrDocument{id=23, score=0.6565079}, SolrDocument{id=7, score=0.5570654}, SolrDocument{id=9, score=0.5252063}]},moreLikeThis={14={numFound=6,start=0,docs=[SolrDocument{id=16}, SolrDocument{id=18}, SolrDocument{id=21}, SolrDocument{id=23}, SolrDocument{id=7}, SolrDocument{id=9}]},16={numFound=6,start=0,docs=[SolrDocument{id=14}, SolrDocument{id=18}, SolrDocument{id=21}, SolrDocument{id=23}, SolrDocument{id=7}, SolrDocument{id=9}]},18={numFound=6,start=0,docs=[SolrDocument{id=14}, SolrDocument{id=16}, SolrDocument{id=21}, SolrDocument{id=23}, SolrDocument{id=7}, SolrDocument{id=9}]},21={numFound=6,start=0,docs=[SolrDocument{id=14}, SolrDocument{id=16}, SolrDocument{id=18}, SolrDocument{id=23}, SolrDocument{id=7}, SolrDocument{id=9}]},23={numFound=6,start=0,docs=[SolrDocument{id=14}, SolrDocument{id=16}, SolrDocument{id=18}, SolrDocument{id=21}, SolrDocument{id=7}, SolrDocument{id=9}]},7={numFound=0,start=0,docs=[]},9={numFound=6,start=0,docs=[SolrDocument{id=14}, SolrDocument{id=16}, SolrDocument{id=18}, SolrDocument{id=21}, SolrDocument{id=23}, SolrDocument{id=7}]}}}
[junit4:junit4]   2> 4043 T251 C12 oashc.MoreLikeThisComponent.handleResponses MLT Query returned: {responseHeader={status=0,QTime=9},response={numFound=6,start=0,maxScore=0.6565079,docs=[SolrDocument{id=16, score=0.6565079}, SolrDocument{id=18, score=0.6565079}, SolrDocument{id=21, score=0.6565079}, SolrDocument{id=23, score=0.6565079}, SolrDocument{id=7, score=0.5570654}, SolrDocument{id=9, score=0.5252063}]},moreLikeThis={16={numFound=6,start=0,docs=[SolrDocument{id=14}, SolrDocument{id=18}, SolrDocument{id=21}, SolrDocument{id=23}, SolrDocument{id=7}, SolrDocument{id=9}]},18={numFound=6,start=0,docs=[SolrDocument{id=14}, SolrDocument{id=16}, SolrDocument{id=21}, SolrDocument{id=23}, SolrDocument{id=7}, SolrDocument{id=9}]},21={numFound=6,start=0,docs=[SolrDocument{id=14}, SolrDocument{id=16}, SolrDocument{id=18}, SolrDocument{id=23}, SolrDocument{id=7}, SolrDocument{id=9}]},23={numFound=6,start=0,docs=[SolrDocument{id=14}, SolrDocument{id=16}, SolrDocument{id=18}, SolrDocument{id=21}, SolrDocument{id=7}, SolrDocument{id=9}]},7={numFound=0,start=0,docs=[]},9={numFound=6,start=0,docs=[SolrDocument{id=14}, SolrDocument{id=16}, SolrDocument{id=18}, SolrDocument{id=21}, SolrDocument{id=23}, SolrDocument{id=7}]}}}
[junit4:junit4]   2> 4044 T251 C12 oashc.MoreLikeThisComponent.handleResponses MLT Query returned: {responseHeader={status=0,QTime=40},response={numFound=7,start=0,maxScore=0.58267975,docs=[SolrDocument{id=13, score=0.58267975}, SolrDocument{id=15, score=0.58267975}, SolrDocument{id=19, score=0.58267975}, SolrDocument{id=20, score=0.58267975}, SolrDocument{id=22, score=0.58267975}, SolrDocument{id=24, score=0.58267975}, SolrDocument{id=17, score=0.4661438}]},moreLikeThis={13={numFound=6,start=0,docs=[SolrDocument{id=15}, SolrDocument{id=19}, SolrDocument{id=20}, SolrDocument{id=22}, SolrDocument{id=24}, SolrDocument{id=17}]},15={numFound=6,start=0,docs=[SolrDocument{id=13}, SolrDocument{id=19}, SolrDocument{id=20}, SolrDocument{id=22}, SolrDocument{id=24}, SolrDocument{id=17}]},19={numFound=6,start=0,docs=[SolrDocument{id=13}, SolrDocument{id=15}, SolrDocument{id=20}, SolrDocument{id=22}, SolrDocument{id=24}, SolrDocument{id=17}]},20={numFound=6,start=0,docs=[SolrDocument{id=13}, SolrDocument{id=15}, SolrDocument{id=19}, SolrDocument{id=22}, SolrDocument{id=24}, SolrDocument{id=17}]},22={numFound=6,start=0,docs=[SolrDocument{id=13}, SolrDocument{id=15}, SolrDocument{id=19}, SolrDocument{id=20}, SolrDocument{id=24}, SolrDocument{id=17}]},24={numFound=6,start=0,docs=[SolrDocument{id=13}, SolrDocument{id=15}, SolrDocument{id=19}, SolrDocument{id=20}, SolrDocument{id=22}, SolrDocument{id=17}]},17={numFound=6,start=0,docs=[SolrDocument{id=13}, SolrDocument{id=15}, SolrDocument{id=19}, SolrDocument{id=20}, SolrDocument{id=22}, SolrDocument{id=24}]}}}
[junit4:junit4]   2> 34008 T251 C12 oasc.SolrException.log SEVERE org.apache.solr.common.SolrException: org.apache.solr.client.solrj.SolrServerException: No live SolrServers available to handle this request:[http://[ff01::083]:33332, http://[ff01::114]:33332, http://[ff01::213]:33332, http://127.0.0.1:10588]
[junit4:junit4]   2> 		at org.apache.solr.handler.component.SearchHandler.handleRequestBody(SearchHandler.java:302)
[junit4:junit4]   2> 		at org.apache.solr.handler.RequestHandlerBase.handleRequest(RequestHandlerBase.java:146)
[junit4:junit4]   2> 		at org.apache.solr.core.SolrCore.execute(SolrCore.java:1819)
[junit4:junit4]   2> 		at org.apache.solr.servlet.SolrDispatchFilter.execute(SolrDispatchFilter.java:458)
[junit4:junit4]   2> 		at org.apache.solr.servlet.SolrDispatchFilter.doFilter(SolrDispatchFilter.java:279)
[junit4:junit4]   2> 		at org.eclipse.jetty.servlet.ServletHandler$CachedChain.doFilter(ServletHandler.java:1307)
[junit4:junit4]   2> 		at org.apache.solr.client.solrj.embedded.JettySolrRunner$DebugFilter.doFilter(JettySolrRunner.java:116)
[junit4:junit4]   2> 		at org.eclipse.jetty.servlet.ServletHandler$CachedChain.doFilter(ServletHandler.java:1307)
[junit4:junit4]   2> 		at org.eclipse.jetty.servlet.ServletHandler.doHandle(ServletHandler.java:453)
[junit4:junit4]   2> 		at org.eclipse.jetty.server.session.SessionHandler.doHandle(SessionHandler.java:229)
[junit4:junit4]   2> 		at org.eclipse.jetty.server.handler.ScopedHandler.handle(ScopedHandler.java:137)
[junit4:junit4]   2> 		at org.eclipse.jetty.server.handler.GzipHandler.handle(GzipHandler.java:275)
[junit4:junit4]   2> 		at org.eclipse.jetty.server.handler.ContextHandler.doHandle(ContextHandler.java:1074)
[junit4:junit4]   2> 		at org.eclipse.jetty.servlet.ServletHandler.doScope(ServletHandler.java:382)
[junit4:junit4]   2> 		at org.eclipse.jetty.server.session.SessionHandler.doScope(SessionHandler.java:193)
[junit4:junit4]   2> 		at org.eclipse.jetty.server.handler.ContextHandler.doScope(ContextHandler.java:1006)
[junit4:junit4]   2> 		at org.eclipse.jetty.server.handler.ScopedHandler.handle(ScopedHandler.java:135)
[junit4:junit4]   2> 		at org.eclipse.jetty.server.handler.HandlerWrapper.handle(HandlerWrapper.java:116)
[junit4:junit4]   2> 		at org.eclipse.jetty.server.Server.handle(Server.java:365)
[junit4:junit4]   2> 		at org.eclipse.jetty.server.AbstractHttpConnection.handleRequest(AbstractHttpConnection.java:485)
[junit4:junit4]   2> 		at org.eclipse.jetty.server.BlockingHttpConnection.handleRequest(BlockingHttpConnection.java:53)
[junit4:junit4]   2> 		at org.eclipse.jetty.server.AbstractHttpConnection.headerComplete(AbstractHttpConnection.java:926)
[junit4:junit4]   2> 		at org.eclipse.jetty.server.AbstractHttpConnection$RequestHandler.headerComplete(AbstractHttpConnection.java:988)
[junit4:junit4]   2> 		at org.eclipse.jetty.http.HttpParser.parseNext(HttpParser.java:635)
[junit4:junit4]   2> 		at org.eclipse.jetty.http.HttpParser.parseAvailable(HttpParser.java:235)
[junit4:junit4]   2> 		at org.eclipse.jetty.server.BlockingHttpConnection.handle(BlockingHttpConnection.java:72)
[junit4:junit4]   2> 		at org.eclipse.jetty.server.bio.SocketConnector$ConnectorEndPoint.run(SocketConnector.java:264)
[junit4:junit4]   2> 		at org.eclipse.jetty.util.thread.QueuedThreadPool.runJob(QueuedThreadPool.java:608)
[junit4:junit4]   2> 		at org.eclipse.jetty.util.thread.QueuedThreadPool$3.run(QueuedThreadPool.java:543)
[junit4:junit4]   2> 		at java.lang.Thread.run(Thread.java:722)
[junit4:junit4]   2> 	Caused by: org.apache.solr.client.solrj.SolrServerException: No live SolrServers available to handle this request:[http://[ff01::083]:33332, http://[ff01::114]:33332, http://[ff01::213]:33332, http://127.0.0.1:10588]
[junit4:junit4]   2> 		at org.apache.solr.client.solrj.impl.LBHttpSolrServer.request(LBHttpSolrServer.java:325)
[junit4:junit4]   2> 		at org.apache.solr.handler.component.HttpShardHandler$1.call(HttpShardHandler.java:171)
[junit4:junit4]   2> 		at org.apache.solr.handler.component.HttpShardHandler$1.call(HttpShardHandler.java:135)
[junit4:junit4]   2> 		at java.util.concurrent.FutureTask$Sync.innerRun(FutureTask.java:334)
[junit4:junit4]   2> 		at java.util.concurrent.FutureTask.run(FutureTask.java:166)
[junit4:junit4]   2> 		at java.util.concurrent.Executors$RunnableAdapter.call(Executors.java:471)
[junit4:junit4]   2> 		at java.util.concurrent.FutureTask$Sync.innerRun(FutureTask.java:334)
[junit4:junit4]   2> 		at java.util.concurrent.FutureTask.run(FutureTask.java:166)
[junit4:junit4]   2> 		at java.util.concurrent.ThreadPoolExecutor.runWorker(ThreadPoolExecutor.java:1110)
[junit4:junit4]   2> 		at java.util.concurrent.ThreadPoolExecutor$Worker.run(ThreadPoolExecutor.java:603)
[junit4:junit4]   2> 		... 1 more
[junit4:junit4]   2> 	Caused by: org.apache.solr.client.solrj.SolrServerException: IOException occured when talking to server at: http://[ff01::114]:33332
[junit4:junit4]   2> 		at org.apache.solr.client.solrj.impl.HttpSolrServer.request(HttpSolrServer.java:413)
[junit4:junit4]   2> 		at org.apache.solr.client.solrj.impl.HttpSolrServer.request(HttpSolrServer.java:181)
[junit4:junit4]   2> 		at org.apache.solr.client.solrj.impl.LBHttpSolrServer.request(LBHttpSolrServer.java:290)
[junit4:junit4]   2> 		... 10 more
[junit4:junit4]   2> 	Caused by: java.net.SocketException: Protocol family unavailable
[junit4:junit4]   2> 		at java.net.PlainSocketImpl.socketConnect(Native Method)
[junit4:junit4]   2> 		at java.net.AbstractPlainSocketImpl.doConnect(AbstractPlainSocketImpl.java:339)
[junit4:junit4]   2> 		at java.net.AbstractPlainSocketImpl.connectToAddress(AbstractPlainSocketImpl.java:200)
[junit4:junit4]   2> 		at java.net.AbstractPlainSocketImpl.connect(AbstractPlainSocketImpl.java:182)
[junit4:junit4]   2> 		at java.net.SocksSocketImpl.connect(SocksSocketImpl.java:391)
[junit4:junit4]   2> 		at java.net.Socket.connect(Socket.java:579)
[junit4:junit4]   2> 		at org.apache.http.conn.scheme.PlainSocketFactory.connectSocket(PlainSocketFactory.java:123)
[junit4:junit4]   2> 		at org.apache.http.impl.conn.DefaultClientConnectionOperator.openConnection(DefaultClientConnectionOperator.java:148)
[junit4:junit4]   2> 		at org.apache.http.impl.conn.AbstractPoolEntry.open(AbstractPoolEntry.java:150)
[junit4:junit4]   2> 		at org.apache.http.impl.conn.AbstractPooledConnAdapter.open(AbstractPooledConnAdapter.java:121)
[junit4:junit4]   2> 		at org.apache.http.impl.client.DefaultRequestDirector.tryConnect(DefaultRequestDirector.java:575)
[junit4:junit4]   2> 		at org.apache.http.impl.client.DefaultRequestDirector.execute(DefaultRequestDirector.java:425)
[junit4:junit4]   2> 		at org.apache.http.impl.client.AbstractHttpClient.execute(AbstractHttpClient.java:820)
[junit4:junit4]   2> 		at org.apache.http.impl.client.AbstractHttpClient.execute(AbstractHttpClient.java:754)
[junit4:junit4]   2> 		at org.apache.http.impl.client.AbstractHttpClient.execute(AbstractHttpClient.java:732)
[junit4:junit4]   2> 		at org.apache.solr.client.solrj.impl.HttpSolrServer.request(HttpSolrServer.java:352)
[junit4:junit4]   2> 		... 12 more
[junit4:junit4]   2> 	
[junit4:junit4]   2> 34010 T251 C12 REQ [collection1] webapp= path=/select params={fl=id&sort=id+desc&mlt.fl=lowerfilt&shards=[ff01::083]:33332/|[ff01::114]:33332/|127.0.0.1:10588/,[ff01::083]:33332/|127.0.0.1:10589/|[ff01::114]:33332/|[ff01::213]:33332/&shards.qt=mltrh&q=lowerfilt:fox&mlt=true&qt=mltrh&wt=javabin&version=2} hits=13 status=500 QTime=30036 
[junit4:junit4]   2> 34012 T251 C12 oasc.SolrException.log SEVERE null:org.apache.solr.common.SolrException: org.apache.solr.client.solrj.SolrServerException: No live SolrServers available to handle this request:[http://[ff01::083]:33332, http://[ff01::114]:33332, http://[ff01::213]:33332, http://127.0.0.1:10588]
[junit4:junit4]   2> 		at org.apache.solr.handler.component.SearchHandler.handleRequestBody(SearchHandler.java:302)
[junit4:junit4]   2> 		at org.apache.solr.handler.RequestHandlerBase.handleRequest(RequestHandlerBase.java:146)
[junit4:junit4]   2> 		at org.apache.solr.core.SolrCore.execute(SolrCore.java:1819)
[junit4:junit4]   2> 		at org.apache.solr.servlet.SolrDispatchFilter.execute(SolrDispatchFilter.java:458)
[junit4:junit4]   2> 		at org.apache.solr.servlet.SolrDispatchFilter.doFilter(SolrDispatchFilter.java:279)
[junit4:junit4]   2> 		at org.eclipse.jetty.servlet.ServletHandler$CachedChain.doFilter(ServletHandler.java:1307)
[junit4:junit4]   2> 		at org.apache.solr.client.solrj.embedded.JettySolrRunner$DebugFilter.doFilter(JettySolrRunner.java:116)
[junit4:junit4]   2> 		at org.eclipse.jetty.servlet.ServletHandler$CachedChain.doFilter(ServletHandler.java:1307)
[junit4:junit4]   2> 		at org.eclipse.jetty.servlet.ServletHandler.doHandle(ServletHandler.java:453)
[junit4:junit4]   2> 		at org.eclipse.jetty.server.session.SessionHandler.doHandle(SessionHandler.java:229)
[junit4:junit4]   2> 		at org.eclipse.jetty.server.handler.ScopedHandler.handle(ScopedHandler.java:137)
[junit4:junit4]   2> 		at org.eclipse.jetty.server.handler.GzipHandler.handle(GzipHandler.java:275)
[junit4:junit4]   2> 		at org.eclipse.jetty.server.handler.ContextHandler.doHandle(ContextHandler.java:1074)
[junit4:junit4]   2> 		at org.eclipse.jetty.servlet.ServletHandler.doScope(ServletHandler.java:382)
[junit4:junit4]   2> 		at org.eclipse.jetty.server.session.SessionHandler.doScope(SessionHandler.java:193)
[junit4:junit4]   2> 		at org.eclipse.jetty.server.handler.ContextHandler.doScope(ContextHandler.java:1006)
[junit4:junit4]   2> 		at org.eclipse.jetty.server.handler.ScopedHandler.handle(ScopedHandler.java:135)
[junit4:junit4]   2> 		at org.eclipse.jetty.server.handler.HandlerWrapper.handle(HandlerWrapper.java:116)
[junit4:junit4]   2> 		at org.eclipse.jetty.server.Server.handle(Server.java:365)
[junit4:junit4]   2> 		at org.eclipse.jetty.server.AbstractHttpConnection.handleRequest(AbstractHttpConnection.java:485)
[junit4:junit4]   2> 		at org.eclipse.jetty.server.BlockingHttpConnection.handleRequest(BlockingHttpConnection.java:53)
[junit4:junit4]   2> 		at org.eclipse.jetty.server.AbstractHttpConnection.headerComplete(AbstractHttpConnection.java:926)
[junit4:junit4]   2> 		at org.eclipse.jetty.server.AbstractHttpConnection$RequestHandler.headerComplete(AbstractHttpConnection.java:988)
[junit4:junit4]   2> 		at org.eclipse.jetty.http.HttpParser.parseNext(HttpParser.java:635)
[junit4:junit4]   2> 		at org.eclipse.jetty.http.HttpParser.parseAvailable(HttpParser.java:235)
[junit4:junit4]   2> 		at org.eclipse.jetty.server.BlockingHttpConnection.handle(BlockingHttpConnection.java:72)
[junit4:junit4]   2> 		at org.eclipse.jetty.server.bio.SocketConnector$ConnectorEndPoint.run(SocketConnector.java:264)
[junit4:junit4]   2> 		at org.eclipse.jetty.util.thread.QueuedThreadPool.runJob(QueuedThreadPool.java:608)
[junit4:junit4]   2> 		at org.eclipse.jetty.util.thread.QueuedThreadPool$3.run(QueuedThreadPool.java:543)
[junit4:junit4]   2> 		at java.lang.Thread.run(Thread.java:722)
[junit4:junit4]   2> 	Caused by: org.apache.solr.client.solrj.SolrServerException: No live SolrServers available to handle this request:[http://[ff01::083]:33332, http://[ff01::114]:33332, http://[ff01::213]:33332, http://127.0.0.1:10588]
[junit4:junit4]   2> 		at org.apache.solr.client.solrj.impl.LBHttpSolrServer.request(LBHttpSolrServer.java:325)
[junit4:junit4]   2> 		at org.apache.solr.handler.component.HttpShardHandler$1.call(HttpShardHandler.java:171)
[junit4:junit4]   2> 		at org.apache.solr.handler.component.HttpShardHandler$1.call(HttpShardHandler.java:135)
[junit4:junit4]   2> 		at java.util.concurrent.FutureTask$Sync.innerRun(FutureTask.java:334)
[junit4:junit4]   2> 		at java.util.concurrent.FutureTask.run(FutureTask.java:166)
[junit4:junit4]   2> 		at java.util.concurrent.Executors$RunnableAdapter.call(Executors.java:471)
[junit4:junit4]   2> 		at java.util.concurrent.FutureTask$Sync.innerRun(FutureTask.java:334)
[junit4:junit4]   2> 		at java.util.concurrent.FutureTask.run(FutureTask.java:166)
[junit4:junit4]   2> 		at java.util.concurrent.ThreadPoolExecutor.runWorker(ThreadPoolExecutor.java:1110)
[junit4:junit4]   2> 		at java.util.concurrent.ThreadPoolExecutor$Worker.run(ThreadPoolExecutor.java:603)
[junit4:junit4]   2> 		... 1 more
[junit4:junit4]   2> 	Caused by: org.apache.solr.client.solrj.SolrServerException: IOException occured when talking to server at: http://[ff01::114]:33332
[junit4:junit4]   2> 		at org.apache.solr.client.solrj.impl.HttpSolrServer.request(HttpSolrServer.java:413)
[junit4:junit4]   2> 		at org.apache.solr.client.solrj.impl.HttpSolrServer.request(HttpSolrServer.java:181)
[junit4:junit4]   2> 		at org.apache.solr.client.solrj.impl.LBHttpSolrServer.request(LBHttpSolrServer.java:290)
[junit4:junit4]   2> 		... 10 more
[junit4:junit4]   2> 	Caused by: java.net.SocketException: Protocol family unavailable
[junit4:junit4]   2> 		at java.net.PlainSocketImpl.socketConnect(Native Method)
[junit4:junit4]   2> 		at java.net.AbstractPlainSocketImpl.doConnect(AbstractPlainSocketImpl.java:339)
[junit4:junit4]   2> 		at java.net.AbstractPlainSocketImpl.connectToAddress(AbstractPlainSocketImpl.java:200)
[junit4:junit4]   2> 		at java.net.AbstractPlainSocketImpl.connect(AbstractPlainSocketImpl.java:182)
[junit4:junit4]   2> 		at java.net.SocksSocketImpl.connect(SocksSocketImpl.java:391)
[junit4:junit4]   2> 		at java.net.Socket.connect(Socket.java:579)
[junit4:junit4]   2> 		at org.apache.http.conn.scheme.PlainSocketFactory.connectSocket(PlainSocketFactory.java:123)
[junit4:junit4]   2> 		at org.apache.http.impl.conn.DefaultClientConnectionOperator.openConnection(DefaultClientConnectionOperator.java:148)
[junit4:junit4]   2> 		at org.apache.http.impl.conn.AbstractPoolEntry.open(AbstractPoolEntry.java:150)
[junit4:junit4]   2> 		at org.apache.http.impl.conn.AbstractPooledConnAdapter.open(AbstractPooledConnAdapter.java:121)
[junit4:junit4]   2> 		at org.apache.http.impl.client.DefaultRequestDirector.tryConnect(DefaultRequestDirector.java:575)
[junit4:junit4]   2> 		at org.apache.http.impl.client.DefaultRequestDirector.execute(DefaultRequestDirector.java:425)
[junit4:junit4]   2> 		at org.apache.http.impl.client.AbstractHttpClient.execute(AbstractHttpClient.java:820)
[junit4:junit4]   2> 		at org.apache.http.impl.client.AbstractHttpClient.execute(AbstractHttpClient.java:754)
[junit4:junit4]   2> 		at org.apache.http.impl.client.AbstractHttpClient.execute(AbstractHttpClient.java:732)
[junit4:junit4]   2> 		at org.apache.solr.client.solrj.impl.HttpSolrServer.request(HttpSolrServer.java:352)
[junit4:junit4]   2> 		... 12 more
[junit4:junit4]   2> 	
[junit4:junit4]   2> 34014 T226 oasc.CoreContainer.shutdown Shutting down CoreContainer instance=1664420707
[junit4:junit4]   2> 34015 T226 oasc.SolrCore.close [collection1]  CLOSING SolrCore org.apache.solr.core.SolrCore@5ddaee61
[junit4:junit4]   2> 34033 T226 oasu.DirectUpdateHandler2.close closing DirectUpdateHandler2{commits=1,autocommits=0,soft autocommits=0,optimizes=0,rollbacks=0,expungeDeletes=0,docsPending=0,adds=0,deletesById=0,deletesByQuery=0,errors=0,cumulative_adds=24,cumulative_deletesById=0,cumulative_deletesByQuery=1,cumulative_errors=0}
[junit4:junit4]   2> 34034 T226 oasc.SolrCore.decrefSolrCoreState Closing SolrCoreState
[junit4:junit4]   2> 34034 T226 oasu.DefaultSolrCoreState.closeIndexWriter SolrCoreState ref count has reached 0 - closing IndexWriter
[junit4:junit4]   2> 34035 T226 oasu.DefaultSolrCoreState.closeIndexWriter closing IndexWriter with IndexWriterCloser
[junit4:junit4]   2> 34036 T226 C10 oasc.CachingDirectoryFactory.close Releasing directory:/usr/home/hudson/hudson-slave/workspace/Lucene-Solr-Tests-trunk-java7/solr/build/solr-core/test/J0/./org.apache.solr.handler.component.DistributedMLTComponentTest-1355938373313/control/data/index
[junit4:junit4]   2> 34037 T226 oasc.SolrCore.closeSearcher [collection1] Closing main searcher on request.
[junit4:junit4]   2> 34038 T226 oasc.CachingDirectoryFactory.close Releasing directory:/usr/home/hudson/hudson-slave/workspace/Lucene-Solr-Tests-trunk-java7/solr/build/solr-core/test/J0/./org.apache.solr.handler.component.DistributedMLTComponentTest-1355938373313/control/data/index
[junit4:junit4]   2> 34038 T226 oasc.CachingDirectoryFactory.close Closing directory when closing factory:/usr/home/hudson/hudson-slave/workspace/Lucene-Solr-Tests-trunk-java7/solr/build/solr-core/test/J0/./org.apache.solr.handler.component.DistributedMLTComponentTest-1355938373313/control/data
[junit4:junit4]   2> 34039 T226 oasc.CachingDirectoryFactory.closeDirectory Closing directory:/usr/home/hudson/hudson-slave/workspace/Lucene-Solr-Tests-trunk-java7/solr/build/solr-core/test/J0/./org.apache.solr.handler.component.DistributedMLTComponentTest-1355938373313/control/data
[junit4:junit4]   2> 34039 T226 oasc.CachingDirectoryFactory.close Closing directory when closing factory:/usr/home/hudson/hudson-slave/workspace/Lucene-Solr-Tests-trunk-java7/solr/build/solr-core/test/J0/./org.apache.solr.handler.component.DistributedMLTComponentTest-1355938373313/control/data/index
[junit4:junit4]   2> 34039 T226 oasc.CachingDirectoryFactory.closeDirectory Closing directory:/usr/home/hudson/hudson-slave/workspace/Lucene-Solr-Tests-trunk-java7/solr/build/solr-core/test/J0/./org.apache.solr.handler.component.DistributedMLTComponentTest-1355938373313/control/data/index
[junit4:junit4]   2> 34040 T226 oejsh.ContextHandler.doStop stopped o.e.j.s.ServletContextHandler{/,null}
[junit4:junit4]   2> 34092 T226 oasc.CoreContainer.shutdown Shutting down CoreContainer instance=1727801177
[junit4:junit4]   2> 34093 T226 oasc.SolrCore.close [collection1]  CLOSING SolrCore org.apache.solr.core.SolrCore@4a7437e4
[junit4:junit4]   2> 34101 T226 oasu.DirectUpdateHandler2.close closing DirectUpdateHandler2{commits=1,autocommits=0,soft autocommits=0,optimizes=0,rollbacks=0,expungeDeletes=0,docsPending=0,adds=0,deletesById=0,deletesByQuery=0,errors=0,cumulative_adds=11,cumulative_deletesById=0,cumulative_deletesByQuery=1,cumulative_errors=0}
[junit4:junit4]   2> 34101 T226 oasc.SolrCore.decrefSolrCoreState Closing SolrCoreState
[junit4:junit4]   2> 34102 T226 oasu.DefaultSolrCoreState.closeIndexWriter SolrCoreState ref count has reached 0 - closing IndexWriter
[junit4:junit4]   2> 34102 T226 oasu.DefaultSolrCoreState.closeIndexWriter closing IndexWriter with IndexWriterCloser
[junit4:junit4]   2> 34104 T226 C11 oasc.CachingDirectoryFactory.close Releasing directory:/usr/home/hudson/hudson-slave/workspace/Lucene-Solr-Tests-trunk-java7/solr/build/solr-core/test/J0/./org.apache.solr.handler.component.DistributedMLTComponentTest-1355938373313/shard0/data/index
[junit4:junit4]   2> 34104 T226 oasc.SolrCore.closeSearcher [collection1] Closing main searcher on request.
[junit4:junit4]   2> 34105 T226 oasc.CachingDirectoryFactory.close Releasing directory:/usr/home/hudson/hudson-slave/workspace/Lucene-Solr-Tests-trunk-java7/solr/build/solr-core/test/J0/./org.apache.solr.handler.component.DistributedMLTComponentTest-1355938373313/shard0/data/index
[junit4:junit4]   2> 34105 T226 oasc.CachingDirectoryFactory.close Closing directory when closing factory:/usr/home/hudson/hudson-slave/workspace/Lucene-Solr-Tests-trunk-java7/solr/build/solr-core/test/J0/./org.apache.solr.handler.component.DistributedMLTComponentTest-1355938373313/shard0/data/index
[junit4:junit4]   2> 34106 T226 oasc.CachingDirectoryFactory.closeDirectory Closing directory:/usr/home/hudson/hudson-slave/workspace/Lucene-Solr-Tests-trunk-java7/solr/build/solr-core/test/J0/./org.apache.solr.handler.component.DistributedMLTComponentTest-1355938373313/shard0/data/index
[junit4:junit4]   2> 34106 T226 oasc.CachingDirectoryFactory.close Closing directory when closing factory:/usr/home/hudson/hudson-slave/workspace/Lucene-Solr-Tests-trunk-java7/solr/build/solr-core/test/J0/./org.apache.solr.handler.component.DistributedMLTComponentTest-1355938373313/shard0/data
[junit4:junit4]   2> 34107 T226 oasc.CachingDirectoryFactory.closeDirectory Closing directory:/usr/home/hudson/hudson-slave/workspace/Lucene-Solr-Tests-trunk-java7/solr/build/solr-core/test/J0/./org.apache.solr.handler.component.DistributedMLTComponentTest-1355938373313/shard0/data
[junit4:junit4]   2> 34107 T226 oejsh.ContextHandler.doStop stopped o.e.j.s.ServletContextHandler{/,null}
[junit4:junit4]   2> 34160 T226 oasc.CoreContainer.shutdown Shutting down CoreContainer instance=2030810868
[junit4:junit4]   2> 34161 T226 oasc.SolrCore.close [collection1]  CLOSING SolrCore org.apache.solr.core.SolrCore@4ddb1499
[junit4:junit4]   2> 34173 T226 oasu.DirectUpdateHandler2.close closing DirectUpdateHandler2{commits=1,autocommits=0,soft autocommits=0,optimizes=0,rollbacks=0,expungeDeletes=0,docsPending=0,adds=0,deletesById=0,deletesByQuery=0,errors=0,cumulative_adds=13,cumulative_deletesById=0,cumulative_deletesByQuery=1,cumulative_errors=0}
[junit4:junit4]   2> 34174 T226 oasc.SolrCore.decrefSolrCoreState Closing SolrCoreState
[junit4:junit4]   2> 34175 T226 oasu.DefaultSolrCoreState.closeIndexWriter SolrCoreState ref count has reached 0 - closing IndexWriter
[junit4:junit4]   2> 34175 T226 oasu.DefaultSolrCoreState.closeIndexWriter closing IndexWriter with IndexWriterCloser
[junit4:junit4]   2> 34177 T226 C12 oasc.CachingDirectoryFactory.close Releasing directory:/usr/home/hudson/hudson-slave/workspace/Lucene-Solr-Tests-trunk-java7/solr/build/solr-core/test/J0/./org.apache.solr.handler.component.DistributedMLTComponentTest-1355938373313/shard1/data/index
[junit4:junit4]   2> 34178 T226 oasc.SolrCore.closeSearcher [collection1] Closing main searcher on request.
[junit4:junit4]   2> 34178 T226 oasc.CachingDirectoryFactory.close Releasing directory:/usr/home/hudson/hudson-slave/workspace/Lucene-Solr-Tests-trunk-java7/solr/build/solr-core/test/J0/./org.apache.solr.handler.component.DistributedMLTComponentTest-1355938373313/shard1/data/index
[junit4:junit4]   2> 34179 T226 oasc.CachingDirectoryFactory.close Closing directory when closing factory:/usr/home/hudson/hudson-slave/workspace/Lucene-Solr-Tests-trunk-java7/solr/build/solr-core/test/J0/./org.apache.solr.handler.component.DistributedMLTComponentTest-1355938373313/shard1/data
[junit4:junit4]   2> 34179 T226 oasc.CachingDirectoryFactory.closeDirectory Closing directory:/usr/home/hudson/hudson-slave/workspace/Lucene-Solr-Tests-trunk-java7/solr/build/solr-core/test/J0/./org.apache.solr.handler.component.DistributedMLTComponentTest-1355938373313/shard1/data
[junit4:junit4]   2> 34179 T226 oasc.CachingDirectoryFactory.close Closing directory when closing factory:/usr/home/hudson/hudson-slave/workspace/Lucene-Solr-Tests-trunk-java7/solr/build/solr-core/test/J0/./org.apache.solr.handler.component.DistributedMLTComponentTest-1355938373313/shard1/data/index
[junit4:junit4]   2> 34180 T226 oasc.CachingDirectoryFactory.closeDirectory Closing directory:/usr/home/hudson/hudson-slave/workspace/Lucene-Solr-Tests-trunk-java7/solr/build/solr-core/test/J0/./org.apache.solr.handler.component.DistributedMLTComponentTest-1355938373313/shard1/data/index
[junit4:junit4]   2> 34181 T226 oejsh.ContextHandler.doStop stopped o.e.j.s.ServletContextHandler{/,null}
[junit4:junit4]   2> 34268 T226 oas.SolrTestCaseJ4.tearDown ###Ending testDistribSearch
[junit4:junit4]   2> NOTE: reproduce with: ant test  -Dtestcase=DistributedMLTComponentTest -Dtests.method=testDistribSearch -Dtests.seed=1E97D968F8B57EAE -Dtests.multiplier=3 -Dtests.slow=true -Dtests.locale=es_ES -Dtests.timezone=Africa/Lagos -Dtests.file.encoding=ISO-8859-1
[junit4:junit4] ERROR   34.4s J0 | DistributedMLTComponentTest.testDistribSearch <<<
[junit4:junit4]    > Throwable #1: org.apache.solr.common.SolrException: Server at http://127.0.0.1:10589 returned non ok status:500, message:Server Error
[junit4:junit4]    > 	at __randomizedtesting.SeedInfo.seed([1E97D968F8B57EAE:9F7157708FEA1E92]:0)
[junit4:junit4]    > 	at org.apache.solr.client.solrj.impl.HttpSolrServer.request(HttpSolrServer.java:372)
[junit4:junit4]    > 	at org.apache.solr.client.solrj.impl.HttpSolrServer.request(HttpSolrServer.java:181)
[junit4:junit4]    > 	at org.apache.solr.client.solrj.request.QueryRequest.process(QueryRequest.java:90)
[junit4:junit4]    > 	at org.apache.solr.client.solrj.SolrServer.query(SolrServer.java:301)
[junit4:junit4]    > 	at org.apache.solr.BaseDistributedSearchTestCase.queryServer(BaseDistributedSearchTestCase.java:470)
[junit4:junit4]    > 	at org.apache.solr.BaseDistributedSearchTestCase.query(BaseDistributedSearchTestCase.java:493)
[junit4:junit4]    > 	at org.apache.solr.BaseDistributedSearchTestCase.query(BaseDistributedSearchTestCase.java:475)
[junit4:junit4]    > 	at org.apache.solr.handler.component.DistributedMLTComponentTest.doTest(DistributedMLTComponentTest.java:119)
[junit4:junit4]    > 	at org.apache.solr.BaseDistributedSearchTestCase.testDistribSearch(BaseDistributedSearchTestCase.java:794)
[junit4:junit4]    > 	at sun.reflect.NativeMethodAccessorImpl.invoke0(Native Method)
[junit4:junit4]    > 	at sun.reflect.NativeMethodAccessorImpl.invoke(NativeMethodAccessorImpl.java:57)
[junit4:junit4]    > 	at sun.reflect.DelegatingMethodAccessorImpl.invoke(DelegatingMethodAccessorImpl.java:43)
[junit4:junit4]    > 	at java.lang.reflect.Method.invoke(Method.java:601)
[junit4:junit4]    > 	at com.carrotsearch.randomizedtesting.RandomizedRunner.invoke(RandomizedRunner.java:1559)
[junit4:junit4]    > 	at com.carrotsearch.randomizedtesting.RandomizedRunner.access$600(RandomizedRunner.java:79)
[junit4:junit4]    > 	at com.carrotsearch.randomizedtesting.RandomizedRunner$6.evaluate(RandomizedRunner.java:737)
[junit4:junit4]    > 	at com.carrotsearch.randomizedtesting.RandomizedRunner$7.evaluate(RandomizedRunner.java:773)
[junit4:junit4]    > 	at com.carrotsearch.randomizedtesting.RandomizedRunner$8.evaluate(RandomizedRunner.java:787)
[junit4:junit4]    > 	at com.carrotsearch.randomizedtesting.rules.SystemPropertiesRestoreRule$1.evaluate(SystemPropertiesRestoreRule.java:53)
[junit4:junit4]    > 	at org.apache.lucene.util.TestRuleSetupTeardownChained$1.evaluate(TestRuleSetupTeardownChained.java:50)
[junit4:junit4]    > 	at org.apache.lucene.util.TestRuleFieldCacheSanity$1.evaluate(TestRuleFieldCacheSanity.java:51)
[junit4:junit4]    > 	at org.apache.lucene.util.AbstractBeforeAfterRule$1.evaluate(AbstractBeforeAfterRule.java:46)
[junit4:junit4]    > 	at com.carrotsearch.randomizedtesting.rules.SystemPropertiesInvariantRule$1.evaluate(SystemPropertiesInvariantRule.java:55)
[junit4:junit4]    > 	at org.apache.lucene.util.TestRuleThreadAndTestName$1.evaluate(TestRuleThreadAndTestName.java:49)
[junit4:junit4]    > 	at org.apache.lucene.util.TestRuleIgnoreAfterMaxFailures$1.evaluate(TestRuleIgnoreAfterMaxFailures.java:70)
[junit4:junit4]    > 	at org.apache.lucene.util.TestRuleMarkFailure$1.evaluate(TestRuleMarkFailure.java:48)
[junit4:junit4]    > 	at com.carrotsearch.randomizedtesting.rules.StatementAdapter.evaluate(StatementAdapter.java:36)
[junit4:junit4]    > 	at com.carrotsearch.randomizedtesting.ThreadLeakControl$StatementRunner.run(ThreadLeakControl.java:358)
[junit4:junit4]    > 	at com.carrotsearch.randomizedtesting.ThreadLeakControl.forkTimeoutingTask(ThreadLeakControl.java:782)
[junit4:junit4]    > 	at com.carrotsearch.randomizedtesting.ThreadLeakControl$3.evaluate(ThreadLeakControl.java:442)
[junit4:junit4]    > 	at com.carrotsearch.randomizedtesting.RandomizedRunner.runSingleTest(RandomizedRunner.java:746)
[junit4:junit4]    > 	at com.carrotsearch.randomizedtesting.RandomizedRunner$3.evaluate(RandomizedRunner.java:648)
[junit4:junit4]    > 	at com.carrotsearch.randomizedtesting.RandomizedRunner$4.evaluate(RandomizedRunner.java:682)
[junit4:junit4]    > 	at com.carrotsearch.randomizedtesting.RandomizedRunner$5.evaluate(RandomizedRunner.java:693)
[junit4:junit4]    > 	at com.carrotsearch.randomizedtesting.rules.StatementAdapter.evaluate(StatementAdapter.java:36)
[junit4:junit4]    > 	at com.carrotsearch.randomizedtesting.rules.SystemPropertiesRestoreRule$1.evaluate(SystemPropertiesRestoreRule.java:53)
[junit4:junit4]    > 	at org.apache.lucene.util.AbstractBeforeAfterRule$1.evaluate(AbstractBeforeAfterRule.java:46)
[junit4:junit4]    > 	at org.apache.lucene.util.TestRuleStoreClassName$1.evaluate(TestRuleStoreClassName.java:42)
[junit4:junit4]    > 	at com.carrotsearch.randomizedtesting.rules.SystemPropertiesInvariantRule$1.evaluate(SystemPropertiesInvariantRule.java:55)
[junit4:junit4]    > 	at com.carrotsearch.randomizedtesting.rules.NoShadowingOrOverridesOnMethodsRule$1.evaluate(NoShadowingOrOverridesOnMethodsRule.java:39)
[junit4:junit4]    > 	at com.carrotsearch.randomizedtesting.rules.NoShadowingOrOverridesOnMethodsRule$1.evaluate(NoShadowingOrOverridesOnMethodsRule.java:39)
[junit4:junit4]    > 	at com.carrotsearch.randomizedtesting.rules.StatementAdapter.evaluate(StatementAdapter.java:36)
[junit4:junit4]    > 	at org.apache.lucene.util.TestRuleAssertionsRequired$1.evaluate(TestRuleAssertionsRequired.java:43)
[junit4:junit4]    > 	at org.apache.lucene.util.TestRuleMarkFailure$1.evaluate(TestRuleMarkFailure.java:48)
[junit4:junit4]    > 	at org.apache.lucene.util.TestRuleIgnoreAfterMaxFailures$1.evaluate(TestRuleIgnoreAfterMaxFailures.java:70)
[junit4:junit4]    > 	at org.apache.lucene.util.TestRuleIgnoreTestSuites$1.evaluate(TestRuleIgnoreTestSuites.java:55)
[junit4:junit4]    > 	at com.carrotsearch.randomizedtesting.rules.StatementAdapter.evaluate(StatementAdapter.java:36)
[junit4:junit4]    > 	at com.carrotsearch.randomizedtesting.ThreadLeakControl$StatementRunner.run(ThreadLeakControl.java:358)
[junit4:junit4]    > 	at java.lang.Thread.run(Thread.java:722)
[junit4:junit4]   2> 34422 T226 oas.SolrTestCaseJ4.deleteCore ###deleteCore
[junit4:junit4]   2> NOTE: test params are: codec=Lucene40, sim=RandomSimilarityProvider(queryNorm=true,coord=crazy): {}, locale=es_ES, timezone=Africa/Lagos
[junit4:junit4]   2> NOTE: FreeBSD 9.0-RELEASE amd64/Oracle Corporation 1.7.0_09 (64-bit)/cpus=16,threads=1,free=23400712,total=124780544
[junit4:junit4]   2> NOTE: All tests run in this JVM: [SolrPluginUtilsTest, CSVRequestHandlerTest, TestIndexSearcher, CopyFieldTest, SolrCmdDistributorTest, TestFastLRUCache, LoggingHandlerTest, TestConfig, DistributedMLTComponentTest]
[junit4:junit4] Completed on J0 in 34.45s, 1 test, 1 error <<< FAILURES!

[...truncated 800 lines...]
[junit4:junit4] Suite: org.apache.solr.cloud.BasicDistributedZkTest
[junit4:junit4]   2> 0 T1260 oas.BaseDistributedSearchTestCase.initHostContext Setting hostContext system property: /
[junit4:junit4]   2> 6 T1260 oas.SolrTestCaseJ4.setUp ###Starting testDistribSearch
[junit4:junit4]   2> Creating dataDir: /usr/home/hudson/hudson-slave/workspace/Lucene-Solr-Tests-trunk-java7/solr/build/solr-core/test/J1/./solrtest-BasicDistributedZkTest-1355938678258
[junit4:junit4]   2> 7 T1260 oasc.ZkTestServer.run STARTING ZK TEST SERVER
[junit4:junit4]   2> 8 T1261 oasc.ZkTestServer$ZKServerMain.runFromConfig Starting server
[junit4:junit4]   2> 11 T1261 oazs.ZooKeeperServer.setTickTime tickTime set to 1000
[junit4:junit4]   2> 11 T1261 oazs.ZooKeeperServer.setMinSessionTimeout minSessionTimeout set to -1
[junit4:junit4]   2> 12 T1261 oazs.ZooKeeperServer.setMaxSessionTimeout maxSessionTimeout set to -1
[junit4:junit4]   2> 12 T1261 oazs.NIOServerCnxnFactory.configure binding to port 0.0.0.0/0.0.0.0:0
[junit4:junit4]   2> 13 T1261 oazsp.FileTxnSnapLog.save Snapshotting: 0x0 to /usr/home/hudson/hudson-slave/workspace/Lucene-Solr-Tests-trunk-java7/solr/build/solr-core/test/J1/./org.apache.solr.cloud.BasicDistributedZkTest-1355938678257/zookeeper/server1/data/version-2/snapshot.0
[junit4:junit4]   2> 109 T1260 oasc.ZkTestServer.run start zk server on port:49998
[junit4:junit4]   2> 109 T1260 oaz.ZooKeeper.<init> Initiating client connection, connectString=127.0.0.1:49998 sessionTimeout=10000 watcher=org.apache.solr.common.cloud.ConnectionManager@3e23a3ac
[junit4:junit4]   2> 110 T1260 oascc.ConnectionManager.waitForConnected Waiting for client to connect to ZooKeeper
[junit4:junit4]   2> 111 T1266 oaz.ClientCnxn$SendThread.logStartConnect Opening socket connection to server localhost/127.0.0.1:49998. Will not attempt to authenticate using SASL (access denied ("javax.security.auth.AuthPermission" "getLoginConfiguration"))
[junit4:junit4]   2> 111 T1266 oaz.ClientCnxn$SendThread.primeConnection Socket connection established to localhost/127.0.0.1:49998, initiating session
[junit4:junit4]   2> 112 T1262 oazs.NIOServerCnxnFactory.run Accepted socket connection from /140.211.11.196:49999
[junit4:junit4]   2> 112 T1262 oazs.ZooKeeperServer.processConnectRequest Client attempting to establish new session at /140.211.11.196:49999
[junit4:junit4]   2> 113 T1264 oazsp.FileTxnLog.append Creating new log file: log.1
[junit4:junit4]   2> 116 T1264 oazs.ZooKeeperServer.finishSessionInit Established session 0x13bb43e45f90000 with negotiated timeout 10000 for client /140.211.11.196:49999
[junit4:junit4]   2> 116 T1266 oaz.ClientCnxn$SendThread.onConnected Session establishment complete on server localhost/127.0.0.1:49998, sessionid = 0x13bb43e45f90000, negotiated timeout = 10000
[junit4:junit4]   2> 117 T1267 oascc.ConnectionManager.process Watcher org.apache.solr.common.cloud.ConnectionManager@3e23a3ac name:ZooKeeperConnection Watcher:127.0.0.1:49998 got event WatchedEvent state:SyncConnected type:None path:null path:null type:None
[junit4:junit4]   2> 117 T1260 oascc.ConnectionManager.waitForConnected Client is connected to ZooKeeper
[junit4:junit4]   2> 118 T1260 oascc.SolrZkClient.makePath makePath: /solr
[junit4:junit4]   2> 145 T1265 oazs.PrepRequestProcessor.pRequest2Txn Processed session termination for sessionid: 0x13bb43e45f90000
[junit4:junit4]   2> 146 T1267 oaz.ClientCnxn$EventThread.run EventThread shut down
[junit4:junit4]   2> 146 T1262 oazs.NIOServerCnxn.closeSock Closed socket connection for client /140.211.11.196:49999 which had sessionid 0x13bb43e45f90000
[junit4:junit4]   2> 146 T1260 oaz.ZooKeeper.close Session: 0x13bb43e45f90000 closed
[junit4:junit4]   2> 147 T1260 oaz.ZooKeeper.<init> Initiating client connection, connectString=127.0.0.1:49998/solr sessionTimeout=10000 watcher=org.apache.solr.common.cloud.ConnectionManager@21252bf4
[junit4:junit4]   2> 148 T1260 oascc.ConnectionManager.waitForConnected Waiting for client to connect to ZooKeeper
[junit4:junit4]   2> 148 T1268 oaz.ClientCnxn$SendThread.logStartConnect Opening socket connection to server localhost/127.0.0.1:49998. Will not attempt to authenticate using SASL (access denied ("javax.security.auth.AuthPermission" "getLoginConfiguration"))
[junit4:junit4]   2> 149 T1268 oaz.ClientCnxn$SendThread.primeConnection Socket connection established to localhost/127.0.0.1:49998, initiating session
[junit4:junit4]   2> 149 T1262 oazs.NIOServerCnxnFactory.run Accepted socket connection from /140.211.11.196:50000
[junit4:junit4]   2> 149 T1262 oazs.ZooKeeperServer.processConnectRequest Client attempting to establish new session at /140.211.11.196:50000
[junit4:junit4]   2> 151 T1264 oazs.ZooKeeperServer.finishSessionInit Established session 0x13bb43e45f90001 with negotiated timeout 10000 for client /140.211.11.196:50000
[junit4:junit4]   2> 151 T1268 oaz.ClientCnxn$SendThread.onConnected Session establishment complete on server localhost/127.0.0.1:49998, sessionid = 0x13bb43e45f90001, negotiated timeout = 10000
[junit4:junit4]   2> 152 T1269 oascc.ConnectionManager.process Watcher org.apache.solr.common.cloud.ConnectionManager@21252bf4 name:ZooKeeperConnection Watcher:127.0.0.1:49998/solr got event WatchedEvent state:SyncConnected type:None path:null path:null type:None
[junit4:junit4]   2> 152 T1260 oascc.ConnectionManager.waitForConnected Client is connected to ZooKeeper
[junit4:junit4]   2> 153 T1260 oascc.SolrZkClient.makePath makePath: /collections/collection1
[junit4:junit4]   2> 215 T1260 oascc.SolrZkClient.makePath makePath: /collections/collection1/shards
[junit4:junit4]   2> 217 T1260 oascc.SolrZkClient.makePath makePath: /collections/control_collection
[junit4:junit4]   2> 277 T1260 oascc.SolrZkClient.makePath makePath: /collections/control_collection/shards
[junit4:junit4]   2> 280 T1260 oasc.AbstractZkTestCase.putConfig put /usr/home/hudson/hudson-slave/workspace/Lucene-Solr-Tests-trunk-java7/solr/build/solr-core/test-files/solr/collection1/conf/solrconfig.xml to /configs/conf1/solrconfig.xml
[junit4:junit4]   2> 281 T1260 oascc.SolrZkClient.makePath makePath: /configs/conf1/solrconfig.xml
[junit4:junit4]   2> 326 T1260 oasc.AbstractZkTestCase.putConfig put /usr/home/hudson/hudson-slave/workspace/Lucene-Solr-Tests-trunk-java7/solr/build/solr-core/test-files/solr/collection1/conf/schema.xml to /configs/conf1/schema.xml
[junit4:junit4]   2> 327 T1260 oascc.SolrZkClient.makePath makePath: /configs/conf1/schema.xml
[junit4:junit4]   2> 430 T1260 oasc.AbstractZkTestCase.putConfig put /usr/home/hudson/hudson-slave/workspace/Lucene-Solr-Tests-trunk-java7/solr/build/solr-core/test-files/solr/collection1/conf/stopwords.txt to /configs/conf1/stopwords.txt
[junit4:junit4]   2> 431 T1260 oascc.SolrZkClient.makePath makePath: /configs/conf1/stopwords.txt
[junit4:junit4]   2> 434 T1260 oasc.AbstractZkTestCase.putConfig put /usr/home/hudson/hudson-slave/workspace/Lucene-Solr-Tests-trunk-java7/solr/build/solr-core/test-files/solr/collection1/conf/protwords.txt to /configs/conf1/protwords.txt
[junit4:junit4]   2> 434 T1260 oascc.SolrZkClient.makePath makePath: /configs/conf1/protwords.txt
[junit4:junit4]   2> 446 T1260 oasc.AbstractZkTestCase.putConfig put /usr/home/hudson/hudson-slave/workspace/Lucene-Solr-Tests-trunk-java7/solr/build/solr-core/test-files/solr/collection1/conf/currency.xml to /configs/conf1/currency.xml
[junit4:junit4]   2> 447 T1260 oascc.SolrZkClient.makePath makePath: /configs/conf1/currency.xml
[junit4:junit4]   2> 450 T1260 oasc.AbstractZkTestCase.putConfig put /usr/home/hudson/hudson-slave/workspace/Lucene-Solr-Tests-trunk-java7/solr/build/solr-core/test-files/solr/collection1/conf/open-exchange-rates.json to /configs/conf1/open-exchange-rates.json
[junit4:junit4]   2> 451 T1260 oascc.SolrZkClient.makePath makePath: /configs/conf1/open-exchange-rates.json
[junit4:junit4]   2> 454 T1260 oasc.AbstractZkTestCase.putConfig put /usr/home/hudson/hudson-slave/workspace/Lucene-Solr-Tests-trunk-java7/solr/build/solr-core/test-files/solr/collection1/conf/mapping-ISOLatin1Accent.txt to /configs/conf1/mapping-ISOLatin1Accent.txt
[junit4:junit4]   2> 455 T1260 oascc.SolrZkClient.makePath makePath: /configs/conf1/mapping-ISOLatin1Accent.txt
[junit4:junit4]   2> 459 T1260 oasc.AbstractZkTestCase.putConfig put /usr/home/hudson/hudson-slave/workspace/Lucene-Solr-Tests-trunk-java7/solr/build/solr-core/test-files/solr/collection1/conf/old_synonyms.txt to /configs/conf1/old_synonyms.txt
[junit4:junit4]   2> 459 T1260 oascc.SolrZkClient.makePath makePath: /configs/conf1/old_synonyms.txt
[junit4:junit4]   2> 462 T1260 oasc.AbstractZkTestCase.putConfig put /usr/home/hudson/hudson-slave/workspace/Lucene-Solr-Tests-trunk-java7/solr/build/solr-core/test-files/solr/collection1/conf/synonyms.txt to /configs/conf1/synonyms.txt
[junit4:junit4]   2> 463 T1260 oascc.SolrZkClient.makePath makePath: /configs/conf1/synonyms.txt
[junit4:junit4]   2> 466 T1265 oazs.PrepRequestProcessor.pRequest2Txn Processed session termination for sessionid: 0x13bb43e45f90001
[junit4:junit4]   2> 467 T1269 oaz.ClientCnxn$EventThread.run EventThread shut down
[junit4:junit4]   2> 467 T1262 oazs.NIOServerCnxn.closeSock Closed socket connection for client /140.211.11.196:50000 which had sessionid 0x13bb43e45f90001
[junit4:junit4]   2> 467 T1260 oaz.ZooKeeper.close Session: 0x13bb43e45f90001 closed
[junit4:junit4]   2> 676 T1260 oejs.Server.doStart jetty-8.1.8.v20121106
[junit4:junit4]   2> 683 T1260 oejs.AbstractConnector.doStart Started SocketConnector@127.0.0.1:50005
[junit4:junit4]   2> 684 T1260 oasc.SolrResourceLoader.locateSolrHome JNDI not configured for solr (NoInitialContextEx)
[junit4:junit4]   2> 685 T1260 oasc.SolrResourceLoader.locateSolrHome using system property solr.solr.home: /usr/home/hudson/hudson-slave/workspace/Lucene-Solr-Tests-trunk-java7/solr/build/solr-core/test/J1/./org.apache.solr.cloud.BasicDistributedZkTest-controljetty-1355938678719
[junit4:junit4]   2> 686 T1260 oasc.SolrResourceLoader.<init> new SolrResourceLoader for deduced Solr Home: '/usr/home/hudson/hudson-slave/workspace/Lucene-Solr-Tests-trunk-java7/solr/build/solr-core/test/J1/./org.apache.solr.cloud.BasicDistributedZkTest-controljetty-1355938678719/'
[junit4:junit4]   2> 750 T1260 oass.SolrDispatchFilter.init SolrDispatchFilter.init()
[junit4:junit4]   2> 751 T1260 oasc.SolrResourceLoader.locateSolrHome JNDI not configured for solr (NoInitialContextEx)
[junit4:junit4]   2> 752 T1260 oasc.SolrResourceLoader.locateSolrHome using system property solr.solr.home: /usr/home/hudson/hudson-slave/workspace/Lucene-Solr-Tests-trunk-java7/solr/build/solr-core/test/J1/./org.apache.solr.cloud.BasicDistributedZkTest-controljetty-1355938678719
[junit4:junit4]   2> 753 T1260 oasc.CoreContainer$Initializer.initialize looking for solr.xml: /usr/home/hudson/hudson-slave/workspace/Lucene-Solr-Tests-trunk-java7/solr/build/solr-core/test/J1/./org.apache.solr.cloud.BasicDistributedZkTest-controljetty-1355938678719/solr.xml
[junit4:junit4]   2> 753 T1260 oasc.CoreContainer.<init> New CoreContainer 882090263
[junit4:junit4]   2> 754 T1260 oasc.CoreContainer.load Loading CoreContainer using Solr Home: '/usr/home/hudson/hudson-slave/workspace/Lucene-Solr-Tests-trunk-java7/solr/build/solr-core/test/J1/./org.apache.solr.cloud.BasicDistributedZkTest-controljetty-1355938678719/'
[junit4:junit4]   2> 755 T1260 oasc.SolrResourceLoader.<init> new SolrResourceLoader for directory: '/usr/home/hudson/hudson-slave/workspace/Lucene-Solr-Tests-trunk-java7/solr/build/solr-core/test/J1/./org.apache.solr.cloud.BasicDistributedZkTest-controljetty-1355938678719/'
[junit4:junit4]   2> 791 T1260 oashc.HttpShardHandlerFactory.getParameter Setting socketTimeout to: 30000
[junit4:junit4]   2> 792 T1260 oashc.HttpShardHandlerFactory.getParameter Setting urlScheme to: http://
[junit4:junit4]   2> 793 T1260 oashc.HttpShardHandlerFactory.getParameter Setting connTimeout to: 15000
[junit4:junit4]   2> 793 T1260 oashc.HttpShardHandlerFactory.getParameter Setting maxConnectionsPerHost to: 20
[junit4:junit4]   2> 794 T1260 oashc.HttpShardHandlerFactory.getParameter Setting corePoolSize to: 0
[junit4:junit4]   2> 795 T1260 oashc.HttpShardHandlerFactory.getParameter Setting maximumPoolSize to: 2147483647
[junit4:junit4]   2> 795 T1260 oashc.HttpShardHandlerFactory.getParameter Setting maxThreadIdleTime to: 5
[junit4:junit4]   2> 796 T1260 oashc.HttpShardHandlerFactory.getParameter Setting sizeOfQueue to: -1
[junit4:junit4]   2> 796 T1260 oashc.HttpShardHandlerFactory.getParameter Setting fairnessPolicy to: false
[junit4:junit4]   2> 797 T1260 oascsi.HttpClientUtil.createClient Creating new http client, config:maxConnectionsPerHost=20&maxConnections=10000&socketTimeout=30000&connTimeout=15000&retry=false
[junit4:junit4]   2> 829 T1260 oasc.CoreContainer.load Registering Log Listener
[junit4:junit4]   2> 857 T1260 oasc.CoreContainer.initZooKeeper Zookeeper client=127.0.0.1:49998/solr
[junit4:junit4]   2> 859 T1260 oasc.ZkController.checkChrootPath zkHost includes chroot
[junit4:junit4]   2> 859 T1260 oaz.ZooKeeper.<init> Initiating client connection, connectString=127.0.0.1:49998 sessionTimeout=60000 watcher=org.apache.solr.common.cloud.ConnectionManager@cc026e6
[junit4:junit4]   2> 861 T1260 oascc.ConnectionManager.waitForConnected Waiting for client to connect to ZooKeeper
[junit4:junit4]   2> 861 T1279 oaz.ClientCnxn$SendThread.logStartConnect Opening socket connection to server localhost/127.0.0.1:49998. Will not attempt to authenticate using SASL (access denied ("javax.security.auth.AuthPermission" "getLoginConfiguration"))
[junit4:junit4]   2> 863 T1279 oaz.ClientCnxn$SendThread.primeConnection Socket connection established to localhost/127.0.0.1:49998, initiating session
[junit4:junit4]   2> 863 T1262 oazs.NIOServerCnxnFactory.run Accepted socket connection from /140.211.11.196:50006
[junit4:junit4]   2> 863 T1262 oazs.ZooKeeperServer.processConnectRequest Client attempting to establish new session at /140.211.11.196:50006
[junit4:junit4]   2> 865 T1264 oazs.ZooKeeperServer.finishSessionInit Established session 0x13bb43e45f90002 with negotiated timeout 20000 for client /140.211.11.196:50006
[junit4:junit4]   2> 865 T1279 oaz.ClientCnxn$SendThread.onConnected Session establishment complete on server localhost/127.0.0.1:49998, sessionid = 0x13bb43e45f90002, negotiated timeout = 20000
[junit4:junit4]   2> 866 T1280 oascc.ConnectionManager.process Watcher org.apache.solr.common.cloud.ConnectionManager@cc026e6 name:ZooKeeperConnection Watcher:127.0.0.1:49998 got event WatchedEvent state:SyncConnected type:None path:null path:null type:None
[junit4:junit4]   2> 866 T1260 oascc.ConnectionManager.waitForConnected Client is connected to ZooKeeper
[junit4:junit4]   2> 867 T1265 oazs.PrepRequestProcessor.pRequest2Txn Processed session termination for sessionid: 0x13bb43e45f90002
[junit4:junit4]   2> 901 T1280 oaz.ClientCnxn$EventThread.run EventThread shut down
[junit4:junit4]   2> 901 T1262 oazs.NIOServerCnxn.closeSock Closed socket connection for client /140.211.11.196:50006 which had sessionid 0x13bb43e45f90002
[junit4:junit4]   2> 901 T1260 oaz.ZooKeeper.close Session: 0x13bb43e45f90002 closed
[junit4:junit4]   2> 902 T1260 oascsi.HttpClientUtil.createClient Creating new http client, config:maxConnections=500&maxConnectionsPerHost=16&socketTimeout=15000&connTimeout=30000
[junit4:junit4]   2> 918 T1260 oaz.ZooKeeper.<init> Initiating client connection, connectString=127.0.0.1:49998/solr sessionTimeout=30000 watcher=org.apache.solr.common.cloud.ConnectionManager@bd777ae
[junit4:junit4]   2> 920 T1260 oascc.ConnectionManager.waitForConnected Waiting for client to connect to ZooKeeper
[junit4:junit4]   2> 920 T1281 oaz.ClientCnxn$SendThread.logStartConnect Opening socket connection to server localhost/127.0.0.1:49998. Will not attempt to authenticate using SASL (access denied ("javax.security.auth.AuthPermission" "getLoginConfiguration"))
[junit4:junit4]   2> 921 T1281 oaz.ClientCnxn$SendThread.primeConnection Socket connection established to localhost/127.0.0.1:49998, initiating session
[junit4:junit4]   2> 921 T1262 oazs.NIOServerCnxnFactory.run Accepted socket connection from /140.211.11.196:50007
[junit4:junit4]   2> 922 T1262 oazs.ZooKeeperServer.processConnectRequest Client attempting to establish new session at /140.211.11.196:50007
[junit4:junit4]   2> 955 T1264 oazs.ZooKeeperServer.finishSessionInit Established session 0x13bb43e45f90003 with negotiated timeout 20000 for client /140.211.11.196:50007
[junit4:junit4]   2> 955 T1281 oaz.ClientCnxn$SendThread.onConnected Session establishment complete on server localhost/127.0.0.1:49998, sessionid = 0x13bb43e45f90003, negotiated timeout = 20000
[junit4:junit4]   2> 956 T1282 oascc.ConnectionManager.process Watcher org.apache.solr.common.cloud.ConnectionManager@bd777ae name:ZooKeeperConnection Watcher:127.0.0.1:49998/solr got event WatchedEvent state:SyncConnected type:None path:null path:null type:None
[junit4:junit4]   2> 956 T1260 oascc.ConnectionManager.waitForConnected Client is connected to ZooKeeper
[junit4:junit4]   2> 959 T1265 oazs.PrepRequestProcessor.pRequest Got user-level KeeperException when processing sessionid:0x13bb43e45f90003 type:create cxid:0x2 zxid:0x1a txntype:-1 reqpath:n/a Error Path:/solr/overseer Error:KeeperErrorCode = NodeExists for /solr/overseer
[junit4:junit4]   2> 960 T1260 oascc.SolrZkClient.makePath makePath: /live_nodes
[junit4:junit4]   2> 973 T1260 oasc.ZkController.createEphemeralLiveNode Register node as live in ZooKeeper:/live_nodes/127.0.0.1:50005_
[junit4:junit4]   2> 974 T1265 oazs.PrepRequestProcessor.pRequest Got user-level KeeperException when processing sessionid:0x13bb43e45f90003 type:delete cxid:0x7 zxid:0x1c txntype:-1 reqpath:n/a Error Path:/solr/live_nodes/127.0.0.1:50005_ Error:KeeperErrorCode = NoNode for /solr/live_nodes/127.0.0.1:50005_
[junit4:junit4]   2> 976 T1260 oascc.SolrZkClient.makePath makePath: /live_nodes/127.0.0.1:50005_
[junit4:junit4]   2> 990 T1260 oascc.SolrZkClient.makePath makePath: /overseer_elect/election
[junit4:junit4]   2> 1021 T1265 oazs.PrepRequestProcessor.pRequest Got user-level KeeperException when processing sessionid:0x13bb43e45f90003 type:delete cxid:0x15 zxid:0x21 txntype:-1 reqpath:n/a Error Path:/solr/overseer_elect/leader Error:KeeperErrorCode = NoNode for /solr/overseer_elect/leader
[junit4:junit4]   2> 1030 T1260 oascc.SolrZkClient.makePath makePath: /overseer_elect/leader
[junit4:junit4]   2> 1033 T1260 oasc.Overseer.start Overseer (id=88862797218775043-127.0.0.1:50005_-n_0000000000) starting
[junit4:junit4]   2> 1034 T1265 oazs.PrepRequestProcessor.pRequest Got user-level KeeperException when processing sessionid:0x13bb43e45f90003 type:create cxid:0x1a zxid:0x23 txntype:-1 reqpath:n/a Error Path:/solr/overseer Error:KeeperErrorCode = NodeExists for /solr/overseer
[junit4:junit4]   2> 1035 T1265 oazs.PrepRequestProcessor.pRequest Got user-level KeeperException when processing sessionid:0x13bb43e45f90003 type:create cxid:0x1b zxid:0x24 txntype:-1 reqpath:n/a Error Path:/solr/overseer Error:KeeperErrorCode = NodeExists for /solr/overseer
[junit4:junit4]   2> 1046 T1265 oazs.PrepRequestProcessor.pRequest Got user-level KeeperException when processing sessionid:0x13bb43e45f90003 type:create cxid:0x1c zxid:0x25 txntype:-1 reqpath:n/a Error Path:/solr/overseer Error:KeeperErrorCode = NodeExists for /solr/overseer
[junit4:junit4]   2> 1049 T1265 oazs.PrepRequestProcessor.pRequest Got user-level KeeperException when processing sessionid:0x13bb43e45f90003 type:create cxid:0x1d zxid:0x26 txntype:-1 reqpath:n/a Error Path:/solr/overseer Error:KeeperErrorCode = NodeExists for /solr/overseer
[junit4:junit4]   2> 1050 T1284 oasc.OverseerCollectionProcessor.run Process current queue of collection messages
[junit4:junit4]   2> 1051 T1260 oascc.SolrZkClient.makePath makePath: /clusterstate.json
[junit4:junit4]   2> 1068 T1260 oascc.ZkStateReader.createClusterStateWatchersAndUpdate Updating cluster state from ZooKeeper... 
[junit4:junit4]   2> 1070 T1283 oasc.Overseer$ClusterStateUpdater.run Starting to work on the main queue
[junit4:junit4]   2> 1077 T1285 oasc.CoreContainer.create Creating SolrCore 'collection1' using instanceDir: /usr/home/hudson/hudson-slave/workspace/Lucene-Solr-Tests-trunk-java7/solr/build/solr-core/test/J1/./org.apache.solr.cloud.BasicDistributedZkTest-controljetty-1355938678719/collection1
[junit4:junit4]   2> 1077 T1285 oasc.ZkController.createCollectionZkNode Check for collection zkNode:control_collection
[junit4:junit4]   2> 1078 T1285 oasc.ZkController.createCollectionZkNode Collection zkNode exists
[junit4:junit4]   2> 1079 T1285 oasc.ZkController.readConfigName Load collection config from:/collections/control_collection
[junit4:junit4]   2> 1082 T1285 oasc.SolrResourceLoader.<init> new SolrResourceLoader for directory: '/usr/home/hudson/hudson-slave/workspace/Lucene-Solr-Tests-trunk-java7/solr/build/solr-core/test/J1/./org.apache.solr.cloud.BasicDistributedZkTest-controljetty-1355938678719/collection1/'
[junit4:junit4]   2> 1083 T1285 oasc.SolrResourceLoader.replaceClassLoader Adding 'file:/usr/home/hudson/hudson-slave/workspace/Lucene-Solr-Tests-trunk-java7/solr/build/solr-core/test/J1/org.apache.solr.cloud.BasicDistributedZkTest-controljetty-1355938678719/collection1/lib/README' to classloader
[junit4:junit4]   2> 1084 T1285 oasc.SolrResourceLoader.replaceClassLoader Adding 'file:/usr/home/hudson/hudson-slave/workspace/Lucene-Solr-Tests-trunk-java7/solr/build/solr-core/test/J1/org.apache.solr.cloud.BasicDistributedZkTest-controljetty-1355938678719/collection1/lib/classes/' to classloader
[junit4:junit4]   2> 1148 T1285 oasc.SolrConfig.<init> Using Lucene MatchVersion: LUCENE_50
[junit4:junit4]   2> 1222 T1285 oasc.SolrConfig.<init> Loaded SolrConfig: solrconfig.xml
[junit4:junit4]   2> 1323 T1285 oass.IndexSchema.readSchema Reading Solr Schema
[junit4:junit4]   2> 1329 T1285 oass.IndexSchema.readSchema Schema name=test
[junit4:junit4]   2> 1965 T1285 oass.OpenExchangeRatesOrgProvider.init Initialized with rates=open-exchange-rates.json, refreshInterval=1440.
[junit4:junit4]   2> 1977 T1285 oass.IndexSchema.readSchema default search field in schema is text
[junit4:junit4]   2> 1981 T1285 oass.IndexSchema.readSchema unique key field: id
[junit4:junit4]   2> 1993 T1285 oass.FileExchangeRateProvider.reload Reloading exchange rates from file currency.xml
[junit4:junit4]   2> 1997 T1285 oass.FileExchangeRateProvider.reload Reloading exchange rates from file currency.xml
[junit4:junit4]   2> 2002 T1285 oass.OpenExchangeRatesOrgProvider.reload Reloading exchange rates from open-exchange-rates.json
[junit4:junit4]   2> 2003 T1285 oass.OpenExchangeRatesOrgProvider.reload Reloading exchange rates from open-exchange-rates.json
[junit4:junit4]   2> 2004 T1285 oasc.SolrCore.<init> [collection1] Opening new SolrCore at /usr/home/hudson/hudson-slave/workspace/Lucene-Solr-Tests-trunk-java7/solr/build/solr-core/test/J1/./org.apache.solr.cloud.BasicDistributedZkTest-controljetty-1355938678719/collection1/, dataDir=./org.apache.solr.cloud.BasicDistributedZkTest-1355938678257/control/data/
[junit4:junit4]   2> 2004 T1285 oasc.JmxMonitoredMap.<init> JMX monitoring is enabled. Adding Solr mbeans to JMX Server: com.sun.jmx.mbeanserver.JmxMBeanServer@7f0205c2
[junit4:junit4]   2> 2004 T1285 oasc.SolrCore.initDirectoryFactory solr.NRTCachingDirectoryFactory
[junit4:junit4]   2> 2037 T1285 oasc.CachingDirectoryFactory.get return new directory for /usr/home/hudson/hudson-slave/workspace/Lucene-Solr-Tests-trunk-java7/solr/build/solr-core/test/J1/./org.apache.solr.cloud.BasicDistributedZkTest-1355938678257/control/data forceNew:false
[junit4:junit4]   2> 2038 T1285 oasc.CachingDirectoryFactory.close Releasing directory:/usr/home/hudson/hudson-slave/workspace/Lucene-Solr-Tests-trunk-java7/solr/build/solr-core/test/J1/./org.apache.solr.cloud.BasicDistributedZkTest-1355938678257/control/data
[junit4:junit4]   2> 2038 T1285 oasc.SolrCore.getNewIndexDir New index directory detected: old=null new=./org.apache.solr.cloud.BasicDistributedZkTest-1355938678257/control/data/index/
[junit4:junit4]   2> 2039 T1285 oasc.SolrCore.initIndex WARNING [collection1] Solr index directory './org.apache.solr.cloud.BasicDistributedZkTest-1355938678257/control/data/index' doesn't exist. Creating new index...
[junit4:junit4]   2> 2040 T1285 oasc.CachingDirectoryFactory.get return new directory for /usr/home/hudson/hudson-slave/workspace/Lucene-Solr-Tests-trunk-java7/solr/build/solr-core/test/J1/./org.apache.solr.cloud.BasicDistributedZkTest-1355938678257/control/data/index forceNew:false
[junit4:junit4]   2> 2049 T1285 oasc.SolrDeletionPolicy.onCommit SolrDeletionPolicy.onCommit: commits:num=1
[junit4:junit4]   2> 		commit{dir=RateLimitedDirectoryWrapper(NRTCachingDirectory(org.apache.lucene.store.NIOFSDirectory@/usr/home/hudson/hudson-slave/workspace/Lucene-Solr-Tests-trunk-java7/solr/build/solr-core/test/J1/org.apache.solr.cloud.BasicDistributedZkTest-1355938678257/control/data/index lockFactory=org.apache.lucene.store.NativeFSLockFactory@37cac7b8; maxCacheMB=48.0 maxMergeSizeMB=4.0)),segFN=segments_1,generation=1,filenames=[segments_1]
[junit4:junit4]   2> 2050 T1285 oasc.SolrDeletionPolicy.updateCommits newest commit = 1[segments_1]
[junit4:junit4]   2> 2051 T1285 oasc.CachingDirectoryFactory.close Releasing directory:/usr/home/hudson/hudson-slave/workspace/Lucene-Solr-Tests-trunk-java7/solr/build/solr-core/test/J1/./org.apache.solr.cloud.BasicDistributedZkTest-1355938678257/control/data/index
[junit4:junit4]   2> 2051 T1285 oasc.SolrCore.initWriters created xml: solr.XMLResponseWriter
[junit4:junit4]   2> 2053 T1285 oasup.UpdateRequestProcessorChain.init inserting DistributedUpdateProcessorFactory into updateRequestProcessorChain "dedupe"
[junit4:junit4]   2> 2053 T1285 oasup.UpdateRequestProcessorChain.init inserting DistributedUpdateProcessorFactory into updateRequestProcessorChain "dedupe-allfields"
[junit4:junit4]   2> 2053 T1285 oasup.UpdateRequestProcessorChain.init inserting DistributedUpdateProcessorFactory into updateRequestProcessorChain "stored_sig"
[junit4:junit4]   2> 2054 T1285 oasup.UpdateRequestProcessorChain.init inserting DistributedUpdateProcessorFactory into updateRequestProcessorChain "uniq-fields"
[junit4:junit4]   2> 2054 T1285 oasup.UpdateRequestProcessorChain.init inserting DistributedUpdateProcessorFactory into updateRequestProcessorChain "distrib-dup-test-chain-implicit"
[junit4:junit4]   2> 2055 T1285 oasc.RequestHandlers.initHandlersFromConfig adding lazy requestHandler: solr.ReplicationHandler
[junit4:junit4]   2> 2055 T1285 oasc.RequestHandlers.initHandlersFromConfig created /replication: solr.ReplicationHandler
[junit4:junit4]   2> 2056 T1285 oasc.RequestHandlers.initHandlersFromConfig created standard: solr.StandardRequestHandler
[junit4:junit4]   2> 2057 T1285 oasc.RequestHandlers.initHandlersFromConfig created /get: solr.RealTimeGetHandler
[junit4:junit4]   2> 2058 T1285 oasc.RequestHandlers.initHandlersFromConfig created dismax: solr.SearchHandler
[junit4:junit4]   2> 2058 T1285 oasc.RequestHandlers.initHandlersFromConfig created mock: org.apache.solr.core.MockQuerySenderListenerReqHandler
[junit4:junit4]   2> 2059 T1285 oasc.RequestHandlers.initHandlersFromConfig created /admin/: org.apache.solr.handler.admin.AdminHandlers
[junit4:junit4]   2> 2060 T1285 oasc.RequestHandlers.initHandlersFromConfig created defaults: solr.StandardRequestHandler
[junit4:junit4]   2> 2060 T1285 oasc.RequestHandlers.initHandlersFromConfig adding lazy requestHandler: solr.StandardRequestHandler
[junit4:junit4]   2> 2060 T1285 oasc.RequestHandlers.initHandlersFromConfig created lazy: solr.StandardRequestHandler
[junit4:junit4]   2> 2061 T1285 oasc.RequestHandlers.initHandlersFromConfig created /update: solr.UpdateRequestHandler
[junit4:junit4]   2> 2062 T1285 oasc.RequestHandlers.initHandlersFromConfig created /terms: org.apache.solr.handler.component.SearchHandler
[junit4:junit4]   2> 2063 T1285 oasc.RequestHandlers.initHandlersFromConfig created spellCheckCompRH: org.apache.solr.handler.component.SearchHandler
[junit4:junit4]   2> 2064 T1285 oasc.RequestHandlers.initHandlersFromConfig created spellCheckCompRH_Direct: org.apache.solr.handler.component.SearchHandler
[junit4:junit4]   2> 2064 T1285 oasc.RequestHandlers.initHandlersFromConfig created spellCheckWithWordbreak: org.apache.solr.handler.component.SearchHandler
[junit4:junit4]   2> 2065 T1285 oasc.RequestHandlers.initHandlersFromConfig created spellCheckWithWordbreak_Direct: org.apache.solr.handler.component.SearchHandler
[junit4:junit4]   2> 2066 T1285 oasc.RequestHandlers.initHandlersFromConfig created spellCheckCompRH1: org.apache.solr.handler.component.SearchHandler
[junit4:junit4]   2> 2067 T1285 oasc.RequestHandlers.initHandlersFromConfig created mltrh: org.apache.solr.handler.component.SearchHandler
[junit4:junit4]   2> 2068 T1285 oasc.RequestHandlers.initHandlersFromConfig created tvrh: org.apache.solr.handler.component.SearchHandler
[junit4:junit4]   2> 2069 T1285 oasc.RequestHandlers.initHandlersFromConfig created /mlt: solr.MoreLikeThisHandler
[junit4:junit4]   2> 2069 T1285 oasc.RequestHandlers.initHandlersFromConfig created /debug/dump: solr.DumpRequestHandler
[junit4:junit4]   2> 2085 T1285 oashl.XMLLoader.init xsltCacheLifetimeSeconds=60
[junit4:junit4]   2> 2091 T1285 oasc.SolrCore.initDeprecatedSupport WARNING solrconfig.xml uses deprecated <admin/gettableFiles>, Please update your config to use the ShowFileRequestHandler.
[junit4:junit4]   2> 2092 T1285 oasc.SolrCore.initDeprecatedSupport WARNING adding ShowFileRequestHandler with hidden files: [SCHEMA.XML, OLD_SYNONYMS.TXT, STOPWORDS.TXT, PROTWORDS.TXT, OPEN-EXCHANGE-RATES.JSON, SYNONYMS.TXT, CURRENCY.XML, MAPPING-ISOLATIN1ACCENT.TXT]
[junit4:junit4]   2> 2095 T1285 oasc.CachingDirectoryFactory.close Releasing directory:/usr/home/hudson/hudson-slave/workspace/Lucene-Solr-Tests-trunk-java7/solr/build/solr-core/test/J1/./org.apache.solr.cloud.BasicDistributedZkTest-1355938678257/control/data
[junit4:junit4]   2> 2098 T1285 oass.SolrIndexSearcher.<init> Opening Searcher@1e1eb592 main
[junit4:junit4]   2> 2099 T1285 oasu.CommitTracker.<init> Hard AutoCommit: disabled
[junit4:junit4]   2> 2099 T1285 oasu.CommitTracker.<init> Soft AutoCommit: disabled
[junit4:junit4]   2> 2100 T1285 oashc.SpellCheckComponent.inform Initializing spell checkers
[junit4:junit4]   2> 2116 T1285 oass.DirectSolrSpellChecker.init init: {name=direct,classname=DirectSolrSpellChecker,field=lowerfilt,minQueryLength=3}
[junit4:junit4]   2> 2178 T1286 oasc.SolrCore.registerSearcher [collection1] Registered new searcher Searcher@1e1eb592 main{StandardDirectoryReader(segments_1:1)}
[junit4:junit4]   2> 2184 T1285 oasc.ZkController.publish publishing core=collection1 state=down
[junit4:junit4]   2> 2185 T1285 oasc.ZkController.publish numShards not found on descriptor - reading it from system property
[junit4:junit4]   2> 2185 T1265 oazs.PrepRequestProcessor.pRequest Got user-level KeeperException when processing sessionid:0x13bb43e45f90003 type:create cxid:0x56 zxid:0x29 txntype:-1 reqpath:n/a Error Path:/solr/overseer/queue Error:KeeperErrorCode = NoNode for /solr/overseer/queue
[junit4:junit4]   2> 2578 T1283 oascc.ZkStateReader.updateClusterState Updating cloud state from ZooKeeper... 
[junit4:junit4]   2> 2579 T1283 oasc.Overseer$ClusterStateUpdater.updateState Update state numShards=1 message={
[junit4:junit4]   2> 	  "operation":"state",
[junit4:junit4]   2> 	  "numShards":"1",
[junit4:junit4]   2> 	  "shard":null,
[junit4:junit4]   2> 	  "roles":null,
[junit4:junit4]   2> 	  "state":"down",
[junit4:junit4]   2> 	  "core":"collection1",
[junit4:junit4]   2> 	  "collection":"control_collection",
[junit4:junit4]   2> 	  "node_name":"127.0.0.1:50005_",
[junit4:junit4]   2> 	  "base_url":"http://127.0.0.1:50005"}
[junit4:junit4]   2> 2579 T1283 oasc.Overseer$ClusterStateUpdater.createCollection Create collection control_collection with numShards 1
[junit4:junit4]   2> 2579 T1283 oasc.Overseer$ClusterStateUpdater.updateState Assigning new node to shard shard=shard1
[junit4:junit4]   2> 2580 T1265 oazs.PrepRequestProcessor.pRequest Got user-level KeeperException when processing sessionid:0x13bb43e45f90003 type:create cxid:0x5e zxid:0x2c txntype:-1 reqpath:n/a Error Path:/solr/overseer/queue-work Error:KeeperErrorCode = NoNode for /solr/overseer/queue-work
[junit4:junit4]   2> 2607 T1282 oascc.ZkStateReader$2.process A cluster state change: WatchedEvent state:SyncConnected type:NodeDataChanged path:/clusterstate.json, has occurred - updating... (live nodes size: 1)
[junit4:junit4]   2> 2698 T1285

[...truncated too long message...]

	        at sun.misc.Unsafe.park(Native Method)
[junit4:junit4]   2> 	        at java.util.concurrent.locks.LockSupport.park(LockSupport.java:186)
[junit4:junit4]   2> 	        at java.util.concurrent.locks.AbstractQueuedSynchronizer$ConditionObject.await(AbstractQueuedSynchronizer.java:2043)
[junit4:junit4]   2> 	        at java.util.concurrent.LinkedBlockingQueue.take(LinkedBlockingQueue.java:442)
[junit4:junit4]   2> 	        at java.util.concurrent.ThreadPoolExecutor.getTask(ThreadPoolExecutor.java:1043)
[junit4:junit4]   2> 	        at java.util.concurrent.ThreadPoolExecutor.runWorker(ThreadPoolExecutor.java:1103)
[junit4:junit4]   2> 	        at java.util.concurrent.ThreadPoolExecutor$Worker.run(ThreadPoolExecutor.java:603)
[junit4:junit4]   2> 	        at java.lang.Thread.run(Thread.java:722)
[junit4:junit4]   2> 	  27) Thread[id=1337, name=qtp21829793-1337 Acceptor0 SocketConnector@127.0.0.1:50024, state=RUNNABLE, group=TGRP-BasicDistributedZkTest]
[junit4:junit4]   2> 	        at java.net.PlainSocketImpl.socketAccept(Native Method)
[junit4:junit4]   2> 	        at java.net.AbstractPlainSocketImpl.accept(AbstractPlainSocketImpl.java:398)
[junit4:junit4]   2> 	        at java.net.ServerSocket.implAccept(ServerSocket.java:522)
[junit4:junit4]   2> 	        at java.net.ServerSocket.accept(ServerSocket.java:490)
[junit4:junit4]   2> 	        at org.eclipse.jetty.server.bio.SocketConnector.accept(SocketConnector.java:117)
[junit4:junit4]   2> 	        at org.eclipse.jetty.server.AbstractConnector$Acceptor.run(AbstractConnector.java:938)
[junit4:junit4]   2> 	        at org.eclipse.jetty.util.thread.QueuedThreadPool.runJob(QueuedThreadPool.java:608)
[junit4:junit4]   2> 	        at org.eclipse.jetty.util.thread.QueuedThreadPool$3.run(QueuedThreadPool.java:543)
[junit4:junit4]   2> 	        at java.lang.Thread.run(Thread.java:722)
[junit4:junit4]   2> 	  28) Thread[id=1333, name=searcherExecutor-739-thread-1, state=WAITING, group=TGRP-BasicDistributedZkTest]
[junit4:junit4]   2> 	        at sun.misc.Unsafe.park(Native Method)
[junit4:junit4]   2> 	        at java.util.concurrent.locks.LockSupport.park(LockSupport.java:186)
[junit4:junit4]   2> 	        at java.util.concurrent.locks.AbstractQueuedSynchronizer$ConditionObject.await(AbstractQueuedSynchronizer.java:2043)
[junit4:junit4]   2> 	        at java.util.concurrent.LinkedBlockingQueue.take(LinkedBlockingQueue.java:442)
[junit4:junit4]   2> 	        at java.util.concurrent.ThreadPoolExecutor.getTask(ThreadPoolExecutor.java:1043)
[junit4:junit4]   2> 	        at java.util.concurrent.ThreadPoolExecutor.runWorker(ThreadPoolExecutor.java:1103)
[junit4:junit4]   2> 	        at java.util.concurrent.ThreadPoolExecutor$Worker.run(ThreadPoolExecutor.java:603)
[junit4:junit4]   2> 	        at java.lang.Thread.run(Thread.java:722)
[junit4:junit4]   2> 	  29) Thread[id=1410, name=searcherExecutor-799-thread-1, state=WAITING, group=TGRP-BasicDistributedZkTest]
[junit4:junit4]   2> 	        at sun.misc.Unsafe.park(Native Method)
[junit4:junit4]   2> 	        at java.util.concurrent.locks.LockSupport.park(LockSupport.java:186)
[junit4:junit4]   2> 	        at java.util.concurrent.locks.AbstractQueuedSynchronizer$ConditionObject.await(AbstractQueuedSynchronizer.java:2043)
[junit4:junit4]   2> 	        at java.util.concurrent.LinkedBlockingQueue.take(LinkedBlockingQueue.java:442)
[junit4:junit4]   2> 	        at java.util.concurrent.ThreadPoolExecutor.getTask(ThreadPoolExecutor.java:1043)
[junit4:junit4]   2> 	        at java.util.concurrent.ThreadPoolExecutor.runWorker(ThreadPoolExecutor.java:1103)
[junit4:junit4]   2> 	        at java.util.concurrent.ThreadPoolExecutor$Worker.run(ThreadPoolExecutor.java:603)
[junit4:junit4]   2> 	        at java.lang.Thread.run(Thread.java:722)
[junit4:junit4]   2> 	  30) Thread[id=1399, name=searcherExecutor-778-thread-1, state=WAITING, group=TGRP-BasicDistributedZkTest]
[junit4:junit4]   2> 	        at sun.misc.Unsafe.park(Native Method)
[junit4:junit4]   2> 	        at java.util.concurrent.locks.LockSupport.park(LockSupport.java:186)
[junit4:junit4]   2> 	        at java.util.concurrent.locks.AbstractQueuedSynchronizer$ConditionObject.await(AbstractQueuedSynchronizer.java:2043)
[junit4:junit4]   2> 	        at java.util.concurrent.LinkedBlockingQueue.take(LinkedBlockingQueue.java:442)
[junit4:junit4]   2> 	        at java.util.concurrent.ThreadPoolExecutor.getTask(ThreadPoolExecutor.java:1043)
[junit4:junit4]   2> 	        at java.util.concurrent.ThreadPoolExecutor.runWorker(ThreadPoolExecutor.java:1103)
[junit4:junit4]   2> 	        at java.util.concurrent.ThreadPoolExecutor$Worker.run(ThreadPoolExecutor.java:603)
[junit4:junit4]   2> 	        at java.lang.Thread.run(Thread.java:722)
[junit4:junit4]   2> NOTE: test params are: codec=Lucene41: {n_f1=PostingsFormat(name=MockRandom), foo_b=PostingsFormat(name=TestBloomFilteredLucene41Postings), cat=PostingsFormat(name=SimpleText), foo_d=PostingsFormat(name=Lucene41WithOrds), foo_f=PostingsFormat(name=TestBloomFilteredLucene41Postings), n_tl1=PostingsFormat(name=MockRandom), n_d1=PostingsFormat(name=SimpleText), rnd_b=PostingsFormat(name=Lucene41WithOrds), intDefault=PostingsFormat(name=MockRandom), n_td1=PostingsFormat(name=MockRandom), timestamp=PostingsFormat(name=SimpleText), id=PostingsFormat(name=Lucene41WithOrds), range_facet_sl=PostingsFormat(name=Lucene41WithOrds), range_facet_si=PostingsFormat(name=SimpleText), oddField_s=PostingsFormat(name=Lucene41WithOrds), sequence_i=PostingsFormat(name=Lucene41WithOrds), name=PostingsFormat(name=Lucene41WithOrds), foo_i=PostingsFormat(name=MockRandom), regex_dup_B_s=PostingsFormat(name=SimpleText), multiDefault=PostingsFormat(name=SimpleText), n_tf1=PostingsFormat(name=SimpleText), n_dt1=PostingsFormat(name=MockRandom), genre_s=PostingsFormat(name=Lucene41WithOrds), author_t=PostingsFormat(name=MockRandom), n_ti1=PostingsFormat(name=Lucene41WithOrds), range_facet_l=PostingsFormat(name=SimpleText), text=PostingsFormat(name=TestBloomFilteredLucene41Postings), _version_=PostingsFormat(name=MockRandom), val_i=PostingsFormat(name=Lucene41WithOrds), SubjectTerms_mfacet=PostingsFormat(name=MockRandom), series_t=PostingsFormat(name=MockRandom), a_t=PostingsFormat(name=SimpleText), n_tdt1=PostingsFormat(name=MockRandom), regex_dup_A_s=PostingsFormat(name=TestBloomFilteredLucene41Postings), price=PostingsFormat(name=TestBloomFilteredLucene41Postings), other_tl1=PostingsFormat(name=MockRandom), n_l1=PostingsFormat(name=SimpleText), a_si=PostingsFormat(name=MockRandom), inStock=PostingsFormat(name=TestBloomFilteredLucene41Postings)}, sim=DefaultSimilarity, locale=sr__#Latn, timezone=Europe/Guernsey
[junit4:junit4]   2> NOTE: FreeBSD 9.0-RELEASE amd64/Oracle Corporation 1.7.0_09 (64-bit)/cpus=16,threads=31,free=401110000,total=519045120
[junit4:junit4]   2> NOTE: All tests run in this JVM: [TestReload, TestElisionMultitermQuery, DocumentBuilderTest, TestPropInject, TestMultiCoreConfBootstrap, TestCSVResponseWriter, DirectSolrSpellCheckerTest, ClusterStateUpdateTest, TestSolrDeletionPolicy1, DebugComponentTest, IndexSchemaRuntimeFieldTest, BasicZkTest, TestStressVersions, TestAtomicUpdateErrorCases, FieldMutatingUpdateProcessorTest, TestUtils, IndexReaderFactoryTest, EchoParamsTest, TestQueryUtils, RecoveryZkTest, TestCodecSupport, TestFunctionQuery, UUIDFieldTest, TestQuerySenderListener, TestRecovery, CoreContainerCoreInitFailuresTest, DisMaxRequestHandlerTest, TestRealTimeGet, PingRequestHandlerTest, TestSolrIndexConfig, TestSort, TestMergePolicyConfig, XsltUpdateRequestHandlerTest, DistributedQueryElevationComponentTest, TestPluginEnable, OpenExchangeRatesOrgProviderTest, TestTrie, TestFoldingMultitermQuery, PrimitiveFieldTypeTest, TestDocSet, TestWriterPerf, TestHashPartitioner, TestDFRSimilarityFactory, LegacyHTMLStripCharFilterTest, MultiTermTest, QueryParsingTest, SignatureUpdateProcessorFactoryTest, ShowFileRequestHandlerTest, QueryEqualityTest, BasicFunctionalityTest, DirectUpdateHandlerTest, TestDistributedSearch, StatelessScriptUpdateProcessorFactoryTest, AnalysisAfterCoreReloadTest, TestCSVLoader, SpellingQueryConverterTest, TestSolr4Spatial, OverseerTest, TestSolrXMLSerializer, ScriptEngineTest, BasicDistributedZkTest]
[junit4:junit4]   2> NOTE: reproduce with: ant test  -Dtestcase=BasicDistributedZkTest -Dtests.seed=1E97D968F8B57EAE -Dtests.multiplier=3 -Dtests.slow=true -Dtests.locale=sr__#Latn -Dtests.timezone=Europe/Guernsey -Dtests.file.encoding=ISO-8859-1
[junit4:junit4] ERROR   0.00s J1 | BasicDistributedZkTest (suite) <<<
[junit4:junit4]    > Throwable #1: java.lang.Exception: Suite timeout exceeded (>= 7200000 msec).
[junit4:junit4]    > 	at __randomizedtesting.SeedInfo.seed([1E97D968F8B57EAE]:0)
[junit4:junit4] Completed on J1 in 7223.96s, 1 test, 2 errors <<< FAILURES!

[...truncated 12 lines...]
BUILD FAILED
/usr/home/hudson/hudson-slave/workspace/Lucene-Solr-Tests-trunk-java7/build.xml:353: The following error occurred while executing this line:
/usr/home/hudson/hudson-slave/workspace/Lucene-Solr-Tests-trunk-java7/build.xml:39: The following error occurred while executing this line:
/usr/home/hudson/hudson-slave/workspace/Lucene-Solr-Tests-trunk-java7/solr/build.xml:178: The following error occurred while executing this line:
/usr/home/hudson/hudson-slave/workspace/Lucene-Solr-Tests-trunk-java7/solr/common-build.xml:438: The following error occurred while executing this line:
/usr/home/hudson/hudson-slave/workspace/Lucene-Solr-Tests-trunk-java7/lucene/common-build.xml:1175: The following error occurred while executing this line:
/usr/home/hudson/hudson-slave/workspace/Lucene-Solr-Tests-trunk-java7/lucene/common-build.xml:840: There were test failures: 243 suites, 1008 tests, 1 suite-level error, 2 errors, 21 ignored (3 assumptions)

Total time: 145 minutes 13 seconds
Build step 'Invoke Ant' marked build as failure
Archiving artifacts
Recording test results
Email was triggered for: Failure
Sending email for trigger: Failure



Mime
View raw message