lucene-dev mailing list archives

Site index · List index
Message view « Date » · « Thread »
Top « Date » · « Thread »
From Robert Muir <rcm...@gmail.com>
Subject Re: [JENKINS] Lucene-Solr-trunk-Linux (64bit/jdk1.8.0-ea-b58) - Build # 2500 - Failure!
Date Thu, 15 Nov 2012 15:27:45 GMT
to be fair, it did get SimpleText.

But why would it be *that* slow?

On Thu, Nov 15, 2012 at 7:23 AM, Policeman Jenkins Server
<jenkins@sd-datasolutions.de> wrote:
> Build: http://jenkins.sd-datasolutions.de/job/Lucene-Solr-trunk-Linux/2500/
> Java: 64bit/jdk1.8.0-ea-b58 -XX:+UseConcMarkSweepGC
>
> 2 tests failed.
> FAILED:  junit.framework.TestSuite.org.apache.lucene.index.TestBagOfPositions
>
> Error Message:
> Suite timeout exceeded (>= 7200000 msec).
>
> Stack Trace:
> java.lang.Exception: Suite timeout exceeded (>= 7200000 msec).
>         at __randomizedtesting.SeedInfo.seed([6D15718EB83FA2C1]:0)
>
>
> REGRESSION:  org.apache.lucene.index.TestBagOfPositions.test
>
> Error Message:
> Test abandoned because suite timeout was reached.
>
> Stack Trace:
> java.lang.Exception: Test abandoned because suite timeout was reached.
>         at __randomizedtesting.SeedInfo.seed([6D15718EB83FA2C1]:0)
>
>
>
>
> Build Log:
> [...truncated 1331 lines...]
> [junit4:junit4] Suite: org.apache.lucene.index.TestBagOfPositions
> [junit4:junit4]   2> NOTE: reproduce with: ant test  -Dtestcase=TestBagOfPositions
-Dtests.method=test -Dtests.seed=6D15718EB83FA2C1 -Dtests.multiplier=3 -Dtests.slow=true -Dtests.locale=ms_MY
-Dtests.timezone=Australia/South -Dtests.file.encoding=UTF-8
> [junit4:junit4] ERROR   7200s J1 | TestBagOfPositions.test <<<
> [junit4:junit4]    > Throwable #1: java.lang.Exception: Test abandoned because suite
timeout was reached.
> [junit4:junit4]    >    at __randomizedtesting.SeedInfo.seed([6D15718EB83FA2C1]:0)
> [junit4:junit4]   2> NOTE: test params are: codec=SimpleText, sim=DefaultSimilarity,
locale=ms_MY, timezone=Australia/South
> [junit4:junit4]   2> NOTE: Linux 3.2.0-32-generic amd64/Oracle Corporation 1.8.0-ea
(64-bit)/cpus=8,threads=1,free=237663168,total=518979584
> [junit4:junit4]   2> NOTE: All tests run in this JVM: [TestNumericTokenStream, TestDocumentsWriterStallControl,
TestSimilarityProvider, TestLongPostings, TestDocValues, TestUniqueTermCount, TestDuelingCodecs,
TestNewestSegment, TestForceMergeForever, TestElevationComparator, TestToken, TestSpans, TestFieldMaskingSpanQuery,
TestPostingsOffsets, TestConstantScoreQuery, TestNoDeletionPolicy, TestBooleanMinShouldMatch,
TestSloppyPhraseQuery2, TestNRTCachingDirectory, TestMinimize, TestDocTermOrds, TestIndexWriterMerging,
TestMockAnalyzer, TestMultiValuedNumericRangeQuery, TestExternalCodecs, TestCharsRef, TestTermsEnum,
TestAutomatonQuery, TestConjunctions, Nested3, Nested1, Nested2, TestAssertions, TestQueryWrapperFilter,
TestField, TestUnicodeUtil, TestCodecs, TestPayloadsOnVectors, TestTermVectorsWriter, TestIdentityHashSet,
TestIndexWriterMergePolicy, TestRegexpQuery, TestCachingWrapperFilter, TestLookaheadTokenFilter,
TestRollback, TestUTF32ToUTF8, TestRandomStoredFields, TestIndexCommit, TestMixedCodecs, TestSentinelIntSet,
TestForUtil, TestTerm, TestRamUsageEstimator, TestLockFactory, TestFieldsReader, TestNRTManager,
TestCrashCausesCorruptIndex, TestPositiveScoresOnlyCollector, TestRecyclingIntBlockAllocator,
TestByteArrayDataInput, TestOmitPositions, TestTermScorer, TestPerFieldPostingsFormat, TestFSTs,
TestSegmentMerger, Test2BPostings, TestWorstCaseTestBehavior, TestNearSpansOrdered, Nested,
TestIndexWriterUnicode, TestPerSegmentDeletes, TestDocumentsWriterDeleteQueue, TestSimpleExplanationsOfNonMatches,
TestCachingCollector, TestTermVectorsReader, Nested1, TestAttributeSource, TestIntsRef, TestOmitNorms,
TestWildcardRandom, TestPayloadTermQuery, TestNot, TestIndexWriterWithThreads, TestPackedInts,
TestNorms, TestIndexWriterReader, TestShardSearching, TestBoolean2, TestIndexWriterExceptions,
TestNumericRangeQuery64, TestSearcherManager, TestNumericRangeQuery32, TestNRTThreads, TestBasics,
TestDeletionPolicy, TestAddIndexes, TestAtomicUpdate, TestIndexWriter, TestMultiMMap, TestLucene40PostingsReader,
TestOpenBitSet, TestTimeLimitingCollector, TestNeverDelete, TestFlushByRamOrCountsPolicy,
TestTopDocsMerge, TestSearchAfter, TestPersistentSnapshotDeletionPolicy, TestIndexWriterDelete,
TestDirectoryReaderReopen, TestSearchWithThreads, TestCollectionUtil, TestDirectoryReader,
TestFixedBitSet, TestTypePromotion, TestCompoundFile, TestSimpleExplanations, TestCustomNorms,
TestStressIndexing, TestDeterminizeLexicon, TestIndexWriterNRTIsCurrent, TestRegexpRandom2,
TestNRTReaderWithThreads, TestDocValuesIndexing, TestConcurrentMergeScheduler, TestHugeRamFile,
TestStressNRT, Test2BDocs, TestPhraseQuery, TestConsistentFieldNumbers, TestFieldCacheRewriteMethod,
TestDoubleBarrelLRUCache, TestComplexExplanations, TestStressAdvance, TestRAMDirectory, TestDeterminism,
TestCharTermAttributeImpl, TestRollingUpdates, TestPrefixInBooleanQuery, TestThreadedForceMerge,
TestBytesRefHash, TestFieldCache, TestSpanExplanations, TestReuseDocsEnum, TestMaxTermFrequency,
TestIndexInput, TestSpanSearchEquivalence, TestMultiThreadTermVectors, TestSegmentTermDocs,
TestParallelCompositeReader, TestSimilarityBase, TestFieldCacheSanityChecker, TestDoc, TestMergeSchedulerExternal,
TestTermsEnum2, TestOmitTf, TestDisjunctionMaxQuery, TestCopyBytes, TestTermRangeFilter, TestPrefixRandom,
TestFilteredQuery, TestDocumentWriter, TestPayloadExplanations, TestMultiTermConstantScore,
TestDocsAndPositions, TestForTooMuchCloning, TestCompiledAutomaton, TestIndexableField, TestParallelAtomicReader,
TestMultiLevelSkipList, TestTermRangeQuery, TestRegexpRandom, TestFuzzyQuery, TestRollingBuffer,
TestBooleanOr, InBeforeClass, InAfterClass, InTestMethod, NonStringProperties, TestWildcard,
TestSizeBoundedForceMerge, TestCheckIndex, TestDocCount, TestSumDocFreq, TestSearchForDuplicates,
TestBinaryTerms, TestIndexFileDeleter, TestIndexWriterConfig, TestTopDocsCollector, Before3,
Before3, TestSetOnce, NestedSetupChain, NestedTeardownChain, TestDocIdSet, Nested, Nested,
TestSubScorerFreqs, TestFilterAtomicReader, TestFieldValueFilter, TestFileSwitchDirectory,
TestMultiTermQueryRewrites, ThrowInUncaught, TestSpansAdvanced, TestPositionIncrement, TestDateTools,
TestDirectory, TestSearch, TestReaderClosed, TestSameTokenSamePosition, TestExplanations,
TestFieldCacheTermsFilter, TestMatchAllDocsQuery, TestSimilarity, TestDemo, TestBinaryDocument,
TestTopScoreDocCollector, TestSpanFirstQuery, TestLock, TestPriorityQueue, TestVirtualMethod,
Test2BTerms, TestNoMergePolicy, TestNamedSPILoader, TestMockCharFilter, TestFieldInfos, TestPrefixFilter,
TestScoreCachingWrappingScorer, TestBitUtil, TestIndexWriterLockRelease, TestCloseableThreadLocal,
TestNoMergeScheduler, TestByteBlockPool, TestCachingTokenFilter, TestSimpleAttributeImpl,
TestTermdocPerf, TestIOUtils, TestLucene40PostingsFormat, TestBlockPostingsFormat, TestBlockPostingsFormat3,
Test2BPositions, Test2BPostingsBytes, TestBagOfPositions]
> [junit4:junit4]   2> NOTE: reproduce with: ant test  -Dtestcase=TestBagOfPositions
-Dtests.seed=6D15718EB83FA2C1 -Dtests.multiplier=3 -Dtests.slow=true -Dtests.locale=ms_MY
-Dtests.timezone=Australia/South -Dtests.file.encoding=UTF-8
> [junit4:junit4] ERROR   0.00s J1 | TestBagOfPositions (suite) <<<
> [junit4:junit4]    > Throwable #1: java.lang.Exception: Suite timeout exceeded (>=
7200000 msec).
> [junit4:junit4]    >    at __randomizedtesting.SeedInfo.seed([6D15718EB83FA2C1]:0)
> [junit4:junit4] Completed on J1 in 7220.29s, 1 test, 2 errors <<< FAILURES!
>
> [...truncated 11 lines...]
> BUILD FAILED
> /mnt/ssd/jenkins/workspace/Lucene-Solr-trunk-Linux/build.xml:337: The following error
occurred while executing this line:
> /mnt/ssd/jenkins/workspace/Lucene-Solr-trunk-Linux/build.xml:39: The following error
occurred while executing this line:
> /mnt/ssd/jenkins/workspace/Lucene-Solr-trunk-Linux/lucene/build.xml:50: The following
error occurred while executing this line:
> /mnt/ssd/jenkins/workspace/Lucene-Solr-trunk-Linux/lucene/common-build.xml:1163: The
following error occurred while executing this line:
> /mnt/ssd/jenkins/workspace/Lucene-Solr-trunk-Linux/lucene/common-build.xml:827: There
were test failures: 319 suites, 1829 tests, 1 suite-level error, 1 error, 22 ignored (11 assumptions)
>
> Total time: 130 minutes 57 seconds
> Build step 'Invoke Ant' marked build as failure
> Archiving artifacts
> Recording test results
> Description set: Java: 64bit/jdk1.8.0-ea-b58 -XX:+UseConcMarkSweepGC
> Email was triggered for: Failure
> Sending email for trigger: Failure
>
>
>
>
> ---------------------------------------------------------------------
> To unsubscribe, e-mail: dev-unsubscribe@lucene.apache.org
> For additional commands, e-mail: dev-help@lucene.apache.org

---------------------------------------------------------------------
To unsubscribe, e-mail: dev-unsubscribe@lucene.apache.org
For additional commands, e-mail: dev-help@lucene.apache.org


Mime
View raw message