lucene-dev mailing list archives

Site index · List index
Message view « Date » · « Thread »
Top « Date » · « Thread »
From Michael McCandless <luc...@mikemccandless.com>
Subject Re: [JENKINS] Lucene-Solr-4.x-Windows (64bit/jdk1.7.0_09) - Build # 1590 - Failure!
Date Tue, 13 Nov 2012 13:37:51 GMT
Woops, I forgot to merge this fix back from trunk yesterday ... I just
did now ...

Mike McCandless

http://blog.mikemccandless.com


On Tue, Nov 13, 2012 at 6:28 AM, Policeman Jenkins Server
<jenkins@sd-datasolutions.de> wrote:
> Build: http://jenkins.sd-datasolutions.de/job/Lucene-Solr-4.x-Windows/1590/
> Java: 64bit/jdk1.7.0_09 -XX:+UseSerialGC
>
> 1 tests failed.
> REGRESSION:  org.apache.lucene.index.TestConcurrentMergeScheduler.testMaxMergeCount
>
> Error Message:
> count should be <= maxMergeCount (= 3)
>
> Stack Trace:
> java.lang.IllegalArgumentException: count should be <= maxMergeCount (= 3)
>         at __randomizedtesting.SeedInfo.seed([F2AF183E6E89DD89:25C8898DD248420F]:0)
>         at org.apache.lucene.index.ConcurrentMergeScheduler.setMaxThreadCount(ConcurrentMergeScheduler.java:90)
>         at org.apache.lucene.index.TestConcurrentMergeScheduler.testMaxMergeCount(TestConcurrentMergeScheduler.java:303)
>         at sun.reflect.NativeMethodAccessorImpl.invoke0(Native Method)
>         at sun.reflect.NativeMethodAccessorImpl.invoke(NativeMethodAccessorImpl.java:57)
>         at sun.reflect.DelegatingMethodAccessorImpl.invoke(DelegatingMethodAccessorImpl.java:43)
>         at java.lang.reflect.Method.invoke(Method.java:601)
>         at com.carrotsearch.randomizedtesting.RandomizedRunner.invoke(RandomizedRunner.java:1559)
>         at com.carrotsearch.randomizedtesting.RandomizedRunner.access$600(RandomizedRunner.java:79)
>         at com.carrotsearch.randomizedtesting.RandomizedRunner$6.evaluate(RandomizedRunner.java:737)
>         at com.carrotsearch.randomizedtesting.RandomizedRunner$7.evaluate(RandomizedRunner.java:773)
>         at com.carrotsearch.randomizedtesting.RandomizedRunner$8.evaluate(RandomizedRunner.java:787)
>         at org.apache.lucene.util.TestRuleSetupTeardownChained$1.evaluate(TestRuleSetupTeardownChained.java:50)
>         at org.apache.lucene.util.TestRuleFieldCacheSanity$1.evaluate(TestRuleFieldCacheSanity.java:51)
>         at org.apache.lucene.util.AbstractBeforeAfterRule$1.evaluate(AbstractBeforeAfterRule.java:45)
>         at com.carrotsearch.randomizedtesting.rules.SystemPropertiesInvariantRule$1.evaluate(SystemPropertiesInvariantRule.java:55)
>         at org.apache.lucene.util.TestRuleThreadAndTestName$1.evaluate(TestRuleThreadAndTestName.java:48)
>         at org.apache.lucene.util.TestRuleIgnoreAfterMaxFailures$1.evaluate(TestRuleIgnoreAfterMaxFailures.java:70)
>         at org.apache.lucene.util.TestRuleMarkFailure$1.evaluate(TestRuleMarkFailure.java:48)
>         at com.carrotsearch.randomizedtesting.rules.StatementAdapter.evaluate(StatementAdapter.java:36)
>         at com.carrotsearch.randomizedtesting.ThreadLeakControl$StatementRunner.run(ThreadLeakControl.java:358)
>         at com.carrotsearch.randomizedtesting.ThreadLeakControl.forkTimeoutingTask(ThreadLeakControl.java:782)
>         at com.carrotsearch.randomizedtesting.ThreadLeakControl$3.evaluate(ThreadLeakControl.java:442)
>         at com.carrotsearch.randomizedtesting.RandomizedRunner.runSingleTest(RandomizedRunner.java:746)
>         at com.carrotsearch.randomizedtesting.RandomizedRunner$3.evaluate(RandomizedRunner.java:648)
>         at com.carrotsearch.randomizedtesting.RandomizedRunner$4.evaluate(RandomizedRunner.java:682)
>         at com.carrotsearch.randomizedtesting.RandomizedRunner$5.evaluate(RandomizedRunner.java:693)
>         at org.apache.lucene.util.AbstractBeforeAfterRule$1.evaluate(AbstractBeforeAfterRule.java:45)
>         at org.apache.lucene.util.TestRuleStoreClassName$1.evaluate(TestRuleStoreClassName.java:42)
>         at com.carrotsearch.randomizedtesting.rules.SystemPropertiesInvariantRule$1.evaluate(SystemPropertiesInvariantRule.java:55)
>         at com.carrotsearch.randomizedtesting.rules.NoShadowingOrOverridesOnMethodsRule$1.evaluate(NoShadowingOrOverridesOnMethodsRule.java:39)
>         at com.carrotsearch.randomizedtesting.rules.NoShadowingOrOverridesOnMethodsRule$1.evaluate(NoShadowingOrOverridesOnMethodsRule.java:39)
>         at com.carrotsearch.randomizedtesting.rules.StatementAdapter.evaluate(StatementAdapter.java:36)
>         at org.apache.lucene.util.TestRuleAssertionsRequired$1.evaluate(TestRuleAssertionsRequired.java:43)
>         at org.apache.lucene.util.TestRuleMarkFailure$1.evaluate(TestRuleMarkFailure.java:48)
>         at org.apache.lucene.util.TestRuleIgnoreAfterMaxFailures$1.evaluate(TestRuleIgnoreAfterMaxFailures.java:70)
>         at org.apache.lucene.util.TestRuleIgnoreTestSuites$1.evaluate(TestRuleIgnoreTestSuites.java:55)
>         at com.carrotsearch.randomizedtesting.rules.StatementAdapter.evaluate(StatementAdapter.java:36)
>         at com.carrotsearch.randomizedtesting.ThreadLeakControl$StatementRunner.run(ThreadLeakControl.java:358)
>         at java.lang.Thread.run(Thread.java:722)
>
>
>
>
> Build Log:
> [...truncated 834 lines...]
> [junit4:junit4] Suite: org.apache.lucene.index.TestConcurrentMergeScheduler
> [junit4:junit4]   2> NOTE: reproduce with: ant test  -Dtestcase=TestConcurrentMergeScheduler
-Dtests.method=testMaxMergeCount -Dtests.seed=F2AF183E6E89DD89 -Dtests.slow=true -Dtests.locale=th_TH
-Dtests.timezone=Africa/Timbuktu -Dtests.file.encoding=Cp1252
> [junit4:junit4] ERROR   0.01s | TestConcurrentMergeScheduler.testMaxMergeCount <<<
> [junit4:junit4]    > Throwable #1: java.lang.IllegalArgumentException: count should
be <= maxMergeCount (= 3)
> [junit4:junit4]    >    at __randomizedtesting.SeedInfo.seed([F2AF183E6E89DD89:25C8898DD248420F]:0)
> [junit4:junit4]    >    at org.apache.lucene.index.ConcurrentMergeScheduler.setMaxThreadCount(ConcurrentMergeScheduler.java:90)
> [junit4:junit4]    >    at org.apache.lucene.index.TestConcurrentMergeScheduler.testMaxMergeCount(TestConcurrentMergeScheduler.java:303)
> [junit4:junit4]    >    at sun.reflect.NativeMethodAccessorImpl.invoke0(Native Method)
> [junit4:junit4]    >    at sun.reflect.NativeMethodAccessorImpl.invoke(NativeMethodAccessorImpl.java:57)
> [junit4:junit4]    >    at sun.reflect.DelegatingMethodAccessorImpl.invoke(DelegatingMethodAccessorImpl.java:43)
> [junit4:junit4]    >    at java.lang.reflect.Method.invoke(Method.java:601)
> [junit4:junit4]    >    at com.carrotsearch.randomizedtesting.RandomizedRunner.invoke(RandomizedRunner.java:1559)
> [junit4:junit4]    >    at com.carrotsearch.randomizedtesting.RandomizedRunner.access$600(RandomizedRunner.java:79)
> [junit4:junit4]    >    at com.carrotsearch.randomizedtesting.RandomizedRunner$6.evaluate(RandomizedRunner.java:737)
> [junit4:junit4]    >    at com.carrotsearch.randomizedtesting.RandomizedRunner$7.evaluate(RandomizedRunner.java:773)
> [junit4:junit4]    >    at com.carrotsearch.randomizedtesting.RandomizedRunner$8.evaluate(RandomizedRunner.java:787)
> [junit4:junit4]    >    at org.apache.lucene.util.TestRuleSetupTeardownChained$1.evaluate(TestRuleSetupTeardownChained.java:50)
> [junit4:junit4]    >    at org.apache.lucene.util.TestRuleFieldCacheSanity$1.evaluate(TestRuleFieldCacheSanity.java:51)
> [junit4:junit4]    >    at org.apache.lucene.util.AbstractBeforeAfterRule$1.evaluate(AbstractBeforeAfterRule.java:45)
> [junit4:junit4]    >    at com.carrotsearch.randomizedtesting.rules.SystemPropertiesInvariantRule$1.evaluate(SystemPropertiesInvariantRule.java:55)
> [junit4:junit4]    >    at org.apache.lucene.util.TestRuleThreadAndTestName$1.evaluate(TestRuleThreadAndTestName.java:48)
> [junit4:junit4]    >    at org.apache.lucene.util.TestRuleIgnoreAfterMaxFailures$1.evaluate(TestRuleIgnoreAfterMaxFailures.java:70)
> [junit4:junit4]    >    at org.apache.lucene.util.TestRuleMarkFailure$1.evaluate(TestRuleMarkFailure.java:48)
> [junit4:junit4]    >    at com.carrotsearch.randomizedtesting.rules.StatementAdapter.evaluate(StatementAdapter.java:36)
> [junit4:junit4]    >    at com.carrotsearch.randomizedtesting.ThreadLeakControl$StatementRunner.run(ThreadLeakControl.java:358)
> [junit4:junit4]    >    at com.carrotsearch.randomizedtesting.ThreadLeakControl.forkTimeoutingTask(ThreadLeakControl.java:782)
> [junit4:junit4]    >    at com.carrotsearch.randomizedtesting.ThreadLeakControl$3.evaluate(ThreadLeakControl.java:442)
> [junit4:junit4]    >    at com.carrotsearch.randomizedtesting.RandomizedRunner.runSingleTest(RandomizedRunner.java:746)
> [junit4:junit4]    >    at com.carrotsearch.randomizedtesting.RandomizedRunner$3.evaluate(RandomizedRunner.java:648)
> [junit4:junit4]    >    at com.carrotsearch.randomizedtesting.RandomizedRunner$4.evaluate(RandomizedRunner.java:682)
> [junit4:junit4]    >    at com.carrotsearch.randomizedtesting.RandomizedRunner$5.evaluate(RandomizedRunner.java:693)
> [junit4:junit4]    >    at org.apache.lucene.util.AbstractBeforeAfterRule$1.evaluate(AbstractBeforeAfterRule.java:45)
> [junit4:junit4]    >    at org.apache.lucene.util.TestRuleStoreClassName$1.evaluate(TestRuleStoreClassName.java:42)
> [junit4:junit4]    >    at com.carrotsearch.randomizedtesting.rules.SystemPropertiesInvariantRule$1.evaluate(SystemPropertiesInvariantRule.java:55)
> [junit4:junit4]    >    at com.carrotsearch.randomizedtesting.rules.NoShadowingOrOverridesOnMethodsRule$1.evaluate(NoShadowingOrOverridesOnMethodsRule.java:39)
> [junit4:junit4]    >    at com.carrotsearch.randomizedtesting.rules.NoShadowingOrOverridesOnMethodsRule$1.evaluate(NoShadowingOrOverridesOnMethodsRule.java:39)
> [junit4:junit4]    >    at com.carrotsearch.randomizedtesting.rules.StatementAdapter.evaluate(StatementAdapter.java:36)
> [junit4:junit4]    >    at org.apache.lucene.util.TestRuleAssertionsRequired$1.evaluate(TestRuleAssertionsRequired.java:43)
> [junit4:junit4]    >    at org.apache.lucene.util.TestRuleMarkFailure$1.evaluate(TestRuleMarkFailure.java:48)
> [junit4:junit4]    >    at org.apache.lucene.util.TestRuleIgnoreAfterMaxFailures$1.evaluate(TestRuleIgnoreAfterMaxFailures.java:70)
> [junit4:junit4]    >    at org.apache.lucene.util.TestRuleIgnoreTestSuites$1.evaluate(TestRuleIgnoreTestSuites.java:55)
> [junit4:junit4]    >    at com.carrotsearch.randomizedtesting.rules.StatementAdapter.evaluate(StatementAdapter.java:36)
> [junit4:junit4]    >    at com.carrotsearch.randomizedtesting.ThreadLeakControl$StatementRunner.run(ThreadLeakControl.java:358)
> [junit4:junit4]    >    at java.lang.Thread.run(Thread.java:722)
> [junit4:junit4]   2> NOTE: test params are: codec=Lucene40, sim=RandomSimilarityProvider(queryNorm=false,coord=crazy):
{content=DFR I(F)B1}, locale=th_TH, timezone=Africa/Timbuktu
> [junit4:junit4]   2> NOTE: Windows 7 6.1 amd64/Oracle Corporation 1.7.0_09 (64-bit)/cpus=2,threads=1,free=17441072,total=70455296
> [junit4:junit4]   2> NOTE: All tests run in this JVM: [TestBackwardsCompatibility,
Nested, TestPositiveScoresOnlyCollector, TestDocBoost, TestTermdocPerf, TestHugeRamFile, TestRegexpRandom,
TestRollingUpdates, TestSimilarityBase, TestSimpleSearchEquivalence, TestCachingTokenFilter,
TestLock, TestTypePromotion, TestBasics, TestCachingWrapperFilter, TestFieldCacheRangeFilter,
TestGraphTokenizers, TestIndexWriterDelete, Before3, Before3, TestDirectoryReader, TestMinimize,
TestSpanExplanationsOfNonMatches, Test4GBStoredFields, TestTopDocsCollector, Test2BDocs, TestBinaryTerms,
TestPhrasePrefixQuery, TestOpenBitSet, InBeforeClass, InAfterClass, NonStringProperties, InTestMethod,
TestCharTermAttributeImpl, TestCloseableThreadLocal, TestVersionComparator, TestNRTManager,
TestNGramPhraseQuery, TestParallelReaderEmptyIndex, TestDisjunctionMaxQuery, TestDocument,
TestBooleanOr, TestWildcardRandom, TestTermRangeFilter, TestScoreCachingWrappingScorer, TestDoc,
TestTermVectorsWriter, TestMultiPhraseQuery, TestNumericUtils, TestElevationComparator, TestIndexInput,
TestNoMergeScheduler, TestSnapshotDeletionPolicy, TestMultiFields, TestSpansAdvanced, TestIndexWriterReader,
TestFieldCacheRewriteMethod, TestDateFilter, TestBytesRefHash, TestLongPostings, TestCodecs,
TestIndexWriterNRTIsCurrent, TestLucene3xPostingsFormat, TestIndexWriterCommit, TestPrefixInBooleanQuery,
TestNeverDelete, TestPriorityQueue, TestBinaryDocument, TestConjunctions, TestAttributeSource,
TestFieldsReader, TestCrashCausesCorruptIndex, TestIndexWriterConfig, TestPerFieldPostingsFormat2,
TestSpanExplanations, TestTopDocsMerge, TestDocIdSet, TestSurrogates, TestDeterminizeLexicon,
TestDemo, TestPayloads, TestReuseDocsEnum, TestQueryWrapperFilter, TestVirtualMethod, TestFilteredQuery,
TestMergeSchedulerExternal, TestAtomicUpdate, TestUTF32ToUTF8, TestSpanMultiTermQueryWrapper,
TestIsCurrent, TestSpanFirstQuery, TestBlockPostingsFormat, TestForceMergeForever, TestDocCount,
TestShardSearching, TestCheckIndex, TestWeakIdentityMap, TestRamUsageEstimatorOnWildAnimals,
TestMatchAllDocsQuery, TestLockFactory, TestFieldValueFilter, TestFieldCache, TestUnicodeUtil,
TestDocumentsWriterStallControl, TestCharsRef, TestSentinelIntSet, TestBooleanMinShouldMatch,
Test2BPostings, TestStressIndexing2, TestSearcherManager, TestMockDirectoryWrapper, TestDirectory,
TestFilterAtomicReader, TestRAMDirectory, TestOmitPositions, TestFieldInfos, TestRegexpRandom2,
TestDoubleBarrelLRUCache, TestIndexWriterMergePolicy, TestSearch, TestMultiTermConstantScore,
TestParallelAtomicReader, TestTermsEnum, TestNoDeletionPolicy, TestSmallFloat, TestMultiMMap,
TestArrayUtil, TestBagOfPostings, TestPayloadNearQuery, TestAutomatonQuery, TestIndexCommit,
TestImpersonation, TestIndexWriterUnicode, TestTransactionRollback, TestTimeLimitingCollector,
TestNumericRangeQuery64, TestCopyBytes, TestOmitNorms, TestRamUsageEstimator, TestComplexExplanations,
TestBasicOperations, TestByteArrayDataInput, TestCollectionUtil, TestSegmentReader, TestRecyclingIntBlockAllocator,
TestIndexableField, TestNamedSPILoader, TestDeletionPolicy, TestSumDocFreq, TestCrash, TestSloppyPhraseQuery2,
TestMockCharFilter, TestStressNRT, TestNRTReaderWithThreads, TestSearchWithThreads, ThrowInUncaught,
TestIntsRef, TestMultiValuedNumericRangeQuery, TestNewestSegment, TestDocValues, TestIdentityHashSet,
TestBoolean2, TestTermVectorsReader, TestStressIndexing, TestPrefixQuery, TestTermScorer,
TestPositionIncrement, TestIndexWriterWithThreads, TestPackedInts, TestFSTs, TestNorms, TestLookaheadTokenFilter,
TestIndexWriterExceptions, TestNumericRangeQuery32, TestNRTThreads, TestByteSlices, TestDuelingCodecs,
TestAddIndexes, TestIndexWriter, TestIndexWriterMerging, TestLucene40PostingsReader, TestFlushByRamOrCountsPolicy,
TestSearchAfter, TestSloppyPhraseQuery, TestPersistentSnapshotDeletionPolicy, TestSort, TestDirectoryReaderReopen,
TestBufferedIndexInput, TestNRTCachingDirectory, TestIndexWriterForceMerge, TestPagedBytes,
TestFixedBitSet, TestToken, TestCompoundFile, TestSimpleExplanations, TestCustomNorms, TestMockAnalyzer,
TestTieredMergePolicy, TestDocValuesIndexing, TestConcurrentMergeScheduler]
> [junit4:junit4] Completed in 1.80s, 5 tests, 1 error <<< FAILURES!
>
> [...truncated 402 lines...]
> BUILD FAILED
> C:\Users\JenkinsSlave\workspace\Lucene-Solr-4.x-Windows\build.xml:337: The following
error occurred while executing this line:
> C:\Users\JenkinsSlave\workspace\Lucene-Solr-4.x-Windows\build.xml:39: The following error
occurred while executing this line:
> C:\Users\JenkinsSlave\workspace\Lucene-Solr-4.x-Windows\lucene\build.xml:50: The following
error occurred while executing this line:
> C:\Users\JenkinsSlave\workspace\Lucene-Solr-4.x-Windows\lucene\common-build.xml:1163:
The following error occurred while executing this line:
> C:\Users\JenkinsSlave\workspace\Lucene-Solr-4.x-Windows\lucene\common-build.xml:827:
There were test failures: 325 suites, 1862 tests, 1 error, 24 ignored (13 assumptions)
>
> Total time: 7 minutes 25 seconds
> Build step 'Invoke Ant' marked build as failure
> Archiving artifacts
> Recording test results
> Description set: Java: 64bit/jdk1.7.0_09 -XX:+UseSerialGC
> Email was triggered for: Failure
> Sending email for trigger: Failure
>
>
>
>
> ---------------------------------------------------------------------
> To unsubscribe, e-mail: dev-unsubscribe@lucene.apache.org
> For additional commands, e-mail: dev-help@lucene.apache.org

---------------------------------------------------------------------
To unsubscribe, e-mail: dev-unsubscribe@lucene.apache.org
For additional commands, e-mail: dev-help@lucene.apache.org


Mime
View raw message