lucene-dev mailing list archives

Site index · List index
Message view « Date » · « Thread »
Top « Date » · « Thread »
From Simon Willnauer <sim...@apache.org>
Subject Re: [JENKINS] Lucene-Solr-4.x-Linux (32bit/jdk1.7.0_09) - Build # 2276 - Failure!
Date Thu, 08 Nov 2012 22:11:50 GMT
damned IndexOuput#seek - I backed out my original commit and merged
again with overriding seek on RateLimitedIndexOutput...

simon

On Thu, Nov 8, 2012 at 10:38 PM, Policeman Jenkins Server
<jenkins@sd-datasolutions.de> wrote:
> Build: http://jenkins.sd-datasolutions.de/job/Lucene-Solr-4.x-Linux/2276/
> Java: 32bit/jdk1.7.0_09 -server -XX:+UseSerialGC
>
> 9 tests failed.
> REGRESSION:  org.apache.lucene.codecs.lucene3x.TestLucene3xPostingsFormat.testDocsAndFreqs
>
> Error Message:
> Captured an uncaught exception in thread: Thread[id=2115, name=Thread-1678, state=RUNNABLE, group=TGRP-TestLucene3xPostingsFormat]
>
> Stack Trace:
> com.carrotsearch.randomizedtesting.UncaughtExceptionError: Captured an uncaught exception in thread: Thread[id=2115, name=Thread-1678, state=RUNNABLE, group=TGRP-TestLucene3xPostingsFormat]
> Caused by: java.lang.RuntimeException: java.lang.ArrayIndexOutOfBoundsException: 0
>         at __randomizedtesting.SeedInfo.seed([1141F7AAA07B449E]:0)
>         at org.apache.lucene.index.BasePostingsFormatTestCase$TestThread.run(BasePostingsFormatTestCase.java:915)
> Caused by: java.lang.ArrayIndexOutOfBoundsException: 0
>         at org.apache.lucene.util.packed.Packed64SingleBlock$Packed64SingleBlock6.get(Packed64SingleBlock.java:379)
>         at org.apache.lucene.codecs.lucene3x.TermInfosReaderIndex.seekEnum(TermInfosReaderIndex.java:124)
>         at org.apache.lucene.codecs.lucene3x.TermInfosReader.seekEnum(TermInfosReader.java:281)
>         at org.apache.lucene.codecs.lucene3x.TermInfosReader.get(TermInfosReader.java:207)
>         at org.apache.lucene.codecs.lucene3x.TermInfosReader.terms(TermInfosReader.java:352)
>         at org.apache.lucene.codecs.lucene3x.Lucene3xFields$PreTermsEnum.reset(Lucene3xFields.java:681)
>         at org.apache.lucene.codecs.lucene3x.Lucene3xFields$PreTerms.iterator(Lucene3xFields.java:179)
>         at org.apache.lucene.index.BasePostingsFormatTestCase.testTermsOneThread(BasePostingsFormatTestCase.java:982)
>         at org.apache.lucene.index.BasePostingsFormatTestCase.access$100(BasePostingsFormatTestCase.java:81)
>         at org.apache.lucene.index.BasePostingsFormatTestCase$TestThread.run(BasePostingsFormatTestCase.java:913)
>
>
> REGRESSION:  org.apache.lucene.index.TestConcurrentMergeScheduler.testFlushExceptions
>
> Error Message:
> CheckIndex failed
>
> Stack Trace:
> java.lang.RuntimeException: CheckIndex failed
>         at org.apache.lucene.util._TestUtil.checkIndex(_TestUtil.java:203)
>         at org.apache.lucene.store.MockDirectoryWrapper.close(MockDirectoryWrapper.java:589)
>         at org.apache.lucene.index.TestConcurrentMergeScheduler.testFlushExceptions(TestConcurrentMergeScheduler.java:118)
>         at sun.reflect.NativeMethodAccessorImpl.invoke0(Native Method)
>         at sun.reflect.NativeMethodAccessorImpl.invoke(NativeMethodAccessorImpl.java:57)
>         at sun.reflect.DelegatingMethodAccessorImpl.invoke(DelegatingMethodAccessorImpl.java:43)
>         at java.lang.reflect.Method.invoke(Method.java:601)
>         at com.carrotsearch.randomizedtesting.RandomizedRunner.invoke(RandomizedRunner.java:1559)
>         at com.carrotsearch.randomizedtesting.RandomizedRunner.access$600(RandomizedRunner.java:79)
>         at com.carrotsearch.randomizedtesting.RandomizedRunner$6.evaluate(RandomizedRunner.java:737)
>         at com.carrotsearch.randomizedtesting.RandomizedRunner$7.evaluate(RandomizedRunner.java:773)
>         at com.carrotsearch.randomizedtesting.RandomizedRunner$8.evaluate(RandomizedRunner.java:787)
>         at org.apache.lucene.util.TestRuleSetupTeardownChained$1.evaluate(TestRuleSetupTeardownChained.java:50)
>         at org.apache.lucene.util.TestRuleFieldCacheSanity$1.evaluate(TestRuleFieldCacheSanity.java:51)
>         at org.apache.lucene.util.AbstractBeforeAfterRule$1.evaluate(AbstractBeforeAfterRule.java:45)
>         at com.carrotsearch.randomizedtesting.rules.SystemPropertiesInvariantRule$1.evaluate(SystemPropertiesInvariantRule.java:55)
>         at org.apache.lucene.util.TestRuleThreadAndTestName$1.evaluate(TestRuleThreadAndTestName.java:48)
>         at org.apache.lucene.util.TestRuleIgnoreAfterMaxFailures$1.evaluate(TestRuleIgnoreAfterMaxFailures.java:70)
>         at org.apache.lucene.util.TestRuleMarkFailure$1.evaluate(TestRuleMarkFailure.java:48)
>         at com.carrotsearch.randomizedtesting.rules.StatementAdapter.evaluate(StatementAdapter.java:36)
>         at com.carrotsearch.randomizedtesting.ThreadLeakControl$StatementRunner.run(ThreadLeakControl.java:358)
>         at com.carrotsearch.randomizedtesting.ThreadLeakControl.forkTimeoutingTask(ThreadLeakControl.java:782)
>         at com.carrotsearch.randomizedtesting.ThreadLeakControl$3.evaluate(ThreadLeakControl.java:442)
>         at com.carrotsearch.randomizedtesting.RandomizedRunner.runSingleTest(RandomizedRunner.java:746)
>         at com.carrotsearch.randomizedtesting.RandomizedRunner$3.evaluate(RandomizedRunner.java:648)
>         at com.carrotsearch.randomizedtesting.RandomizedRunner$4.evaluate(RandomizedRunner.java:682)
>         at com.carrotsearch.randomizedtesting.RandomizedRunner$5.evaluate(RandomizedRunner.java:693)
>         at org.apache.lucene.util.AbstractBeforeAfterRule$1.evaluate(AbstractBeforeAfterRule.java:45)
>         at org.apache.lucene.util.TestRuleStoreClassName$1.evaluate(TestRuleStoreClassName.java:42)
>         at com.carrotsearch.randomizedtesting.rules.SystemPropertiesInvariantRule$1.evaluate(SystemPropertiesInvariantRule.java:55)
>         at com.carrotsearch.randomizedtesting.rules.NoShadowingOrOverridesOnMethodsRule$1.evaluate(NoShadowingOrOverridesOnMethodsRule.java:39)
>         at com.carrotsearch.randomizedtesting.rules.NoShadowingOrOverridesOnMethodsRule$1.evaluate(NoShadowingOrOverridesOnMethodsRule.java:39)
>         at com.carrotsearch.randomizedtesting.rules.StatementAdapter.evaluate(StatementAdapter.java:36)
>         at org.apache.lucene.util.TestRuleAssertionsRequired$1.evaluate(TestRuleAssertionsRequired.java:43)
>         at org.apache.lucene.util.TestRuleMarkFailure$1.evaluate(TestRuleMarkFailure.java:48)
>         at org.apache.lucene.util.TestRuleIgnoreAfterMaxFailures$1.evaluate(TestRuleIgnoreAfterMaxFailures.java:70)
>         at org.apache.lucene.util.TestRuleIgnoreTestSuites$1.evaluate(TestRuleIgnoreTestSuites.java:55)
>         at com.carrotsearch.randomizedtesting.rules.StatementAdapter.evaluate(StatementAdapter.java:36)
>         at com.carrotsearch.randomizedtesting.ThreadLeakControl$StatementRunner.run(ThreadLeakControl.java:358)
>         at java.lang.Thread.run(Thread.java:722)
>
>
> REGRESSION:  org.apache.lucene.index.TestConcurrentMergeScheduler.testNoExtraFiles
>
> Error Message:
>
>
> Stack Trace:
> java.lang.ArrayIndexOutOfBoundsException
>
>
> REGRESSION:  org.apache.lucene.index.TestDirectoryReader.testBinaryFields
>
> Error Message:
> 0
>
> Stack Trace:
> java.lang.ArrayIndexOutOfBoundsException: 0
>         at __randomizedtesting.SeedInfo.seed([1141F7AAA07B449E:983C4A89971F8A3C]:0)
>         at org.apache.lucene.util.packed.Packed64SingleBlock$Packed64SingleBlock6.get(Packed64SingleBlock.java:379)
>         at org.apache.lucene.codecs.lucene3x.TermInfosReaderIndex.seekEnum(TermInfosReaderIndex.java:124)
>         at org.apache.lucene.codecs.lucene3x.TermInfosReader.seekEnum(TermInfosReader.java:281)
>         at org.apache.lucene.codecs.lucene3x.TermInfosReader.get(TermInfosReader.java:207)
>         at org.apache.lucene.codecs.lucene3x.TermInfosReader.terms(TermInfosReader.java:352)
>         at org.apache.lucene.codecs.lucene3x.Lucene3xFields$PreTermsEnum.reset(Lucene3xFields.java:681)
>         at org.apache.lucene.codecs.lucene3x.Lucene3xFields$PreTerms.iterator(Lucene3xFields.java:179)
>         at org.apache.lucene.index.MultiTerms.iterator(MultiTerms.java:103)
>         at org.apache.lucene.codecs.FieldsConsumer.merge(FieldsConsumer.java:71)
>         at org.apache.lucene.index.SegmentMerger.mergeTerms(SegmentMerger.java:314)
>         at org.apache.lucene.index.SegmentMerger.merge(SegmentMerger.java:107)
>         at org.apache.lucene.index.IndexWriter.mergeMiddle(IndexWriter.java:3675)
>         at org.apache.lucene.index.IndexWriter.merge(IndexWriter.java:3281)
>         at org.apache.lucene.index.SerialMergeScheduler.merge(SerialMergeScheduler.java:40)
>         at org.apache.lucene.index.IndexWriter.maybeMerge(IndexWriter.java:1826)
>         at org.apache.lucene.index.IndexWriter.updateDocument(IndexWriter.java:1463)
>         at org.apache.lucene.index.IndexWriter.addDocument(IndexWriter.java:1127)
>         at org.apache.lucene.index.IndexWriter.addDocument(IndexWriter.java:1108)
>         at org.apache.lucene.index.TestDirectoryReader.addDocumentWithTermVectorFields(TestDirectoryReader.java:539)
>         at org.apache.lucene.index.TestDirectoryReader.testBinaryFields(TestDirectoryReader.java:380)
>         at sun.reflect.NativeMethodAccessorImpl.invoke0(Native Method)
>         at sun.reflect.NativeMethodAccessorImpl.invoke(NativeMethodAccessorImpl.java:57)
>         at sun.reflect.DelegatingMethodAccessorImpl.invoke(DelegatingMethodAccessorImpl.java:43)
>         at java.lang.reflect.Method.invoke(Method.java:601)
>         at com.carrotsearch.randomizedtesting.RandomizedRunner.invoke(RandomizedRunner.java:1559)
>         at com.carrotsearch.randomizedtesting.RandomizedRunner.access$600(RandomizedRunner.java:79)
>         at com.carrotsearch.randomizedtesting.RandomizedRunner$6.evaluate(RandomizedRunner.java:737)
>         at com.carrotsearch.randomizedtesting.RandomizedRunner$7.evaluate(RandomizedRunner.java:773)
>         at com.carrotsearch.randomizedtesting.RandomizedRunner$8.evaluate(RandomizedRunner.java:787)
>         at org.apache.lucene.util.TestRuleSetupTeardownChained$1.evaluate(TestRuleSetupTeardownChained.java:50)
>         at org.apache.lucene.util.TestRuleFieldCacheSanity$1.evaluate(TestRuleFieldCacheSanity.java:51)
>         at org.apache.lucene.util.AbstractBeforeAfterRule$1.evaluate(AbstractBeforeAfterRule.java:45)
>         at com.carrotsearch.randomizedtesting.rules.SystemPropertiesInvariantRule$1.evaluate(SystemPropertiesInvariantRule.java:55)
>         at org.apache.lucene.util.TestRuleThreadAndTestName$1.evaluate(TestRuleThreadAndTestName.java:48)
>         at org.apache.lucene.util.TestRuleIgnoreAfterMaxFailures$1.evaluate(TestRuleIgnoreAfterMaxFailures.java:70)
>         at org.apache.lucene.util.TestRuleMarkFailure$1.evaluate(TestRuleMarkFailure.java:48)
>         at com.carrotsearch.randomizedtesting.rules.StatementAdapter.evaluate(StatementAdapter.java:36)
>         at com.carrotsearch.randomizedtesting.ThreadLeakControl$StatementRunner.run(ThreadLeakControl.java:358)
>         at com.carrotsearch.randomizedtesting.ThreadLeakControl.forkTimeoutingTask(ThreadLeakControl.java:782)
>         at com.carrotsearch.randomizedtesting.ThreadLeakControl$3.evaluate(ThreadLeakControl.java:442)
>         at com.carrotsearch.randomizedtesting.RandomizedRunner.runSingleTest(RandomizedRunner.java:746)
>         at com.carrotsearch.randomizedtesting.RandomizedRunner$3.evaluate(RandomizedRunner.java:648)
>         at com.carrotsearch.randomizedtesting.RandomizedRunner$4.evaluate(RandomizedRunner.java:682)
>         at com.carrotsearch.randomizedtesting.RandomizedRunner$5.evaluate(RandomizedRunner.java:693)
>         at org.apache.lucene.util.AbstractBeforeAfterRule$1.evaluate(AbstractBeforeAfterRule.java:45)
>         at org.apache.lucene.util.TestRuleStoreClassName$1.evaluate(TestRuleStoreClassName.java:42)
>         at com.carrotsearch.randomizedtesting.rules.SystemPropertiesInvariantRule$1.evaluate(SystemPropertiesInvariantRule.java:55)
>         at com.carrotsearch.randomizedtesting.rules.NoShadowingOrOverridesOnMethodsRule$1.evaluate(NoShadowingOrOverridesOnMethodsRule.java:39)
>         at com.carrotsearch.randomizedtesting.rules.NoShadowingOrOverridesOnMethodsRule$1.evaluate(NoShadowingOrOverridesOnMethodsRule.java:39)
>         at com.carrotsearch.randomizedtesting.rules.StatementAdapter.evaluate(StatementAdapter.java:36)
>         at org.apache.lucene.util.TestRuleAssertionsRequired$1.evaluate(TestRuleAssertionsRequired.java:43)
>         at org.apache.lucene.util.TestRuleMarkFailure$1.evaluate(TestRuleMarkFailure.java:48)
>         at org.apache.lucene.util.TestRuleIgnoreAfterMaxFailures$1.evaluate(TestRuleIgnoreAfterMaxFailures.java:70)
>         at org.apache.lucene.util.TestRuleIgnoreTestSuites$1.evaluate(TestRuleIgnoreTestSuites.java:55)
>         at com.carrotsearch.randomizedtesting.rules.StatementAdapter.evaluate(StatementAdapter.java:36)
>         at com.carrotsearch.randomizedtesting.ThreadLeakControl$StatementRunner.run(ThreadLeakControl.java:358)
>         at java.lang.Thread.run(Thread.java:722)
>
>
> REGRESSION:  org.apache.lucene.index.TestMultiFields.testRandom
>
> Error Message:
>
>
> Stack Trace:
> java.lang.ArrayIndexOutOfBoundsException
>
>
> REGRESSION:  org.apache.lucene.index.TestSegmentTermEnum.testTermEnum
>
> Error Message:
>
>
> Stack Trace:
> java.lang.NullPointerException
>         at org.apache.lucene.index.TestSegmentTermEnum.verifyDocFreq(TestSegmentTermEnum.java:112)
>         at org.apache.lucene.index.TestSegmentTermEnum.testTermEnum(TestSegmentTermEnum.java:65)
>         at sun.reflect.NativeMethodAccessorImpl.invoke0(Native Method)
>         at sun.reflect.NativeMethodAccessorImpl.invoke(NativeMethodAccessorImpl.java:57)
>         at sun.reflect.DelegatingMethodAccessorImpl.invoke(DelegatingMethodAccessorImpl.java:43)
>         at java.lang.reflect.Method.invoke(Method.java:601)
>         at com.carrotsearch.randomizedtesting.RandomizedRunner.invoke(RandomizedRunner.java:1559)
>         at com.carrotsearch.randomizedtesting.RandomizedRunner.access$600(RandomizedRunner.java:79)
>         at com.carrotsearch.randomizedtesting.RandomizedRunner$6.evaluate(RandomizedRunner.java:737)
>         at com.carrotsearch.randomizedtesting.RandomizedRunner$7.evaluate(RandomizedRunner.java:773)
>         at com.carrotsearch.randomizedtesting.RandomizedRunner$8.evaluate(RandomizedRunner.java:787)
>         at org.apache.lucene.util.TestRuleSetupTeardownChained$1.evaluate(TestRuleSetupTeardownChained.java:50)
>         at org.apache.lucene.util.TestRuleFieldCacheSanity$1.evaluate(TestRuleFieldCacheSanity.java:51)
>         at org.apache.lucene.util.AbstractBeforeAfterRule$1.evaluate(AbstractBeforeAfterRule.java:45)
>         at com.carrotsearch.randomizedtesting.rules.SystemPropertiesInvariantRule$1.evaluate(SystemPropertiesInvariantRule.java:55)
>         at org.apache.lucene.util.TestRuleThreadAndTestName$1.evaluate(TestRuleThreadAndTestName.java:48)
>         at org.apache.lucene.util.TestRuleIgnoreAfterMaxFailures$1.evaluate(TestRuleIgnoreAfterMaxFailures.java:70)
>         at org.apache.lucene.util.TestRuleMarkFailure$1.evaluate(TestRuleMarkFailure.java:48)
>         at com.carrotsearch.randomizedtesting.rules.StatementAdapter.evaluate(StatementAdapter.java:36)
>         at com.carrotsearch.randomizedtesting.ThreadLeakControl$StatementRunner.run(ThreadLeakControl.java:358)
>         at com.carrotsearch.randomizedtesting.ThreadLeakControl.forkTimeoutingTask(ThreadLeakControl.java:782)
>         at com.carrotsearch.randomizedtesting.ThreadLeakControl$3.evaluate(ThreadLeakControl.java:442)
>         at com.carrotsearch.randomizedtesting.RandomizedRunner.runSingleTest(RandomizedRunner.java:746)
>         at com.carrotsearch.randomizedtesting.RandomizedRunner$3.evaluate(RandomizedRunner.java:648)
>         at com.carrotsearch.randomizedtesting.RandomizedRunner$4.evaluate(RandomizedRunner.java:682)
>         at com.carrotsearch.randomizedtesting.RandomizedRunner$5.evaluate(RandomizedRunner.java:693)
>         at org.apache.lucene.util.AbstractBeforeAfterRule$1.evaluate(AbstractBeforeAfterRule.java:45)
>         at org.apache.lucene.util.TestRuleStoreClassName$1.evaluate(TestRuleStoreClassName.java:42)
>         at com.carrotsearch.randomizedtesting.rules.SystemPropertiesInvariantRule$1.evaluate(SystemPropertiesInvariantRule.java:55)
>         at com.carrotsearch.randomizedtesting.rules.NoShadowingOrOverridesOnMethodsRule$1.evaluate(NoShadowingOrOverridesOnMethodsRule.java:39)
>         at com.carrotsearch.randomizedtesting.rules.NoShadowingOrOverridesOnMethodsRule$1.evaluate(NoShadowingOrOverridesOnMethodsRule.java:39)
>         at com.carrotsearch.randomizedtesting.rules.StatementAdapter.evaluate(StatementAdapter.java:36)
>         at org.apache.lucene.util.TestRuleAssertionsRequired$1.evaluate(TestRuleAssertionsRequired.java:43)
>         at org.apache.lucene.util.TestRuleMarkFailure$1.evaluate(TestRuleMarkFailure.java:48)
>         at org.apache.lucene.util.TestRuleIgnoreAfterMaxFailures$1.evaluate(TestRuleIgnoreAfterMaxFailures.java:70)
>         at org.apache.lucene.util.TestRuleIgnoreTestSuites$1.evaluate(TestRuleIgnoreTestSuites.java:55)
>         at com.carrotsearch.randomizedtesting.rules.StatementAdapter.evaluate(StatementAdapter.java:36)
>         at com.carrotsearch.randomizedtesting.ThreadLeakControl$StatementRunner.run(ThreadLeakControl.java:358)
>         at java.lang.Thread.run(Thread.java:722)
>
>
> REGRESSION:  org.apache.lucene.index.TestStressIndexing2.testMultiConfig
>
> Error Message:
> Captured an uncaught exception in thread: Thread[id=1495, name=Thread-1242, state=RUNNABLE, group=TGRP-TestStressIndexing2]
>
> Stack Trace:
> com.carrotsearch.randomizedtesting.UncaughtExceptionError: Captured an uncaught exception in thread: Thread[id=1495, name=Thread-1242, state=RUNNABLE, group=TGRP-TestStressIndexing2]
> Caused by: junit.framework.AssertionFailedError: java.lang.ArrayIndexOutOfBoundsException: 0
>         at __randomizedtesting.SeedInfo.seed([1141F7AAA07B449E]:0)
>         at junit.framework.Assert.fail(Assert.java:50)
>         at org.apache.lucene.index.TestStressIndexing2$IndexingThread.run(TestStressIndexing2.java:880)
>
>
> REGRESSION:  org.apache.lucene.search.TestAutomatonQueryUnicode.testSortOrder
>
> Error Message:
>
>
> Stack Trace:
> java.lang.ArrayIndexOutOfBoundsException
>
>
> REGRESSION:  org.apache.lucene.search.TestDisjunctionMaxQuery.testSkipToFirsttimeMiss
>
> Error Message:
>
>
> Stack Trace:
> java.lang.NullPointerException
>         at __randomizedtesting.SeedInfo.seed([1141F7AAA07B449E:4F39571625C2F6E2]:0)
>         at org.apache.lucene.search.TestDisjunctionMaxQuery.testSkipToFirsttimeMiss(TestDisjunctionMaxQuery.java:178)
>         at sun.reflect.NativeMethodAccessorImpl.invoke0(Native Method)
>         at sun.reflect.NativeMethodAccessorImpl.invoke(NativeMethodAccessorImpl.java:57)
>         at sun.reflect.DelegatingMethodAccessorImpl.invoke(DelegatingMethodAccessorImpl.java:43)
>         at java.lang.reflect.Method.invoke(Method.java:601)
>         at com.carrotsearch.randomizedtesting.RandomizedRunner.invoke(RandomizedRunner.java:1559)
>         at com.carrotsearch.randomizedtesting.RandomizedRunner.access$600(RandomizedRunner.java:79)
>         at com.carrotsearch.randomizedtesting.RandomizedRunner$6.evaluate(RandomizedRunner.java:737)
>         at com.carrotsearch.randomizedtesting.RandomizedRunner$7.evaluate(RandomizedRunner.java:773)
>         at com.carrotsearch.randomizedtesting.RandomizedRunner$8.evaluate(RandomizedRunner.java:787)
>         at org.apache.lucene.util.TestRuleSetupTeardownChained$1.evaluate(TestRuleSetupTeardownChained.java:50)
>         at org.apache.lucene.util.TestRuleFieldCacheSanity$1.evaluate(TestRuleFieldCacheSanity.java:51)
>         at org.apache.lucene.util.AbstractBeforeAfterRule$1.evaluate(AbstractBeforeAfterRule.java:45)
>         at com.carrotsearch.randomizedtesting.rules.SystemPropertiesInvariantRule$1.evaluate(SystemPropertiesInvariantRule.java:55)
>         at org.apache.lucene.util.TestRuleThreadAndTestName$1.evaluate(TestRuleThreadAndTestName.java:48)
>         at org.apache.lucene.util.TestRuleIgnoreAfterMaxFailures$1.evaluate(TestRuleIgnoreAfterMaxFailures.java:70)
>         at org.apache.lucene.util.TestRuleMarkFailure$1.evaluate(TestRuleMarkFailure.java:48)
>         at com.carrotsearch.randomizedtesting.rules.StatementAdapter.evaluate(StatementAdapter.java:36)
>         at com.carrotsearch.randomizedtesting.ThreadLeakControl$StatementRunner.run(ThreadLeakControl.java:358)
>         at com.carrotsearch.randomizedtesting.ThreadLeakControl.forkTimeoutingTask(ThreadLeakControl.java:782)
>         at com.carrotsearch.randomizedtesting.ThreadLeakControl$3.evaluate(ThreadLeakControl.java:442)
>         at com.carrotsearch.randomizedtesting.RandomizedRunner.runSingleTest(RandomizedRunner.java:746)
>         at com.carrotsearch.randomizedtesting.RandomizedRunner$3.evaluate(RandomizedRunner.java:648)
>         at com.carrotsearch.randomizedtesting.RandomizedRunner$4.evaluate(RandomizedRunner.java:682)
>         at com.carrotsearch.randomizedtesting.RandomizedRunner$5.evaluate(RandomizedRunner.java:693)
>         at org.apache.lucene.util.AbstractBeforeAfterRule$1.evaluate(AbstractBeforeAfterRule.java:45)
>         at org.apache.lucene.util.TestRuleStoreClassName$1.evaluate(TestRuleStoreClassName.java:42)
>         at com.carrotsearch.randomizedtesting.rules.SystemPropertiesInvariantRule$1.evaluate(SystemPropertiesInvariantRule.java:55)
>         at com.carrotsearch.randomizedtesting.rules.NoShadowingOrOverridesOnMethodsRule$1.evaluate(NoShadowingOrOverridesOnMethodsRule.java:39)
>         at com.carrotsearch.randomizedtesting.rules.NoShadowingOrOverridesOnMethodsRule$1.evaluate(NoShadowingOrOverridesOnMethodsRule.java:39)
>         at com.carrotsearch.randomizedtesting.rules.StatementAdapter.evaluate(StatementAdapter.java:36)
>         at org.apache.lucene.util.TestRuleAssertionsRequired$1.evaluate(TestRuleAssertionsRequired.java:43)
>         at org.apache.lucene.util.TestRuleMarkFailure$1.evaluate(TestRuleMarkFailure.java:48)
>         at org.apache.lucene.util.TestRuleIgnoreAfterMaxFailures$1.evaluate(TestRuleIgnoreAfterMaxFailures.java:70)
>         at org.apache.lucene.util.TestRuleIgnoreTestSuites$1.evaluate(TestRuleIgnoreTestSuites.java:55)
>         at com.carrotsearch.randomizedtesting.rules.StatementAdapter.evaluate(StatementAdapter.java:36)
>         at com.carrotsearch.randomizedtesting.ThreadLeakControl$StatementRunner.run(ThreadLeakControl.java:358)
>         at java.lang.Thread.run(Thread.java:722)
>
>
>
>
> Build Log:
> [...truncated 474 lines...]
> [junit4:junit4] Suite: org.apache.lucene.index.TestDirectoryReader
> [junit4:junit4]   2> NOTE: reproduce with: ant test  -Dtestcase=TestDirectoryReader -Dtests.method=testBinaryFields -Dtests.seed=1141F7AAA07B449E -Dtests.multiplier=3 -Dtests.slow=true -Dtests.locale=ar_KW -Dtests.timezone=Brazil/East -Dtests.file.encoding=US-ASCII
> [junit4:junit4] ERROR   0.16s J1 | TestDirectoryReader.testBinaryFields <<<
> [junit4:junit4]    > Throwable #1: java.lang.ArrayIndexOutOfBoundsException: 0
> [junit4:junit4]    >    at __randomizedtesting.SeedInfo.seed([1141F7AAA07B449E:983C4A89971F8A3C]:0)
> [junit4:junit4]    >    at org.apache.lucene.util.packed.Packed64SingleBlock$Packed64SingleBlock6.get(Packed64SingleBlock.java:379)
> [junit4:junit4]    >    at org.apache.lucene.codecs.lucene3x.TermInfosReaderIndex.seekEnum(TermInfosReaderIndex.java:124)
> [junit4:junit4]    >    at org.apache.lucene.codecs.lucene3x.TermInfosReader.seekEnum(TermInfosReader.java:281)
> [junit4:junit4]    >    at org.apache.lucene.codecs.lucene3x.TermInfosReader.get(TermInfosReader.java:207)
> [junit4:junit4]    >    at org.apache.lucene.codecs.lucene3x.TermInfosReader.terms(TermInfosReader.java:352)
> [junit4:junit4]    >    at org.apache.lucene.codecs.lucene3x.Lucene3xFields$PreTermsEnum.reset(Lucene3xFields.java:681)
> [junit4:junit4]    >    at org.apache.lucene.codecs.lucene3x.Lucene3xFields$PreTerms.iterator(Lucene3xFields.java:179)
> [junit4:junit4]    >    at org.apache.lucene.index.MultiTerms.iterator(MultiTerms.java:103)
> [junit4:junit4]    >    at org.apache.lucene.codecs.FieldsConsumer.merge(FieldsConsumer.java:71)
> [junit4:junit4]    >    at org.apache.lucene.index.SegmentMerger.mergeTerms(SegmentMerger.java:314)
> [junit4:junit4]    >    at org.apache.lucene.index.SegmentMerger.merge(SegmentMerger.java:107)
> [junit4:junit4]    >    at org.apache.lucene.index.IndexWriter.mergeMiddle(IndexWriter.java:3675)
> [junit4:junit4]    >    at org.apache.lucene.index.IndexWriter.merge(IndexWriter.java:3281)
> [junit4:junit4]    >    at org.apache.lucene.index.SerialMergeScheduler.merge(SerialMergeScheduler.java:40)
> [junit4:junit4]    >    at org.apache.lucene.index.IndexWriter.maybeMerge(IndexWriter.java:1826)
> [junit4:junit4]    >    at org.apache.lucene.index.IndexWriter.updateDocument(IndexWriter.java:1463)
> [junit4:junit4]    >    at org.apache.lucene.index.IndexWriter.addDocument(IndexWriter.java:1127)
> [junit4:junit4]    >    at org.apache.lucene.index.IndexWriter.addDocument(IndexWriter.java:1108)
> [junit4:junit4]    >    at org.apache.lucene.index.TestDirectoryReader.addDocumentWithTermVectorFields(TestDirectoryReader.java:539)
> [junit4:junit4]    >    at org.apache.lucene.index.TestDirectoryReader.testBinaryFields(TestDirectoryReader.java:380)
> [junit4:junit4]    >    at sun.reflect.NativeMethodAccessorImpl.invoke0(Native Method)
> [junit4:junit4]    >    at sun.reflect.NativeMethodAccessorImpl.invoke(NativeMethodAccessorImpl.java:57)
> [junit4:junit4]    >    at sun.reflect.DelegatingMethodAccessorImpl.invoke(DelegatingMethodAccessorImpl.java:43)
> [junit4:junit4]    >    at java.lang.reflect.Method.invoke(Method.java:601)
> [junit4:junit4]    >    at com.carrotsearch.randomizedtesting.RandomizedRunner.invoke(RandomizedRunner.java:1559)
> [junit4:junit4]    >    at com.carrotsearch.randomizedtesting.RandomizedRunner.access$600(RandomizedRunner.java:79)
> [junit4:junit4]    >    at com.carrotsearch.randomizedtesting.RandomizedRunner$6.evaluate(RandomizedRunner.java:737)
> [junit4:junit4]    >    at com.carrotsearch.randomizedtesting.RandomizedRunner$7.evaluate(RandomizedRunner.java:773)
> [junit4:junit4]    >    at com.carrotsearch.randomizedtesting.RandomizedRunner$8.evaluate(RandomizedRunner.java:787)
> [junit4:junit4]    >    at org.apache.lucene.util.TestRuleSetupTeardownChained$1.evaluate(TestRuleSetupTeardownChained.java:50)
> [junit4:junit4]    >    at org.apache.lucene.util.TestRuleFieldCacheSanity$1.evaluate(TestRuleFieldCacheSanity.java:51)
> [junit4:junit4]    >    at org.apache.lucene.util.AbstractBeforeAfterRule$1.evaluate(AbstractBeforeAfterRule.java:45)
> [junit4:junit4]    >    at com.carrotsearch.randomizedtesting.rules.SystemPropertiesInvariantRule$1.evaluate(SystemPropertiesInvariantRule.java:55)
> [junit4:junit4]    >    at org.apache.lucene.util.TestRuleThreadAndTestName$1.evaluate(TestRuleThreadAndTestName.java:48)
> [junit4:junit4]    >    at org.apache.lucene.util.TestRuleIgnoreAfterMaxFailures$1.evaluate(TestRuleIgnoreAfterMaxFailures.java:70)
> [junit4:junit4]    >    at org.apache.lucene.util.TestRuleMarkFailure$1.evaluate(TestRuleMarkFailure.java:48)
> [junit4:junit4]    >    at com.carrotsearch.randomizedtesting.rules.StatementAdapter.evaluate(StatementAdapter.java:36)
> [junit4:junit4]    >    at com.carrotsearch.randomizedtesting.ThreadLeakControl$StatementRunner.run(ThreadLeakControl.java:358)
> [junit4:junit4]    >    at com.carrotsearch.randomizedtesting.ThreadLeakControl.forkTimeoutingTask(ThreadLeakControl.java:782)
> [junit4:junit4]    >    at com.carrotsearch.randomizedtesting.ThreadLeakControl$3.evaluate(ThreadLeakControl.java:442)
> [junit4:junit4]    >    at com.carrotsearch.randomizedtesting.RandomizedRunner.runSingleTest(RandomizedRunner.java:746)
> [junit4:junit4]    >    at com.carrotsearch.randomizedtesting.RandomizedRunner$3.evaluate(RandomizedRunner.java:648)
> [junit4:junit4]    >    at com.carrotsearch.randomizedtesting.RandomizedRunner$4.evaluate(RandomizedRunner.java:682)
> [junit4:junit4]    >    at com.carrotsearch.randomizedtesting.RandomizedRunner$5.evaluate(RandomizedRunner.java:693)
> [junit4:junit4]    >    at org.apache.lucene.util.AbstractBeforeAfterRule$1.evaluate(AbstractBeforeAfterRule.java:45)
> [junit4:junit4]    >    at org.apache.lucene.util.TestRuleStoreClassName$1.evaluate(TestRuleStoreClassName.java:42)
> [junit4:junit4]    >    at com.carrotsearch.randomizedtesting.rules.SystemPropertiesInvariantRule$1.evaluate(SystemPropertiesInvariantRule.java:55)
> [junit4:junit4]    >    at com.carrotsearch.randomizedtesting.rules.NoShadowingOrOverridesOnMethodsRule$1.evaluate(NoShadowingOrOverridesOnMethodsRule.java:39)
> [junit4:junit4]    >    at com.carrotsearch.randomizedtesting.rules.NoShadowingOrOverridesOnMethodsRule$1.evaluate(NoShadowingOrOverridesOnMethodsRule.java:39)
> [junit4:junit4]    >    at com.carrotsearch.randomizedtesting.rules.StatementAdapter.evaluate(StatementAdapter.java:36)
> [junit4:junit4]    >    at org.apache.lucene.util.TestRuleAssertionsRequired$1.evaluate(TestRuleAssertionsRequired.java:43)
> [junit4:junit4]    >    at org.apache.lucene.util.TestRuleMarkFailure$1.evaluate(TestRuleMarkFailure.java:48)
> [junit4:junit4]    >    at org.apache.lucene.util.TestRuleIgnoreAfterMaxFailures$1.evaluate(TestRuleIgnoreAfterMaxFailures.java:70)
> [junit4:junit4]    >    at org.apache.lucene.util.TestRuleIgnoreTestSuites$1.evaluate(TestRuleIgnoreTestSuites.java:55)
> [junit4:junit4]    >    at com.carrotsearch.randomizedtesting.rules.StatementAdapter.evaluate(StatementAdapter.java:36)
> [junit4:junit4]    >    at com.carrotsearch.randomizedtesting.ThreadLeakControl$StatementRunner.run(ThreadLeakControl.java:358)
> [junit4:junit4]    >    at java.lang.Thread.run(Thread.java:722)
> [junit4:junit4] IGNOR/A 0.03s J1 | TestDirectoryReader.testTotalTermFreqCached
> [junit4:junit4]    > Assumption #1: got: <false>, expected: is <true>
> [junit4:junit4]   2> NOTE: test params are: codec=Lucene3x, sim=RandomSimilarityProvider(queryNorm=false,coord=no): {f=DFR I(n)L1, body=DFR I(F)L3(800.0), text=DFR I(ne)B3(800.0), tvposition=DFR G3(800.0), text2=DFR I(n)Z(0.3), unstored2=DFR I(F)Z(0.3), unstored=DFR I(F)LZ(0.3), number=DFR I(n)Z(0.3), field=DFR I(ne)B1, content=DFR I(ne)L1, termvector=DFR I(F)L1, tvnot=DFR I(F)B3(800.0), tvpositionoffset=DFR GL1, tvoffset=DFR I(ne)B3(800.0)}, locale=ar_KW, timezone=Brazil/East
> [junit4:junit4]   2> NOTE: Linux 3.2.0-32-generic i386/Oracle Corporation 1.7.0_09 (32-bit)/cpus=8,threads=1,free=17881056,total=110743552
> [junit4:junit4]   2> NOTE: All tests run in this JVM: [TestPositionIncrement, TestBooleanMinShouldMatch, TestBagOfPostings, TestCloseableThreadLocal, TestToken, TestNumericRangeQuery64, TestSearch, TestTermVectorsReader, TestMultiTermQueryRewrites, TestByteArrayDataInput, TestRecyclingIntBlockAllocator, TestOmitPositions, TestPerFieldPostingsFormat, TestNorms, TestParallelAtomicReader, TestRAMDirectory, TestUniqueTermCount, TestRegexpQuery, TestConjunctions, TestNeverDelete, TestFieldCacheTermsFilter, TestRegexpRandom, TestTermsEnum, TestRollback, TestNoMergePolicy, TestTermRangeFilter, TestBinaryDocument, TestSpanSearchEquivalence, TestPostingsFormat, TestAddIndexes, TestDateTools, TestIndexWriterConfig, TestPositiveScoresOnlyCollector, TestTermVectorsWriter, TestNearSpansOrdered, TestDirectoryReader]
> [junit4:junit4] Completed on J1 in 1.92s, 24 tests, 1 error, 1 skipped <<< FAILURES!
>
> [...truncated 225 lines...]
> [junit4:junit4] Suite: org.apache.lucene.index.TestStressIndexing2
> [junit4:junit4]   2> java.lang.ArrayIndexOutOfBoundsException: 0
> [junit4:junit4]   2>    at org.apache.lucene.util.PagedBytes$PagedBytesDataInput.readByte(PagedBytes.java:442)
> [junit4:junit4]   2>    at org.apache.lucene.store.DataInput.readVInt(DataInput.java:108)
> [junit4:junit4]   2>    at org.apache.lucene.codecs.lucene3x.TermInfosReaderIndex.compareField(TermInfosReaderIndex.java:255)
> [junit4:junit4]   2>    at org.apache.lucene.codecs.lucene3x.TermInfosReaderIndex.compareTo(TermInfosReaderIndex.java:231)
> [junit4:junit4]   2>    at org.apache.lucene.codecs.lucene3x.TermInfosReaderIndex.getIndexOffset(TermInfosReaderIndex.java:162)
> [junit4:junit4]   2>    at org.apache.lucene.codecs.lucene3x.TermInfosReader.seekEnum(TermInfosReader.java:278)
> [junit4:junit4]   2>    at org.apache.lucene.codecs.lucene3x.TermInfosReader.get(TermInfosReader.java:207)
> [junit4:junit4]   2>    at org.apache.lucene.codecs.lucene3x.TermInfosReader.terms(TermInfosReader.java:352)
> [junit4:junit4]   2>    at org.apache.lucene.codecs.lucene3x.Lucene3xFields$PreTermsEnum.reset(Lucene3xFields.java:681)
> [junit4:junit4]   2>    at org.apache.lucene.codecs.lucene3x.Lucene3xFields$PreTerms.iterator(Lucene3xFields.java:179)
> [junit4:junit4]   2>    at org.apache.lucene.index.BufferedDeletesStream.applyTermDeletes(BufferedDeletesStream.java:385)
> [junit4:junit4]   2>    at org.apache.lucene.index.BufferedDeletesStream.applyDeletes(BufferedDeletesStream.java:271)
> [junit4:junit4]   2>    at org.apache.lucene.index.IndexWriter._mergeInit(IndexWriter.java:3445)
> [junit4:junit4]   2>    at org.apache.lucene.index.IndexWriter.mergeInit(IndexWriter.java:3407)
> [junit4:junit4]   2>    at org.apache.lucene.index.ConcurrentMergeScheduler.merge(ConcurrentMergeScheduler.java:366)
> [junit4:junit4]   2>    at org.apache.lucene.index.IndexWriter.maybeMerge(IndexWriter.java:1826)
> [junit4:junit4]   2>    at org.apache.lucene.index.IndexWriter.updateDocument(IndexWriter.java:1463)
> [junit4:junit4]   2>    at org.apache.lucene.index.IndexWriter.updateDocument(IndexWriter.java:1424)
> [junit4:junit4]   2>    at org.apache.lucene.index.TestStressIndexing2$IndexingThread.indexDoc(TestStressIndexing2.java:841)
> [junit4:junit4]   2>    at org.apache.lucene.index.TestStressIndexing2$IndexingThread.run(TestStressIndexing2.java:875)
> [junit4:junit4]   2> java.lang.AssertionError: Packet and Segments deletegen can only match on a segment private del packet gen=7
> [junit4:junit4]   2>    at org.apache.lucene.index.BufferedDeletesStream.applyDeletes(BufferedDeletesStream.java:208)
> [junit4:junit4]   2>    at org.apache.lucene.index.IndexWriter._mergeInit(IndexWriter.java:3445)
> [junit4:junit4]   2>    at org.apache.lucene.index.IndexWriter.mergeInit(IndexWriter.java:3407)
> [junit4:junit4]   2>    at org.apache.lucene.index.ConcurrentMergeScheduler.merge(ConcurrentMergeScheduler.java:366)
> [junit4:junit4]   2>    at org.apache.lucene.index.IndexWriter.maybeMerge(IndexWriter.java:1826)
> [junit4:junit4]   2>    at org.apache.lucene.index.IndexWriter.updateDocument(IndexWriter.java:1463)
> [junit4:junit4]   2>    at org.apache.lucene.index.IndexWriter.updateDocument(IndexWriter.java:1424)
> [junit4:junit4]   2>    at org.apache.lucene.index.TestStressIndexing2$IndexingThread.indexDoc(TestStressIndexing2.java:841)
> [junit4:junit4]   2>    at org.apache.lucene.index.TestStressIndexing2$IndexingThread.run(TestStressIndexing2.java:875)
> [junit4:junit4]   2> java.lang.AssertionError: Packet and Segments deletegen can only match on a segment private del packet gen=7
> [junit4:junit4]   2>    at org.apache.lucene.index.BufferedDeletesStream.applyDeletes(BufferedDeletesStream.java:208)
> [junit4:junit4]   2>    at org.apache.lucene.index.IndexWriter._mergeInit(IndexWriter.java:3445)
> [junit4:junit4]   2>    at org.apache.lucene.index.IndexWriter.mergeInit(IndexWriter.java:3407)
> [junit4:junit4]   2>    at org.apache.lucene.index.ConcurrentMergeScheduler.merge(ConcurrentMergeScheduler.java:366)
> [junit4:junit4]   2>    at org.apache.lucene.index.IndexWriter.maybeMerge(IndexWriter.java:1826)
> [junit4:junit4]   2>    at org.apache.lucene.index.IndexWriter.updateDocument(IndexWriter.java:1463)
> [junit4:junit4]   2>    at org.apache.lucene.index.IndexWriter.updateDocument(IndexWriter.java:1424)
> [junit4:junit4]   2>    at org.apache.lucene.index.TestStressIndexing2$IndexingThread.indexDoc(TestStressIndexing2.java:841)
> [junit4:junit4]   2>    at org.apache.lucene.index.TestStressIndexing2$IndexingThread.run(TestStressIndexing2.java:875)
> [junit4:junit4]   2> Kas 09, 2012 3:35:39 AM com.carrotsearch.randomizedtesting.RandomizedRunner$QueueUncaughtExceptionsHandler uncaughtException
> [junit4:junit4]   2> WARNING: Uncaught exception in thread: Thread[Thread-1240,5,TGRP-TestStressIndexing2]
> [junit4:junit4]   2> junit.framework.AssertionFailedError: java.lang.AssertionError: Packet and Segments deletegen can only match on a segment private del packet gen=7
> [junit4:junit4]   2>    at __randomizedtesting.SeedInfo.seed([1141F7AAA07B449E]:0)
> [junit4:junit4]   2>    at junit.framework.Assert.fail(Assert.java:50)
> [junit4:junit4]   2>    at org.apache.lucene.index.TestStressIndexing2$IndexingThread.run(TestStressIndexing2.java:880)
> [junit4:junit4]   2>
> [junit4:junit4]   2> Kas 09, 2012 3:35:39 AM com.carrotsearch.randomizedtesting.RandomizedRunner$QueueUncaughtExceptionsHandler uncaughtException
> [junit4:junit4]   2> WARNING: Uncaught exception in thread: Thread[Thread-1239,5,TGRP-TestStressIndexing2]
> [junit4:junit4]   2> junit.framework.AssertionFailedError: java.lang.AssertionError: Packet and Segments deletegen can only match on a segment private del packet gen=7
> [junit4:junit4]   2>    at __randomizedtesting.SeedInfo.seed([1141F7AAA07B449E]:0)
> [junit4:junit4]   2>    at junit.framework.Assert.fail(Assert.java:50)
> [junit4:junit4]   2>    at org.apache.lucene.index.TestStressIndexing2$IndexingThread.run(TestStressIndexing2.java:880)
> [junit4:junit4]   2>
> [junit4:junit4]   2> Kas 09, 2012 3:35:39 AM com.carrotsearch.randomizedtesting.RandomizedRunner$QueueUncaughtExceptionsHandler uncaughtException
> [junit4:junit4]   2> WARNING: Uncaught exception in thread: Thread[Thread-1242,5,TGRP-TestStressIndexing2]
> [junit4:junit4]   2> junit.framework.AssertionFailedError: java.lang.ArrayIndexOutOfBoundsException: 0
> [junit4:junit4]   2>    at __randomizedtesting.SeedInfo.seed([1141F7AAA07B449E]:0)
> [junit4:junit4]   2>    at junit.framework.Assert.fail(Assert.java:50)
> [junit4:junit4]   2>    at org.apache.lucene.index.TestStressIndexing2$IndexingThread.run(TestStressIndexing2.java:880)
> [junit4:junit4]   2>
> [junit4:junit4]   2> NOTE: reproduce with: ant test  -Dtestcase=TestStressIndexing2 -Dtests.method=testMultiConfig -Dtests.seed=1141F7AAA07B449E -Dtests.multiplier=3 -Dtests.slow=true -Dtests.locale=tr -Dtests.timezone=Asia/Thimbu -Dtests.file.encoding=US-ASCII
> [junit4:junit4] ERROR   0.25s J0 | TestStressIndexing2.testMultiConfig <<<
> [junit4:junit4]    > Throwable #1: java.lang.AssertionError: Packet and Segments deletegen can only match on a segment private del packet gen=7
> [junit4:junit4]    >    at org.apache.lucene.index.BufferedDeletesStream.applyDeletes(BufferedDeletesStream.java:208)
> [junit4:junit4]    >    at org.apache.lucene.index.IndexWriter.applyAllDeletes(IndexWriter.java:2939)
> [junit4:junit4]    >    at org.apache.lucene.index.IndexWriter.maybeApplyDeletes(IndexWriter.java:2930)
> [junit4:junit4]    >    at org.apache.lucene.index.IndexWriter.doFlush(IndexWriter.java:2903)
> [junit4:junit4]    >    at org.apache.lucene.index.IndexWriter.flush(IndexWriter.java:2872)
> [junit4:junit4]    >    at org.apache.lucene.index.IndexWriter.closeInternal(IndexWriter.java:907)
> [junit4:junit4]    >    at org.apache.lucene.index.IndexWriter.close(IndexWriter.java:862)
> [junit4:junit4]    >    at org.apache.lucene.index.IndexWriter.close(IndexWriter.java:824)
> [junit4:junit4]    >    at org.apache.lucene.index.TestStressIndexing2.indexRandom(TestStressIndexing2.java:230)
> [junit4:junit4]    >    at org.apache.lucene.index.TestStressIndexing2.testMultiConfig(TestStressIndexing2.java:119)
> [junit4:junit4]    >    at sun.reflect.NativeMethodAccessorImpl.invoke0(Native Method)
> [junit4:junit4]    >    at sun.reflect.NativeMethodAccessorImpl.invoke(NativeMethodAccessorImpl.java:57)
> [junit4:junit4]    >    at sun.reflect.DelegatingMethodAccessorImpl.invoke(DelegatingMethodAccessorImpl.java:43)
> [junit4:junit4]    >    at java.lang.reflect.Method.invoke(Method.java:601)
> [junit4:junit4]    >    at com.carrotsearch.randomizedtesting.RandomizedRunner.invoke(RandomizedRunner.java:1559)
> [junit4:junit4]    >    at com.carrotsearch.randomizedtesting.RandomizedRunner.access$600(RandomizedRunner.java:79)
> [junit4:junit4]    >    at com.carrotsearch.randomizedtesting.RandomizedRunner$6.evaluate(RandomizedRunner.java:737)
> [junit4:junit4]    >    at com.carrotsearch.randomizedtesting.RandomizedRunner$7.evaluate(RandomizedRunner.java:773)
> [junit4:junit4]    >    at com.carrotsearch.randomizedtesting.RandomizedRunner$8.evaluate(RandomizedRunner.java:787)
> [junit4:junit4]    >    at org.apache.lucene.util.TestRuleSetupTeardownChained$1.evaluate(TestRuleSetupTeardownChained.java:50)
> [junit4:junit4]    >    at org.apache.lucene.util.TestRuleFieldCacheSanity$1.evaluate(TestRuleFieldCacheSanity.java:51)
> [junit4:junit4]    >    at org.apache.lucene.util.AbstractBeforeAfterRule$1.evaluate(AbstractBeforeAfterRule.java:45)
> [junit4:junit4]    >    at com.carrotsearch.randomizedtesting.rules.SystemPropertiesInvariantRule$1.evaluate(SystemPropertiesInvariantRule.java:55)
> [junit4:junit4]    >    at org.apache.lucene.util.TestRuleThreadAndTestName$1.evaluate(TestRuleThreadAndTestName.java:48)
> [junit4:junit4]    >    at org.apache.lucene.util.TestRuleIgnoreAfterMaxFailures$1.evaluate(TestRuleIgnoreAfterMaxFailures.java:70)
> [junit4:junit4]    >    at org.apache.lucene.util.TestRuleMarkFailure$1.evaluate(TestRuleMarkFailure.java:48)
> [junit4:junit4]    >    at com.carrotsearch.randomizedtesting.rules.StatementAdapter.evaluate(StatementAdapter.java:36)
> [junit4:junit4]    >    at com.carrotsearch.randomizedtesting.ThreadLeakControl$StatementRunner.run(ThreadLeakControl.java:358)
> [junit4:junit4]    >    at com.carrotsearch.randomizedtesting.ThreadLeakControl.forkTimeoutingTask(ThreadLeakControl.java:782)
> [junit4:junit4]    >    at com.carrotsearch.randomizedtesting.ThreadLeakControl$3.evaluate(ThreadLeakControl.java:442)
> [junit4:junit4]    >    at com.carrotsearch.randomizedtesting.RandomizedRunner.runSingleTest(RandomizedRunner.java:746)
> [junit4:junit4]    >    at com.carrotsearch.randomizedtesting.RandomizedRunner$3.evaluate(RandomizedRunner.java:648)
> [junit4:junit4]    >    at com.carrotsearch.randomizedtesting.RandomizedRunner$4.evaluate(RandomizedRunner.java:682)
> [junit4:junit4]    >    at com.carrotsearch.randomizedtesting.RandomizedRunner$5.evaluate(RandomizedRunner.java:693)
> [junit4:junit4]    >    at org.apache.lucene.util.AbstractBeforeAfterRule$1.evaluate(AbstractBeforeAfterRule.java:45)
> [junit4:junit4]    >    at org.apache.lucene.util.TestRuleStoreClassName$1.evaluate(TestRuleStoreClassName.java:42)
> [junit4:junit4]    >    at com.carrotsearch.randomizedtesting.rules.SystemPropertiesInvariantRule$1.evaluate(SystemPropertiesInvariantRule.java:55)
> [junit4:junit4]    >    at com.carrotsearch.randomizedtesting.rules.NoShadowingOrOverridesOnMethodsRule$1.evaluate(NoShadowingOrOverridesOnMethodsRule.java:39)
> [junit4:junit4]    >    at com.carrotsearch.randomizedtesting.rules.NoShadowingOrOverridesOnMethodsRule$1.evaluate(NoShadowingOrOverridesOnMethodsRule.java:39)
> [junit4:junit4]    >    at com.carrotsearch.randomizedtesting.rules.StatementAdapter.evaluate(StatementAdapter.java:36)
> [junit4:junit4]    >    at org.apache.lucene.util.TestRuleAssertionsRequired$1.evaluate(TestRuleAssertionsRequired.java:43)
> [junit4:junit4]    >    at org.apache.lucene.util.TestRuleMarkFailure$1.evaluate(TestRuleMarkFailure.java:48)
> [junit4:junit4]    >    at org.apache.lucene.util.TestRuleIgnoreAfterMaxFailures$1.evaluate(TestRuleIgnoreAfterMaxFailures.java:70)
> [junit4:junit4]    >    at org.apache.lucene.util.TestRuleIgnoreTestSuites$1.evaluate(TestRuleIgnoreTestSuites.java:55)
> [junit4:junit4]    >    at com.carrotsearch.randomizedtesting.rules.StatementAdapter.evaluate(StatementAdapter.java:36)
> [junit4:junit4]    >    at com.carrotsearch.randomizedtesting.ThreadLeakControl$StatementRunner.run(ThreadLeakControl.java:358)
> [junit4:junit4]    >    at java.lang.Thread.run(Thread.java:722)
> [junit4:junit4]    > Throwable #2: com.carrotsearch.randomizedtesting.UncaughtExceptionError: Captured an uncaught exception in thread: Thread[id=1495, name=Thread-1242, state=RUNNABLE, group=TGRP-TestStressIndexing2]
> [junit4:junit4]    > Caused by: junit.framework.AssertionFailedError: java.lang.ArrayIndexOutOfBoundsException: 0
> [junit4:junit4]    >    at __randomizedtesting.SeedInfo.seed([1141F7AAA07B449E]:0)
> [junit4:junit4]    >    at junit.framework.Assert.fail(Assert.java:50)
> [junit4:junit4]    >    at org.apache.lucene.index.TestStressIndexing2$IndexingThread.run(TestStressIndexing2.java:880)
> [junit4:junit4]    > Throwable #3: com.carrotsearch.randomizedtesting.UncaughtExceptionError: Captured an uncaught exception in thread: Thread[id=1493, name=Thread-1240, state=RUNNABLE, group=TGRP-TestStressIndexing2]
> [junit4:junit4]    > Caused by: junit.framework.AssertionFailedError: java.lang.AssertionError: Packet and Segments deletegen can only match on a segment private del packet gen=7
> [junit4:junit4]    >    at __randomizedtesting.SeedInfo.seed([1141F7AAA07B449E]:0)
> [junit4:junit4]    >    at junit.framework.Assert.fail(Assert.java:50)
> [junit4:junit4]    >    at org.apache.lucene.index.TestStressIndexing2$IndexingThread.run(TestStressIndexing2.java:880)
> [junit4:junit4]    > Throwable #4: com.carrotsearch.randomizedtesting.UncaughtExceptionError: Captured an uncaught exception in thread: Thread[id=1492, name=Thread-1239, state=RUNNABLE, group=TGRP-TestStressIndexing2]
> [junit4:junit4]    > Caused by: junit.framework.AssertionFailedError: java.lang.AssertionError: Packet and Segments deletegen can only match on a segment private del packet gen=7
> [junit4:junit4]    >    at __randomizedtesting.SeedInfo.seed([1141F7AAA07B449E]:0)
> [junit4:junit4]    >    at junit.framework.Assert.fail(Assert.java:50)
> [junit4:junit4]    >    at org.apache.lucene.index.TestStressIndexing2$IndexingThread.run(TestStressIndexing2.java:880)
> [junit4:junit4]   2> NOTE: test params are: codec=Lucene3x, sim=RandomSimilarityProvider(queryNorm=false,coord=yes): {f34=LM Jelinek-Mercer(0.700000), f59=DFR I(F)2, f33=DFR I(n)1, f57=DFR I(n)B2, f32=IB LL-D3(800.0), f8=DFR I(F)B2, f31=DFR I(ne)LZ(0.3), f30=IB SPL-L2, f10=DFR I(n)B3(800.0), f77=BM25(k1=1.2,b=0.75), f78=DefaultSimilarity, f15=DFR I(F)B2, f75=DFR GB1, f14=IB SPL-L3(800.0), f50=IB SPL-L3(800.0), f13=DFR I(ne)L1, f19=DFR I(n)L2, f74=DFR GL3(800.0), f17=IB LL-L1, f72=DFR I(F)L3(800.0), f81=IB LL-D1, f2=DFR I(n)BZ(0.3), f68=DFR G3(800.0), f69=DFR I(n)L3(800.0), f20=DFR I(F)L1, f41=DFR GZ(0.3), f60=IB SPL-D2, f26=DFR GL2, f29=DFR I(n)B1, f47=DFR I(n)B1, f28=DFR GBZ(0.3), f46=DFR GBZ(0.3), f84=DFR I(F)3(800.0), f67=IB LL-L2, f85=IB LL-L2, f48=DFR I(F)3(800.0), f99=DFR G2, f70=LM Jelinek-Mercer(0.700000), f96=DFR I(n)Z(0.3)}, locale=tr, timezone=Asia/Thimbu
> [junit4:junit4]   2> NOTE: Linux 3.2.0-32-generic i386/Oracle Corporation 1.7.0_09 (32-bit)/cpus=8,threads=1,free=48066144,total=88907776
> [junit4:junit4]   2> NOTE: All tests run in this JVM: [TestIndexWriterReader, TestBlockPostingsFormat, Nested, TestDoubleBarrelLRUCache, TestDocument, TestIOUtils, TestSizeBoundedForceMerge, TestPhraseQuery, TestMultiTermConstantScore, TestDocValuesScoring, TestWindowsMMap, TestSimpleAttributeImpl, Nested1, TestRecyclingByteBlockAllocator, TestBackwardsCompatibility, TestSameTokenSamePosition, TestLucene40PostingsFormat, TestOpenBitSet, TestAllFilesHaveCodecHeader, TestTransactionRollback, TestTermRangeQuery, TestCustomSearcherSort, TestIndexWriterForceMerge, TestMockDirectoryWrapper, TestParallelReaderEmptyIndex, TestBufferedIndexInput, TestVersionComparator, TestTermInfosReaderIndex, TestCustomNorms, TestIndexWriterWithThreads, TestVersion, TestRollingBuffer, TestPayloadExplanations, TestSloppyPhraseQuery, TestSmallFloat, TestMultiLevelSkipList, TestPrefixCodedTerms, TestComplexExplanationsOfNonMatches, TestIndexInput, TestCompoundFile, TestComplexExplanations, TestFilteredQuery, TestBackwardsCompatibility3x, TestBasicOperations, TestNRTThreads, Nested1, TestSearchAfter, TestScoreCachingWrappingScorer, TestGraphTokenizers, TestLevenshteinAutomata, TestIndexWriterLockRelease, TestTieredMergePolicy, TestDocBoost, TestDeterminism, TestAtomicUpdate, TestMultiThreadTermVectors, TestIndexWriterExceptions, TestSimpleSearchEquivalence, TestMatchAllDocsQuery, TestBooleanQueryVisitSubscorers, TestNoMergeScheduler, TestTimeLimitingCollector, TestArrayUtil, TestIndexableField, TestPrefixFilter, TestPagedBytes, Nested, Nested, TestFieldCacheRangeFilter, Nested1, TestIndexWriterCommit, TestPayloadSpans, TestSimilarityBase, Nested, Nested, Nested, Nested, Nested, Nested, Nested, Nested, Nested, Nested, Nested, Nested, Nested, Nested, Nested, Nested, Nested, Nested, Nested, Nested, Nested, TestSort, TestDateSort, TestIndexWriter, TestStressIndexing2]
> [junit4:junit4] Completed on J0 in 0.50s, 3 tests, 1 error <<< FAILURES!
>
> [...truncated 117 lines...]
> [junit4:junit4] Suite: org.apache.lucene.index.TestConcurrentMergeScheduler
> [junit4:junit4]   2> nov 08, 2012 9:37:04 PM com.carrotsearch.randomizedtesting.RandomizedRunner$QueueUncaughtExceptionsHandler uncaughtException
> [junit4:junit4]   2> WARNING: Uncaught exception in thread: Thread[Lucene Merge Thread #0,6,TGRP-TestConcurrentMergeScheduler]
> [junit4:junit4]   2> org.apache.lucene.index.MergePolicy$MergeException: java.lang.ArrayIndexOutOfBoundsException
> [junit4:junit4]   2>    at __randomizedtesting.SeedInfo.seed([1141F7AAA07B449E]:0)
> [junit4:junit4]   2>    at org.apache.lucene.index.ConcurrentMergeScheduler.handleMergeException(ConcurrentMergeScheduler.java:535)
> [junit4:junit4]   2>    at org.apache.lucene.index.ConcurrentMergeScheduler$MergeThread.run(ConcurrentMergeScheduler.java:508)
> [junit4:junit4]   2> Caused by: java.lang.ArrayIndexOutOfBoundsException
> [junit4:junit4]   2>
> [junit4:junit4]   2> nov 08, 2012 9:37:04 PM com.carrotsearch.randomizedtesting.RandomizedRunner$QueueUncaughtExceptionsHandler uncaughtException
> [junit4:junit4]   2> WARNING: Uncaught exception in thread: Thread[Lucene Merge Thread #1,6,TGRP-TestConcurrentMergeScheduler]
> [junit4:junit4]   2> org.apache.lucene.index.MergePolicy$MergeException: java.lang.ArrayIndexOutOfBoundsException
> [junit4:junit4]   2>    at __randomizedtesting.SeedInfo.seed([1141F7AAA07B449E]:0)
> [junit4:junit4]   2>    at org.apache.lucene.index.ConcurrentMergeScheduler.handleMergeException(ConcurrentMergeScheduler.java:535)
> [junit4:junit4]   2>    at org.apache.lucene.index.ConcurrentMergeScheduler$MergeThread.run(ConcurrentMergeScheduler.java:508)
> [junit4:junit4]   2> Caused by: java.lang.ArrayIndexOutOfBoundsException
> [junit4:junit4]   2>
> [junit4:junit4]   2> nov 08, 2012 9:37:04 PM com.carrotsearch.randomizedtesting.RandomizedRunner$QueueUncaughtExceptionsHandler uncaughtException
> [junit4:junit4]   2> WARNING: Uncaught exception in thread: Thread[Lucene Merge Thread #2,6,TGRP-TestConcurrentMergeScheduler]
> [junit4:junit4]   2> org.apache.lucene.index.MergePolicy$MergeException: java.lang.ArrayIndexOutOfBoundsException
> [junit4:junit4]   2>    at __randomizedtesting.SeedInfo.seed([1141F7AAA07B449E]:0)
> [junit4:junit4]   2>    at org.apache.lucene.index.ConcurrentMergeScheduler.handleMergeException(ConcurrentMergeScheduler.java:535)
> [junit4:junit4]   2>    at org.apache.lucene.index.ConcurrentMergeScheduler$MergeThread.run(ConcurrentMergeScheduler.java:508)
> [junit4:junit4]   2> Caused by: java.lang.ArrayIndexOutOfBoundsException
> [junit4:junit4]   2>
> [junit4:junit4]   2> nov 08, 2012 9:37:04 PM com.carrotsearch.randomizedtesting.RandomizedRunner$QueueUncaughtExceptionsHandler uncaughtException
> [junit4:junit4]   2> WARNING: Uncaught exception in thread: Thread[Lucene Merge Thread #3,6,TGRP-TestConcurrentMergeScheduler]
> [junit4:junit4]   2> org.apache.lucene.index.MergePolicy$MergeException: java.lang.ArrayIndexOutOfBoundsException
> [junit4:junit4]   2>    at __randomizedtesting.SeedInfo.seed([1141F7AAA07B449E]:0)
> [junit4:junit4]   2>    at org.apache.lucene.index.ConcurrentMergeScheduler.handleMergeException(ConcurrentMergeScheduler.java:535)
> [junit4:junit4]   2>    at org.apache.lucene.index.ConcurrentMergeScheduler$MergeThread.run(ConcurrentMergeScheduler.java:508)
> [junit4:junit4]   2> Caused by: java.lang.ArrayIndexOutOfBoundsException
> [junit4:junit4]   2>
> [junit4:junit4]   2> nov 08, 2012 9:37:04 PM com.carrotsearch.randomizedtesting.RandomizedRunner$QueueUncaughtExceptionsHandler uncaughtException
> [junit4:junit4]   2> WARNING: Uncaught exception in thread: Thread[Lucene Merge Thread #4,6,TGRP-TestConcurrentMergeScheduler]
> [junit4:junit4]   2> org.apache.lucene.index.MergePolicy$MergeException: java.lang.ArrayIndexOutOfBoundsException
> [junit4:junit4]   2>    at __randomizedtesting.SeedInfo.seed([1141F7AAA07B449E]:0)
> [junit4:junit4]   2>    at org.apache.lucene.index.ConcurrentMergeScheduler.handleMergeException(ConcurrentMergeScheduler.java:535)
> [junit4:junit4]   2>    at org.apache.lucene.index.ConcurrentMergeScheduler$MergeThread.run(ConcurrentMergeScheduler.java:508)
> [junit4:junit4]   2> Caused by: java.lang.ArrayIndexOutOfBoundsException
> [junit4:junit4]   2>
> [junit4:junit4]   2> nov 08, 2012 9:37:04 PM com.carrotsearch.randomizedtesting.RandomizedRunner$QueueUncaughtExceptionsHandler uncaughtException
> [junit4:junit4]   2> WARNING: Uncaught exception in thread: Thread[Lucene Merge Thread #5,6,TGRP-TestConcurrentMergeScheduler]
> [junit4:junit4]   2> org.apache.lucene.index.MergePolicy$MergeException: java.lang.ArrayIndexOutOfBoundsException
> [junit4:junit4]   2>    at __randomizedtesting.SeedInfo.seed([1141F7AAA07B449E]:0)
> [junit4:junit4]   2>    at org.apache.lucene.index.ConcurrentMergeScheduler.handleMergeException(ConcurrentMergeScheduler.java:535)
> [junit4:junit4]   2>    at org.apache.lucene.index.ConcurrentMergeScheduler$MergeThread.run(ConcurrentMergeScheduler.java:508)
> [junit4:junit4]   2> Caused by: java.lang.ArrayIndexOutOfBoundsException
> [junit4:junit4]   2>
> [junit4:junit4]   2> nov 08, 2012 9:37:04 PM com.carrotsearch.randomizedtesting.RandomizedRunner$QueueUncaughtExceptionsHandler uncaughtException
> [junit4:junit4]   2> WARNING: Uncaught exception in thread: Thread[Lucene Merge Thread #6,6,TGRP-TestConcurrentMergeScheduler]
> [junit4:junit4]   2> org.apache.lucene.index.MergePolicy$MergeException: java.lang.ArrayIndexOutOfBoundsException
> [junit4:junit4]   2>    at __randomizedtesting.SeedInfo.seed([1141F7AAA07B449E]:0)
> [junit4:junit4]   2>    at org.apache.lucene.index.ConcurrentMergeScheduler.handleMergeException(ConcurrentMergeScheduler.java:535)
> [junit4:junit4]   2>    at org.apache.lucene.index.ConcurrentMergeScheduler$MergeThread.run(ConcurrentMergeScheduler.java:508)
> [junit4:junit4]   2> Caused by: java.lang.ArrayIndexOutOfBoundsException
> [junit4:junit4]   2>
> [junit4:junit4]   2> nov 08, 2012 9:37:04 PM com.carrotsearch.randomizedtesting.RandomizedRunner$QueueUncaughtExceptionsHandler uncaughtException
> [junit4:junit4]   2> WARNING: Uncaught exception in thread: Thread[Lucene Merge Thread #7,6,TGRP-TestConcurrentMergeScheduler]
> [junit4:junit4]   2> org.apache.lucene.index.MergePolicy$MergeException: java.lang.ArrayIndexOutOfBoundsException
> [junit4:junit4]   2>    at __randomizedtesting.SeedInfo.seed([1141F7AAA07B449E]:0)
> [junit4:junit4]   2>    at org.apache.lucene.index.ConcurrentMergeScheduler.handleMergeException(ConcurrentMergeScheduler.java:535)
> [junit4:junit4]   2>    at org.apache.lucene.index.ConcurrentMergeScheduler$MergeThread.run(ConcurrentMergeScheduler.java:508)
> [junit4:junit4]   2> Caused by: java.lang.ArrayIndexOutOfBoundsException
> [junit4:junit4]   2>
> [junit4:junit4]   2> nov 08, 2012 9:37:04 PM com.carrotsearch.randomizedtesting.RandomizedRunner$QueueUncaughtExceptionsHandler uncaughtException
> [junit4:junit4]   2> WARNING: Uncaught exception in thread: Thread[Lucene Merge Thread #8,6,TGRP-TestConcurrentMergeScheduler]
> [junit4:junit4]   2> org.apache.lucene.index.MergePolicy$MergeException: java.lang.ArrayIndexOutOfBoundsException
> [junit4:junit4]   2>    at __randomizedtesting.SeedInfo.seed([1141F7AAA07B449E]:0)
> [junit4:junit4]   2>    at org.apache.lucene.index.ConcurrentMergeScheduler.handleMergeException(ConcurrentMergeScheduler.java:535)
> [junit4:junit4]   2>    at org.apache.lucene.index.ConcurrentMergeScheduler$MergeThread.run(ConcurrentMergeScheduler.java:508)
> [junit4:junit4]   2> Caused by: java.lang.ArrayIndexOutOfBoundsException
> [junit4:junit4]   2>
> [junit4:junit4]   2> nov 08, 2012 9:37:04 PM com.carrotsearch.randomizedtesting.RandomizedRunner$QueueUncaughtExceptionsHandler uncaughtException
> [junit4:junit4]   2> WARNING: Uncaught exception in thread: Thread[Lucene Merge Thread #9,6,TGRP-TestConcurrentMergeScheduler]
> [junit4:junit4]   2> org.apache.lucene.index.MergePolicy$MergeException: java.lang.ArrayIndexOutOfBoundsException
> [junit4:junit4]   2>    at __randomizedtesting.SeedInfo.seed([1141F7AAA07B449E]:0)
> [junit4:junit4]   2>    at org.apache.lucene.index.ConcurrentMergeScheduler.handleMergeException(ConcurrentMergeScheduler.java:535)
> [junit4:junit4]   2>    at org.apache.lucene.index.ConcurrentMergeScheduler$MergeThread.run(ConcurrentMergeScheduler.java:508)
> [junit4:junit4]   2> Caused by: java.lang.ArrayIndexOutOfBoundsException
> [junit4:junit4]   2>
> [junit4:junit4]   2> nov 08, 2012 9:37:04 PM com.carrotsearch.randomizedtesting.RandomizedRunner$QueueUncaughtExceptionsHandler uncaughtException
> [junit4:junit4]   2> WARNING: Uncaught exception in thread: Thread[Lucene Merge Thread #10,6,TGRP-TestConcurrentMergeScheduler]
> [junit4:junit4]   2> org.apache.lucene.index.MergePolicy$MergeException: java.lang.ArrayIndexOutOfBoundsException
> [junit4:junit4]   2>    at __randomizedtesting.SeedInfo.seed([1141F7AAA07B449E]:0)
> [junit4:junit4]   2>    at org.apache.lucene.index.ConcurrentMergeScheduler.handleMergeException(ConcurrentMergeScheduler.java:535)
> [junit4:junit4]   2>    at org.apache.lucene.index.ConcurrentMergeScheduler$MergeThread.run(ConcurrentMergeScheduler.java:508)
> [junit4:junit4]   2> Caused by: java.lang.ArrayIndexOutOfBoundsException
> [junit4:junit4]   2>
> [junit4:junit4]   2> nov 08, 2012 9:37:05 PM com.carrotsearch.randomizedtesting.RandomizedRunner$QueueUncaughtExceptionsHandler uncaughtException
> [junit4:junit4]   2> WARNING: Uncaught exception in thread: Thread[Lucene Merge Thread #11,6,TGRP-TestConcurrentMergeScheduler]
> [junit4:junit4]   2> org.apache.lucene.index.MergePolicy$MergeException: java.lang.ArrayIndexOutOfBoundsException
> [junit4:junit4]   2>    at __randomizedtesting.SeedInfo.seed([1141F7AAA07B449E]:0)
> [junit4:junit4]   2>    at org.apache.lucene.index.ConcurrentMergeScheduler.handleMergeException(ConcurrentMergeScheduler.java:535)
> [junit4:junit4]   2>    at org.apache.lucene.index.ConcurrentMergeScheduler$MergeThread.run(ConcurrentMergeScheduler.java:508)
> [junit4:junit4]   2> Caused by: java.lang.ArrayIndexOutOfBoundsException
> [junit4:junit4]   2>
> [junit4:junit4]   2> nov 08, 2012 9:37:05 PM com.carrotsearch.randomizedtesting.RandomizedRunner$QueueUncaughtExceptionsHandler uncaughtException
> [junit4:junit4]   2> WARNING: Uncaught exception in thread: Thread[Lucene Merge Thread #12,6,TGRP-TestConcurrentMergeScheduler]
> [junit4:junit4]   2> org.apache.lucene.index.MergePolicy$MergeException: java.lang.ArrayIndexOutOfBoundsException
> [junit4:junit4]   2>    at __randomizedtesting.SeedInfo.seed([1141F7AAA07B449E]:0)
> [junit4:junit4]   2>    at org.apache.lucene.index.ConcurrentMergeScheduler.handleMergeException(ConcurrentMergeScheduler.java:535)
> [junit4:junit4]   2>    at org.apache.lucene.index.ConcurrentMergeScheduler$MergeThread.run(ConcurrentMergeScheduler.java:508)
> [junit4:junit4]   2> Caused by: java.lang.ArrayIndexOutOfBoundsException
> [junit4:junit4]   2>
> [junit4:junit4]   2> nov 08, 2012 9:37:05 PM com.carrotsearch.randomizedtesting.RandomizedRunner$QueueUncaughtExceptionsHandler uncaughtException
> [junit4:junit4]   2> WARNING: Uncaught exception in thread: Thread[Lucene Merge Thread #13,6,TGRP-TestConcurrentMergeScheduler]
> [junit4:junit4]   2> org.apache.lucene.index.MergePolicy$MergeException: java.lang.ArrayIndexOutOfBoundsException
> [junit4:junit4]   2>    at __randomizedtesting.SeedInfo.seed([1141F7AAA07B449E]:0)
> [junit4:junit4]   2>    at org.apache.lucene.index.ConcurrentMergeScheduler.handleMergeException(ConcurrentMergeScheduler.java:535)
> [junit4:junit4]   2>    at org.apache.lucene.index.ConcurrentMergeScheduler$MergeThread.run(ConcurrentMergeScheduler.java:508)
> [junit4:junit4]   2> Caused by: java.lang.ArrayIndexOutOfBoundsException
> [junit4:junit4]   2>
> [junit4:junit4]   2> nov 08, 2012 9:37:05 PM com.carrotsearch.randomizedtesting.RandomizedRunner$QueueUncaughtExceptionsHandler uncaughtException
> [junit4:junit4]   2> WARNING: Uncaught exception in thread: Thread[Lucene Merge Thread #14,6,TGRP-TestConcurrentMergeScheduler]
> [junit4:junit4]   2> org.apache.lucene.index.MergePolicy$MergeException: java.lang.ArrayIndexOutOfBoundsException
> [junit4:junit4]   2>    at __randomizedtesting.SeedInfo.seed([1141F7AAA07B449E]:0)
> [junit4:junit4]   2>    at org.apache.lucene.index.ConcurrentMergeScheduler.handleMergeException(ConcurrentMergeScheduler.java:535)
> [junit4:junit4]   2>    at org.apache.lucene.index.ConcurrentMergeScheduler$MergeThread.run(ConcurrentMergeScheduler.java:508)
> [junit4:junit4]   2> Caused by: java.lang.ArrayIndexOutOfBoundsException
> [junit4:junit4]   2>
> [junit4:junit4]   2> nov 08, 2012 9:37:05 PM com.carrotsearch.randomizedtesting.RandomizedRunner$QueueUncaughtExceptionsHandler uncaughtException
> [junit4:junit4]   2> WARNING: Uncaught exception in thread: Thread[Lucene Merge Thread #15,6,TGRP-TestConcurrentMergeScheduler]
> [junit4:junit4]   2> org.apache.lucene.index.MergePolicy$MergeException: java.lang.ArrayIndexOutOfBoundsException
> [junit4:junit4]   2>    at __randomizedtesting.SeedInfo.seed([1141F7AAA07B449E]:0)
> [junit4:junit4]   2>    at org.apache.lucene.index.ConcurrentMergeScheduler.handleMergeException(ConcurrentMergeScheduler.java:535)
> [junit4:junit4]   2>    at org.apache.lucene.index.ConcurrentMergeScheduler$MergeThread.run(ConcurrentMergeScheduler.java:508)
> [junit4:junit4]   2> Caused by: java.lang.ArrayIndexOutOfBoundsException
> [junit4:junit4]   2>
> [junit4:junit4]   2> nov 08, 2012 9:37:05 PM com.carrotsearch.randomizedtesting.RandomizedRunner$QueueUncaughtExceptionsHandler uncaughtException
> [junit4:junit4]   2> WARNING: Uncaught exception in thread: Thread[Lucene Merge Thread #16,6,TGRP-TestConcurrentMergeScheduler]
> [junit4:junit4]   2> org.apache.lucene.index.MergePolicy$MergeException: java.lang.ArrayIndexOutOfBoundsException
> [junit4:junit4]   2>    at __randomizedtesting.SeedInfo.seed([1141F7AAA07B449E]:0)
> [junit4:junit4]   2>    at org.apache.lucene.index.ConcurrentMergeScheduler.handleMergeException(ConcurrentMergeScheduler.java:535)
> [junit4:junit4]   2>    at org.apache.lucene.index.ConcurrentMergeScheduler$MergeThread.run(ConcurrentMergeScheduler.java:508)
> [junit4:junit4]   2> Caused by: java.lang.ArrayIndexOutOfBoundsException
> [junit4:junit4]   2>
> [junit4:junit4]   2> nov 08, 2012 9:37:05 PM com.carrotsearch.randomizedtesting.RandomizedRunner$QueueUncaughtExceptionsHandler uncaughtException
> [junit4:junit4]   2> WARNING: Uncaught exception in thread: Thread[Lucene Merge Thread #17,6,TGRP-TestConcurrentMergeScheduler]
> [junit4:junit4]   2> org.apache.lucene.index.MergePolicy$MergeException: java.lang.ArrayIndexOutOfBoundsException
> [junit4:junit4]   2>    at __randomizedtesting.SeedInfo.seed([1141F7AAA07B449E]:0)
> [junit4:junit4]   2>    at org.apache.lucene.index.ConcurrentMergeScheduler.handleMergeException(ConcurrentMergeScheduler.java:535)
> [junit4:junit4]   2>    at org.apache.lucene.index.ConcurrentMergeScheduler$MergeThread.run(ConcurrentMergeScheduler.java:508)
> [junit4:junit4]   2> Caused by: java.lang.ArrayIndexOutOfBoundsException
> [junit4:junit4]   2>
> [junit4:junit4]   2> nov 08, 2012 9:37:05 PM com.carrotsearch.randomizedtesting.RandomizedRunner$QueueUncaughtExceptionsHandler uncaughtException
> [junit4:junit4]   2> WARNING: Uncaught exception in thread: Thread[Lucene Merge Thread #19,6,TGRP-TestConcurrentMergeScheduler]
> [junit4:junit4]   2> org.apache.lucene.index.MergePolicy$MergeException: java.lang.ArrayIndexOutOfBoundsException
> [junit4:junit4]   2>    at __randomizedtesting.SeedInfo.seed([1141F7AAA07B449E]:0)
> [junit4:junit4]   2>    at org.apache.lucene.index.ConcurrentMergeScheduler.handleMergeException(ConcurrentMergeScheduler.java:535)
> [junit4:junit4]   2>    at org.apache.lucene.index.ConcurrentMergeScheduler$MergeThread.run(ConcurrentMergeScheduler.java:508)
> [junit4:junit4]   2> Caused by: java.lang.ArrayIndexOutOfBoundsException
> [junit4:junit4]   2>
> [junit4:junit4]   2> nov 08, 2012 9:37:05 PM com.carrotsearch.randomizedtesting.RandomizedRunner$QueueUncaughtExceptionsHandler uncaughtException
> [junit4:junit4]   2> WARNING: Uncaught exception in thread: Thread[Lucene Merge Thread #18,6,TGRP-TestConcurrentMergeScheduler]
> [junit4:junit4]   2> org.apache.lucene.index.MergePolicy$MergeException: java.lang.ArrayIndexOutOfBoundsException
> [junit4:junit4]   2>    at __randomizedtesting.SeedInfo.seed([1141F7AAA07B449E]:0)
> [junit4:junit4]   2>    at org.apache.lucene.index.ConcurrentMergeScheduler.handleMergeException(ConcurrentMergeScheduler.java:535)
> [junit4:junit4]   2>    at org.apache.lucene.index.ConcurrentMergeScheduler$MergeThread.run(ConcurrentMergeScheduler.java:508)
> [junit4:junit4]   2> Caused by: java.lang.ArrayIndexOutOfBoundsException
> [junit4:junit4]   2>
> [junit4:junit4]   2> nov 08, 2012 9:37:05 PM com.carrotsearch.randomizedtesting.RandomizedRunner$QueueUncaughtExceptionsHandler uncaughtException
> [junit4:junit4]   2> WARNING: Uncaught exception in thread: Thread[Lucene Merge Thread #20,6,TGRP-TestConcurrentMergeScheduler]
> [junit4:junit4]   2> org.apache.lucene.index.MergePolicy$MergeException: java.lang.ArrayIndexOutOfBoundsException
> [junit4:junit4]   2>    at __randomizedtesting.SeedInfo.seed([1141F7AAA07B449E]:0)
> [junit4:junit4]   2>    at org.apache.lucene.index.ConcurrentMergeScheduler.handleMergeException(ConcurrentMergeScheduler.java:535)
> [junit4:junit4]   2>    at org.apache.lucene.index.ConcurrentMergeScheduler$MergeThread.run(ConcurrentMergeScheduler.java:508)
> [junit4:junit4]   2> Caused by: java.lang.ArrayIndexOutOfBoundsException
> [junit4:junit4]   2>
> [junit4:junit4]   2> nov 08, 2012 9:37:05 PM com.carrotsearch.randomizedtesting.RandomizedRunner$QueueUncaughtExceptionsHandler uncaughtException
> [junit4:junit4]   2> WARNING: Uncaught exception in thread: Thread[Lucene Merge Thread #21,6,TGRP-TestConcurrentMergeScheduler]
> [junit4:junit4]   2> org.apache.lucene.index.MergePolicy$MergeException: java.lang.ArrayIndexOutOfBoundsException
> [junit4:junit4]   2>    at __randomizedtesting.SeedInfo.seed([1141F7AAA07B449E]:0)
> [junit4:junit4]   2>    at org.apache.lucene.index.ConcurrentMergeScheduler.handleMergeException(ConcurrentMergeScheduler.java:535)
> [junit4:junit4]   2>    at org.apache.lucene.index.ConcurrentMergeScheduler$MergeThread.run(ConcurrentMergeScheduler.java:508)
> [junit4:junit4]   2> Caused by: java.lang.ArrayIndexOutOfBoundsException
> [junit4:junit4]   2>
> [junit4:junit4]   2> nov 08, 2012 9:37:05 PM com.carrotsearch.randomizedtesting.RandomizedRunner$QueueUncaughtExceptionsHandler uncaughtException
> [junit4:junit4]   2> WARNING: Uncaught exception in thread: Thread[Lucene Merge Thread #22,6,TGRP-TestConcurrentMergeScheduler]
> [junit4:junit4]   2> org.apache.lucene.index.MergePolicy$MergeException: java.lang.ArrayIndexOutOfBoundsException
> [junit4:junit4]   2>    at __randomizedtesting.SeedInfo.seed([1141F7AAA07B449E]:0)
> [junit4:junit4]   2>    at org.apache.lucene.index.ConcurrentMergeScheduler.handleMergeException(ConcurrentMergeScheduler.java:535)
> [junit4:junit4]   2>    at org.apache.lucene.index.ConcurrentMergeScheduler$MergeThread.run(ConcurrentMergeScheduler.java:508)
> [junit4:junit4]   2> Caused by: java.lang.ArrayIndexOutOfBoundsException
> [junit4:junit4]   2>
> [junit4:junit4]   2> nov 08, 2012 9:37:05 PM com.carrotsearch.randomizedtesting.RandomizedRunner$QueueUncaughtExceptionsHandler uncaughtException
> [junit4:junit4]   2> WARNING: Uncaught exception in thread: Thread[Lucene Merge Thread #23,6,TGRP-TestConcurrentMergeScheduler]
> [junit4:junit4]   2> org.apache.lucene.index.MergePolicy$MergeException: java.lang.ArrayIndexOutOfBoundsException
> [junit4:junit4]   2>    at __randomizedtesting.SeedInfo.seed([1141F7AAA07B449E]:0)
> [junit4:junit4]   2>    at org.apache.lucene.index.ConcurrentMergeScheduler.handleMergeException(ConcurrentMergeScheduler.java:535)
> [junit4:junit4]   2>    at org.apache.lucene.index.ConcurrentMergeScheduler$MergeThread.run(ConcurrentMergeScheduler.java:508)
> [junit4:junit4]   2> Caused by: java.lang.ArrayIndexOutOfBoundsException
> [junit4:junit4]   2>
> [junit4:junit4]   2> nov 08, 2012 9:37:05 PM com.carrotsearch.randomizedtesting.RandomizedRunner$QueueUncaughtExceptionsHandler uncaughtException
> [junit4:junit4]   2> WARNING: Uncaught exception in thread: Thread[Lucene Merge Thread #25,6,TGRP-TestConcurrentMergeScheduler]
> [junit4:junit4]   2> org.apache.lucene.index.MergePolicy$MergeException: java.lang.ArrayIndexOutOfBoundsException
> [junit4:junit4]   2>    at __randomizedtesting.SeedInfo.seed([1141F7AAA07B449E]:0)
> [junit4:junit4]   2>    at org.apache.lucene.index.ConcurrentMergeScheduler.handleMergeException(ConcurrentMergeScheduler.java:535)
> [junit4:junit4]   2>    at org.apache.lucene.index.ConcurrentMergeScheduler$MergeThread.run(ConcurrentMergeScheduler.java:508)
> [junit4:junit4]   2> Caused by: java.lang.ArrayIndexOutOfBoundsException
> [junit4:junit4]   2>
> [junit4:junit4]   2> nov 08, 2012 9:37:05 PM com.carrotsearch.randomizedtesting.RandomizedRunner$QueueUncaughtExceptionsHandler uncaughtException
> [junit4:junit4]   2> WARNING: Uncaught exception in thread: Thread[Lucene Merge Thread #24,6,TGRP-TestConcurrentMergeScheduler]
> [junit4:junit4]   2> org.apache.lucene.index.MergePolicy$MergeException: java.lang.ArrayIndexOutOfBoundsException
> [junit4:junit4]   2>    at __randomizedtesting.SeedInfo.seed([1141F7AAA07B449E]:0)
> [junit4:junit4]   2>    at org.apache.lucene.index.ConcurrentMergeScheduler.handleMergeException(ConcurrentMergeScheduler.java:535)
> [junit4:junit4]   2>    at org.apache.lucene.index.ConcurrentMergeScheduler$MergeThread.run(ConcurrentMergeScheduler.java:508)
> [junit4:junit4]   2> Caused by: java.lang.ArrayIndexOutOfBoundsException
> [junit4:junit4]   2>
> [junit4:junit4]   2> nov 08, 2012 9:37:05 PM com.carrotsearch.randomizedtesting.RandomizedRunner$QueueUncaughtExceptionsHandler uncaughtException
> [junit4:junit4]   2> WARNING: Uncaught exception in thread: Thread[Lucene Merge Thread #28,6,TGRP-TestConcurrentMergeScheduler]
> [junit4:junit4]   2> org.apache.lucene.index.MergePolicy$MergeException: java.lang.ArrayIndexOutOfBoundsException
> [junit4:junit4]   2>    at __randomizedtesting.SeedInfo.seed([1141F7AAA07B449E]:0)
> [junit4:junit4]   2>    at org.apache.lucene.index.ConcurrentMergeScheduler.handleMergeException(ConcurrentMergeScheduler.java:535)
> [junit4:junit4]   2>    at org.apache.lucene.index.ConcurrentMergeScheduler$MergeThread.run(ConcurrentMergeScheduler.java:508)
> [junit4:junit4]   2> Caused by: java.lang.ArrayIndexOutOfBoundsException
> [junit4:junit4]   2>
> [junit4:junit4]   2> nov 08, 2012 9:37:05 PM com.carrotsearch.randomizedtesting.RandomizedRunner$QueueUncaughtExceptionsHandler uncaughtException
> [junit4:junit4]   2> WARNING: Uncaught exception in thread: Thread[Lucene Merge Thread #27,6,TGRP-TestConcurrentMergeScheduler]
> [junit4:junit4]   2> org.apache.lucene.index.MergePolicy$MergeException: java.lang.ArrayIndexOutOfBoundsException
> [junit4:junit4]   2>    at __randomizedtesting.SeedInfo.seed([1141F7AAA07B449E]:0)
> [junit4:junit4]   2>    at org.apache.lucene.index.ConcurrentMergeScheduler.handleMergeException(ConcurrentMergeScheduler.java:535)
> [junit4:junit4]   2>    at org.apache.lucene.index.ConcurrentMergeScheduler$MergeThread.run(ConcurrentMergeScheduler.java:508)
> [junit4:junit4]   2> Caused by: java.lang.ArrayIndexOutOfBoundsException
> [junit4:junit4]   2>
> [junit4:junit4]   2> nov 08, 2012 9:37:05 PM com.carrotsearch.randomizedtesting.RandomizedRunner$QueueUncaughtExceptionsHandler uncaughtException
> [junit4:junit4]   2> WARNING: Uncaught exception in thread: Thread[Lucene Merge Thread #29,6,TGRP-TestConcurrentMergeScheduler]
> [junit4:junit4]   2> org.apache.lucene.index.MergePolicy$MergeException: java.lang.ArrayIndexOutOfBoundsException
> [junit4:junit4]   2>    at __randomizedtesting.SeedInfo.seed([1141F7AAA07B449E]:0)
> [junit4:junit4]   2>    at org.apache.lucene.index.ConcurrentMergeScheduler.handleMergeException(ConcurrentMergeScheduler.java:535)
> [junit4:junit4]   2>    at org.apache.lucene.index.ConcurrentMergeScheduler$MergeThread.run(ConcurrentMergeScheduler.java:508)
> [junit4:junit4]   2> Caused by: java.lang.ArrayIndexOutOfBoundsException
> [junit4:junit4]   2>
> [junit4:junit4]   2> nov 08, 2012 9:37:06 PM com.carrotsearch.randomizedtesting.RandomizedRunner$QueueUncaughtExceptionsHandler uncaughtException
> [junit4:junit4]   2> WARNING: Uncaught exception in thread: Thread[Lucene Merge Thread #30,6,TGRP-TestConcurrentMergeScheduler]
> [junit4:junit4]   2> org.apache.lucene.index.MergePolicy$MergeException: java.lang.ArrayIndexOutOfBoundsException
> [junit4:junit4]   2>    at __randomizedtesting.SeedInfo.seed([1141F7AAA07B449E]:0)
> [junit4:junit4]   2>    at org.apache.lucene.index.ConcurrentMergeScheduler.handleMergeException(ConcurrentMergeScheduler.java:535)
> [junit4:junit4]   2>    at org.apache.lucene.index.ConcurrentMergeScheduler$MergeThread.run(ConcurrentMergeScheduler.java:508)
> [junit4:junit4]   2> Caused by: java.lang.ArrayIndexOutOfBoundsException
> [junit4:junit4]   2>
> [junit4:junit4]   2> nov 08, 2012 9:37:06 PM com.carrotsearch.randomizedtesting.RandomizedRunner$QueueUncaughtExceptionsHandler uncaughtException
> [junit4:junit4]   2> WARNING: Uncaught exception in thread: Thread[Lucene Merge Thread #31,6,TGRP-TestConcurrentMergeScheduler]
> [junit4:junit4]   2> org.apache.lucene.index.MergePolicy$MergeException: java.lang.ArrayIndexOutOfBoundsException
> [junit4:junit4]   2>    at __randomizedtesting.SeedInfo.seed([1141F7AAA07B449E]:0)
> [junit4:junit4]   2>    at org.apache.lucene.index.ConcurrentMergeScheduler.handleMergeException(ConcurrentMergeScheduler.java:535)
> [junit4:junit4]   2>    at org.apache.lucene.index.ConcurrentMergeScheduler$MergeThread.run(ConcurrentMergeScheduler.java:508)
> [junit4:junit4]   2> Caused by: java.lang.ArrayIndexOutOfBoundsException
> [junit4:junit4]   2>
> [junit4:junit4]   2> nov 08, 2012 9:37:06 PM com.carrotsearch.randomizedtesting.RandomizedRunner$QueueUncaughtExceptionsHandler uncaughtException
> [junit4:junit4]   2> WARNING: Uncaught exception in thread: Thread[Lucene Merge Thread #32,6,TGRP-TestConcurrentMergeScheduler]
> [junit4:junit4]   2> org.apache.lucene.index.MergePolicy$MergeException: java.lang.ArrayIndexOutOfBoundsException
> [junit4:junit4]   2>    at __randomizedtesting.SeedInfo.seed([1141F7AAA07B449E]:0)
> [junit4:junit4]   2>    at org.apache.lucene.index.ConcurrentMergeScheduler.handleMergeException(ConcurrentMergeScheduler.java:535)
> [junit4:junit4]   2>    at org.apache.lucene.index.ConcurrentMergeScheduler$MergeThread.run(ConcurrentMergeScheduler.java:508)
> [junit4:junit4]   2> Caused by: java.lang.ArrayIndexOutOfBoundsException
> [junit4:junit4]   2>
> [junit4:junit4]   2> nov 08, 2012 9:37:06 PM com.carrotsearch.randomizedtesting.RandomizedRunner$QueueUncaughtExceptionsHandler uncaughtException
> [junit4:junit4]   2> WARNING: Uncaught exception in thread: Thread[Lucene Merge Thread #33,6,TGRP-TestConcurrentMergeScheduler]
> [junit4:junit4]   2> org.apache.lucene.index.MergePolicy$MergeException: java.lang.ArrayIndexOutOfBoundsException
> [junit4:junit4]   2>    at __randomizedtesting.SeedInfo.seed([1141F7AAA07B449E]:0)
> [junit4:junit4]   2>    at org.apache.lucene.index.ConcurrentMergeScheduler.handleMergeException(ConcurrentMergeScheduler.java:535)
> [junit4:junit4]   2>    at org.apache.lucene.index.ConcurrentMergeScheduler$MergeThread.run(ConcurrentMergeScheduler.java:508)
> [junit4:junit4]   2> Caused by: java.lang.ArrayIndexOutOfBoundsException
> [junit4:junit4]   2>
> [junit4:junit4]   2> nov 08, 2012 9:37:06 PM com.carrotsearch.randomizedtesting.RandomizedRunner$QueueUncaughtExceptionsHandler uncaughtException
> [junit4:junit4]   2> WARNING: Uncaught exception in thread: Thread[Lucene Merge Thread #34,6,TGRP-TestConcurrentMergeScheduler]
> [junit4:junit4]   2> org.apache.lucene.index.MergePolicy$MergeException: java.lang.ArrayIndexOutOfBoundsException
> [junit4:junit4]   2>    at __randomizedtesting.SeedInfo.seed([1141F7AAA07B449E]:0)
> [junit4:junit4]   2>    at org.apache.lucene.index.ConcurrentMergeScheduler.handleMergeException(ConcurrentMergeScheduler.java:535)
> [junit4:junit4]   2>    at org.apache.lucene.index.ConcurrentMergeScheduler$MergeThread.run(ConcurrentMergeScheduler.java:508)
> [junit4:junit4]   2> Caused by: java.lang.ArrayIndexOutOfBoundsException
> [junit4:junit4]   2>
> [junit4:junit4]   2> nov 08, 2012 9:37:06 PM com.carrotsearch.randomizedtesting.RandomizedRunner$QueueUncaughtExceptionsHandler uncaughtException
> [junit4:junit4]   2> WARNING: Uncaught exception in thread: Thread[Lucene Merge Thread #35,6,TGRP-TestConcurrentMergeScheduler]
> [junit4:junit4]   2> org.apache.lucene.index.MergePolicy$MergeException: java.lang.ArrayIndexOutOfBoundsException
> [junit4:junit4]   2>    at __randomizedtesting.SeedInfo.seed([1141F7AAA07B449E]:0)
> [junit4:junit4]   2>    at org.apache.lucene.index.ConcurrentMergeScheduler.handleMergeException(ConcurrentMergeScheduler.java:535)
> [junit4:junit4]   2>    at org.apache.lucene.index.ConcurrentMergeScheduler$MergeThread.run(ConcurrentMergeScheduler.java:508)
> [junit4:junit4]   2> Caused by: java.lang.ArrayIndexOutOfBoundsException
> [junit4:junit4]   2>
> [junit4:junit4]   2> nov 08, 2012 9:37:06 PM com.carrotsearch.randomizedtesting.RandomizedRunner$QueueUncaughtExceptionsHandler uncaughtException
> [junit4:junit4]   2> WARNING: Uncaught exception in thread: Thread[Lucene Merge Thread #36,6,TGRP-TestConcurrentMergeScheduler]
> [junit4:junit4]   2> org.apache.lucene.index.MergePolicy$MergeException: java.lang.ArrayIndexOutOfBoundsException
> [junit4:junit4]   2>    at __randomizedtesting.SeedInfo.seed([1141F7AAA07B449E]:0)
> [junit4:junit4]   2>    at org.apache.lucene.index.ConcurrentMergeScheduler.handleMergeException(ConcurrentMergeScheduler.java:535)
> [junit4:junit4]   2>    at org.apache.lucene.index.ConcurrentMergeScheduler$MergeThread.run(ConcurrentMergeScheduler.java:508)
> [junit4:junit4]   2> Caused by: java.lang.ArrayIndexOutOfBoundsException
> [junit4:junit4]   2>
> [junit4:junit4]   2> nov 08, 2012 9:37:06 PM com.carrotsearch.randomizedtesting.RandomizedRunner$QueueUncaughtExceptionsHandler uncaughtException
> [junit4:junit4]   2> WARNING: Uncaught exception in thread: Thread[Lucene Merge Thread #37,6,TGRP-TestConcurrentMergeScheduler]
> [junit4:junit4]   2> org.apache.lucene.index.MergePolicy$MergeException: java.lang.ArrayIndexOutOfBoundsException
> [junit4:junit4]   2>    at __randomizedtesting.SeedInfo.seed([1141F7AAA07B449E]:0)
> [junit4:junit4]   2>    at org.apache.lucene.index.ConcurrentMergeScheduler.handleMergeException(ConcurrentMergeScheduler.java:535)
> [junit4:junit4]   2>    at org.apache.lucene.index.ConcurrentMergeScheduler$MergeThread.run(ConcurrentMergeScheduler.java:508)
> [junit4:junit4]   2> Caused by: java.lang.ArrayIndexOutOfBoundsException
> [junit4:junit4]   2>
> [junit4:junit4]   2> nov 08, 2012 9:37:06 PM com.carrotsearch.randomizedtesting.RandomizedRunner$QueueUncaughtExceptionsHandler uncaughtException
> [junit4:junit4]   2> WARNING: Uncaught exception in thread: Thread[Lucene Merge Thread #38,6,TGRP-TestConcurrentMergeScheduler]
> [junit4:junit4]   2> org.apache.lucene.index.MergePolicy$MergeException: java.lang.ArrayIndexOutOfBoundsException
> [junit4:junit4]   2>    at __randomizedtesting.SeedInfo.seed([1141F7AAA07B449E]:0)
> [junit4:junit4]   2>    at org.apache.lucene.index.ConcurrentMergeScheduler.handleMergeException(ConcurrentMergeScheduler.java:535)
> [junit4:junit4]   2>    at org.apache.lucene.index.ConcurrentMergeScheduler$MergeThread.run(ConcurrentMergeScheduler.java:508)
> [junit4:junit4]   2> Caused by: java.lang.ArrayIndexOutOfBoundsException
> [junit4:junit4]   2>
> [junit4:junit4]   2> nov 08, 2012 9:37:06 PM com.carrotsearch.randomizedtesting.RandomizedRunner$QueueUncaughtExceptionsHandler uncaughtException
> [junit4:junit4]   2> WARNING: Uncaught exception in thread: Thread[Lucene Merge Thread #39,6,TGRP-TestConcurrentMergeScheduler]
> [junit4:junit4]   2> org.apache.lucene.index.MergePolicy$MergeException: java.lang.ArrayIndexOutOfBoundsException
> [junit4:junit4]   2>    at __randomizedtesting.SeedInfo.seed([1141F7AAA07B449E]:0)
> [junit4:junit4]   2>    at org.apache.lucene.index.ConcurrentMergeScheduler.handleMergeException(ConcurrentMergeScheduler.java:535)
> [junit4:junit4]   2>    at org.apache.lucene.index.ConcurrentMergeScheduler$MergeThread.run(ConcurrentMergeScheduler.java:508)
> [junit4:junit4]   2> Caused by: java.lang.ArrayIndexOutOfBoundsException
> [junit4:junit4]   2>
> [junit4:junit4]   2> nov 08, 2012 9:37:06 PM com.carrotsearch.randomizedtesting.RandomizedRunner$QueueUncaughtExceptionsHandler uncaughtException
> [junit4:junit4]   2> WARNING: Uncaught exception in thread: Thread[Lucene Merge Thread #41,8,TGRP-TestConcurrentMergeScheduler]
> [junit4:junit4]   2> org.apache.lucene.index.MergePolicy$MergeException: java.lang.ArrayIndexOutOfBoundsException
> [junit4:junit4]   2>    at __randomizedtesting.SeedInfo.seed([1141F7AAA07B449E]:0)
> [junit4:junit4]   2>    at org.apache.lucene.index.ConcurrentMergeScheduler.handleMergeException(ConcurrentMergeScheduler.java:535)
> [junit4:junit4]   2>    at org.apache.lucene.index.ConcurrentMergeScheduler$MergeThread.run(ConcurrentMergeScheduler.java:508)
> [junit4:junit4]   2> Caused by: java.lang.ArrayIndexOutOfBoundsException
> [junit4:junit4]   2>
> [junit4:junit4]   2> nov 08, 2012 9:37:06 PM com.carrotsearch.randomizedtesting.RandomizedRunner$QueueUncaughtExceptionsHandler uncaughtException
> [junit4:junit4]   2> WARNING: Uncaught exception in thread: Thread[Lucene Merge Thread #40,7,TGRP-TestConcurrentMergeScheduler]
> [junit4:junit4]   2> org.apache.lucene.index.MergePolicy$MergeException: java.lang.ArrayIndexOutOfBoundsException
> [junit4:junit4]   2>    at __randomizedtesting.SeedInfo.seed([1141F7AAA07B449E]:0)
> [junit4:junit4]   2>    at org.apache.lucene.index.ConcurrentMergeScheduler.handleMergeException(ConcurrentMergeScheduler.java:535)
> [junit4:junit4]   2>    at org.apache.lucene.index.ConcurrentMergeScheduler$MergeThread.run(ConcurrentMergeScheduler.java:508)
> [junit4:junit4]   2> Caused by: java.lang.ArrayIndexOutOfBoundsException
> [junit4:junit4]   2>
> [junit4:junit4]   2> nov 08, 2012 9:37:06 PM com.carrotsearch.randomizedtesting.RandomizedRunner$QueueUncaughtExceptionsHandler uncaughtException
> [junit4:junit4]   2> WARNING: Uncaught exception in thread: Thread[Lucene Merge Thread #26,6,TGRP-TestConcurrentMergeScheduler]
> [junit4:junit4]   2> org.apache.lucene.index.MergePolicy$MergeException: java.lang.ArrayIndexOutOfBoundsException
> [junit4:junit4]   2>    at __randomizedtesting.SeedInfo.seed([1141F7AAA07B449E]:0)
> [junit4:junit4]   2>    at org.apache.lucene.index.ConcurrentMergeScheduler.handleMergeException(ConcurrentMergeScheduler.java:535)
> [junit4:junit4]   2>    at org.apache.lucene.index.ConcurrentMergeScheduler$MergeThread.run(ConcurrentMergeScheduler.java:508)
> [junit4:junit4]   2> Caused by: java.lang.ArrayIndexOutOfBoundsException
> [junit4:junit4]   2>
> [junit4:junit4]   1> CheckIndex failed
> [junit4:junit4]   1> Segments file=segments_1 numSegments=100 version=4.1 format=
> [junit4:junit4]   1>   1 of 100: name=_0 docCount=2
> [junit4:junit4]   1>     codec=Lucene3x
> [junit4:junit4]   1>     compound=false
> [junit4:junit4]   1>     numFiles=7
> [junit4:junit4]   1>     size (MB)=0
> [junit4:junit4]   1>     diagnostics = {os=Linux, os.version=3.2.0-32-generic, source=flush, lucene.version=4.1-SNAPSHOT, os.arch=i386, java.version=1.7.0_09, java.vendor=Oracle Corporation}
> [junit4:junit4]   1>     no deletions
> [junit4:junit4]   1>     test: open reader.........OK
> [junit4:junit4]   1>     test: fields..............OK [1 fields]
> [junit4:junit4]   1>     test: field norms.........OK [0 fields]
> [junit4:junit4]   1>     test: terms, freq, prox...OK [2 terms; 2 terms/docs pairs; 0 tokens]
> [junit4:junit4]   1>     test: stored fields.......OK [2 total field count; avg 1 fields per doc]
> [junit4:junit4]   1>     test: term vectors........OK [0 total vector count; avg 0 term/freq vector fields per doc]
> [junit4:junit4]   1>     test: docvalues...........OK [0 total doc count; 0 docvalues fields]
> [junit4:junit4]   1>
> [junit4:junit4]   1>   2 of 100: name=_1 docCount=2
> [junit4:junit4]   1>     codec=Lucene3x
> [junit4:junit4]   1>     compound=false
> [junit4:junit4]   1>     numFiles=7
> [junit4:junit4]   1>     size (MB)=0
> [junit4:junit4]   1>     diagnostics = {os=Linux, os.version=3.2.0-32-generic, source=flush, lucene.version=4.1-SNAPSHOT, os.arch=i386, java.version=1.7.0_09, java.vendor=Oracle Corporation}
> [junit4:junit4]   1>     no deletions
> [junit4:junit4]   1>     test: open reader.........OK
> [junit4:junit4]   1>     test: fields..............OK [1 fields]
> [junit4:junit4]   1>     test: field norms.........OK [0 fields]
> [junit4:junit4]   1>     test: terms, freq, prox...ERROR: java.lang.ArrayIndexOutOfBoundsException
> [junit4:junit4]   1> java.lang.ArrayIndexOutOfBoundsException
> [junit4:junit4]   1>     test: stored fields.......OK [2 total field count; avg 1 fields per doc]
> [junit4:junit4]   1>     test: term vectors........OK [0 total vector count; avg 0 term/freq vector fields per doc]
> [junit4:junit4]   1>     test: docvalues...........OK [0 total doc count; 0 docvalues fields]
> [junit4:junit4]   1> FAILED
> [junit4:junit4]   1>     WARNING: fixIndex() would remove reference to this segment; full exception:
> [junit4:junit4]   1> java.lang.RuntimeException: Term Index test failed
> [junit4:junit4]   1>    at org.apache.lucene.index.CheckIndex.checkIndex(CheckIndex.java:620)
> [junit4:junit4]   1>    at org.apache.lucene.util._TestUtil.checkIndex(_TestUtil.java:199)
> [junit4:junit4]   1>    at org.apache.lucene.store.MockDirectoryWrapper.close(MockDirectoryWrapper.java:589)
> [junit4:junit4]   1>    at org.apache.lucene.index.TestConcurrentMergeScheduler.testFlushExceptions(TestConcurrentMergeScheduler.java:118)
> [junit4:junit4]   1>    at sun.reflect.NativeMethodAccessorImpl.invoke0(Native Method)
> [junit4:junit4]   1>    at sun.reflect.NativeMethodAccessorImpl.invoke(NativeMethodAccessorImpl.java:57)
> [junit4:junit4]   1>    at sun.reflect.DelegatingMethodAccessorImpl.invoke(DelegatingMethodAccessorImpl.java:43)
> [junit4:junit4]   1>    at java.lang.reflect.Method.invoke(Method.java:601)
> [junit4:junit4]   1>    at com.carrotsearch.randomizedtesting.RandomizedRunner.invoke(RandomizedRunner.java:1559)
> [junit4:junit4]   1>    at com.carrotsearch.randomizedtesting.RandomizedRunner.access$600(RandomizedRunner.java:79)
> [junit4:junit4]   1>    at com.carrotsearch.randomizedtesting.RandomizedRunner$6.evaluate(RandomizedRunner.java:737)
> [junit4:junit4]   1>    at com.carrotsearch.randomizedtesting.RandomizedRunner$7.evaluate(RandomizedRunner.java:773)
> [junit4:junit4]   1>    at com.carrotsearch.randomizedtesting.RandomizedRunner$8.evaluate(RandomizedRunner.java:787)
> [junit4:junit4]   1>    at org.apache.lucene.util.TestRuleSetupTeardownChained$1.evaluate(TestRuleSetupTeardownChained.java:50)
> [junit4:junit4]   1>    at org.apache.lucene.util.TestRuleFieldCacheSanity$1.evaluate(TestRuleFieldCacheSanity.java:51)
> [junit4:junit4]   1>    at org.apache.lucene.util.AbstractBeforeAfterRule$1.evaluate(AbstractBeforeAfterRule.java:45)
> [junit4:junit4]   1>    at com.carrotsearch.randomizedtesting.rules.SystemPropertiesInvariantRule$1.evaluate(SystemPropertiesInvariantRule.java:55)
> [junit4:junit4]   1>    at org.apache.lucene.util.TestRuleThreadAndTestName$1.evaluate(TestRuleThreadAndTestName.java:48)
> [junit4:junit4]   1>    at org.apache.lucene.util.TestRuleIgnoreAfterMaxFailures$1.evaluate(TestRuleIgnoreAfterMaxFailures.java:70)
> [junit4:junit4]   1>    at org.apache.lucene.util.TestRuleMarkFailure$1.evaluate(TestRuleMarkFailure.java:48)
> [junit4:junit4]   1>    at com.carrotsearch.randomizedtesting.rules.StatementAdapter.evaluate(StatementAdapter.java:36)
> [junit4:junit4]   1>    at com.carrotsearch.randomizedtesting.ThreadLeakControl$StatementRunner.run(ThreadLeakControl.java:358)
> [junit4:junit4]   1>    at com.carrotsearch.randomizedtesting.ThreadLeakControl.forkTimeoutingTask(ThreadLeakControl.java:782)
> [junit4:junit4]   1>    at com.carrotsearch.randomizedtesting.ThreadLeakControl$3.evaluate(ThreadLeakControl.java:442)
> [junit4:junit4]   1>    at com.carrotsearch.randomizedtesting.RandomizedRunner.runSingleTest(RandomizedRunner.java:746)
> [junit4:junit4]   1>    at com.carrotsearch.randomizedtesting.RandomizedRunner$3.evaluate(RandomizedRunner.java:648)
> [junit4:junit4]   1>    at com.carrotsearch.randomizedtesting.RandomizedRunner$4.evaluate(RandomizedRunner.java:682)
> [junit4:junit4]   1>    at com.carrotsearch.randomizedtesting.RandomizedRunner$5.evaluate(RandomizedRunner.java:693)
> [junit4:junit4]   1>    at org.apache.lucene.util.AbstractBeforeAfterRule$1.evaluate(AbstractBeforeAfterRule.java:45)
> [junit4:junit4]   1>    at org.apache.lucene.util.TestRuleStoreClassName$1.evaluate(TestRuleStoreClassName.java:42)
> [junit4:junit4]   1>    at com.carrotsearch.randomizedtesting.rules.SystemPropertiesInvariantRule$1.evaluate(SystemPropertiesInvariantRule.java:55)
> [junit4:junit4]   1>    at com.carrotsearch.randomizedtesting.rules.NoShadowingOrOverridesOnMethodsRule$1.evaluate(NoShadowingOrOverridesOnMethodsRule.java:39)
> [junit4:junit4]   1>    at com.carrotsearch.randomizedtesting.rules.NoShadowingOrOverridesOnMethodsRule$1.evaluate(NoShadowingOrOverridesOnMethodsRule.java:39)
> [junit4:junit4]   1>    at com.carrotsearch.randomizedtesting.rules.StatementAdapter.evaluate(StatementAdapter.java:36)
> [junit4:junit4]   1>    at org.apache.lucene.util.TestRuleAssertionsRequired$1.evaluate(TestRuleAssertionsRequired.java:43)
> [junit4:junit4]   1>    at org.apache.lucene.util.TestRuleMarkFailure$1.evaluate(TestRuleMarkFailure.java:48)
> [junit4:junit4]   1>    at org.apache.lucene.util.TestRuleIgnoreAfterMaxFailures$1.evaluate(TestRuleIgnoreAfterMaxFailures.java:70)
> [junit4:junit4]   1>    at org.apache.lucene.util.TestRuleIgnoreTestSuites$1.evaluate(TestRuleIgnoreTestSuites.java:55)
> [junit4:junit4]   1>    at com.carrotsearch.randomizedtesting.rules.StatementAdapter.evaluate(StatementAdapter.java:36)
> [junit4:junit4]   1>    at com.carrotsearch.randomizedtesting.ThreadLeakControl$StatementRunner.run(ThreadLeakControl.java:358)
> [junit4:junit4]   1>    at java.lang.Thread.run(Thread.java:722)
> [junit4:junit4]   1>
> [junit4:junit4]   1>   3 of 100: name=_2 docCount=2
> [junit4:junit4]   1>     codec=Lucene3x
> [junit4:junit4]   1>     compound=false
> [junit4:junit4]   1>     numFiles=7
> [junit4:junit4]   1>     size (MB)=0
> [junit4:junit4]   1>     diagnostics = {os=Linux, os.version=3.2.0-32-generic, source=flush, lucene.version=4.1-SNAPSHOT, os.arch=i386, java.version=1.7.0_09, java.vendor=Oracle Corporation}
> [junit4:junit4]   1>     no deletions
> [junit4:junit4]   1>     test: open reader.........OK
> [junit4:junit4]   1>     test: fields..............OK [1 fields]
> [junit4:junit4]   1>     test: field norms.........OK [0 fields]
> [junit4:junit4]   1>     test: terms, freq, prox...OK [0 terms; 0 terms/docs pairs; 0 tokens]
> [junit4:junit4]   1>     test: stored fields.......OK [2 total field count; avg 1 fields per doc]
> [junit4:junit4]   1>     test: term vectors........OK [0 total vector count; avg 0 term/freq vector fields per doc]
> [junit4:junit4]   1>     test: docvalues...........OK [0 total doc count; 0 docvalues fields]
> [junit4:junit4]   1>
> [junit4:junit4]   1>   4 of 100: name=_3 docCount=2
> [junit4:junit4]   1>     codec=Lucene3x
> [junit4:junit4]   1>     compound=false
> [junit4:junit4]   1>     numFiles=7
> [junit4:junit4]   1>     size (MB)=0
> [junit4:junit4]   1>     diagnostics = {os=Linux, os.version=3.2.0-32-generic, source=flush, lucene.version=4.1-SNAPSHOT, os.arch=i386, java.version=1.7.0_09, java.vendor=Oracle Corporation}
> [junit4:junit4]   1>     no deletions
> [junit4:junit4]   1>     test: open reader.........OK
> [junit4:junit4]   1>     test: fields..............OK [1 fields]
> [junit4:junit4]   1>     test: field norms.........OK [0 fields]
> [junit4:junit4]   1>     test: terms, freq, prox...OK [0 terms; 0 terms/docs pairs; 0 tokens]
> [junit4:junit4]   1>     test: stored fields.......OK [2 total field count; avg 1 fields per doc]
> [junit4:junit4]   1>     test: term vectors........OK [0 total vector count; avg 0 term/freq vector fields per doc]
> [junit4:junit4]   1>     test: docvalues...........OK [0 total doc count; 0 docvalues fields]
> [junit4:junit4]   1>
> [junit4:junit4]   1>   5 of 100: name=_4 docCount=2
> [junit4:junit4]   1>     codec=Lucene3x
> [junit4:junit4]   1>     compound=false
> [junit4:junit4]   1>     numFiles=7
> [junit4:junit4]   1>     size (MB)=0
> [junit4:junit4]   1>     diagnostics = {os=Linux, os.version=3.2.0-32-generic, source=flush, lucene.version=4.1-SNAPSHOT, os.arch=i386, java.version=1.7.0_09, java.vendor=Oracle Corporation}
> [junit4:junit4]   1>     no deletions
> [junit4:junit4]   1>     test: open reader.........OK
> [junit4:junit4]   1>     test: fields..............OK [1 fields]
> [junit4:junit4]   1>     test: field norms.........OK [0 fields]
> [junit4:junit4]   1>     test: terms, freq, prox...OK [2 terms; 2 terms/docs pairs; 0 tokens]
> [junit4:junit4]   1>     test: stored fields.......OK [2 total field count; avg 1 fields per doc]
> [junit4:junit4]   1>     test: term vectors........OK [0 total vector count; avg 0 term/freq vector fields per doc]
> [junit4:junit4]   1>     test: docvalues...........OK [0 total doc count; 0 docvalues fields]
> [junit4:junit4]   1>
> [junit4:junit4]   1>   6 of 100: name=_5 docCount=2
> [junit4:junit4]   1>     codec=Lucene3x
> [junit4:junit4]   1>     compound=false
> [junit4:junit4]   1>     numFiles=7
> [junit4:junit4]   1>     size (MB)=0
> [junit4:junit4]   1>     diagnostics = {os=Linux, os.version=3.2.0-32-generic, source=flush, lucene.version=4.1-SNAPSHOT, os.arch=i386, java.version=1.7.0_09, java.vendor=Oracle Corporation}
> [junit4:junit4]   1>     no deletions
> [junit4:junit4]   1>     test: open reader.........OK
> [junit4:junit4]   1>     test: fields..............OK [1 fields]
> [junit4:junit4]   1>     test: field norms.........OK [0 fields]
> [junit4:junit4]   1>     test: terms, freq, prox...ERROR: java.lang.ArrayIndexOutOfBoundsException
> [junit4:junit4]   1> java.lang.ArrayIndexOutOfBoundsException
> [junit4:junit4]   1>     test: stored fields.......OK [2 total field count; avg 1 fields per doc]
> [junit4:junit4]   1>     test: term vectors........OK [0 total vector count; avg 0 term/freq vector fields per doc]
> [junit4:junit4]   1>     test: docvalues...........OK [0 total doc count; 0 docvalues fields]
> [junit4:junit4]   1> FAILED
> [junit4:junit4]   1>     WARNING: fixIndex() would remove reference to this segment; full exception:
> [junit4:junit4]   1> java.lang.RuntimeException: Term Index test failed
> [junit4:junit4]   1>    at org.apache.lucene.index.CheckIndex.checkIndex(CheckIndex.java:620)
> [junit4:junit4]   1>    at org.apache.lucene.util._TestUtil.checkIndex(_TestUtil.java:199)
> [junit4:junit4]   1>    at org.apache.lucene.store.MockDirectoryWrapper.close(MockDirectoryWrapper.java:589)
> [junit4:junit4]   1>    at org.apache.lucene.index.TestConcurrentMergeScheduler.testFlushExceptions(TestConcurrentMergeScheduler.java:118)
> [junit4:junit4]   1>    at sun.reflect.NativeMethodAccessorImpl.invoke0(Native Method)
> [junit4:junit4]   1>    at sun.reflect.NativeMethodAccessorImpl.invoke(NativeMethodAccessorImpl.java:57)
> [junit4:junit4]   1>    at sun.reflect.DelegatingMethodAccessorImpl.invoke(DelegatingMethodAccessorImpl.java:43)
> [junit4:junit4]   1>    at java.lang.reflect.Method.invoke(Method.java:601)
> [junit4:junit4]   1>    at com.carrotsearch.randomizedtesting.RandomizedRunner.invoke(RandomizedRunner.java:1559)
> [junit4:junit4]   1>    at com.carrotsearch.randomizedtesting.RandomizedRunner.access$600(RandomizedRunner.java:79)
> [junit4:junit4]   1>    at com.carrotsearch.randomizedtesting.RandomizedRunner$6.evaluate(RandomizedRunner.java:737)
> [junit4:junit4]   1>    at com.carrotsearch.randomizedtesting.RandomizedRunner$7.evaluate(RandomizedRunner.java:773)
> [junit4:junit4]   1>    at com.carrotsearch.randomizedtesting.RandomizedRunner$8.evaluate(RandomizedRunner.java:787)
> [junit4:junit4]   1>    at org.apache.lucene.util.TestRuleSetupTeardownChained$1.evaluate(TestRuleSetupTeardownChained.java:50)
> [junit4:junit4]   1>    at org.apache.lucene.util.TestRuleFieldCacheSanity$1.evaluate(TestRuleFieldCacheSanity.java:51)
> [junit4:junit4]   1>    at org.apache.lucene.util.AbstractBeforeAfterRule$1.evaluate(AbstractBeforeAfterRule.java:45)
> [junit4:junit4]   1>    at com.carrotsearch.randomizedtesting.rules.SystemPropertiesInvariantRule$1.evaluate(SystemPropertiesInvariantRule.java:55)
> [junit4:junit4]   1>    at org.apache.lucene.util.TestRuleThreadAndTestName$1.evaluate(TestRuleThreadAndTestName.java:48)
> [junit4:junit4]   1>    at org.apache.lucene.util.TestRuleIgnoreAfterMaxFailures$1.evaluate(TestRuleIgnoreAfterMaxFailures.java:70)
> [junit4:junit4]   1>    at org.apache.lucene.util.TestRuleMarkFailure$1.evaluate(TestRuleMarkFailure.java:48)
> [junit4:junit4]   1>    at com.carrotsearch.randomizedtesting.rules.StatementAdapter.evaluate(StatementAdapter.java:36)
> [junit4:junit4]   1>    at com.carrotsearch.randomizedtesting.ThreadLeakControl$StatementRunner.run(ThreadLeakControl.java:358)
> [junit4:junit4]   1>    at com.carrotsearch.randomizedtesting.ThreadLeakControl.forkTimeoutingTask(ThreadLeakControl.java:782)
> [junit4:junit4]   1>    at com.carrotsearch.randomizedtesting.ThreadLeakControl$3.evaluate(ThreadLeakControl.java:442)
> [junit4:junit4]   1>    at com.carrotsearch.randomizedtesting.RandomizedRunner.runSingleTest(RandomizedRunner.java:746)
> [junit4:junit4]   1>    at com.carrotsearch.randomizedtesting.RandomizedRunner$3.evaluate(RandomizedRunner.java:648)
> [junit4:junit4]   1>    at com.carrotsearch.randomizedtesting.RandomizedRunner$4.evaluate(RandomizedRunner.java:682)
> [junit4:junit4]   1>    at com.carrotsearch.randomizedtesting.RandomizedRunner$5.evaluate(RandomizedRunner.java:693)
> [junit4:junit4]   1>    at org.apache.lucene.util.AbstractBeforeAfterRule$1.evaluate(AbstractBeforeAfterRule.java:45)
> [junit4:junit4]   1>    at org.apache.lucene.util.TestRuleStoreClassName$1.evaluate(TestRuleStoreClassName.java:42)
> [junit4:junit4]   1>    at com.carrotsearch.randomizedtesting.rules.SystemPropertiesInvariantRule$1.evaluate(SystemPropertiesInvariantRule.java:55)
> [junit4:junit4]   1>    at com.carrotsearch.randomizedtesting.rules.NoShadowingOrOverridesOnMethodsRule$1.evaluate(NoShadowingOrOverridesOnMethodsRule.java:39)
> [junit4:junit4]   1>    at com.carrotsearch.randomizedtesting.rules.NoShadowingOrOverridesOnMethodsRule$1.evaluate(NoShadowingOrOverridesOnMethodsRule.java:39)
> [junit4:junit4]   1>    at com.carrotsearch.randomizedtesting.rules.StatementAdapter.evaluate(StatementAdapter.java:36)
> [junit4:junit4]   1>    at org.apache.lucene.util.TestRuleAssertionsRequired$1.evaluate(TestRuleAssertionsRequired.java:43)
> [junit4:junit4]   1>    at org.apache.lucene.util.TestRuleMarkFailure$1.evaluate(TestRuleMarkFailure.java:48)
> [junit4:junit4]   1>    at org.apache.lucene.util.TestRuleIgnoreAfterMaxFailures$1.evaluate(TestRuleIgnoreAfterMaxFailures.java:70)
> [junit4:junit4]   1>    at org.apache.lucene.util.TestRuleIgnoreTestSuites$1.evaluate(TestRuleIgnoreTestSuites.java:55)
> [junit4:junit4]   1>    at com.carrotsearch.randomizedtesting.rules.StatementAdapter.evaluate(StatementAdapter.java:36)
> [junit4:junit4]   1>    at com.carrotsearch.randomizedtesting.ThreadLeakControl$StatementRunner.run(ThreadLeakControl.java:358)
> [junit4:junit4]   1>    at java.lang.Thread.run(Thread.java:722)
> [junit4:junit4]   1>
> [junit4:junit4]   1>   7 of 100: name=_6 docCount=2
> [junit4:junit4]   1>     codec=Lucene3x
> [junit4:junit4]   1>     compound=false
> [junit4:junit4]   1>     numFiles=7
> [junit4:junit4]   1>     size (MB)=0
> [junit4:junit4]   1>     diagnostics = {os=Linux, os.version=3.2.0-32-generic, source=flush, lucene.version=4.1-SNAPSHOT, os.arch=i386, java.version=1.7.0_09, java.vendor=Oracle Corporation}
> [junit4:junit4]   1>     no deletions
> [junit4:junit4]   1>     test: open reader.........OK
> [junit4:junit4]   1>     test: fields..............OK [1 fields]
> [junit4:junit4]   1>     test: field norms.........OK [0 fields]
> [junit4:junit4]   1>     test: terms, freq, prox...OK [2 terms; 2 terms/docs pairs; 0 tokens]
> [junit4:junit4]   1>     test: stored fields.......OK [2 total field count; avg 1 fields per doc]
> [junit4:junit4]   1>     test: term vectors........OK [0 total vector count; avg 0 term/freq vector fields per doc]
> [junit4:junit4]   1>     test: docvalues...........OK [0 total doc count; 0 docvalues fields]
> [junit4:junit4]   1>
> [junit4:junit4]   1>   8 of 100: name=_7 docCount=2
> [junit4:junit4]   1>     codec=Lucene3x
> [junit4:junit4]   1>     compound=false
> [junit4:junit4]   1>     numFiles=7
> [junit4:junit4]   1>     size (MB)=0
> [junit4:junit4]   1>     diagnostics = {os=Linux, os.version=3.2.0-32-generic, source=flush, lucene.version=4.1-SNAPSHOT, os.arch=i386, java.version=1.7.0_09, java.vendor=Oracle Corporation}
> [junit4:junit4]   1>     no deletions
> [junit4:junit4]   1>     test: open reader.........OK
> [junit4:junit4]   1>     test: fields..............OK [1 fields]
> [junit4:junit4]   1>     test: field norms.........OK [0 fields]
> [junit4:junit4]   1>     test: terms, freq, prox...OK [2 terms; 2 terms/docs pairs; 0 tokens]
> [junit4:junit4]   1>     test: stored fields.......OK [2 total field count; avg 1 fields per doc]
> [junit4:junit4]   1>     test: term vectors........OK [0 total vector count; avg 0 term/freq vector fields per doc]
> [junit4:junit4]   1>     test: docvalues...........OK [0 total doc count; 0 docvalues fields]
> [junit4:junit4]   1>
> [junit4:junit4]   1>   9 of 100: name=_8 docCount=2
> [junit4:junit4]   1>     codec=Lucene3x
> [junit4:junit4]   1>     compound=false
> [junit4:junit4]   1>     numFiles=7
> [junit4:junit4]   1>     size (MB)=0
> [junit4:junit4]   1>     diagnostics = {os=Linux, os.version=3.2.0-32-generic, source=flush, lucene.version=4.1-SNAPSHOT, os.arch=i386, java.version=1.7.0_09, java.vendor=Oracle Corporation}
> [junit4:junit4]   1>     no deletions
> [junit4:junit4]   1>     test: open reader.........OK
> [junit4:junit4]   1>     test: fields..............OK [1 fields]
> [junit4:junit4]   1>     test: field norms.........OK [0 fields]
> [junit4:junit4]   1>     test: terms, freq, prox...OK [2 terms; 2 terms/docs pairs; 0 tokens]
> [junit4:junit4]   1>     test: stored fields.......OK [2 total field count; avg 1 fields per doc]
> [junit4:junit4]   1>     test: term vectors........OK [0 total vector count; avg 0 term/freq vector fields per doc]
> [junit4:junit4]   1>     test: docvalues...........OK [0 total doc count; 0 docvalues fields]
> [junit4:junit4]   1>
> [junit4:junit4]   1>   10 of 100: name=_9 docCount=2
> [junit4:junit4]   1>     codec=Lucene3x
> [junit4:junit4]   1>     compound=false
> [junit4:junit4]   1>     numFiles=7
> [junit4:junit4]   1>     size (MB)=0
> [junit4:junit4]   1>     diagnostics = {os=Linux, os.version=3.2.0-32-generic, source=flush, lucene.version=4.1-SNAPSHOT, os.arch=i386, java.version=1.7.0_09, java.vendor=Oracle Corporation}
> [junit4:junit4]   1>     no deletions
> [junit4:junit4]   1>     test: open reader.........OK
> [junit4:junit4]   1>     test: fields..............OK [1 fields]
> [junit4:junit4]   1>     test: field norms.........OK [0 fields]
> [junit4:junit4]   1>     test: terms, freq, prox...OK [2 terms; 2 terms/docs pairs; 0 tokens]
> [junit4:junit4]   1>     test: stored fields.......OK [2 total field count; avg 1 fields per doc]
> [junit4:junit4]   1>...
>
> [Message clipped]
>
> ---------------------------------------------------------------------
> To unsubscribe, e-mail: dev-unsubscribe@lucene.apache.org
> For additional commands, e-mail: dev-help@lucene.apache.org

---------------------------------------------------------------------
To unsubscribe, e-mail: dev-unsubscribe@lucene.apache.org
For additional commands, e-mail: dev-help@lucene.apache.org


Mime
View raw message