lucene-dev mailing list archives

Site index · List index
Message view « Date » · « Thread »
Top « Date » · « Thread »
From Apache Jenkins Server <jenk...@builds.apache.org>
Subject [JENKINS] Lucene-Solr-Tests-4.x-java7 - Build # 609 - Still Failing
Date Sat, 03 Nov 2012 03:28:35 GMT
Build: https://builds.apache.org/job/Lucene-Solr-Tests-4.x-java7/609/

4 tests failed.
FAILED:  junit.framework.TestSuite.org.apache.solr.cloud.LeaderElectionIntegrationTest

Error Message:
Suite timeout exceeded (>= 7200000 msec).

Stack Trace:
java.lang.Exception: Suite timeout exceeded (>= 7200000 msec).
	at __randomizedtesting.SeedInfo.seed([74596681D419C368]:0)


FAILED:  junit.framework.TestSuite.org.apache.solr.request.TestRemoteStreaming

Error Message:
4 threads leaked from SUITE scope at org.apache.solr.request.TestRemoteStreaming:     1) Thread[id=35, name=qtp1053008442-35 Acceptor0 SelectChannelConnector@0.0.0.0:50599, state=BLOCKED, group=TGRP-TestRemoteStreaming]         at sun.nio.ch.ServerSocketChannelImpl.accept(ServerSocketChannelImpl.java:210)         at org.eclipse.jetty.server.nio.SelectChannelConnector.accept(SelectChannelConnector.java:104)         at org.eclipse.jetty.server.AbstractConnector$Acceptor.run(AbstractConnector.java:933)         at org.eclipse.jetty.util.thread.QueuedThreadPool.runJob(QueuedThreadPool.java:599)         at org.eclipse.jetty.util.thread.QueuedThreadPool$3.run(QueuedThreadPool.java:534)         at java.lang.Thread.run(Thread.java:722)    2) Thread[id=37, name=qtp1053008442-37 Acceptor2 SelectChannelConnector@0.0.0.0:50599, state=RUNNABLE, group=TGRP-TestRemoteStreaming]         at sun.nio.ch.ServerSocketChannelImpl.accept0(Native Method)         at sun.nio.ch.ServerSocketChannelImpl.accept(ServerSocketChannelImpl.java:226)         at org.eclipse.jetty.server.nio.SelectChannelConnector.accept(SelectChannelConnector.java:104)         at org.eclipse.jetty.server.AbstractConnector$Acceptor.run(AbstractConnector.java:933)         at org.eclipse.jetty.util.thread.QueuedThreadPool.runJob(QueuedThreadPool.java:599)         at org.eclipse.jetty.util.thread.QueuedThreadPool$3.run(QueuedThreadPool.java:534)         at java.lang.Thread.run(Thread.java:722)    3) Thread[id=38, name=qtp1053008442-38 Acceptor3 SelectChannelConnector@0.0.0.0:50599, state=BLOCKED, group=TGRP-TestRemoteStreaming]         at sun.nio.ch.ServerSocketChannelImpl.accept(ServerSocketChannelImpl.java:210)         at org.eclipse.jetty.server.nio.SelectChannelConnector.accept(SelectChannelConnector.java:104)         at org.eclipse.jetty.server.AbstractConnector$Acceptor.run(AbstractConnector.java:933)         at org.eclipse.jetty.util.thread.QueuedThreadPool.runJob(QueuedThreadPool.java:599)         at org.eclipse.jetty.util.thread.QueuedThreadPool$3.run(QueuedThreadPool.java:534)         at java.lang.Thread.run(Thread.java:722)    4) Thread[id=36, name=qtp1053008442-36 Acceptor1 SelectChannelConnector@0.0.0.0:50599, state=BLOCKED, group=TGRP-TestRemoteStreaming]         at sun.nio.ch.ServerSocketChannelImpl.accept(ServerSocketChannelImpl.java:210)         at org.eclipse.jetty.server.nio.SelectChannelConnector.accept(SelectChannelConnector.java:104)         at org.eclipse.jetty.server.AbstractConnector$Acceptor.run(AbstractConnector.java:933)         at org.eclipse.jetty.util.thread.QueuedThreadPool.runJob(QueuedThreadPool.java:599)         at org.eclipse.jetty.util.thread.QueuedThreadPool$3.run(QueuedThreadPool.java:534)         at java.lang.Thread.run(Thread.java:722)

Stack Trace:
com.carrotsearch.randomizedtesting.ThreadLeakError: 4 threads leaked from SUITE scope at org.apache.solr.request.TestRemoteStreaming: 
   1) Thread[id=35, name=qtp1053008442-35 Acceptor0 SelectChannelConnector@0.0.0.0:50599, state=BLOCKED, group=TGRP-TestRemoteStreaming]
        at sun.nio.ch.ServerSocketChannelImpl.accept(ServerSocketChannelImpl.java:210)
        at org.eclipse.jetty.server.nio.SelectChannelConnector.accept(SelectChannelConnector.java:104)
        at org.eclipse.jetty.server.AbstractConnector$Acceptor.run(AbstractConnector.java:933)
        at org.eclipse.jetty.util.thread.QueuedThreadPool.runJob(QueuedThreadPool.java:599)
        at org.eclipse.jetty.util.thread.QueuedThreadPool$3.run(QueuedThreadPool.java:534)
        at java.lang.Thread.run(Thread.java:722)
   2) Thread[id=37, name=qtp1053008442-37 Acceptor2 SelectChannelConnector@0.0.0.0:50599, state=RUNNABLE, group=TGRP-TestRemoteStreaming]
        at sun.nio.ch.ServerSocketChannelImpl.accept0(Native Method)
        at sun.nio.ch.ServerSocketChannelImpl.accept(ServerSocketChannelImpl.java:226)
        at org.eclipse.jetty.server.nio.SelectChannelConnector.accept(SelectChannelConnector.java:104)
        at org.eclipse.jetty.server.AbstractConnector$Acceptor.run(AbstractConnector.java:933)
        at org.eclipse.jetty.util.thread.QueuedThreadPool.runJob(QueuedThreadPool.java:599)
        at org.eclipse.jetty.util.thread.QueuedThreadPool$3.run(QueuedThreadPool.java:534)
        at java.lang.Thread.run(Thread.java:722)
   3) Thread[id=38, name=qtp1053008442-38 Acceptor3 SelectChannelConnector@0.0.0.0:50599, state=BLOCKED, group=TGRP-TestRemoteStreaming]
        at sun.nio.ch.ServerSocketChannelImpl.accept(ServerSocketChannelImpl.java:210)
        at org.eclipse.jetty.server.nio.SelectChannelConnector.accept(SelectChannelConnector.java:104)
        at org.eclipse.jetty.server.AbstractConnector$Acceptor.run(AbstractConnector.java:933)
        at org.eclipse.jetty.util.thread.QueuedThreadPool.runJob(QueuedThreadPool.java:599)
        at org.eclipse.jetty.util.thread.QueuedThreadPool$3.run(QueuedThreadPool.java:534)
        at java.lang.Thread.run(Thread.java:722)
   4) Thread[id=36, name=qtp1053008442-36 Acceptor1 SelectChannelConnector@0.0.0.0:50599, state=BLOCKED, group=TGRP-TestRemoteStreaming]
        at sun.nio.ch.ServerSocketChannelImpl.accept(ServerSocketChannelImpl.java:210)
        at org.eclipse.jetty.server.nio.SelectChannelConnector.accept(SelectChannelConnector.java:104)
        at org.eclipse.jetty.server.AbstractConnector$Acceptor.run(AbstractConnector.java:933)
        at org.eclipse.jetty.util.thread.QueuedThreadPool.runJob(QueuedThreadPool.java:599)
        at org.eclipse.jetty.util.thread.QueuedThreadPool$3.run(QueuedThreadPool.java:534)
        at java.lang.Thread.run(Thread.java:722)
	at __randomizedtesting.SeedInfo.seed([74596681D419C368]:0)


FAILED:  junit.framework.TestSuite.org.apache.solr.request.TestRemoteStreaming

Error Message:
There are still zombie threads that couldn't be terminated:    1) Thread[id=35, name=qtp1053008442-35 Acceptor0 SelectChannelConnector@0.0.0.0:50599, state=BLOCKED, group=TGRP-TestRemoteStreaming]         at sun.nio.ch.ServerSocketChannelImpl.accept(ServerSocketChannelImpl.java:210)         at org.eclipse.jetty.server.nio.SelectChannelConnector.accept(SelectChannelConnector.java:104)         at org.eclipse.jetty.server.AbstractConnector$Acceptor.run(AbstractConnector.java:933)         at org.eclipse.jetty.util.thread.QueuedThreadPool.runJob(QueuedThreadPool.java:599)         at org.eclipse.jetty.util.thread.QueuedThreadPool$3.run(QueuedThreadPool.java:534)         at java.lang.Thread.run(Thread.java:722)    2) Thread[id=37, name=qtp1053008442-37 Acceptor2 SelectChannelConnector@0.0.0.0:50599, state=RUNNABLE, group=TGRP-TestRemoteStreaming]         at sun.nio.ch.ServerSocketChannelImpl.accept0(Native Method)         at sun.nio.ch.ServerSocketChannelImpl.accept(ServerSocketChannelImpl.java:226)         at org.eclipse.jetty.server.nio.SelectChannelConnector.accept(SelectChannelConnector.java:104)         at org.eclipse.jetty.server.AbstractConnector$Acceptor.run(AbstractConnector.java:933)         at org.eclipse.jetty.util.thread.QueuedThreadPool.runJob(QueuedThreadPool.java:599)         at org.eclipse.jetty.util.thread.QueuedThreadPool$3.run(QueuedThreadPool.java:534)         at java.lang.Thread.run(Thread.java:722)    3) Thread[id=38, name=qtp1053008442-38 Acceptor3 SelectChannelConnector@0.0.0.0:50599, state=BLOCKED, group=TGRP-TestRemoteStreaming]         at sun.nio.ch.ServerSocketChannelImpl.accept(ServerSocketChannelImpl.java:210)         at org.eclipse.jetty.server.nio.SelectChannelConnector.accept(SelectChannelConnector.java:104)         at org.eclipse.jetty.server.AbstractConnector$Acceptor.run(AbstractConnector.java:933)         at org.eclipse.jetty.util.thread.QueuedThreadPool.runJob(QueuedThreadPool.java:599)         at org.eclipse.jetty.util.thread.QueuedThreadPool$3.run(QueuedThreadPool.java:534)         at java.lang.Thread.run(Thread.java:722)    4) Thread[id=36, name=qtp1053008442-36 Acceptor1 SelectChannelConnector@0.0.0.0:50599, state=BLOCKED, group=TGRP-TestRemoteStreaming]         at sun.nio.ch.ServerSocketChannelImpl.accept(ServerSocketChannelImpl.java:210)         at org.eclipse.jetty.server.nio.SelectChannelConnector.accept(SelectChannelConnector.java:104)         at org.eclipse.jetty.server.AbstractConnector$Acceptor.run(AbstractConnector.java:933)         at org.eclipse.jetty.util.thread.QueuedThreadPool.runJob(QueuedThreadPool.java:599)         at org.eclipse.jetty.util.thread.QueuedThreadPool$3.run(QueuedThreadPool.java:534)         at java.lang.Thread.run(Thread.java:722)

Stack Trace:
com.carrotsearch.randomizedtesting.ThreadLeakError: There are still zombie threads that couldn't be terminated:
   1) Thread[id=35, name=qtp1053008442-35 Acceptor0 SelectChannelConnector@0.0.0.0:50599, state=BLOCKED, group=TGRP-TestRemoteStreaming]
        at sun.nio.ch.ServerSocketChannelImpl.accept(ServerSocketChannelImpl.java:210)
        at org.eclipse.jetty.server.nio.SelectChannelConnector.accept(SelectChannelConnector.java:104)
        at org.eclipse.jetty.server.AbstractConnector$Acceptor.run(AbstractConnector.java:933)
        at org.eclipse.jetty.util.thread.QueuedThreadPool.runJob(QueuedThreadPool.java:599)
        at org.eclipse.jetty.util.thread.QueuedThreadPool$3.run(QueuedThreadPool.java:534)
        at java.lang.Thread.run(Thread.java:722)
   2) Thread[id=37, name=qtp1053008442-37 Acceptor2 SelectChannelConnector@0.0.0.0:50599, state=RUNNABLE, group=TGRP-TestRemoteStreaming]
        at sun.nio.ch.ServerSocketChannelImpl.accept0(Native Method)
        at sun.nio.ch.ServerSocketChannelImpl.accept(ServerSocketChannelImpl.java:226)
        at org.eclipse.jetty.server.nio.SelectChannelConnector.accept(SelectChannelConnector.java:104)
        at org.eclipse.jetty.server.AbstractConnector$Acceptor.run(AbstractConnector.java:933)
        at org.eclipse.jetty.util.thread.QueuedThreadPool.runJob(QueuedThreadPool.java:599)
        at org.eclipse.jetty.util.thread.QueuedThreadPool$3.run(QueuedThreadPool.java:534)
        at java.lang.Thread.run(Thread.java:722)
   3) Thread[id=38, name=qtp1053008442-38 Acceptor3 SelectChannelConnector@0.0.0.0:50599, state=BLOCKED, group=TGRP-TestRemoteStreaming]
        at sun.nio.ch.ServerSocketChannelImpl.accept(ServerSocketChannelImpl.java:210)
        at org.eclipse.jetty.server.nio.SelectChannelConnector.accept(SelectChannelConnector.java:104)
        at org.eclipse.jetty.server.AbstractConnector$Acceptor.run(AbstractConnector.java:933)
        at org.eclipse.jetty.util.thread.QueuedThreadPool.runJob(QueuedThreadPool.java:599)
        at org.eclipse.jetty.util.thread.QueuedThreadPool$3.run(QueuedThreadPool.java:534)
        at java.lang.Thread.run(Thread.java:722)
   4) Thread[id=36, name=qtp1053008442-36 Acceptor1 SelectChannelConnector@0.0.0.0:50599, state=BLOCKED, group=TGRP-TestRemoteStreaming]
        at sun.nio.ch.ServerSocketChannelImpl.accept(ServerSocketChannelImpl.java:210)
        at org.eclipse.jetty.server.nio.SelectChannelConnector.accept(SelectChannelConnector.java:104)
        at org.eclipse.jetty.server.AbstractConnector$Acceptor.run(AbstractConnector.java:933)
        at org.eclipse.jetty.util.thread.QueuedThreadPool.runJob(QueuedThreadPool.java:599)
        at org.eclipse.jetty.util.thread.QueuedThreadPool$3.run(QueuedThreadPool.java:534)
        at java.lang.Thread.run(Thread.java:722)
	at __randomizedtesting.SeedInfo.seed([74596681D419C368]:0)


FAILED:  org.apache.solr.cloud.LeaderElectionIntegrationTest.testLeaderElectionAfterClientTimeout

Error Message:
Test abandoned because suite timeout was reached.

Stack Trace:
java.lang.Exception: Test abandoned because suite timeout was reached.
	at __randomizedtesting.SeedInfo.seed([74596681D419C368]:0)




Build Log:
[...truncated 8297 lines...]
[junit4:junit4] Suite: org.apache.solr.request.TestRemoteStreaming
[junit4:junit4]   2> 0 T28 oas.SolrTestCaseJ4.initCore ####initCore
[junit4:junit4]   2> Creating dataDir: /usr/home/hudson/hudson-slave/workspace/Lucene-Solr-Tests-4.x-java7/solr/build/solr-core/test/J1/./solrtest-TestRemoteStreaming-1351906047269
[junit4:junit4]   2> 2 T28 oas.SolrTestCaseJ4.initCore ####initCore end
[junit4:junit4]   2> 573 T28 oejs.Server.doStart jetty-8.1.2.v20120308
[junit4:junit4]   2> 917 T28 oejs.AbstractConnector.doStart Started SelectChannelConnector@0.0.0.0:50599
[junit4:junit4]   2> 959 T28 oasc.SolrResourceLoader.locateSolrHome JNDI not configured for solr (NoInitialContextEx)
[junit4:junit4]   2> 960 T28 oasc.SolrResourceLoader.locateSolrHome using system property solr.solr.home: solr/
[junit4:junit4]   2> 960 T28 oasc.SolrResourceLoader.<init> new SolrResourceLoader for deduced Solr Home: 'solr/'
[junit4:junit4]   2> 1004 T28 oass.SolrDispatchFilter.init SolrDispatchFilter.init()
[junit4:junit4]   2> 1005 T28 oasc.SolrResourceLoader.locateSolrHome JNDI not configured for solr (NoInitialContextEx)
[junit4:junit4]   2> 1005 T28 oasc.SolrResourceLoader.locateSolrHome using system property solr.solr.home: solr/
[junit4:junit4]   2> 1006 T28 oasc.CoreContainer$Initializer.initialize looking for solr.xml: /usr/home/hudson/hudson-slave/workspace/Lucene-Solr-Tests-4.x-java7/solr/build/solr-core/test/J1/solr/solr.xml
[junit4:junit4]   2> 1006 T28 oasc.CoreContainer.<init> New CoreContainer 1645340219
[junit4:junit4]   2> 1007 T28 oasc.CoreContainer$Initializer.initialize no solr.xml file found - using default
[junit4:junit4]   2> 1008 T28 oasc.CoreContainer.load Loading CoreContainer using Solr Home: 'solr/'
[junit4:junit4]   2> 1008 T28 oasc.SolrResourceLoader.<init> new SolrResourceLoader for directory: 'solr/'
[junit4:junit4]   2> 1053 T28 oasc.CoreContainer.load Registering Log Listener
[junit4:junit4]   2> 1109 T28 oasc.CoreContainer.create Creating SolrCore 'collection1' using instanceDir: solr/collection1
[junit4:junit4]   2> 1110 T28 oasc.SolrResourceLoader.<init> new SolrResourceLoader for directory: 'solr/collection1/'
[junit4:junit4]   2> 1186 T28 oasc.SolrConfig.<init> Using Lucene MatchVersion: LUCENE_41
[junit4:junit4]   2> 1257 T28 oasc.SolrConfig.<init> Loaded SolrConfig: solrconfig.xml
[junit4:junit4]   2> 1261 T28 oass.IndexSchema.readSchema Reading Solr Schema
[junit4:junit4]   2> 1290 T28 oass.IndexSchema.readSchema Schema name=test
[junit4:junit4]   2> 1883 T28 oass.OpenExchangeRatesOrgProvider.init Initialized with rates=open-exchange-rates.json, refreshInterval=1440.
[junit4:junit4]   2> 1896 T28 oass.IndexSchema.readSchema default search field in schema is text
[junit4:junit4]   2> 1900 T28 oass.IndexSchema.readSchema unique key field: id
[junit4:junit4]   2> 1943 T28 oass.FileExchangeRateProvider.reload Reloading exchange rates from file currency.xml
[junit4:junit4]   2> 1967 T28 oass.FileExchangeRateProvider.reload Reloading exchange rates from file currency.xml
[junit4:junit4]   2> 1974 T28 oass.OpenExchangeRatesOrgProvider.reload Reloading exchange rates from open-exchange-rates.json
[junit4:junit4]   2> 1982 T28 oass.OpenExchangeRatesOrgProvider.reload Reloading exchange rates from open-exchange-rates.json
[junit4:junit4]   2> 1986 T28 oasc.SolrCore.<init> [collection1] Opening new SolrCore at solr/collection1/, dataDir=/usr/home/hudson/hudson-slave/workspace/Lucene-Solr-Tests-4.x-java7/solr/build/solr-core/test/J1/solrtest-TestRemoteStreaming-1351906047269/
[junit4:junit4]   2> 1986 T28 oasc.JmxMonitoredMap.<init> JMX monitoring is enabled. Adding Solr mbeans to JMX Server: com.sun.jmx.mbeanserver.JmxMBeanServer@2bf96987
[junit4:junit4]   2> 1989 T28 oasc.SolrCore.getNewIndexDir New index directory detected: old=null new=/usr/home/hudson/hudson-slave/workspace/Lucene-Solr-Tests-4.x-java7/solr/build/solr-core/test/J1/solrtest-TestRemoteStreaming-1351906047269/index/
[junit4:junit4]   2> 1990 T28 oasc.SolrCore.initIndex WARNING [collection1] Solr index directory '/usr/home/hudson/hudson-slave/workspace/Lucene-Solr-Tests-4.x-java7/solr/build/solr-core/test/J1/solrtest-TestRemoteStreaming-1351906047269/index' doesn't exist. Creating new index...
[junit4:junit4]   2> 1992 T28 oasc.CachingDirectoryFactory.get return new directory for /usr/home/hudson/hudson-slave/workspace/Lucene-Solr-Tests-4.x-java7/solr/build/solr-core/test/J1/solrtest-TestRemoteStreaming-1351906047269/index forceNew:false
[junit4:junit4]   2> 1996 T28 oasc.SolrDeletionPolicy.onCommit SolrDeletionPolicy.onCommit: commits:num=1
[junit4:junit4]   2> 		commit{dir=BaseDirectoryWrapper(org.apache.lucene.store.RAMDirectory@4bc2ebc7 lockFactory=org.apache.lucene.store.NativeFSLockFactory@e3c3695),segFN=segments_1,generation=1,filenames=[segments_1]
[junit4:junit4]   2> 1997 T28 oasc.SolrDeletionPolicy.updateCommits newest commit = 1
[junit4:junit4]   2> 1999 T28 oasc.SolrCore.initWriters created xml: solr.XMLResponseWriter
[junit4:junit4]   2> 2004 T28 oasup.UpdateRequestProcessorChain.init inserting DistributedUpdateProcessorFactory into updateRequestProcessorChain "dedupe"
[junit4:junit4]   2> 2006 T28 oasup.UpdateRequestProcessorChain.init inserting DistributedUpdateProcessorFactory into updateRequestProcessorChain "dedupe-allfields"
[junit4:junit4]   2> 2007 T28 oasup.UpdateRequestProcessorChain.init inserting DistributedUpdateProcessorFactory into updateRequestProcessorChain "stored_sig"
[junit4:junit4]   2> 2008 T28 oasup.UpdateRequestProcessorChain.init inserting DistributedUpdateProcessorFactory into updateRequestProcessorChain "uniq-fields"
[junit4:junit4]   2> 2010 T28 oasup.UpdateRequestProcessorChain.init inserting DistributedUpdateProcessorFactory into updateRequestProcessorChain "distrib-dup-test-chain-implicit"
[junit4:junit4]   2> 2011 T28 oasc.RequestHandlers.initHandlersFromConfig adding lazy requestHandler: solr.ReplicationHandler
[junit4:junit4]   2> 2012 T28 oasc.RequestHandlers.initHandlersFromConfig created /replication: solr.ReplicationHandler
[junit4:junit4]   2> 2014 T28 oasc.RequestHandlers.initHandlersFromConfig created standard: solr.StandardRequestHandler
[junit4:junit4]   2> 2015 T28 oasc.RequestHandlers.initHandlersFromConfig created /get: solr.RealTimeGetHandler
[junit4:junit4]   2> 2017 T28 oasc.RequestHandlers.initHandlersFromConfig created dismax: solr.SearchHandler
[junit4:junit4]   2> 2019 T28 oasc.RequestHandlers.initHandlersFromConfig created mock: org.apache.solr.core.MockQuerySenderListenerReqHandler
[junit4:junit4]   2> 2020 T28 oasc.RequestHandlers.initHandlersFromConfig created /admin/: org.apache.solr.handler.admin.AdminHandlers
[junit4:junit4]   2> 2021 T28 oasc.RequestHandlers.initHandlersFromConfig created defaults: solr.StandardRequestHandler
[junit4:junit4]   2> 2022 T28 oasc.RequestHandlers.initHandlersFromConfig adding lazy requestHandler: solr.StandardRequestHandler
[junit4:junit4]   2> 2024 T28 oasc.RequestHandlers.initHandlersFromConfig created lazy: solr.StandardRequestHandler
[junit4:junit4]   2> 2025 T28 oasc.RequestHandlers.initHandlersFromConfig created /update: solr.UpdateRequestHandler
[junit4:junit4]   2> 2027 T28 oasc.RequestHandlers.initHandlersFromConfig created /terms: org.apache.solr.handler.component.SearchHandler
[junit4:junit4]   2> 2028 T28 oasc.RequestHandlers.initHandlersFromConfig created spellCheckCompRH: org.apache.solr.handler.component.SearchHandler
[junit4:junit4]   2> 2030 T28 oasc.RequestHandlers.initHandlersFromConfig created spellCheckCompRH_Direct: org.apache.solr.handler.component.SearchHandler
[junit4:junit4]   2> 2032 T28 oasc.RequestHandlers.initHandlersFromConfig created spellCheckWithWordbreak: org.apache.solr.handler.component.SearchHandler
[junit4:junit4]   2> 2033 T28 oasc.RequestHandlers.initHandlersFromConfig created spellCheckWithWordbreak_Direct: org.apache.solr.handler.component.SearchHandler
[junit4:junit4]   2> 2035 T28 oasc.RequestHandlers.initHandlersFromConfig created spellCheckCompRH1: org.apache.solr.handler.component.SearchHandler
[junit4:junit4]   2> 2036 T28 oasc.RequestHandlers.initHandlersFromConfig created tvrh: org.apache.solr.handler.component.SearchHandler
[junit4:junit4]   2> 2038 T28 oasc.RequestHandlers.initHandlersFromConfig created /mlt: solr.MoreLikeThisHandler
[junit4:junit4]   2> 2039 T28 oasc.RequestHandlers.initHandlersFromConfig created /debug/dump: solr.DumpRequestHandler
[junit4:junit4]   2> 2063 T28 oashl.XMLLoader.init xsltCacheLifetimeSeconds=60
[junit4:junit4]   2> 2072 T28 oasc.SolrCore.initDeprecatedSupport WARNING solrconfig.xml uses deprecated <admin/gettableFiles>, Please update your config to use the ShowFileRequestHandler.
[junit4:junit4]   2> 2075 T28 oasc.SolrCore.initDeprecatedSupport WARNING adding ShowFileRequestHandler with hidden files: []
[junit4:junit4]   2> 2080 T28 oass.SolrIndexSearcher.<init> Opening Searcher@33a40908 main
[junit4:junit4]   2> 2081 T28 oass.SolrIndexSearcher.getIndexDir WARNING WARNING: Directory impl does not support setting indexDir: org.apache.lucene.store.BaseDirectoryWrapper
[junit4:junit4]   2> 2083 T28 oasu.CommitTracker.<init> Hard AutoCommit: disabled
[junit4:junit4]   2> 2084 T28 oasu.CommitTracker.<init> Soft AutoCommit: disabled
[junit4:junit4]   2> 2085 T28 oashc.SpellCheckComponent.inform Initializing spell checkers
[junit4:junit4]   2> 2129 T28 oass.DirectSolrSpellChecker.init init: {name=direct,classname=DirectSolrSpellChecker,field=lowerfilt,minQueryLength=3}
[junit4:junit4]   2> 2361 T28 oashc.HttpShardHandlerFactory.getParameter Setting socketTimeout to: 0
[junit4:junit4]   2> 2362 T28 oashc.HttpShardHandlerFactory.getParameter Setting urlScheme to: http://
[junit4:junit4]   2> 2363 T28 oashc.HttpShardHandlerFactory.getParameter Setting connTimeout to: 0
[junit4:junit4]   2> 2364 T28 oashc.HttpShardHandlerFactory.getParameter Setting maxConnectionsPerHost to: 20
[junit4:junit4]   2> 2364 T28 oashc.HttpShardHandlerFactory.getParameter Setting corePoolSize to: 0
[junit4:junit4]   2> 2365 T28 oashc.HttpShardHandlerFactory.getParameter Setting maximumPoolSize to: 2147483647
[junit4:junit4]   2> 2365 T28 oashc.HttpShardHandlerFactory.getParameter Setting maxThreadIdleTime to: 5
[junit4:junit4]   2> 2366 T28 oashc.HttpShardHandlerFactory.getParameter Setting sizeOfQueue to: -1
[junit4:junit4]   2> 2367 T28 oashc.HttpShardHandlerFactory.getParameter Setting fairnessPolicy to: false
[junit4:junit4]   2> 2367 T28 oascsi.HttpClientUtil.createClient Creating new http client, config:maxConnectionsPerHost=20&maxConnections=10000&socketTimeout=0&connTimeout=0&retry=false
[junit4:junit4]   2> 2391 T43 oasc.SolrCore.registerSearcher [collection1] Registered new searcher Searcher@33a40908 main{StandardDirectoryReader(segments_1:1)}
[junit4:junit4]   2> 2405 T28 oasc.CoreContainer.register registering core: collection1
[junit4:junit4]   2> 2406 T28 oass.SolrDispatchFilter.init user.dir=/usr/home/hudson/hudson-slave/workspace/Lucene-Solr-Tests-4.x-java7/solr/build/solr-core/test/J1
[junit4:junit4]   2> 2406 T28 oass.SolrDispatchFilter.init SolrDispatchFilter.init() done
[junit4:junit4]   2> 2407 T28 oas.SolrJettyTestBase.createJetty Jetty Assigned Port#50599
[junit4:junit4]   2> 2424 T28 oas.SolrTestCaseJ4.setUp ###Starting testNoUrlAccess
[junit4:junit4]   2> 2526 T28 oascsi.HttpClientUtil.createClient Creating new http client, config:maxConnections=128&maxConnectionsPerHost=32&followRedirects=false
[junit4:junit4]   2> ASYNC  NEW_CORE C5 name=collection1 org.apache.solr.core.SolrCore@4d8267cc
[junit4:junit4]   2> 3774 T40 C5 oasc.SolrDeletionPolicy.onInit SolrDeletionPolicy.onInit: commits:num=1
[junit4:junit4]   2> 		commit{dir=BaseDirectoryWrapper(org.apache.lucene.store.RAMDirectory@4bc2ebc7 lockFactory=org.apache.lucene.store.NativeFSLockFactory@e3c3695),segFN=segments_1,generation=1,filenames=[segments_1]
[junit4:junit4]   2> 3774 T40 C5 oasc.SolrDeletionPolicy.updateCommits newest commit = 1
[junit4:junit4]   2> 3776 T40 C5 UPDATE [collection1] webapp=/solr path=/update params={wt=javabin&version=2} {add=[1234]} 0 33
[junit4:junit4]   2> 3910 T41 C5 oasu.DirectUpdateHandler2.commit start commit{flags=0,_version_=0,optimize=false,openSearcher=true,waitSearcher=true,expungeDeletes=false,softCommit=false}
[junit4:junit4]   2> 3948 T41 C5 oasc.SolrDeletionPolicy.onCommit SolrDeletionPolicy.onCommit: commits:num=2
[junit4:junit4]   2> 		commit{dir=BaseDirectoryWrapper(org.apache.lucene.store.RAMDirectory@4bc2ebc7 lockFactory=org.apache.lucene.store.NativeFSLockFactory@e3c3695),segFN=segments_1,generation=1,filenames=[segments_1]
[junit4:junit4]   2> 		commit{dir=BaseDirectoryWrapper(org.apache.lucene.store.RAMDirectory@4bc2ebc7 lockFactory=org.apache.lucene.store.NativeFSLockFactory@e3c3695),segFN=segments_2,generation=2,filenames=[_0.fnm, _0_Memory_0.ram, _0_MockVariableIntBlock_0.doc, _0_nrm.cfs, _0_MockVariableIntBlock_0.skp, _0_Memory_1.ram, _0_MockVariableIntBlock_0.pyl, _0_Pulsing41_0.doc, _0_Pulsing41_0.pos, _0_MockVariableIntBlock_0.tib, _0_Pulsing41_0.tim, _0_Pulsing41_0.tip, _0_MockVariableIntBlock_0.frq, _0_nrm.cfe, _0_MockVariableIntBlock_0.pos, segments_2, _0.fdx, _0.si, _0.fdt, _0_MockVariableIntBlock_0.tii]
[junit4:junit4]   2> 3948 T41 C5 oasc.SolrDeletionPolicy.updateCommits newest commit = 2
[junit4:junit4]   2> 3966 T41 C5 oass.SolrIndexSearcher.<init> Opening Searcher@4f8771a main
[junit4:junit4]   2> 3966 T41 C5 oass.SolrIndexSearcher.getIndexDir WARNING WARNING: Directory impl does not support setting indexDir: org.apache.lucene.store.BaseDirectoryWrapper
[junit4:junit4]   2> 3967 T41 C5 oasu.DirectUpdateHandler2.commit end_commit_flush
[junit4:junit4]   2> 3969 T43 oasc.SolrCore.registerSearcher [collection1] Registered new searcher Searcher@4f8771a main{StandardDirectoryReader(segments_2:3 _0(4.1):C1)}
[junit4:junit4]   2> 3970 T41 C5 UPDATE [collection1] webapp=/solr path=/update params={waitSearcher=true&wt=javabin&commit=true&softCommit=false&version=2} {commit=} 0 60
[junit4:junit4]   2> 4051 T42 C5 REQ [collection1] webapp=/solr path=/select params={wt=javabin&q=id:1234&version=2} hits=1 status=0 QTime=56 
[junit4:junit4]   2> 4062 T41 C5 REQ [collection1] webapp=/solr path=/select params={wt=javabin&stream.url=http://127.0.0.1:50599/solr/update?commit%3Dtrue%26stream.body%3D%253Cdelete%253E%253Cquery%253E*%253A*%253C%252Fquery%253E%253C%252Fdelete%253E&q=*:*&version=2} hits=1 status=0 QTime=5 
[junit4:junit4]   2> 4066 T42 C5 REQ [collection1] webapp=/solr path=/select params={wt=javabin&q=id:1234&version=2} hits=1 status=0 QTime=1 
[junit4:junit4]   2> 4067 T28 oas.SolrTestCaseJ4.tearDown ###Ending testNoUrlAccess
[junit4:junit4]   2> 4076 T28 oas.SolrTestCaseJ4.setUp ###Starting testStreamUrl
[junit4:junit4]   2> 4080 T40 C5 UPDATE [collection1] webapp=/solr path=/update params={wt=javabin&version=2} {add=[1234]} 0 1
[junit4:junit4]   2> 4084 T41 C5 oasu.DirectUpdateHandler2.commit start commit{flags=0,_version_=0,optimize=false,openSearcher=true,waitSearcher=true,expungeDeletes=false,softCommit=false}
[junit4:junit4]   2> 4089 T41 C5 oasc.SolrDeletionPolicy.onCommit SolrDeletionPolicy.onCommit: commits:num=2
[junit4:junit4]   2> 		commit{dir=BaseDirectoryWrapper(org.apache.lucene.store.RAMDirectory@4bc2ebc7 lockFactory=org.apache.lucene.store.NativeFSLockFactory@e3c3695),segFN=segments_2,generation=2,filenames=[_0.fnm, _0_Memory_0.ram, _0_MockVariableIntBlock_0.doc, _0_nrm.cfs, _0_MockVariableIntBlock_0.skp, _0_Memory_1.ram, _0_MockVariableIntBlock_0.pyl, _0_Pulsing41_0.doc, _0_Pulsing41_0.pos, _0_MockVariableIntBlock_0.tib, _0_Pulsing41_0.tim, _0_Pulsing41_0.tip, _0_MockVariableIntBlock_0.frq, _0_nrm.cfe, _0_MockVariableIntBlock_0.pos, segments_2, _0.fdx, _0.si, _0.fdt, _0_MockVariableIntBlock_0.tii]
[junit4:junit4]   2> 		commit{dir=BaseDirectoryWrapper(org.apache.lucene.store.RAMDirectory@4bc2ebc7 lockFactory=org.apache.lucene.store.NativeFSLockFactory@e3c3695),segFN=segments_3,generation=3,filenames=[_1_MockVariableIntBlock_0.skp, _1_nrm.cfs, _1_Memory_1.ram, _1_MockVariableIntBlock_0.tii, _1_MockVariableIntBlock_0.pos, _1_MockVariableIntBlock_0.pyl, _1_Pulsing41_0.doc, _1.fnm, _1_Pulsing41_0.pos, _1_nrm.cfe, _1_MockVariableIntBlock_0.tib, _1_MockVariableIntBlock_0.frq, _1.fdx, _1_Memory_0.ram, _1_Pulsing41_0.tip, _1.fdt, _1_Pulsing41_0.tim, _1.si, _1_MockVariableIntBlock_0.doc, segments_3]
[junit4:junit4]   2> 4090 T41 C5 oasc.SolrDeletionPolicy.updateCommits newest commit = 3
[junit4:junit4]   2> 4092 T41 C5 oass.SolrIndexSearcher.<init> Opening Searcher@11ad05de main
[junit4:junit4]   2> 4093 T41 C5 oass.SolrIndexSearcher.getIndexDir WARNING WARNING: Directory impl does not support setting indexDir: org.apache.lucene.store.BaseDirectoryWrapper
[junit4:junit4]   2> 4093 T41 C5 oasu.DirectUpdateHandler2.commit end_commit_flush
[junit4:junit4]   2> 4096 T43 oasc.SolrCore.registerSearcher [collection1] Registered new searcher Searcher@11ad05de main{StandardDirectoryReader(segments_3:7 _1(4.1):C1)}
[junit4:junit4]   2> 4097 T41 C5 UPDATE [collection1] webapp=/solr path=/update params={waitSearcher=true&wt=javabin&commit=true&softCommit=false&version=2} {commit=} 0 13
[junit4:junit4]   2> 4105 T42 C5 REQ [collection1] webapp=/solr path=/select params={wt=javabin&q=id:1234&version=2} hits=1 status=0 QTime=1 
[junit4:junit4]   2> 4121 T42 C5 REQ [collection1] webapp=/solr path=/select params={wt=csv&q=*:*&fl=id} hits=1 status=0 QTime=1 
[junit4:junit4]   2> 4148 T41 C5 REQ [collection1] webapp=/solr path=/debug/dump params={wt=xml&stream.url=http://127.0.0.1:50599/solr/select?q%3D*:*%26fl%3Did%26wt%3Dcsv} status=0 QTime=30 
[junit4:junit4]   2> 4157 T28 oas.SolrTestCaseJ4.tearDown ###Ending testStreamUrl
[junit4:junit4]   2> 4166 T28 oas.SolrTestCaseJ4.setUp ###Starting testMakeDeleteAllUrl
[junit4:junit4]   2> 4171 T40 C5 UPDATE [collection1] webapp=/solr path=/update params={wt=javabin&version=2} {add=[1234]} 0 1
[junit4:junit4]   2> 4175 T41 C5 oasu.DirectUpdateHandler2.commit start commit{flags=0,_version_=0,optimize=false,openSearcher=true,waitSearcher=true,expungeDeletes=false,softCommit=false}
[junit4:junit4]   2> 4180 T41 C5 oasc.SolrDeletionPolicy.onCommit SolrDeletionPolicy.onCommit: commits:num=2
[junit4:junit4]   2> 		commit{dir=BaseDirectoryWrapper(org.apache.lucene.store.RAMDirectory@4bc2ebc7 lockFactory=org.apache.lucene.store.NativeFSLockFactory@e3c3695),segFN=segments_3,generation=3,filenames=[_1_MockVariableIntBlock_0.skp, _1_nrm.cfs, _1_Memory_1.ram, _1_MockVariableIntBlock_0.tii, _1_MockVariableIntBlock_0.pos, _1_MockVariableIntBlock_0.pyl, _1_Pulsing41_0.doc, _1.fnm, _1_Pulsing41_0.pos, _1_nrm.cfe, _1_MockVariableIntBlock_0.tib, _1_MockVariableIntBlock_0.frq, _1.fdx, _1_Memory_0.ram, _1_Pulsing41_0.tip, _1.fdt, _1_Pulsing41_0.tim, _1.si, _1_MockVariableIntBlock_0.doc, segments_3]
[junit4:junit4]   2> 		commit{dir=BaseDirectoryWrapper(org.apache.lucene.store.RAMDirectory@4bc2ebc7 lockFactory=org.apache.lucene.store.NativeFSLockFactory@e3c3695),segFN=segments_4,generation=4,filenames=[_2_Pulsing41_0.doc, _2.si, _2_MockVariableIntBlock_0.tii, _2_MockVariableIntBlock_0.pyl, _2_MockVariableIntBlock_0.tib, _2.fdt, _2_MockVariableIntBlock_0.frq, _2.fdx, _2_MockVariableIntBlock_0.doc, _2.fnm, _2_Pulsing41_0.tim, _2_Pulsing41_0.pos, _2_nrm.cfe, _2_Memory_1.ram, _2_Pulsing41_0.tip, _2_Memory_0.ram, _2_MockVariableIntBlock_0.skp, _2_nrm.cfs, _2_MockVariableIntBlock_0.pos, segments_4]
[junit4:junit4]   2> 4181 T41 C5 oasc.SolrDeletionPolicy.updateCommits newest commit = 4
[junit4:junit4]   2> 4183 T41 C5 oass.SolrIndexSearcher.<init> Opening Searcher@24fd5136 main
[junit4:junit4]   2> 4184 T41 C5 oass.SolrIndexSearcher.getIndexDir WARNING WARNING: Directory impl does not support setting indexDir: org.apache.lucene.store.BaseDirectoryWrapper
[junit4:junit4]   2> 4184 T41 C5 oasu.DirectUpdateHandler2.commit end_commit_flush
[junit4:junit4]   2> 4187 T43 oasc.SolrCore.registerSearcher [collection1] Registered new searcher Searcher@24fd5136 main{StandardDirectoryReader(segments_4:11 _2(4.1):C1)}
[junit4:junit4]   2> 4188 T41 C5 UPDATE [collection1] webapp=/solr path=/update params={waitSearcher=true&wt=javabin&commit=true&softCommit=false&version=2} {commit=} 0 13
[junit4:junit4]   2> 4192 T42 C5 REQ [collection1] webapp=/solr path=/select params={wt=javabin&q=id:1234&version=2} hits=1 status=0 QTime=1 
[junit4:junit4]   2> 4195 T40 C5 oasu.DirectUpdateHandler2.deleteAll [collection1] REMOVING ALL DOCUMENTS FROM INDEX
[junit4:junit4]   2> 4196 T40 C5 oasu.DirectUpdateHandler2.commit start commit{flags=0,_version_=0,optimize=false,openSearcher=true,waitSearcher=true,expungeDeletes=false,softCommit=false}
[junit4:junit4]   2> 4197 T40 C5 oasc.SolrDeletionPolicy.onCommit SolrDeletionPolicy.onCommit: commits:num=2
[junit4:junit4]   2> 		commit{dir=BaseDirectoryWrapper(org.apache.lucene.store.RAMDirectory@4bc2ebc7 lockFactory=org.apache.lucene.store.NativeFSLockFactory@e3c3695),segFN=segments_4,generation=4,filenames=[_2_Pulsing41_0.doc, _2.si, _2_MockVariableIntBlock_0.tii, _2_MockVariableIntBlock_0.pyl, _2_MockVariableIntBlock_0.tib, _2.fdt, _2_MockVariableIntBlock_0.frq, _2.fdx, _2_MockVariableIntBlock_0.doc, _2.fnm, _2_Pulsing41_0.tim, _2_Pulsing41_0.pos, _2_nrm.cfe, _2_Memory_1.ram, _2_Pulsing41_0.tip, _2_Memory_0.ram, _2_MockVariableIntBlock_0.skp, _2_nrm.cfs, _2_MockVariableIntBlock_0.pos, segments_4]
[junit4:junit4]   2> 		commit{dir=BaseDirectoryWrapper(org.apache.lucene.store.RAMDirectory@4bc2ebc7 lockFactory=org.apache.lucene.store.NativeFSLockFactory@e3c3695),segFN=segments_5,generation=5,filenames=[segments_5]
[junit4:junit4]   2> 4197 T40 C5 oasc.SolrDeletionPolicy.updateCommits newest commit = 5
[junit4:junit4]   2> 4198 T40 C5 oass.SolrIndexSearcher.<init> Opening Searcher@782a437c main
[junit4:junit4]   2> 4199 T40 C5 oass.SolrIndexSearcher.getIndexDir WARNING WARNING: Directory impl does not support setting indexDir: org.apache.lucene.store.BaseDirectoryWrapper
[junit4:junit4]   2> 4199 T40 C5 oasu.DirectUpdateHandler2.commit end_commit_flush
[junit4:junit4]   2> 4201 T43 oasc.SolrCore.registerSearcher [collection1] Registered new searcher Searcher@782a437c main{StandardDirectoryReader(segments_5:12)}
[junit4:junit4]   2> 4202 T40 C5 UPDATE [collection1] webapp=/solr path=/update params={commit=true&stream.body=<delete><query>*:*</query></delete>} {deleteByQuery=*:*,commit=} 0 8
[junit4:junit4]   2> 4207 T41 C5 REQ [collection1] webapp=/solr path=/select params={wt=javabin&q=id:1234&version=2} hits=0 status=0 QTime=1 
[junit4:junit4]   2> 4208 T28 oas.SolrTestCaseJ4.tearDown ###Ending testMakeDeleteAllUrl
[junit4:junit4]   2> 4216 T28 oas.SolrTestCaseJ4.setUp ###Starting testQtUpdateFails
[junit4:junit4]   2> 4222 T42 C5 UPDATE [collection1] webapp=/solr path=/update params={wt=javabin&version=2} {add=[1234]} 0 2
[junit4:junit4]   2> 4227 T40 C5 oasu.DirectUpdateHandler2.commit start commit{flags=0,_version_=0,optimize=false,openSearcher=true,waitSearcher=true,expungeDeletes=false,softCommit=false}
[junit4:junit4]   2> 4233 T40 C5 oasc.SolrDeletionPolicy.onCommit SolrDeletionPolicy.onCommit: commits:num=2
[junit4:junit4]   2> 		commit{dir=BaseDirectoryWrapper(org.apache.lucene.store.RAMDirectory@4bc2ebc7 lockFactory=org.apache.lucene.store.NativeFSLockFactory@e3c3695),segFN=segments_5,generation=5,filenames=[segments_5]
[junit4:junit4]   2> 		commit{dir=BaseDirectoryWrapper(org.apache.lucene.store.RAMDirectory@4bc2ebc7 lockFactory=org.apache.lucene.store.NativeFSLockFactory@e3c3695),segFN=segments_6,generation=6,filenames=[_3_nrm.cfe, _3_MockVariableIntBlock_0.frq, _3_MockVariableIntBlock_0.doc, _3.fnm, _3.fdt, _3_MockVariableIntBlock_0.tii, _3.fdx, _3_Pulsing41_0.pos, _3_nrm.cfs, _3_MockVariableIntBlock_0.pyl, _3_MockVariableIntBlock_0.tib, _3_Pulsing41_0.tim, _3.si, _3_Pulsing41_0.tip, _3_Memory_0.ram, _3_MockVariableIntBlock_0.skp, segments_6, _3_Pulsing41_0.doc, _3_Memory_1.ram, _3_MockVariableIntBlock_0.pos]
[junit4:junit4]   2> 4233 T40 C5 oasc.SolrDeletionPolicy.updateCommits newest commit = 6
[junit4:junit4]   2> 4237 T40 C5 oass.SolrIndexSearcher.<init> Opening Searcher@74e6cbcd main
[junit4:junit4]   2> 4237 T40 C5 oass.SolrIndexSearcher.getIndexDir WARNING WARNING: Directory impl does not support setting indexDir: org.apache.lucene.store.BaseDirectoryWrapper
[junit4:junit4]   2> 4238 T40 C5 oasu.DirectUpdateHandler2.commit end_commit_flush
[junit4:junit4]   2> 4241 T43 oasc.SolrCore.registerSearcher [collection1] Registered new searcher Searcher@74e6cbcd main{StandardDirectoryReader(segments_6:14 _3(4.1):C1)}
[junit4:junit4]   2> 4241 T40 C5 UPDATE [collection1] webapp=/solr path=/update params={waitSearcher=true&wt=javabin&commit=true&softCommit=false&version=2} {commit=} 0 14
[junit4:junit4]   2> 4246 T41 C5 REQ [collection1] webapp=/solr path=/select params={wt=javabin&q=id:1234&version=2} hits=1 status=0 QTime=1 
[junit4:junit4]   2> 4250 T28 oas.SolrTestCaseJ4.tearDown ###Ending testQtUpdateFails
[junit4:junit4]   2> 4298 T28 oasc.CoreContainer.shutdown Shutting down CoreContainer instance=1645340219
[junit4:junit4]   2> 4298 T28 oasc.SolrCore.close [collection1]  CLOSING SolrCore org.apache.solr.core.SolrCore@4d8267cc
[junit4:junit4]   2> 4313 T28 oasu.DirectUpdateHandler2.close closing DirectUpdateHandler2{commits=5,autocommits=0,soft autocommits=0,optimizes=0,rollbacks=0,expungeDeletes=0,docsPending=0,adds=0,deletesById=0,deletesByQuery=0,errors=0,cumulative_adds=4,cumulative_deletesById=0,cumulative_deletesByQuery=1,cumulative_errors=0}
[junit4:junit4]   2> 4314 T28 oasc.SolrCore.decrefSolrCoreState Closing SolrCoreState
[junit4:junit4]   2> 4314 T28 oasu.DefaultSolrCoreState.closeIndexWriter SolrCoreState ref count has reached 0 - closing IndexWriter
[junit4:junit4]   2> 4315 T28 oasu.DefaultSolrCoreState.closeIndexWriter closing IndexWriter with IndexWriterCloser
[junit4:junit4]   2> 4405 T28 oasc.SolrCore.closeSearcher [collection1] Closing main searcher on request.
[junit4:junit4]   2> 4417 T28 oejsh.ContextHandler.doStop stopped o.e.j.s.ServletContextHandler{/solr,null}
[junit4:junit4]   2> 4518 T28 oejut.QueuedThreadPool.doStop WARNING 4 threads could not be stopped
[junit4:junit4]   2> 4518 T28 oas.SolrTestCaseJ4.deleteCore ###deleteCore
[junit4:junit4]   2> 4532 T27 ccr.ThreadLeakControl.checkThreadLeaks WARNING Will linger awaiting termination of 4 leaked thread(s).
[junit4:junit4]   2> 24664 T27 ccr.ThreadLeakControl.checkThreadLeaks SEVERE 4 threads leaked from SUITE scope at org.apache.solr.request.TestRemoteStreaming: 
[junit4:junit4]   2> 	   1) Thread[id=35, name=qtp1053008442-35 Acceptor0 SelectChannelConnector@0.0.0.0:50599, state=BLOCKED, group=TGRP-TestRemoteStreaming]
[junit4:junit4]   2> 	        at sun.nio.ch.ServerSocketChannelImpl.accept(ServerSocketChannelImpl.java:210)
[junit4:junit4]   2> 	        at org.eclipse.jetty.server.nio.SelectChannelConnector.accept(SelectChannelConnector.java:104)
[junit4:junit4]   2> 	        at org.eclipse.jetty.server.AbstractConnector$Acceptor.run(AbstractConnector.java:933)
[junit4:junit4]   2> 	        at org.eclipse.jetty.util.thread.QueuedThreadPool.runJob(QueuedThreadPool.java:599)
[junit4:junit4]   2> 	        at org.eclipse.jetty.util.thread.QueuedThreadPool$3.run(QueuedThreadPool.java:534)
[junit4:junit4]   2> 	        at java.lang.Thread.run(Thread.java:722)
[junit4:junit4]   2> 	   2) Thread[id=37, name=qtp1053008442-37 Acceptor2 SelectChannelConnector@0.0.0.0:50599, state=RUNNABLE, group=TGRP-TestRemoteStreaming]
[junit4:junit4]   2> 	        at sun.nio.ch.ServerSocketChannelImpl.accept0(Native Method)
[junit4:junit4]   2> 	        at sun.nio.ch.ServerSocketChannelImpl.accept(ServerSocketChannelImpl.java:226)
[junit4:junit4]   2> 	        at org.eclipse.jetty.server.nio.SelectChannelConnector.accept(SelectChannelConnector.java:104)
[junit4:junit4]   2> 	        at org.eclipse.jetty.server.AbstractConnector$Acceptor.run(AbstractConnector.java:933)
[junit4:junit4]   2> 	        at org.eclipse.jetty.util.thread.QueuedThreadPool.runJob(QueuedThreadPool.java:599)
[junit4:junit4]   2> 	        at org.eclipse.jetty.util.thread.QueuedThreadPool$3.run(QueuedThreadPool.java:534)
[junit4:junit4]   2> 	        at java.lang.Thread.run(Thread.java:722)
[junit4:junit4]   2> 	   3) Thread[id=38, name=qtp1053008442-38 Acceptor3 SelectChannelConnector@0.0.0.0:50599, state=BLOCKED, group=TGRP-TestRemoteStreaming]
[junit4:junit4]   2> 	        at sun.nio.ch.ServerSocketChannelImpl.accept(ServerSocketChannelImpl.java:210)
[junit4:junit4]   2> 	        at org.eclipse.jetty.server.nio.SelectChannelConnector.accept(SelectChannelConnector.java:104)
[junit4:junit4]   2> 	        at org.eclipse.jetty.server.AbstractConnector$Acceptor.run(AbstractConnector.java:933)
[junit4:junit4]   2> 	        at org.eclipse.jetty.util.thread.QueuedThreadPool.runJob(QueuedThreadPool.java:599)
[junit4:junit4]   2> 	        at org.eclipse.jetty.util.thread.QueuedThreadPool$3.run(QueuedThreadPool.java:534)
[junit4:junit4]   2> 	        at java.lang.Thread.run(Thread.java:722)
[junit4:junit4]   2> 	   4) Thread[id=36, name=qtp1053008442-36 Acceptor1 SelectChannelConnector@0.0.0.0:50599, state=BLOCKED, group=TGRP-TestRemoteStreaming]
[junit4:junit4]   2> 	        at sun.nio.ch.ServerSocketChannelImpl.accept(ServerSocketChannelImpl.java:210)
[junit4:junit4]   2> 	        at org.eclipse.jetty.server.nio.SelectChannelConnector.accept(SelectChannelConnector.java:104)
[junit4:junit4]   2> 	        at org.eclipse.jetty.server.AbstractConnector$Acceptor.run(AbstractConnector.java:933)
[junit4:junit4]   2> 	        at org.eclipse.jetty.util.thread.QueuedThreadPool.runJob(QueuedThreadPool.java:599)
[junit4:junit4]   2> 	        at org.eclipse.jetty.util.thread.QueuedThreadPool$3.run(QueuedThreadPool.java:534)
[junit4:junit4]   2> 	        at java.lang.Thread.run(Thread.java:722)
[junit4:junit4]   2> 24665 T27 ccr.ThreadLeakControl.tryToInterruptAll Starting to interrupt leaked threads:
[junit4:junit4]   2> 	   1) Thread[id=35, name=qtp1053008442-35 Acceptor0 SelectChannelConnector@0.0.0.0:50599, state=BLOCKED, group=TGRP-TestRemoteStreaming]
[junit4:junit4]   2> 	   2) Thread[id=37, name=qtp1053008442-37 Acceptor2 SelectChannelConnector@0.0.0.0:50599, state=RUNNABLE, group=TGRP-TestRemoteStreaming]
[junit4:junit4]   2> 	   3) Thread[id=38, name=qtp1053008442-38 Acceptor3 SelectChannelConnector@0.0.0.0:50599, state=BLOCKED, group=TGRP-TestRemoteStreaming]
[junit4:junit4]   2> 	   4) Thread[id=36, name=qtp1053008442-36 Acceptor1 SelectChannelConnector@0.0.0.0:50599, state=BLOCKED, group=TGRP-TestRemoteStreaming]
[junit4:junit4]   2> 27708 T27 ccr.ThreadLeakControl.tryToInterruptAll SEVERE There are still zombie threads that couldn't be terminated:
[junit4:junit4]   2> 	   1) Thread[id=35, name=qtp1053008442-35 Acceptor0 SelectChannelConnector@0.0.0.0:50599, state=BLOCKED, group=TGRP-TestRemoteStreaming]
[junit4:junit4]   2> 	        at sun.nio.ch.ServerSocketChannelImpl.accept(ServerSocketChannelImpl.java:210)
[junit4:junit4]   2> 	        at org.eclipse.jetty.server.nio.SelectChannelConnector.accept(SelectChannelConnector.java:104)
[junit4:junit4]   2> 	        at org.eclipse.jetty.server.AbstractConnector$Acceptor.run(AbstractConnector.java:933)
[junit4:junit4]   2> 	        at org.eclipse.jetty.util.thread.QueuedThreadPool.runJob(QueuedThreadPool.java:599)
[junit4:junit4]   2> 	        at org.eclipse.jetty.util.thread.QueuedThreadPool$3.run(QueuedThreadPool.java:534)
[junit4:junit4]   2> 	        at java.lang.Thread.run(Thread.java:722)
[junit4:junit4]   2> 	   2) Thread[id=37, name=qtp1053008442-37 Acceptor2 SelectChannelConnector@0.0.0.0:50599, state=RUNNABLE, group=TGRP-TestRemoteStreaming]
[junit4:junit4]   2> 	        at sun.nio.ch.ServerSocketChannelImpl.accept0(Native Method)
[junit4:junit4]   2> 	        at sun.nio.ch.ServerSocketChannelImpl.accept(ServerSocketChannelImpl.java:226)
[junit4:junit4]   2> 	        at org.eclipse.jetty.server.nio.SelectChannelConnector.accept(SelectChannelConnector.java:104)
[junit4:junit4]   2> 	        at org.eclipse.jetty.server.AbstractConnector$Acceptor.run(AbstractConnector.java:933)
[junit4:junit4]   2> 	        at org.eclipse.jetty.util.thread.QueuedThreadPool.runJob(QueuedThreadPool.java:599)
[junit4:junit4]   2> 	        at org.eclipse.jetty.util.thread.QueuedThreadPool$3.run(QueuedThreadPool.java:534)
[junit4:junit4]   2> 	        at java.lang.Thread.run(Thread.java:722)
[junit4:junit4]   2> 	   3) Thread[id=38, name=qtp1053008442-38 Acceptor3 SelectChannelConnector@0.0.0.0:50599, state=BLOCKED, group=TGRP-TestRemoteStreaming]
[junit4:junit4]   2> 	        at sun.nio.ch.ServerSocketChannelImpl.accept(ServerSocketChannelImpl.java:210)
[junit4:junit4]   2> 	        at org.eclipse.jetty.server.nio.SelectChannelConnector.accept(SelectChannelConnector.java:104)
[junit4:junit4]   2> 	        at org.eclipse.jetty.server.AbstractConnector$Acceptor.run(AbstractConnector.java:933)
[junit4:junit4]   2> 	        at org.eclipse.jetty.util.thread.QueuedThreadPool.runJob(QueuedThreadPool.java:599)
[junit4:junit4]   2> 	        at org.eclipse.jetty.util.thread.QueuedThreadPool$3.run(QueuedThreadPool.java:534)
[junit4:junit4]   2> 	        at java.lang.Thread.run(Thread.java:722)
[junit4:junit4]   2> 	   4) Thread[id=36, name=qtp1053008442-36 Acceptor1 SelectChannelConnector@0.0.0.0:50599, state=BLOCKED, group=TGRP-TestRemoteStreaming]
[junit4:junit4]   2> 	        at sun.nio.ch.ServerSocketChannelImpl.accept(ServerSocketChannelImpl.java:210)
[junit4:junit4]   2> 	        at org.eclipse.jetty.server.nio.SelectChannelConnector.accept(SelectChannelConnector.java:104)
[junit4:junit4]   2> 	        at org.eclipse.jetty.server.AbstractConnector$Acceptor.run(AbstractConnector.java:933)
[junit4:junit4]   2> 	        at org.eclipse.jetty.util.thread.QueuedThreadPool.runJob(QueuedThreadPool.java:599)
[junit4:junit4]   2> 	        at org.eclipse.jetty.util.thread.QueuedThreadPool$3.run(QueuedThreadPool.java:534)
[junit4:junit4]   2> 	        at java.lang.Thread.run(Thread.java:722)
[junit4:junit4]   2> NOTE: test params are: codec=Lucene41: {timestamp=Pulsing41(freqCutoff=16 minBlockSize=6 maxBlockSize=102), range_facet_l=Pulsing41(freqCutoff=16 minBlockSize=6 maxBlockSize=102), id=PostingsFormat(name=Memory doPackFST= false), range_facet_sl=PostingsFormat(name=Memory doPackFST= true), range_facet_si=MockVariableIntBlock(baseBlockSize=86), multiDefault=MockVariableIntBlock(baseBlockSize=86), intDefault=Pulsing41(freqCutoff=16 minBlockSize=6 maxBlockSize=102)}, sim=RandomSimilarityProvider(queryNorm=false,coord=crazy): {}, locale=fi, timezone=Africa/Algiers
[junit4:junit4]   2> NOTE: FreeBSD 9.0-RELEASE amd64/Oracle Corporation 1.7.0_09 (64-bit)/cpus=16,threads=5,free=38914040,total=145752064
[junit4:junit4]   2> NOTE: All tests run in this JVM: [TestCharFilters, SoftAutoCommitTest, TermVectorComponentTest, TestRemoteStreaming]
[junit4:junit4]   2> NOTE: reproduce with: ant test  -Dtestcase=TestRemoteStreaming -Dtests.seed=74596681D419C368 -Dtests.multiplier=3 -Dtests.slow=true -Dtests.locale=fi -Dtests.timezone=Africa/Algiers -Dtests.file.encoding=ISO-8859-1
[junit4:junit4] ERROR   0.00s J1 | TestRemoteStreaming (suite) <<<
[junit4:junit4]    > Throwable #1: com.carrotsearch.randomizedtesting.ThreadLeakError: 4 threads leaked from SUITE scope at org.apache.solr.request.TestRemoteStreaming: 
[junit4:junit4]    >    1) Thread[id=35, name=qtp1053008442-35 Acceptor0 SelectChannelConnector@0.0.0.0:50599, state=BLOCKED, group=TGRP-TestRemoteStreaming]
[junit4:junit4]    >         at sun.nio.ch.ServerSocketChannelImpl.accept(ServerSocketChannelImpl.java:210)
[junit4:junit4]    >         at org.eclipse.jetty.server.nio.SelectChannelConnector.accept(SelectChannelConnector.java:104)
[junit4:junit4]    >         at org.eclipse.jetty.server.AbstractConnector$Acceptor.run(AbstractConnector.java:933)
[junit4:junit4]    >         at org.eclipse.jetty.util.thread.QueuedThreadPool.runJob(QueuedThreadPool.java:599)
[junit4:junit4]    >         at org.eclipse.jetty.util.thread.QueuedThreadPool$3.run(QueuedThreadPool.java:534)
[junit4:junit4]    >         at java.lang.Thread.run(Thread.java:722)
[junit4:junit4]    >    2) Thread[id=37, name=qtp1053008442-37 Acceptor2 SelectChannelConnector@0.0.0.0:50599, state=RUNNABLE, group=TGRP-TestRemoteStreaming]
[junit4:junit4]    >         at sun.nio.ch.ServerSocketChannelImpl.accept0(Native Method)
[junit4:junit4]    >         at sun.nio.ch.ServerSocketChannelImpl.accept(ServerSocketChannelImpl.java:226)
[junit4:junit4]    >         at org.eclipse.jetty.server.nio.SelectChannelConnector.accept(SelectChannelConnector.java:104)
[junit4:junit4]    >         at org.eclipse.jetty.server.AbstractConnector$Acceptor.run(AbstractConnector.java:933)
[junit4:junit4]    >         at org.eclipse.jetty.util.thread.QueuedThreadPool.runJob(QueuedThreadPool.java:599)
[junit4:junit4]    >         at org.eclipse.jetty.util.thread.QueuedThreadPool$3.run(QueuedThreadPool.java:534)
[junit4:junit4]    >         at java.lang.Thread.run(Thread.java:722)
[junit4:junit4]    >    3) Thread[id=38, name=qtp1053008442-38 Acceptor3 SelectChannelConnector@0.0.0.0:50599, state=BLOCKED, group=TGRP-TestRemoteStreaming]
[junit4:junit4]    >         at sun.nio.ch.ServerSocketChannelImpl.accept(ServerSocketChannelImpl.java:210)
[junit4:junit4]    >         at org.eclipse.jetty.server.nio.SelectChannelConnector.accept(SelectChannelConnector.java:104)
[junit4:junit4]    >         at org.eclipse.jetty.server.AbstractConnector$Acceptor.run(AbstractConnector.java:933)
[junit4:junit4]    >         at org.eclipse.jetty.util.thread.QueuedThreadPool.runJob(QueuedThreadPool.java:599)
[junit4:junit4]    >         at org.eclipse.jetty.util.thread.QueuedThreadPool$3.run(QueuedThreadPool.java:534)
[junit4:junit4]    >         at java.lang.Thread.run(Thread.java:722)
[junit4:junit4]    >    4) Thread[id=36, name=qtp1053008442-36 Acceptor1 SelectChannelConnector@0.0.0.0:50599, state=BLOCKED, group=TGRP-TestRemoteStreaming]
[junit4:junit4]    >         at sun.nio.ch.ServerSocketChannelImpl.accept(ServerSocketChannelImpl.java:210)
[junit4:junit4]    >         at org.eclipse.jetty.server.nio.SelectChannelConnector.accept(SelectChannelConnector.java:104)
[junit4:junit4]    >         at org.eclipse.jetty.server.AbstractConnector$Acceptor.run(AbstractConnector.java:933)
[junit4:junit4]    >         at org.eclipse.jetty.util.thread.QueuedThreadPool.runJob(QueuedThreadPool.java:599)
[junit4:junit4]    >         at org.eclipse.jetty.util.thread.QueuedThreadPool$3.run(QueuedThreadPool.java:534)
[junit4:junit4]    >         at java.lang.Thread.run(Thread.java:722)
[junit4:junit4]    > 	at __randomizedtesting.SeedInfo.seed([74596681D419C368]:0)
[junit4:junit4]    > Throwable #2: com.carrotsearch.randomizedtesting.ThreadLeakError: There are still zombie threads that couldn't be terminated:
[junit4:junit4]    >    1) Thread[id=35, name=qtp1053008442-35 Acceptor0 SelectChannelConnector@0.0.0.0:50599, state=BLOCKED, group=TGRP-TestRemoteStreaming]
[junit4:junit4]    >         at sun.nio.ch.ServerSocketChannelImpl.accept(ServerSocketChannelImpl.java:210)
[junit4:junit4]    >         at org.eclipse.jetty.server.nio.SelectChannelConnector.accept(SelectChannelConnector.java:104)
[junit4:junit4]    >         at org.eclipse.jetty.server.AbstractConnector$Acceptor.run(AbstractConnector.java:933)
[junit4:junit4]    >         at org.eclipse.jetty.util.thread.QueuedThreadPool.runJob(QueuedThreadPool.java:599)
[junit4:junit4]    >         at org.eclipse.jetty.util.thread.QueuedThreadPool$3.run(QueuedThreadPool.java:534)
[junit4:junit4]    >         at java.lang.Thread.run(Thread.java:722)
[junit4:junit4]    >    2) Thread[id=37, name=qtp1053008442-37 Acceptor2 SelectChannelConnector@0.0.0.0:50599, state=RUNNABLE, group=TGRP-TestRemoteStreaming]
[junit4:junit4]    >         at sun.nio.ch.ServerSocketChannelImpl.accept0(Native Method)
[junit4:junit4]    >         at sun.nio.ch.ServerSocketChannelImpl.accept(ServerSocketChannelImpl.java:226)
[junit4:junit4]    >         at org.eclipse.jetty.server.nio.SelectChannelConnector.accept(SelectChannelConnector.java:104)
[junit4:junit4]    >         at org.eclipse.jetty.server.AbstractConnector$Acceptor.run(AbstractConnector.java:933)
[junit4:junit4]    >         at org.eclipse.jetty.util.thread.QueuedThreadPool.runJob(QueuedThreadPool.java:599)
[junit4:junit4]    >         at org.eclipse.jetty.util.thread.QueuedThreadPool$3.run(QueuedThreadPool.java:534)
[junit4:junit4]    >         at java.lang.Thread.run(Thread.java:722)
[junit4:junit4]    >    3) Thread[id=38, name=qtp1053008442-38 Acceptor3 SelectChannelConnector@0.0.0.0:50599, state=BLOCKED, group=TGRP-TestRemoteStreaming]
[junit4:junit4]    >         at sun.nio.ch.ServerSocketChannelImpl.accept(ServerSocketChannelImpl.java:210)
[junit4:junit4]    >         at org.eclipse.jetty.server.nio.SelectChannelConnector.accept(SelectChannelConnector.java:104)
[junit4:junit4]    >         at org.eclipse.jetty.server.AbstractConnector$Acceptor.run(AbstractConnector.java:933)
[junit4:junit4]    >         at org.eclipse.jetty.util.thread.QueuedThreadPool.runJob(QueuedThreadPool.java:599)
[junit4:junit4]    >         at org.eclipse.jetty.util.thread.QueuedThreadPool$3.run(QueuedThreadPool.java:534)
[junit4:junit4]    >         at java.lang.Thread.run(Thread.java:722)
[junit4:junit4]    >    4) Thread[id=36, name=qtp1053008442-36 Acceptor1 SelectChannelConnector@0.0.0.0:50599, state=BLOCKED, group=TGRP-TestRemoteStreaming]
[junit4:junit4]    >         at sun.nio.ch.ServerSocketChannelImpl.accept(ServerSocketChannelImpl.java:210)
[junit4:junit4]    >         at org.eclipse.jetty.server.nio.SelectChannelConnector.accept(SelectChannelConnector.java:104)
[junit4:junit4]    >         at org.eclipse.jetty.server.AbstractConnector$Acceptor.run(AbstractConnector.java:933)
[junit4:junit4]    >         at org.eclipse.jetty.util.thread.QueuedThreadPool.runJob(QueuedThreadPool.java:599)
[junit4:junit4]    >         at org.eclipse.jetty.util.thread.QueuedThreadPool$3.run(QueuedThreadPool.java:534)
[junit4:junit4]    >         at java.lang.Thread.run(Thread.java:722)
[junit4:junit4]    > 	at __randomizedtesting.SeedInfo.seed([74596681D419C368]:0)
[junit4:junit4] Completed on J1 in 27.92s, 4 tests, 2 errors <<< FAILURES!

[...truncated 639 lines...]
[junit4:junit4] Suite: org.apache.solr.cloud.LeaderElectionIntegrationTest
[junit4:junit4]   2> 4 T75 oas.SolrTestCaseJ4.setUp ###Starting testLeaderElectionAfterClientTimeout
[junit4:junit4]   2> Creating dataDir: /usr/home/hudson/hudson-slave/workspace/Lucene-Solr-Tests-4.x-java7/solr/build/solr-core/test/J0/./solrtest-LeaderElectionIntegrationTest-1351906080841
[junit4:junit4]   2> 10 T75 oasc.ZkTestServer.run STARTING ZK TEST SERVER
[junit4:junit4]   2> 133 T76 oaz.Environment.logEnv Server environment:zookeeper.version=3.3.6-1366786, built on 07/29/2012 06:22 GMT
[junit4:junit4]   2> 134 T76 oaz.Environment.logEnv Server environment:host.name=lucene.zones.apache.org
[junit4:junit4]   2> 134 T76 oaz.Environment.logEnv Server environment:java.version=1.7.0_09
[junit4:junit4]   2> 134 T76 oaz.Environment.logEnv Server environment:java.vendor=Oracle Corporation
[junit4:junit4]   2> 134 T76 oaz.Environment.logEnv Server environment:java.home=/usr/local/openjdk7/jre
[junit4:junit4]   2> 134 T76 oaz.Environment.logEnv Server environment:java.class.path=/usr/home/hudson/hudson-slave/workspace/Lucene-Solr-Tests-4.x-java7/solr/build/solr-core/classes/test:/usr/home/hudson/hudson-slave/workspace/Lucene-Solr-Tests-4.x-java7/solr/build/solr-test-framework/classes/java:/usr/home/hudson/hudson-slave/workspace/Lucene-Solr-Tests-4.x-java7/solr/build/solr-core/test-files:/usr/home/hudson/hudson-slave/workspace/Lucene-Solr-Tests-4.x-java7/lucene/build/test-framework/classes/java:/usr/home/hudson/hudson-slave/workspace/Lucene-Solr-Tests-4.x-java7/lucene/build/codecs/classes/java:/usr/home/hudson/hudson-slave/workspace/Lucene-Solr-Tests-4.x-java7/solr/build/solr-solrj/classes/java:/usr/home/hudson/hudson-slave/workspace/Lucene-Solr-Tests-4.x-java7/solr/build/solr-core/classes/java:/usr/home/hudson/hudson-slave/workspace/Lucene-Solr-Tests-4.x-java7/lucene/build/analysis/common/lucene-analyzers-common-4.1-SNAPSHOT.jar:/usr/home/hudson/hudson-slave/workspace/Lucene-Solr-Tests-4.x-java7/lucene/build/analysis/kuromoji/lucene-analyzers-kuromoji-4.1-SNAPSHOT.jar:/usr/home/hudson/hudson-slave/workspace/Lucene-Solr-Tests-4.x-java7/lucene/build/analysis/phonetic/lucene-analyzers-phonetic-4.1-SNAPSHOT.jar:/usr/home/hudson/hudson-slave/workspace/Lucene-Solr-Tests-4.x-java7/lucene/build/highlighter/lucene-highlighter-4.1-SNAPSHOT.jar:/usr/home/hudson/hudson-slave/workspace/Lucene-Solr-Tests-4.x-java7/lucene/build/memory/lucene-memory-4.1-SNAPSHOT.jar:/usr/home/hudson/hudson-slave/workspace/Lucene-Solr-Tests-4.x-java7/lucene/build/misc/lucene-misc-4.1-SNAPSHOT.jar:/usr/home/hudson/hudson-slave/workspace/Lucene-Solr-Tests-4.x-java7/lucene/build/spatial/lucene-spatial-4.1-SNAPSHOT.jar:/usr/home/hudson/hudson-slave/workspace/Lucene-Solr-Tests-4.x-java7/lucene/build/suggest/lucene-suggest-4.1-SNAPSHOT.jar:/usr/home/hudson/hudson-slave/workspace/Lucene-Solr-Tests-4.x-java7/lucene/build/grouping/lucene-grouping-4.1-SNAPSHOT.jar:/usr/home/hudson/hudson-slave/workspace/Lucene-Solr-Tests-4.x-java7/lucene/build/queries/lucene-queries-4.1-SNAPSHOT.jar:/usr/home/hudson/hudson-slave/workspace/Lucene-Solr-Tests-4.x-java7/lucene/build/queryparser/lucene-queryparser-4.1-SNAPSHOT.jar:/usr/home/hudson/hudson-slave/workspace/Lucene-Solr-Tests-4.x-java7/solr/core/lib/commons-cli-1.2.jar:/usr/home/hudson/hudson-slave/workspace/Lucene-Solr-Tests-4.x-java7/solr/core/lib/commons-codec-1.7.jar:/usr/home/hudson/hudson-slave/workspace/Lucene-Solr-Tests-4.x-java7/solr/core/lib/commons-fileupload-1.2.1.jar:/usr/home/hudson/hudson-slave/workspace/Lucene-Solr-Tests-4.x-java7/solr/core/lib/commons-lang-2.6.jar:/usr/home/hudson/hudson-slave/workspace/Lucene-Solr-Tests-4.x-java7/solr/core/lib/easymock-2.2.jar:/usr/home/hudson/hudson-slave/workspace/Lucene-Solr-Tests-4.x-java7/solr/core/lib/guava-r05.jar:/usr/home/hudson/hudson-slave/workspace/Lucene-Solr-Tests-4.x-java7/solr/core/lib/javax.servlet-api-3.0.1.jar:/usr/home/hudson/hudson-slave/workspace/Lucene-Solr-Tests-4.x-java7/solr/core/lib/spatial4j-0.3.jar:/usr/home/hudson/hudson-slave/workspace/Lucene-Solr-Tests-4.x-java7/solr/solrj/lib/commons-io-2.1.jar:/usr/home/hudson/hudson-slave/workspace/Lucene-Solr-Tests-4.x-java7/solr/solrj/lib/httpclient-4.1.3.jar:/usr/home/hudson/hudson-slave/workspace/Lucene-Solr-Tests-4.x-java7/solr/solrj/lib/httpcore-4.1.4.jar:/usr/home/hudson/hudson-slave/workspace/Lucene-Solr-Tests-4.x-java7/solr/solrj/lib/httpmime-4.1.3.jar:/usr/home/hudson/hudson-slave/workspace/Lucene-Solr-Tests-4.x-java7/solr/solrj/lib/jcl-over-slf4j-1.6.4.jar:/usr/home/hudson/hudson-slave/workspace/Lucene-Solr-Tests-4.x-java7/solr/solrj/lib/log4j-over-slf4j-1.6.4.jar:/usr/home/hudson/hudson-slave/workspace/Lucene-Solr-Tests-4.x-java7/solr/solrj/lib/slf4j-api-1.6.4.jar:/usr/home/hudson/hudson-slave/workspace/Lucene-Solr-Tests-4.x-java7/solr/solrj/lib/slf4j-jdk14-1.6.4.jar:/usr/home/hudson/hudson-slave/workspace/Lucene-Solr-Tests-4.x-java7/solr/solrj/lib/wstx-asl-3.2.7.jar:/usr/home/hudson/hudson-slave/workspace/Lucene-Solr-Tests-4.x-java7/solr/solrj/lib/zookeeper-3.3.6.jar:/usr/home/hudson/hudson-slave/workspace/Lucene-Solr-Tests-4.x-java7/solr/example/lib/jetty-continuation-8.1.2.v20120308.jar:/usr/home/hudson/hudson-slave/workspace/Lucene-Solr-Tests-4.x-java7/solr/example/lib/jetty-deploy-8.1.2.v20120308.jar:/usr/home/hudson/hudson-slave/workspace/Lucene-Solr-Tests-4.x-java7/solr/example/lib/jetty-http-8.1.2.v20120308.jar:/usr/home/hudson/hudson-slave/workspace/Lucene-Solr-Tests-4.x-java7/solr/example/lib/jetty-io-8.1.2.v20120308.jar:/usr/home/hudson/hudson-slave/workspace/Lucene-Solr-Tests-4.x-java7/solr/example/lib/jetty-jmx-8.1.2.v20120308.jar:/usr/home/hudson/hudson-slave/workspace/Lucene-Solr-Tests-4.x-java7/solr/example/lib/jetty-security-8.1.2.v20120308.jar:/usr/home/hudson/hudson-slave/workspace/Lucene-Solr-Tests-4.x-java7/solr/example/lib/jetty-server-8.1.2.v20120308.jar:/usr/home/hudson/hudson-slave/workspace/Lucene-Solr-Tests-4.x-java7/solr/example/lib/jetty-servlet-8.1.2.v20120308.jar:/usr/home/hudson/hudson-slave/workspace/Lucene-Solr-Tests-4.x-java7/solr/example/lib/jetty-util-8.1.2.v20120308.jar:/usr/home/hudson/hudson-slave/workspace/Lucene-Solr-Tests-4.x-java7/solr/example/lib/jetty-webapp-8.1.2.v20120308.jar:/usr/home/hudson/hudson-slave/workspace/Lucene-Solr-Tests-4.x-java7/solr/example/lib/jetty-xml-8.1.2.v20120308.jar:/usr/home/hudson/hudson-slave/workspace/Lucene-Solr-Tests-4.x-java7/solr/example/lib/servlet-api-3.0.jar:/usr/home/hudson/hudson-slave/workspace/Lucene-Solr-Tests-4.x-java7/solr/example/example-DIH/solr/db/lib/hsqldb-1.8.0.10.jar:/usr/home/hudson/hudson-slave/workspace/Lucene-Solr-Tests-4.x-java7/lucene/build/core/classes/java:/usr/home/hudson/hudson-slave/workspace/Lucene-Solr-Tests-4.x-java7/lucene/test-framework/lib/junit-4.10.jar:/usr/home/hudson/hudson-slave/workspace/Lucene-Solr-Tests-4.x-java7/lucene/test-framework/lib/randomizedtesting-runner-2.0.4.jar:/home/hudson/hudson-slave/tools/Ant/ant-1.8.2/lib/ant-launcher.jar:/home/hudson/.ant/lib/ivy-2.2.0.jar:/home/hudson/hudson-slave/tools/Ant/ant-1.8.2/lib/ant-apache-regexp.jar:/home/hudson/hudson-slave/tools/Ant/ant-1.8.2/lib/ant-junit.jar:/home/hudson/hudson-slave/tools/Ant/ant-1.8.2/lib/ant-apache-bsf.jar:/home/hudson/hudson-slave/tools/Ant/ant-1.8.2/lib/ant-commons-net.jar:/home/hudson/hudson-slave/tools/Ant/ant-1.8.2/lib/ant-antlr.jar:/home/hudson/hudson-slave/tools/Ant/ant-1.8.2/lib/ant-apache-log4j.jar:/home/hudson/hudson-slave/tools/Ant/ant-1.8.2/lib/ant-commons-logging.jar:/home/hudson/hudson-slave/tools/Ant/ant-1.8.2/lib/ant-apache-xalan2.jar:/home/hudson/hudson-slave/tools/Ant/ant-1.8.2/lib/ant-apache-oro.jar:/home/hudson/hudson-slave/tools/Ant/ant-1.8.2/lib/ant-junit4.jar:/home/hudson/hudson-slave/tools/Ant/ant-1.8.2/lib/ant-netrexx.jar:/home/hudson/hudson-slave/tools/Ant/ant-1.8.2/lib/ant-swing.jar:/home/hudson/hudson-slave/tools/Ant/ant-1.8.2/lib/ant-javamail.jar:/home/hudson/hudson-slave/tools/Ant/ant-1.8.2/lib/ant-jsch.jar:/home/hudson/hudson-slave/tools/Ant/ant-1.8.2/lib/ant-jmf.jar:/home/hudson/hudson-slave/tools/Ant/ant-1.8.2/lib/ant.jar:/home/hudson/hudson-slave/tools/Ant/ant-1.8.2/lib/ant-apache-bcel.jar:/home/hudson/hudson-slave/tools/Ant/ant-1.8.2/lib/ant-jai.jar:/home/hudson/hudson-slave/tools/Ant/ant-1.8.2/lib/ant-testutil.jar:/home/hudson/hudson-slave/tools/Ant/ant-1.8.2/lib/ant-apache-resolver.jar:/home/hudson/hudson-slave/tools/Ant/ant-1.8.2/lib/ant-jdepend.jar:/usr/local/openjdk7/lib/tools.jar:/home/hudson/.ivy2/cache/com.carrotsearch.randomizedtesting/junit4-ant/jars/junit4-ant-2.0.4.jar
[junit4:junit4]   2> 135 T76 oaz.Environment.logEnv Server environment:java.library.path=/usr/local/openjdk7/jre/lib/amd64/server:/usr/local/openjdk7/jre/lib/amd64:/usr/local/openjdk7/jre/../lib/amd64:/usr/local/openjdk6/jre/lib/amd64/server:/usr/local/openjdk6/jre/lib/amd64:/usr/local/openjdk6/jre/../lib/amd64:/usr/java/packages/lib/amd64:/lib:/usr/lib:/usr/local/lib
[junit4:junit4]   2> 136 T76 oaz.Environment.logEnv Server environment:java.io.tmpdir=.
[junit4:junit4]   2> 136 T76 oaz.Environment.logEnv Server environment:java.compiler=<NA>
[junit4:junit4]   2> 136 T76 oaz.Environment.logEnv Server environment:os.name=FreeBSD
[junit4:junit4]   2> 136 T76 oaz.Environment.logEnv Server environment:os.arch=amd64
[junit4:junit4]   2> 136 T76 oaz.Environment.logEnv Server environment:os.version=9.0-RELEASE
[junit4:junit4]   2> 137 T76 oaz.Environment.logEnv Server environment:user.name=hudson
[junit4:junit4]   2> 137 T76 oaz.Environment.logEnv Server environment:user.home=/home/hudson
[junit4:junit4]   2> 137 T76 oaz.Environment.logEnv Server environment:user.dir=/usr/home/hudson/hudson-slave/workspace/Lucene-Solr-Tests-4.x-java7/solr/build/solr-core/test/J0
[junit4:junit4]   2> 189 T76 oazs.ZooKeeperServer.setTickTime tickTime set to 1000
[junit4:junit4]   2> 233 T76 oazs.NIOServerCnxn$Factory.<init> binding to port 0.0.0.0/0.0.0.0:0
[junit4:junit4]   2> 315 T76 oazsp.FileTxnSnapLog.save Snapshotting: 0
[junit4:junit4]   2> 318 T75 oasc.ZkTestServer.run start zk server on port:57157
[junit4:junit4]   2> 405 T75 oaz.Environment.logEnv Client environment:zookeeper.version=3.3.6-1366786, built on 07/29/2012 06:22 GMT
[junit4:junit4]   2> 406 T75 oaz.Environment.logEnv Client environment:host.name=lucene.zones.apache.org
[junit4:junit4]   2> 406 T75 oaz.Environment.logEnv Client environment:java.version=1.7.0_09
[junit4:junit4]   2> 406 T75 oaz.Environment.logEnv Client environment:java.vendor=Oracle Corporation
[junit4:junit4]   2> 406 T75 oaz.Environment.logEnv Client environment:java.home=/usr/local/openjdk7/jre
[junit4:junit4]   2> 407 T75 oaz.Environment.logEnv Client environment:java.class.path=/usr/home/hudson/hudson-slave/workspace/Lucene-Solr-Tests-4.x-java7/solr/build/solr-core/classes/test:/usr/home/hudson/hudson-slave/workspace/Lucene-Solr-Tests-4.x-java7/solr/build/solr-test-framework/classes/java:/usr/home/hudson/hudson-slave/workspace/Lucene-Solr-Tests-4.x-java7/solr/build/solr-core/test-files:/usr/home/hudson/hudson-slave/workspace/Lucene-Solr-Tests-4.x-java7/lucene/build/test-framework/classes/java:/usr/home/hudson/hudson-slave/workspace/Lucene-Solr-Tests-4.x-java7/lucene/build/codecs/classes/java:/usr/home/hudson/hudson-slave/workspace/Lucene-Solr-Tests-4.x-java7/solr/build/solr-solrj/classes/java:/usr/home/hudson/hudson-slave/workspace/Lucene-Solr-Tests-4.x-java7/solr/build/solr-core/classes/java:/usr/home/hudson/hudson-slave/workspace/Lucene-Solr-Tests-4.x-java7/lucene/build/analysis/common/lucene-analyzers-common-4.1-SNAPSHOT.jar:/usr/home/hudson/hudson-slave/workspace/Lucene-Solr-Tests-4.x-java7/lucene/build/analysis/kuromoji/lucene-analyzers-kuromoji-4.1-SNAPSHOT.jar:/usr/home/hudson/hudson-slave/workspace/Lucene-Solr-Tests-4.x-java7/lucene/build/analysis/phonetic/lucene-analyzers-phonetic-4.1-SNAPSHOT.jar:/usr/home/hudson/hudson-slave/workspace/Lucene-Solr-Tests-4.x-java7/lucene/build/highlighter/lucene-highlighter-4.1-SNAPSHOT.jar:/usr/home/hudson/hudson-slave/workspace/Lucene-Solr-Tests-4.x-java7/lucene/build/memory/lucene-memory-4.1-SNAPSHOT.jar:/usr/home/hudson/hudson-slave/workspace/Lucene-Solr-Tests-4.x-java7/lucene/build/misc/lucene-misc-4.1-SNAPSHOT.jar:/usr/home/hudson/hudson-slave/workspace/Lucene-Solr-Tests-4.x-java7/lucene/build/spatial/lucene-spatial-4.1-SNAPSHOT.jar:/usr/home/hudson/hudson-slave/workspace/Lucene-Solr-Tests-4.x-java7/lucene/build/suggest/lucene-suggest-4.1-SNAPSHOT.jar:/usr/home/hudson/hudson-slave/workspace/Lucene-Solr-Tests-4.x-java7/lucene/build/grouping/lucene-grouping-4.1-SNAPSHOT.jar:/usr/home/hudson/hudson-slave/workspace/Lucene-Solr-Tests-4.x-java7/lucene/build/queries/lucene-queries-4.1-SNAPSHOT.jar:/usr/home/hudson/hudson-slave/workspace/Lucene-Solr-Tests-4.x-java7/lucene/build/queryparser/lucene-queryparser-4.1-SNAPSHOT.jar:/usr/home/hudson/hudson-slave/workspace/Lucene-Solr-Tests-4.x-java7/solr/core/lib/commons-cli-1.2.jar:/usr/home/hudson/hudson-slave/workspace/Lucene-Solr-Tests-4.x-java7/solr/core/lib/commons-codec-1.7.jar:/usr/home/hudson/hudson-slave/workspace/Lucene-Solr-Tests-4.x-java7/solr/core/lib/commons-fileupload-1.2.1.jar:/usr/home/hudson/hudson-slave/workspace/Lucene-Solr-Tests-4.x-java7/solr/core/lib/commons-lang-2.6.jar:/usr/home/hudson/hudson-slave/workspace/Lucene-Solr-Tests-4.x-java7/solr/core/lib/easymock-2.2.jar:/usr/home/hudson/hudson-slave/workspace/Lucene-Solr-Tests-4.x-java7/solr/core/lib/guava-r05.jar:/usr/home/hudson/hudson-slave/workspace/Lucene-Solr-Tests-4.x-java7/solr/core/lib/javax.servlet-api-3.0.1.jar:/usr/home/hudson/hudson-slave/workspace/Lucene-Solr-Tests-4.x-java7/solr/core/lib/spatial4j-0.3.jar:/usr/home/hudson/hudson-slave/workspace/Lucene-Solr-Tests-4.x-java7/solr/solrj/lib/commons-io-2.1.jar:/usr/home/hudson/hudson-slave/workspace/Lucene-Solr-Tests-4.x-java7/solr/solrj/lib/httpclient-4.1.3.jar:/usr/home/hudson/hudson-slave/workspace/Lucene-Solr-Tests-4.x-java7/solr/solrj/lib/httpcore-4.1.4.jar:/usr/home/hudson/hudson-slave/workspace/Lucene-Solr-Tests-4.x-java7/solr/solrj/lib/httpmime-4.1.3.jar:/usr/home/hudson/hudson-slave/workspace/Lucene-Solr-Tests-4.x-java7/solr/solrj/lib/jcl-over-slf4j-1.6.4.jar:/usr/home/hudson/hudson-slave/workspace/Lucene-Solr-Tests-4.x-java7/solr/solrj/lib/log4j-over-slf4j-1.6.4.jar:/usr/home/hudson/hudson-slave/workspace/Lucene-Solr-Tests-4.x-java7/solr/solrj/lib/slf4j-api-1.6.4.jar:/usr/home/hudson/hudson-slave/workspace/Lucene-Solr-Tests-4.x-java7/solr/solrj/lib/slf4j-jdk14-1.6.4.jar:/usr/home/hudson/hudson-slave/workspace/Lucene-Solr-Tests-4.x-java7/solr/solrj/lib/wstx-asl-3.2.7.jar:/usr/home/hudson/hudson-slave/workspace/Lucene-Solr-Tests-4.x-java7/solr/solrj/lib/zookeeper-3.3.6.jar:/usr/home/hudson/hudson-slave/workspace/Lucene-Solr-Tests-4.x-java7/solr/example/lib/jetty-continuation-8.1.2.v20120308.jar:/usr/home/hudson/hudson-slave/workspace/Lucene-Solr-Tests-4.x-java7/solr/example/lib/jetty-deploy-8.1.2.v20120308.jar:/usr/home/hudson/hudson-slave/workspace/Lucene-Solr-Tests-4.x-java7/solr/example/lib/jetty-http-8.1.2.v20120308.jar:/usr/home/hudson/hudson-slave/workspace/Lucene-Solr-Tests-4.x-java7/solr/example/lib/jetty-io-8.1.2.v20120308.jar:/usr/home/hudson/hudson-slave/workspace/Lucene-Solr-Tests-4.x-java7/solr/example/lib/jetty-jmx-8.1.2.v20120308.jar:/usr/home/hudson/hudson-slave/workspace/Lucene-Solr-Tests-4.x-java7/solr/example/lib/jetty-security-8.1.2.v20120308.jar:/usr/home/hudson/hudson-slave/workspace/Lucene-Solr-Tests-4.x-java7/solr/example/lib/jetty-server-8.1.2.v20120308.jar:/usr/home/hudson/hudson-slave/workspace/Lucene-Solr-Tests-4.x-java7/solr/example/lib/jetty-servlet-8.1.2.v20120308.jar:/usr/home/hudson/hudson-slave/workspace/Lucene-Solr-Tests-4.x-java7/solr/example/lib/jetty-util-8.1.2.v20120308.jar:/usr/home/hudson/hudson-slave/workspace/Lucene-Solr-Tests-4.x-java7/solr/example/lib/jetty-webapp-8.1.2.v20120308.jar:/usr/home/hudson/hudson-slave/workspace/Lucene-Solr-Tests-4.x-java7/solr/example/lib/jetty-xml-8.1.2.v20120308.jar:/usr/home/hudson/hudson-slave/workspace/Lucene-Solr-Tests-4.x-java7/solr/example/lib/servlet-api-3.0.jar:/usr/home/hudson/hudson-slave/workspace/Lucene-Solr-Tests-4.x-java7/solr/example/example-DIH/solr/db/lib/hsqldb-1.8.0.10.jar:/usr/home/hudson/hudson-slave/workspace/Lucene-Solr-Tests-4.x-java7/lucene/build/core/classes/java:/usr/home/hudson/hudson-slave/workspace/Lucene-Solr-Tests-4.x-java7/lucene/test-framework/lib/junit-4.10.jar:/usr/home/hudson/hudson-slave/workspace/Lucene-Solr-Tests-4.x-java7/lucene/test-framework/lib/randomizedtesting-runner-2.0.4.jar:/home/hudson/hudson-slave/tools/Ant/ant-1.8.2/lib/ant-launcher.jar:/home/hudson/.ant/lib/ivy-2.2.0.jar:/home/hudson/hudson-slave/tools/Ant/ant-1.8.2/lib/ant-apache-regexp.jar:/home/hudson/hudson-slave/tools/Ant/ant-1.8.2/lib/ant-junit.jar:/home/hudson/hudson-slave/tools/Ant/ant-1.8.2/lib/ant-apache-bsf.jar:/home/hudson/hudson-slave/tools/Ant/ant-1.8.2/lib/ant-commons-net.jar:/home/hudson/hudson-slave/tools/Ant/ant-1.8.2/lib/ant-antlr.jar:/home/hudson/hudson-slave/tools/Ant/ant-1.8.2/lib/ant-apache-log4j.jar:/home/hudson/hudson-slave/tools/Ant/ant-1.8.2/lib/ant-commons-logging.jar:/home/hudson/hudson-slave/tools/Ant/ant-1.8.2/lib/ant-apache-xalan2.jar:/home/hudson/hudson-slave/tools/Ant/ant-1.8.2/lib/ant-apache-oro.jar:/home/hudson/hudson-slave/tools/Ant/ant-1.8.2/lib/ant-junit4.jar:/home/hudson/hudson-slave/tools/Ant/ant-1.8.2/lib/ant-netrexx.jar:/home/hudson/hudson-slave/tools/Ant/ant-1.8.2/lib/ant-swing.jar:/home/hudson/hudson-slave/tools/Ant/ant-1.8.2/lib/ant-javamail.jar:/home/hudson/hudson-slave/tools/Ant/ant-1.8.2/lib/ant-jsch.jar:/home/hudson/hudson-slave/tools/Ant/ant-1.8.2/lib/ant-jmf.jar:/home/hudson/hudson-slave/tools/Ant/ant-1.8.2/lib/ant.jar:/home/hudson/hudson-slave/tools/Ant/ant-1.8.2/lib/ant-apache-bcel.jar:/home/hudson/hudson-slave/tools/Ant/ant-1.8.2/lib/ant-jai.jar:/home/hudson/hudson-slave/tools/Ant/ant-1.8.2/lib/ant-testutil.jar:/home/hudson/hudson-slave/tools/Ant/ant-1.8.2/lib/ant-apache-resolver.jar:/home/hudson/hudson-slave/tools/Ant/ant-1.8.2/lib/ant-jdepend.jar:/usr/local/openjdk7/lib/tools.jar:/home/hudson/.ivy2/cache/com.carrotsearch.randomizedtesting/junit4-ant/jars/junit4-ant-2.0.4.jar
[junit4:junit4]   2> 408 T75 oaz.Environment.logEnv Client environment:java.library.path=/usr/local/openjdk7/jre/lib/amd64/server:/usr/local/openjdk7/jre/lib/amd64:/usr/local/openjdk7/jre/../lib/amd64:/usr/local/openjdk6/jre/lib/amd64/server:/usr/local/openjdk6/jre/lib/amd64:/usr/local/openjdk6/jre/../lib/amd64:/usr/java/packages/lib/amd64:/lib:/usr/lib:/usr/local/lib
[junit4:junit4]   2> 408 T75 oaz.Environment.logEnv Client environment:java.io.tmpdir=.
[junit4:junit4]   2> 408 T75 oaz.Environment.logEnv Client environment:java.compiler=<NA>
[junit4:junit4]   2> 408 T75 oaz.Environment.logEnv Client environment:os.name=FreeBSD
[junit4:junit4]   2> 409 T75 oaz.Environment.logEnv Client environment:os.arch=amd64
[junit4:junit4]   2> 409 T75 oaz.Environment.logEnv Client environment:os.version=9.0-RELEASE
[junit4:junit4]   2> 409 T75 oaz.Environment.logEnv Client environment:user.name=hudson
[junit4:junit4]   2> 409 T75 oaz.Environment.logEnv Client environment:user.home=/home/hudson
[junit4:junit4]   2> 410 T75 oaz.Environment.logEnv Client environment:user.dir=/usr/home/hudson/hudson-slave/workspace/Lucene-Solr-Tests-4.x-java7/solr/build/solr-core/test/J0
[junit4:junit4]   2> 415 T75 oaz.ZooKeeper.<init> Initiating client connection, connectString=127.0.0.1:57157 sessionTimeout=10000 watcher=org.apache.solr.common.cloud.ConnectionManager@1bcc1503
[junit4:junit4]   2> 469 T80 oaz.ClientCnxn$SendThread.startConnect Opening socket connection to server /127.0.0.1:57157
[junit4:junit4]   2> 470 T75 oascc.ConnectionManager.waitForConnected Waiting for client to connect to ZooKeeper
[junit4:junit4]   2> 472 T80 oaz.ClientCnxn$SendThread.primeConnection Socket connection established to localhost/127.0.0.1:57157, initiating session
[junit4:junit4]   2> 472 T77 oazs.NIOServerCnxn$Factory.run Accepted socket connection from /140.211.11.196:21567
[junit4:junit4]   2> 485 T77 oazs.NIOServerCnxn.doIO WARNING Exception causing close of session 0x0 due to java.io.IOException: ZooKeeperServer not running
[junit4:junit4]   2> 485 T77 oazs.NIOServerCnxn.closeSock Closed socket connection for client /140.211.11.196:21567 (no session established for client)
[junit4:junit4]   2> 486 T80 oaz.ClientCnxn$SendThread.run Unable to read additional data from server sessionid 0x0, likely server has closed socket, closing socket connection and attempting reconnect
[junit4:junit4]   2> 2204 T80 oaz.ClientCnxn$SendThread.startConnect Opening socket connection to server localhost/127.0.0.1:57157
[junit4:junit4]   2> 2204 T80 oaz.ClientCnxn$SendThread.primeConnection Socket connection established to localhost/127.0.0.1:57157, initiating session
[junit4:junit4]   2> 2205 T77 oazs.NIOServerCnxn$Factory.run Accepted socket connection from /140.211.11.196:21636
[junit4:junit4]   2> 2206 T77 oazs.NIOServerCnxn.readConnectRequest Client attempting to establish new session at /140.211.11.196:21636
[junit4:junit4]   2> 2222 T79 oazsp.FileTxnLog.append Creating new log file: log.1
[junit4:junit4]   2> 2264 T79 oazs.NIOServerCnxn.finishSessionInit Established session 0x13ac3e1b9bc0000 with negotiated timeout 10000 for client /140.211.11.196:21636
[junit4:junit4]   2> 2265 T80 oaz.ClientCnxn$SendThread.readConnectResult Session establishment complete on server localhost/127.0.0.1:57157, sessionid = 0x13ac3e1b9bc0000, negotiated timeout = 10000
[junit4:junit4]   2> 2269 T82 oascc.ConnectionManager.process Watcher org.apache.solr.common.cloud.ConnectionManager@1bcc1503 name:ZooKeeperConnection Watcher:127.0.0.1:57157 got event WatchedEvent state:SyncConnected type:None path:null path:null type:None
[junit4:junit4]   2> 2270 T75 oascc.ConnectionManager.waitForConnected Client is connected to ZooKeeper
[junit4:junit4]   2> 2274 T75 oascc.SolrZkClient.makePath makePath: /solr
[junit4:junit4]   2> 2349 T81 oazs.PrepRequestProcessor.pRequest Processed session termination for sessionid: 0x13ac3e1b9bc0000
[junit4:junit4]   2> 2351 T82 oaz.ClientCnxn$EventThread.run EventThread shut down
[junit4:junit4]   2> 2351 T75 oaz.ZooKeeper.close Session: 0x13ac3e1b9bc0000 closed
[junit4:junit4]   2> 2351 T75 oaz.ZooKeeper.<init> Initiating client connection, connectString=127.0.0.1:57157/solr sessionTimeout=10000 watcher=org.apache.solr.common.cloud.ConnectionManager@7b0c2fa
[junit4:junit4]   2> 2352 T77 oazs.NIOServerCnxn.closeSock Closed socket connection for client /140.211.11.196:21636 which had sessionid 0x13ac3e1b9bc0000
[junit4:junit4]   2> 2352 T83 oaz.ClientCnxn$SendThread.startConnect Opening socket connection to server /127.0.0.1:57157
[junit4:junit4]   2> 2352 T75 oascc.ConnectionManager.waitForConnected Waiting for client to connect to ZooKeeper
[junit4:junit4]   2> 2353 T83 oaz.ClientCnxn$SendThread.primeConnection Socket connection established to localhost/127.0.0.1:57157, initiating session
[junit4:junit4]   2> 2354 T77 oazs.NIOServerCnxn$Factory.run Accepted socket connection from /140.211.11.196:43000
[junit4:junit4]   2> 2354 T77 oazs.NIOServerCnxn.readConnectRequest Client attempting to establish new session at /140.211.11.196:43000
[junit4:junit4]   2> 2356 T79 oazs.NIOServerCnxn.finishSessionInit Established session 0x13ac3e1b9bc0001 with negotiated timeout 10000 for client /140.211.11.196:43000
[junit4:junit4]   2> 2356 T83 oaz.ClientCnxn$SendThread.readConnectResult Session establishment complete on server localhost/127.0.0.1:57157, sessionid = 0x13ac3e1b9bc0001, negotiated timeout = 10000
[junit4:junit4]   2> 2356 T84 oascc.ConnectionManager.process Watcher org.apache.solr.common.cloud.ConnectionManager@7b0c2fa name:ZooKeeperConnection Watcher:127.0.0.1:57157/solr got event WatchedEvent state:SyncConnected type:None path:null path:null type:None
[junit4:junit4]   2> 2357 T75 oascc.ConnectionManager.waitForConnected Client is connected to ZooKeeper
[junit4:junit4]   2> 2370 T75 oascc.SolrZkClient.makePath makePath: /collections/collection1
[junit4:junit4]   2> 2376 T75 oascc.SolrZkClient.makePath makePath: /collections/collection1/shards
[junit4:junit4]   2> 2380 T75 oascc.SolrZkClient.makePath makePath: /collections/control_collection
[junit4:junit4]   2> 2388 T75 oascc.SolrZkClient.makePath makePath: /collections/control_collection/shards
[junit4:junit4]   2> 2393 T75 oasc.AbstractZkTestCase.putConfig put /usr/home/hudson/hudson-slave/workspace/Lucene-Solr-Tests-4.x-java7/solr/build/solr-core/test-files/solr/collection1/conf/solrconfig.xml to /configs/conf1/solrconfig.xml
[junit4:junit4]   2> 2423 T75 oascc.SolrZkClient.makePath makePath: /configs/conf1/solrconfig.xml
[junit4:junit4]   2> 2438 T75 oasc.AbstractZkTestCase.putConfig put /usr/home/hudson/hudson-slave/workspace/Lucene-Solr-Tests-4.x-java7/solr/build/solr-core/test-files/solr/collection1/conf/schema.xml to /configs/conf1/schema.xml
[junit4:junit4]   2> 2439 T75 oascc.SolrZkClient.makePath makePath: /configs/conf1/schema.xml
[junit4:junit4]   2> 2445 T75 oasc.AbstractZkTestCase.putConfig put /usr/home/hudson/hudson-slave/workspace/Lucene-Solr-Tests-4.x-java7/solr/build/solr-core/test-files/solr/collection1/conf/solrconfig.xml to /configs/conf1/solrconfig.xml
[junit4:junit4]   2> 2445 T75 oascc.SolrZkClient.makePath makePath: /configs/conf1/solrconfig.xml
[junit4:junit4]   2> 2465 T75 oasc.AbstractZkTestCase.putConfig put /usr/home/hudson/hudson-slave/workspace/Lucene-Solr-Tests-4.x-java7/solr/build/solr-core/test-files/solr/collection1/conf/stopwords.txt to /configs/conf1/stopwords.txt
[junit4:junit4]   2> 2466 T75 oascc.SolrZkClient.makePath makePath: /configs/conf1/stopwords.txt
[junit4:junit4]   2> 2471 T75 oasc.AbstractZkTestCase.putConfig put /usr/home/hudson/hudson-slave/workspace/Lucene-Solr-Tests-4.x-java7/solr/build/solr-core/test-files/solr/collection1/conf/protwords.txt to /configs/conf1/protwords.txt
[junit4:junit4]   2> 2472 T75 oascc.SolrZkClient.makePath makePath: /configs/conf1/protwords.txt
[junit4:junit4]   2> 2476 T75 oasc.AbstractZkTestCase.putConfig put /usr/home/hudson/hudson-slave/workspace/Lucene-Solr-Tests-4.x-java7/solr/build/solr-core/test-files/solr/collection1/conf/currency.xml to /configs/conf1/currency.xml
[junit4:junit4]   2> 2477 T75 oascc.SolrZkClient.makePath makePath: /configs/conf1/currency.xml
[junit4:junit4]   2> 2481 T75 oasc.AbstractZkTestCase.putConfig put /usr/home/hudson/hudson-slave/workspace/Lucene-Solr-Tests-4.x-java7/solr/build/solr-core/test-files/solr/collection1/conf/open-exchange-rates.json to /configs/conf1/open-exchange-rates.json
[junit4:junit4]   2> 2482 T75 oascc.SolrZkClient.makePath makePath: /configs/conf1/open-exchange-rates.json
[junit4:junit4]   2> 2487 T75 oasc.AbstractZkTestCase.putConfig put /usr/home/hudson/hudson-slave/workspace/Lucene-Solr-Tests-4.x-java7/solr/build/solr-core/test-files/solr/collection1/conf/mapping-ISOLatin1Accent.txt to /configs/conf1/mapping-ISOLatin1Accent.txt
[junit4:junit4]   2> 2487 T75 oascc.SolrZkClient.makePath makePath: /configs/conf1/mapping-ISOLatin1Accent.txt
[junit4:junit4]   2> 2495 T75 oasc.AbstractZkTestCase.putConfig put /usr/home/hudson/hudson-slave/workspace/Lucene-Solr-Tests-4.x-java7/solr/build/solr-core/test-files/solr/collection1/conf/old_synonyms.txt to /configs/conf1/old_synonyms.txt
[junit4:junit4]   2> 2496 T75 oascc.SolrZkClient.makePath makePath: /configs/conf1/old_synonyms.txt
[junit4:junit4]   2> 2500 T75 oasc.AbstractZkTestCase.putConfig put /usr/home/hudson/hudson-slave/workspace/Lucene-Solr-Tests-4.x-java7/solr/build/solr-core/test-files/solr/collection1/conf/synonyms.txt to /configs/conf1/synonyms.txt
[junit4:junit4]   2> 2501 T75 oascc.SolrZkClient.makePath makePath: /configs/conf1/synonyms.txt
[junit4:junit4]   2> 2506 T81 oazs.PrepRequestProcessor.pRequest Processed session termination for sessionid: 0x13ac3e1b9bc0001
[junit4:junit4]   2> 2507 T84 oaz.ClientCnxn$EventThread.run EventThread shut down
[junit4:junit4]   2> 2507 T75 oaz.ZooKeeper.close Session: 0x13ac3e1b9bc0001 closed
[junit4:junit4]   2> 2507 T77 oazs.NIOServerCnxn.closeSock Closed socket connection for client /140.211.11.196:43000 which had sessionid 0x13ac3e1b9bc0001
[junit4:junit4]   2> 2508 T75 oasc.LeaderElectionIntegrationTest.setUp ####SETUP_START testLeaderElectionAfterClientTimeout
[junit4:junit4]   2> 2510 T75 oasc.SolrResourceLoader.locateSolrHome JNDI not configured for solr (NoInitialContextEx)
[junit4:junit4]   2> 2511 T75 oasc.SolrResourceLoader.locateSolrHome using system property solr.solr.home: /usr/home/hudson/hudson-slave/workspace/Lucene-Solr-Tests-4.x-java7/solr/build/solr-core/test-files/solr
[junit4:junit4]   2> 2511 T75 oasc.CoreContainer$Initializer.initialize looking for solr.xml: /usr/home/hudson/hudson-slave/workspace/Lucene-Solr-Tests-4.x-java7/solr/build/solr-core/test-files/solr/solr.xml
[junit4:junit4]   2> 2512 T75 oasc.CoreContainer.<init> New CoreContainer 1755608529
[junit4:junit4]   2> 2512 T75 oasc.CoreContainer.load Loading CoreContainer using Solr Home: '/usr/home/hudson/hudson-slave/workspace/Lucene-Solr-Tests-4.x-java7/solr/build/solr-core/test-files/solr/'
[junit4:junit4]   2> 2513 T75 oasc.SolrResourceLoader.<init> new SolrResourceLoader for directory: '/usr/home/hudson/hudson-slave/workspace/Lucene-Solr-Tests-4.x-java7/solr/build/solr-core/test-files/solr/'
[junit4:junit4]   2> 2590 T75 oasc.CoreContainer.load Registering Log Listener
[junit4:junit4]   2> 2607 T75 oasc.CoreContainer.initZooKeeper Zookeeper client=127.0.0.1:57157/solr
[junit4:junit4]   2> 2635 T75 oaz.ZooKeeper.<init> Initiating client connection, connectString=127.0.0.1:57157/solr sessionTimeout=3000 watcher=org.apache.solr.common.cloud.ConnectionManager@5e934dd
[junit4:junit4]   2> 2637 T85 oaz.ClientCnxn$SendThread.startConnect Opening socket connection to server /127.0.0.1:57157
[junit4:junit4]   2> 2637 T75 oascc.ConnectionManager.waitForConnected Waiting for client to connect to ZooKeeper
[junit4:junit4]   2> 2638 T85 oaz.ClientCnxn$SendThread.primeConnection Socket connection established to localhost/127.0.0.1:57157, initiating session
[junit4:junit4]   2> 2638 T77 oazs.NIOServerCnxn$Factory.run Accepted socket connection from /140.211.11.196:10260
[junit4:junit4]   2> 2639 T77 oazs.NIOServerCnxn.readConnectRequest Client attempting to establish new session at /140.211.11.196:10260
[junit4:junit4]   2> 2640 T79 oazs.NIOServerCnxn.finishSessionInit Established session 0x13ac3e1b9bc0002 with negotiated timeout 3000 for client /140.211.11.196:10260
[junit4:junit4]   2> 2640 T85 oaz.ClientCnxn$SendThread.readConnectResult Session establishment complete on server localhost/127.0.0.1:57157, sessionid = 0x13ac3e1b9bc0002, negotiated timeout = 3000
[junit4:junit4]   2> 2641 T86 oascc.ConnectionManager.process Watcher org.apache.solr.common.cloud.ConnectionManager@5e934dd name:ZooKeeperConnection Watcher:127.0.0.1:57157/solr got event WatchedEvent state:SyncConnected type:None path:null path:null type:None
[junit4:junit4]   2> 2641 T75 oascc.ConnectionManager.waitForConnected Client is connected to ZooKeeper
[junit4:junit4]   2> 2663 T81 oazs.PrepRequestProcessor.pRequest Got user-level KeeperException when processing sessionid:0x13ac3e1b9bc0002 type:create cxid:0x2 zxid:0xfffffffffffffffe txntype:unknown reqpath:n/a Error Path:/solr/overseer Error:KeeperErrorCode = NodeExists for /solr/overseer
[junit4:junit4]   2> 2675 T75 oascc.SolrZkClient.makePath makePath: /live_nodes
[junit4:junit4]   2> 2678 T75 oasc.ZkController.createEphemeralLiveNode Register node as live in ZooKeeper:/live_nodes/127.0.0.1:7000_solr
[junit4:junit4]   2> 2684 T81 oazs.PrepRequestProcessor.pRequest Got user-level KeeperException when processing sessionid:0x13ac3e1b9bc0002 type:delete cxid:0x7 zxid:0xfffffffffffffffe txntype:unknown reqpath:n/a Error Path:/solr/live_nodes/127.0.0.1:7000_solr Error:KeeperErrorCode = NoNode for /solr/live_nodes/127.0.0.1:7000_solr
[junit4:junit4]   2> 2685 T75 oascc.SolrZkClient.makePath makePath: /live_nodes/127.0.0.1:7000_solr
[junit4:junit4]   2> 2690 T75 oashc.HttpShardHandlerFactory.getParameter Setting socketTimeout to: 0
[junit4:junit4]   2> 2690 T75 oashc.HttpShardHandlerFactory.getParameter Setting urlScheme to: http://
[junit4:junit4]   2> 2690 T75 oashc.HttpShardHandlerFactory.getParameter Setting connTimeout to: 0
[junit4:junit4]   2> 2691 T75 oashc.HttpShardHandlerFactory.getParameter Setting maxConnectionsPerHost to: 20
[junit4:junit4]   2> 2691 T75 oashc.HttpShardHandlerFactory.getParameter Setting corePoolSize to: 0
[junit4:junit4]   2> 2691 T75 oashc.HttpShardHandlerFactory.getParameter Setting maximumPoolSize to: 2147483647
[junit4:junit4]   2> 2692 T75 oashc.HttpShardHandlerFactory.getParameter Setting maxThreadIdleTime to: 5
[junit4:junit4]   2> 2692 T75 oashc.HttpShardHandlerFactory.getParameter Setting sizeOfQueue to: -1
[junit4:junit4]   2> 2693 T75 oashc.HttpShardHandlerFactory.getParameter Setting fairnessPolicy to: false
[junit4:junit4]   2> 2693 T75 oascsi.HttpClientUtil.createClient Creating new http client, config:maxConnectionsPerHost=20&maxConnections=10000&socketTimeout=0&connTimeout=0&retry=false
[junit4:junit4]   2> 2711 T75 oascc.SolrZkClient.makePath makePath: /overseer_elect/election
[junit4:junit4]   2> 2734 T81 oazs.PrepRequestProcessor.pRequest Got user-level KeeperException when processing sessionid:0x13ac3e1b9bc0002 type:delete cxid:0x15 zxid:0xfffffffffffffffe txntype:unknown reqpath:n/a Error Path:/solr/overseer_elect/leader Error:KeeperErrorCode = NoNode for /solr/overseer_elect/leader
[junit4:junit4]   2> 2735 T75 oascc.SolrZkClient.makePath makePath: /overseer_elect/leader
[junit4:junit4]   2> 2739 T75 oasc.Overseer.start Overseer (id=88598516938309634-127.0.0.1:7000_solr-n_0000000000) starting
[junit4:junit4]   2> 2740 T81 oazs.PrepRequestProcessor.pRequest Got user-level KeeperException when processing sessionid:0x13ac3e1b9bc0002 type:create cxid:0x1a zxid:0xfffffffffffffffe txntype:unknown reqpath:n/a Error Path:/solr/overseer Error:KeeperErrorCode = NodeExists for /solr/overseer
[junit4:junit4]   2> 2766 T81 oazs.PrepRequestProcessor.pRequest Got user-level KeeperException when processing sessionid:0x13ac3e1b9bc0002 type:create cxid:0x1b zxid:0xfffffffffffffffe txntype:unknown reqpath:n/a Error Path:/solr/overseer Error:KeeperErrorCode = NodeExists for /solr/overseer
[junit4:junit4]   2> 2767 T81 oazs.PrepRequestProcessor.pRequest Got user-level KeeperException when processing sessionid:0x13ac3e1b9bc0002 type:create cxid:0x1c zxid:0xfffffffffffffffe txntype:unknown reqpath:n/a Error Path:/solr/overseer Error:KeeperErrorCode = NodeExists for /solr/overseer
[junit4:junit4]   2> 2783 T81 oazs.PrepRequestProcessor.pRequest Got user-level KeeperException when processing sessionid:0x13ac3e1b9bc0002 type:create cxid:0x1d zxid:0xfffffffffffffffe txntype:unknown reqpath:n/a Error Path:/solr/overseer Error:KeeperErrorCode = NodeExists for /solr/overseer
[junit4:junit4]   2> 2784 T88 oasc.OverseerCollectionProcessor.run Process current queue of collection messages
[junit4:junit4]   2> 2785 T75 oascc.SolrZkClient.makePath makePath: /clusterstate.json
[junit4:junit4]   2> 2789 T75 oascc.ZkStateReader.createClusterStateWatchersAndUpdate Updating cluster state from ZooKeeper... 
[junit4:junit4]   2> 2824 T87 oasc.Overseer$ClusterStateUpdater.run Starting to work on the main queue
[junit4:junit4]   2> 2868 T75 oasc.CoreContainer.create Creating SolrCore 'collection1' using instanceDir: /usr/home/hudson/hudson-slave/workspace/Lucene-Solr-Tests-4.x-java7/solr/build/solr-core/test-files/solr/collection1
[junit4:junit4]   2> 2869 T75 oasc.ZkController.createCollectionZkNode Check for collection zkNode:collection1
[junit4:junit4]   2> 2870 T75 oasc.ZkController.createCollectionZkNode Collection zkNode exists
[junit4:junit4]   2> 2870 T75 oasc.ZkController.readConfigName Load collection config from:/collections/collection1
[junit4:junit4]   2> 2872 T75 oasc.SolrResourceLoader.<init> new SolrResourceLoader for directory: '/usr/home/hudson/hudson-slave/workspace/Lucene-Solr-Tests-4.x-java7/solr/build/solr-core/test-files/solr/collection1/'
[junit4:junit4]   2> 2874 T75 oasc.SolrResourceLoader.replaceClassLoader Adding 'file:/usr/home/hudson/hudson-slave/workspace/Lucene-Solr-Tests-4.x-java7/solr/build/solr-core/test-files/solr/collection1/lib/classes/' to classloader
[junit4:junit4]   2> 2875 T75 oasc.SolrResourceLoader.replaceClassLoader Adding 'file:/usr/home/hudson/hudson-slave/workspace/Lucene-Solr-Tests-4.x-java7/solr/build/solr-core/test-files/solr/collection1/lib/README' to classloader
[junit4:junit4]   2> 2988 T75 oasc.SolrConfig.<init> Using Lucene MatchVersion: LUCENE_41
[junit4:junit4]   2> 3075 T75 oasc.SolrConfig.<init> Loaded SolrConfig: solrconfig.xml
[junit4:junit4]   2> 3077 T75 oass.IndexSchema.readSchema Reading Solr Schema
[junit4:junit4]   2> 3110 T75 oass.IndexSchema.readSchema Schema name=test
[junit4:junit4]   2> 3855 T75 oass.OpenExchangeRatesOrgProvider.init Initialized with rates=open-exchange-rates.json, refreshInterval=1440.
[junit4:junit4]   2> 3870 T75 oass.IndexSchema.readSchema default search field in schema is text
[junit4:junit4]   2> 3872 T75 oass.IndexSchema.readSchema unique key field: id
[junit4:junit4]   2> 3907 T75 oass.FileExchangeRateProvider.reload Reloading exchange rates from file currency.xml
[junit4:junit4]   2> 3918 T75 oass.FileExchangeRateProvider.reload Reloading exchange rates from file currency.xml
[junit4:junit4]   2> 3929 T75 oass.OpenExchangeRatesOrgProvider.reload Reloading exchange rates from open-exchange-rates.json
[junit4:junit4]   2> 3934 T75 oass.OpenExchangeRatesOrgProvider.reload Reloading exchange rates from open-exchange-rates.json
[junit4:junit4]   2> 3936 T75 oasc.SolrCore.<init> [collection1] Opening new SolrCore at /usr/home/hudson/hudson-slave/workspace/Lucene-Solr-Tests-4.x-java7/solr/build/solr-core/test-files/solr/collection1/, dataDir=/usr/home/hudson/hudson-slave/workspace/Lucene-Solr-Tests-4.x-java7/solr/build/solr-core/test/J0/./solrtest-LeaderElectionIntegrationTest-1351906080841/data_7000/
[junit4:junit4]   2> 3939 T75 oasc.JmxMonitoredMap.<init> JMX monitoring is enabled. Adding Solr mbeans to JMX Server: com.sun.jmx.mbeanserver.JmxMBeanServer@54db16d7
[junit4:junit4]   2> 3939 T75 oasc.SolrCore.getNewIndexDir New index directory detected: old=null new=/usr/home/hudson/hudson-slave/workspace/Lucene-Solr-Tests-4.x-java7/solr/build/solr-core/test/J0/./solrtest-LeaderElectionIntegrationTest-1351906080841/data_7000/index/
[junit4:junit4]   2> 3940 T75 oasc.SolrCore.initIndex WARNING [collection1] Solr index directory '/usr/home/hudson/hudson-slave/workspace/Lucene-Solr-Tests-4.x-java7/solr/build/solr-core/test/J0/./solrtest-LeaderElectionIntegrationTest-1351906080841/data_7000/index' doesn't exist. Creating new index...
[junit4:junit4]   2> 3940 T75 oasc.CachingDirectoryFactory.get return new directory for /usr/home/hudson/hudson-slave/workspace/Lucene-Solr-Tests-4.x-java7/solr/build/solr-core/test/J0/./solrtest-LeaderElectionIntegrationTest-1351906080841/data_7000/index forceNew:false
[junit4:junit4]   2> 3942 T75 oasc.SolrDeletionPolicy.onCommit SolrDeletionPolicy.onCommit: commits:num=1
[junit4:junit4]   2> 		commit{dir=MockDirWrapper(org.apache.lucene.store.RAMDirectory@2eab8f37 lockFactory=org.apache.lucene.store.NativeFSLockFactory@7c11d6fe),segFN=segments_1,generation=1,filenames=[segments_1]
[junit4:junit4]   2> 3942 T75 oasc.SolrDeletionPolicy.updateCommits newest commit = 1
[junit4:junit4]   2> 3943 T75 oasc.SolrCore.initWriters created xml: solr.XMLResponseWriter
[junit4:junit4]   2> 3945 T75 oasup.UpdateRequestProcessorChain.init inserting DistributedUpdateProcessorFactory into updateRequestProcessorChain "dedupe"
[junit4:junit4]   2> 3945 T75 oasup.UpdateRequestProcessorChain.init inserting DistributedUpdateProcessorFactory into updateRequestProcessorChain "dedupe-allfields"
[junit4:junit4]   2> 3946 T75 oasup.UpdateRequestProcessorChain.init inserting DistributedUpdateProcessorFactory into updateRequestProcessorChain "stored_sig"
[junit4:junit4]   2> 3946 T75 oasup.UpdateRequestProcessorChain.init inserting DistributedUpdateProcessorFactory into updateRequestProcessorChain "uniq-fields"
[junit4:junit4]   2> 3947 T75 oasup.UpdateRequestProcessorChain.init inserting DistributedUpdateProcessorFactory into updateRequestProcessorChain "distrib-dup-test-chain-implicit"
[junit4:junit4]   2> 3947 T75 oasc.RequestHandlers.initHandlersFromConfig adding lazy requestHandler: solr.ReplicationHandler
[junit4:junit4]   2> 3948 T75 oasc.RequestHandlers.initHandlersFromConfig created /replication: solr.ReplicationHandler
[junit4:junit4]   2> 3948 T75 oasc.RequestHandlers.initHandlersFromConfig created standard: solr.StandardRequestHandler
[junit4:junit4]   2> 3948 T75 oasc.RequestHandlers.initHandlersFromConfig created /get: solr.RealTimeGetHandler
[junit4:junit4]   2> 3949 T75 oasc.RequestHandlers.initHandlersFromConfig created dismax: solr.SearchHandler
[junit4:junit4]   2> 3949 T75 oasc.RequestHandlers.initHandlersFromConfig created mock: org.apache.solr.core.MockQuerySenderListenerReqHandler
[junit4:junit4]   2> 3950 T75 oasc.RequestHandlers.initHandlersFromConfig created /admin/: org.apache.solr.handler.admin.AdminHandlers
[junit4:junit4]   2> 3950 T75 oasc.RequestHandlers.initHandlersFromConfig created defaults: solr.StandardRequestHandler
[junit4:junit4]   2> 3950 T75 oasc.RequestHandlers.initHandlersFromConfig adding lazy requestHandler: solr.StandardRequestHandler
[junit4:junit4]   2> 3951 T75 oasc.RequestHandlers.initHandlersFromConfig created lazy: solr.StandardRequestHandler
[junit4:junit4]   2> 3951 T75 oasc.RequestHandlers.initHandlersFromConfig created /update: solr.UpdateRequestHandler
[junit4:junit4]   2> 3952 T75 oasc.RequestHandlers.initHandlersFromConfig created /terms: org.apache.solr.handler.component.SearchHandler
[junit4:junit4]   2> 3952 T75 oasc.RequestHandlers.initHandlersFromConfig created spellCheckCompRH: org.apache.solr.handler.component.SearchHandler
[junit4:junit4]   2> 3952 T75 oasc.RequestHandlers.initHandlersFromConfig created spellCheckCompRH_Direct: org.apache.solr.handler.component.SearchHandler
[junit4:junit4]   2> 3953 T75 oasc.RequestHandlers.initHandlersFromConfig created spellCheckWithWordbreak: org.apache.solr.handler.component.SearchHandler
[junit4:junit4]   2> 3953 T75 oasc.RequestHandlers.initHandlersFromConfig created spellCheckWithWordbreak_Direct: org.apache.solr.handler.component.SearchHandler
[junit4:junit4]   2> 3954 T75 oasc.RequestHandlers.initHandlersFromConfig created spellCheckCompRH1: org.apache.solr.handler.component.SearchHandler
[junit4:junit4]   2> 3954 T75 oasc.RequestHandlers.initHandlersFromConfig created tvrh: org.apache.solr.handler.component.SearchHandler
[junit4:junit4]   2> 3954 T75 oasc.RequestHandlers.initHandlersFromConfig created /mlt: solr.MoreLikeThisHandler
[junit4:junit4]   2> 3955 T75 oasc.RequestHandlers.initHandlersFromConfig created /debug/dump: solr.DumpRequestHandler
[junit4:junit4]   2> 3963 T75 oashl.XMLLoader.init xsltCacheLifetimeSeconds=60
[junit4:junit4]   2> 3967 T75 oasc.SolrCore.initDeprecatedSupport WARNING solrconfig.xml uses deprecated <admin/gettableFiles>, Please update your config to use the ShowFileRequestHandler.
[junit4:junit4]   2> 3968 T75 oasc.SolrCore.initDeprecatedSupport WARNING adding ShowFileRequestHandler with hidden files: [SCHEMA.XML, OLD_SYNONYMS.TXT, STOPWORDS.TXT, PROTWORDS.TXT, OPEN-EXCHANGE-RATES.JSON, SYNONYMS.TXT, CURRENCY.XML, MAPPING-ISOLATIN1ACCENT.TXT]
[junit4:junit4]   2> 3970 T75 oass.SolrIndexSearcher.<init> Opening Searcher@75fd56dc main
[junit4:junit4]   2> 3970 T75 oass.SolrIndexSearcher.getIndexDir WARNING WARNING: Directory impl does not support setting indexDir: org.apache.lucene.store.MockDirectoryWrapper
[junit4:junit4]   2> 3971 T75 oasu.CommitTracker.<init> Hard AutoCommit: disabled
[junit4:junit4]   2> 3971 T75 oasu.CommitTracker.<init> Soft AutoCommit: disabled
[junit4:junit4]   2> 3971 T75 oashc.SpellCheckComponent.inform Initializing spell checkers
[junit4:junit4]   2> 3977 T75 oass.DirectSolrSpellChecker.init init: {name=direct,classname=DirectSolrSpellChecker,field=lowerfilt,minQueryLength=3}
[junit4:junit4]   2> 4029 T89 oasc.SolrCore.registerSearcher [collection1] Registered new searcher Searcher@75fd56dc main{StandardDirectoryReader(segments_1:1)}
[junit4:junit4]   2> 4033 T75 oasc.ZkController.publish numShards not found on descriptor - reading it from system property
[junit4:junit4]   2> 4034 T81 oazs.PrepRequestProcessor.pRequest Got user-level KeeperException when processing sessionid:0x13ac3e1b9bc0002 type:create cxid:0x56 zxid:0xfffffffffffffffe txntype:unknown reqpath:n/a Error Path:/solr/overseer/queue Error:KeeperErrorCode = NoNode for /solr/overseer/queue
[junit4:junit4]   2> 4045 T75 oasc.CoreContainer.register registering core: collection1
[junit4:junit4]   2> 4045 T75 oasc.ZkController.register Register shard - core:collection1 address:http://127.0.0.1:7000/solr shardId:shard1
[junit4:junit4]   2> 4055 T75 oascsi.HttpClientUtil.createClient Creating new http client, config:maxConnections=10000&maxConnectionsPerHost=20&connTimeout=30000&socketTimeout=30000&retry=false
[junit4:junit4]   2> 4066 T75 oascc.SolrZkClient.makePath makePath: /collections/collection1/leader_elect/shard1/election
[junit4:junit4]   2> 4088 T81 oazs.PrepRequestProcessor.pRequest Got user-level KeeperException when processing sessionid:0x13ac3e1b9bc0002 type:delete cxid:0x65 zxid:0xfffffffffffffffe txntype:unknown reqpath:n/a Error Path:/solr/collections/collection1/leaders Error:KeeperErrorCode = NoNode for /solr/collections/collection1/leaders
[junit4:junit4]   2> 4089 T75 oasc.ShardLeaderElectionContext.runLeaderProcess Running the leader process.
[junit4:junit4]   2> 4090 T81 oazs.PrepRequestProcessor.pRequest Got user-level KeeperException when processing sessionid:0x13ac3e1b9bc0002 type:create cxid:0x66 zxid:0xfffffffffffffffe txntype:unknown reqpath:n/a Error Path:/solr/overseer Error:KeeperErrorCode = NodeExists for /solr/overseer
[junit4:junit4]   2> 4334 T87 oascc.ZkStateReader.updateClusterState Updating cloud state from ZooKeeper... 
[junit4:junit4]   2> 4335 T87 oasc.Overseer$ClusterStateUpdater.updateState Update state numShards=null message={
[junit4:junit4]   2> 	  "operation":"state",
[junit4:junit4]   2> 	  "numShards":null,
[junit4:junit4]   2> 	  "shard":"shard1",
[junit4:junit4]   2> 	  "roles":null,
[junit4:junit4]   2> 	  "state":"down",
[junit4:junit4]   2> 	  "core":"collection1",
[junit4:junit4]   2> 	  "collection":"collection1",
[junit4:junit4]   2> 	  "node_name":"127.0.0.1:7000_solr",
[junit4:junit4]   2> 	  "base_url":"http://127.0.0.1:7000/solr"}
[junit4:junit4]   2> 4348 T81 oazs.PrepRequestProcessor.pRequest Got user-level KeeperException when processing sessionid:0x13ac3e1b9bc0002 type:create cxid:0x6d zxid:0xfffffffffffffffe txntype:unknown reqpath:n/a Error Path:/solr/overseer/queue-work Error:KeeperErrorCode = NoNode for /solr/overseer/queue-work
[junit4:junit4]   2> 4384 T86 oascc.ZkStateReader$2.process A cluster state change has occurred - updating... (1)
[junit4:junit4]   2> 4602 T75 oasc.ShardLeaderElectionContext.waitForReplicasToComeUp Enough replicas found to continue.
[junit4:junit4]   2> 4603 T75 oasc.ShardLeaderElectionContext.runLeaderProcess I may be the new leader - try and sync
[junit4:junit4]   2> 4603 T75 oasc.ShardLeaderElectionContext.runLeaderProcess I am the new leader: http://127.0.0.1:7000/solr/collection1/
[junit4:junit4]   2> 4603 T75 oascc.SolrZkClient.makePath makePath: /collections/collection1/leaders/shard1
[junit4:junit4]   2> 4609 T81 oazs.PrepRequestProcessor.pRequest Got user-level KeeperException when processing sessionid:0x13ac3e1b9bc0002 type:create cxid:0x8b zxid:0xfffffffffffffffe txntype:unknown reqpath:n/a Error Path:/solr/overseer Error:KeeperErrorCode = NodeExists for /solr/overseer
[junit4:junit4]   2> 4892 T87 oascc.ZkStateReader.updateClusterState Updating cloud state from ZooKeeper... 
[junit4:junit4]   2> 4906 T86 oascc.ZkStateReader$2.process A cluster state change has occurred - updating... (1)
[junit4:junit4]   2> 4925 T75 oasc.ZkController.register We are http://127.0.0.1:7000/solr/collection1/ and leader is http://127.0.0.1:7000/solr/collection1/
[junit4:junit4]   2> 4925 T75 oasc.ZkController.checkRecovery WARNING Skipping recovery according to sys prop solrcloud.skip.autorecovery
[junit4:junit4]   2> 4926 T75 oasc.ZkController.publish numShards not found on descriptor - reading it from system property
[junit4:junit4]   2> 4929 T75 oascc.ZkStateReader.updateClusterState Updating cloud state from ZooKeeper... 
[junit4:junit4]   2> 4933 T75 oasc.SolrResourceLoader.locateSolrHome JNDI not configured for solr (NoInitialContextEx)
[junit4:junit4]   2> 4933 T75 oasc.SolrResourceLoader.locateSolrHome using system property solr.solr.home: /usr/home/hudson/hudson-slave/workspace/Lucene-Solr-Tests-4.x-java7/solr/build/solr-core/test-files/solr
[junit4:junit4]   2> 4933 T75 oasc.CoreContainer$Initializer.initialize looking for solr.xml: /usr/home/hudson/hudson-slave/workspace/Lucene-Solr-Tests-4.x-java7/solr/build/solr-core/test-files/solr/solr.xml
[junit4:junit4]   2> 4934 T75 oasc.CoreContainer.<init> New CoreContainer 229421624
[junit4:junit4]   2> 4935 T75 oasc.CoreContainer.load Loading CoreContainer using Solr Home: '/usr/home/hudson/hudson-slave/workspace/Lucene-Solr-Tests-4.x-java7/solr/build/solr-core/test-files/solr/'
[junit4:junit4]   2> 4935 T75 oasc.SolrResourceLoader.<init> new SolrResourceLoader for directory: '/usr/home/hudson/hudson-slave/workspace/Lucene-Solr-Tests-4.x-java7/solr/build/solr-core/test-files/solr/'
[junit4:junit4]   2> 4999 T75 oasc.CoreContainer.load Registering Log Listener
[junit4:junit4]   2> 5016 T75 oasc.CoreContainer.initZooKeeper Zookeeper client=127.0.0.1:57157/solr
[junit4:junit4]   2> 5017 T75 oaz.ZooKeeper.<init> Initiating client connection, connectString=127.0.0.1:57157/solr sessionTimeout=3000 watcher=org.apache.solr.common.cloud.ConnectionManager@577670ee
[junit4:junit4]   2> 5018 T90 oaz.ClientCnxn$SendThread.startConnect Opening socket connection to server /127.0.0.1:57157
[junit4:junit4]   2> 5018 T75 oascc.ConnectionManager.waitForConnected Waiting for client to connect to ZooKeeper
[junit4:junit4]   2> 5019 T90 oaz.ClientCnxn$SendThread.primeConnection Socket connection established to localhost/127.0.0.1:57157, initiating session
[junit4:junit4]   2> 5019 T77 oazs.NIOServerCnxn$Factory.run Accepted socket connection from /140.211.11.196:54083
[junit4:junit4]   2> 5020 T77 oazs.NIOServerCnxn.readConnectRequest Client attempting to establish new session at /140.211.11.196:54083
[junit4:junit4]   2> 5021 T79 oazs.NIOServerCnxn.finishSessionInit Established session 0x13ac3e1b9bc0003 with negotiated timeout 3000 for client /140.211.11.196:54083
[junit4:junit4]   2> 5021 T90 oaz.ClientCnxn$SendThread.readConnectResult Session establishment complete on server localhost/127.0.0.1:57157, sessionid = 0x13ac3e1b9bc0003, negotiated timeout = 3000
[junit4:junit4]   2> 5022 T91 oascc.ConnectionManager.process Watcher org.apache.solr.common.cloud.ConnectionManager@577670ee name:ZooKeeperConnection Watcher:127.0.0.1:57157/solr got event WatchedEvent state:SyncConnected type:None path:null path:null type:None
[junit4:junit4]   2> 5022 T75 oascc.ConnectionManager.waitForConnected Client is connected to ZooKeeper
[junit4:junit4]   2> 5023 T81 oazs.PrepRequestProcessor.pRequest Got user-level KeeperException when processing sessionid:0x13ac3e1b9bc0003 type:create cxid:0x1 zxid:0xfffffffffffffffe txntype:unknown reqpath:n/a Error Path:/solr/overseer Error:KeeperErrorCode = NodeExists for /solr/overseer
[junit4:junit4]   2> 5024 T81 oazs.PrepRequestProcessor.pRequest Got user-level KeeperException when processing sessionid:0x13ac3e1b9bc0003 type:create cxid:0x2 zxid:0xfffffffffffffffe txntype:unknown reqpath:n/a Error Path:/solr/overseer Error:KeeperErrorCode = NodeExists for /solr/overseer
[junit4:junit4]   2> 5026 T75 oasc.ZkController.createEphemeralLiveNode Register node as live in ZooKeeper:/live_nodes/127.0.0.1:7001_solr
[junit4:junit4]   2> 5027 T81 oazs.PrepRequestProcessor.pRequest Got user-level KeeperException when processing sessionid:0x13ac3e1b9bc0003 type:delete cxid:0x4 zxid:0xfffffffffffffffe txntype:unknown reqpath:n/a Error Path:/solr/live_nodes/127.0.0.1:7001_solr Error:KeeperErrorCode = NoNode for /solr/live_nodes/127.0.0.1:7001_solr
[junit4:junit4]   2> 5034 T75 oascc.SolrZkClient.makePath makePath: /live_nodes/127.0.0.1:7001_solr
[junit4:junit4]   2> 5037 T86 oascc.ZkStateReader$3.process Updating live nodes... (2)
[junit4:junit4]   2> 5038 T75 oashc.HttpShardHandlerFactory.getParameter Setting socketTimeout to: 0
[junit4:junit4]   2> 5038 T75 oashc.HttpShardHandlerFactory.getParameter Setting urlScheme to: http://
[junit4:junit4]   2> 5039 T75 oashc.HttpShardHandlerFactory.getParameter Setting connTimeout to: 0
[junit4:junit4]   2> 5039 T75 oashc.HttpShardHandlerFactory.getParameter Setting maxConnectionsPerHost to: 20
[junit4:junit4]   2> 5039 T75 oashc.HttpShardHandlerFactory.getParameter Setting corePoolSize to: 0
[junit4:junit4]   2> 5040 T75 oashc.HttpShardHandlerFactory.getParameter Setting maximumPoolSize to: 2147483647
[junit4:junit4]   2> 5040 T75 oashc.HttpShardHandlerFactory.getParameter Setting maxThreadIdleTime to: 5
[junit4:junit4]   2> 5040 T75 oashc.HttpShardHandlerFactory.getParameter Setting sizeOfQueue to: -1
[junit4:junit4]   2> 5041 T75 oashc.HttpShardHandlerFactory.getParameter Setting fairnessPolicy to: false
[junit4:junit4]   2> 5041 T75 oascsi.HttpClientUtil.createClient Creating new http client, config:maxConnectionsPerHost=20&maxConnections=10000&socketTimeout=0&connTimeout=0&retry=false
[junit4:junit4]   2> 5061 T75 oascc.ZkStateReader.createClusterStateWatchersAndUpdate Updating cluster state from ZooKeeper... 
[junit4:junit4]   2> 5069 T75 oasc.CoreContainer.create Creating SolrCore 'collection1' using instanceDir: /usr/home/hudson/hudson-slave/workspace/Lucene-Solr-Tests-4.x-java7/solr/build/solr-core/test-files/solr/collection1
[junit4:junit4]   2> 5069 T75 oasc.ZkController.createCollectionZkNode Check for collection zkNode:collection1
[junit4:junit4]   2> 5070 T75 oasc.ZkController.createCollectionZkNode Collection zkNode exists
[junit4:junit4]   2> 5070 T75 oasc.ZkController.readConfigName Load collection config from:/collections/collection1
[junit4:junit4]   2> 5072 T75 oasc.SolrResourceLoader.<init> new SolrResourceLoader for directory: '/usr/home/hudson/hudson-slave/workspace/Lucene-Solr-Tests-4.x-java7/solr/build/solr-core/test-files/solr/collection1/'
[junit4:junit4]   2> 5073 T75 oasc.SolrResourceLoader.replaceClassLoader Adding 'file:/usr/home/hudson/hudson-slave/workspace/Lucene-Solr-Tests-4.x-java7/solr/build/solr-core/test-files/solr/collection1/lib/classes/' to classloader
[junit4:junit4]   2> 5074 T75 oasc.SolrResourceLoader.replaceClassLoader Adding 'file:/usr/home/hudson/hudson-slave/workspace/Lucene-Solr-Tests-4.x-java7/solr/build/solr-core/test-files/solr/collection1/lib/README' to classloader
[junit4:junit4]   2> 5140 T75 oasc.SolrConfig.<init> Using Lucene MatchVersion: LUCENE_41
[junit4:junit4]   2> 5222 T75 oasc.SolrConfig.<init> Loaded SolrConfig: solrconfig.xml
[junit4:junit4]   2> 5224 T75 oass.IndexSchema.readSchema Reading Solr Schema
[junit4:junit4]   2> 5254 T75 oass.IndexSchema.readSchema Schema name=test
[junit4:junit4]   2> 5412 T87 oascc.ZkStateReader.updateClusterState Updating cloud state from ZooKeeper... 
[junit4:junit4]   2> 5413 T87 oasc.Overseer$ClusterStateUpdater.updateState Update state numShards=null message={
[junit4:junit4]   2> 	  "operation":"state",
[junit4:junit4]   2> 	  "numShards":null,
[junit4:junit4]   2> 	  "shard":"shard1",
[junit4:junit4]   2> 	  "roles":null,
[junit4:junit4]   2> 	  "state":"active",
[junit4:junit4]   2> 	  "core":"collection1",
[junit4:junit4]   2> 	  "collection":"collection1",
[junit4:junit4]   2> 	  "node_name":"127.0.0.1:7000_solr",
[junit4:junit4]   2> 	  "base_url":"http://127.0.0.1:7000/solr"}
[junit4:junit4]   2> 5427 T86 oascc.ZkStateReader$2.process A cluster state change has occurred - updating... (2)
[junit4:junit4]   2> 5427 T91 oascc.ZkStateReader$2.process A cluster state change has occurred - updating... (2)
[junit4:junit4]   2> 5887 T75 oass.OpenExchangeRatesOrgProvider.init Initialized with rates=open-exchange-rates.json, refreshInterval=1440.
[junit4:junit4]   2> 5903 T75 oass.IndexSchema.readSchema default search field in schema is text
[junit4:junit4]   2> 5907 T75 oass.IndexSchema.readSchema unique key field: id
[junit4:junit4]   2> 5933 T75 oass.FileExchangeRateProvider.reload Reloading exchange rates from file currency.xml
[junit4:junit4]   2> 5940 T75 oass.FileExchangeRateProvider.reload Reloading exchange rates from file currency.xml
[junit4:junit4]   2> 5949 T75 oass.OpenExchangeRatesOrgProvider.reload Reloading exchange rates from open-exchange-rates.json
[junit4:junit4]   2> 5950 T75 oass.OpenExchangeRatesOrgProvider.reload Reloading exchange rates from open-exchange-rates.json
[junit4:junit4]   2> 5952 T75 oasc.SolrCore.<init> [collection1] Opening new SolrCore at /usr/home/hudson/hudson-slave/workspace/Lucene-Solr-Tests-4.x-java7/solr/build/solr-core/test-files/solr/collection1/, dataDir=/usr/home/hudson/hudson-slave/workspace/Lucene-Solr-Tests-4.x-java7/solr/build/solr-core/test/J0/./solrtest-LeaderElectionIntegrationTest-1351906080841/data_7001/
[junit4:junit4]   2> 5953 T75 oasc.JmxMonitoredMap.<init> JMX monitoring is enabled. Adding Solr mbeans to JMX Server: com.sun.jmx.mbeanserver.JmxMBeanServer@54db16d7
[junit4:junit4]   2> 5954 T75 oasc.SolrCore.getNewIndexDir New index directory detected: old=null new=/usr/home/hudson/hudson-slave/workspace/Lucene-Solr-Tests-4.x-java7/solr/build/solr-core/test/J0/./solrtest-LeaderElectionIntegrationTest-1351906080841/data_7001/index/
[junit4:junit4]   2> 5955 T75 oasc.SolrCore.initIndex WARNING [collection1] Solr index directory '/usr/home/hudson/hudson-slave/workspace/Lucene-Solr-Tests-4.x-java7/solr/build/solr-core/test/J0/./solrtest-LeaderElectionIntegrationTest-1351906080841/data_7001/index' doesn't exist. Creating new index...
[junit4:junit4]   2> 5956 T75 oasc.CachingDirectoryFactory.get return new directory for /usr/home/hudson/hudson-slave/workspace/Lucene-Solr-Tests-4.x-java7/solr/build/solr-core/test/J0/./solrtest-LeaderElectionIntegrationTest-1351906080841/data_7001/index forceNew:false
[junit4:junit4]   2> 5958 T75 oasc.SolrDeletionPolicy.onCommit SolrDeletionPolicy.onCommit: commits:num=1
[junit4:junit4]   2> 		commit{dir=MockDirWrapper(NRTCachingDirectory(org.apache.lucene.store.RAMDirectory@66d9ce6e lockFactory=org.apache.lucene.store.NativeFSLockFactory@245b315a; maxCacheMB=0.923828125 maxMergeSizeMB=0.8994140625)),segFN=segments_1,generation=1,filenames=[segments_1]
[junit4:junit4]   2> 5959 T75 oasc.SolrDeletionPolicy.updateCommits newest commit = 1
[junit4:junit4]   2> 5960 T75 oasc.SolrCore.initWriters created xml: solr.XMLResponseWriter
[junit4:junit4]   2> 5962 T75 oasup.UpdateRequestProcessorChain.init inserting DistributedUpdateProcessorFactory into updateRequestProcessorChain "dedupe"
[junit4:junit4]   2> 5963 T75 oasup.UpdateRequestProcessorChain.init inserting DistributedUpdateProcessorFactory into updateRequestProcessorChain "dedupe-allfields"
[junit4:junit4]   2> 5963 T75 oasup.UpdateRequestProcessorChain.init inserting DistributedUpdateProcessorFactory into updateRequestProcessorChain "stored_sig"
[junit4:junit4]   2> 5964 T75 oasup.UpdateRequestProcessorChain.init inserting DistributedUpdateProcessorFactory into updateRequestProcessorChain "uniq-fields"
[junit4:junit4]   2> 5965 T75 oasup.UpdateRequestProcessorChain.init inserting DistributedUpdateProcessorFactory into updateRequestProcessorChain "distrib-dup-test-chain-implicit"
[junit4:junit4]   2> 5965 T75 oasc.RequestHandlers.initHandlersFromConfig adding lazy requestHandler: solr.ReplicationHandler
[junit4:junit4]   2> 5966 T75 oasc.RequestHandlers.initHandlersFromConfig created /replication: solr.ReplicationHandler
[junit4:junit4]   2> 5966 T75 oasc.RequestHandlers.initHandlersFromConfig created standard: solr.StandardRequestHandler
[junit4:junit4]   2> 5967 T75 oasc.RequestHandlers.initHandlersFromConfig created /get: solr.RealTimeGetHandler
[junit4:junit4]   2> 5968 T75 oasc.RequestHandlers.initHandlersFromConfig created dismax: solr.SearchHandler
[junit4:junit4]   2> 5968 T75 oasc.RequestHandlers.initHandlersFromConfig created mock: org.apache.solr.core.MockQuerySenderListenerReqHandler
[junit4:junit4]   2> 5969 T75 oasc.RequestHandlers.initHandlersFromConfig created /admin/: org.apache.solr.handler.admin.AdminHandlers
[junit4:junit4]   2> 5970 T75 oasc.RequestHandlers.initHandlersFromConfig created defaults: solr.StandardRequestHandler
[junit4:junit4]   2> 5970 T75 oasc.RequestHandlers.initHandlersFromConfig adding lazy requestHandler: solr.StandardRequestHandler
[junit4:junit4]   2> 5971 T75 oasc.RequestHandlers.initHandlersFromConfig created lazy: solr.StandardRequestHandler
[junit4:junit4]   2> 5971 T75 oasc.RequestHandlers.initHandlersFromConfig created /update: solr.UpdateRequestHandler
[junit4:junit4]   2> 5972 T75 oasc.RequestHandlers.initHandlersFromConfig created /terms: org.apache.solr.handler.component.SearchHandler
[junit4:junit4]   2> 5973 T75 oasc.RequestHandlers.initHandlersFromConfig created spellCheckCompRH: org.apache.solr.handler.component.SearchHandler
[junit4:junit4]   2> 5973 T75 oasc.RequestHandlers.initHandlersFromConfig created spellCheckCompRH_Direct: org.apache.solr.handler.component.SearchHandler
[junit4:junit4]   2> 5974 T75 oasc.RequestHandlers.initHandlersFromConfig created spellCheckWithWordbreak: org.apache.solr.handler.component.SearchHandler
[junit4:junit4]   2> 5975 T75 oasc.RequestHandlers.initHandlersFromConfig created spellCheckWithWordbreak_Direct: org.apache.solr.handler.component.SearchHandler
[junit4:junit4]   2> 5975 T75 oasc.RequestHandlers.initHandlersFromConfig created spellCheckCompRH1: org.apache.solr.handler.component.SearchHandler
[junit4:junit4]   2> 5976 T75 oasc.RequestHandlers.initHandlersFromConfig created tvrh: org.apache.solr.handler.component.SearchHandler
[junit4:junit4]   2> 5977 T75 oasc.RequestHandlers.initHandlersFromConfig created /mlt: solr.MoreLikeThisHandler
[junit4:junit4]   2> 5977 T75 oasc.RequestHandlers.initHandlersFromConfig created /debug/dump: solr.DumpRequestHandler
[junit4:junit4]   2> 5990 T75 oashl.XMLLoader.init xsltCacheLifetimeSeconds=60
[junit4:junit4]   2> 5995 T75 oasc.SolrCore.initDeprecatedSupport WARNING solrconfig.xml uses deprecated <admin/gettableFiles>, Please update your config to use the ShowFileRequestHandler.
[junit4:junit4]   2> 5996 T75 oasc.SolrCore.initDeprecatedSupport WARNING adding ShowFileRequestHandler with hidden files: [SCHEMA.XML, OLD_SYNONYMS.TXT, STOPWORDS.TXT, PROTWORDS.TXT, OPEN-EXCHANGE-RATES.JSON, SYNONYMS.TXT, CURRENCY.XML, MAPPING-ISOLATIN1ACCENT.TXT]
[junit4:junit4]   2> 5999 T75 oass.SolrIndexSearcher.<init> Opening Searcher@66a22ed7 main
[junit4:junit4]   2> 5999 T75 oass.SolrIndexSearcher.getIndexDir WARNING WARNING: Directory impl does not support setting indexDir: org.apache.lucene.store.MockDirectoryWrapper
[junit4:junit4]   2> 6000 T75 oasu.CommitTracker.<init> Hard AutoCommit: disabled
[junit4:junit4]   2> 6001 T75 oasu.CommitTracker.<init> Soft AutoCommit: disabled
[junit4:junit4]   2> 6001 T75 oashc.SpellCheckComponent.inform Initializing spell checkers
[junit4:junit4]   2> 6024 T75 oass.DirectSolrSpellChecker.init init: {name=direct,classname=DirectSolrSpellChecker,field=lowerfilt,minQueryLength=3}
[junit4:junit4]   2> 6084 T92 oasc.SolrCore.registerSearcher [collection1] Registered new searcher Searcher@66a22ed7 main{StandardDirectoryReader(segments_1:1)}
[junit4:junit4]   2> 6091 T75 oasc.ZkController.publish numShards not found on descriptor - reading it from system property
[junit4:junit4]   2> 6093 T75 oasc.CoreContainer.register registering core: collection1
[junit4:junit4]   2> 6093 T75 oasc.ZkController.register Register shard - core:collection1 address:http://127.0.0.1:7001/solr shardId:shard1
[junit4:junit4]   2> 6098 T75 oasc.ZkController.register We are http://127.0.0.1:7001/solr/collection1/ and leader is http://127.0.0.1:7000/solr/collection1/
[junit4:junit4]   2> 6098 T75 oasc.ZkController.checkRecovery WARNING Skipping recovery according to sys prop solrcloud.skip.autorecovery
[junit4:junit4]   2> 6099 T75 oasc.ZkController.publish numShards not found on descriptor - reading it from system property
[junit4:junit4]   2> 6101 T75 oascc.ZkStateReader.updateClusterState Updating cloud state from ZooKeeper... 
[junit4:junit4]   2> 6104 T75 oasc.SolrResourceLoader.locateSolrHome JNDI not configured for solr (NoInitialContextEx)
[junit4:junit4]   2> 6104 T75 oasc.SolrResourceLoader.locateSolrHome using system property solr.solr.home: /usr/home/hudson/hudson-slave/workspace/Lucene-Solr-Tests-4.x-java7/solr/build/solr-core/test-files/solr
[junit4:junit4]   2> 6105 T75 oasc.CoreContainer$Initializer.initialize looking for solr.xml: /usr/home/hudson/hudson-slave/workspace/Lucene-Solr-Tests-4.x-java7/solr/build/solr-core/test-files/solr/solr.xml
[junit4:junit4]   2> 6105 T75 oasc.CoreContainer.<init> New CoreContainer 649127729
[junit4:junit4]   2> 6106 T75 oasc.CoreContainer.load Loading CoreContainer using Solr Home: '/usr/home/hudson/hudson-slave/workspace/Lucene-Solr-Tests-4.x-java7/solr/build/solr-core/test-files/solr/'
[junit4:junit4]   2> 6106 T75 oasc.SolrResourceLoader.<init> new SolrResourceLoader for directory: '/usr/home/hudson/hudson-slave/workspace/Lucene-Solr-Tests-4.x-java7/solr/build/solr-core/test-files/solr/'
[junit4:junit4]   2> 6167 T75 oasc.CoreContainer.load Registering Log Listener
[junit4:junit4]   2> 6182 T75 oasc.CoreContainer.initZooKeeper Zookeeper client=127.0.0.1:57157/solr
[junit4:junit4]   2> 6183 T75 oaz.ZooKeeper.<init> Initiating client connection, connectString=127.0.0.1:57157/solr sessionTimeout=3000 watcher=org.apache.solr.common.cloud.ConnectionManager@467746a2
[junit4:junit4]   2> 6184 T93 oaz.ClientCnxn$SendThread.startConnect Opening socket connection to server /127.0.0.1:57157
[junit4:junit4]   2> 6184 T75 oascc.ConnectionManager.waitForConnected Waiting for client to connect to ZooKeeper
[junit4:junit4]   2> 6185 T93 oaz.ClientCnxn$SendThread.primeConnection Socket connection established to localhost/127.0.0.1:57157, initiating session
[junit4:junit4]   2> 6186 T77 oazs.NIOServerCnxn$Factory.run Accepted socket connection from /140.211.11.196:21278
[junit4:junit4]   2> 6186 T77 oazs.NIOServerCnxn.readConnectRequest Client attempting to establish new session at /140.211.11.196:21278
[junit4:junit4]   2> 6188 T79 oazs.NIOServerCnxn.finishSessionInit Established session 0x13ac3e1b9bc0004 with negotiated timeout 3000 for client /140.211.11.196:21278
[junit4:junit4]   2> 6188 T93 oaz.ClientCnxn$SendThread.readConnectResult Session establishment complete on server localhost/127.0.0.1:57157, sessionid = 0x13ac3e1b9bc0004, negotiated timeout = 3000
[junit4:junit4]   2> 6188 T94 oascc.ConnectionManager.process Watcher org.apache.solr.common.cloud.ConnectionManager@467746a2 name:ZooKeeperConnection Watcher:127.0.0.1:57157/solr got event WatchedEvent state:SyncConnected type:None path:null path:null type:None
[junit4:junit4]   2> 6188 T75 oascc.ConnectionManager.waitForConnected Client is connected to ZooKeeper
[junit4:junit4]   2> 6189 T81 oazs.PrepRequestProcessor.pRequest Got user-level KeeperException when processing sessionid:0x13ac3e1b9bc0004 type:create cxid:0x1 zxid:0xfffffffffffffffe txntype:unknown reqpath:n/a Error Path:/solr/overseer Error:KeeperErrorCode = NodeExists for /solr/overseer
[junit4:junit4]   2> 6191 T81 oazs.PrepRequestProcessor.pRequest Got user-level KeeperException when processing sessionid:0x13ac3e1b9bc0004 type:create cxid:0x2 zxid:0xfffffffffffffffe txntype:unknown reqpath:n/a Error Path:/solr/overseer Error:KeeperErrorCode = NodeExists for /solr/overseer
[junit4:junit4]   2> 6200 T75 oasc.ZkController.createEphemeralLiveNode Register node as live in ZooKeeper:/live_nodes/127.0.0.1:7002_solr
[junit4:junit4]   2> 6200 T81 oazs.PrepRequestProcessor.pRequest Got user-level KeeperException when processing sessionid:0x13ac3e1b9bc0004 type:delete cxid:0x4 zxid:0xfffffffffffffffe txntype:unknown reqpath:n/a Error Path:/solr/live_nodes/127.0.0.1:7002_solr Error:KeeperErrorCode = NoNode for /solr/live_nodes/127.0.0.1:7002_solr
[junit4:junit4]   2> 6201 T75 oascc.SolrZkClient.makePath makePath: /live_nodes/127.0.0.1:7002_solr
[junit4:junit4]   2> 6205 T86 oascc.ZkStateReader$3.process Updating live nodes... (3)
[junit4:junit4]   2> 6205 T91 oascc.ZkStateReader$3.process Updating live nodes... (3)
[junit4:junit4]   2> 6206 T75 oashc.HttpShardHandlerFactory.getParameter Setting socketTimeout to: 0
[junit4:junit4]   2> 6207 T75 oashc.HttpShardHandlerFactory.getParameter Setting urlScheme to: http://
[junit4:junit4]   2> 6207 T75 oashc.HttpShardHandlerFactory.getParameter Setting connTimeout to: 0
[junit4:junit4]   2> 6207 T75 oashc.HttpShardHandlerFactory.getParameter Setting maxConnectionsPerHost to: 20
[junit4:junit4]   2> 6208 T75 oashc.HttpShardHandlerFactory.getParameter Setting corePoolSize to: 0
[junit4:junit4]   2> 6208 T75 oashc.HttpShardHandlerFactory.getParameter Setting maximumPoolSize to: 2147483647
[junit4:junit4]   2> 6208 T75 oashc.HttpShardHandlerFactory.getParameter Setting maxThreadIdleTime to: 5
[junit4:junit4]   2> 6209 T75 oashc.HttpShardHandlerFactory.getParameter Setting sizeOfQueue to: -1
[junit4:junit4]   2> 6209 T75 oashc.HttpShardHandlerFactory.getParameter Setting fairnessPolicy to: false
[junit4:junit4]   2> 6210 T75 oascsi.HttpClientUtil.createClient Creating new http client, config:maxConnectionsPerHost=20&maxConnections=10000&socketTimeout=0&connTimeout=0&retry=false
[junit4:junit4]   2> 6232 T75 oascc.ZkStateReader.createClusterStateWatchersAndUpdate Updating cluster state from ZooKeeper... 
[junit4:junit4]   2> 6247 T75 oasc.CoreContainer.create Creating SolrCore 'collection1' using instanceDir: /usr/home/hudson/hudson-slave/workspace/Lucene-Solr-Tests-4.x-java7/solr/build/solr-core/test-files/solr/collection1
[junit4:junit4]   2> 6248 T75 oasc.ZkController.createCollectionZkNode Check for collection zkNode:collection1
[junit4:junit4]   2> 6249 T75 oasc.ZkController.createCollectionZkNode Collection zkNode exists
[junit4:junit4]   2> 6249 T75 oasc.ZkController.readConfigName Load collection config from:/collections/collection1
[junit4:junit4]   2> 6251 T75 oasc.SolrResourceLoader.<init> new SolrResourceLoader for directory: '/usr/home/hudson/hudson-slave/workspace/Lucene-Solr-Tests-4.x-java7/solr/build/solr-core/test-files/solr/collection1/'
[junit4:junit4]   2> 6253 T75 oasc.SolrResourceLoader.replaceClassLoader Adding 'file:/usr/home/hudson/hudson-slave/workspace/Lucene-Solr-Tests-4.x-java7/solr/build/solr-core/test-files/solr/collection1/lib/classes/' to classloader
[junit4:junit4]   2> 6253 T75 oasc.SolrResourceLoader.replaceClassLoader Adding 'file:/usr/home/hudson/hudson-slave/workspace/Lucene-Solr-Tests-4.x-java7/solr/build/solr-core/test-files/solr/collection1/lib/README' to classloader
[junit4:junit4]   2> 6314 T75 oasc.SolrConfig.<init> Using Lucene MatchVersion: LUCENE_41
[junit4:junit4]   2> 6393 T75 oasc.SolrConfig.<init> Loaded SolrConfig: solrconfig.xml
[junit4:junit4]   2> 6395 T75 oass.IndexSchema.readSchema Reading Solr Schema
[junit4:junit4]   2> 6415 T75 oass.IndexSchema.readSchema Schema name=test
[junit4:junit4]   2> 6448 T87 oascc.ZkStateReader.updateClusterState Updating cloud state from ZooKeeper... 
[junit4:junit4]   2> 6449 T87 oasc.Overseer$ClusterStateUpdater.updateState Update state numShards=null message={
[junit4:junit4]   2> 	  "operation":"state",
[junit4:junit4]   2> 	  "numShards":null,
[junit4:junit4]   2> 	  "shard":"shard1",
[junit4:junit4]   2> 	  "roles":null,
[junit4:junit4]   2> 	  "state":"down",
[junit4:junit4]   2> 	  "core":"collection1",
[junit4:junit4]   2> 	  "collection":"collection1",
[junit4:junit4]   2> 	  "node_name":"127.0.0.1:7001_solr",
[junit4:junit4]   2> 	  "base_url":"http://127.0.0.1:7001/solr"}
[junit4:junit4]   2> 6482 T87 oasc.Overseer$ClusterStateUpdater.updateState Update state numShards=null message={
[junit4:junit4]   2> 	  "operation":"state",
[junit4:junit4]   2> 	  "numShards":null,
[junit4:junit4]   2> 	  "shard":"shard1",
[junit4:junit4]   2> 	  "roles":null,
[junit4:junit4]   2> 	  "state":"active",
[junit4:junit4]   2> 	  "core":"collection1",
[junit4:junit4]   2> 	  "collection":"collection1",
[junit4:junit4]   2> 	  "node_name":"127.0.0.1:7001_solr",
[junit4:junit4]   2> 	  "base_url":"http://127.0.0.1:7001/solr"}
[junit4:junit4]   2> 6494 T86 oascc.ZkStateReader$2.process A cluster state change has occurred - updating... (3)
[junit4:junit4]   2> 6494 T91 oascc.ZkStateReader$2.process A cluster state change has occurred - updating... (3)
[junit4:junit4]   2> 6494 T94 oascc.ZkStateReader$2.process A cluster state change has occurred - updating... (3)
[junit4:junit4]   2> 7037 T75 oass.OpenExchangeRatesOrgProvider.init Initialized with rates=open-exchange-rates.json, refreshInterval=1440.
[junit4:junit4]   2> 7065 T75 oass.IndexSchema.readSchema default search field in schema is text
[junit4:junit4]   2> 7070 T75 oass.IndexSchema.readSchema unique key field: id
[junit4:junit4]   2> 7102 T75 oass.FileExchangeRateProvider.reload Reloading exchange rates from file currency.xml
[junit4:junit4]   2> 7108 T75 oass.FileExchangeRateProvider.reload Reloading exchange rates from file currency.xml
[junit4:junit4]   2> 7114 T75 oass.OpenExchangeRatesOrgProvider.reload Reloading exchange rates from open-exchange-rates.json
[junit4:junit4]   2> 7116 T75 oass.OpenExchangeRatesOrgProvider.reload Reloading exchange rates from open-exchange-rates.json
[junit4:junit4]   2> 7118 T75 oasc.SolrCore.<init> [collection1] Opening new SolrCore at /usr/home/hudson/hudson-slave/workspace/Lucene-Solr-Tests-4.x-java7/solr/build/solr-core/test-files/solr/collection1/, dataDir=/usr/home/hudson/hudson-slave/workspace/Lucene-Solr-Tests-4.x-java7/solr/build/solr-core/test/J0/./solrtest-LeaderElectionIntegrationTest-1351906080841/data_7002/
[junit4:junit4]   2> 7118 T75 oasc.JmxMonitoredMap.<init> JMX monitoring is enabled. Adding Solr mbeans to JMX Server: com.sun.jmx.mbeanserver.JmxMBeanServer@54db16d7
[junit4:junit4]   2> 7120 T75 oasc.SolrCore.getNewIndexDir New index directory detected: old=null new=/usr/home/hudson/hudson-slave/workspace/Lucene-Solr-Tests-4.x-java7/solr/build/solr-core/test/J0/./solrtest-LeaderElectionIntegrationTest-1351906080841/data_7002/index/
[junit4:junit4]   2> 7120 T75 oasc.SolrCore.initIndex WARNING [collection1] Solr index directory '/usr/home/hudson/hudson-slave/workspace/Lucene-Solr-Tests-4.x-java7/solr/build/solr-core/test/J0/./solrtest-LeaderElectionIntegrationTest-1351906080841/data_7002/index' doesn't exist. Creating new index...
[junit4:junit4]   2> 7121 T75 oasc.CachingDirectoryFactory.get return new directory for /usr/home/hudson/hudson-slave/workspace/Lucene-Solr-Tests-4.x-java7/solr/build/solr-core/test/J0/./solrtest-LeaderElectionIntegrationTest-1351906080841/data_7002/index forceNew:false
[junit4:junit4]   2> 7123 T75 oasc.SolrDeletionPolicy.onCommit SolrDeletionPolicy.onCommit: commits:num=1
[junit4:junit4]   2> 		commit{dir=BaseDirectoryWrapper(org.apache.lucene.store.RAMDirectory@14dc1f90 lockFactory=org.apache.lucene.store.NativeFSLockFactory@677ec421),segFN=segments_1,generation=1,filenames=[segments_1]
[junit4:junit4]   2> 7124 T75 oasc.SolrDeletionPolicy.updateCommits newest commit = 1
[junit4:junit4]   2> 7124 T75 oasc.SolrCore.initWriters created xml: solr.XMLResponseWriter
[junit4:junit4]   2> 7128 T75 oasup.UpdateRequestProcessorChain.init inserting DistributedUpdateProcessorFactory into updateRequestProcessorChain "dedupe"
[junit4:junit4]   2> 7128 T75 oasup.UpdateRequestProcessorChain.init inserting DistributedUpdateProcessorFactory into updateRequestProcessorChain "dedupe-allfields"
[junit4:junit4]   2> 7129 T75 oasup.UpdateRequestProcessorChain.init inserting DistributedUpdateProcessorFactory into updateRequestProcessorChain "stored_sig"
[junit4:junit4]   2> 7129 T75 oasup.UpdateRequestProcessorChain.init inserting DistributedUpdateProcessorFactory into updateRequestProcessorChain "uniq-fields"
[junit4:junit4]   2> 7130 T75 oasup.UpdateRequestProcessorChain.init inserting DistributedUpdateProcessorFactory into updateRequestProcessorChain "distrib-dup-test-chain-implicit"
[junit4:junit4]   2> 7131 T75 oasc.RequestHandlers.initHandlersFromConfig adding lazy requestHandler: solr.ReplicationHandler
[junit4:junit4]   2> 7131 T75 oasc.RequestHandlers.initHandlersFromConfig created /replication: solr.ReplicationHandler
[junit4:junit4]   2> 7132 T75 oasc.RequestHandlers.initHandlersFromConfig created standard: solr.StandardRequestHandler
[junit4:junit4]   2> 7133 T75 oasc.RequestHandlers.initHandlersFromConfig created /get: solr.RealTimeGetHandler
[junit4:junit4]   2> 7134 T75 oasc.RequestHandlers.initHandlersFromConfig created dismax: solr.SearchHandler
[junit4:junit4]   2> 7134 T75 oasc.RequestHandlers.initHandlersFromConfig created mock: org.apache.solr.core.MockQuerySenderListenerReqHandler
[junit4:junit4]   2> 7135 T75 oasc.RequestHandlers.initHandlersFromConfig created /admin/: org.apache.solr.handler.admin.AdminHandlers
[junit4:junit4]   2> 7136 T75 oasc.RequestHandlers.initHandlersFromConfig created defaults: solr.StandardRequestHandler
[junit4:junit4]   2> 7136 T75 oasc.RequestHandlers.initHandlersFromConfig adding lazy requestHandler: solr.StandardRequestHandler
[junit4:junit4]   2> 7137 T75 oasc.RequestHandlers.initHandlersFromConfig created lazy: solr.StandardRequestHandler
[junit4:junit4]   2> 7138 T75 oasc.RequestHandlers.initHandlersFromConfig created /update: solr.UpdateRequestHandler
[junit4:junit4]   2> 7138 T75 oasc.RequestHandlers.initHandlersFromConfig created /terms: org.apache.solr.handler.component.SearchHandler
[junit4:junit4]   2> 7139 T75 oasc.RequestHandlers.initHandlersFromConfig created spellCheckCompRH: org.apache.solr.handler.component.SearchHandler
[junit4:junit4]   2> 7140 T75 oasc.RequestHandlers.initHandlersFromConfig created spellCheckCompRH_Direct: org.apache.solr.handler.component.SearchHandler
[junit4:junit4]   2> 7140 T75 oasc.RequestHandlers.initHandlersFromConfig created spellCheckWithWordbreak: org.apache.solr.handler.component.SearchHandler
[junit4:junit4]   2> 7141 T75 oasc.RequestHandlers.initHandlersFromConfig created spellCheckWithWordbreak_Direct: org.apache.solr.handler.component.SearchHandler
[junit4:junit4]   2> 7142 T75 oasc.RequestHandlers.initHandlersFromConfig created spellCheckCompRH1: org.apache.solr.handler.component.SearchHandler
[junit4:junit4]   2> 7143 T75 oasc.RequestHandlers.initHandlersFromConfig created tvrh: org.apache.solr.handler.component.SearchHandler
[junit4:junit4]   2> 7143 T75 oasc.RequestHandlers.initHandlersFromConfig created /mlt: solr.MoreLikeThisHandler
[junit4:junit4]   2> 7144 T75 oasc.RequestHandlers.initHandlersFromConfig created /debug/dump: solr.DumpRequestHandler
[junit4:junit4]   2> 7157 T75 oashl.XMLLoader.init xsltCacheLifetimeSeconds=60
[junit4:junit4]   2> 7162 T75 oasc.SolrCore.initDeprecatedSupport WARNING solrconfig.xml uses deprecated <admin/gettableFiles>, Please update your config to use the ShowFileRequestHandler.
[junit4:junit4]   2> 7163 T75 oasc.SolrCore.initDeprecatedSupport WARNING adding ShowFileRequestHandler with hidden files: [SCHEMA.XML, OLD_SYNONYMS.TXT, STOPWORDS.TXT, PROTWORDS.TXT, OPEN-EXCHANGE-RATES.JSON, SYNONYMS.TXT, CURRENCY.XML, MAPPING-ISOLATIN1ACCENT.TXT]
[junit4:junit4]   2> 7166 T75 oass.SolrIndexSearcher.<init> Opening Searcher@2cb056c8 main
[junit4:junit4]   2> 7166 T75 oass.SolrIndexSearcher.getIndexDir WARNING WARNING: Directory impl does not support setting indexDir: org.apache.lucene.store.BaseDirectoryWrapper
[junit4:junit4]   2> 7167 T75 oasu.CommitTracker.<init> Hard AutoCommit: disabled
[junit4:junit4]   2> 7167 T75 oasu.CommitTracker.<init> Soft AutoCommit: disabled
[junit4:junit4]   2> 7168 T75 oashc.SpellCheckComponent.inform Initializing spell checkers
[junit4:junit4]   2> 7202 T75 oass.DirectSolrSpellChecker.init init: {name=direct,classname=DirectSolrSpellChecker,field=lowerfilt,minQueryLength=3}
[junit4:junit4]   2> 7262 T95 oasc.SolrCore.registerSearcher [collection1] Registered new searcher Searcher@2cb056c8 main{StandardDirectoryReader(segments_1:1)}
[junit4:junit4]   2> 7269 T75 oasc.ZkController.publish numShards not found on descriptor - reading it from system property
[junit4:junit4]   2> 7272 T75 oasc.CoreContainer.register registering core: collection1
[junit4:junit4]   2> 7272 T75 oasc.ZkController.register Register shard - core:collection1 address:http://127.0.0.1:7002/solr shardId:shard1
[junit4:junit4]   2> 7276 T75 oasc.ZkController.register We are http://127.0.0.1:7002/solr/collection1/ and leader is http://127.0.0.1:7000/solr/collection1/
[junit4:junit4]   2> 7277 T75 oasc.ZkController.checkRecovery WARNING Skipping recovery according to sys prop solrcloud.skip.autorecovery
[junit4:junit4]   2> 7277 T75 oasc.ZkController.publish numShards not found on descriptor - reading it from system property
[junit4:junit4]   2> 7280 T75 oascc.ZkStateReader.updateClusterState Updating cloud state from ZooKeeper... 
[junit4:junit4]   2> 7283 T75 oasc.SolrResourceLoader.locateSolrHome JNDI not configured for solr (NoInitialContextEx)
[junit4:junit4]   2> 7283 T75 oasc.SolrResourceLoader.locateSolrHome using system property solr.solr.home: /usr/home/hudson/hudson-slave/workspace/Lucene-Solr-Tests-4.x-java7/solr/build/solr-core/test-files/solr
[junit4:junit4]   2> 7284 T75 oasc.CoreContainer$Initializer.initialize looking for solr.xml: /usr/home/hudson/hudson-slave/workspace/Lucene-Solr-Tests-4.x-java7/solr/build/solr-core/test-files/solr/solr.xml
[junit4:junit4]   2> 7284 T75 oasc.CoreContainer.<init> New CoreContainer 1379550442
[junit4:junit4]   2> 7285 T75 oasc.CoreContainer.load Loading CoreContainer using Solr Home: '/usr/home/hudson/hudson-slave/workspace/Lucene-Solr-Tests-4.x-java7/solr/build/solr-core/test-files/solr/'
[junit4:junit4]   2> 7285 T75 oasc.SolrResourceLoader.<init> new SolrResourceLoader for directory: '/usr/home/hudson/hudson-slave/workspace/Lucene-Solr-Tests-4.x-java7/solr/build/solr-core/test-files/solr/'
[junit4:junit4]   2> 7347 T75 oasc.CoreContainer.load Registering Log Listener
[junit4:junit4]   2> 7363 T75 oasc.CoreContainer.initZooKeeper Zookeeper client=127.0.0.1:57157/solr
[junit4:junit4]   2> 7363 T75 oaz.ZooKeeper.<init> Initiating client connection, connectString=127.0.0.1:57157/solr sessionTimeout=3000 watcher=org.apache.solr.common.cloud.ConnectionManager@6be7b7cd
[junit4:junit4]   2> 7364 T96 oaz.ClientCnxn$SendThread.startConnect Opening socket connection to server /127.0.0.1:57157
[junit4:junit4]   2> 7364 T75 oascc.ConnectionManager.waitForConnected Waiting for client to connect to ZooKeeper
[junit4:junit4]   2> 7366 T96 oaz.ClientCnxn$SendThread.primeConnection Socket connection established to localhost/127.0.0.1:57157, initiating session
[junit4:junit4]   2> 7366 T77 oazs.NIOServerCnxn$Factory.run Accepted socket connection from /140.211.11.196:35865
[junit4:junit4]   2> 7366 T77 oazs.NIOServerCnxn.readConnectRequest Client attempting to establish new session at /140.211.11.196:35865
[junit4:junit4]   2> 7368 T79 oazs.NIOServerCnxn.finishSessionInit Established session 0x13ac3e1b9bc0005 with negotiated timeout 3000 for client /140.211.11.196:35865
[junit4:junit4]   2> 7368 T96 oaz.ClientCnxn$SendThread.readConnectResult Session establishment complete on server localhost/127.0.0.1:57157, sessionid = 0x13ac3e1b9bc0005, negotiated timeout = 3000
[junit4:junit4]   2> 7369 T97 oascc.ConnectionManager.process Watcher org.apache.solr.common.cloud.ConnectionManager@6be7b7cd name:ZooKeeperConnection Watcher:127.0.0.1:57157/solr got event WatchedEvent state:SyncConnected type:None path:null path:null type:None
[junit4:junit4]   2> 7369 T75 oascc.ConnectionManager.waitForConnected Client is connected to ZooKeeper
[junit4:junit4]   2> 7370 T81 oazs.PrepRequestProcessor.pRequest Got user-level KeeperException when processing sessionid:0x13ac3e1b9bc0005 type:create cxid:0x1 zxid:0xfffffffffffffffe txntype:unknown reqpath:n/a Error Path:/solr/overseer Error:KeeperErrorCode = NodeExists for /solr/overseer
[junit4:junit4]   2> 7371 T81 oazs.PrepRequestProcessor.pRequest Got user-level KeeperException when processing sessionid:0x13ac3e1b9bc0005 type:create cxid:0x2 zxid:0xfffffffffffffffe txntype:unknown reqpath:n/a Error Path:/solr/overseer Error:KeeperErrorCode = NodeExists for /solr/overseer
[junit4:junit4]   2> 7373 T75 oasc.ZkController.createEphemeralLiveNode Register node as live in ZooKeeper:/live_nodes/127.0.0.1:7003_solr
[junit4:junit4]   2> 7373 T81 oazs.PrepRequestProcessor.pRequest Got user-level KeeperException when processing sessionid:0x13ac3e1b9bc0005 type:delete cxid:0x4 zxid:0xfffffffffffffffe txntype:unknown reqpath:n/a Error Path:/solr/live_nodes/127.0.0.1:7003_solr Error:KeeperErrorCode = NoNode for /solr/live_nodes/127.0.0.1:7003_solr
[junit4:junit4]   2> 7382 T75 oascc.SolrZkClient.makePath makePath: /live_nodes/127.0.0.1:7003_solr
[junit4:junit4]   2> 7385 T86 oascc.ZkStateReader$3.process Updating live nodes... (4)
[junit4:junit4]   2> 7385 T91 oascc.ZkStateReader$3.process Updating live nodes... (4)
[junit4:junit4]   2> 7385 T94 oascc.ZkStateReader$3.process Updating live nodes... (4)
[junit4:junit4]   2> 7386 T75 oashc.HttpShardHandlerFactory.getParameter Setting socketTimeout to: 0
[junit4:junit4]   2> 7386 T75 oashc.HttpShardHandlerFactory.getParameter Setting urlScheme to: http://
[junit4:junit4]   2> 7387 T75 oashc.HttpShardHandlerFactory.getParameter Setting connTimeout to: 0
[junit4:junit4]   2> 7387 T75 oashc.HttpShardHandlerFactory.getParameter Setting maxConnectionsPerHost to: 20
[junit4:junit4]   2> 7387 T75 oashc.HttpShardHandlerFactory.getParameter Setting corePoolSize to: 0
[junit4:junit4]   2> 7388 T75 oashc.HttpShardHandlerFactory.getParameter Setting maximumPoolSize to: 2147483647
[junit4:junit4]   2> 7388 T75 oashc.HttpShardHandlerFactory.getParameter Setting maxThreadIdleTime to: 5
[junit4:junit4]   2> 7388 T75 oashc.HttpShardHandlerFactory.getParameter Setting sizeOfQueue to: -1
[junit4:junit4]   2> 7389 T75 oashc.HttpShardHandlerFactory.getParameter Setting fairnessPolicy to: false
[junit4:junit4]   2> 7389 T75 oascsi.HttpClientUtil.createClient Creating new http client, config:maxConnectionsPerHost=20&maxConnections=10000&socketTimeout=0&connTimeout=0&retry=false
[junit4:junit4]   2> 7411 T75 oascc.ZkStateReader.createClusterStateWatchersAndUpdate Updating cluster state from ZooKeeper... 
[junit4:junit4]   2> 7418 T75 oasc.CoreContainer.create Creating SolrCore 'collection1' using instanceDir: /usr/home/hudson/hudson-slave/workspace/Lucene-Solr-Tests-4.x-java7/solr/build/solr-core/test-files/solr/collection1
[junit4:junit4]   2> 7418 T75 oasc.ZkController.createCollectionZkNode Check for collection zkNode:collection1
[junit4:junit4]   2> 7419 T75 oasc.ZkController.createCollectionZkNode Collection zkNode exists
[junit4:junit4]   2> 7420 T75 oasc.ZkController.readConfigName Load collection config from:/collections/collection1
[junit4:junit4]   2> 7421 T75 oasc.SolrResourceLoader.<init> new SolrResourceLoader for directory: '/usr/home/hudson/hudson-slave/workspace/Lucene-Solr-Tests-4.x-java7/solr/build/solr-core/test-files/solr/collection1/'
[junit4:junit4]   2> 7423 T75 oasc.SolrResourceLoader.replaceClassLoader Adding 'file:/usr/home/hudson/hudson-slave/workspace/Lucene-Solr-Tests-4.x-java7/solr/build/solr-core/test-files/solr/collection1/lib/classes/' to classloader
[junit4:junit4]   2> 7424 T75 oasc.SolrResourceLoader.replaceClassLoader Adding 'file:/usr/home/hudson/hudson-slave/workspace/Lucene-Solr-Tests-4.x-java7/solr/build/solr-core/test-files/solr/collection1/lib/README' to classloader
[junit4:junit4]   2> 7480 T75 oasc.SolrConfig.<init> Using Lucene MatchVersion: LUCENE_41
[junit4:junit4]   2> 7513 T87 oascc.ZkStateReader.updateClusterState Updating cloud state from ZooKeeper... 
[junit4:junit4]   2> 7514 T87 oasc.Overseer$ClusterStateUpdater.updateState Update state numShards=null message={
[junit4:junit4]   2> 	  "operation":"state",
[junit4:junit4]   2> 	  "numShards":null,
[junit4:junit4]   2> 	  "shard":"shard1",
[junit4:junit4]   2> 	  "roles":null,
[junit4:junit4]   2> 	  "state":"down",
[junit4:junit4]   2> 	  "core":"collection1",
[junit4:junit4]   2> 	  "collection":"collection1",
[junit4:junit4]   2> 	  "node_name":"127.0.0.1:7002_solr",
[junit4:junit4]   2> 	  "base_url":"http://127.0.0.1:7002/solr"}
[junit4:junit4]   2> 7521 T87 oasc.Overseer$ClusterStateUpdater.updateState Update state numShards=null message={
[junit4:junit4]   2> 	  "operation":"state",
[junit4:junit4]   2> 	  "numShards":null,
[junit4:junit4]   2> 	  "shard":"shard1",
[junit4:junit4]   2> 	  "roles":null,
[junit4:junit4]   2> 	  "state":"active",
[junit4:junit4]   2> 	  "core":"collection1",
[junit4:junit4]   2> 	  "collection":"collection1",
[junit4:junit4]   2> 	  "node_name":"127.0.0.1:7002_solr",
[junit4:junit4]   2> 	  "base_url":"http://127.0.0.1:7002/solr"}
[junit4:junit4]   2> 7534 T86 oascc.ZkStateReader$2.process A cluster state change has occurred - updating... (4)
[junit4:junit4]   2> 7534 T94 oascc.ZkStateReader$2.process A cluster state change has occurred - updating... (4)
[junit4:junit4]   2> 7534 T91 oascc.ZkStateReader$2.process A cluster state change has occurred - updating... (4)
[junit4:junit4]   2> 7534 T97 oascc.ZkStateReader$2.process A cluster state change has occurred - updating... (4)
[junit4:junit4]   2> 7552 T75 oasc.SolrConfig.<init> Loaded SolrConfig: solrconfig.xml
[junit4:junit4]   2> 7554 T75 oass.IndexSchema.readSchema Reading Solr Schema
[junit4:junit4]   2> 7570 T75 oass.IndexSchema.readSchema Schema name=test
[junit4:junit4]   2> 8182 T75 oass.OpenExchangeRatesOrgProvider.init Initialized with rates=open-exchange-rates.json, refreshInterval=1440.
[junit4:junit4]   2> 8197 T75 oass.IndexSchema.readSchema default search field in schema is text
[junit4:junit4]   2> 8201 T75 oass.IndexSchema.readSchema unique key field: id
[junit4:junit4]   2> 8226 T75 oass.FileExchangeRateProvider.reload Reloading exchange rates from file currency.xml
[junit4:junit4]   2> 8232 T75 oass.FileExchangeRateProvider.reload Reloading exchange rates from file currency.xml
[junit4:junit4]   2> 8237 T75 oass.OpenExchangeRatesOrgProvider.reload Reloading exchange rates from open-exchange-rates.json
[junit4:junit4]   2> 8239 T75 oass.OpenExchangeRatesOrgProvider.reload Reloading exchange rates from open-exchange-rates.json
[junit4:junit4]   2> 8241 T75 oasc.SolrCore.<init> [collection1] Opening new SolrCore at /usr/home/hudson/hudson-slave/workspace/Lucene-Solr-Tests-4.x-java7/solr/build/solr-core/test-files/solr/collection1/, dataDir=/usr/home/hudson/hudson-slave/workspace/Lucene-Solr-Tests-4.x-java7/solr/build/solr-core/test/J0/./solrtest-LeaderElectionIntegrationTest-1351906080841/data_7003/
[junit4:junit4]   2> 8241 T75 oasc.JmxMonitoredMap.<init> JMX monitoring is enabled. Adding Solr mbeans to JMX Server: com.sun.jmx.mbeanserver.JmxMBeanServer@54db16d7
[junit4:junit4]   2> 8242 T75 oasc.SolrCore.getNewIndexDir New index directory detected: old=null new=/usr/home/hudson/hudson-slave/workspace/Lucene-Solr-Tests-4.x-java7/solr/build/solr-core/test/J0/./solrtest-LeaderElectionIntegrationTest-1351906080841/data_7003/index/
[junit4:junit4]   2> 8243 T75 oasc.SolrCore.initIndex WARNING [collection1] Solr index directory '/usr/home/hudson/hudson-slave/workspace/Lucene-Solr-Tests-4.x-java7/solr/build/solr-core/test/J0/./solrtest-LeaderElectionIntegrationTest-1351906080841/data_7003/index' doesn't exist. Creating new index...
[junit4:junit4]   2> 8244 T75 oasc.CachingDirectoryFactory.get return new directory for /usr/home/hudson/hudson-slave/workspace/Lucene-Solr-Tests-4.x-java7/solr/build/solr-core/test/J0/./solrtest-LeaderElectionIntegrationTest-1351906080841/data_7003/index forceNew:false
[junit4:junit4]   2> 8246 T75 oasc.SolrDeletionPolicy.onCommit SolrDeletionPolicy.onCommit: commits:num=1
[junit4:junit4]   2> 		commit{dir=MockDirWrapper(org.apache.lucene.store.RAMDirectory@49fc1d7e lockFactory=org.apache.lucene.store.NativeFSLockFactory@5615a6e0),segFN=segments_1,generation=1,filenames=[segments_1]
[junit4:junit4]   2> 8247 T75 oasc.SolrDeletionPolicy.updateCommits newest commit = 1
[junit4:junit4]   2> 8247 T75 oasc.SolrCore.initWriters created xml: solr.XMLResponseWriter
[junit4:junit4]   2> 8250 T75 oasup.UpdateRequestProcessorChain.init inserting DistributedUpdateProcessorFactory into updateRequestProcessorChain "dedupe"
[junit4:junit4]   2> 8251 T75 oasup.UpdateRequestProcessorChain.init inserting DistributedUpdateProcessorFactory into updateRequestProcessorChain "dedupe-allfields"
[junit4:junit4]   2> 8251 T75 oasup.UpdateRequestProcessorChain.init inserting DistributedUpdateProcessorFactory into updateRequestProcessorChain "stored_sig"
[junit4:junit4]   2> 8251 T75 oasup.UpdateRequestProcessorChain.init inserting DistributedUpdateProcessorFactory into updateRequestProcessorChain "uniq-fields"
[junit4:junit4]   2> 8252 T75 oasup.UpdateRequestProcessorChain.init inserting DistributedUpdateProcessorFactory into updateRequestProcessorChain "distrib-dup-test-chain-implicit"
[junit4:junit4]   2> 8253 T75 oasc.RequestHandlers.initHandlersFromConfig adding lazy requestHandler: solr.ReplicationHandler
[junit4:junit4]   2> 8253 T75 oasc.RequestHandlers.initHandlersFromConfig created /replication: solr.ReplicationHandler
[junit4:junit4]   2> 8254 T75 oasc.RequestHandlers.initHandlersFromConfig created standard: solr.StandardRequestHandler
[junit4:junit4]   2> 8255 T75 oasc.RequestHandlers.initHandlersFromConfig created /get: solr.RealTimeGetHandler
[junit4:junit4]   2> 8255 T75 oasc.RequestHandlers.initHandlersFromConfig created dismax: solr.SearchHandler
[junit4:junit4]   2> 8256 T75 oasc.RequestHandlers.initHandlersFromConfig created mock: org.apache.solr.core.MockQuerySenderListenerReqHandler
[junit4:junit4]   2> 8257 T75 oasc.RequestHandlers.initHandlersFromConfig created /admin/: org.apache.solr.handler.admin.AdminHandlers
[junit4:junit4]   2> 8257 T75 oasc.RequestHandlers.initHandlersFromConfig created defaults: solr.StandardRequestHandler
[junit4:junit4]   2> 8258 T75 oasc.RequestHandlers.initHandlersFromConfig adding lazy requestHandler: solr.StandardRequestHandler
[junit4:junit4]   2> 8258 T75 oasc.RequestHandlers.initHandlersFromConfig created lazy: solr.StandardRequestHandler
[junit4:junit4]   2> 8259 T75 oasc.RequestHandlers.initHandlersFromConfig created /update: solr.UpdateRequestHandler
[junit4:junit4]   2> 8259 T75 oasc.RequestHandlers.initHandlersFromConfig created /terms: org.apache.solr.handler.component.SearchHandler
[junit4:junit4]   2> 8260 T75 oasc.RequestHandlers.initHandlersFromConfig created spellCheckCompRH: org.apache.solr.handler.component.SearchHandler
[junit4:junit4]   2> 8261 T75 oasc.RequestHandlers.initHandlersFromConfig created spellCheckCompRH_Direct: org.apache.solr.handler.component.SearchHandler
[junit4:junit4]   2> 8261 T75 oasc.RequestHandlers.initHandlersFromConfig created spellCheckWithWordbreak: org.apache.solr.handler.component.SearchHandler
[junit4:junit4]   2> 8262 T75 oasc.RequestHandlers.initHandlersFromConfig created spellCheckWithWordbreak_Direct: org.apache.solr.handler.component.SearchHandler
[junit4:junit4]   2> 8263 T75 oasc.RequestHandlers.initHandlersFromConfig created spellCheckCompRH1: org.apache.solr.handler.component.SearchHandler
[junit4:junit4]   2> 8263 T75 oasc.RequestHandlers.initHandlersFromConfig created tvrh: org.apache.solr.handler.component.SearchHandler
[junit4:junit4]   2> 8264 T75 oasc.RequestHandlers.initHandlersFromConfig created /mlt: solr.MoreLikeThisHandler
[junit4:junit4]   2> 8265 T75 oasc.RequestHandlers.initHandlersFromConfig created /debug/dump: solr.DumpRequestHandler
[junit4:junit4]   2> 8277 T75 oashl.XMLLoader.init xsltCacheLifetimeSeconds=60
[junit4:junit4]   2> 8281 T75 oasc.SolrCore.initDeprecatedSupport WARNING solrconfig.xml uses deprecated <admin/gettableFiles>, Please update your config to use the ShowFileRequestHandler.
[junit4:junit4]   2> 8283 T75 oasc.SolrCore.initDeprecatedSupport WARNING adding ShowFileRequestHandler with hidden files: [SCHEMA.XML, OLD_SYNONYMS.TXT, STOPWORDS.TXT, PROTWORDS.TXT, OPEN-EXCHANGE-RATES.JSON, SYNONYMS.TXT, CURRENCY.XML, MAPPING-ISOLATIN1ACCENT.TXT]
[junit4:junit4]   2> 8286 T75 oass.SolrIndexSearcher.<init> Opening Searcher@68dd9142 main
[junit4:junit4]   2> 8286 T75 oass.SolrIndexSearcher.getIndexDir WARNING WARNING: Directory impl does not support setting indexDir: org.apache.lucene.store.MockDirectoryWrapper
[junit4:junit4]   2> 8287 T75 oasu.CommitTracker.<init> Hard AutoCommit: disabled
[junit4:junit4]   2> 8287 T75 oasu.CommitTracker.<init> Soft AutoCommit: disabled
[junit4:junit4]   2> 8288 T75 oashc.SpellCheckComponent.inform Initializing spell checkers
[junit4:junit4]   2> 8337 T75 oass.DirectSolrSpellChecker.init init: {name=direct,classname=DirectSolrSpellChecker,field=lowerfilt,minQueryLength=3}
[junit4:junit4]   2> 8492 T98 oasc.SolrCore.registerSearcher [collection1] Registered new searcher Searcher@68dd9142 main{StandardDirectoryReader(segments_1:1)}
[junit4:junit4]   2> 8498 T75 oasc.ZkController.publish numShards not found on descriptor - reading it from system property
[junit4:junit4]   2> 8523 T75 oasc.CoreContainer.register registering core: collection1
[junit4:junit4]   2> 8523 T75 oasc.ZkController.register Register shard - core:collection1 address:http://127.0.0.1:7003/solr shardId:shard1
[junit4:junit4]   2> 8532 T75 oasc.ZkController.register We are http://127.0.0.1:7003/solr/collection1/ and leader is http://127.0.0.1:7000/solr/collection1/
[junit4:junit4]   2> 8532 T75 oasc.ZkController.checkRecovery WARNING Skipping recovery according to sys prop solrcloud.skip.autorecovery
[junit4:junit4]   2> 8533 T75 oasc.ZkController.publish numShards not found on descriptor - reading it from system property
[junit4:junit4]   2> 8555 T75 oascc.ZkStateReader.updateClusterState Updating cloud state from ZooKeeper... 
[junit4:junit4]   2> 8557 T87 oascc.ZkStateReader.updateClusterState Updating cloud state from ZooKeeper... 
[junit4:junit4]   2> 8558 T87 oasc.Overseer$ClusterStateUpdater.updateState Update state numShards=null message={
[junit4:junit4]   2> 	  "operation":"state",
[junit4:junit4]   2> 	  "numShards":null,
[junit4:junit4]   2> 	  "shard":"shard1",
[junit4:junit4]   2> 	  "roles":null,
[junit4:junit4]   2> 	  "state":"down",
[junit4:junit4]   2> 	  "core":"collection1",
[junit4:junit4]   2> 	  "collection":"collection1",
[junit4:junit4]   2> 	  "node_name":"127.0.0.1:7003_solr",
[junit4:junit4]   2> 	  "base_url":"http://127.0.0.1:7003/solr"}
[junit4:junit4]   2> 8559 T75 oasc.SolrResourceLoader.locateSolrHome JNDI not configured for solr (NoInitialContextEx)
[junit4:junit4]   2> 8559 T75 oasc.SolrResourceLoader.locateSolrHome using system property solr.solr.home: /usr/home/hudson/hudson-slave/workspace/Lucene-Solr-Tests-4.x-java7/solr/build/solr-core/test-files/solr
[junit4:junit4]   2> 8560 T75 oasc.CoreContainer$Initializer.initialize looking for solr.xml: /usr/home/hudson/hudson-slave/workspace/Lucene-Solr-Tests-4.x-java7/solr/build/solr-core/test-files/solr/solr.xml
[junit4:junit4]   2> 8560 T75 oasc.CoreContainer.<init> New CoreContainer 133269757
[junit4:junit4]   2> 8561 T75 oasc.CoreContainer.load Loading CoreContainer using Solr Home: '/usr/home/hudson/hudson-slave/workspace/Lucene-Solr-Tests-4.x-java7/solr/build/solr-core/test-files/solr/'
[junit4:junit4]   2> 8561 T75 oasc.SolrResourceLoader.<init> new SolrResourceLoader for directory: '/usr/home/hudson/hudson-slave/workspace/Lucene-Solr-Tests-4.x-java7/solr/build/solr-core/test-files/solr/'
[junit4:junit4]   2> 8624 T75 oasc.CoreContainer.load Registering Log Listener
[junit4:junit4]   2> 8627 T87 oasc.Overseer$ClusterStateUpdater.updateState Update state numShards=null message={
[junit4:junit4]   2> 	  "operation":"state",
[junit4:junit4]   2> 	  "numShards":null,
[junit4:junit4]   2> 	  "shard":"shard1",
[junit4:junit4]   2> 	  "roles":null,
[junit4:junit4]   2> 	  "state":"active",
[junit4:junit4]   2> 	  "core":"collection1",
[junit4:junit4]   2> 	  "collection":"collection1",
[junit4:junit4]   2> 	  "node_name":"127.0.0.1:7003_solr",
[junit4:junit4]   2> 	  "base_url":"http://127.0.0.1:7003/solr"}
[junit4:junit4]   2> 8640 T75 oasc.CoreContainer.initZooKeeper Zookeeper client=127.0.0.1:57157/solr
[junit4:junit4]   2> 8641 T75 oaz.ZooKeeper.<init> Initiating client connection, connectString=127.0.0.1:57157/solr sessionTimeout=3000 watcher=org.apache.solr.common.cloud.ConnectionManager@6ceb8bfa
[junit4:junit4]   2> 8642 T99 oaz.ClientCnxn$SendThread.startConnect Opening socket connection to server /127.0.0.1:57157
[junit4:junit4]   2> 8642 T75 oascc.ConnectionManager.waitForConnected Waiting for client to connect to ZooKeeper
[junit4:junit4]   2> 8643 T99 oaz.ClientCnxn$SendThread.primeConnection Socket connection established to localhost/127.0.0.1:57157, initiating session
[junit4:junit4]   2> 8643 T77 oazs.NIOServerCnxn$Factory.run Accepted socket connection from /140.211.11.196:13862
[junit4:junit4]   2> 8644 T77 oazs.NIOServerCnxn.readConnectRequest Client attempting to establish new session at /140.211.11.196:13862
[junit4:junit4]   2> 8664 T86 oascc.ZkStateReader$2.process A cluster state change has occurred - updating... (4)
[junit4:junit4]   2> 8664 T91 oascc.ZkStateReader$2.process A cluster state change has occurred - updating... (4)
[junit4:junit4]   2> 8664 T97 oascc.ZkStateReader$2.process A cluster state change has occurred - updating... (4)
[junit4:junit4]   2> 8664 T94 oascc.ZkStateReader$2.process A cluster state change has occurred - updating... (4)
[junit4:junit4]   2> 8665 T79 oazs.NIOServerCnxn.finishSessionInit Established session 0x13ac3e1b9bc0006 with negotiated timeout 3000 for client /140.211.11.196:13862
[junit4:junit4]   2> 8665 T99 oaz.ClientCnxn$SendThread.readConnectResult Session establishment complete on server localhost/127.0.0.1:57157, sessionid = 0x13ac3e1b9bc0006, negotiated timeout = 3000
[junit4:junit4]   2> 8665 T100 oascc.ConnectionManager.process Watcher org.apache.solr.common.cloud.ConnectionManager@6ceb8bfa name:ZooKeeperConnection Watcher:127.0.0.1:57157/solr got event WatchedEvent state:SyncConnected type:None path:null path:null type:None
[junit4:junit4]   2> 8666 T75 oascc.ConnectionManager.waitForConnected Client is connected to ZooKeeper
[junit4:junit4]   2> 8667 T81 oazs.PrepRequestProcessor.pRequest Got user-level KeeperException when processing sessionid:0x13ac3e1b9bc0006 type:create cxid:0x1 zxid:0xfffffffffffffffe txntype:unknown reqpath:n/a Error Path:/solr/overseer Error:KeeperErrorCode = NodeExists for /solr/overseer
[junit4:junit4]   2> 8668 T81 oazs.PrepRequestProcessor.pRequest Got user-level KeeperException when processing sessionid:0x13ac3e1b9bc0006 type:create cxid:0x2 zxid:0xfffffffffffffffe txntype:unknown reqpath:n/a Error Path:/solr/overseer Error:KeeperErrorCode = NodeExists for /solr/overseer
[junit4:junit4]   2> 8669 T75 oasc.ZkController.createEphemeralLiveNode Register node as live in ZooKeeper:/live_nodes/127.0.0.1:7004_solr
[junit4:junit4]   2> 8670 T81 oazs.PrepRequestProcessor.pRequest Got user-level KeeperException when processing sessionid:0x13ac3e1b9bc0006 type:delete cxid:0x4 zxid:0xfffffffffffffffe txntype:unknown reqpath:n/a Error Path:/solr/live_nodes/127.0.0.1:7004_solr Error:KeeperErrorCode = NoNode for /solr/live_nodes/127.0.0.1:7004_solr
[junit4:junit4]   2> 8671 T75 oascc.SolrZkClient.makePath makePath: /live_nodes/127.0.0.1:7004_solr
[junit4:junit4]   2> 8674 T86 oascc.ZkStateReader$3.process Updating live nodes... (5)
[junit4:junit4]   2> 8674 T97 oascc.ZkStateReader$3.process Updating live nodes... (5)
[junit4:junit4]   2> 8674 T91 oascc.ZkStateReader$3.process Updating live nodes... (5)
[junit4:junit4]   2> 8674 T94 oascc.ZkStateReader$3.process Updating live nodes... (5)
[junit4:junit4]   2> 8675 T75 oashc.HttpShardHandlerFactory.getParameter Setting socketTimeout to: 0
[junit4:junit4]   2> 8676 T75 oashc.HttpShardHandlerFactory.getParameter Setting urlScheme to: http://
[junit4:junit4]   2> 8676 T75 oashc.HttpShardHandlerFactory.getParameter Setting connTimeout to: 0
[junit4:junit4]   2> 8676 T75 oashc.HttpShardHandlerFactory.getParameter Setting maxConnectionsPerHost to: 20
[junit4:junit4]   2> 8677 T75 oashc.HttpShardHandlerFactory.getParameter Setting corePoolSize to: 0
[junit4:junit4]   2> 8677 T75 oashc.HttpShardHandlerFactory.getParameter Setting maximumPoolSize to: 2147483647
[junit4:junit4]   2> 8677 T75 oashc.HttpShardHandlerFactory.getParameter Setting maxThreadIdleTime to: 5
[junit4:junit4]   2> 8678 T75 oashc.HttpShardHandlerFactory.getParameter Setting sizeOfQueue to: -1
[junit4:junit4]   2> 8678 T75 oashc.HttpShardHandlerFactory.getParameter Setting fairnessPolicy to: false
[junit4:junit4]   2> 8678 T75 oascsi.HttpClientUtil.createClient Creating new http client, config:maxConnectionsPerHost=20&maxConnections=10000&socketTimeout=0&connTimeout=0&retry=false
[junit4:junit4]   2> 8699 T75 oascc.ZkStateReader.createClusterStateWatchersAndUpdate Updating cluster state from ZooKeeper... 
[junit4:junit4]   2> 8706 T75 oasc.CoreContainer.create Creating SolrCore 'collection1' using instanceDir: /usr/home/hudson/hudson-slave/workspace/Lucene-Solr-Tests-4.x-java7/solr/build/solr-core/test-files/solr/collection1
[junit4:junit4]   2> 8706 T75 oasc.ZkController.createCollectionZkNode Check for collection zkNode:collection1
[junit4:junit4]   2> 8707 T75 oasc.ZkController.createCollectionZkNode Collection zkNode exists
[junit4:junit4]   2> 8708 T75 oasc.ZkController.readConfigName Load collection config from:/collections/collection1
[junit4:junit4]   2> 8709 T75 oasc.SolrResourceLoader.<init> new SolrResourceLoader for directory: '/usr/home/hudson/hudson-slave/workspace/Lucene-Solr-Tests-4.x-java7/solr/build/solr-core/test-files/solr/collection1/'
[junit4:junit4]   2> 8711 T75 oasc.SolrResourceLoader.replaceClassLoader Adding 'file:/usr/home/hudson/hudson-slave/workspace/Lucene-Solr-Tests-4.x-java7/solr/build/solr-core/test-files/solr/collection1/lib/classes/' to classloader
[junit4:junit4]   2> 8711 T75 oasc.SolrResourceLoader.replaceClassLoader Adding 'file:/usr/home/hudson/hudson-slave/workspace/Lucene-Solr-Tests-4.x-java7/solr/build/solr-core/test-files/solr/collection1/lib/README' to classloader
[junit4:junit4]   2> 8764 T75 oasc.SolrConfig.<init> Using Lucene MatchVersion: LUCENE_41
[junit4:junit4]   2> 8840 T75 oasc.SolrConfig.<init> Loaded SolrConfig: solrconfig.xml
[junit4:junit4]   2> 8842 T75 oass.IndexSchema.readSchema Reading Solr Schema
[junit4:junit4]   2> 8856 T75 oass.IndexSchema.readSchema Schema name=test
[junit4:junit4]   2> 9409 T75 oass.OpenExchangeRatesOrgProvider.init Initialized with rates=open-exchange-rates.json, refreshInterval=1440.
[junit4:junit4]   2> 9422 T75 oass.IndexSchema.readSchema default search field in schema is text
[junit4:junit4]   2> 9425 T75 oass.IndexSchema.readSchema unique key field: id
[junit4:junit4]   2> 9445 T75 oass.FileExchangeRateProvider.reload Reloading exchange rates from file currency.xml
[junit4:junit4]   2> 9450 T75 oass.FileExchangeRateProvider.reload Reloading exchange rates from file currency.xml
[junit4:junit4]   2> 9454 T75 oass.OpenExchangeRatesOrgProvider.reload Reloading exchange rates from open-exchange-rates.json
[junit4:junit4]   2> 9455 T75 oass.OpenExchangeRatesOrgProvider.reload Reloading exchange rates from open-exchange-rates.json
[junit4:junit4]   2> 9457 T75 oasc.SolrCore.<init> [collection1] Opening new SolrCore at /usr/home/hudson/hudson-slave/workspace/Lucene-Solr-Tests-4.x-java7/solr/build/solr-core/test-files/solr/collection1/, dataDir=/usr/home/hudson/hudson-slave/workspace/Lucene-Solr-Tests-4.x-java7/solr/build/solr-core/test/J0/./solrtest-LeaderElectionIntegrationTest-1351906080841/data_7004/
[junit4:junit4]   2> 9457 T75 oasc.JmxMonitoredMap.<init> JMX monitoring is enabled. Adding Solr mbeans to JMX Server: com.sun.jmx.mbeanserver.JmxMBeanServer@54db16d7
[junit4:junit4]   2> 9458 T75 oasc.SolrCore.getNewIndexDir New index directory detected: old=null new=/usr/home/hudson/hudson-slave/workspace/Lucene-Solr-Tests-4.x-java7/solr/build/solr-core/test/J0/./solrtest-LeaderElectionIntegrationTest-1351906080841/data_7004/index/
[junit4:junit4]   2> 9458 T75 oasc.SolrCore.initIndex WARNING [collection1] Solr index directory '/usr/home/hudson/hudson-slave/workspace/Lucene-Solr-Tests-4.x-java7/solr/build/solr-core/test/J0/./solrtest-LeaderElectionIntegrationTest-1351906080841/data_7004/index' doesn't exist. Creating new index...
[junit4:junit4]   2> 9459 T75 oasc.CachingDirectoryFactory.get return new directory for /usr/home/hudson/hudson-slave/workspace/Lucene-Solr-Tests-4.x-java7/solr/build/solr-core/test/J0/./solrtest-LeaderElectionIntegrationTest-1351906080841/data_7004/index forceNew:false
[junit4:junit4]   2> 9461 T75 oasc.SolrDeletionPolicy.onCommit SolrDeletionPolicy.onCommit: commits:num=1
[junit4:junit4]   2> 		commit{dir=MockDirWrapper(org.apache.lucene.store.RAMDirectory@119cb48 lockFactory=org.apache.lucene.store.NativeFSLockFactory@4fabbfd2),segFN=segments_1,generation=1,filenames=[segments_1]
[junit4:junit4]   2> 9461 T75 oasc.SolrDeletionPolicy.updateCommits newest commit = 1
[junit4:junit4]   2> 9461 T75 oasc.SolrCore.initWriters created xml: solr.XMLResponseWriter
[junit4:junit4]   2> 9463 T75 oasup.UpdateRequestProcessorChain.init inserting DistributedUpdateProcessorFactory into updateRequestProcessorChain "dedupe"
[junit4:junit4]   2> 9464 T75 oasup.UpdateRequestProcessorChain.init inserting DistributedUpdateProcessorFactory into updateRequestProcessorChain "dedupe-allfields"
[junit4:junit4]   2> 9464 T75 oasup.UpdateRequestProcessorChain.init inserting DistributedUpdateProcessorFactory into updateRequestProcessorChain "stored_sig"
[junit4:junit4]   2> 9464 T75 oasup.UpdateRequestProcessorChain.init inserting DistributedUpdateProcessorFactory into updateRequestProcessorChain "uniq-fields"
[junit4:junit4]   2> 9465 T75 oasup.UpdateRequestProcessorChain.init inserting DistributedUpdateProcessorFactory into updateRequestProcessorChain "distrib-dup-test-chain-implicit"
[junit4:junit4]   2> 9465 T75 oasc.RequestHandlers.initHandlersFromConfig adding lazy requestHandler: solr.ReplicationHandler
[junit4:junit4]   2> 9466 T75 oasc.RequestHandlers.initHandlersFromConfig created /replication: solr.ReplicationHandler
[junit4:junit4]   2> 9466 T75 oasc.RequestHandlers.initHandlersFromConfig created standard: solr.StandardRequestHandler
[junit4:junit4]   2> 9467 T75 oasc.RequestHandlers.initHandlersFromConfig created /get: solr.RealTimeGetHandler
[junit4:junit4]   2> 9467 T75 oasc.RequestHandlers.initHandlersFromConfig created dismax: solr.SearchHandler
[junit4:junit4]   2> 9468 T75 oasc.RequestHandlers.initHandlersFromConfig created mock: org.apache.solr.core.MockQuerySenderListenerReqHandler
[junit4:junit4]   2> 9468 T75 oasc.RequestHandlers.initHandlersFromConfig created /admin/: org.apache.solr.handler.admin.AdminHandlers
[junit4:junit4]   2> 9469 T75 oasc.RequestHandlers.initHandlersFromConfig created defaults: solr.StandardRequestHandler
[junit4:junit4]   2> 9469 T75 oasc.RequestHandlers.initHandlersFromConfig adding lazy requestHandler: solr.StandardRequestHandler
[junit4:junit4]   2> 9470 T75 oasc.RequestHandlers.initHandlersFromConfig created lazy: solr.StandardRequestHandler
[junit4:junit4]   2> 9470 T75 oasc.RequestHandlers.initHandlersFromConfig created /update: solr.UpdateRequestHandler
[junit4:junit4]   2> 9471 T75 oasc.RequestHandlers.initHandlersFromConfig created /terms: org.apache.solr.handler.component.SearchHandler
[junit4:junit4]   2> 9471 T75 oasc.RequestHandlers.initHandlersFromConfig created spellCheckCompRH: org.apache.solr.handler.component.SearchHandler
[junit4:junit4]   2> 9472 T75 oasc.RequestHandlers.initHandlersFromConfig created spellCheckCompRH_Direct: org.apache.solr.handler.component.SearchHandler
[junit4:junit4]   2> 9472 T75 oasc.RequestHandlers.initHandlersFromConfig created spellCheckWithWordbreak: org.apache.solr.handler.component.SearchHandler
[junit4:junit4]   2> 9473 T75 oasc.RequestHandlers.initHandlersFromConfig created spellCheckWithWordbreak_Direct: org.apache.solr.handler.component.SearchHandler
[junit4:junit4]   2> 9473 T75 oasc.RequestHandlers.initHandlersFromConfig created spellCheckCompRH1: org.apache.solr.handler.component.SearchHandler
[junit4:junit4]   2> 9474 T75 oasc.RequestHandlers.initHandlersFromConfig created tvrh: org.apache.solr.handler.component.SearchHandler
[junit4:junit4]   2> 9474 T75 oasc.RequestHandlers.initHandlersFromConfig created /mlt: solr.MoreLikeThisHandler
[junit4:junit4]   2> 9475 T75 oasc.RequestHandlers.initHandlersFromConfig created /debug/dump: solr.DumpRequestHandler
[junit4:junit4]   2> 9483 T75 oashl.XMLLoader.init xsltCacheLifetimeSeconds=60
[junit4:junit4]   2> 9486 T75 oasc.SolrCore.initDeprecatedSupport WARNING solrconfig.xml uses deprecated <admin/gettableFiles>, Please update your config to use the ShowFileRequestHandler.
[junit4:junit4]   2> 9488 T75 oasc.SolrCore.initDeprecatedSupport WARNING adding ShowFileRequestHandler with hidden files: [SCHEMA.XML, OLD_SYNONYMS.TXT, STOPWORDS.TXT, PROTWORDS.TXT, OPEN-EXCHANGE-RATES.JSON, SYNONYMS.TXT, CURRENCY.XML, MAPPING-ISOLATIN1ACCENT.TXT]
[junit4:junit4]   2> 9490 T75 oass.SolrIndexSearcher.<init> Opening Searcher@4242dfb main
[junit4:junit4]   2> 9490 T75 oass.SolrIndexSearcher.getIndexDir WARNING WARNING: Directory impl does not support setting indexDir: org.apache.lucene.store.MockDirectoryWrapper
[junit4:junit4]   2> 9490 T75 oasu.CommitTracker.<init> Hard AutoCommit: disabled
[junit4:junit4]   2> 9491 T75 oasu.CommitTracker.<init> Soft AutoCommit: disabled
[junit4:junit4]   2> 9491 T75 oashc.SpellCheckComponent.inform Initializing spell checkers
[junit4:junit4]   2> 9523 T75 oass.DirectSolrSpellChecker.init init: {name=direct,classname=DirectSolrSpellChecker,field=lowerfilt,minQueryLength=3}
[junit4:junit4]   2> 9576 T101 oasc.SolrCore.registerSearcher [collection1] Registered new searcher Searcher@4242dfb main{StandardDirectoryReader(segments_1:1)}
[junit4:junit4]   2> 9580 T75 oasc.ZkController.publish numShards not found on descriptor - reading it from system property
[junit4:junit4]   2> 9582 T75 oasc.CoreContainer.register registering core: collection1
[junit4:junit4]   2> 9582 T75 oasc.ZkController.register Register shard - core:collection1 address:http://127.0.0.1:7004/solr shardId:shard1
[junit4:junit4]   2> 9586 T75 oasc.ZkController.register We are http://127.0.0.1:7004/solr/collection1/ and leader is http://127.0.0.1:7000/solr/collection1/
[junit4:junit4]   2> 9586 T75 oasc.ZkController.checkRecovery WARNING Skipping recovery according to sys prop solrcloud.skip.autorecovery
[junit4:junit4]   2> 9586 T75 oasc.ZkController.publish numShards not found on descriptor - reading it from system property
[junit4:junit4]   2> 9593 T75 oascc.ZkStateReader.updateClusterState Updating cloud state from ZooKeeper... 
[junit4:junit4]   2> 9596 T75 oasc.SolrResourceLoader.locateSolrHome JNDI not configured for solr (NoInitialContextEx)
[junit4:junit4]   2> 9596 T75 oasc.SolrResourceLoader.locateSolrHome using system property solr.solr.home: /usr/home/hudson/hudson-slave/workspace/Lucene-Solr-Tests-4.x-java7/solr/build/solr-core/test-files/solr
[junit4:junit4]   2> 9596 T75 oasc.CoreContainer$Initializer.initialize looking for solr.xml: /usr/home/hudson/hudson-slave/workspace/Lucene-Solr-Tests-4.x-java7/solr/build/solr-core/test-files/solr/solr.xml
[junit4:junit4]   2> 9596 T75 oasc.CoreContainer.<init> New CoreContainer 108824254
[junit4:junit4]   2> 9597 T75 oasc.CoreContainer.load Loading CoreContainer using Solr Home: '/usr/home/hudson/hudson-slave/workspace/Lucene-Solr-Tests-4.x-java7/solr/build/solr-core/test-files/solr/'
[junit4:junit4]   2> 9597 T75 oasc.SolrResourceLoader.<init> new SolrResourceLoader for directory: '/usr/home/hudson/hudson-slave/workspace/Lucene-Solr-Tests-4.x-java7/solr/build/solr-core/test-files/solr/'
[junit4:junit4]   2> 9636 T75 oasc.CoreContainer.load Registering Log Listener
[junit4:junit4]   2> 9646 T75 oasc.CoreContainer.initZooKeeper Zookeeper client=127.0.0.1:57157/solr
[junit4:junit4]   2> 9647 T75 oaz.ZooKeeper.<init> Initiating client connection, connectString=127.0.0.1:57157/solr sessionTimeout=3000 watcher=org.apache.solr.common.cloud.ConnectionManager@3111c576
[junit4:junit4]   2> 9648 T102 oaz.ClientCnxn$SendThread.startConnect Opening socket connection to server /127.0.0.1:57157
[junit4:junit4]   2> 9648 T75 oascc.ConnectionManager.waitForConnected Waiting for client to connect to ZooKeeper
[junit4:junit4]   2> 9649 T102 oaz.ClientCnxn$SendThread.primeConnection Socket connection established to localhost/127.0.0.1:57157, initiating session
[junit4:junit4]   2> 9649 T77 oazs.NIOServerCnxn$Factory.run Accepted socket connection from /140.211.11.196:21843
[junit4:junit4]   2> 9649 T77 oazs.NIOServerCnxn.readConnectRequest Client attempting to establish new session at /140.211.11.196:21843
[junit4:junit4]   2> 9651 T79 oazs.NIOServerCnxn.finishSessionInit Established session 0x13ac3e1b9bc0007 with negotiated timeout 3000 for client /140.211.11.196:21843
[junit4:junit4]   2> 9651 T102 oaz.ClientCnxn$SendThread.readConnectResult Session establishment complete on server localhost/127.0.0.1:57157, sessionid = 0x13ac3e1b9bc0007, negotiated timeout = 3000
[junit4:junit4]   2> 9652 T103 oascc.ConnectionManager.process Watcher org.apache.solr.common.cloud.ConnectionManager@3111c576 name:ZooKeeperConnection Watcher:127.0.0.1:57157/solr got event WatchedEvent state:SyncConnected type:None path:null path:null type:None
[junit4:junit4]   2> 9652 T75 oascc.ConnectionManager.waitForConnected Client is connected to ZooKeeper
[junit4:junit4]   2> 9653 T81 oazs.PrepRequestProcessor.pRequest Got user-level KeeperException when processing sessionid:0x13ac3e1b9bc0007 type:create cxid:0x1 zxid:0xfffffffffffffffe txntype:unknown reqpath:n/a Error Path:/solr/overseer Error:KeeperErrorCode = NodeExists for /solr/overseer
[junit4:junit4]   2> 9654 T81 oazs.PrepRequestProcessor.pRequest Got user-level KeeperException when processing sessionid:0x13ac3e1b9bc0007 type:create cxid:0x2 zxid:0xfffffffffffffffe txntype:unknown reqpath:n/a Error Path:/solr/overseer Error:KeeperErrorCode = NodeExists for /solr/overseer
[junit4:junit4]   2> 9655 T75 oasc.ZkController.createEphemeralLiveNode Register node as live in ZooKeeper:/live_nodes/127.0.0.1:3333_solr
[junit4:junit4]   2> 9656 T81 oazs.PrepRequestProcessor.pRequest Got user-level KeeperException when processing sessionid:0x13ac3e1b9bc0007 type:delete cxid:0x4 zxid:0xfffffffffffffffe txntype:unknown reqpath:n/a Error Path:/solr/live_nodes/127.0.0.1:3333_solr Error:KeeperErrorCode = NoNode for /solr/live_nodes/127.0.0.1:3333_solr
[junit4:junit4]   2> 9665 T75 oascc.SolrZkClient.makePath makePath: /live_nodes/127.0.0.1:3333_solr
[junit4:junit4]   2> 9668 T86 oascc.ZkStateReader$3.process Updating live nodes... (6)
[junit4:junit4]   2> 9669 T91 oascc.ZkStateReader$3.process Updating live nodes... (6)
[junit4:junit4]   2> 9669 T97 oascc.ZkStateReader$3.process Updating live nodes... (6)
[junit4:junit4]   2> 9668 T94 oascc.ZkStateReader$3.process Updating live nodes... (6)
[junit4:junit4]   2> 9669 T100 oascc.ZkStateReader$3.process Updating live nodes... (6)
[junit4:junit4]   2> 9669 T75 oashc.HttpShardHandlerFactory.getParameter Setting socketTimeout to: 0
[junit4:junit4]   2> 9670 T75 oashc.HttpShardHandlerFactory.getParameter Setting urlScheme to: http://
[junit4:junit4]   2> 9670 T75 oashc.HttpShardHandlerFactory.getParameter Setting connTimeout to: 0
[junit4:junit4]   2> 9670 T75 oashc.HttpShardHandlerFactory.getParameter Setting maxConnectionsPerHost to: 20
[junit4:junit4]   2> 9670 T75 oashc.HttpShardHandlerFactory.getParameter Setting corePoolSize to: 0
[junit4:junit4]   2> 9671 T75 oashc.HttpShardHandlerFactory.getParameter Setting maximumPoolSize to: 2147483647
[junit4:junit4]   2> 9671 T75 oashc.HttpShardHandlerFactory.getParameter Setting maxThreadIdleTime to: 5
[junit4:junit4]   2> 9671 T75 oashc.HttpShardHandlerFactory.getParameter Setting sizeOfQueue to: -1
[junit4:junit4]   2> 9671 T75 oashc.HttpShardHandlerFactory.getParameter Setting fairnessPolicy to: false
[junit4:junit4]   2> 9672 T75 oascsi.HttpClientUtil.createClient Creating new http client, config:maxConnectionsPerHost=20&maxConnections=10000&socketTimeout=0&connTimeout=0&retry=false
[junit4:junit4]   2> 9677 T87 oascc.ZkStateReader.updateClusterState Updating cloud state from ZooKeeper... 
[junit4:junit4]   2> 9677 T87 oasc.Overseer$ClusterStateUpdater.updateState Update state numShards=null message={
[junit4:junit4]   2> 	  "operation":"state",
[junit4:junit4]   2> 	  "numShards":null,
[junit4:junit4]   2> 	  "shard":"shard1",
[junit4:junit4]   2> 	  "roles":null,
[junit4:junit4]   2> 	  "state":"down",
[junit4:junit4]   2> 	  "core":"collection1",
[junit4:junit4]   2> 	  "collection":"collection1",
[junit4:junit4]   2> 	  "node_name":"127.0.0.1:7004_solr",
[junit4:junit4]   2> 	  "base_url":"http://127.0.0.1:7004/solr"}
[junit4:junit4]   2> 9682 T87 oasc.Overseer$ClusterStateUpdater.updateState Update state numShards=null message={
[junit4:junit4]   2> 	  "operation":"state",
[junit4:junit4]   2> 	  "numShards":null,
[junit4:junit4]   2> 	  "shard":"shard1",
[junit4:junit4]   2> 	  "roles":null,
[junit4:junit4]   2> 	  "state":"active",
[junit4:junit4]   2> 	  "core":"collection1",
[junit4:junit4]   2> 	  "collection":"collection1",
[junit4:junit4]   2> 	  "node_name":"127.0.0.1:7004_solr",
[junit4:junit4]   2> 	  "base_url":"http://127.0.0.1:7004/solr"}
[junit4:junit4]   2> 9692 T75 oascc.ZkStateReader.createClusterStateWatchersAndUpdate Updating cluster state from ZooKeeper... 
[junit4:junit4]   2> 9693 T86 oascc.ZkStateReader$2.process A cluster state change has occurred - updating... (6)
[junit4:junit4]   2> 9693 T97 oascc.ZkStateReader$2.process A cluster state change has occurred - updating... (6)
[junit4:junit4]   2> 9693 T91 oascc.ZkStateReader$2.process A cluster state change has occurred - updating... (6)
[junit4:junit4]   2> 9693 T100 oascc.ZkStateReader$2.process A cluster state change has occurred - updating... (6)
[junit4:junit4]   2> 9693 T94 oascc.ZkStateReader$2.process A cluster state change has occurred - updating... (6)
[junit4:junit4]   2> 9693 T103 oaz.ClientCnxn$EventThread.processEvent SEVERE Error while calling watcher  java.lang.NullPointerException
[junit4:junit4]   2> 	at org.apache.solr.common.cloud.ZkStateReader$2.process(ZkStateReader.java:189)
[junit4:junit4]   2> 	at org.apache.zookeeper.ClientCnxn$EventThread.processEvent(ClientCnxn.java:526)
[junit4:junit4]   2> 	at org.apache.zookeeper.ClientCnxn$EventThread.run(ClientCnxn.java:502)
[junit4:junit4]   2> 
[junit4:junit4]   2> 9699 T75 oasc.CoreContainer.create Creating SolrCore 'collection1' using instanceDir: /usr/home/hudson/hudson-slave/workspace/Lucene-Solr-Tests-4.x-java7/solr/build/solr-core/test-files/solr/collection1
[junit4:junit4]   2> 9699 T75 oasc.ZkController.createCollectionZkNode Check for collection zkNode:collection1
[junit4:junit4]   2> 9700 T75 oasc.ZkController.createCollectionZkNode Collection zkNode exists
[junit4:junit4]   2> 9700 T75 oasc.ZkController.readConfigName Load collection config from:/collections/collection1
[junit4:junit4]   2> 9701 T75 oasc.SolrResourceLoader.<init> new SolrResourceLoader for directory: '/usr/home/hudson/hudson-slave/workspace/Lucene-Solr-Tests-4.x-java7/solr/build/solr-core/test-files/solr/collection1/'
[junit4:junit4]   2> 9702 T75 oasc.SolrResourceLoader.replaceClassLoader Adding 'file:/usr/home/hudson/hudson-slave/workspace/Lucene-Solr-Tests-4.x-java7/solr/build/solr-core/test-files/solr/collection1/lib/classes/' to classloader
[junit4:junit4]   2> 9703 T75 oasc.SolrResourceLoader.replaceClassLoader Adding 'file:/usr/home/hudson/hudson-slave/workspace/Lucene-Solr-Tests-4.x-java7/solr/build/solr-core/test-files/solr/collection1/lib/README' to classloader
[junit4:junit4]   2> 9740 T75 oasc.SolrConfig.<init> Using Lucene MatchVersion: LUCENE_41
[junit4:junit4]   2> 9788 T75 oasc.SolrConfig.<init> Loaded SolrConfig: solrconfig.xml
[junit4:junit4]   2> 9789 T75 oass.IndexSchema.readSchema Reading Solr Schema
[junit4:junit4]   2> 9799 T75 oass.IndexSchema.readSchema Schema name=test
[junit4:junit4]   2> 10235 T75 oass.OpenExchangeRatesOrgProvider.init Initialized with rates=open-exchange-rates.json, refreshInterval=1440.
[junit4:junit4]   2> 10244 T75 oass.IndexSchema.readSchema default search field in schema is text
[junit4:junit4]   2> 10247 T75 oass.IndexSchema.readSchema unique key field: id
[junit4:junit4]   2> 10449 T75 oass.FileExchangeRateProvider.reload Reloading exchange rates from file currency.xml
[junit4:junit4]   2> 10454 T75 oass.FileExchangeRateProvider.reload Reloading exchange rates from file currency.xml
[junit4:junit4]   2> 10458 T75 oass.OpenExchangeRatesOrgProvider.reload Reloading exchange rates from open-exchange-rates.json
[junit4:junit4]   2> 10459 T75 oass.OpenExchangeRatesOrgProvider.reload Reloading exchange rates from open-exchange-rates.json
[junit4:junit4]   2> 10461 T75 oasc.SolrCore.<init> [collection1] Opening new SolrCore at /usr/home/hudson/hudson-slave/workspace/Lucene-Solr-Tests-4.x-java7/solr/build/solr-core/test-files/solr/collection1/, dataDir=/usr/home/hudson/hudson-slave/workspace/Lucene-Solr-Tests-4.x-java7/solr/build/solr-core/test/J0/./solrtest-LeaderElectionIntegrationTest-1351906080841/data_3333/
[junit4:junit4]   2> 10461 T75 oasc.JmxMonitoredMap.<init> JMX monitoring is enabled. Adding Solr mbeans to JMX Server: com.sun.jmx.mbeanserver.JmxMBeanServer@54db16d7
[junit4:junit4]   2> 10462 T75 oasc.SolrCore.getNewIndexDir New index directory detected: old=null new=/usr/home/hudson/hudson-slave/workspace/Lucene-Solr-Tests-4.x-java7/solr/build/solr-core/test/J0/./solrtest-LeaderElectionIntegrationTest-1351906080841/data_3333/index/
[junit4:junit4]   2> 10462 T75 oasc.SolrCore.initIndex WARNING [collection1] Solr index directory '/usr/home/hudson/hudson-slave/workspace/Lucene-Solr-Tests-4.x-java7/solr/build/solr-core/test/J0/./solrtest-LeaderElectionIntegrationTest-1351906080841/data_3333/index' doesn't exist. Creating new index...
[junit4:junit4]   2> 10463 T75 oasc.CachingDirectoryFactory.get return new directory for /usr/home/hudson/hudson-slave/workspace/Lucene-Solr-Tests-4.x-java7/solr/build/solr-core/test/J0/./solrtest-LeaderElectionIntegrationTest-1351906080841/data_3333/index forceNew:false
[junit4:junit4]   2> 10465 T75 oasc.SolrDeletionPolicy.onCommit SolrDeletionPolicy.onCommit: commits:num=1
[junit4:junit4]   2> 		commit{dir=MockDirWrapper(org.apache.lucene.store.RAMDirectory@19d0954e lockFactory=org.apache.lucene.store.NativeFSLockFactory@41c981b4),segFN=segments_1,generation=1,filenames=[segments_1]
[junit4:junit4]   2> 10465 T75 oasc.SolrDeletionPolicy.updateCommits newest commit = 1
[junit4:junit4]   2> 10466 T75 oasc.SolrCore.initWriters created xml: solr.XMLResponseWriter
[junit4:junit4]   2> 10468 T75 oasup.UpdateRequestProcessorChain.init inserting DistributedUpdateProcessorFactory into updateRequestProcessorChain "dedupe"
[junit4:junit4]   2> 10469 T75 oasup.UpdateRequestProcessorChain.init inserting DistributedUpdateProcessorFactory into updateRequestProcessorChain "dedupe-allfields"
[junit4:junit4]   2> 10469 T75 oasup.UpdateRequestProcessorChain.init inserting DistributedUpdateProcessorFactory into updateRequestProcessorChain "stored_sig"
[junit4:junit4]   2> 10469 T75 oasup.UpdateRequestProcessorChain.init inserting DistributedUpdateProcessorFactory into updateRequestProcessorChain "uniq-fields"
[junit4:junit4]   2> 10470 T75 oasup.UpdateRequestProcessorChain.init inserting DistributedUpdateProcessorFactory into updateRequestProcessorChain "distrib-dup-test-chain-implicit"
[junit4:junit4]   2> 10470 T75 oasc.RequestHandlers.initHandlersFromConfig adding lazy requestHandler: solr.ReplicationHandler
[junit4:junit4]   2> 10471 T75 oasc.RequestHandlers.initHandlersFromConfig created /replication: solr.ReplicationHandler
[junit4:junit4]   2> 10471 T75 oasc.RequestHandlers.initHandlersFromConfig created standard: solr.StandardRequestHandler
[junit4:junit4]   2> 10472 T75 oasc.RequestHandlers.initHandlersFromConfig created /get: solr.RealTimeGetHandler
[junit4:junit4]   2> 10472 T75 oasc.RequestHandlers.initHandlersFromConfig created dismax: solr.SearchHandler
[junit4:junit4]   2> 10473 T75 oasc.RequestHandlers.initHandlersFromConfig created mock: org.apache.solr.core.MockQuerySenderListenerReqHandler
[junit4:junit4]   2> 10473 T75 oasc.RequestHandlers.initHandlersFromConfig created /admin/: org.apache.solr.handler.admin.AdminHandlers
[junit4:junit4]   2> 10474 T75 oasc.RequestHandlers.initHandlersFromConfig created defaults: solr.StandardRequestHandler
[junit4:junit4]   2> 10474 T75 oasc.RequestHandlers.initHandlersFromConfig adding lazy requestHandler: solr.StandardRequestHandler
[junit4:junit4]   2> 10474 T75 oasc.RequestHandlers.initHandlersFromConfig created lazy: solr.StandardRequestHandler
[junit4:junit4]   2> 10475 T75 oasc.RequestHandlers.initHandlersFromConfig created /update: solr.UpdateRequestHandler
[junit4:junit4]   2> 10475 T75 oasc.RequestHandlers.initHandlersFromConfig created /terms: org.apache.solr.handler.component.SearchHandler
[junit4:junit4]   2> 10476 T75 oasc.RequestHandlers.initHandlersFromConfig created spellCheckCompRH: org.apache.solr.handler.component.SearchHandler
[junit4:junit4]   2> 10476 T75 oasc.RequestHandlers.initHandlersFromConfig created spellCheckCompRH_Direct: org.apache.solr.handler.component.SearchHandler
[junit4:junit4]   2> 10477 T75 oasc.RequestHandlers.initHandlersFromConfig created spellCheckWithWordbreak: org.apache.solr.handler.component.SearchHandler
[junit4:junit4]   2> 10477 T75 oasc.RequestHandlers.initHandlersFromConfig created spellCheckWithWordbreak_Direct: org.apache.solr.handler.component.SearchHandler
[junit4:junit4]   2> 10478 T75 oasc.RequestHandlers.initHandlersFromConfig created spellCheckCompRH1: org.apache.solr.handler.component.SearchHandler
[junit4:junit4]   2> 10478 T75 oasc.RequestHandlers.initHandlersFromConfig created tvrh: org.apache.solr.handler.component.SearchHandler
[junit4:junit4]   2> 10479 T75 oasc.RequestHandlers.initHandlersFromConfig created /mlt: solr.MoreLikeThisHandler
[junit4:junit4]   2> 10479 T75 oasc.RequestHandlers.initHandlersFromConfig created /debug/dump: solr.DumpRequestHandler
[junit4:junit4]   2> 10488 T75 oashl.XMLLoader.init xsltCacheLifetimeSeconds=60
[junit4:junit4]   2> 10491 T75 oasc.SolrCore.initDeprecatedSupport WARNING solrconfig.xml uses deprecated <admin/gettableFiles>, Please update your config to use the ShowFileRequestHandler.
[junit4:junit4]   2> 10492 T75 oasc.SolrCore.initDeprecatedSupport WARNING adding ShowFileRequestHandler with hidden files: [SCHEMA.XML, OLD_SYNONYMS.TXT, STOPWORDS.TXT, PROTWORDS.TXT, OPEN-EXCHANGE-RATES.JSON, SYNONYMS.TXT, CURRENCY.XML, MAPPING-ISOLATIN1ACCENT.TXT]
[junit4:junit4]   2> 10495 T75 oass.SolrIndexSearcher.<init> Opening Searcher@36800134 main
[junit4:junit4]   2> 10495 T75 oass.SolrIndexSearcher.getIndexDir WARNING WARNING: Directory impl does not support setting indexDir: org.apache.lucene.store.MockDirectoryWrapper
[junit4:junit4]   2> 10495 T75 oasu.CommitTracker.<init> Hard AutoCommit: disabled
[junit4:junit4]   2> 10496 T75 oasu.CommitTracker.<init> Soft AutoCommit: disabled
[junit4:junit4]   2> 10496 T75 oashc.SpellCheckComponent.inform Initializing spell checkers
[junit4:junit4]   2> 10541 T75 oass.DirectSolrSpellChecker.init init: {name=direct,classname=DirectSolrSpellChecker,field=lowerfilt,minQueryLength=3}
[junit4:junit4]   2> 10586 T104 oasc.SolrCore.registerSearcher [collection1] Registered new searcher Searcher@36800134 main{StandardDirectoryReader(segments_1:1)}
[junit4:junit4]   2> 10593 T75 oasc.ZkController.publish numShards not found on descriptor - reading it from system property
[junit4:junit4]   2> 10595 T75 oasc.CoreContainer.register registering core: collection1
[junit4:junit4]   2> 10595 T75 oasc.ZkController.register Register shard - core:collection1 address:http://127.0.0.1:3333/solr shardId:shard2
[junit4:junit4]   2> 10596 T75 oascc.SolrZkClient.makePath makePath: /collections/collection1/leader_elect/shard2/election
[junit4:junit4]   2> 10610 T81 oazs.PrepRequestProcessor.pRequest Got user-level KeeperException when processing sessionid:0x13ac3e1b9bc0007 type:delete cxid:0x40 zxid:0xfffffffffffffffe txntype:unknown reqpath:n/a Error Path:/solr/collections/collection1/leaders/shard2 Error:KeeperErrorCode = NoNode for /solr/collections/collection1/leaders/shard2
[junit4:junit4]   2> 10611 T75 oasc.ShardLeaderElectionContext.runLeaderProcess Running the leader process.
[junit4:junit4]   2> 10612 T81 oazs.PrepRequestProcessor.pRequest Got user-level KeeperException when processing sessionid:0x13ac3e1b9bc0007 type:create cxid:0x41 zxid:0xfffffffffffffffe txntype:unknown reqpath:n/a Error Path:/solr/overseer Error:KeeperErrorCode = NodeExists for /solr/overseer
[junit4:junit4]   2> 10704 T87 oascc.ZkStateReader.updateClusterState Updating cloud state from ZooKeeper... 
[junit4:junit4]   2> 10704 T87 oasc.Overseer$ClusterStateUpdater.updateState Update state numShards=null message={
[junit4:junit4]   2> 	  "operation":"state",
[junit4:junit4]   2> 	  "numShards":null,
[junit4:junit4]   2> 	  "shard":"shard2",
[junit4:junit4]   2> 	  "roles":null,
[junit4:junit4]   2> 	  "state":"down",
[junit4:junit4]   2> 	  "core":"collection1",
[junit4:junit4]   2> 	  "collection":"collection1",
[junit4:junit4]   2> 	  "node_name":"127.0.0.1:3333_solr",
[junit4:junit4]   2> 	  "base_url":"http://127.0.0.1:3333/solr"}
[junit4:junit4]   2> 10722 T91 oascc.ZkStateReader$2.process A cluster state change has occurred - updating... (6)
[junit4:junit4]   2> 10722 T86 oascc.ZkStateReader$2.process A cluster state change has occurred - updating... (6)
[junit4:junit4]   2> 10723 T94 oascc.ZkStateReader$2.process A cluster state change has occurred - updating... (6)
[junit4:junit4]   2> 10723 T100 oascc.ZkStateReader$2.process A cluster state change has occurred - updating... (6)
[junit4:junit4]   2> 107

[...truncated too long message...]

ve_errors=0}
[junit4:junit4]   2> 7222870 T75 oasc.SolrCore.decrefSolrCoreState Closing SolrCoreState
[junit4:junit4]   2> 7222870 T75 oasu.DefaultSolrCoreState.closeIndexWriter SolrCoreState ref count has reached 0 - closing IndexWriter
[junit4:junit4]   2> 7222871 T75 oasu.DefaultSolrCoreState.closeIndexWriter closing IndexWriter with IndexWriterCloser
[junit4:junit4]   2> 7222871 T75 oasc.SolrCore.closeSearcher [collection1] Closing main searcher on request.
[junit4:junit4]   2> 7223297 T102 oaz.ClientCnxn$SendThread.run Client session timed out, have not heard from server in 3000ms for sessionid 0x13ac3e1b9bc0007, closing socket connection and attempting reconnect
[junit4:junit4]   2> 7223342 T75 oaz.ZooKeeper.close Session: 0x13ac3e1b9bc0006 closed
[junit4:junit4]   2> 7223342 T75 oasc.CoreContainer.shutdown Shutting down CoreContainer instance=108824254
[junit4:junit4]   2> 7223343 T75 oasc.SolrCore.close SEVERE Too many close [count:-1] on org.apache.solr.core.SolrCore@5bb8ad39. Please report this exception to solr-user@lucene.apache.org
[junit4:junit4]   2> 7223371 T74 ccr.ThreadLeakControl.tryToInterruptAll SEVERE There are still zombie threads that couldn't be terminated:
[junit4:junit4]   2> 	   1) Thread[id=102, name=TEST-LeaderElectionIntegrationTest.testLeaderElectionAfterClientTimeout-seed#[74596681D419C368]-SendThread(localhost:57157), state=TIMED_WAITING, group=TGRP-LeaderElectionIntegrationTest]
[junit4:junit4]   2> 	        at java.lang.Thread.sleep(Native Method)
[junit4:junit4]   2> 	        at org.apache.zookeeper.ClientCnxn$SendThread.startConnect(ClientCnxn.java:1038)
[junit4:junit4]   2> 	        at org.apache.zookeeper.ClientCnxn$SendThread.run(ClientCnxn.java:1101)
[junit4:junit4]   2> 	   2) Thread[id=75, name=TEST-LeaderElectionIntegrationTest.testLeaderElectionAfterClientTimeout-seed#[74596681D419C368], state=WAITING, group=TGRP-LeaderElectionIntegrationTest]
[junit4:junit4]   2> 	        at java.lang.Object.wait(Native Method)
[junit4:junit4]   2> 	        at java.lang.Object.wait(Object.java:503)
[junit4:junit4]   2> 	        at org.apache.zookeeper.ClientCnxn.submitRequest(ClientCnxn.java:1345)
[junit4:junit4]   2> 	        at org.apache.zookeeper.ClientCnxn.close(ClientCnxn.java:1323)
[junit4:junit4]   2> 	        at org.apache.zookeeper.ZooKeeper.close(ZooKeeper.java:537)
[junit4:junit4]   2> 	        at org.apache.solr.common.cloud.SolrZooKeeper.close(SolrZooKeeper.java:91)
[junit4:junit4]   2> 	        at org.apache.solr.common.cloud.SolrZkClient.closeKeeper(SolrZkClient.java:573)
[junit4:junit4]   2> 	        at org.apache.solr.common.cloud.SolrZkClient.close(SolrZkClient.java:542)
[junit4:junit4]   2> 	        at org.apache.solr.cloud.ZkController.close(ZkController.java:319)
[junit4:junit4]   2> 	        at org.apache.solr.core.CoreContainer.shutdown(CoreContainer.java:603)
[junit4:junit4]   2> 	        at org.apache.solr.cloud.LeaderElectionIntegrationTest.tearDown(LeaderElectionIntegrationTest.java:289)
[junit4:junit4]   2> 	        at sun.reflect.NativeMethodAccessorImpl.invoke0(Native Method)
[junit4:junit4]   2> 	        at sun.reflect.NativeMethodAccessorImpl.invoke(NativeMethodAccessorImpl.java:57)
[junit4:junit4]   2> 	        at sun.reflect.DelegatingMethodAccessorImpl.invoke(DelegatingMethodAccessorImpl.java:43)
[junit4:junit4]   2> 	        at java.lang.reflect.Method.invoke(Method.java:601)
[junit4:junit4]   2> 	        at com.carrotsearch.randomizedtesting.RandomizedRunner.invoke(RandomizedRunner.java:1559)
[junit4:junit4]   2> 	        at com.carrotsearch.randomizedtesting.RandomizedRunner.access$600(RandomizedRunner.java:79)
[junit4:junit4]   2> 	        at com.carrotsearch.randomizedtesting.RandomizedRunner$8.evaluate(RandomizedRunner.java:795)
[junit4:junit4]   2> 	        at com.carrotsearch.randomizedtesting.rules.SystemPropertiesRestoreRule$1.evaluate(SystemPropertiesRestoreRule.java:53)
[junit4:junit4]   2> 	        at org.apache.lucene.util.TestRuleSetupTeardownChained$1.evaluate(TestRuleSetupTeardownChained.java:50)
[junit4:junit4]   2> 	        at org.apache.lucene.util.TestRuleFieldCacheSanity$1.evaluate(TestRuleFieldCacheSanity.java:51)
[junit4:junit4]   2> 	        at org.apache.lucene.util.AbstractBeforeAfterRule$1.evaluate(AbstractBeforeAfterRule.java:45)
[junit4:junit4]   2> 	        at com.carrotsearch.randomizedtesting.rules.SystemPropertiesInvariantRule$1.evaluate(SystemPropertiesInvariantRule.java:55)
[junit4:junit4]   2> 	        at org.apache.lucene.util.TestRuleThreadAndTestName$1.evaluate(TestRuleThreadAndTestName.java:48)
[junit4:junit4]   2> 	        at org.apache.lucene.util.TestRuleIgnoreAfterMaxFailures$1.evaluate(TestRuleIgnoreAfterMaxFailures.java:70)
[junit4:junit4]   2> 	        at org.apache.lucene.util.TestRuleMarkFailure$1.evaluate(TestRuleMarkFailure.java:48)
[junit4:junit4]   2> 	        at com.carrotsearch.randomizedtesting.rules.StatementAdapter.evaluate(StatementAdapter.java:36)
[junit4:junit4]   2> 	        at com.carrotsearch.randomizedtesting.ThreadLeakControl$StatementRunner.run(ThreadLeakControl.java:358)
[junit4:junit4]   2> 	        at com.carrotsearch.randomizedtesting.ThreadLeakControl.forkTimeoutingTask(ThreadLeakControl.java:782)
[junit4:junit4]   2> 	        at com.carrotsearch.randomizedtesting.ThreadLeakControl$3.evaluate(ThreadLeakControl.java:442)
[junit4:junit4]   2> 	        at com.carrotsearch.randomizedtesting.RandomizedRunner.runSingleTest(RandomizedRunner.java:746)
[junit4:junit4]   2> 	        at com.carrotsearch.randomizedtesting.RandomizedRunner$3.evaluate(RandomizedRunner.java:648)
[junit4:junit4]   2> 	        at com.carrotsearch.randomizedtesting.RandomizedRunner$4.evaluate(RandomizedRunner.java:682)
[junit4:junit4]   2> 	        at com.carrotsearch.randomizedtesting.RandomizedRunner$5.evaluate(RandomizedRunner.java:693)
[junit4:junit4]   2> 	        at com.carrotsearch.randomizedtesting.rules.StatementAdapter.evaluate(StatementAdapter.java:36)
[junit4:junit4]   2> 	        at com.carrotsearch.randomizedtesting.rules.SystemPropertiesRestoreRule$1.evaluate(SystemPropertiesRestoreRule.java:53)
[junit4:junit4]   2> 	        at org.apache.lucene.util.AbstractBeforeAfterRule$1.evaluate(AbstractBeforeAfterRule.java:45)
[junit4:junit4]   2> 	        at org.apache.lucene.util.TestRuleStoreClassName$1.evaluate(TestRuleStoreClassName.java:42)
[junit4:junit4]   2> 	        at com.carrotsearch.randomizedtesting.rules.SystemPropertiesInvariantRule$1.evaluate(SystemPropertiesInvariantRule.java:55)
[junit4:junit4]   2> 	        at com.carrotsearch.randomizedtesting.rules.NoShadowingOrOverridesOnMethodsRule$1.evaluate(NoShadowingOrOverridesOnMethodsRule.java:39)
[junit4:junit4]   2> 	        at com.carrotsearch.randomizedtesting.rules.NoShadowingOrOverridesOnMethodsRule$1.evaluate(NoShadowingOrOverridesOnMethodsRule.java:39)
[junit4:junit4]   2> 	        at com.carrotsearch.randomizedtesting.rules.StatementAdapter.evaluate(StatementAdapter.java:36)
[junit4:junit4]   2> 	        at org.apache.lucene.util.TestRuleAssertionsRequired$1.evaluate(TestRuleAssertionsRequired.java:43)
[junit4:junit4]   2> 	        at org.apache.lucene.util.TestRuleMarkFailure$1.evaluate(TestRuleMarkFailure.java:48)
[junit4:junit4]   2> 	        at org.apache.lucene.util.TestRuleIgnoreAfterMaxFailures$1.evaluate(TestRuleIgnoreAfterMaxFailures.java:70)
[junit4:junit4]   2> 	        at org.apache.lucene.util.TestRuleIgnoreTestSuites$1.evaluate(TestRuleIgnoreTestSuites.java:55)
[junit4:junit4]   2> 	        at com.carrotsearch.randomizedtesting.rules.StatementAdapter.evaluate(StatementAdapter.java:36)
[junit4:junit4]   2> 	        at com.carrotsearch.randomizedtesting.ThreadLeakControl$StatementRunner.run(ThreadLeakControl.java:358)
[junit4:junit4]   2> 	        at java.lang.Thread.run(Thread.java:722)
[junit4:junit4]   2> NOTE: test params are: codec=Lucene40, sim=RandomSimilarityProvider(queryNorm=true,coord=yes): {}, locale=el_GR, timezone=America/Cancun
[junit4:junit4]   2> NOTE: FreeBSD 9.0-RELEASE amd64/Oracle Corporation 1.7.0_09 (64-bit)/cpus=16,threads=6,free=90418984,total=145752064
[junit4:junit4]   2> NOTE: All tests run in this JVM: [TestFaceting, TestGroupingSearch, DistanceFunctionTest, LeaderElectionIntegrationTest]
[junit4:junit4]   2> NOTE: reproduce with: ant test  -Dtestcase=LeaderElectionIntegrationTest -Dtests.seed=74596681D419C368 -Dtests.multiplier=3 -Dtests.slow=true -Dtests.locale=el_GR -Dtests.timezone=America/Cancun -Dtests.file.encoding=ISO-8859-1
[junit4:junit4] ERROR   0.00s J0 | LeaderElectionIntegrationTest (suite) <<<
[junit4:junit4]    > Throwable #1: java.lang.Exception: Suite timeout exceeded (>= 7200000 msec).
[junit4:junit4]    > 	at __randomizedtesting.SeedInfo.seed([74596681D419C368]:0)
[junit4:junit4] Completed on J0 in 7223.42s, 1 test, 2 errors <<< FAILURES!

[...truncated 174 lines...]
BUILD FAILED
/usr/home/hudson/hudson-slave/workspace/Lucene-Solr-Tests-4.x-java7/build.xml:335: The following error occurred while executing this line:
/usr/home/hudson/hudson-slave/workspace/Lucene-Solr-Tests-4.x-java7/build.xml:39: The following error occurred while executing this line:
/usr/home/hudson/hudson-slave/workspace/Lucene-Solr-Tests-4.x-java7/solr/build.xml:178: The following error occurred while executing this line:
/usr/home/hudson/hudson-slave/workspace/Lucene-Solr-Tests-4.x-java7/lucene/module-build.xml:61: The following error occurred while executing this line:
/usr/home/hudson/hudson-slave/workspace/Lucene-Solr-Tests-4.x-java7/lucene/common-build.xml:1163: The following error occurred while executing this line:
/usr/home/hudson/hudson-slave/workspace/Lucene-Solr-Tests-4.x-java7/lucene/common-build.xml:827: There were test failures: 233 suites, 964 tests, 3 suite-level errors, 1 error, 850 ignored

Total time: 137 minutes 58 seconds
Build step 'Invoke Ant' marked build as failure
Archiving artifacts
Recording test results
Email was triggered for: Failure
Sending email for trigger: Failure



Mime
View raw message