lucene-dev mailing list archives

Site index · List index
Message view « Date » · « Thread »
Top « Date » · « Thread »
From Policeman Jenkins Server <jenk...@sd-datasolutions.de>
Subject [JENKINS] Lucene-Solr-4.x-Windows (32bit/jdk1.7.0_07) - Build # 1400 - Still Failing!
Date Fri, 02 Nov 2012 06:09:16 GMT
Build: http://jenkins.sd-datasolutions.de/job/Lucene-Solr-4.x-Windows/1400/
Java: 32bit/jdk1.7.0_07 -client -XX:+UseG1GC

1 tests failed.
REGRESSION:  org.apache.solr.cloud.BasicDistributedZkTest.testDistribSearch

Error Message:
There are still nodes recoverying - waited for 180 seconds

Stack Trace:
java.lang.AssertionError: There are still nodes recoverying - waited for 180 seconds
	at __randomizedtesting.SeedInfo.seed([2C37AB2482B95E3B:ADD1253CF5E63E07]:0)
	at org.junit.Assert.fail(Assert.java:93)
	at org.apache.solr.cloud.AbstractDistribZkTestBase.waitForRecoveriesToFinish(AbstractDistribZkTestBase.java:165)
	at org.apache.solr.cloud.AbstractDistribZkTestBase.waitForRecoveriesToFinish(AbstractDistribZkTestBase.java:115)
	at org.apache.solr.cloud.AbstractDistribZkTestBase.waitForRecoveriesToFinish(AbstractDistribZkTestBase.java:110)
	at org.apache.solr.cloud.AbstractFullDistribZkTestBase.waitForRecoveriesToFinish(AbstractFullDistribZkTestBase.java:553)
	at org.apache.solr.cloud.BasicDistributedZkTest.doTest(BasicDistributedZkTest.java:162)
	at org.apache.solr.BaseDistributedSearchTestCase.testDistribSearch(BaseDistributedSearchTestCase.java:695)
	at sun.reflect.NativeMethodAccessorImpl.invoke0(Native Method)
	at sun.reflect.NativeMethodAccessorImpl.invoke(NativeMethodAccessorImpl.java:57)
	at sun.reflect.DelegatingMethodAccessorImpl.invoke(DelegatingMethodAccessorImpl.java:43)
	at java.lang.reflect.Method.invoke(Method.java:601)
	at com.carrotsearch.randomizedtesting.RandomizedRunner.invoke(RandomizedRunner.java:1559)
	at com.carrotsearch.randomizedtesting.RandomizedRunner.access$600(RandomizedRunner.java:79)
	at com.carrotsearch.randomizedtesting.RandomizedRunner$6.evaluate(RandomizedRunner.java:737)
	at com.carrotsearch.randomizedtesting.RandomizedRunner$7.evaluate(RandomizedRunner.java:773)
	at com.carrotsearch.randomizedtesting.RandomizedRunner$8.evaluate(RandomizedRunner.java:787)
	at com.carrotsearch.randomizedtesting.rules.SystemPropertiesRestoreRule$1.evaluate(SystemPropertiesRestoreRule.java:53)
	at org.apache.lucene.util.TestRuleSetupTeardownChained$1.evaluate(TestRuleSetupTeardownChained.java:50)
	at org.apache.lucene.util.TestRuleFieldCacheSanity$1.evaluate(TestRuleFieldCacheSanity.java:51)
	at org.apache.lucene.util.AbstractBeforeAfterRule$1.evaluate(AbstractBeforeAfterRule.java:45)
	at com.carrotsearch.randomizedtesting.rules.SystemPropertiesInvariantRule$1.evaluate(SystemPropertiesInvariantRule.java:55)
	at org.apache.lucene.util.TestRuleThreadAndTestName$1.evaluate(TestRuleThreadAndTestName.java:48)
	at org.apache.lucene.util.TestRuleIgnoreAfterMaxFailures$1.evaluate(TestRuleIgnoreAfterMaxFailures.java:70)
	at org.apache.lucene.util.TestRuleMarkFailure$1.evaluate(TestRuleMarkFailure.java:48)
	at com.carrotsearch.randomizedtesting.rules.StatementAdapter.evaluate(StatementAdapter.java:36)
	at com.carrotsearch.randomizedtesting.ThreadLeakControl$StatementRunner.run(ThreadLeakControl.java:358)
	at com.carrotsearch.randomizedtesting.ThreadLeakControl.forkTimeoutingTask(ThreadLeakControl.java:782)
	at com.carrotsearch.randomizedtesting.ThreadLeakControl$3.evaluate(ThreadLeakControl.java:442)
	at com.carrotsearch.randomizedtesting.RandomizedRunner.runSingleTest(RandomizedRunner.java:746)
	at com.carrotsearch.randomizedtesting.RandomizedRunner$3.evaluate(RandomizedRunner.java:648)
	at com.carrotsearch.randomizedtesting.RandomizedRunner$4.evaluate(RandomizedRunner.java:682)
	at com.carrotsearch.randomizedtesting.RandomizedRunner$5.evaluate(RandomizedRunner.java:693)
	at com.carrotsearch.randomizedtesting.rules.StatementAdapter.evaluate(StatementAdapter.java:36)
	at com.carrotsearch.randomizedtesting.rules.SystemPropertiesRestoreRule$1.evaluate(SystemPropertiesRestoreRule.java:53)
	at org.apache.lucene.util.AbstractBeforeAfterRule$1.evaluate(AbstractBeforeAfterRule.java:45)
	at org.apache.lucene.util.TestRuleStoreClassName$1.evaluate(TestRuleStoreClassName.java:42)
	at com.carrotsearch.randomizedtesting.rules.SystemPropertiesInvariantRule$1.evaluate(SystemPropertiesInvariantRule.java:55)
	at com.carrotsearch.randomizedtesting.rules.NoShadowingOrOverridesOnMethodsRule$1.evaluate(NoShadowingOrOverridesOnMethodsRule.java:39)
	at com.carrotsearch.randomizedtesting.rules.NoShadowingOrOverridesOnMethodsRule$1.evaluate(NoShadowingOrOverridesOnMethodsRule.java:39)
	at com.carrotsearch.randomizedtesting.rules.StatementAdapter.evaluate(StatementAdapter.java:36)
	at org.apache.lucene.util.TestRuleAssertionsRequired$1.evaluate(TestRuleAssertionsRequired.java:43)
	at org.apache.lucene.util.TestRuleMarkFailure$1.evaluate(TestRuleMarkFailure.java:48)
	at org.apache.lucene.util.TestRuleIgnoreAfterMaxFailures$1.evaluate(TestRuleIgnoreAfterMaxFailures.java:70)
	at org.apache.lucene.util.TestRuleIgnoreTestSuites$1.evaluate(TestRuleIgnoreTestSuites.java:55)
	at com.carrotsearch.randomizedtesting.rules.StatementAdapter.evaluate(StatementAdapter.java:36)
	at com.carrotsearch.randomizedtesting.ThreadLeakControl$StatementRunner.run(ThreadLeakControl.java:358)
	at java.lang.Thread.run(Thread.java:722)




Build Log:
[...truncated 8332 lines...]
[junit4:junit4] Suite: org.apache.solr.cloud.BasicDistributedZkTest
[junit4:junit4]   2> 3 T337 oas.SolrTestCaseJ4.setUp ###Starting testDistribSearch
[junit4:junit4]   2> Creating dataDir: C:\Users\JenkinsSlave\workspace\Lucene-Solr-4.x-Windows\solr\build\solr-core\test\J0\.\solrtest-BasicDistributedZkTest-1351835287370
[junit4:junit4]   2> 5 T337 oasc.ZkTestServer.run STARTING ZK TEST SERVER
[junit4:junit4]   2> 8 T338 oazs.ZooKeeperServer.setTickTime tickTime set to 1000
[junit4:junit4]   2> 9 T338 oazs.NIOServerCnxn$Factory.<init> binding to port 0.0.0.0/0.0.0.0:0
[junit4:junit4]   2> 9 T338 oazsp.FileTxnSnapLog.save Snapshotting: 0
[junit4:junit4]   2> 78 T337 oasc.ZkTestServer.run start zk server on port:63254
[junit4:junit4]   2> 78 T337 oaz.ZooKeeper.<init> Initiating client connection, connectString=127.0.0.1:63254 sessionTimeout=10000 watcher=org.apache.solr.common.cloud.ConnectionManager@173a651
[junit4:junit4]   2> 81 T343 oaz.ClientCnxn$SendThread.startConnect Opening socket connection to server /127.0.0.1:63254
[junit4:junit4]   2> 81 T337 oascc.ConnectionManager.waitForConnected Waiting for client to connect to ZooKeeper
[junit4:junit4]   2> 82 T343 oaz.ClientCnxn$SendThread.primeConnection Socket connection established to 127.0.0.1/127.0.0.1:63254, initiating session
[junit4:junit4]   2> 82 T339 oazs.NIOServerCnxn$Factory.run Accepted socket connection from /127.0.0.1:63257
[junit4:junit4]   2> 82 T339 oazs.NIOServerCnxn.readConnectRequest Client attempting to establish new session at /127.0.0.1:63257
[junit4:junit4]   2> 83 T341 oazsp.FileTxnLog.append Creating new log file: log.1
[junit4:junit4]   2> 89 T341 oazs.NIOServerCnxn.finishSessionInit Established session 0x13abfa97f500000 with negotiated timeout 10000 for client /127.0.0.1:63257
[junit4:junit4]   2> 89 T343 oaz.ClientCnxn$SendThread.readConnectResult Session establishment complete on server 127.0.0.1/127.0.0.1:63254, sessionid = 0x13abfa97f500000, negotiated timeout = 10000
[junit4:junit4]   2> 90 T344 oascc.ConnectionManager.process Watcher org.apache.solr.common.cloud.ConnectionManager@173a651 name:ZooKeeperConnection Watcher:127.0.0.1:63254 got event WatchedEvent state:SyncConnected type:None path:null path:null type:None
[junit4:junit4]   2> 90 T337 oascc.ConnectionManager.waitForConnected Client is connected to ZooKeeper
[junit4:junit4]   2> 90 T337 oascc.SolrZkClient.makePath makePath: /solr
[junit4:junit4]   2> 93 T342 oazs.PrepRequestProcessor.pRequest Processed session termination for sessionid: 0x13abfa97f500000
[junit4:junit4]   2> 94 T344 oaz.ClientCnxn$EventThread.run EventThread shut down
[junit4:junit4]   2> 94 T339 oazs.NIOServerCnxn.closeSock Closed socket connection for client /127.0.0.1:63257 which had sessionid 0x13abfa97f500000
[junit4:junit4]   2> 94 T337 oaz.ZooKeeper.close Session: 0x13abfa97f500000 closed
[junit4:junit4]   2> 95 T337 oaz.ZooKeeper.<init> Initiating client connection, connectString=127.0.0.1:63254/solr sessionTimeout=10000 watcher=org.apache.solr.common.cloud.ConnectionManager@1cf4ae2
[junit4:junit4]   2> 95 T345 oaz.ClientCnxn$SendThread.startConnect Opening socket connection to server /127.0.0.1:63254
[junit4:junit4]   2> 95 T337 oascc.ConnectionManager.waitForConnected Waiting for client to connect to ZooKeeper
[junit4:junit4]   2> 97 T345 oaz.ClientCnxn$SendThread.primeConnection Socket connection established to 127.0.0.1/127.0.0.1:63254, initiating session
[junit4:junit4]   2> 97 T339 oazs.NIOServerCnxn$Factory.run Accepted socket connection from /127.0.0.1:63260
[junit4:junit4]   2> 98 T339 oazs.NIOServerCnxn.readConnectRequest Client attempting to establish new session at /127.0.0.1:63260
[junit4:junit4]   2> 99 T341 oazs.NIOServerCnxn.finishSessionInit Established session 0x13abfa97f500001 with negotiated timeout 10000 for client /127.0.0.1:63260
[junit4:junit4]   2> 99 T345 oaz.ClientCnxn$SendThread.readConnectResult Session establishment complete on server 127.0.0.1/127.0.0.1:63254, sessionid = 0x13abfa97f500001, negotiated timeout = 10000
[junit4:junit4]   2> 100 T346 oascc.ConnectionManager.process Watcher org.apache.solr.common.cloud.ConnectionManager@1cf4ae2 name:ZooKeeperConnection Watcher:127.0.0.1:63254/solr got event WatchedEvent state:SyncConnected type:None path:null path:null type:None
[junit4:junit4]   2> 100 T337 oascc.ConnectionManager.waitForConnected Client is connected to ZooKeeper
[junit4:junit4]   2> 100 T337 oascc.SolrZkClient.makePath makePath: /collections/collection1
[junit4:junit4]   2> 103 T337 oascc.SolrZkClient.makePath makePath: /collections/collection1/shards
[junit4:junit4]   2> 106 T337 oascc.SolrZkClient.makePath makePath: /collections/control_collection
[junit4:junit4]   2> 108 T337 oascc.SolrZkClient.makePath makePath: /collections/control_collection/shards
[junit4:junit4]   2> 111 T337 oasc.AbstractZkTestCase.putConfig put C:\Users\JenkinsSlave\workspace\Lucene-Solr-4.x-Windows\solr\build\solr-core\test-files\solr\collection1\conf\solrconfig.xml to /configs/conf1/solrconfig.xml
[junit4:junit4]   2> 112 T337 oascc.SolrZkClient.makePath makePath: /configs/conf1/solrconfig.xml
[junit4:junit4]   2> 117 T337 oasc.AbstractZkTestCase.putConfig put C:\Users\JenkinsSlave\workspace\Lucene-Solr-4.x-Windows\solr\build\solr-core\test-files\solr\collection1\conf\schema.xml to /configs/conf1/schema.xml
[junit4:junit4]   2> 117 T337 oascc.SolrZkClient.makePath makePath: /configs/conf1/schema.xml
[junit4:junit4]   2> 120 T337 oasc.AbstractZkTestCase.putConfig put C:\Users\JenkinsSlave\workspace\Lucene-Solr-4.x-Windows\solr\build\solr-core\test-files\solr\collection1\conf\solrconfig.xml to /configs/conf1/solrconfig.xml
[junit4:junit4]   2> 120 T337 oascc.SolrZkClient.makePath makePath: /configs/conf1/solrconfig.xml
[junit4:junit4]   2> 124 T337 oasc.AbstractZkTestCase.putConfig put C:\Users\JenkinsSlave\workspace\Lucene-Solr-4.x-Windows\solr\build\solr-core\test-files\solr\collection1\conf\stopwords.txt to /configs/conf1/stopwords.txt
[junit4:junit4]   2> 124 T337 oascc.SolrZkClient.makePath makePath: /configs/conf1/stopwords.txt
[junit4:junit4]   2> 126 T337 oasc.AbstractZkTestCase.putConfig put C:\Users\JenkinsSlave\workspace\Lucene-Solr-4.x-Windows\solr\build\solr-core\test-files\solr\collection1\conf\protwords.txt to /configs/conf1/protwords.txt
[junit4:junit4]   2> 126 T337 oascc.SolrZkClient.makePath makePath: /configs/conf1/protwords.txt
[junit4:junit4]   2> 129 T337 oasc.AbstractZkTestCase.putConfig put C:\Users\JenkinsSlave\workspace\Lucene-Solr-4.x-Windows\solr\build\solr-core\test-files\solr\collection1\conf\currency.xml to /configs/conf1/currency.xml
[junit4:junit4]   2> 130 T337 oascc.SolrZkClient.makePath makePath: /configs/conf1/currency.xml
[junit4:junit4]   2> 133 T337 oasc.AbstractZkTestCase.putConfig put C:\Users\JenkinsSlave\workspace\Lucene-Solr-4.x-Windows\solr\build\solr-core\test-files\solr\collection1\conf\open-exchange-rates.json to /configs/conf1/open-exchange-rates.json
[junit4:junit4]   2> 133 T337 oascc.SolrZkClient.makePath makePath: /configs/conf1/open-exchange-rates.json
[junit4:junit4]   2> 136 T337 oasc.AbstractZkTestCase.putConfig put C:\Users\JenkinsSlave\workspace\Lucene-Solr-4.x-Windows\solr\build\solr-core\test-files\solr\collection1\conf\mapping-ISOLatin1Accent.txt to /configs/conf1/mapping-ISOLatin1Accent.txt
[junit4:junit4]   2> 136 T337 oascc.SolrZkClient.makePath makePath: /configs/conf1/mapping-ISOLatin1Accent.txt
[junit4:junit4]   2> 138 T337 oasc.AbstractZkTestCase.putConfig put C:\Users\JenkinsSlave\workspace\Lucene-Solr-4.x-Windows\solr\build\solr-core\test-files\solr\collection1\conf\old_synonyms.txt to /configs/conf1/old_synonyms.txt
[junit4:junit4]   2> 139 T337 oascc.SolrZkClient.makePath makePath: /configs/conf1/old_synonyms.txt
[junit4:junit4]   2> 141 T337 oasc.AbstractZkTestCase.putConfig put C:\Users\JenkinsSlave\workspace\Lucene-Solr-4.x-Windows\solr\build\solr-core\test-files\solr\collection1\conf\synonyms.txt to /configs/conf1/synonyms.txt
[junit4:junit4]   2> 142 T337 oascc.SolrZkClient.makePath makePath: /configs/conf1/synonyms.txt
[junit4:junit4]   2> 145 T342 oazs.PrepRequestProcessor.pRequest Processed session termination for sessionid: 0x13abfa97f500001
[junit4:junit4]   2> 145 T346 oaz.ClientCnxn$EventThread.run EventThread shut down
[junit4:junit4]   2> 145 T339 oazs.NIOServerCnxn.doIO WARNING EndOfStreamException: Unable to read additional data from client sessionid 0x13abfa97f500001, likely client has closed socket
[junit4:junit4]   2> 145 T337 oaz.ZooKeeper.close Session: 0x13abfa97f500001 closed
[junit4:junit4]   2> 146 T339 oazs.NIOServerCnxn.closeSock Closed socket connection for client /127.0.0.1:63260 which had sessionid 0x13abfa97f500001
[junit4:junit4]   2> 148 T337 oejs.Server.doStart jetty-8.1.2.v20120308
[junit4:junit4]   2> 152 T337 oejs.AbstractConnector.doStart Started SelectChannelConnector@0.0.0.0:63261
[junit4:junit4]   2> 152 T337 oasc.SolrResourceLoader.locateSolrHome JNDI not configured for solr (NoInitialContextEx)
[junit4:junit4]   2> 152 T337 oasc.SolrResourceLoader.locateSolrHome using system property solr.solr.home: C:\Users\JenkinsSlave\workspace\Lucene-Solr-4.x-Windows\solr\build\solr-core\test-files\solr
[junit4:junit4]   2> 153 T337 oasc.SolrResourceLoader.<init> new SolrResourceLoader for deduced Solr Home: 'C:\Users\JenkinsSlave\workspace\Lucene-Solr-4.x-Windows\solr\build\solr-core\test-files\solr\'
[junit4:junit4]   2> 176 T337 oass.SolrDispatchFilter.init SolrDispatchFilter.init()
[junit4:junit4]   2> 177 T337 oasc.SolrResourceLoader.locateSolrHome JNDI not configured for solr (NoInitialContextEx)
[junit4:junit4]   2> 178 T337 oasc.SolrResourceLoader.locateSolrHome using system property solr.solr.home: C:\Users\JenkinsSlave\workspace\Lucene-Solr-4.x-Windows\solr\build\solr-core\test-files\solr
[junit4:junit4]   2> 178 T337 oasc.CoreContainer$Initializer.initialize looking for solr.xml: C:\Users\JenkinsSlave\workspace\Lucene-Solr-4.x-Windows\solr\build\solr-core\test-files\solr\solr.xml
[junit4:junit4]   2> 178 T337 oasc.CoreContainer.<init> New CoreContainer 15762699
[junit4:junit4]   2> 179 T337 oasc.CoreContainer.load Loading CoreContainer using Solr Home: 'C:\Users\JenkinsSlave\workspace\Lucene-Solr-4.x-Windows\solr\build\solr-core\test-files\solr\'
[junit4:junit4]   2> 179 T337 oasc.SolrResourceLoader.<init> new SolrResourceLoader for directory: 'C:\Users\JenkinsSlave\workspace\Lucene-Solr-4.x-Windows\solr\build\solr-core\test-files\solr\'
[junit4:junit4]   2> 195 T337 oasc.CoreContainer.load Registering Log Listener
[junit4:junit4]   2> 224 T337 oasc.CoreContainer.initZooKeeper Zookeeper client=127.0.0.1:63254/solr
[junit4:junit4]   2> 224 T337 oaz.ZooKeeper.<init> Initiating client connection, connectString=127.0.0.1:63254/solr sessionTimeout=5000 watcher=org.apache.solr.common.cloud.ConnectionManager@5778a8
[junit4:junit4]   2> 225 T356 oaz.ClientCnxn$SendThread.startConnect Opening socket connection to server /127.0.0.1:63254
[junit4:junit4]   2> 225 T337 oascc.ConnectionManager.waitForConnected Waiting for client to connect to ZooKeeper
[junit4:junit4]   2> 226 T356 oaz.ClientCnxn$SendThread.primeConnection Socket connection established to 127.0.0.1/127.0.0.1:63254, initiating session
[junit4:junit4]   2> 226 T339 oazs.NIOServerCnxn$Factory.run Accepted socket connection from /127.0.0.1:63266
[junit4:junit4]   2> 226 T339 oazs.NIOServerCnxn.readConnectRequest Client attempting to establish new session at /127.0.0.1:63266
[junit4:junit4]   2> 229 T341 oazs.NIOServerCnxn.finishSessionInit Established session 0x13abfa97f500002 with negotiated timeout 5000 for client /127.0.0.1:63266
[junit4:junit4]   2> 229 T356 oaz.ClientCnxn$SendThread.readConnectResult Session establishment complete on server 127.0.0.1/127.0.0.1:63254, sessionid = 0x13abfa97f500002, negotiated timeout = 5000
[junit4:junit4]   2> 229 T357 oascc.ConnectionManager.process Watcher org.apache.solr.common.cloud.ConnectionManager@5778a8 name:ZooKeeperConnection Watcher:127.0.0.1:63254/solr got event WatchedEvent state:SyncConnected type:None path:null path:null type:None
[junit4:junit4]   2> 229 T337 oascc.ConnectionManager.waitForConnected Client is connected to ZooKeeper
[junit4:junit4]   2> 231 T342 oazs.PrepRequestProcessor.pRequest Got user-level KeeperException when processing sessionid:0x13abfa97f500002 type:create cxid:0x2 zxid:0xfffffffffffffffe txntype:unknown reqpath:n/a Error Path:/solr/overseer Error:KeeperErrorCode = NodeExists for /solr/overseer
[junit4:junit4]   2> 232 T337 oascc.SolrZkClient.makePath makePath: /live_nodes
[junit4:junit4]   2> 234 T337 oasc.ZkController.createEphemeralLiveNode Register node as live in ZooKeeper:/live_nodes/127.0.0.1:63261_solr
[junit4:junit4]   2> 235 T342 oazs.PrepRequestProcessor.pRequest Got user-level KeeperException when processing sessionid:0x13abfa97f500002 type:delete cxid:0x7 zxid:0xfffffffffffffffe txntype:unknown reqpath:n/a Error Path:/solr/live_nodes/127.0.0.1:63261_solr Error:KeeperErrorCode = NoNode for /solr/live_nodes/127.0.0.1:63261_solr
[junit4:junit4]   2> 236 T337 oascc.SolrZkClient.makePath makePath: /live_nodes/127.0.0.1:63261_solr
[junit4:junit4]   2> 238 T337 oashc.HttpShardHandlerFactory.getParameter Setting socketTimeout to: 0
[junit4:junit4]   2> 238 T337 oashc.HttpShardHandlerFactory.getParameter Setting urlScheme to: http://
[junit4:junit4]   2> 238 T337 oashc.HttpShardHandlerFactory.getParameter Setting connTimeout to: 0
[junit4:junit4]   2> 238 T337 oashc.HttpShardHandlerFactory.getParameter Setting maxConnectionsPerHost to: 20
[junit4:junit4]   2> 239 T337 oashc.HttpShardHandlerFactory.getParameter Setting corePoolSize to: 0
[junit4:junit4]   2> 239 T337 oashc.HttpShardHandlerFactory.getParameter Setting maximumPoolSize to: 2147483647
[junit4:junit4]   2> 239 T337 oashc.HttpShardHandlerFactory.getParameter Setting maxThreadIdleTime to: 5
[junit4:junit4]   2> 239 T337 oashc.HttpShardHandlerFactory.getParameter Setting sizeOfQueue to: -1
[junit4:junit4]   2> 241 T337 oashc.HttpShardHandlerFactory.getParameter Setting fairnessPolicy to: false
[junit4:junit4]   2> 241 T337 oascsi.HttpClientUtil.createClient Creating new http client, config:maxConnectionsPerHost=20&maxConnections=10000&socketTimeout=0&connTimeout=0&retry=false
[junit4:junit4]   2> 245 T337 oascc.SolrZkClient.makePath makePath: /overseer_elect/election
[junit4:junit4]   2> 250 T342 oazs.PrepRequestProcessor.pRequest Got user-level KeeperException when processing sessionid:0x13abfa97f500002 type:delete cxid:0x15 zxid:0xfffffffffffffffe txntype:unknown reqpath:n/a Error Path:/solr/overseer_elect/leader Error:KeeperErrorCode = NoNode for /solr/overseer_elect/leader
[junit4:junit4]   2> 251 T337 oascc.SolrZkClient.makePath makePath: /overseer_elect/leader
[junit4:junit4]   2> 253 T337 oasc.Overseer.start Overseer (id=88593877393473538-127.0.0.1:63261_solr-n_0000000000) starting
[junit4:junit4]   2> 255 T342 oazs.PrepRequestProcessor.pRequest Got user-level KeeperException when processing sessionid:0x13abfa97f500002 type:create cxid:0x1a zxid:0xfffffffffffffffe txntype:unknown reqpath:n/a Error Path:/solr/overseer Error:KeeperErrorCode = NodeExists for /solr/overseer
[junit4:junit4]   2> 255 T342 oazs.PrepRequestProcessor.pRequest Got user-level KeeperException when processing sessionid:0x13abfa97f500002 type:create cxid:0x1b zxid:0xfffffffffffffffe txntype:unknown reqpath:n/a Error Path:/solr/overseer Error:KeeperErrorCode = NodeExists for /solr/overseer
[junit4:junit4]   2> 257 T342 oazs.PrepRequestProcessor.pRequest Got user-level KeeperException when processing sessionid:0x13abfa97f500002 type:create cxid:0x1c zxid:0xfffffffffffffffe txntype:unknown reqpath:n/a Error Path:/solr/overseer Error:KeeperErrorCode = NodeExists for /solr/overseer
[junit4:junit4]   2> 259 T342 oazs.PrepRequestProcessor.pRequest Got user-level KeeperException when processing sessionid:0x13abfa97f500002 type:create cxid:0x1d zxid:0xfffffffffffffffe txntype:unknown reqpath:n/a Error Path:/solr/overseer Error:KeeperErrorCode = NodeExists for /solr/overseer
[junit4:junit4]   2> 260 T359 oasc.OverseerCollectionProcessor.run Process current queue of collection messages
[junit4:junit4]   2> 262 T337 oascc.SolrZkClient.makePath makePath: /clusterstate.json
[junit4:junit4]   2> 265 T337 oascc.ZkStateReader.createClusterStateWatchersAndUpdate Updating cluster state from ZooKeeper... 
[junit4:junit4]   2> 267 T358 oasc.Overseer$ClusterStateUpdater.run Starting to work on the main queue
[junit4:junit4]   2> 270 T337 oasc.CoreContainer.create Creating SolrCore 'collection1' using instanceDir: C:\Users\JenkinsSlave\workspace\Lucene-Solr-4.x-Windows\solr\build\solr-core\test-files\solr\collection1
[junit4:junit4]   2> 270 T337 oasc.ZkController.createCollectionZkNode Check for collection zkNode:control_collection
[junit4:junit4]   2> 271 T337 oasc.ZkController.createCollectionZkNode Collection zkNode exists
[junit4:junit4]   2> 271 T337 oasc.ZkController.readConfigName Load collection config from:/collections/control_collection
[junit4:junit4]   2> 272 T337 oasc.SolrResourceLoader.<init> new SolrResourceLoader for directory: 'C:\Users\JenkinsSlave\workspace\Lucene-Solr-4.x-Windows\solr\build\solr-core\test-files\solr\collection1\'
[junit4:junit4]   2> 274 T337 oasc.SolrResourceLoader.replaceClassLoader Adding 'file:/C:/Users/JenkinsSlave/workspace/Lucene-Solr-4.x-Windows/solr/build/solr-core/test-files/solr/collection1/lib/classes/' to classloader
[junit4:junit4]   2> 274 T337 oasc.SolrResourceLoader.replaceClassLoader Adding 'file:/C:/Users/JenkinsSlave/workspace/Lucene-Solr-4.x-Windows/solr/build/solr-core/test-files/solr/collection1/lib/README' to classloader
[junit4:junit4]   2> 303 T337 oasc.SolrConfig.<init> Using Lucene MatchVersion: LUCENE_41
[junit4:junit4]   2> 346 T337 oasc.SolrConfig.<init> Loaded SolrConfig: solrconfig.xml
[junit4:junit4]   2> 348 T337 oass.IndexSchema.readSchema Reading Solr Schema
[junit4:junit4]   2> 352 T337 oass.IndexSchema.readSchema Schema name=test
[junit4:junit4]   2> 853 T337 oass.OpenExchangeRatesOrgProvider.init Initialized with rates=open-exchange-rates.json, refreshInterval=1440.
[junit4:junit4]   2> 861 T337 oass.IndexSchema.readSchema default search field in schema is text
[junit4:junit4]   2> 865 T337 oass.IndexSchema.readSchema unique key field: id
[junit4:junit4]   2> 875 T337 oass.FileExchangeRateProvider.reload Reloading exchange rates from file currency.xml
[junit4:junit4]   2> 880 T337 oass.FileExchangeRateProvider.reload Reloading exchange rates from file currency.xml
[junit4:junit4]   2> 885 T337 oass.OpenExchangeRatesOrgProvider.reload Reloading exchange rates from open-exchange-rates.json
[junit4:junit4]   2> 885 T337 oass.OpenExchangeRatesOrgProvider.reload Reloading exchange rates from open-exchange-rates.json
[junit4:junit4]   2> 887 T337 oasc.SolrCore.<init> [collection1] Opening new SolrCore at C:\Users\JenkinsSlave\workspace\Lucene-Solr-4.x-Windows\solr\build\solr-core\test-files\solr\collection1\, dataDir=.\org.apache.solr.cloud.BasicDistributedZkTest-1351835287369/control/data\
[junit4:junit4]   2> 887 T337 oasc.JmxMonitoredMap.<init> JMX monitoring is enabled. Adding Solr mbeans to JMX Server: com.sun.jmx.mbeanserver.JmxMBeanServer@5f0f87
[junit4:junit4]   2> 888 T337 oasc.SolrCore.getNewIndexDir New index directory detected: old=null new=.\org.apache.solr.cloud.BasicDistributedZkTest-1351835287369/control/data\index/
[junit4:junit4]   2> 889 T337 oasc.SolrCore.initIndex WARNING [collection1] Solr index directory '.\org.apache.solr.cloud.BasicDistributedZkTest-1351835287369\control\data\index' doesn't exist. Creating new index...
[junit4:junit4]   2> 889 T337 oasc.CachingDirectoryFactory.get return new directory for C:\Users\JenkinsSlave\workspace\Lucene-Solr-4.x-Windows\solr\build\solr-core\test\J0\.\org.apache.solr.cloud.BasicDistributedZkTest-1351835287369\control\data\index forceNew:false
[junit4:junit4]   2> 897 T337 oasc.SolrDeletionPolicy.onCommit SolrDeletionPolicy.onCommit: commits:num=1
[junit4:junit4]   2> 		commit{dir=NRTCachingDirectory(org.apache.lucene.store.SimpleFSDirectory@C:\Users\JenkinsSlave\workspace\Lucene-Solr-4.x-Windows\solr\build\solr-core\test\J0\org.apache.solr.cloud.BasicDistributedZkTest-1351835287369\control\data\index lockFactory=org.apache.lucene.store.NativeFSLockFactory@1d8dfbf; maxCacheMB=48.0 maxMergeSizeMB=4.0),segFN=segments_1,generation=1,filenames=[segments_1]
[junit4:junit4]   2> 897 T337 oasc.SolrDeletionPolicy.updateCommits newest commit = 1
[junit4:junit4]   2> 899 T337 oasc.SolrCore.initWriters created xml: solr.XMLResponseWriter
[junit4:junit4]   2> 901 T337 oasup.UpdateRequestProcessorChain.init inserting DistributedUpdateProcessorFactory into updateRequestProcessorChain "dedupe"
[junit4:junit4]   2> 901 T337 oasup.UpdateRequestProcessorChain.init inserting DistributedUpdateProcessorFactory into updateRequestProcessorChain "dedupe-allfields"
[junit4:junit4]   2> 902 T337 oasup.UpdateRequestProcessorChain.init inserting DistributedUpdateProcessorFactory into updateRequestProcessorChain "stored_sig"
[junit4:junit4]   2> 902 T337 oasup.UpdateRequestProcessorChain.init inserting DistributedUpdateProcessorFactory into updateRequestProcessorChain "uniq-fields"
[junit4:junit4]   2> 903 T337 oasup.UpdateRequestProcessorChain.init inserting DistributedUpdateProcessorFactory into updateRequestProcessorChain "distrib-dup-test-chain-implicit"
[junit4:junit4]   2> 903 T337 oasc.RequestHandlers.initHandlersFromConfig adding lazy requestHandler: solr.ReplicationHandler
[junit4:junit4]   2> 903 T337 oasc.RequestHandlers.initHandlersFromConfig created /replication: solr.ReplicationHandler
[junit4:junit4]   2> 904 T337 oasc.RequestHandlers.initHandlersFromConfig created standard: solr.StandardRequestHandler
[junit4:junit4]   2> 904 T337 oasc.RequestHandlers.initHandlersFromConfig created /get: solr.RealTimeGetHandler
[junit4:junit4]   2> 904 T337 oasc.RequestHandlers.initHandlersFromConfig created dismax: solr.SearchHandler
[junit4:junit4]   2> 904 T337 oasc.RequestHandlers.initHandlersFromConfig created mock: org.apache.solr.core.MockQuerySenderListenerReqHandler
[junit4:junit4]   2> 904 T337 oasc.RequestHandlers.initHandlersFromConfig created /admin/: org.apache.solr.handler.admin.AdminHandlers
[junit4:junit4]   2> 905 T337 oasc.RequestHandlers.initHandlersFromConfig created defaults: solr.StandardRequestHandler
[junit4:junit4]   2> 905 T337 oasc.RequestHandlers.initHandlersFromConfig adding lazy requestHandler: solr.StandardRequestHandler
[junit4:junit4]   2> 905 T337 oasc.RequestHandlers.initHandlersFromConfig created lazy: solr.StandardRequestHandler
[junit4:junit4]   2> 906 T337 oasc.RequestHandlers.initHandlersFromConfig created /update: solr.UpdateRequestHandler
[junit4:junit4]   2> 906 T337 oasc.RequestHandlers.initHandlersFromConfig created /terms: org.apache.solr.handler.component.SearchHandler
[junit4:junit4]   2> 906 T337 oasc.RequestHandlers.initHandlersFromConfig created spellCheckCompRH: org.apache.solr.handler.component.SearchHandler
[junit4:junit4]   2> 906 T337 oasc.RequestHandlers.initHandlersFromConfig created spellCheckCompRH_Direct: org.apache.solr.handler.component.SearchHandler
[junit4:junit4]   2> 906 T337 oasc.RequestHandlers.initHandlersFromConfig created spellCheckWithWordbreak: org.apache.solr.handler.component.SearchHandler
[junit4:junit4]   2> 907 T337 oasc.RequestHandlers.initHandlersFromConfig created spellCheckWithWordbreak_Direct: org.apache.solr.handler.component.SearchHandler
[junit4:junit4]   2> 907 T337 oasc.RequestHandlers.initHandlersFromConfig created spellCheckCompRH1: org.apache.solr.handler.component.SearchHandler
[junit4:junit4]   2> 907 T337 oasc.RequestHandlers.initHandlersFromConfig created tvrh: org.apache.solr.handler.component.SearchHandler
[junit4:junit4]   2> 908 T337 oasc.RequestHandlers.initHandlersFromConfig created /mlt: solr.MoreLikeThisHandler
[junit4:junit4]   2> 908 T337 oasc.RequestHandlers.initHandlersFromConfig created /debug/dump: solr.DumpRequestHandler
[junit4:junit4]   2> 914 T337 oashl.XMLLoader.init xsltCacheLifetimeSeconds=60
[junit4:junit4]   2> 917 T337 oasc.SolrCore.initDeprecatedSupport WARNING solrconfig.xml uses deprecated <admin/gettableFiles>, Please update your config to use the ShowFileRequestHandler.
[junit4:junit4]   2> 918 T337 oasc.SolrCore.initDeprecatedSupport WARNING adding ShowFileRequestHandler with hidden files: [SCHEMA.XML, OLD_SYNONYMS.TXT, STOPWORDS.TXT, PROTWORDS.TXT, OPEN-EXCHANGE-RATES.JSON, SYNONYMS.TXT, CURRENCY.XML, MAPPING-ISOLATIN1ACCENT.TXT]
[junit4:junit4]   2> 921 T337 oass.SolrIndexSearcher.<init> Opening Searcher@123b4a main
[junit4:junit4]   2> 923 T337 oasu.CommitTracker.<init> Hard AutoCommit: disabled
[junit4:junit4]   2> 923 T337 oasu.CommitTracker.<init> Soft AutoCommit: disabled
[junit4:junit4]   2> 924 T337 oashc.SpellCheckComponent.inform Initializing spell checkers
[junit4:junit4]   2> 931 T337 oass.DirectSolrSpellChecker.init init: {name=direct,classname=DirectSolrSpellChecker,field=lowerfilt,minQueryLength=3}
[junit4:junit4]   2> 965 T360 oasc.SolrCore.registerSearcher [collection1] Registered new searcher Searcher@123b4a main{StandardDirectoryReader(segments_1:1)}
[junit4:junit4]   2> 968 T337 oasc.ZkController.publish numShards not found on descriptor - reading it from system property
[junit4:junit4]   2> 968 T342 oazs.PrepRequestProcessor.pRequest Got user-level KeeperException when processing sessionid:0x13abfa97f500002 type:create cxid:0x53 zxid:0xfffffffffffffffe txntype:unknown reqpath:n/a Error Path:/solr/overseer/queue Error:KeeperErrorCode = NoNode for /solr/overseer/queue
[junit4:junit4]   2> 972 T337 oasc.CoreContainer.register registering core: collection1
[junit4:junit4]   2> 972 T337 oasc.ZkController.register Register shard - core:collection1 address:http://127.0.0.1:63261/solr shardId:control_shard
[junit4:junit4]   2> 973 T337 oascc.SolrZkClient.makePath makePath: /collections/control_collection/leader_elect/control_shard/election
[junit4:junit4]   2> 980 T342 oazs.PrepRequestProcessor.pRequest Got user-level KeeperException when processing sessionid:0x13abfa97f500002 type:delete cxid:0x62 zxid:0xfffffffffffffffe txntype:unknown reqpath:n/a Error Path:/solr/collections/control_collection/leaders Error:KeeperErrorCode = NoNode for /solr/collections/control_collection/leaders
[junit4:junit4]   2> 982 T337 oasc.ShardLeaderElectionContext.runLeaderProcess Running the leader process.
[junit4:junit4]   2> 982 T342 oazs.PrepRequestProcessor.pRequest Got user-level KeeperException when processing sessionid:0x13abfa97f500002 type:create cxid:0x63 zxid:0xfffffffffffffffe txntype:unknown reqpath:n/a Error Path:/solr/overseer Error:KeeperErrorCode = NodeExists for /solr/overseer
[junit4:junit4]   2> 993 T358 oascc.ZkStateReader.updateClusterState Updating cloud state from ZooKeeper... 
[junit4:junit4]   2> 994 T358 oasc.Overseer$ClusterStateUpdater.updateState Update state numShards=null message={
[junit4:junit4]   2> 	  "operation":"state",
[junit4:junit4]   2> 	  "numShards":null,
[junit4:junit4]   2> 	  "shard":"control_shard",
[junit4:junit4]   2> 	  "roles":null,
[junit4:junit4]   2> 	  "state":"down",
[junit4:junit4]   2> 	  "core":"collection1",
[junit4:junit4]   2> 	  "collection":"control_collection",
[junit4:junit4]   2> 	  "node_name":"127.0.0.1:63261_solr",
[junit4:junit4]   2> 	  "base_url":"http://127.0.0.1:63261/solr"}
[junit4:junit4]   2> 994 T342 oazs.PrepRequestProcessor.pRequest Got user-level KeeperException when processing sessionid:0x13abfa97f500002 type:create cxid:0x6a zxid:0xfffffffffffffffe txntype:unknown reqpath:n/a Error Path:/solr/overseer/queue-work Error:KeeperErrorCode = NoNode for /solr/overseer/queue-work
[junit4:junit4]   2> 1013 T357 oascc.ZkStateReader$2.process A cluster state change has occurred - updating... (1)
[junit4:junit4]   2> 1347 T337 oasc.ShardLeaderElectionContext.waitForReplicasToComeUp Enough replicas found to continue.
[junit4:junit4]   2> 1347 T337 oasc.ShardLeaderElectionContext.runLeaderProcess I may be the new leader - try and sync
[junit4:junit4]   2> 1347 T337 oasc.SyncStrategy.sync Sync replicas to http://127.0.0.1:63261/solr/collection1/
[junit4:junit4]   2> 1348 T337 oasc.SyncStrategy.syncReplicas Sync Success - now sync replicas to me
[junit4:junit4]   2> 1349 T337 oasc.SyncStrategy.syncToMe http://127.0.0.1:63261/solr/collection1/ has no replicas
[junit4:junit4]   2> 1350 T337 oasc.ShardLeaderElectionContext.runLeaderProcess I am the new leader: http://127.0.0.1:63261/solr/collection1/
[junit4:junit4]   2> 1350 T337 oascc.SolrZkClient.makePath makePath: /collections/control_collection/leaders/control_shard
[junit4:junit4]   2> 1357 T342 oazs.PrepRequestProcessor.pRequest Got user-level KeeperException when processing sessionid:0x13abfa97f500002 type:create cxid:0x88 zxid:0xfffffffffffffffe txntype:unknown reqpath:n/a Error Path:/solr/overseer Error:KeeperErrorCode = NodeExists for /solr/overseer
[junit4:junit4]   2> 1386 T358 oascc.ZkStateReader.updateClusterState Updating cloud state from ZooKeeper... 
[junit4:junit4]   2> 1395 T357 oascc.ZkStateReader$2.process A cluster state change has occurred - updating... (1)
[junit4:junit4]   2> 1432 T337 oasc.ZkController.register We are http://127.0.0.1:63261/solr/collection1/ and leader is http://127.0.0.1:63261/solr/collection1/
[junit4:junit4]   2> 1432 T337 oasc.ZkController.register No LogReplay needed for core=collection1 baseURL=http://127.0.0.1:63261/solr
[junit4:junit4]   2> 1433 T337 oasc.ZkController.checkRecovery I am the leader, no recovery necessary
[junit4:junit4]   2> 1433 T337 oasc.ZkController.publish numShards not found on descriptor - reading it from system property
[junit4:junit4]   2> 1436 T337 oascc.ZkStateReader.updateClusterState Updating cloud state from ZooKeeper... 
[junit4:junit4]   2> 1438 T337 oass.SolrDispatchFilter.init user.dir=C:\Users\JenkinsSlave\workspace\Lucene-Solr-4.x-Windows\solr\build\solr-core\test\J0
[junit4:junit4]   2> 1438 T337 oass.SolrDispatchFilter.init SolrDispatchFilter.init() done
[junit4:junit4]   2> 1439 T337 oascsi.HttpClientUtil.createClient Creating new http client, config:maxConnections=128&maxConnectionsPerHost=32&followRedirects=false
[junit4:junit4]   2> 1661 T337 oejs.Server.doStart jetty-8.1.2.v20120308
[junit4:junit4]   2> 1664 T337 oejs.AbstractConnector.doStart Started SelectChannelConnector@0.0.0.0:63267
[junit4:junit4]   2> 1665 T337 oasc.SolrResourceLoader.locateSolrHome JNDI not configured for solr (NoInitialContextEx)
[junit4:junit4]   2> 1665 T337 oasc.SolrResourceLoader.locateSolrHome using system property solr.solr.home: C:\Users\JenkinsSlave\workspace\Lucene-Solr-4.x-Windows\solr\build\solr-core\test\J0\.\solrtest-jetty1-1351835288818
[junit4:junit4]   2> 1665 T337 oasc.SolrResourceLoader.<init> new SolrResourceLoader for deduced Solr Home: 'C:\Users\JenkinsSlave\workspace\Lucene-Solr-4.x-Windows\solr\build\solr-core\test\J0\.\solrtest-jetty1-1351835288818\'
[junit4:junit4]   2> 1688 T337 oass.SolrDispatchFilter.init SolrDispatchFilter.init()
[junit4:junit4]   2> 1689 T337 oasc.SolrResourceLoader.locateSolrHome JNDI not configured for solr (NoInitialContextEx)
[junit4:junit4]   2> 1689 T337 oasc.SolrResourceLoader.locateSolrHome using system property solr.solr.home: C:\Users\JenkinsSlave\workspace\Lucene-Solr-4.x-Windows\solr\build\solr-core\test\J0\.\solrtest-jetty1-1351835288818
[junit4:junit4]   2> 1689 T337 oasc.CoreContainer$Initializer.initialize looking for solr.xml: C:\Users\JenkinsSlave\workspace\Lucene-Solr-4.x-Windows\solr\build\solr-core\test\J0\.\solrtest-jetty1-1351835288818\solr.xml
[junit4:junit4]   2> 1689 T337 oasc.CoreContainer.<init> New CoreContainer 17418918
[junit4:junit4]   2> 1689 T337 oasc.CoreContainer.load Loading CoreContainer using Solr Home: 'C:\Users\JenkinsSlave\workspace\Lucene-Solr-4.x-Windows\solr\build\solr-core\test\J0\.\solrtest-jetty1-1351835288818\'
[junit4:junit4]   2> 1690 T337 oasc.SolrResourceLoader.<init> new SolrResourceLoader for directory: 'C:\Users\JenkinsSlave\workspace\Lucene-Solr-4.x-Windows\solr\build\solr-core\test\J0\.\solrtest-jetty1-1351835288818\'
[junit4:junit4]   2> 1708 T337 oasc.CoreContainer.load Registering Log Listener
[junit4:junit4]   2> 1721 T337 oasc.CoreContainer.initZooKeeper Zookeeper client=127.0.0.1:63254/solr
[junit4:junit4]   2> 1721 T337 oaz.ZooKeeper.<init> Initiating client connection, connectString=127.0.0.1:63254/solr sessionTimeout=5000 watcher=org.apache.solr.common.cloud.ConnectionManager@1865cd6
[junit4:junit4]   2> 1722 T370 oaz.ClientCnxn$SendThread.startConnect Opening socket connection to server /127.0.0.1:63254
[junit4:junit4]   2> 1722 T337 oascc.ConnectionManager.waitForConnected Waiting for client to connect to ZooKeeper
[junit4:junit4]   2> 1723 T370 oaz.ClientCnxn$SendThread.primeConnection Socket connection established to 127.0.0.1/127.0.0.1:63254, initiating session
[junit4:junit4]   2> 1723 T339 oazs.NIOServerCnxn$Factory.run Accepted socket connection from /127.0.0.1:63272
[junit4:junit4]   2> 1724 T339 oazs.NIOServerCnxn.readConnectRequest Client attempting to establish new session at /127.0.0.1:63272
[junit4:junit4]   2> 1731 T341 oazs.NIOServerCnxn.finishSessionInit Established session 0x13abfa97f500003 with negotiated timeout 5000 for client /127.0.0.1:63272
[junit4:junit4]   2> 1731 T370 oaz.ClientCnxn$SendThread.readConnectResult Session establishment complete on server 127.0.0.1/127.0.0.1:63254, sessionid = 0x13abfa97f500003, negotiated timeout = 5000
[junit4:junit4]   2> 1731 T371 oascc.ConnectionManager.process Watcher org.apache.solr.common.cloud.ConnectionManager@1865cd6 name:ZooKeeperConnection Watcher:127.0.0.1:63254/solr got event WatchedEvent state:SyncConnected type:None path:null path:null type:None
[junit4:junit4]   2> 1731 T337 oascc.ConnectionManager.waitForConnected Client is connected to ZooKeeper
[junit4:junit4]   2> 1733 T342 oazs.PrepRequestProcessor.pRequest Got user-level KeeperException when processing sessionid:0x13abfa97f500003 type:create cxid:0x1 zxid:0xfffffffffffffffe txntype:unknown reqpath:n/a Error Path:/solr/overseer Error:KeeperErrorCode = NodeExists for /solr/overseer
[junit4:junit4]   2> 1734 T342 oazs.PrepRequestProcessor.pRequest Got user-level KeeperException when processing sessionid:0x13abfa97f500003 type:create cxid:0x2 zxid:0xfffffffffffffffe txntype:unknown reqpath:n/a Error Path:/solr/overseer Error:KeeperErrorCode = NodeExists for /solr/overseer
[junit4:junit4]   2> 1736 T337 oasc.ZkController.createEphemeralLiveNode Register node as live in ZooKeeper:/live_nodes/127.0.0.1:63267_solr
[junit4:junit4]   2> 1737 T342 oazs.PrepRequestProcessor.pRequest Got user-level KeeperException when processing sessionid:0x13abfa97f500003 type:delete cxid:0x4 zxid:0xfffffffffffffffe txntype:unknown reqpath:n/a Error Path:/solr/live_nodes/127.0.0.1:63267_solr Error:KeeperErrorCode = NoNode for /solr/live_nodes/127.0.0.1:63267_solr
[junit4:junit4]   2> 1739 T337 oascc.SolrZkClient.makePath makePath: /live_nodes/127.0.0.1:63267_solr
[junit4:junit4]   2> 1741 T357 oascc.ZkStateReader$3.process Updating live nodes... (2)
[junit4:junit4]   2> 1741 T337 oashc.HttpShardHandlerFactory.getParameter Setting socketTimeout to: 0
[junit4:junit4]   2> 1741 T337 oashc.HttpShardHandlerFactory.getParameter Setting urlScheme to: http://
[junit4:junit4]   2> 1742 T337 oashc.HttpShardHandlerFactory.getParameter Setting connTimeout to: 0
[junit4:junit4]   2> 1742 T337 oashc.HttpShardHandlerFactory.getParameter Setting maxConnectionsPerHost to: 20
[junit4:junit4]   2> 1743 T337 oashc.HttpShardHandlerFactory.getParameter Setting corePoolSize to: 0
[junit4:junit4]   2> 1743 T337 oashc.HttpShardHandlerFactory.getParameter Setting maximumPoolSize to: 2147483647
[junit4:junit4]   2> 1743 T337 oashc.HttpShardHandlerFactory.getParameter Setting maxThreadIdleTime to: 5
[junit4:junit4]   2> 1743 T337 oashc.HttpShardHandlerFactory.getParameter Setting sizeOfQueue to: -1
[junit4:junit4]   2> 1743 T337 oashc.HttpShardHandlerFactory.getParameter Setting fairnessPolicy to: false
[junit4:junit4]   2> 1743 T337 oascsi.HttpClientUtil.createClient Creating new http client, config:maxConnectionsPerHost=20&maxConnections=10000&socketTimeout=0&connTimeout=0&retry=false
[junit4:junit4]   2> 1751 T337 oascc.ZkStateReader.createClusterStateWatchersAndUpdate Updating cluster state from ZooKeeper... 
[junit4:junit4]   2> 1754 T337 oasc.CoreContainer.create Creating SolrCore 'collection1' using instanceDir: C:\Users\JenkinsSlave\workspace\Lucene-Solr-4.x-Windows\solr\build\solr-core\test\J0\.\solrtest-jetty1-1351835288818\collection1
[junit4:junit4]   2> 1755 T337 oasc.ZkController.createCollectionZkNode Check for collection zkNode:collection1
[junit4:junit4]   2> 1755 T337 oasc.ZkController.createCollectionZkNode Collection zkNode exists
[junit4:junit4]   2> 1755 T337 oasc.ZkController.readConfigName Load collection config from:/collections/collection1
[junit4:junit4]   2> 1756 T337 oasc.SolrResourceLoader.<init> new SolrResourceLoader for directory: 'C:\Users\JenkinsSlave\workspace\Lucene-Solr-4.x-Windows\solr\build\solr-core\test\J0\.\solrtest-jetty1-1351835288818\collection1\'
[junit4:junit4]   2> 1758 T337 oasc.SolrResourceLoader.replaceClassLoader Adding 'file:/C:/Users/JenkinsSlave/workspace/Lucene-Solr-4.x-Windows/solr/build/solr-core/test/J0/solrtest-jetty1-1351835288818/collection1/lib/classes/' to classloader
[junit4:junit4]   2> 1758 T337 oasc.SolrResourceLoader.replaceClassLoader Adding 'file:/C:/Users/JenkinsSlave/workspace/Lucene-Solr-4.x-Windows/solr/build/solr-core/test/J0/solrtest-jetty1-1351835288818/collection1/lib/README' to classloader
[junit4:junit4]   2> 1760 T358 oascc.ZkStateReader.updateClusterState Updating cloud state from ZooKeeper... 
[junit4:junit4]   2> 1762 T358 oasc.Overseer$ClusterStateUpdater.updateState Update state numShards=null message={
[junit4:junit4]   2> 	  "operation":"state",
[junit4:junit4]   2> 	  "numShards":null,
[junit4:junit4]   2> 	  "shard":"control_shard",
[junit4:junit4]   2> 	  "roles":null,
[junit4:junit4]   2> 	  "state":"active",
[junit4:junit4]   2> 	  "core":"collection1",
[junit4:junit4]   2> 	  "collection":"control_collection",
[junit4:junit4]   2> 	  "node_name":"127.0.0.1:63261_solr",
[junit4:junit4]   2> 	  "base_url":"http://127.0.0.1:63261/solr"}
[junit4:junit4]   2> 1767 T357 oascc.ZkStateReader$2.process A cluster state change has occurred - updating... (2)
[junit4:junit4]   2> 1768 T371 oascc.ZkStateReader$2.process A cluster state change has occurred - updating... (2)
[junit4:junit4]   2> 1808 T337 oasc.SolrConfig.<init> Using Lucene MatchVersion: LUCENE_41
[junit4:junit4]   2> 1849 T337 oasc.SolrConfig.<init> Loaded SolrConfig: solrconfig.xml
[junit4:junit4]   2> 1851 T337 oass.IndexSchema.readSchema Reading Solr Schema
[junit4:junit4]   2> 1853 T337 oass.IndexSchema.readSchema Schema name=test
[junit4:junit4]   2> 2375 T337 oass.OpenExchangeRatesOrgProvider.init Initialized with rates=open-exchange-rates.json, refreshInterval=1440.
[junit4:junit4]   2> 2383 T337 oass.IndexSchema.readSchema default search field in schema is text
[junit4:junit4]   2> 2387 T337 oass.IndexSchema.readSchema unique key field: id
[junit4:junit4]   2> 2397 T337 oass.FileExchangeRateProvider.reload Reloading exchange rates from file currency.xml
[junit4:junit4]   2> 2401 T337 oass.FileExchangeRateProvider.reload Reloading exchange rates from file currency.xml
[junit4:junit4]   2> 2404 T337 oass.OpenExchangeRatesOrgProvider.reload Reloading exchange rates from open-exchange-rates.json
[junit4:junit4]   2> 2406 T337 oass.OpenExchangeRatesOrgProvider.reload Reloading exchange rates from open-exchange-rates.json
[junit4:junit4]   2> 2406 T337 oasc.SolrCore.<init> [collection1] Opening new SolrCore at C:\Users\JenkinsSlave\workspace\Lucene-Solr-4.x-Windows\solr\build\solr-core\test\J0\.\solrtest-jetty1-1351835288818\collection1\, dataDir=.\org.apache.solr.cloud.BasicDistributedZkTest-1351835287369/jetty1\
[junit4:junit4]   2> 2406 T337 oasc.JmxMonitoredMap.<init> JMX monitoring is enabled. Adding Solr mbeans to JMX Server: com.sun.jmx.mbeanserver.JmxMBeanServer@5f0f87
[junit4:junit4]   2> 2408 T337 oasc.SolrCore.getNewIndexDir New index directory detected: old=null new=.\org.apache.solr.cloud.BasicDistributedZkTest-1351835287369/jetty1\index/
[junit4:junit4]   2> 2409 T337 oasc.SolrCore.initIndex WARNING [collection1] Solr index directory '.\org.apache.solr.cloud.BasicDistributedZkTest-1351835287369\jetty1\index' doesn't exist. Creating new index...
[junit4:junit4]   2> 2409 T337 oasc.CachingDirectoryFactory.get return new directory for C:\Users\JenkinsSlave\workspace\Lucene-Solr-4.x-Windows\solr\build\solr-core\test\J0\.\org.apache.solr.cloud.BasicDistributedZkTest-1351835287369\jetty1\index forceNew:false
[junit4:junit4]   2> 2418 T337 oasc.SolrDeletionPolicy.onCommit SolrDeletionPolicy.onCommit: commits:num=1
[junit4:junit4]   2> 		commit{dir=NRTCachingDirectory(org.apache.lucene.store.SimpleFSDirectory@C:\Users\JenkinsSlave\workspace\Lucene-Solr-4.x-Windows\solr\build\solr-core\test\J0\org.apache.solr.cloud.BasicDistributedZkTest-1351835287369\jetty1\index lockFactory=org.apache.lucene.store.NativeFSLockFactory@806a54; maxCacheMB=48.0 maxMergeSizeMB=4.0),segFN=segments_1,generation=1,filenames=[segments_1]
[junit4:junit4]   2> 2418 T337 oasc.SolrDeletionPolicy.updateCommits newest commit = 1
[junit4:junit4]   2> 2419 T337 oasc.SolrCore.initWriters created xml: solr.XMLResponseWriter
[junit4:junit4]   2> 2420 T337 oasup.UpdateRequestProcessorChain.init inserting DistributedUpdateProcessorFactory into updateRequestProcessorChain "dedupe"
[junit4:junit4]   2> 2420 T337 oasup.UpdateRequestProcessorChain.init inserting DistributedUpdateProcessorFactory into updateRequestProcessorChain "dedupe-allfields"
[junit4:junit4]   2> 2420 T337 oasup.UpdateRequestProcessorChain.init inserting DistributedUpdateProcessorFactory into updateRequestProcessorChain "stored_sig"
[junit4:junit4]   2> 2421 T337 oasup.UpdateRequestProcessorChain.init inserting DistributedUpdateProcessorFactory into updateRequestProcessorChain "uniq-fields"
[junit4:junit4]   2> 2421 T337 oasup.UpdateRequestProcessorChain.init inserting DistributedUpdateProcessorFactory into updateRequestProcessorChain "distrib-dup-test-chain-implicit"
[junit4:junit4]   2> 2421 T337 oasc.RequestHandlers.initHandlersFromConfig adding lazy requestHandler: solr.ReplicationHandler
[junit4:junit4]   2> 2421 T337 oasc.RequestHandlers.initHandlersFromConfig created /replication: solr.ReplicationHandler
[junit4:junit4]   2> 2421 T337 oasc.RequestHandlers.initHandlersFromConfig created standard: solr.StandardRequestHandler
[junit4:junit4]   2> 2421 T337 oasc.RequestHandlers.initHandlersFromConfig created /get: solr.RealTimeGetHandler
[junit4:junit4]   2> 2422 T337 oasc.RequestHandlers.initHandlersFromConfig created dismax: solr.SearchHandler
[junit4:junit4]   2> 2422 T337 oasc.RequestHandlers.initHandlersFromConfig created mock: org.apache.solr.core.MockQuerySenderListenerReqHandler
[junit4:junit4]   2> 2423 T337 oasc.RequestHandlers.initHandlersFromConfig created /admin/: org.apache.solr.handler.admin.AdminHandlers
[junit4:junit4]   2> 2423 T337 oasc.RequestHandlers.initHandlersFromConfig created defaults: solr.StandardRequestHandler
[junit4:junit4]   2> 2423 T337 oasc.RequestHandlers.initHandlersFromConfig adding lazy requestHandler: solr.StandardRequestHandler
[junit4:junit4]   2> 2423 T337 oasc.RequestHandlers.initHandlersFromConfig created lazy: solr.StandardRequestHandler
[junit4:junit4]   2> 2423 T337 oasc.RequestHandlers.initHandlersFromConfig created /update: solr.UpdateRequestHandler
[junit4:junit4]   2> 2424 T337 oasc.RequestHandlers.initHandlersFromConfig created /terms: org.apache.solr.handler.component.SearchHandler
[junit4:junit4]   2> 2424 T337 oasc.RequestHandlers.initHandlersFromConfig created spellCheckCompRH: org.apache.solr.handler.component.SearchHandler
[junit4:junit4]   2> 2424 T337 oasc.RequestHandlers.initHandlersFromConfig created spellCheckCompRH_Direct: org.apache.solr.handler.component.SearchHandler
[junit4:junit4]   2> 2425 T337 oasc.RequestHandlers.initHandlersFromConfig created spellCheckWithWordbreak: org.apache.solr.handler.component.SearchHandler
[junit4:junit4]   2> 2425 T337 oasc.RequestHandlers.initHandlersFromConfig created spellCheckWithWordbreak_Direct: org.apache.solr.handler.component.SearchHandler
[junit4:junit4]   2> 2426 T337 oasc.RequestHandlers.initHandlersFromConfig created spellCheckCompRH1: org.apache.solr.handler.component.SearchHandler
[junit4:junit4]   2> 2426 T337 oasc.RequestHandlers.initHandlersFromConfig created tvrh: org.apache.solr.handler.component.SearchHandler
[junit4:junit4]   2> 2426 T337 oasc.RequestHandlers.initHandlersFromConfig created /mlt: solr.MoreLikeThisHandler
[junit4:junit4]   2> 2426 T337 oasc.RequestHandlers.initHandlersFromConfig created /debug/dump: solr.DumpRequestHandler
[junit4:junit4]   2> 2431 T337 oashl.XMLLoader.init xsltCacheLifetimeSeconds=60
[junit4:junit4]   2> 2435 T337 oasc.SolrCore.initDeprecatedSupport WARNING solrconfig.xml uses deprecated <admin/gettableFiles>, Please update your config to use the ShowFileRequestHandler.
[junit4:junit4]   2> 2436 T337 oasc.SolrCore.initDeprecatedSupport WARNING adding ShowFileRequestHandler with hidden files: [SCHEMA.XML, OLD_SYNONYMS.TXT, STOPWORDS.TXT, PROTWORDS.TXT, OPEN-EXCHANGE-RATES.JSON, SYNONYMS.TXT, CURRENCY.XML, MAPPING-ISOLATIN1ACCENT.TXT]
[junit4:junit4]   2> 2440 T337 oass.SolrIndexSearcher.<init> Opening Searcher@15d31b0 main
[junit4:junit4]   2> 2441 T337 oasu.CommitTracker.<init> Hard AutoCommit: disabled
[junit4:junit4]   2> 2441 T337 oasu.CommitTracker.<init> Soft AutoCommit: disabled
[junit4:junit4]   2> 2442 T337 oashc.SpellCheckComponent.inform Initializing spell checkers
[junit4:junit4]   2> 2449 T337 oass.DirectSolrSpellChecker.init init: {name=direct,classname=DirectSolrSpellChecker,field=lowerfilt,minQueryLength=3}
[junit4:junit4]   2> 2485 T372 oasc.SolrCore.registerSearcher [collection1] Registered new searcher Searcher@15d31b0 main{StandardDirectoryReader(segments_1:1)}
[junit4:junit4]   2> 2488 T337 oasc.ZkController.publish numShards not found on descriptor - reading it from system property
[junit4:junit4]   2> 2496 T358 oascc.ZkStateReader.updateClusterState Updating cloud state from ZooKeeper... 
[junit4:junit4]   2> 2496 T358 oasc.Overseer$ClusterStateUpdater.updateState Update state numShards=2 message={
[junit4:junit4]   2> 	  "operation":"state",
[junit4:junit4]   2> 	  "numShards":"2",
[junit4:junit4]   2> 	  "shard":null,
[junit4:junit4]   2> 	  "roles":null,
[junit4:junit4]   2> 	  "state":"down",
[junit4:junit4]   2> 	  "core":"collection1",
[junit4:junit4]   2> 	  "collection":"collection1",
[junit4:junit4]   2> 	  "node_name":"127.0.0.1:63267_solr",
[junit4:junit4]   2> 	  "base_url":"http://127.0.0.1:63267/solr"}
[junit4:junit4]   2> 2497 T358 oasc.Overseer$ClusterStateUpdater.createCollection Create collection collection1 with numShards 2
[junit4:junit4]   2> 2501 T371 oascc.ZkStateReader$2.process A cluster state change has occurred - updating... (2)
[junit4:junit4]   2> 2501 T357 oascc.ZkStateReader$2.process A cluster state change has occurred - updating... (2)
[junit4:junit4]   2> 2850 T337 oasc.CoreContainer.register registering core: collection1
[junit4:junit4]   2> 2850 T337 oasc.ZkController.register Register shard - core:collection1 address:http://127.0.0.1:63267/solr shardId:shard1
[junit4:junit4]   2> 2850 T337 oascc.SolrZkClient.makePath makePath: /collections/collection1/leader_elect/shard1/election
[junit4:junit4]   2> 2858 T342 oazs.PrepRequestProcessor.pRequest Got user-level KeeperException when processing sessionid:0x13abfa97f500003 type:delete cxid:0x43 zxid:0xfffffffffffffffe txntype:unknown reqpath:n/a Error Path:/solr/collections/collection1/leaders Error:KeeperErrorCode = NoNode for /solr/collections/collection1/leaders
[junit4:junit4]   2> 2860 T337 oasc.ShardLeaderElectionContext.runLeaderProcess Running the leader process.
[junit4:junit4]   2> 2860 T342 oazs.PrepRequestProcessor.pRequest Got user-level KeeperException when processing sessionid:0x13abfa97f500003 type:create cxid:0x44 zxid:0xfffffffffffffffe txntype:unknown reqpath:n/a Error Path:/solr/overseer Error:KeeperErrorCode = NodeExists for /solr/overseer
[junit4:junit4]   2> 2862 T337 oasc.ShardLeaderElectionContext.waitForReplicasToComeUp Enough replicas found to continue.
[junit4:junit4]   2> 2863 T337 oasc.ShardLeaderElectionContext.runLeaderProcess I may be the new leader - try and sync
[junit4:junit4]   2> 2863 T337 oasc.SyncStrategy.sync Sync replicas to http://127.0.0.1:63267/solr/collection1/
[junit4:junit4]   2> 2863 T337 oasc.SyncStrategy.syncReplicas Sync Success - now sync replicas to me
[junit4:junit4]   2> 2864 T337 oasc.SyncStrategy.syncToMe http://127.0.0.1:63267/solr/collection1/ has no replicas
[junit4:junit4]   2> 2864 T337 oasc.ShardLeaderElectionContext.runLeaderProcess I am the new leader: http://127.0.0.1:63267/solr/collection1/
[junit4:junit4]   2> 2864 T337 oascc.SolrZkClient.makePath makePath: /collections/collection1/leaders/shard1
[junit4:junit4]   2> 2866 T358 oascc.ZkStateReader.updateClusterState Updating cloud state from ZooKeeper... 
[junit4:junit4]   2> 2870 T342 oazs.PrepRequestProcessor.pRequest Got user-level KeeperException when processing sessionid:0x13abfa97f500003 type:create cxid:0x4e zxid:0xfffffffffffffffe txntype:unknown reqpath:n/a Error Path:/solr/overseer Error:KeeperErrorCode = NodeExists for /solr/overseer
[junit4:junit4]   2> 2878 T371 oascc.ZkStateReader$2.process A cluster state change has occurred - updating... (2)
[junit4:junit4]   2> 2878 T357 oascc.ZkStateReader$2.process A cluster state change has occurred - updating... (2)
[junit4:junit4]   2> 2910 T337 oasc.ZkController.register We are http://127.0.0.1:63267/solr/collection1/ and leader is http://127.0.0.1:63267/solr/collection1/
[junit4:junit4]   2> 2910 T337 oasc.ZkController.register No LogReplay needed for core=collection1 baseURL=http://127.0.0.1:63267/solr
[junit4:junit4]   2> 2910 T337 oasc.ZkController.checkRecovery I am the leader, no recovery necessary
[junit4:junit4]   2> 2910 T337 oasc.ZkController.publish numShards not found on descriptor - reading it from system property
[junit4:junit4]   2> 2912 T337 oascc.ZkStateReader.updateClusterState Updating cloud state from ZooKeeper... 
[junit4:junit4]   2> 2913 T337 oass.SolrDispatchFilter.init user.dir=C:\Users\JenkinsSlave\workspace\Lucene-Solr-4.x-Windows\solr\build\solr-core\test\J0
[junit4:junit4]   2> 2913 T337 oass.SolrDispatchFilter.init SolrDispatchFilter.init() done
[junit4:junit4]   2> 2913 T337 oascsi.HttpClientUtil.createClient Creating new http client, config:maxConnections=128&maxConnectionsPerHost=32&followRedirects=false
[junit4:junit4]   2> 3138 T337 oejs.Server.doStart jetty-8.1.2.v20120308
[junit4:junit4]   2> 3142 T337 oejs.AbstractConnector.doStart Started SelectChannelConnector@0.0.0.0:63273
[junit4:junit4]   2> 3142 T337 oasc.SolrResourceLoader.locateSolrHome JNDI not configured for solr (NoInitialContextEx)
[junit4:junit4]   2> 3143 T337 oasc.SolrResourceLoader.locateSolrHome using system property solr.solr.home: C:\Users\JenkinsSlave\workspace\Lucene-Solr-4.x-Windows\solr\build\solr-core\test\J0\.\solrtest-jetty2-1351835290285
[junit4:junit4]   2> 3143 T337 oasc.SolrResourceLoader.<init> new SolrResourceLoader for deduced Solr Home: 'C:\Users\JenkinsSlave\workspace\Lucene-Solr-4.x-Windows\solr\build\solr-core\test\J0\.\solrtest-jetty2-1351835290285\'
[junit4:junit4]   2> 3171 T337 oass.SolrDispatchFilter.init SolrDispatchFilter.init()
[junit4:junit4]   2> 3172 T337 oasc.SolrResourceLoader.locateSolrHome JNDI not configured for solr (NoInitialContextEx)
[junit4:junit4]   2> 3172 T337 oasc.SolrResourceLoader.locateSolrHome using system property solr.solr.home: C:\Users\JenkinsSlave\workspace\Lucene-Solr-4.x-Windows\solr\build\solr-core\test\J0\.\solrtest-jetty2-1351835290285
[junit4:junit4]   2> 3172 T337 oasc.CoreContainer$Initializer.initialize looking for solr.xml: C:\Users\JenkinsSlave\workspace\Lucene-Solr-4.x-Windows\solr\build\solr-core\test\J0\.\solrtest-jetty2-1351835290285\solr.xml
[junit4:junit4]   2> 3172 T337 oasc.CoreContainer.<init> New CoreContainer 29227552
[junit4:junit4]   2> 3173 T337 oasc.CoreContainer.load Loading CoreContainer using Solr Home: 'C:\Users\JenkinsSlave\workspace\Lucene-Solr-4.x-Windows\solr\build\solr-core\test\J0\.\solrtest-jetty2-1351835290285\'
[junit4:junit4]   2> 3173 T337 oasc.SolrResourceLoader.<init> new SolrResourceLoader for directory: 'C:\Users\JenkinsSlave\workspace\Lucene-Solr-4.x-Windows\solr\build\solr-core\test\J0\.\solrtest-jetty2-1351835290285\'
[junit4:junit4]   2> 3194 T337 oasc.CoreContainer.load Registering Log Listener
[junit4:junit4]   2> 3208 T337 oasc.CoreContainer.initZooKeeper Zookeeper client=127.0.0.1:63254/solr
[junit4:junit4]   2> 3209 T337 oaz.ZooKeeper.<init> Initiating client connection, connectString=127.0.0.1:63254/solr sessionTimeout=5000 watcher=org.apache.solr.common.cloud.ConnectionManager@1940e22
[junit4:junit4]   2> 3210 T382 oaz.ClientCnxn$SendThread.startConnect Opening socket connection to server /127.0.0.1:63254
[junit4:junit4]   2> 3210 T337 oascc.ConnectionManager.waitForConnected Waiting for client to connect to ZooKeeper
[junit4:junit4]   2> 3211 T382 oaz.ClientCnxn$SendThread.primeConnection Socket connection established to 127.0.0.1/127.0.0.1:63254, initiating session
[junit4:junit4]   2> 3211 T339 oazs.NIOServerCnxn$Factory.run Accepted socket connection from /127.0.0.1:63278
[junit4:junit4]   2> 3212 T339 oazs.NIOServerCnxn.readConnectRequest Client attempting to establish new session at /127.0.0.1:63278
[junit4:junit4]   2> 3226 T341 oazs.NIOServerCnxn.finishSessionInit Established session 0x13abfa97f500004 with negotiated timeout 5000 for client /127.0.0.1:63278
[junit4:junit4]   2> 3226 T382 oaz.ClientCnxn$SendThread.readConnectResult Session establishment complete on server 127.0.0.1/127.0.0.1:63254, sessionid = 0x13abfa97f500004, negotiated timeout = 5000
[junit4:junit4]   2> 3227 T383 oascc.ConnectionManager.process Watcher org.apache.solr.common.cloud.ConnectionManager@1940e22 name:ZooKeeperConnection Watcher:127.0.0.1:63254/solr got event WatchedEvent state:SyncConnected type:None path:null path:null type:None
[junit4:junit4]   2> 3227 T337 oascc.ConnectionManager.waitForConnected Client is connected to ZooKeeper
[junit4:junit4]   2> 3228 T342 oazs.PrepRequestProcessor.pRequest Got user-level KeeperException when processing sessionid:0x13abfa97f500004 type:create cxid:0x1 zxid:0xfffffffffffffffe txntype:unknown reqpath:n/a Error Path:/solr/overseer Error:KeeperErrorCode = NodeExists for /solr/overseer
[junit4:junit4]   2> 3253 T342 oazs.PrepRequestProcessor.pRequest Got user-level KeeperException when processing sessionid:0x13abfa97f500004 type:create cxid:0x2 zxid:0xfffffffffffffffe txntype:unknown reqpath:n/a Error Path:/solr/overseer Error:KeeperErrorCode = NodeExists for /solr/overseer
[junit4:junit4]   2> 3269 T337 oasc.ZkController.createEphemeralLiveNode Register node as live in ZooKeeper:/live_nodes/127.0.0.1:63273_solr
[junit4:junit4]   2> 3269 T342 oazs.PrepRequestProcessor.pRequest Got user-level KeeperException when processing sessionid:0x13abfa97f500004 type:delete cxid:0x4 zxid:0xfffffffffffffffe txntype:unknown reqpath:n/a Error Path:/solr/live_nodes/127.0.0.1:63273_solr Error:KeeperErrorCode = NoNode for /solr/live_nodes/127.0.0.1:63273_solr
[junit4:junit4]   2> 3291 T337 oascc.SolrZkClient.makePath makePath: /live_nodes/127.0.0.1:63273_solr
[junit4:junit4]   2> 3292 T358 oascc.ZkStateReader.updateClusterState Updating cloud state from ZooKeeper... 
[junit4:junit4]   2> 3292 T358 oasc.Overseer$ClusterStateUpdater.updateState Update state numShards=2 message={
[junit4:junit4]   2> 	  "operation":"state",
[junit4:junit4]   2> 	  "numShards":"2",
[junit4:junit4]   2> 	  "shard":"shard1",
[junit4:junit4]   2> 	  "roles":null,
[junit4:junit4]   2> 	  "state":"active",
[junit4:junit4]   2> 	  "core":"collection1",
[junit4:junit4]   2> 	  "collection":"collection1",
[junit4:junit4]   2> 	  "node_name":"127.0.0.1:63267_solr",
[junit4:junit4]   2> 	  "base_url":"http://127.0.0.1:63267/solr"}
[junit4:junit4]   2> 3323 T371 oascc.ZkStateReader$3.process Updating live nodes... (3)
[junit4:junit4]   2> 3324 T337 oashc.HttpShardHandlerFactory.getParameter Setting socketTimeout to: 0
[junit4:junit4]   2> 3324 T337 oashc.HttpShardHandlerFactory.getParameter Setting urlScheme to: http://
[junit4:junit4]   2> 3324 T337 oashc.HttpShardHandlerFactory.getParameter Setting connTimeout to: 0
[junit4:junit4]   2> 3324 T337 oashc.HttpShardHandlerFactory.getParameter Setting maxConnectionsPerHost to: 20
[junit4:junit4]   2> 3324 T337 oashc.HttpShardHandlerFactory.getParameter Setting corePoolSize to: 0
[junit4:junit4]   2> 3324 T337 oashc.HttpShardHandlerFactory.getParameter Setting maximumPoolSize to: 2147483647
[junit4:junit4]   2> 3324 T337 oashc.HttpShardHandlerFactory.getParameter Setting maxThreadIdleTime to: 5
[junit4:junit4]   2> 3324 T337 oashc.HttpShardHandlerFactory.getParameter Setting sizeOfQueue to: -1
[junit4:junit4]   2> 3325 T337 oashc.HttpShardHandlerFactory.getParameter Setting fairnessPolicy to: false
[junit4:junit4]   2> 3326 T337 oascsi.HttpClientUtil.createClient Creating new http client, config:maxConnectionsPerHost=20&maxConnections=10000&socketTimeout=0&connTimeout=0&retry=false
[junit4:junit4]   2> 3377 T371 oascc.ZkStateReader$2.process A cluster state change has occurred - updating... (3)
[junit4:junit4]   2> 3377 T337 oascc.ZkStateReader.createClusterStateWatchersAndUpdate Updating cluster state from ZooKeeper... 
[junit4:junit4]   2> 3394 T357 oascc.ZkStateReader$3.process Updating live nodes... (3)
[junit4:junit4]   2> 3394 T357 oascc.ZkStateReader$2.process A cluster state change has occurred - updating... (3)
[junit4:junit4]   2> 3400 T337 oasc.CoreContainer.create Creating SolrCore 'collection1' using instanceDir: C:\Users\JenkinsSlave\workspace\Lucene-Solr-4.x-Windows\solr\build\solr-core\test\J0\.\solrtest-jetty2-1351835290285\collection1
[junit4:junit4]   2> 3400 T337 oasc.ZkController.createCollectionZkNode Check for collection zkNode:collection1
[junit4:junit4]   2> 3402 T337 oasc.ZkController.createCollectionZkNode Collection zkNode exists
[junit4:junit4]   2> 3402 T337 oasc.ZkController.readConfigName Load collection config from:/collections/collection1
[junit4:junit4]   2> 3404 T337 oasc.SolrResourceLoader.<init> new SolrResourceLoader for directory: 'C:\Users\JenkinsSlave\workspace\Lucene-Solr-4.x-Windows\solr\build\solr-core\test\J0\.\solrtest-jetty2-1351835290285\collection1\'
[junit4:junit4]   2> 3406 T337 oasc.SolrResourceLoader.replaceClassLoader Adding 'file:/C:/Users/JenkinsSlave/workspace/Lucene-Solr-4.x-Windows/solr/build/solr-core/test/J0/solrtest-jetty2-1351835290285/collection1/lib/classes/' to classloader
[junit4:junit4]   2> 3407 T337 oasc.SolrResourceLoader.replaceClassLoader Adding 'file:/C:/Users/JenkinsSlave/workspace/Lucene-Solr-4.x-Windows/solr/build/solr-core/test/J0/solrtest-jetty2-1351835290285/collection1/lib/README' to classloader
[junit4:junit4]   2> 3480 T337 oasc.SolrConfig.<init> Using Lucene MatchVersion: LUCENE_41
[junit4:junit4]   2> 3531 T337 oasc.SolrConfig.<init> Loaded SolrConfig: solrconfig.xml
[junit4:junit4]   2> 3533 T337 oass.IndexSchema.readSchema Reading Solr Schema
[junit4:junit4]   2> 3536 T337 oass.IndexSchema.readSchema Schema name=test
[junit4:junit4]   2> 4075 T337 oass.OpenExchangeRatesOrgProvider.init Initialized with rates=open-exchange-rates.json, refreshInterval=1440.
[junit4:junit4]   2> 4084 T337 oass.IndexSchema.readSchema default search field in schema is text
[junit4:junit4]   2> 4089 T337 oass.IndexSchema.readSchema unique key field: id
[junit4:junit4]   2> 4100 T337 oass.FileExchangeRateProvider.reload Reloading exchange rates from file currency.xml
[junit4:junit4]   2> 4104 T337 oass.FileExchangeRateProvider.reload Reloading exchange rates from file currency.xml
[junit4:junit4]   2> 4108 T337 oass.OpenExchangeRatesOrgProvider.reload Reloading exchange rates from open-exchange-rates.json
[junit4:junit4]   2> 4109 T337 oass.OpenExchangeRatesOrgProvider.reload Reloading exchange rates from open-exchange-rates.json
[junit4:junit4]   2> 4110 T337 oasc.SolrCore.<init> [collection1] Opening new SolrCore at C:\Users\JenkinsSlave\workspace\Lucene-Solr-4.x-Windows\solr\build\solr-core\test\J0\.\solrtest-jetty2-1351835290285\collection1\, dataDir=.\org.apache.solr.cloud.BasicDistributedZkTest-1351835287369/jetty2\
[junit4:junit4]   2> 4110 T337 oasc.JmxMonitoredMap.<init> JMX monitoring is enabled. Adding Solr mbeans to JMX Server: com.sun.jmx.mbeanserver.JmxMBeanServer@5f0f87
[junit4:junit4]   2> 4112 T337 oasc.SolrCore.getNewIndexDir New index directory detected: old=null new=.\org.apache.solr.cloud.BasicDistributedZkTest-1351835287369/jetty2\index/
[junit4:junit4]   2> 4113 T337 oasc.SolrCore.initIndex WARNING [collection1] Solr index directory '.\org.apache.solr.cloud.BasicDistributedZkTest-1351835287369\jetty2\index' doesn't exist. Creating new index...
[junit4:junit4]   2> 4113 T337 oasc.CachingDirectoryFactory.get return new directory for C:\Users\JenkinsSlave\workspace\Lucene-Solr-4.x-Windows\solr\build\solr-core\test\J0\.\org.apache.solr.cloud.BasicDistributedZkTest-1351835287369\jetty2\index forceNew:false
[junit4:junit4]   2> 4147 T337 oasc.SolrDeletionPolicy.onCommit SolrDeletionPolicy.onCommit: commits:num=1
[junit4:junit4]   2> 		commit{dir=NRTCachingDirectory(org.apache.lucene.store.SimpleFSDirectory@C:\Users\JenkinsSlave\workspace\Lucene-Solr-4.x-Windows\solr\build\solr-core\test\J0\org.apache.solr.cloud.BasicDistributedZkTest-1351835287369\jetty2\index lockFactory=org.apache.lucene.store.NativeFSLockFactory@21035; maxCacheMB=48.0 maxMergeSizeMB=4.0),segFN=segments_1,generation=1,filenames=[segments_1]
[junit4:junit4]   2> 4148 T337 oasc.SolrDeletionPolicy.updateCommits newest commit = 1
[junit4:junit4]   2> 4150 T337 oasc.SolrCore.initWriters created xml: solr.XMLResponseWriter
[junit4:junit4]   2> 4151 T337 oasup.UpdateRequestProcessorChain.init inserting DistributedUpdateProcessorFactory into updateRequestProcessorChain "dedupe"
[junit4:junit4]   2> 4152 T337 oasup.UpdateRequestProcessorChain.init inserting DistributedUpdateProcessorFactory into updateRequestProcessorChain "dedupe-allfields"
[junit4:junit4]   2> 4153 T337 oasup.UpdateRequestProcessorChain.init inserting DistributedUpdateProcessorFactory into updateRequestProcessorChain "stored_sig"
[junit4:junit4]   2> 4153 T337 oasup.UpdateRequestProcessorChain.init inserting DistributedUpdateProcessorFactory into updateRequestProcessorChain "uniq-fields"
[junit4:junit4]   2> 4154 T337 oasup.UpdateRequestProcessorChain.init inserting DistributedUpdateProcessorFactory into updateRequestProcessorChain "distrib-dup-test-chain-implicit"
[junit4:junit4]   2> 4155 T337 oasc.RequestHandlers.initHandlersFromConfig adding lazy requestHandler: solr.ReplicationHandler
[junit4:junit4]   2> 4155 T337 oasc.RequestHandlers.initHandlersFromConfig created /replication: solr.ReplicationHandler
[junit4:junit4]   2> 4155 T337 oasc.RequestHandlers.initHandlersFromConfig created standard: solr.StandardRequestHandler
[junit4:junit4]   2> 4156 T337 oasc.RequestHandlers.initHandlersFromConfig created /get: solr.RealTimeGetHandler
[junit4:junit4]   2> 4156 T337 oasc.RequestHandlers.initHandlersFromConfig created dismax: solr.SearchHandler
[junit4:junit4]   2> 4156 T337 oasc.RequestHandlers.initHandlersFromConfig created mock: org.apache.solr.core.MockQuerySenderListenerReqHandler
[junit4:junit4]   2> 4157 T337 oasc.RequestHandlers.initHandlersFromConfig created /admin/: org.apache.solr.handler.admin.AdminHandlers
[junit4:junit4]   2> 4157 T337 oasc.RequestHandlers.initHandlersFromConfig created defaults: solr.StandardRequestHandler
[junit4:junit4]   2> 4157 T337 oasc.RequestHandlers.initHandlersFromConfig adding lazy requestHandler: solr.StandardRequestHandler
[junit4:junit4]   2> 4158 T337 oasc.RequestHandlers.initHandlersFromConfig created lazy: solr.StandardRequestHandler
[junit4:junit4]   2> 4158 T337 oasc.RequestHandlers.initHandlersFromConfig created /update: solr.UpdateRequestHandler
[junit4:junit4]   2> 4158 T337 oasc.RequestHandlers.initHandlersFromConfig created /terms: org.apache.solr.handler.component.SearchHandler
[junit4:junit4]   2> 4158 T337 oasc.RequestHandlers.initHandlersFromConfig created spellCheckCompRH: org.apache.solr.handler.component.SearchHandler
[junit4:junit4]   2> 4158 T337 oasc.RequestHandlers.initHandlersFromConfig created spellCheckCompRH_Direct: org.apache.solr.handler.component.SearchHandler
[junit4:junit4]   2> 4159 T337 oasc.RequestHandlers.initHandlersFromConfig created spellCheckWithWordbreak: org.apache.solr.handler.component.SearchHandler
[junit4:junit4]   2> 4159 T337 oasc.RequestHandlers.initHandlersFromConfig created spellCheckWithWordbreak_Direct: org.apache.solr.handler.component.SearchHandler
[junit4:junit4]   2> 4159 T337 oasc.RequestHandlers.initHandlersFromConfig created spellCheckCompRH1: org.apache.solr.handler.component.SearchHandler
[junit4:junit4]   2> 4160 T337 oasc.RequestHandlers.initHandlersFromConfig created tvrh: org.apache.solr.handler.component.SearchHandler
[junit4:junit4]   2> 4161 T337 oasc.RequestHandlers.initHandlersFromConfig created /mlt: solr.MoreLikeThisHandler
[junit4:junit4]   2> 4161 T337 oasc.RequestHandlers.initHandlersFromConfig created /debug/dump: solr.DumpRequestHandler
[junit4:junit4]   2> 4166 T337 oashl.XMLLoader.init xsltCacheLifetimeSeconds=60
[junit4:junit4]   2> 4171 T337 oasc.SolrCore.initDeprecatedSupport WARNING solrconfig.xml uses deprecated <admin/gettableFiles>, Please update your config to use the ShowFileRequestHandler.
[junit4:junit4]   2> 4172 T337 oasc.SolrCore.initDeprecatedSupport WARNING adding ShowFileRequestHandler with hidden files: [SCHEMA.XML, OLD_SYNONYMS.TXT, STOPWORDS.TXT, PROTWORDS.TXT, OPEN-EXCHANGE-RATES.JSON, SYNONYMS.TXT, CURRENCY.XML, MAPPING-ISOLATIN1ACCENT.TXT]
[junit4:junit4]   2> 4176 T337 oass.SolrIndexSearcher.<init> Opening Searcher@17dfa7c main
[junit4:junit4]   2> 4179 T337 oasu.CommitTracker.<init> Hard AutoCommit: disabled
[junit4:junit4]   2> 4179 T337 oasu.CommitTracker.<init> Soft AutoCommit: disabled
[junit4:junit4]   2> 4179 T337 oashc.SpellCheckComponent.inform Initializing spell checkers
[junit4:junit4]   2> 4211 T337 oass.DirectSolrSpellChecker.init init: {name=direct,classname=DirectSolrSpellChecker,field=lowerfilt,minQueryLength=3}
[junit4:junit4]   2> 4411 T384 oasc.SolrCore.registerSearcher [collection1] Registered new searcher Searcher@17dfa7c main{StandardDirectoryReader(segments_1:1)}
[junit4:junit4]   2> 4413 T337 oasc.ZkController.publish numShards not found on descriptor - reading it from system property
[junit4:junit4]   2> 4589 T358 oascc.ZkStateReader.updateClusterState Updating cloud state from ZooKeeper... 
[junit4:junit4]   2> 4590 T358 oasc.Overseer$ClusterStateUpdater.updateState Update state numShards=2 message={
[junit4:junit4]   2> 	  "operation":"state",
[junit4:junit4]   2> 	  "numShards":"2",
[junit4:junit4]   2> 	  "shard":null,
[junit4:junit4]   2> 	  "roles":null,
[junit4:junit4]   2> 	  "state":"down",
[junit4:junit4]   2> 	  "core":"collection1",
[junit4:junit4]   2> 	  "collection":"collection1",
[junit4:junit4]   2> 	  "node_name":"127.0.0.1:63273_solr",
[junit4:junit4]   2> 	  "base_url":"http://127.0.0.1:63273/solr"}
[junit4:junit4]   2> 4650 T383 oascc.ZkStateReader$2.process A cluster state change has occurred - updating... (3)
[junit4:junit4]   2> 4651 T357 oascc.ZkStateReader$2.process A cluster state change has occurred - updating... (3)
[junit4:junit4]   2> 4651 T371 oascc.ZkStateReader$2.process A cluster state change has occurred - updating... (3)
[junit4:junit4]   2> 4827 T337 oasc.CoreContainer.register registering core: collection1
[junit4:junit4]   2> 4828 T337 oasc.ZkController.register Register shard - core:collection1 address:http://127.0.0.1:63273/solr shardId:shard2
[junit4:junit4]   2> 4829 T337 oascc.SolrZkClient.makePath makePath: /collections/collection1/leader_elect/shard2/election
[junit4:junit4]   2> 4881 T342 oazs.PrepRequestProcessor.pRequest Got user-level KeeperException when processing sessionid:0x13abfa97f500004 type:delete cxid:0x41 zxid:0xfffffffffffffffe txntype:unknown reqpath:n/a Error Path:/solr/collections/collection1/leaders/shard2 Error:KeeperErrorCode = NoNode for /solr/collections/collection1/leaders/shard2
[junit4:junit4]   2> 4896 T337 oasc.ShardLeaderElectionContext.runLeaderProcess Running the leader process.
[junit4:junit4]   2> 4897 T342 oazs.PrepRequestProcessor.pRequest Got user-level KeeperException when processing sessionid:0x13abfa97f500004 type:create cxid:0x42 zxid:0xfffffffffffffffe txntype:unknown reqpath:n/a Error Path:/solr/overseer Error:KeeperErrorCode = NodeExists for /solr/overseer
[junit4:junit4]   2> 4929 T337 oasc.ShardLeaderElectionContext.waitForReplicasToComeUp Enough replicas found to continue.
[junit4:junit4]   2> 4929 T337 oasc.ShardLeaderElectionContext.runLeaderProcess I may be the new leader - try and sync
[junit4:junit4]   2> 4930 T337 oasc.SyncStrategy.sync Sync replicas to http://127.0.0.1:63273/solr/collection1/
[junit4:junit4]   2> 4930 T337 oasc.SyncStrategy.syncReplicas Sync Success - now sync replicas to me
[junit4:junit4]   2> 4931 T337 oasc.SyncStrategy.syncToMe http://127.0.0.1:63273/solr/collection1/ has no replicas
[junit4:junit4]   2> 4932 T337 oasc.ShardLeaderElectionContext.runLeaderProcess I am the new leader: http://127.0.0.1:63273/solr/collection1/
[junit4:junit4]   2> 4933 T337 oascc.SolrZkClient.makePath makePath: /collections/collection1/leaders/shard2
[junit4:junit4]   2> 4953 T342 oazs.PrepRequestProcessor.pRequest Got user-level KeeperException when processing sessionid:0x13abfa97f500004 type:create cxid:0x4b zxid:0xfffffffffffffffe txntype:unknown reqpath:n/a Error Path:/solr/overseer Error:KeeperErrorCode = NodeExists for /solr/overseer
[junit4:junit4]   2> 5067 T358 oascc.ZkStateReader.updateClusterState Updating cloud state from ZooKeeper... 
[junit4:junit4]   2> 5134 T383 oascc.ZkStateReader$2.process A cluster state change has occurred - updating... (3)
[junit4:junit4]   2> 5134 T371 oascc.ZkStateReader$2.process A cluster state change has occurred - updating... (3)
[junit4:junit4]   2> 5134 T357 oascc.ZkStateReader$2.process A cluster state change has occurred - updating... (3)
[junit4:junit4]   2> 5145 T337 oasc.ZkController.register We are http://127.0.0.1:63273/solr/collection1/ and leader is http://127.0.0.1:63273/solr/collection1/
[junit4:junit4]   2> 5145 T337 oasc.ZkController.register No LogReplay needed for core=collection1 baseURL=http://127.0.0.1:63273/solr
[junit4:junit4]   2> 5146 T337 oasc.ZkController.checkRecovery I am the leader, no recovery necessary
[junit4:junit4]   2> 5146 T337 oasc.ZkController.publish numShards not found on descriptor - reading it from system property
[junit4:junit4]   2> 5157 T337 oascc.ZkStateReader.updateClusterState Updating cloud state from ZooKeeper... 
[junit4:junit4]   2> 5159 T337 oass.SolrDispatchFilter.init user.dir=C:\Users\JenkinsSlave\workspace\Lucene-Solr-4.x-Windows\solr\build\solr-core\test\J0
[junit4:junit4]   2> 5159 T337 oass.SolrDispatchFilter.init SolrDispatchFilter.init() done
[junit4:junit4]   2> 5159 T337 oascsi.HttpClientUtil.createClient Creating new http client, config:maxConnections=128&maxConnectionsPerHost=32&followRedirects=false
[junit4:junit4]   2> 5399 T337 oejs.Server.doStart jetty-8.1.2.v20120308
[junit4:junit4]   2> 5401 T337 oejs.AbstractConnector.doStart Started SelectChannelConnector@0.0.0.0:63279
[junit4:junit4]   2> 5403 T337 oasc.SolrResourceLoader.locateSolrHome JNDI not configured for solr (NoInitialContextEx)
[junit4:junit4]   2> 5403 T337 oasc.SolrResourceLoader.locateSolrHome using system property solr.solr.home: C:\Users\JenkinsSlave\workspace\Lucene-Solr-4.x-Windows\solr\build\solr-core\test\J0\.\solrtest-jetty3-1351835292529
[junit4:junit4]   2> 5403 T337 oasc.SolrResourceLoader.<init> new SolrResourceLoader for deduced Solr Home: 'C:\Users\JenkinsSlave\workspace\Lucene-Solr-4.x-Windows\solr\build\solr-core\test\J0\.\solrtest-jetty3-1351835292529\'
[junit4:junit4]   2> 5429 T337 oass.SolrDispatchFilter.init SolrDispatchFilter.init()
[junit4:junit4]   2> 5431 T337 oasc.SolrResourceLoader.locateSolrHome JNDI not configured for solr (NoInitialContextEx)
[junit4:junit4]   2> 5431 T337 oasc.SolrResourceLoader.locateSolrHome using system property solr.solr.home: C:\Users\JenkinsSlave\workspace\Lucene-Solr-4.x-Windows\solr\build\solr-core\test\J0\.\solrtest-jetty3-1351835292529
[junit4:junit4]   2> 5431 T337 oasc.CoreContainer$Initializer.initialize looking for solr.xml: C:\Users\JenkinsSlave\workspace\Lucene-Solr-4.x-Windows\solr\build\solr-core\test\J0\.\solrtest-jetty3-1351835292529\solr.xml
[junit4:junit4]   2> 5431 T337 oasc.CoreContainer.<init> New CoreContainer 21605349
[junit4:junit4]   2> 5432 T337 oasc.CoreContainer.load Loading CoreContainer using Solr Home: 'C:\Users\JenkinsSlave\workspace\Lucene-Solr-4.x-Windows\solr\build\solr-core\test\J0\.\solrtest-jetty3-1351835292529\'
[junit4:junit4]   2> 5432 T337 oasc.SolrResourceLoader.<init> new SolrResourceLoader for directory: 'C:\Users\JenkinsSlave\workspace\Lucene-Solr-4.x-Windows\solr\build\solr-core\test\J0\.\solrtest-jetty3-1351835292529\'
[junit4:junit4]   2> 5450 T337 oasc.CoreContainer.load Registering Log Listener
[junit4:junit4]   2> 5461 T337 oasc.CoreContainer.initZooKeeper Zookeeper client=127.0.0.1:63254/solr
[junit4:junit4]   2> 5462 T337 oaz.ZooKeeper.<init> Initiating client connection, connectString=127.0.0.1:63254/solr sessionTimeout=5000 watcher=org.apache.solr.common.cloud.ConnectionManager@c18b8
[junit4:junit4]   2> 5463 T394 oaz.ClientCnxn$SendThread.startConnect Opening socket connection to server /127.0.0.1:63254
[junit4:junit4]   2> 5463 T337 oascc.ConnectionManager.waitForConnected Waiting for client to connect to ZooKeeper
[junit4:junit4]   2> 5464 T394 oaz.ClientCnxn$SendThread.primeConnection Socket connection established to 127.0.0.1/127.0.0.1:63254, initiating session
[junit4:junit4]   2> 5464 T339 oazs.NIOServerCnxn$Factory.run Accepted socket connection from /127.0.0.1:63284
[junit4:junit4]   2> 5465 T339 oazs.NIOServerCnxn.readConnectRequest Client attempting to establish new session at /127.0.0.1:63284
[junit4:junit4]   2> 5488 T341 oazs.NIOServerCnxn.finishSessionInit Established session 0x13abfa97f500005 with negotiated timeout 5000 for client /127.0.0.1:63284
[junit4:junit4]   2> 5488 T394 oaz.ClientCnxn$SendThread.readConnectResult Session establishment complete on server 127.0.0.1/127.0.0.1:63254, sessionid = 0x13abfa97f500005, negotiated timeout = 5000
[junit4:junit4]   2> 5489 T395 oascc.ConnectionManager.process Watcher org.apache.solr.common.cloud.ConnectionManager@c18b8 name:ZooKeeperConnection Watcher:127.0.0.1:63254/solr got event WatchedEvent state:SyncConnected type:None path:null path:null type:None
[junit4:junit4]   2> 5489 T337 oascc.ConnectionManager.waitForConnected Client is connected to ZooKeeper
[junit4:junit4]   2> 5491 T342 oazs.PrepRequestProcessor.pRequest Got user-level KeeperException when processing sessionid:0x13abfa97f500005 type:create cxid:0x1 zxid:0xfffffffffffffffe txntype:unknown reqpath:n/a Error Path:/solr/overseer Error:KeeperErrorCode = NodeExists for /solr/overseer
[junit4:junit4]   2> 5498 T342 oazs.PrepRequestProcessor.pRequest Got user-level KeeperException when processing sessionid:0x13abfa97f500005 type:create cxid:0x2 zxid:0xfffffffffffffffe txntype:unknown reqpath:n/a Error Path:/solr/overseer Error:KeeperErrorCode = NodeExists for /solr/overseer
[junit4:junit4]   2> 5515 T337 oasc.ZkController.createEphemeralLiveNode Register node as live in ZooKeeper:/live_nodes/127.0.0.1:63279_solr
[junit4:junit4]   2> 5515 T342 oazs.PrepRequestProcessor.pRequest Got user-level KeeperException when processing sessionid:0x13abfa97f500005 type:delete cxid:0x4 zxid:0xfffffffffffffffe txntype:unknown reqpath:n/a Error Path:/solr/live_nodes/127.0.0.1:63279_solr Error:KeeperErrorCode = NoNode for /solr/live_nodes/127.0.0.1:63279_solr
[junit4:junit4]   2> 5529 T337 oascc.SolrZkClient.makePath makePath: /live_nodes/127.0.0.1:63279_solr
[junit4:junit4]   2> 5546 T383 oascc.ZkStateReader$3.process Updating live nodes... (4)
[junit4:junit4]   2> 5546 T357 oascc.ZkStateReader$3.process Updating live nodes... (4)
[junit4:junit4]   2> 5546 T371 oascc.ZkStateReader$3.process Updating live nodes... (4)
[junit4:junit4]   2> 5547 T337 oashc.HttpShardHandlerFactory.getParameter Setting socketTimeout to: 0
[junit4:junit4]   2> 5548 T337 oashc.HttpShardHandlerFactory.getParameter Setting urlScheme to: http://
[junit4:junit4]   2> 5549 T337 oashc.HttpShardHandlerFactory.getParameter Setting connTimeout to: 0
[junit4:junit4]   2> 5549 T337 oashc.HttpShardHandlerFactory.getParameter Setting maxConnectionsPerHost to: 20
[junit4:junit4]   2> 5550 T337 oashc.HttpShardHandlerFactory.getParameter Setting corePoolSize to: 0
[junit4:junit4]   2> 5550 T337 oashc.HttpShardHandlerFactory.getParameter Setting maximumPoolSize to: 2147483647
[junit4:junit4]   2> 5551 T337 oashc.HttpShardHandlerFactory.getParameter Setting maxThreadIdleTime to: 5
[junit4:junit4]   2> 5552 T337 oashc.HttpShardHandlerFactory.getParameter Setting sizeOfQueue to: -1
[junit4:junit4]   2> 5552 T337 oashc.HttpShardHandlerFactory.getParameter Setting fairnessPolicy to: false
[junit4:junit4]   2> 5553 T337 oascsi.HttpClientUtil.createClient Creating new http client, config:maxConnectionsPerHost=20&maxConnections=10000&socketTimeout=0&connTimeout=0&retry=false
[junit4:junit4]   2> 5558 T358 oascc.ZkStateReader.updateClusterState Updating cloud state from ZooKeeper... 
[junit4:junit4]   2> 5559 T358 oasc.Overseer$ClusterStateUpdater.updateState Update state numShards=2 message={
[junit4:junit4]   2> 	  "operation":"state",
[junit4:junit4]   2> 	  "numShards":"2",
[junit4:junit4]   2> 	  "shard":"shard2",
[junit4:junit4]   2> 	  "roles":null,
[junit4:junit4]   2> 	  "state":"active",
[junit4:junit4]   2> 	  "core":"collection1",
[junit4:junit4]   2> 	  "collection":"collection1",
[junit4:junit4]   2> 	  "node_name":"127.0.0.1:63273_solr",
[junit4:junit4]   2> 	  "base_url":"http://127.0.0.1:63273/solr"}
[junit4:junit4]   2> 5609 T337 oascc.ZkStateReader.createClusterStateWatchersAndUpdate Updating cluster state from ZooKeeper... 
[junit4:junit4]   2> 5625 T383 oascc.ZkStateReader$2.process A cluster state change has occurred - updating... (4)
[junit4:junit4]   2> 5625 T395 oaz.ClientCnxn$EventThread.processEvent SEVERE Error while calling watcher  java.lang.NullPointerException
[junit4:junit4]   2> 	at org.apache.solr.common.cloud.ZkStateReader$2.process(ZkStateReader.java:189)
[junit4:junit4]   2> 	at org.apache.zookeeper.ClientCnxn$EventThread.processEvent(ClientCnxn.java:526)
[junit4:junit4]   2> 	at org.apache.zookeeper.ClientCnxn$EventThread.run(ClientCnxn.java:502)
[junit4:junit4]   2> 
[junit4:junit4]   2> 5625 T371 oascc.ZkStateReader$2.process A cluster state change has occurred - updating... (4)
[junit4:junit4]   2> 5625 T357 oascc.ZkStateReader$2.process A cluster state change has occurred - updating... (4)
[junit4:junit4]   2> 5636 T337 oasc.CoreContainer.create Creating SolrCore 'collection1' using instanceDir: C:\Users\JenkinsSlave\workspace\Lucene-Solr-4.x-Windows\solr\build\solr-core\test\J0\.\solrtest-jetty3-1351835292529\collection1
[junit4:junit4]   2> 5637 T337 oasc.ZkController.createCollectionZkNode Check for collection zkNode:collection1
[junit4:junit4]   2> 5647 T337 oasc.ZkController.createCollectionZkNode Collection zkNode exists
[junit4:junit4]   2> 5648 T337 oasc.ZkController.readConfigName Load collection config from:/collections/collection1
[junit4:junit4]   2> 5649 T337 oasc.SolrResourceLoader.<init> new SolrResourceLoader for directory: 'C:\Users\JenkinsSlave\workspace\Lucene-Solr-4.x-Windows\solr\build\solr-core\test\J0\.\solrtest-jetty3-1351835292529\collection1\'
[junit4:junit4]   2> 5651 T337 oasc.SolrResourceLoader.replaceClassLoader Adding 'file:/C:/Users/JenkinsSlave/workspace/Lucene-Solr-4.x-Windows/solr/build/solr-core/test/J0/solrtest-jetty3-1351835292529/collection1/lib/classes/' to classloader
[junit4:junit4]   2> 5652 T337 oasc.SolrResourceLoader.replaceClassLoader Adding 'file:/C:/Users/JenkinsSlave/workspace/Lucene-Solr-4.x-Windows/solr/build/solr-core/test/J0/solrtest-jetty3-1351835292529/collection1/lib/README' to classloader
[junit4:junit4]   2> 5691 T337 oasc.SolrConfig.<init> Using Lucene MatchVersion: LUCENE_41
[junit4:junit4]   2> 5751 T337 oasc.SolrConfig.<init> Loaded SolrConfig: solrconfig.xml
[junit4:junit4]   2> 5753 T337 oass.IndexSchema.readSchema Reading Solr Schema
[junit4:junit4]   2> 5756 T337 oass.IndexSchema.readSchema Schema name=test
[junit4:junit4]   2> 6290 T337 oass.OpenExchangeRatesOrgProvider.init Initialized with rates=open-exchange-rates.json, refreshInterval=1440.
[junit4:junit4]   2> 6297 T337 oass.IndexSchema.readSchema default search field in schema is text
[junit4:junit4]   2> 6300 T337 oass.IndexSchema.readSchema unique key field: id
[junit4:junit4]   2> 6311 T337 oass.FileExchangeRateProvider.reload Reloading exchange rates from file currency.xml
[junit4:junit4]   2> 6316 T337 oass.FileExchangeRateProvider.reload Reloading exchange rates from file currency.xml
[junit4:junit4]   2> 6319 T337 oass.OpenExchangeRatesOrgProvider.reload Reloading exchange rates from open-exchange-rates.json
[junit4:junit4]   2> 6321 T337 oass.OpenExchangeRatesOrgProvider.reload Reloading exchange rates from open-exchange-rates.json
[junit4:junit4]   2> 6321 T337 oasc.SolrCore.<init> [collection1] Opening new SolrCore at C:\Users\JenkinsSlave\workspace\Lucene-Solr-4.x-Windows\solr\build\solr-core\test\J0\.\solrtest-jetty3-1351835292529\collection1\, dataDir=.\org.apache.solr.cloud.BasicDistributedZkTest-1351835287369/jetty3\
[junit4:junit4]   2> 6322 T337 oasc.JmxMonitoredMap.<init> JMX monitoring is enabled. Adding Solr mbeans to JMX Server: com.sun.jmx.mbeanserver.JmxMBeanServer@5f0f87
[junit4:junit4]   2> 6323 T337 oasc.SolrCore.getNewIndexDir New index directory detected: old=null new=.\org.apache.solr.cloud.BasicDistributedZkTest-1351835287369/jetty3\index/
[junit4:junit4]   2> 6324 T337 oasc.SolrCore.initIndex WARNING [collection1] Solr index directory '.\org.apache.solr.cloud.BasicDistributedZkTest-1351835287369\jetty3\index' doesn't exist. Creating new index...
[junit4:junit4]   2> 6326 T337 oasc.CachingDirectoryFactory.get return new directory for C:\Users\JenkinsSlave\workspace\Lucene-Solr-4.x-Windows\solr\build\solr-core\test\J0\.\org.apache.solr.cloud.BasicDistributedZkTest-1351835287369\jetty3\index forceNew:false
[junit4:junit4]   2> 6356 T337 oasc.SolrDeletionPolicy.onCommit SolrDeletionPolicy.onCommit: commits:num=1
[junit4:junit4]   2> 		commit{dir=NRTCachingDirectory(org.apache.lucene.store.SimpleFSDirectory@C:\Users\JenkinsSlave\workspace\Lucene-Solr-4.x-Windows\solr\build\solr-core\test\J0\org.apache.solr.cloud.BasicDistributedZkTest-1351835287369\jetty3\index lockFactory=org.apache.lucene.store.NativeFSLockFactory@b7cf67; maxCacheMB=48.0 maxMergeSizeMB=4.0),segFN=segments_1,generation=1,filenames=[segments_1]
[junit4:junit4]   2> 6356 T337 oasc.SolrDeletionPolicy.updateCommits newest commit = 1
[junit4:junit4]   2> 6357 T337 oasc.SolrCore.initWriters created xml: solr.XMLResponseWriter
[junit4:junit4]   2> 6358 T337 oasup.UpdateRequestProcessorChain.init inserting DistributedUpdateProcessorFactory into updateRequestProcessorChain "dedupe"
[junit4:junit4]   2> 6359 T337 oasup.UpdateRequestProcessorChain.init inserting DistributedUpdateProcessorFactory into updateRequestProcessorChain "dedupe-allfields"
[junit4:junit4]   2> 6359 T337 oasup.UpdateRequestProcessorChain.init inserting DistributedUpdateProcessorFactory into updateRequestProcessorChain "stored_sig"
[junit4:junit4]   2> 6359 T337 oasup.UpdateRequestProcessorChain.init inserting DistributedUpdateProcessorFactory into updateRequestProcessorChain "uniq-fields"
[junit4:junit4]   2> 6360 T337 oasup.UpdateRequestProcessorChain.init inserting DistributedUpdateProcessorFactory into updateRequestProcessorChain "distrib-dup-test-chain-implicit"
[junit4:junit4]   2> 6360 T337 oasc.RequestHandlers.initHandlersFromConfig adding lazy requestHandler: solr.ReplicationHandler
[junit4:junit4]   2> 6360 T337 oasc.RequestHandlers.initHandlersFromConfig created /replication: solr.ReplicationHandler
[junit4:junit4]   2> 6362 T337 oasc.RequestHandlers.initHandlersFromConfig created standard: solr.StandardRequestHandler
[junit4:junit4]   2> 6362 T337 oasc.RequestHandlers.initHandlersFromConfig created /get: solr.RealTimeGetHandler
[junit4:junit4]   2> 6362 T337 oasc.RequestHandlers.initHandlersFromConfig created dismax: solr.SearchHandler
[junit4:junit4]   2> 6362 T337 oasc.RequestHandlers.initHandlersFromConfig created mock: org.apache.solr.core.MockQuerySenderListenerReqHandler
[junit4:junit4]   2> 6362 T337 oasc.RequestHandlers.initHandlersFromConfig created /admin/: org.apache.solr.handler.admin.AdminHandlers
[junit4:junit4]   2> 6363 T337 oasc.RequestHandlers.initHandlersFromConfig created defaults: solr.StandardRequestHandler
[junit4:junit4]   2> 6363 T337 oasc.RequestHandlers.initHandlersFromConfig adding lazy requestHandler: solr.StandardRequestHandler
[junit4:junit4]   2> 6363 T337 oasc.RequestHandlers.initHandlersFromConfig created lazy: solr.StandardRequestHandler
[junit4:junit4]   2> 6363 T337 oasc.RequestHandlers.initHandlersFromConfig created /update: solr.UpdateRequestHandler
[junit4:junit4]   2> 6364 T337 oasc.RequestHandlers.initHandlersFromConfig created /terms: org.apache.solr.handler.component.SearchHandler
[junit4:junit4]   2> 6365 T337 oasc.RequestHandlers.initHandlersFromConfig created spellCheckCompRH: org.apache.solr.handler.component.SearchHandler
[junit4:junit4]   2> 6365 T337 oasc.RequestHandlers.initHandlersFromConfig created spellCheckCompRH_Direct: org.apache.solr.handler.component.SearchHandler
[junit4:junit4]   2> 6366 T337 oasc.RequestHandlers.initHandlersFromConfig created spellCheckWithWordbreak: org.apache.solr.handler.component.SearchHandler
[junit4:junit4]   2> 6366 T337 oasc.RequestHandlers.initHandlersFromConfig created spellCheckWithWordbreak_Direct: org.apache.solr.handler.component.SearchHandler
[junit4:junit4]   2> 6366 T337 oasc.RequestHandlers.initHandlersFromConfig created spellCheckCompRH1: org.apache.solr.handler.component.SearchHandler
[junit4:junit4]   2> 6366 T337 oasc.RequestHandlers.initHandlersFromConfig created tvrh: org.apache.solr.handler.component.SearchHandler
[junit4:junit4]   2> 6366 T337 oasc.RequestHandlers.initHandlersFromConfig created /mlt: solr.MoreLikeThisHandler
[junit4:junit4]   2> 6367 T337 oasc.RequestHandlers.initHandlersFromConfig created /debug/dump: solr.DumpRequestHandler
[junit4:junit4]   2> 6375 T337 oashl.XMLLoader.init xsltCacheLifetimeSeconds=60
[junit4:junit4]   2> 6380 T337 oasc.SolrCore.initDeprecatedSupport WARNING solrconfig.xml uses deprecated <admin/gettableFiles>, Please update your config to use the ShowFileRequestHandler.
[junit4:junit4]   2> 6381 T337 oasc.SolrCore.initDeprecatedSupport WARNING adding ShowFileRequestHandler with hidden files: [SCHEMA.XML, OLD_SYNONYMS.TXT, STOPWORDS.TXT, PROTWORDS.TXT, OPEN-EXCHANGE-RATES.JSON, SYNONYMS.TXT, CURRENCY.XML, MAPPING-ISOLATIN1ACCENT.TXT]
[junit4:junit4]   2> 6383 T337 oass.SolrIndexSearcher.<init> Opening Searcher@985612 main
[junit4:junit4]   2> 6385 T337 oasu.CommitTracker.<init> Hard AutoCommit: disabled
[junit4:junit4]   2> 6385 T337 oasu.CommitTracker.<init> Soft AutoCommit: disabled
[junit4:junit4]   2> 6386 T337 oashc.SpellCheckComponent.inform Initializing spell checkers
[junit4:junit4]   2> 6400 T337 oass.DirectSolrSpellChecker.init init: {name=direct,classname=DirectSolrSpellChecker,field=lowerfilt,minQueryLength=3}
[junit4:junit4]   2> 6528 T396 oasc.SolrCore.registerSearcher [collection1] Registered new searcher Searcher@985612 main{StandardDirectoryReader(segments_1:1)}
[junit4:junit4]   2> 6531 T337 oasc.ZkController.publish numShards not found on descriptor - reading it from system property
[junit4:junit4]   2> 6844 T358 oascc.ZkStateReader.updateClusterState Updating cloud state from ZooKeeper... 
[junit4:junit4]   2> 6845 T358 oasc.Overseer$ClusterStateUpdater.updateState Update state numShards=2 message={
[junit4:junit4]   2> 	  "operation":"state",
[junit4:junit4]   2> 	  "numShards":"2",
[junit4:junit4]   2> 	  "shard":null,
[junit4:junit4]   2> 	  "roles":null,
[junit4:junit4]   2> 	  "state":"down",
[junit4:junit4]   2> 	  "core":"collection1",
[junit4:junit4]   2> 	  "collection":"collection1",
[junit4:junit4]   2> 	  "node_name":"127.0.0.1:63279_solr",
[junit4:junit4]   2> 	  "base_url":"http://127.0.0.1:63279/solr"}
[junit4:junit4]   2> 6890 T383 oascc.ZkStateReader$2.process A cluster state change has occurred - updating... (4)
[junit4:junit4]   2> 6890 T357 oascc.ZkStateReader$2.process A cluster state change has occurred - updating... (4)
[junit4:junit4]   2> 6890 T371 oascc.ZkStateReader$2.process A cluster state change has occurred - updating... (4)
[junit4:junit4]   2> 70445 T337 oasc.SolrException.log SEVERE null:org.apache.solr.common.SolrException: Could not get shard_id for core: collection1
[junit4:junit4]   2> 		at org.apache.solr.cloud.ZkController.doGetShardIdProcess(ZkController.java:996)
[junit4:junit4]   2> 		at org.apache.solr.cloud.ZkController.preRegister(ZkController.java:1054)
[junit4:junit4]   2> 		at org.apache.solr.core.CoreContainer.register(CoreContainer.java:661)
[junit4:junit4]   2> 		at org.apache.solr.core.CoreContainer.load(CoreContainer.java:531)
[junit4:junit4]   2> 		at org.apache.solr.core.CoreContainer.load(CoreContainer.java:351)
[junit4:junit4]   2> 		at org.apache.solr.core.CoreContainer$Initializer.initialize(CoreContainer.java:303)
[junit4:junit4]   2> 		at org.apache.solr.servlet.SolrDispatchFilter.init(SolrDispatchFilter.java:107)
[junit4:junit4]   2> 		at org.eclipse.jetty.servlet.FilterHolder.doStart(FilterHolder.java:114)
[junit4:junit4]   2> 		at org.eclipse.jetty.util.component.AbstractLifeCycle.start(AbstractLifeCycle.java:59)
[junit4:junit4]   2> 		at org.eclipse.jetty.servlet.ServletHandler.initialize(ServletHandler.java:754)
[junit4:junit4]   2> 		at org.eclipse.jetty.servlet.ServletHandler.updateMappings(ServletHandler.java:1227)
[junit4:junit4]   2> 		at org.eclipse.jetty.servlet.ServletHandler.setFilterMappings(ServletHandler.java:1263)
[junit4:junit4]   2> 		at org.eclipse.jetty.servlet.ServletHandler.addFilterWithMapping(ServletHandler.java:965)
[junit4:junit4]   2> 		at org.eclipse.jetty.servlet.ServletHandler.addFilterWithMapping(ServletHandler.java:923)
[junit4:junit4]   2> 		at org.eclipse.jetty.servlet.ServletContextHandler.addFilter(ServletContextHandler.java:333)
[junit4:junit4]   2> 		at org.apache.solr.client.solrj.embedded.JettySolrRunner$1.lifeCycleStarted(JettySolrRunner.java:173)
[junit4:junit4]   2> 		at org.eclipse.jetty.util.component.AbstractLifeCycle.setStarted(AbstractLifeCycle.java:169)
[junit4:junit4]   2> 		at org.eclipse.jetty.util.component.AbstractLifeCycle.start(AbstractLifeCycle.java:60)
[junit4:junit4]   2> 		at org.apache.solr.client.solrj.embedded.JettySolrRunner.start(JettySolrRunner.java:225)
[junit4:junit4]   2> 		at org.apache.solr.client.solrj.embedded.JettySolrRunner.start(JettySolrRunner.java:205)
[junit4:junit4]   2> 		at org.apache.solr.BaseDistributedSearchTestCase.createJetty(BaseDistributedSearchTestCase.java:262)
[junit4:junit4]   2> 		at org.apache.solr.cloud.AbstractFullDistribZkTestBase.createJettys(AbstractFullDistribZkTestBase.java:294)
[junit4:junit4]   2> 		at org.apache.solr.cloud.AbstractFullDistribZkTestBase.createServers(AbstractFullDistribZkTestBase.java:268)
[junit4:junit4]   2> 		at org.apache.solr.BaseDistributedSearchTestCase.testDistribSearch(BaseDistributedSearchTestCase.java:693)
[junit4:junit4]   2> 		at sun.reflect.NativeMethodAccessorImpl.invoke0(Native Method)
[junit4:junit4]   2> 		at sun.reflect.NativeMethodAccessorImpl.invoke(NativeMethodAccessorImpl.java:57)
[junit4:junit4]   2> 		at sun.reflect.DelegatingMethodAccessorImpl.invoke(DelegatingMethodAccessorImpl.java:43)
[junit4:junit4]   2> 		at java.lang.reflect.Method.invoke(Method.java:601)
[junit4:junit4]   2> 		at com.carrotsearch.randomizedtesting.RandomizedRunner.invoke(RandomizedRunner.java:1559)
[junit4:junit4]   2> 		at com.carrotsearch.randomizedtesting.RandomizedRunner.access$600(RandomizedRunner.java:79)
[junit4:junit4]   2> 		at com.carrotsearch.randomizedtesting.RandomizedRunner$6.evaluate(RandomizedRunner.java:737)
[junit4:junit4]   2> 		at com.carrotsearch.randomizedtesting.RandomizedRunner$7.evaluate(RandomizedRunner.java:773)
[junit4:junit4]   2> 		at com.carrotsearch.randomizedtesting.RandomizedRunner$8.evaluate(RandomizedRunner.java:787)
[junit4:junit4]   2> 		at com.carrotsearch.randomizedtesting.rules.SystemPropertiesRestoreRule$1.evaluate(SystemPropertiesRestoreRule.java:53)
[junit4:junit4]   2> 		at org.apache.lucene.util.TestRuleSetupTeardownChained$1.evaluate(TestRuleSetupTeardownChained.java:50)
[junit4:junit4]   2> 		at org.apache.lucene.util.TestRuleFieldCacheSanity$1.evaluate(TestRuleFieldCacheSanity.java:51)
[junit4:junit4]   2> 		at org.apache.lucene.util.AbstractBeforeAfterRule$1.evaluate(AbstractBeforeAfterRule.java:45)
[junit4:junit4]   2> 		at com.carrotsearch.randomizedtesting.rules.SystemPropertiesInvariantRule$1.evaluate(SystemPropertiesInvariantRule.java:55)
[junit4:junit4]   2> 		at org.apache.lucene.util.TestRuleThreadAndTestName$1.evaluate(TestRuleThreadAndTestName.java:48)
[junit4:junit4]   2> 		at org.apache.lucene.util.TestRuleIgnoreAfterMaxFailures$1.evaluate(TestRuleIgnoreAfterMaxFailures.java:70)
[junit4:junit4]   2> 		at org.apache.lucene.util.TestRuleMarkFailure$1.evaluate(TestRuleMarkFailure.java:48)
[junit4:junit4]   2> 		at com.carrotsearch.randomizedtesting.rules.StatementAdapter.evaluate(StatementAdapter.java:36)
[junit4:junit4]   2> 		at com.carrotsearch.randomizedtesting.ThreadLeakControl$StatementRunner.run(ThreadLeakControl.java:358)
[junit4:junit4]   2> 		at com.carrotsearch.randomizedtesting.ThreadLeakControl.forkTimeoutingTask(ThreadLeakControl.java:782)
[junit4:junit4]   2> 		at com.carrotsearch.randomizedtesting.ThreadLeakControl$3.evaluate(ThreadLeakControl.java:442)
[junit4:junit4]   2> 		at com.carrotsearch.randomizedtesting.RandomizedRunner.runSingleTest(RandomizedRunner.java:746)
[junit4:junit4]   2> 		at com.carrotsearch.randomizedtesting.RandomizedRunner$3.evaluate(RandomizedRunner.java:648)
[junit4:junit4]   2> 		at com.carrotsearch.randomizedtesting.RandomizedRunner$4.evaluate(RandomizedRunner.java:682)
[junit4:junit4]   2> 		at com.carrotsearch.randomizedtesting.RandomizedRunner$5.evaluate(RandomizedRunner.java:693)
[junit4:junit4]   2> 		at com.carrotsearch.randomizedtesting.rules.StatementAdapter.evaluate(StatementAdapter.java:36)
[junit4:junit4]   2> 		at com.carrotsearch.randomizedtesting.rules.SystemPropertiesRestoreRule$1.evaluate(SystemPropertiesRestoreRule.java:53)
[junit4:junit4]   2> 		at org.apache.lucene.util.AbstractBeforeAfterRule$1.evaluate(AbstractBeforeAfterRule.java:45)
[junit4:junit4]   2> 		at org.apache.lucene.util.TestRuleStoreClassName$1.evaluate(TestRuleStoreClassName.java:42)
[junit4:junit4]   2> 		at com.carrotsearch.randomizedtesting.rules.SystemPropertiesInvariantRule$1.evaluate(SystemPropertiesInvariantRule.java:55)
[junit4:junit4]   2> 		at com.carrotsearch.randomizedtesting.rules.NoShadowingOrOverridesOnMethodsRule$1.evaluate(NoShadowingOrOverridesOnMethodsRule.java:39)
[junit4:junit4]   2> 		at com.carrotsearch.randomizedtesting.rules.NoShadowingOrOverridesOnMethodsRule$1.evaluate(NoShadowingOrOverridesOnMethodsRule.java:39)
[junit4:junit4]   2> 		at com.carrotsearch.randomizedtesting.rules.StatementAdapter.evaluate(StatementAdapter.java:36)
[junit4:junit4]   2> 		at org.apache.lucene.util.TestRuleAssertionsRequired$1.evaluate(TestRuleAssertionsRequired.java:43)
[junit4:junit4]   2> 		at org.apache.lucene.util.TestRuleMarkFailure$1.evaluate(TestRuleMarkFailure.java:48)
[junit4:junit4]   2> 		at org.apache.lucene.util.TestRuleIgnoreAfterMaxFailures$1.evaluate(TestRuleIgnoreAfterMaxFailures.java:70)
[junit4:junit4]   2> 		at org.apache.lucene.util.TestRuleIgnoreTestSuites$1.evaluate(TestRuleIgnoreTestSuites.java:55)
[junit4:junit4]   2> 		at com.carrotsearch.randomizedtesting.rules.StatementAdapter.evaluate(StatementAdapter.java:36)
[junit4:junit4]   2> 		at com.carrotsearch.randomizedtesting.ThreadLeakControl$StatementRunner.run(ThreadLeakControl.java:358)
[junit4:junit4]   2> 		at java.lang.Thread.run(Thread.java:722)
[junit4:junit4]   2> 	
[junit4:junit4]   2> 70448 T337 oasc.SolrCore.close [collection1]  CLOSING SolrCore org.apache.solr.core.SolrCore@b3a369
[junit4:junit4]   2> 70460 T337 oasu.DirectUpdateHandler2.close closing DirectUpdateHandler2{commits=0,autocommits=0,soft autocommits=0,optimizes=0,rollbacks=0,expungeDeletes=0,docsPending=0,adds=0,deletesById=0,deletesByQuery=0,errors=0,cumulative_adds=0,cumulative_deletesById=0,cumulative_deletesByQuery=0,cumulative_errors=0}
[junit4:junit4]   2> 70460 T337 oasc.SolrCore.decrefSolrCoreState Closing SolrCoreState
[junit4:junit4]   2> 70463 T337 oasu.DefaultSolrCoreState.closeIndexWriter SolrCoreState ref count has reached 0 - closing IndexWriter
[junit4:junit4]   2> 70463 T337 oasu.DefaultSolrCoreState.closeIndexWriter closing IndexWriter with IndexWriterCloser
[junit4:junit4]   2> 70464 T337 oasc.SolrCore.closeSearcher [collection1] Closing main searcher on request.
[junit4:junit4]   2> 70466 T337 oass.SolrDispatchFilter.init user.dir=C:\Users\JenkinsSlave\workspace\Lucene-Solr-4.x-Windows\solr\build\solr-core\test\J0
[junit4:junit4]   2> 70466 T337 oass.SolrDispatchFilter.init SolrDispatchFilter.init() done
[junit4:junit4]   2> 70467 T337 oascsi.HttpClientUtil.createClient Creating new http client, config:maxConnections=128&maxConnectionsPerHost=32&followRedirects=false
[junit4:junit4]   2> 70868 T337 oejs.Server.doStart jetty-8.1.2.v20120308
[junit4:junit4]   2> 70872 T337 oejs.AbstractConnector.doStart Started SelectChannelConnector@0.0.0.0:63285
[junit4:junit4]   2> 70874 T337 oasc.SolrResourceLoader.locateSolrHome JNDI not configured for solr (NoInitialContextEx)
[junit4:junit4]   2> 70874 T337 oasc.SolrResourceLoader.locateSolrHome using system property solr.solr.home: C:\Users\JenkinsSlave\workspace\Lucene-Solr-4.x-Windows\solr\build\solr-core\test\J0\.\solrtest-jetty4-1351835357846
[junit4:junit4]   2> 70875 T337 oasc.SolrResourceLoader.<init> new SolrResourceLoader for deduced Solr Home: 'C:\Users\JenkinsSlave\workspace\Lucene-Solr-4.x-Windows\solr\build\solr-core\test\J0\.\solrtest-jetty4-1351835357846\'
[junit4:junit4]   2> 70927 T337 oass.SolrDispatchFilter.init SolrDispatchFilter.init()
[junit4:junit4]   2> 70928 T337 oasc.SolrResourceLoader.locateSolrHome JNDI not configured for solr (NoInitialContextEx)
[junit4:junit4]   2> 70928 T337 oasc.SolrResourceLoader.locateSolrHome using system property solr.solr.home: C:\Users\JenkinsSlave\workspace\Lucene-Solr-4.x-Windows\solr\build\solr-core\test\J0\.\solrtest-jetty4-1351835357846
[junit4:junit4]   2> 70930 T337 oasc.CoreContainer$Initializer.initialize looking for solr.xml: C:\Users\JenkinsSlave\workspace\Lucene-Solr-4.x-Windows\solr\build\solr-core\test\J0\.\solrtest-jetty4-1351835357846\solr.xml
[junit4:junit4]   2> 70930 T337 oasc.CoreContainer.<init> New CoreContainer 31020446
[junit4:junit4]   2> 70931 T337 oasc.CoreContainer.load Loading CoreContainer using Solr Home: 'C:\Users\JenkinsSlave\workspace\Lucene-Solr-4.x-Windows\solr\build\solr-core\test\J0\.\solrtest-jetty4-1351835357846\'
[junit4:junit4]   2> 70931 T337 oasc.SolrResourceLoader.<init> new SolrResourceLoader for directory: 'C:\Users\JenkinsSlave\workspace\Lucene-Solr-4.x-Windows\solr\build\solr-core\test\J0\.\solrtest-jetty4-1351835357846\'
[junit4:junit4]   2> 70971 T337 oasc.CoreContainer.load Registering Log Listener
[junit4:junit4]   2> 71000 T337 oasc.CoreContainer.initZooKeeper Zookeeper client=127.0.0.1:63254/solr
[junit4:junit4]   2> 71000 T337 oaz.ZooKeeper.<init> Initiating client connection, connectString=127.0.0.1:63254/solr sessionTimeout=5000 watcher=org.apache.solr.common.cloud.ConnectionManager@1e7ea3d
[junit4:junit4]   2> 71003 T337 oascc.ConnectionManager.waitForConnected Waiting for client to connect to ZooKeeper
[junit4:junit4]   2> 71003 T406 oaz.ClientCnxn$SendThread.startConnect Opening socket connection to server /127.0.0.1:63254
[junit4:junit4]   2> 71007 T406 oaz.ClientCnxn$SendThread.primeConnection Socket connection established to 127.0.0.1/127.0.0.1:63254, initiating session
[junit4:junit4]   2> 71007 T339 oazs.NIOServerCnxn$Factory.run Accepted socket connection from /127.0.0.1:63290
[junit4:junit4]   2> 71007 T339 oazs.NIOServerCnxn.readConnectRequest Client attempting to establish new session at /127.0.0.1:63290
[junit4:junit4]   2> 71025 T341 oazs.NIOServerCnxn.finishSessionInit Established session 0x13abfa97f500006 with negotiated timeout 5000 for client /127.0.0.1:63290
[junit4:junit4]   2> 71025 T406 oaz.ClientCnxn$SendThread.readConnectResult Session establishment complete on server 127.0.0.1/127.0.0.1:63254, sessionid = 0x13abfa97f500006, negotiated timeout = 5000
[junit4:junit4]   2> 71025 T407 oascc.ConnectionManager.process Watcher org.apache.solr.common.cloud.ConnectionManager@1e7ea3d name:ZooKeeperConnection Watcher:127.0.0.1:63254/solr got event WatchedEvent state:SyncConnected type:None path:null path:null type:None
[junit4:junit4]   2> 71027 T337 oascc.ConnectionManager.waitForConnected Client is connected to ZooKeeper
[junit4:junit4]   2> 71029 T342 oazs.PrepRequestProcessor.pRequest Got user-level KeeperException when processing sessionid:0x13abfa97f500006 type:create cxid:0x1 zxid:0xfffffffffffffffe txntype:unknown reqpath:n/a Error Path:/solr/overseer Error:KeeperErrorCode = NodeExists for /solr/overseer
[junit4:junit4]   2> 71033 T342 oazs.PrepRequestProcessor.pRequest Got user-level KeeperException when processing sessionid:0x13abfa97f500006 type:create cxid:0x2 zxid:0xfffffffffffffffe txntype:unknown reqpath:n/a Error Path:/solr/overseer Error:KeeperErrorCode = NodeExists for /solr/overseer
[junit4:junit4]   2> 71036 T337 oasc.ZkController.createEphemeralLiveNode Register node as live in ZooKeeper:/live_nodes/127.0.0.1:63285_solr
[junit4:junit4]   2> 71037 T342 oazs.PrepRequestProcessor.pRequest Got user-level KeeperException when processing sessionid:0x13abfa97f500006 type:delete cxid:0x4 zxid:0xfffffffffffffffe txntype:unknown reqpath:n/a Error Path:/solr/live_nodes/127.0.0.1:63285_solr Error:KeeperErrorCode = NoNode for /solr/live_nodes/127.0.0.1:63285_solr
[junit4:junit4]   2> 71040 T337 oascc.SolrZkClient.makePath makePath: /live_nodes/127.0.0.1:63285_solr
[junit4:junit4]   2> 71048 T383 oascc.ZkStateReader$3.process Updating live nodes... (5)
[junit4:junit4]   2> 71048 T371 oascc.ZkStateReader$3.process Updating live nodes... (5)
[junit4:junit4]   2> 71048 T395 oascc.ZkStateReader$3.process Updating live nodes... (5)
[junit4:junit4]   2> 71049 T357 oascc.ZkStateReader$3.process Updating live nodes... (5)
[junit4:junit4]   2> 71049 T337 oashc.HttpShardHandlerFactory.getParameter Setting socketTimeout to: 0
[junit4:junit4]   2> 71049 T337 oashc.HttpShardHandlerFactory.getParameter Setting urlScheme to: http://
[junit4:junit4]   2> 71049 T337 oashc.HttpShardHandlerFactory.getParameter Setting connTimeout to: 0
[junit4:junit4]   2> 71051 T337 oashc.HttpShardHandlerFactory.getParameter Setting maxConnectionsPerHost to: 20
[junit4:junit4]   2> 71051 T337 oashc.HttpShardHandlerFactory.getParameter Setting corePoolSize to: 0
[junit4:junit4]   2> 71051 T337 oashc.HttpShardHandlerFactory.getParameter Setting maximumPoolSize to: 2147483647
[junit4:junit4]   2> 71051 T337 oashc.HttpShardHandlerFactory.getParameter Setting maxThreadIdleTime to: 5
[junit4:junit4]   2> 71052 T337 oashc.HttpShardHandlerFactory.getParameter Setting sizeOfQueue to: -1
[junit4:junit4]   2> 71052 T337 oashc.HttpShardHandlerFactory.getParameter Setting fairnessPolicy to: false
[junit4:junit4]   2> 71053 T337 oascsi.HttpClientUtil.createClient Creating new http client, config:maxConnectionsPerHost=20&maxConnections=10000&socketTimeout=0&connTimeout=0&retry=false
[junit4:junit4]   2> 71099 T337 oascc.ZkStateReader.createClusterStateWatchersAndUpdate Updating cluster state from ZooKeeper... 
[junit4:junit4]   2> 71110 T337 oasc.CoreContainer.create Creating SolrCore 'collection1' using instanceDir: C:\Users\JenkinsSlave\workspace\Lucene-Solr-4.x-Windows\solr\build\solr-core\test\J0\.\solrtest-jetty4-1351835357846\collection1
[junit4:junit4]   2> 71111 T337 oasc.ZkController.createCollectionZkNode Check for collection zkNode:collection1
[junit4:junit4]   2> 71112 T337 oasc.ZkController.createCollectionZkNode Collection zkNode exists
[junit4:junit4]   2> 71112 T337 oasc.ZkController.readConfigName Load collection config from:/collections/collection1
[junit4:junit4]   2> 71115 T337 oasc.SolrResourceLoader.<init> new SolrResourceLoader for directory: 'C:\Users\JenkinsSlave\workspace\Lucene-Solr-4.x-Windows\solr\build\solr-core\test\J0\.\solrtest-jetty4-1351835357846\collection1\'
[junit4:junit4]   2> 71118 T337 oasc.SolrResourceLoader.replaceClassLoader Adding 'file:/C:/Users/JenkinsSlave/workspace/Lucene-Solr-4.x-Windows/solr/build/solr-core/test/J0/solrtest-jetty4-1351835357846/collection1/lib/classes/' to classloader
[junit4:junit4]   2> 71119 T337 oasc.SolrResourceLoader.replaceClassLoader Adding 'file:/C:/Users/JenkinsSlave/workspace/Lucene-Solr-4.x-Windows/solr/build/solr-core/test/J0/solrtest-jetty4-1351835357846/collection1/lib/README' to classloader
[junit4:junit4]   2> 71233 T337 oasc.SolrConfig.<init> Using Lucene MatchVersion: LUCENE_41
[junit4:junit4]   2> 71321 T337 oasc.SolrConfig.<init> Loaded SolrConfig: solrconfig.xml
[junit4:junit4]   2> 71322 T337 oass.IndexSchema.readSchema Reading Solr Schema
[junit4:junit4]   2> 71329 T337 oass.IndexSchema.readSchema Schema name=test
[junit4:junit4]   2> 72366 T337 oass.OpenExchangeRatesOrgProvider.init Initialized with rates=open-exchange-rates.json, refreshInterval=1440.
[junit4:junit4]   2> 72382 T337 oass.IndexSchema.readSchema default search field in schema is text
[junit4:junit4]   2> 72389 T337 oass.IndexSchema.readSchema unique key field: id
[junit4:junit4]   2> 72410 T337 oass.FileExchangeRateProvider.reload Reloading exchange rates from file currency.xml
[junit4:junit4]   2> 72415 T337 oass.FileExchangeRateProvider.reload Reloading exchange rates from file currency.xml
[junit4:junit4]   2> 72425 T337 oass.OpenExchangeRatesOrgProvider.reload Reloading exchange rates from open-exchange-rates.json
[junit4:junit4]   2> 72426 T337 oass.OpenExchangeRatesOrgProvider.reload Reloading exchange rates from open-exchange-rates.json
[junit4:junit4]   2> 72428 T337 oasc.SolrCore.<init> [collection1] Opening new SolrCore at C:\Users\JenkinsSlave\workspace\Lucene-Solr-4.x-Windows\solr\build\solr-core\test\J0\.\solrtest-jetty4-1351835357846\collection1\, dataDir=.\org.apache.solr.cloud.BasicDistributedZkTest-1351835287369/jetty4\
[junit4:junit4]   2> 72428 T337 oasc.JmxMonitoredMap.<init> JMX monitoring is enabled. Adding Solr mbeans to JMX Server: com.sun.jmx.mbeanserver.JmxMBeanServer@5f0f87
[junit4:junit4]   2> 72430 T337 oasc.SolrCore.getNewIndexDir New index directory detected: old=null new=.\org.apache.solr.cloud.BasicDistributedZkTest-1351835287369/jetty4\index/
[junit4:junit4]   2> 72433 T337 oasc.SolrCore.initIndex WARNING [collection1] Solr index directory '.\org.apache.solr.cloud.BasicDistributedZkTest-1351835287369\jetty4\index' doesn't exist. Creating new index...
[junit4:junit4]   2> 72433 T337 oasc.CachingDirectoryFactory.get return new directory for C:\Users\JenkinsSlave\workspace\Lucene-Solr-4.x-Windows\solr\build\solr-core\test\J0\.\org.apache.solr.cloud.BasicDistributedZkTest-1351835287369\jetty4\index forceNew:false
[junit4:junit4]   2> 72447 T337 oasc.SolrDeletionPolicy.onCommit SolrDeletionPolicy.onCommit: commits:num=1
[junit4:junit4]   2> 		commit{dir=NRTCachingDirectory(org.apache.lucene.store.SimpleFSDirectory@C:\Users\JenkinsSlave\workspace\Lucene-Solr-4.x-Windows\solr\build\solr-core\test\J0\org.apache.solr.cloud.BasicDistributedZkTest-1351835287369\jetty4\index lockFactory=org.apache.lucene.store.NativeFSLockFactory@1e99715; maxCacheMB=48.0 maxMergeSizeMB=4.0),segFN=segments_1,generation=1,filenames=[segments_1]
[junit4:junit4]   2> 72448 T337 oasc.SolrDeletionPolicy.updateCommits newest commit = 1
[junit4:junit4]   2> 72451 T337 oasc.SolrCore.initWriters created xml: solr.XMLResponseWriter
[junit4:junit4]   2> 72454 T337 oasup.UpdateRequestProcessorChain.init inserting DistributedUpdateProcessorFactory into updateRequestProcessorChain "dedupe"
[junit4:junit4]   2> 72456 T337 oasup.UpdateRequestProcessorChain.init inserting DistributedUpdateProcessorFactory into updateRequestProcessorChain "dedupe-allfields"
[junit4:junit4]   2> 72456 T337 oasup.UpdateRequestProcessorChain.init inserting DistributedUpdateProcessorFactory into updateRequestProcessorChain "stored_sig"
[junit4:junit4]   2> 72458 T337 oasup.UpdateRequestProcessorChain.init inserting DistributedUpdateProcessorFactory into updateRequestProcessorChain "uniq-fields"
[junit4:junit4]   2> 72458 T337 oasup.UpdateRequestProcessorChain.init inserting DistributedUpdateProcessorFactory into updateRequestProcessorChain "distrib-dup-test-chain-implicit"
[junit4:junit4]   2> 72461 T337 oasc.RequestHandlers.initHandlersFromConfig adding lazy requestHandler: solr.ReplicationHandler
[junit4:junit4]   2> 72461 T337 oasc.RequestHandlers.initHandlersFromConfig created /replication: solr.ReplicationHandler
[junit4:junit4]   2> 72461 T337 oasc.RequestHandlers.initHandlersFromConfig created standard: solr.StandardRequestHandler
[junit4:junit4]   2> 72462 T337 oasc.RequestHandlers.initHandlersFromConfig created /get: solr.RealTimeGetHandler
[junit4:junit4]   2> 72463 T337 oasc.RequestHandlers.initHandlersFromConfig created dismax: solr.SearchHandler
[junit4:junit4]   2> 72466 T337 oasc.RequestHandlers.initHandlersFromConfig created mock: org.apache.solr.core.MockQuerySenderListenerReqHandler
[junit4:junit4]   2> 72466 T337 oasc.RequestHandlers.initHandlersFromConfig created /admin/: org.apache.solr.handler.admin.AdminHandlers
[junit4:junit4]   2> 72466 T337 oasc.RequestHandlers.initHandlersFromConfig created defaults: solr.StandardRequestHandler
[junit4:junit4]   2> 72467 T337 oasc.RequestHandlers.initHandlersFromConfig adding lazy requestHandler: solr.StandardRequestHandler
[junit4:junit4]   2> 72469 T337 oasc.RequestHandlers.initHandlersFromConfig created lazy: solr.StandardRequestHandler
[junit4:junit4]   2> 72470 T337 oasc.RequestHandlers.initHandlersFromConfig created /update: solr.UpdateRequestHandler
[junit4:junit4]   2> 72470 T337 oasc.RequestHandlers.initHandlersFromConfig created /terms: org.apache.solr.handler.component.SearchHandler
[junit4:junit4]   2> 72470 T337 oasc.RequestHandlers.initHandlersFromConfig created spellCheckCompRH: org.apache.solr.handler.component.SearchHandler
[junit4:junit4]   2> 72472 T337 oasc.RequestHandlers.initHandlersFromConfig created spellCheckCompRH_Direct: org.apache.solr.handler.component.SearchHandler
[junit4:junit4]   2> 72473 T337 oasc.RequestHandlers.initHandlersFromConfig created spellCheckWithWordbreak: org.apache.solr.handler.component.SearchHandler
[junit4:junit4]   2> 72473 T337 oasc.RequestHandlers.initHandlersFromConfig created spellCheckWithWordbreak_Direct: org.apache.solr.handler.component.SearchHandler
[junit4:junit4]   2> 72474 T337 oasc.RequestHandlers.initHandlersFromConfig created spellCheckCompRH1: org.apache.solr.handler.component.SearchHandler
[junit4:junit4]   2> 72476 T337 oasc.RequestHandlers.initHandlersFromConfig created tvrh: org.apache.solr.handler.component.SearchHandler
[junit4:junit4]   2> 72476 T337 oasc.RequestHandlers.initHandlersFromConfig created /mlt: solr.MoreLikeThisHandler
[junit4:junit4]   2> 72476 T337 oasc.RequestHandlers.initHandlersFromConfig created /debug/dump: solr.DumpRequestHandler
[junit4:junit4]   2> 72488 T337 oashl.XMLLoader.init xsltCacheLifetimeSeconds=60
[junit4:junit4]   2> 72494 T337 oasc.SolrCore.initDeprecatedSupport WARNING solrconfig.xml uses deprecated <admin/gettableFiles>, Please update your config to use the ShowFileRequestHandler.
[junit4:junit4]   2> 72496 T337 oasc.SolrCore.initDeprecatedSupport WARNING adding ShowFileRequestHandler with hidden files: [SCHEMA.XML, OLD_SYNONYMS.TXT, STOPWORDS.TXT, PROTWORDS.TXT, OPEN-EXCHANGE-RATES.JSON, SYNONYMS.TXT, CURRENCY.XML, MAPPING-ISOLATIN1ACCENT.TXT]
[junit4:junit4]   2> 72503 T337 oass.SolrIndexSearcher.<init> Opening Searcher@129b95e main
[junit4:junit4]   2> 72506 T337 oasu.CommitTracker.<init> Hard AutoCommit: disabled
[junit4:junit4]   2> 72507 T337 oasu.CommitTracker.<init> Soft AutoCommit: disabled
[junit4:junit4]   2> 72507 T337 oashc.SpellCheckComponent.inform Initializing spell checkers
[junit4:junit4]   2> 72522 T337 oass.DirectSolrSpellChecker.init init: {name=direct,classname=DirectSolrSpellChecker,field=lowerfilt,minQueryLength=3}
[junit4:junit4]   2> 72608 T408 oasc.SolrCore.registerSearcher [collection1] Registered new searcher Searcher@129b95e main{StandardDirectoryReader(segments_1:1)}
[junit4:junit4]   2> 72612 T337 oasc.ZkController.publish numShards not found on descriptor - reading it from system property
[junit4:junit4]   2> 72775 T358 oascc.ZkStateReader.updateClusterState Updating cloud state from ZooKeeper... 
[junit4:junit4]   2> 72776 T358 oasc.Overseer$ClusterStateUpdater.updateState Update state numShards=2 message={
[junit4:junit4]   2> 	  "operation":"state",
[junit4:junit4]   2> 	  "numShards":"2",
[junit4:junit4]   2> 	  "shard":null,
[junit4:junit4]   2> 	  "roles":null,
[junit4:junit4]   2> 	  "state":"down",
[junit4:junit4]   2> 	  "core":"collection1",
[junit4:junit4]   2> 	  "collection":"collection1",
[junit4:junit4]   2> 	  "node_name":"127.0.0.1:63285_solr",
[junit4:junit4]   2> 	  "base_url":"http://127.0.0.1:63285/solr"}
[junit4:junit4]   2> 72787 T383 oascc.ZkStateReader$2.process A cluster state change has occurred - updating... (5)
[junit4:junit4]   2> 72789 T407 oascc.ZkStateReader$2.process A cluster state change has occurred - updating... (5)
[junit4:junit4]   2> 72791 T357 oascc.ZkStateReader$2.process A cluster state change has occurred - updating... (5)
[junit4:junit4]   2> 72791 T371 oascc.ZkStateReader$2.process A cluster state change has occurred - updating... (5)
[junit4:junit4]   2> 73320 T337 oasc.CoreContainer.register registering core: collection1
[junit4:junit4]   2> 73320 T337 oasc.ZkController.register Register shard - core:collection1 address:http://127.0.0.1:63285/solr shardId:shard2
[junit4:junit4]   2> 73326 T337 oasc.ZkController.register We are http://127.0.0.1:63285/solr/collection1/ and leader is http://127.0.0.1:63273/solr/collection1/
[junit4:junit4]   2> 73326 T337 oasc.ZkController.register No LogReplay needed for core=collection1 baseURL=http://127.0.0.1:63285/solr
[junit4:junit4]   2> 73326 T337 oasc.ZkController.checkRecovery Core needs to recover:collection1
[junit4:junit4]   2> 73327 T337 oasu.DefaultSolrCoreState.doRecovery Running recovery - first canceling any ongoing recovery
[junit4:junit4]   2> ASYNC  NEW_CORE C20 name=collection1 org.apache.solr.core.SolrCore@192fb7a url=http://127.0.0.1:63285/solr/collection1 node=127.0.0.1:63285_solr
[junit4:junit4]   2> 73332 T409 C20 P63285 oasc.RecoveryStrategy.run Starting recovery process.  core=collection1 recoveringAfterStartup=true
[junit4:junit4]   2> 73332 T409 C20 P63285 oasc.RecoveryStrategy.doRecovery ###### startupVersions=[]
[junit4:junit4]   2> 73334 T409 C20 P63285 oasc.ZkController.publish numShards not found on descriptor - reading it from system property
[junit4:junit4]   2> 73334 T337 oascc.ZkStateReader.updateClusterState Updating cloud state from ZooKeeper... 
[junit4:junit4]   2> 73338 T409 C20 P63285 oasc.RecoveryStrategy.doRecovery Attempting to PeerSync from http://127.0.0.1:63273/solr/collection1/ core=collection1 - recoveringAfterStartup=true
[junit4:junit4]   2> 73338 T409 C20 P63285 oasu.PeerSync.sync PeerSync: core=collection1 url=http://127.0.0.1:63285/solr START replicas=[http://127.0.0.1:63273/solr/collection1/] nUpdates=100
[junit4:junit4]   2> 73338 T337 oass.SolrDispatchFilter.init user.dir=C:\Users\JenkinsSlave\workspace\Lucene-Solr-4.x-Windows\solr\build\solr-core\test\J0
[junit4:junit4]   2> 73341 T409 C20 P63285 oasu.PeerSync.sync WARNING no frame of reference to tell of we've missed updates
[junit4:junit4]   2> 73341 T337 oass.SolrDispatchFilter.init SolrDispatchFilter.init() done
[junit4:junit4]   2> 73342 T337 oascsi.HttpClientUtil.createClient Creating new http client, config:maxConnections=128&maxConnectionsPerHost=32&followRedirects=false
[junit4:junit4]   2> 73343 T409 C20 P63285 oasc.RecoveryStrategy.doRecovery PeerSync Recovery was not successful - trying replication. core=collection1
[junit4:junit4]   2> 73345 T409 C20 P63285 oasc.RecoveryStrategy.doRecovery Starting Replication Recovery. core=collection1
[junit4:junit4]   2> 73346 T409 C20 P63285 oascsi.HttpClientUtil.createClient Creating new http client, config:maxConnections=128&maxConnectionsPerHost=32&followRedirects=false
[junit4:junit4]   2> 73360 T337 oaz.ZooKeeper.<init> Initiating client connection, connectString=127.0.0.1:63254/solr sessionTimeout=10000 watcher=org.apache.solr.common.cloud.ConnectionManager@15a24b3
[junit4:junit4]   2> 73364 T337 oascc.ConnectionManager.waitForConnected Waiting for client to connect to ZooKeeper
[junit4:junit4]   2> 73369 T411 oaz.ClientCnxn$SendThread.startConnect Opening socket connection to server /127.0.0.1:63254
[junit4:junit4]   2> 73372 T411 oaz.ClientCnxn$SendThread.primeConnection Socket connection established to 127.0.0.1/127.0.0.1:63254, initiating session
[junit4:junit4]   2> 73374 T339 oazs.NIOServerCnxn$Factory.run Accepted socket connection from /127.0.0.1:63295
[junit4:junit4]   2> 73374 T339 oazs.NIOServerCnxn.readConnectRequest Client attempting to establish new session at /127.0.0.1:63295
[junit4:junit4]   2> ASYNC  NEW_CORE C21 name=collection1 org.apache.solr.core.SolrCore@cde78 url=http://127.0.0.1:63273/solr/collection1 node=127.0.0.1:63273_solr
[junit4:junit4]   2> 73380 T377 C21 P63273 REQ /get {distrib=false&qt=/get&wt=javabin&version=2&getVersions=100} status=0 QTime=4 
[junit4:junit4]   2> 73380 T411 oaz.ClientCnxn$SendThread.readConnectResult Session establishment complete on server 127.0.0.1/127.0.0.1:63254, sessionid = 0x13abfa97f500007, negotiated timeout = 10000
[junit4:junit4]   2> 73380 T341 oazs.NIOServerCnxn.finishSessionInit Established session 0x13abfa97f500007 with negotiated timeout 10000 for client /127.0.0.1:63295
[junit4:junit4]   2> 73382 T412 oascc.ConnectionManager.process Watcher org.apache.solr.common.cloud.ConnectionManager@15a24b3 name:ZooKeeperConnection Watcher:127.0.0.1:63254/solr got event WatchedEvent state:SyncConnected type:None path:null path:null type:None
[junit4:junit4]   2> 73382 T337 oascc.ConnectionManager.waitForConnected Client is connected to ZooKeeper
[junit4:junit4]   2> 73383 T337 oascc.ZkStateReader.createClusterStateWatchersAndUpdate Updating cluster state from ZooKeeper... 
[junit4:junit4]   2> 73386 T337 oasc.ChaosMonkey.monkeyLog monkey: init - expire sessions:true cause connection loss:true
[junit4:junit4]   2> 73386 T337 oascsi.HttpClientUtil.createClient Creating new http client, config:
[junit4:junit4]   2> 73394 T337 oascc.ZkStateReader.updateClusterState Updating cloud state from ZooKeeper... 
[junit4:junit4]   2> 73396 T337 oasc.AbstractDistribZkTestBase.waitForRecoveriesToFinish Wait for recoveries to finish - collection: collection1 failOnTimeout:true timeout (sec):180
[junit4:junit4]   2> 73397 T337 oascc.ZkStateReader.updateClusterState Updating cloud state from ZooKeeper... 
[junit4:junit4]   2> 73504 T358 oascc.ZkStateReader.updateClusterState Updating cloud state from ZooKeeper... 
[junit4:junit4]   2> 73505 T358 oasc.Overseer$ClusterStateUpdater.updateState Update state numShards=2 message={
[junit4:junit4]   2> 	  "operation":"state",
[junit4:junit4]   2> 	  "numShards":"2",
[junit4:junit4]   2> 	  "shard":"shard2",
[junit4:junit4]   2> 	  "roles":null,
[junit4:junit4]   2> 	  "state":"recovering",
[junit4:junit4]   2> 	  "core":"collection1",
[junit4:junit4]   2> 	  "collection":"collection1",
[junit4:junit4]   2> 	  "node_name":"127.0.0.1:63285_solr",
[junit4:junit4]   2> 	  "base_url":"http://127.0.0.1:63285/solr"}
[junit4:junit4]   2> 73514 T412 oascc.ZkStateReader$2.process A cluster state change has occurred - updating... (5)
[junit4:junit4]   2> 73514 T383 oascc.ZkStateReader$2.process A cluster state change has occurred - updating... (5)
[junit4:junit4]   2> 73515 T357 oascc.ZkStateReader$2.process A cluster state change has occurred - updating... (5)
[junit4:junit4]   2> 73515 T371 oascc.ZkStateReader$2.process A cluster state change has occurred - updating... (5)
[junit4:junit4]   2> 73514 T407 oascc.ZkStateReader$2.process A cluster state change has occurred - updating... (5)
[junit4:junit4]   2> 74804 T337 oascc.ZkStateReader.updateClusterState Updating cloud state from ZooKeeper... 
[junit4:junit4]   2> 76213 T337 oascc.ZkStateReader.updateClusterState Updating cloud state from ZooKeeper... 
[junit4:junit4]   2>  C20_STATE=coll:collection1 core:collection1 props:{shard=shard2, roles=null, state=recovering, core=collection1, collection=collection1, node_name=127.0.0.1:63285_solr, base_url=http://127.0.0.1:63285/solr}
[junit4:junit4]   2> 77588 T409 C20 P63285 oasc.RecoveryStrategy.doRecovery Begin buffering updates. core=collection1
[junit4:junit4]   2> 77588 T409 C20 P63285 oasu.UpdateLog.bufferUpdates Starting to buffer updates. FSUpdateLog{state=ACTIVE, tlog=null}
[junit4:junit4]   2> 77588 T409 C20 P63285 oasc.RecoveryStrategy.replicate Attempting to replicate from http://127.0.0.1:63273/solr/collection1/. core=collection1
[junit4:junit4]   2> 77588 T409 C20 P63285 oascsi.HttpClientUtil.createClient Creating new http client, config:maxConnections=128&maxConnectionsPerHost=32&followRedirects=false
[junit4:junit4]   2> 77599 T381 C21 P63273 oasu.DirectUpdateHandler2.commit start commit{flags=0,_version_=0,optimize=false,openSearcher=false,waitSearcher=true,expungeDeletes=false,softCommit=false}
[junit4:junit4]   2> 77608 T381 C21 P63273 oasc.SolrDeletionPolicy.onInit SolrDeletionPolicy.onInit: commits:num=1
[junit4:junit4]   2> 		commit{dir=NRTCachingDirectory(org.apache.lucene.store.SimpleFSDirectory@C:\Users\JenkinsSlave\workspace\Lucene-Solr-4.x-Windows\solr\build\solr-core\test\J0\org.apache.solr.cloud.BasicDistributedZkTest-1351835287369\jetty2\index lockFactory=org.apache.lucene.store.NativeFSLockFactory@21035; maxCacheMB=48.0 maxMergeSizeMB=4.0),segFN=segments_1,generation=1,filenames=[segments_1]
[junit4:junit4]   2> 77608 T381 C21 P63273 oasc.SolrDeletionPolicy.updateCommits newest commit = 1
[junit4:junit4]   2> 77609 T381 C21 P63273 oass.SolrIndexSearcher.<init> Opening Searcher@1755c7c realtime
[junit4:junit4]   2> 77609 T381 C21 P63273 oasu.DirectUpdateHandler2.commit end_commit_flush
[junit4:junit4]   2> 77610 T381 C21 P63273 /update {waitSearcher=true&openSearcher=false&commit=true&commit_end_point=true&wt=javabin&softCommit=false&version=2} {commit=} 0 12
[junit4:junit4]   2> 77610 T409 C20 P63285 oash.ReplicationHandler.inform Commits will be reserved for  10000
[junit4:junit4]   2> 77612 T409 C20 P63285 oash.SnapPuller.<init>  No value set for 'pollInterval'. Timer Task not started.
[junit4:junit4]   2> 77614 T377 C21 P63273 oash.ReplicationHandler.inform Commits will be reserved for  10000
[junit4:junit4]   2> 77614 T377 C21 P63273 REQ /replication {command=indexversion&wt=javabin&qt=/replication&version=2} status=0 QTime=0 
[junit4:junit4]   2> 77620 T337 oascc.ZkStateReader.updateClusterState Updating cloud state from ZooKeeper... 
[junit4:junit4]   2> 77623 T409 C20 P63285 oasc.SolrDeletionPolicy.onInit SolrDeletionPolicy.onInit: commits:num=1
[junit4:junit4]   2> 		commit{dir=NRTCachingDirectory(org.apache.lucene.store.SimpleFSDirectory@C:\Users\JenkinsSlave\workspace\Lucene-Solr-4.x-Windows\solr\build\solr-core\test\J0\org.apache.solr.cloud.BasicDistributedZkTest-1351835287369\jetty4\index lockFactory=org.apache.lucene.store.NativeFSLockFactory@1e99715; maxCacheMB=48.0 maxMergeSizeMB=4.0),segFN=segments_1,generation=1,filenames=[segments_1]
[junit4:junit4]   2> 77624 T409 C20 P63285 oasc.SolrDeletionPolicy.updateCommits newest commit = 1
[junit4:junit4]   2> 77625 T409 C20 P63285 oasu.DirectUpdateHandler2.commit start commit{flags=0,_version_=0,optimize=false,openSearcher=true,waitSearcher=true,expungeDeletes=false,softCommit=false}
[junit4:junit4]   2> 77638 T409 C20 P63285 oasc.SolrDeletionPolicy.onCommit SolrDeletionPolicy.onCommit: commits:num=2
[junit4:junit4]   2> 		commit{dir=NRTCachingDirectory(org.apache.lucene.store.SimpleFSDirectory@C:\Users\JenkinsSlave\workspace\Lucene-Solr-4.x-Windows\solr\build\solr-core\test\J0\org.apache.solr.cloud.BasicDistributedZkTest-1351835287369\jetty4\index lockFactory=org.apache.lucene.store.NativeFSLockFactory@1e99715; maxCacheMB=48.0 maxMergeSizeMB=4.0),segFN=segments_1,generation=1,filenames=[segments_1]
[junit4:junit4]   2> 		commit{dir=NRTCachingDirectory(org.apache.lucene.store.SimpleFSDirectory@C:\Users\JenkinsSlave\workspace\Lucene-Solr-4.x-Windows\solr\build\solr-core\test\J0\org.apache.solr.cloud.BasicDistributedZkTest-1351835287369\jetty4\index lockFactory=org.apache.lucene.store.NativeFSLockFactory@1e99715; maxCacheMB=48.0 maxMergeSizeMB=4.0),segFN=segments_2,generation=2,filenames=[segments_2]
[junit4:junit4]   2> 77638 T409 C20 P63285 oasc.SolrDeletionPolicy.updateCommits newest commit = 2
[junit4:junit4]   2> 77643 T409 C20 P63285 oass.SolrIndexSearcher.<init> Opening Searcher@fc8c8b main
[junit4:junit4]   2> 77645 T409 C20 P63285 oasu.DirectUpdateHandler2.commit end_commit_flush
[junit4:junit4]   2> 77646 T408 oasc.SolrCore.registerSearcher [collection1] Registered new searcher Searcher@fc8c8b main{StandardDirectoryReader(segments_2:2)}
[junit4:junit4]   2> 77647 T409 C20 P63285 oasc.RecoveryStrategy.replay No replay needed. core=collection1
[junit4:junit4]   2> 77647 T409 C20 P63285 oasc.RecoveryStrategy.doRecovery Replication Recovery was successful - registering as Active. core=collection1
[junit4:junit4]   2> 77647 T409 C20 P63285 oasc.ZkController.publish numShards not found on descriptor - reading it from system property
[junit4:junit4]   2> 77652 T409 C20 P63285 oasc.RecoveryStrategy.doRecovery Finished recovery process. core=collection1
[junit4:junit4]   2> 77752 T358 oascc.ZkStateReader.updateClusterState Updating cloud state from ZooKeeper... 
[junit4:junit4]   2> 77753 T358 oasc.Overseer$ClusterStateUpdater.updateState Update state numShards=2 message={
[junit4:junit4]   2> 	  "operation":"state",
[junit4:junit4]   2> 	  "numShards":"2",
[junit4:junit4]   2> 	  "shard":"shard2",
[junit4:junit4]   2> 	  "roles":null,
[junit4:junit4]   2> 	  "state":"active",
[junit4:junit4]   2> 	  "core":"collection1",
[junit4:junit4]   2> 	  "collection":"collection1",
[junit4:junit4]   2> 	  "node_name":"127.0.0.1:63285_solr",
[junit4:junit4]   2> 	  "base_url":"http://127.0.0.1:63285/solr"}
[junit4:junit4]   2> 77761 T383 oascc.ZkStateReader$2.process A cluster state change has occurred - updating... (5)
[junit4:junit4]   2> 77763 T407 oascc.ZkStateReader$2.process A cluster state change has occurred - updating... (5)
[junit4:junit4]   2> 77763 T371 oascc.ZkStateReader$2.process A cluster state change has occurred - updating... (5)
[junit4:junit4]   2> 77761 T412 oascc.ZkStateReader$2.process A cluster state change has occurred - updating... (5)
[junit4:junit4]   2> 77763 T357 oascc.ZkStateReader$2.process A cluster state change has occurred - updating... (5)
[junit4:junit4]   2> 78959 T337 oascc.ZkStateReader.updateClusterState Updating cloud state from ZooKeeper... 
[junit4:junit4]   2> 80227 T337 oascc.ZkStateReader.updateClusterState Updating cloud state from ZooKeeper... 
[junit4:junit4]   2> 81494 T337 oascc.ZkStateReader.updateClusterState Updating cloud state from ZooKeeper... 
[junit4:junit4]   2> 82761 T337 oascc.ZkStateReader.updateClusterState Updating cloud state from ZooKeeper... 
[junit4:junit4]   2> 84028 T337 oascc.ZkStateReader.updateClusterState Updating cloud state from ZooKeeper... 
[junit4:junit4]   2> 85296 T337 oascc.ZkStateReader.updateClusterState Updating cloud state from ZooKeeper... 
[junit4:junit4]   2> 86562 T337 oascc.ZkStateReader.updateClusterState Updating cloud state from ZooKeeper... 
[junit4:junit4]   2> 87830 T337 oascc.ZkStateReader.updateClusterState Updating cloud state from ZooKeeper... 
[junit4:junit4]   2> 89096 T337 oascc.ZkStateReader.updateClusterState Updating cloud state from ZooKeeper... 
[junit4:junit4]   2> 90364 T337 oascc.ZkStateReader.updateClusterState Updating cloud state from ZooKeeper... 
[junit4:junit4]   2> 91568 T337 oascc.ZkStateReader.updateClusterState Updating cloud state from ZooKeeper... 
[junit4:junit4]   2> 92708 T337 oascc.ZkStateReader.updateClusterState Updating cloud state from ZooKeeper... 
[junit4:junit4]   2> 93849 T337 oascc.ZkStateReader.updateClusterState Updating cloud state from ZooKeeper... 
[junit4:junit4]   2> 94990 T337 oascc.ZkStateReader.updateClusterState Updating cloud state from ZooKeeper... 
[junit4:junit4]   2> 96131 T337 oascc.ZkStateReader.updateClusterState Updating cloud state from ZooKeeper... 
[junit4:junit4]   2> 97271 T337 oascc.ZkStateReader.updateClusterState Updating cloud state from ZooKeeper... 
[junit4:junit4]   2> 98411 T337 oascc.ZkStateReader.updateClusterState Updating cloud state from ZooKeeper... 
[junit4:junit4]   2> 99550 T337 oascc.ZkStateReader.updateClusterState Updating cloud state from ZooKeeper... 
[junit4:junit4]   2> 100690 T337 oascc.ZkStateReader.updateClusterState Updating cloud state from ZooKeeper... 
[junit4:junit4]   2> 101831 T337 oascc.ZkStateReader.updateClusterState Updating cloud state from ZooKeeper... 
[junit4:junit4]   2> 102913 T337 oascc.ZkStateReader.updateClusterState Updating cloud state from ZooKeeper... 
[junit4:junit4]   2> 103939 T337 oascc.ZkStateReader.updateClusterState Updating cloud state from ZooKeeper... 
[junit4:junit4]   2> 104966 T337 oascc.ZkStateReader.updateClusterState Updating cloud state from ZooKeeper... 
[junit4:junit4]   2> 105993 T337 oascc.ZkStateReader.updateClusterState Updating cloud state from ZooKeeper... 
[junit4:junit4]   2> 107019 T337 oascc.ZkStateReader.updateClusterState Updating cloud state from ZooKeeper... 
[junit4:junit4]   2> 108046 T337 oascc.ZkStateReader.updateClusterState Updating cloud state from ZooKeeper... 
[junit4:junit4]   2> 109074 T337 oascc.ZkStateReader.updateClusterState Updating cloud state from ZooKeeper... 
[junit4:junit4]   2> 110100 T337 oascc.ZkStateReader.updateClusterState Updating cloud state from ZooKeeper... 
[junit4:junit4]   2> 111126 T337 oascc.ZkStateReader.updateClusterState Updating cloud state from ZooKeeper... 
[junit4:junit4]   2> 112152 T337 oascc.ZkStateReader.updateClusterState Updating cloud state from ZooKeeper... 
[junit4:junit4]   2> 113125 T337 oascc.ZkStateReader.updateClusterState Updating cloud state from ZooKeeper... 
[junit4:junit4]   2> 114049 T337 oascc.ZkStateReader.updateClusterState Updating cloud state from ZooKeeper... 
[junit4:junit4]   2> 114972 T337 oascc.ZkStateReader.updateClusterState Updating cloud state from ZooKeeper... 
[junit4:junit4]   2> 115896 T337 oascc.ZkStateReader.updateClusterState Updating cloud state from ZooKeeper... 
[junit4:junit4]   2> 116821 T337 oascc.ZkStateReader.updateClusterState Updating cloud state from ZooKeeper... 
[junit4:junit4]   2> 117744 T337 oascc.ZkStateReader.updateClusterState Updating cloud state from ZooKeeper... 
[junit4:junit4]   2> 118667 T337 oascc.ZkStateReader.updateClusterState Updating cloud state from ZooKeeper... 
[junit4:junit4]   2> 119591 T337 oascc.ZkStateReader.updateClusterState Updating cloud state from ZooKeeper... 
[junit4:junit4]   2> 120514 T337 oascc.ZkStateReader.updateClusterState Updating cloud state from ZooKeeper... 
[junit4:junit4]   2> 121438 T337 oascc.ZkStateReader.updateClusterState Updating cloud state from ZooKeeper... 
[junit4:junit4]   2> 122312 T337 oascc.ZkStateReader.updateClusterState Updating cloud state from ZooKeeper... 
[junit4:junit4]   2> 123143 T337 oascc.ZkStateReader.updateClusterState Updating cloud state from ZooKeeper... 
[junit4:junit4]   2> 123975 T337 oascc.ZkStateReader.updateClusterState Updating cloud state from ZooKeeper... 
[junit4:junit4]   2> 124807 T337 oascc.ZkStateReader.updateClusterState Updating cloud state from ZooKeeper... 
[junit4:junit4]   2> 125638 T337 oascc.ZkStateReader.updateClusterState Updating cloud state from ZooKeeper... 
[junit4:junit4]   2> 126469 T337 oascc.ZkStateReader.updateClusterState Updating cloud state from ZooKeeper... 
[junit4:junit4]   2> 127300 T337 oascc.ZkStateReader.updateClusterState Updating cloud state from ZooKeeper... 
[junit4:junit4]   2> 128132 T337 oascc.ZkStateReader.updateClusterState Updating cloud state from ZooKeeper... 
[junit4:junit4]   2> 128964 T337 oascc.ZkStateReader.updateClusterState Updating cloud state from ZooKeeper... 
[junit4:junit4]   2> 129796 T337 oascc.ZkStateReader.updateClusterState Updating cloud state from ZooKeeper... 
[junit4:junit4]   2> 130581 T337 oascc.ZkStateReader.updateClusterState Updating cloud state from ZooKeeper... 
[junit4:junit4]   2> 131330 T337 oascc.ZkStateReader.updateClusterState Updating cloud state from ZooKeeper... 
[junit4:junit4]   2> 132078 T337 oascc.ZkStateReader.updateClusterState Updating cloud state from ZooKeeper... 
[junit4:junit4]   2> 132826 T337 oascc.ZkStateReader.updateClusterState Updating cloud state from ZooKeeper... 
[junit4:junit4]   2> 133575 T337 oascc.ZkStateReader.updateClusterState Updating cloud state from ZooKeeper... 
[junit4:junit4]   2> 134324 T337 oascc.ZkStateReader.updateClusterState Updating cloud state from ZooKeeper... 
[junit4:junit4]   2> 135072 T337 oascc.ZkStateReader.updateClusterState Updating cloud state from ZooKeeper... 
[junit4:junit4]   2> 135819 T337 oascc.ZkStateReader.updateClusterState Updating cloud state from ZooKeeper... 
[junit4:junit4]   2> 136568 T337 oascc.ZkStateReader.updateClusterState Updating cloud state from ZooKeeper... 
[junit4:junit4]   2> 137317 T337 oascc.ZkStateReader.updateClusterState Updating cloud state from ZooKeeper... 
[junit4:junit4]   2> 138108 T337 oascc.ZkStateReader.updateClusterState Updating cloud state from ZooKeeper... 
[junit4:junit4]   2> 138932 T337 oascc.ZkStateReader.updateClusterState Updating cloud state from ZooKeeper... 
[junit4:junit4]   2> 139754 T337 oascc.ZkStateReader.updateClusterState Updating cloud state from ZooKeeper... 
[junit4:junit4]   2> 140578 T337 oascc.ZkStateReader.updateClusterState Updating cloud state from ZooKeeper... 
[junit4:junit4]   2> 141400 T337 oascc.ZkStateReader.updateClusterState Updating cloud state from ZooKeeper... 
[junit4:junit4]   2> 142223 T337 oascc.ZkStateReader.updateClusterState Updating cloud state from ZooKeeper... 
[junit4:junit4]   2> 143047 T337 oascc.ZkStateReader.updateClusterState Updating cloud state from ZooKeeper... 
[junit4:junit4]   2> 143870 T337 oascc.ZkStateReader.updateClusterState Updating cloud state from ZooKeeper... 
[junit4:junit4]   2> 144694 T337 oascc.ZkStateReader.updateClusterState Updating cloud state from ZooKeeper... 
[junit4:junit4]   2> 145517 T337 oascc.ZkStateReader.updateClusterState Updating cloud state from ZooKeeper... 
[junit4:junit4]   2> 146388 T337 oascc.ZkStateReader.updateClusterState Updating cloud state from ZooKeeper... 
[junit4:junit4]   2> 147294 T337 oascc.ZkStateReader.updateClusterState Updating cloud state from ZooKeeper... 
[junit4:junit4]   2> 148200 T337 oascc.ZkStateReader.updateClusterState Updating cloud state from ZooKeeper... 
[junit4:junit4]   2> 149105 T337 oascc.ZkStateReader.updateClusterState Updating cloud state from ZooKeeper... 
[junit4:junit4]   2> 150010 T337 oascc.ZkStateReader.updateClusterState Updating cloud state from ZooKeeper... 
[junit4:junit4]   2> 150916 T337 oascc.ZkStateReader.updateClusterState Updating cloud state from ZooKeeper... 
[junit4:junit4]   2> 151821 T337 oascc.ZkStateReader.updateClusterState Updating cloud state from ZooKeeper... 
[junit4:junit4]   2> 152725 T337 oascc.ZkStateReader.updateClusterState Updating cloud state from ZooKeeper... 
[junit4:junit4]   2> 153630 T337 oascc.ZkStateReader.updateClusterState Updating cloud state from ZooKeeper... 
[junit4:junit4]   2> 154537 T337 oascc.ZkStateReader.updateClusterState Updating cloud state from ZooKeeper... 
[junit4:junit4]   2> 155499 T337 oascc.ZkStateReader.updateClusterState Updating cloud state from ZooKeeper... 
[junit4:junit4]   2> 156494 T337 oascc.ZkStateReader.updateClusterState Updating cloud state from ZooKeeper... 
[junit4:junit4]   2> 157490 T337 oascc.ZkStateReader.updateClusterState Updating cloud state from ZooKeeper... 
[junit4:junit4]   2> 158486 T337 oascc.ZkStateReader.updateClusterState Updating cloud state from ZooKeeper... 
[junit4:junit4]   2> 159482 T337 oascc.ZkStateReader.updateClusterState Updating cloud state from ZooKeeper... 
[junit4:junit4]   2> 160479 T337 oascc.ZkStateReader.updateClusterState Updating cloud state from ZooKeeper... 
[junit4:junit4]   2> 161474 T337 oascc.ZkStateReader.updateClusterState Updating cloud state from ZooKeeper... 
[junit4:junit4]   2> 162470 T337 oascc.ZkStateReader.updateClusterState Updating cloud state from ZooKeeper... 
[junit4:junit4]   2> 163465 T337 oascc.ZkStateReader.updateClusterState Updating cloud state from ZooKeeper... 
[junit4:junit4]   2> 164461 T337 oascc.ZkStateReader.updateClusterState Updating cloud state from ZooKeeper... 
[junit4:junit4]   2> 165518 T337 oascc.ZkStateReader.updateClusterState Updating cloud state from ZooKeeper... 
[junit4:junit4]   2> 166613 T337 oascc.ZkStateReader.updateClusterState Updating cloud state from ZooKeeper... 
[junit4:junit4]   2> 167708 T337 oascc.ZkStateReader.updateClusterState Updating cloud state from ZooKeeper... 
[junit4:junit4]   2> 168804 T337 oascc.ZkStateReader.updateClusterState Updating cloud state from ZooKeeper... 
[junit4:junit4]   2> 169899 T337 oascc.ZkStateReader.updateClusterState Updating cloud state from ZooKeeper... 
[junit4:junit4]   2> 170995 T337 oascc.ZkStateReader.updateClusterState Updating cloud state from ZooKeeper... 
[junit4:junit4]   2> 172090 T337 oascc.ZkStateReader.updateClusterState Updating cloud state from ZooKeeper... 
[junit4:junit4]   2> 173185 T337 oascc.ZkStateReader.updateClusterState Updating cloud state from ZooKeeper... 
[junit4:junit4]   2> 174280 T337 oascc.ZkStateReader.updateClusterState Updating cloud state from ZooKeeper... 
[junit4:junit4]   2> 175376 T337 oascc.ZkStateReader.updateClusterState Updating cloud state from ZooKeeper... 
[junit4:junit4]   2> 176541 T337 oascc.ZkStateReader.updateClusterState Updating cloud state from ZooKeeper... 
[junit4:junit4]   2> 177746 T337 oascc.ZkStateReader.updateClusterState Updating cloud state from ZooKeeper... 
[junit4:junit4]   2> 178951 T337 oascc.ZkStateReader.updateClusterState Updating cloud state from ZooKeeper... 
[junit4:junit4]   2> 180157 T337 oascc.ZkStateReader.updateClusterState Updating cloud state from ZooKeeper... 
[junit4:junit4]   2> 181361 T337 oascc.ZkStateReader.updateClusterState Updating cloud state from ZooKeeper... 
[junit4:junit4]   2> 182566 T337 oascc.ZkStateReader.updateClusterState Updating cloud state from ZooKeeper... 
[junit4:junit4]   2> 183771 T337 oascc.ZkStateReader.updateClusterState Updating cloud state from ZooKeeper... 
[junit4:junit4]   2> 184977 T337 oascc.ZkStateReader.updateClusterState Updating cloud state from ZooKeeper... 
[junit4:junit4]   2> 186183 T337 oascc.ZkStateReader.updateClusterState Updating cloud state from ZooKeeper... 
[junit4:junit4]   2> 187388 T337 oascc.ZkStateReader.updateClusterState Updating cloud state from ZooKeeper... 
[junit4:junit4]   2> 188672 T337 oascc.ZkStateReader.updateClusterState Updating cloud state from ZooKeeper... 
[junit4:junit4]   2> 189997 T337 oascc.ZkStateReader.updateClusterState Updating cloud state from ZooKeeper... 
[junit4:junit4]   2> 191321 T337 oascc.ZkStateReader.updateClusterState Updating cloud state from ZooKeeper... 
[junit4:junit4]   2> 192646 T337 oascc.ZkStateReader.updateClusterState Updating cloud state from ZooKeeper... 
[junit4:junit4]   2> 193974 T337 oascc.ZkStateReader.updateClusterState Updating cloud state from ZooKeeper... 
[junit4:junit4]   2> 195299 T337 oascc.ZkStateReader.updateClusterState Updating cloud state from ZooKeeper... 
[junit4:junit4]   2> 196626 T337 oascc.ZkStateReader.updateClusterState Updating cloud state from ZooKeeper... 
[junit4:junit4]   2> 197951 T337 oascc.ZkStateReader.updateClusterState Updating cloud state from ZooKeeper... 
[junit4:junit4]   2> 199276 T337 oascc.ZkStateReader.updateClusterState Updating cloud state from ZooKeeper... 
[junit4:junit4]   2> 200601 T337 oascc.ZkStateReader.updateClusterState Updating cloud state from ZooKeeper... 
[junit4:junit4]   2> 201840 T337 oascc.ZkStateReader.updateClusterState Updating cloud state from ZooKeeper... 
[junit4:junit4]   2> 203033 T337 oascc.ZkStateReader.updateClusterState Updating cloud state from ZooKeeper... 
[junit4:junit4]   2> 204226 T337 oascc.ZkStateReader.updateClusterState Updating cloud state from ZooKeeper... 
[junit4:junit4]   2> 205419 T337 oascc.ZkStateReader.updateClusterState Updating cloud state from ZooKeeper... 
[junit4:junit4]   2> 206612 T337 oascc.ZkStateReader.updateClusterState Updating cloud state from ZooKeeper... 
[junit4:junit4]   2> 207805 T337 oascc.ZkStateReader.updateClusterState Updating cloud state from ZooKeeper... 
[junit4:junit4]   2> 208997 T337 oascc.ZkStateReader.updateClusterState Updating cloud state from ZooKeeper... 
[junit4:junit4]   2> 210191 T337 oascc.ZkStateReader.updateClusterState Updating cloud state from ZooKeeper... 
[junit4:junit4]   2> 211383 T337 oascc.ZkStateReader.updateClusterState Updating cloud state from ZooKeeper... 
[junit4:junit4]   2> 212577 T337 oascc.ZkStateReader.updateClusterState Updating cloud state from ZooKeeper... 
[junit4:junit4]   2> 213690 T337 oascc.ZkStateReader.updateClusterState Updating cloud state from ZooKeeper... 
[junit4:junit4]   2> 214764 T337 oascc.ZkStateReader.updateClusterState Updating cloud state from ZooKeeper... 
[junit4:junit4]   2> 215838 T337 oascc.ZkStateReader.updateClusterState Updating cloud state from ZooKeeper... 
[junit4:junit4]   2> 216912 T337 oascc.ZkStateReader.updateClusterState Updating cloud state from ZooKeeper... 
[junit4:junit4]   2> 217986 T337 oascc.ZkStateReader.updateClusterState Updating cloud state from ZooKeeper... 
[junit4:junit4]   2> 219059 T337 oascc.ZkStateReader.updateClusterState Updating cloud state from ZooKeeper... 
[junit4:junit4]   2> 220134 T337 oascc.ZkStateReader.updateClusterState Updating cloud state from ZooKeeper... 
[junit4:junit4]   2> 221208 T337 oascc.ZkStateReader.updateClusterState Updating cloud state from ZooKeeper... 
[junit4:junit4]   2> 222282 T337 oascc.ZkStateReader.updateClusterState Updating cloud state from ZooKeeper... 
[junit4:junit4]   2> 223357 T337 oascc.ZkStateReader.updateClusterState Updating cloud state from ZooKeeper... 
[junit4:junit4]   2> 224356 T337 oascc.ZkStateReader.updateClusterState Updating cloud state from ZooKeeper... 
[junit4:junit4]   2> 225321 T337 oascc.ZkStateReader.updateClusterState Updating cloud state from ZooKeeper... 
[junit4:junit4]   2> 226288 T337 oascc.ZkStateReader.updateClusterState Updating cloud state from ZooKeeper... 
[junit4:junit4]   2> 227255 T337 oascc.ZkStateReader.updateClusterState Updating cloud state from ZooKeeper... 
[junit4:junit4]   2> 228221 T337 oascc.ZkStateReader.updateClusterState Updating cloud state from ZooKeeper... 
[junit4:junit4]   2> 229188 T337 oascc.ZkStateReader.updateClusterState Updating cloud state from ZooKeeper... 
[junit4:junit4]   2> 230154 T337 oascc.ZkStateReader.updateClusterState Updating cloud state from ZooKeeper... 
[junit4:junit4]   2> 231120 T337 oascc.ZkStateReader.updateClusterState Updating cloud state from ZooKeeper... 
[junit4:junit4]   2> 232087 T337 oascc.ZkStateReader.updateClusterState Updating cloud state from ZooKeeper... 
[junit4:junit4]   2> 233054 T337 oascc.ZkStateReader.updateClusterState Updating cloud state from ZooKeeper... 
[junit4:junit4]   2> 233951 T337 oascc.ZkStateReader.updateClusterState Updating cloud state from ZooKeeper... 
[junit4:junit4]   2> 234821 T337 oascc.ZkStateReader.updateClusterState Updating cloud state from ZooKeeper... 
[junit4:junit4]   2> 235691 T337 oascc.ZkStateReader.updateClusterState Updating cloud state from ZooKeeper... 
[junit4:junit4]   2> 236560 T337 oascc.ZkStateReader.updateClusterState Updating cloud state from ZooKeeper... 
[junit4:junit4]   2> 237430 T337 oascc.ZkStateReader.updateClusterState Updating cloud state from ZooKeeper... 
[junit4:junit4]   2> 238300 T337 oascc.ZkStateReader.updateClusterState Updating cloud state from ZooKeeper... 
[junit4:junit4]   2> 239170 T337 oascc.ZkStateReader.updateClusterState Updating cloud state from ZooKeeper... 
[junit4:junit4]   2> 240039 T337 oascc.ZkStateReader.updateClusterState Updating cloud state from ZooKeeper... 
[junit4:junit4]   2> 240909 T337 oascc.ZkStateReader.updateClusterState Updating cloud state from ZooKeeper... 
[junit4:junit4]   2> 241778 T337 oascc.ZkStateReader.updateClusterState Updating cloud state from ZooKeeper... 
[junit4:junit4]   2> 242586 T337 oascc.ZkStateReader.updateClusterState Updating cloud state from ZooKeeper... 
[junit4:junit4]   2> 243368 T337 oascc.ZkStateReader.updateClusterState Updating cloud state from ZooKeeper... 
[junit4:junit4]   2> 244151 T337 oascc.ZkStateReader.updateClusterState Updating cloud state from ZooKeeper... 
[junit4:junit4]   2> 244934 T337 oascc.ZkStateReader.updateClusterState Updating cloud state from ZooKeeper... 
[junit4:junit4]   2> 245717 T337 oascc.ZkStateReader.updateClusterState Updating cloud state from ZooKeeper... 
[junit4:junit4]   2> 246500 T337 oascc.ZkStateReader.updateClusterState Updating cloud state from ZooKeeper... 
[junit4:junit4]   2> 247283 T337 oascc.ZkStateReader.updateClusterState Updating cloud state from ZooKeeper... 
[junit4:junit4]   2> 248066 T337 oascc.ZkStateReader.updateClusterState Updating cloud state from ZooKeeper... 
[junit4:junit4]   2> 248849 T337 oascc.ZkStateReader.updateClusterState Updating cloud state from ZooKeeper... 
[junit4:junit4]   2> 249631 T337 oascc.ZkStateReader.updateClusterState Updating cloud state from ZooKeeper... 
[junit4:junit4]   2> 250471 T337 oascc.ZkStateReader.updateClusterState Updating cloud state from ZooKeeper... 
[junit4:junit4]   2> 251332 T337 oascc.ZkStateReader.updateClusterState Updating cloud state from ZooKeeper... 
[junit4:junit4]   2> 252193 T337 oascc.ZkStateReader.updateClusterState Updating cloud state from ZooKeeper... 
[junit4:junit4]   2> 253054 T337 oascc.ZkStateReader.updateClusterState Updating cloud state from ZooKeeper... 
[junit4:junit4]   2> 253914 T337 oascc.ZkStateReader.updateClusterState Updating cloud state from ZooKeeper... 
[junit4:junit4]   2> 254775 T337 oascc.ZkStateReader.updateClusterState Updating cloud state from ZooKeeper... 
[junit4:junit4]   2> 255636 T337 oascc.ZkStateReader.updateClusterState Updating cloud state from ZooKeeper... 
[junit4:junit4]   1> 
[junit4:junit4]   1> Thread[TEST-BasicDistributedZkTest.testDistribSearch-seed#[2C37AB2482B95E3B]-SendThread(127.0.0.1:63254),5,TGRP-BasicDistributedZkTest]
[junit4:junit4]   1> sun.nio.ch.WindowsSelectorImpl$SubSelector.poll0(Native Method)
[junit4:junit4]   1> sun.nio.ch.WindowsSelectorImpl$SubSelector.poll(WindowsSelectorImpl.java:295)
[junit4:junit4]   1> sun.nio.ch.WindowsSelectorImpl$SubSelector.access$400(WindowsSelectorImpl.java:277)
[junit4:junit4]   1> sun.nio.ch.WindowsSelectorImpl.doSelect(WindowsSelectorImpl.java:158)
[junit4:junit4]   1> sun.nio.ch.SelectorImpl.lockAndDoSelect(SelectorImpl.java:87)
[junit4:junit4]   1> sun.nio.ch.SelectorImpl.select(SelectorImpl.java:98)
[junit4:junit4]   1> org.apache.zookeeper.ClientCnxn$SendThread.run(ClientCnxn.java:1131)
[junit4:junit4]   1> 
[junit4:junit4]   1> Thread[TEST-BasicDistributedZkTest.testDistribSearch-seed#[2C37AB2482B95E3B]-EventThread,5,TGRP-BasicDistributedZkTest]
[junit4:junit4]   1> sun.misc.Unsafe.park(Native Method)
[junit4:junit4]   1> java.util.concurrent.locks.LockSupport.park(LockSupport.java:186)
[junit4:junit4]   1> java.util.concurrent.locks.AbstractQueuedSynchronizer$ConditionObject.await(AbstractQueuedSynchronizer.java:2043)
[junit4:junit4]   1> java.util.concurrent.LinkedBlockingQueue.take(LinkedBlockingQueue.java:442)
[junit4:junit4]   1> org.apache.zookeeper.ClientCnxn$EventThread.run(ClientCnxn.java:498)
[junit4:junit4]   1> 
[junit4:junit4]   1> Thread[HashSessionScavenger-5,5,TGRP-BasicDistributedZkTest]
[junit4:junit4]   1> java.lang.Object.wait(Native Method)
[junit4:junit4]   1> java.util.TimerThread.mainLoop(Timer.java:552)
[junit4:junit4]   1> java.util.TimerThread.run(Timer.java:505)
[junit4:junit4]   1> 
[junit4:junit4]   1> Thread[qtp11031280-375 Acceptor0 SelectChannelConnector@0.0.0.0:63273,5,TGRP-BasicDistributedZkTest]
[junit4:junit4]   1> sun.nio.ch.ServerSocketChannelImpl.accept0(Native Method)
[junit4:junit4]   1> sun.nio.ch.ServerSocketChannelImpl.accept(ServerSocketChannelImpl.java:226)
[junit4:junit4]   1> org.eclipse.jetty.server.nio.SelectChannelConnector.accept(SelectChannelConnector.java:104)
[junit4:junit4]   1> org.eclipse.jetty.server.AbstractConnector$Acceptor.run(AbstractConnector.java:933)
[junit4:junit4]   1> org.eclipse.jetty.util.thread.QueuedThreadPool.runJob(QueuedThreadPool.java:599)
[junit4:junit4]   1> org.eclipse.jetty.util.thread.QueuedThreadPool$3.run(QueuedThreadPool.java:534)
[junit4:junit4]   1> java.lang.Thread.run(Thread.java:722)
[junit4:junit4]   1> 
[junit4:junit4]   1> Thread[qtp3185543-405,5,TGRP-BasicDistributedZkTest]
[junit4:junit4]   1> sun.misc.Unsafe.park(Native Method)
[junit4:junit4]   1> java.util.concurrent.locks.LockSupport.parkNanos(LockSupport.java:226)
[junit4:junit4]   1> java.util.concurrent.locks.AbstractQueuedSynchronizer$ConditionObject.awaitNanos(AbstractQueuedSynchronizer.java:2082)
[junit4:junit4]   1> org.eclipse.jetty.util.BlockingArrayQueue.poll(BlockingArrayQueue.java:337)
[junit4:junit4]   1> org.eclipse.jetty.util.thread.QueuedThreadPool.idleJobPoll(QueuedThreadPool.java:517)
[junit4:junit4]   1> org.eclipse.jetty.util.thread.QueuedThreadPool.access$600(QueuedThreadPool.java:39)
[junit4:junit4]   1> org.eclipse.jetty.util.thread.QueuedThreadPool$3.run(QueuedThreadPool.java:563)
[junit4:junit4]   1> java.lang.Thread.run(Thread.java:722)
[junit4:junit4]   1> 
[junit4:junit4]   1> Thread[Signal Dispatcher,9,system]
[junit4:junit4]   1> 
[junit4:junit4]   1> Thread[qtp29472451-391,5,TGRP-BasicDistributedZkTest]
[junit4:junit4]   1> sun.misc.Unsafe.park(Native Method)
[junit4:junit4]   1> java.util.concurrent.locks.LockSupport.parkNanos(LockSupport.java:226)
[junit4:junit4]   1> java.util.concurrent.locks.AbstractQueuedSynchronizer$ConditionObject.awaitNanos(AbstractQueuedSynchronizer.java:2082)
[junit4:junit4]   1> org.eclipse.jetty.util.BlockingArrayQueue.poll(BlockingArrayQueue.java:337)
[junit4:junit4]   1> org.eclipse.jetty.util.thread.QueuedThreadPool.idleJobPoll(QueuedThreadPool.java:517)
[junit4:junit4]   1> org.eclipse.jetty.util.thread.QueuedThreadPool.access$600(QueuedThreadPool.java:39)
[junit4:junit4]   1> org.eclipse.jetty.util.thread.QueuedThreadPool$3.run(QueuedThreadPool.java:563)
[junit4:junit4]   1> java.lang.Thread.run(Thread.java:722)
[junit4:junit4]   1> 
[junit4:junit4]   1> Thread[HashSessionScavenger-7,5,TGRP-BasicDistributedZkTest]
[junit4:junit4]   1> java.lang.Object.wait(Native Method)
[junit4:junit4]   1> java.util.TimerThread.mainLoop(Timer.java:552)
[junit4:junit4]   1> java.util.TimerThread.run(Timer.java:505)
[junit4:junit4]   1> 
[junit4:junit4]   1> Thread[qtp24950648-369,5,TGRP-BasicDistributedZkTest]
[junit4:junit4]   1> sun.misc.Unsafe.park(Native Method)
[junit4:junit4]   1> java.util.concurrent.locks.LockSupport.parkNanos(LockSupport.java:226)
[junit4:junit4]   1> java.util.concurrent.locks.AbstractQueuedSynchronizer$ConditionObject.awaitNanos(AbstractQueuedSynchronizer.java:2082)
[junit4:junit4]   1> org.eclipse.jetty.util.BlockingArrayQueue.poll(BlockingArrayQueue.java:337)
[junit4:junit4]   1> org.eclipse.jetty.util.thread.QueuedThreadPool.idleJobPoll(QueuedThreadPool.java:517)
[junit4:junit4]   1> org.eclipse.jetty.util.thread.QueuedThreadPool.access$600(QueuedThreadPool.java:39)
[junit4:junit4]   1> org.eclipse.jetty.util.thread.QueuedThreadPool$3.run(QueuedThreadPool.java:563)
[junit4:junit4]   1> java.lang.Thread.run(Thread.java:722)
[junit4:junit4]   1> 
[junit4:junit4]   1> Thread[qtp3185543-398 Selector0,5,TGRP-BasicDistributedZkTest]
[junit4:junit4]   1> sun.nio.ch.WindowsSelectorImpl$SubSelector.poll0(Native Method)
[junit4:junit4]   1> sun.nio.ch.WindowsSelectorImpl$SubSelector.poll(WindowsSelectorImpl.java:295)
[junit4:junit4]   1> sun.nio.ch.WindowsSelectorImpl$SubSelector.access$400(WindowsSelectorImpl.java:277)
[junit4:junit4]   1> sun.nio.ch.WindowsSelectorImpl.doSelect(WindowsSelectorImpl.java:158)
[junit4:junit4]   1> sun.nio.ch.SelectorImpl.lockAndDoSelect(SelectorImpl.java:87)
[junit4:junit4]   1> sun.nio.ch.SelectorImpl.select(SelectorImpl.java:98)
[junit4:junit4]   1> org.eclipse.jetty.io.nio.SelectorManager$SelectSet.doSelect(SelectorManager.java:564)
[junit4:junit4]   1> org.eclipse.jetty.io.nio.SelectorManager$1.run(SelectorManager.java:285)
[junit4:junit4]   1> org.eclipse.jetty.util.thread.QueuedThreadPool.runJob(QueuedThreadPool.java:599)
[junit4:junit4]   1> org.eclipse.jetty.util.thread.QueuedThreadPool$3.run(QueuedThreadPool.java:534)
[junit4:junit4]   1> java.lang.Thread.run(Thread.java:722)
[junit4:junit4]   1> 
[junit4:junit4]   1> Thread[HashSessionScavenger-6,5,TGRP-BasicDistributedZkTest]
[junit4:junit4]   1> java.lang.Object.wait(Native Method)
[junit4:junit4]   1> java.util.TimerThread.mainLoop(Timer.java:552)
[junit4:junit4]   1> java.util.TimerThread.run(Timer.java:505)
[junit4:junit4]   1> 
[junit4:junit4]   1> Thread[qtp11031280-379,5,TGRP-BasicDistributedZkTest]
[junit4:junit4]   1> sun.misc.Unsafe.park(Native Method)
[junit4:junit4]   1> java.util.concurrent.locks.LockSupport.parkNanos(LockSupport.java:226)
[junit4:junit4]   1> java.util.concurrent.locks.AbstractQueuedSynchronizer$ConditionObject.awaitNanos(AbstractQueuedSynchronizer.java:2082)
[junit4:junit4]   1> org.eclipse.jetty.util.BlockingArrayQueue.poll(BlockingArrayQueue.java:337)
[junit4:junit4]   1> org.eclipse.jetty.util.thread.QueuedThreadPool.idleJobPoll(QueuedThreadPool.java:517)
[junit4:junit4]   1> org.eclipse.jetty.util.thread.QueuedThreadPool.access$600(QueuedThreadPool.java:39)
[junit4:junit4]   1> org.eclipse.jetty.util.thread.QueuedThreadPool$3.run(QueuedThreadPool.java:563)
[junit4:junit4]   1> java.lang.Thread.run(Thread.java:722)
[junit4:junit4]   1> 
[junit4:junit4]   1> Thread[qtp24950648-367,5,TGRP-BasicDistributedZkTest]
[junit4:junit4]   1> sun.misc.Unsafe.park(Native Method)
[junit4:junit4]   1> java.util.concurrent.locks.LockSupport.parkNanos(LockSupport.java:226)
[junit4:junit4]   1> java.util.concurrent.locks.AbstractQueuedSynchronizer$ConditionObject.awaitNanos(AbstractQueuedSynchronizer.java:2082)
[junit4:junit4]   1> org.eclipse.jetty.util.BlockingArrayQueue.poll(BlockingArrayQueue.java:337)
[junit4:junit4]   1> org.eclipse.jetty.util.thread.QueuedThreadPool.idleJobPoll(QueuedThreadPool.java:517)
[junit4:junit4]   1> org.eclipse.jetty.util.thread.QueuedThreadPool.access$600(QueuedThreadPool.java:39)
[junit4:junit4]   1> org.eclipse.jetty.util.thread.QueuedThreadPool$3.run(QueuedThreadPool.java:563)
[junit4:junit4]   1> java.lang.Thread.run(Thread.java:722)
[junit4:junit4]   1> 
[junit4:junit4]   1> Thread[qtp28086316-353,5,TGRP-BasicDistributedZkTest]
[junit4:junit4]   1> sun.misc.Unsafe.park(Native Method)
[junit4:junit4]   1> java.util.concurrent.locks.LockSupport.parkNanos(LockSupport.java:226)
[junit4:junit4]   1> java.util.concurrent.locks.AbstractQueuedSynchronizer$ConditionObject.awaitNanos(AbstractQueuedSynchronizer.java:2082)
[junit4:junit4]   1> org.eclipse.jetty.util.BlockingArrayQueue.poll(BlockingArrayQueue.java:337)
[junit4:junit4]   1> org.eclipse.jetty.util.thread.QueuedThreadPool.idleJobPoll(QueuedThreadPool.java:517)
[junit4:junit4]   1> org.eclipse.jetty.util.thread.QueuedThreadPool.access$600(QueuedThreadPool.java:39)
[junit4:junit4]   1> org.eclipse.jetty.util.thread.QueuedThreadPool$3.run(QueuedThreadPool.java:563)
[junit4:junit4]   1> java.lang.Thread.run(Thread.java:722)
[junit4:junit4]   1> 
[junit4:junit4]   1> Thread[NIOServerCxn.Factory:0.0.0.0/0.0.0.0:0,5,TGRP-BasicDistributedZkTest]
[junit4:junit4]   1> sun.nio.ch.WindowsSelectorImpl$SubSelector.poll0(Native Method)
[junit4:junit4]   1> sun.nio.ch.WindowsSelectorImpl$SubSelector.poll(WindowsSelectorImpl.java:295)
[junit4:junit4]   1> sun.nio.ch.WindowsSelectorImpl$SubSelector.access$400(WindowsSelectorImpl.java:277)
[junit4:junit4]   1> sun.nio.ch.WindowsSelectorImpl.doSelect(WindowsSelectorImpl.java:158)
[junit4:junit4]   1> sun.nio.ch.SelectorImpl.lockAndDoSelect(SelectorImpl.java:87)
[junit4:junit4]   1> sun.nio.ch.SelectorImpl.select(SelectorImpl.java:98)
[junit4:junit4]   1> org.apache.zookeeper.server.NIOServerCnxn$Factory.run(NIOServerCnxn.java:232)
[junit4:junit4]   1> 
[junit4:junit4]   1> Thread[qtp28086316-354,5,TGRP-BasicDistributedZkTest]
[junit4:junit4]   1> sun.misc.Unsafe.park(Native Method)
[junit4:junit4]   1> java.util.concurrent.locks.LockSupport.parkNanos(LockSupport.java:226)
[junit4:junit4]   1> java.util.concurrent.locks.AbstractQueuedSynchronizer$ConditionObject.awaitNanos(AbstractQueuedSynchronizer.java:2082)
[junit4:junit4]   1> org.eclipse.jetty.util.BlockingArrayQueue.poll(BlockingArrayQueue.java:337)
[junit4:junit4]   1> org.eclipse.jetty.util.thread.QueuedThreadPool.idleJobPoll(QueuedThreadPool.java:517)
[junit4:junit4]   1> org.eclipse.jetty.util.thread.QueuedThreadPool.access$600(QueuedThreadPool.java:39)
[junit4:junit4]   1> org.eclipse.jetty.util.thread.QueuedThreadPool$3.run(QueuedThreadPool.java:563)
[junit4:junit4]   1> java.lang.Thread.run(Thread.java:722)
[junit4:junit4]   1> 
[junit4:junit4]   1> Thread[ProcessThread:-1,5,TGRP-BasicDistributedZkTest]
[junit4:junit4]   1> sun.misc.Unsafe.park(Native Method)
[junit4:junit4]   1> java.util.concurrent.locks.LockSupport.park(LockSupport.java:186)
[junit4:junit4]   1> java.util.concurrent.locks.AbstractQueuedSynchronizer$ConditionObject.await(AbstractQueuedSynchronizer.java:2043)
[junit4:junit4]   1> java.util.concurrent.LinkedBlockingQueue.take(LinkedBlockingQueue.java:442)
[junit4:junit4]   1> org.apache.zookeeper.server.PrepRequestProcessor.run(PrepRequestProcessor.java:105)
[junit4:junit4]   1> 
[junit4:junit4]   1> Thread[main,5,main]
[junit4:junit4]   1> java.lang.Object.wait(Native Method)
[junit4:junit4]   1> java.lang.Thread.join(Thread.java:1258)
[junit4:junit4]   1> java.lang.Thread.join(Thread.java:1332)
[junit4:junit4]   1> com.carrotsearch.randomizedtesting.RandomizedRunner.runSuite(RandomizedRunner.java:502)
[junit4:junit4]   1> com.carrotsearch.randomizedtesting.RandomizedRunner.run(RandomizedRunner.java:399)
[junit4:junit4]   1> com.carrotsearch.ant.tasks.junit4.slave.SlaveMain.execute(SlaveMain.java:161)
[junit4:junit4]   1> com.carrotsearch.ant.tasks.junit4.slave.SlaveMain.main(SlaveMain.java:255)
[junit4:junit4]   1> com.carrotsearch.ant.tasks.junit4.slave.SlaveMainSafe.main(SlaveMainSafe.java:12)
[junit4:junit4]   1> 
[junit4:junit4]   1> Thread[Thread-100,5,TGRP-BasicDistributedZkTest]
[junit4:junit4]   1> java.lang.Object.wait(Native Method)
[junit4:junit4]   1> java.lang.Thread.join(Thread.java:1258)
[junit4:junit4]   1> java.lang.Thread.join(Thread.java:1332)
[junit4:junit4]   1> org.apache.solr.cloud.ZkTestServer$ZKServerMain.runFromConfig(ZkTestServer.java:103)
[junit4:junit4]   1> org.apache.solr.cloud.ZkTestServer$2.run(ZkTestServer.java:214)
[junit4:junit4]   1> 
[junit4:junit4]   1> Thread[qtp28086316-348 Selector0,5,TGRP-BasicDistributedZkTest]
[junit4:junit4]   1> sun.nio.ch.WindowsSelectorImpl$SubSelector.poll0(Native Method)
[junit4:junit4]   1> sun.nio.ch.WindowsSelectorImpl$SubSelector.poll(WindowsSelectorImpl.java:295)
[junit4:junit4]   1> sun.nio.ch.WindowsSelectorImpl$SubSelector.access$400(WindowsSelectorImpl.java:277)
[junit4:junit4]   1> sun.nio.ch.WindowsSelectorImpl.doSelect(WindowsSelectorImpl.java:158)
[junit4:junit4]   1> sun.nio.ch.SelectorImpl.lockAndDoSelect(SelectorImpl.java:87)
[junit4:junit4]   1> sun.nio.ch.SelectorImpl.select(SelectorImpl.java:98)
[junit4:junit4]   1> org.eclipse.jetty.io.nio.SelectorManager$SelectSet.doSelect(SelectorManager.java:564)
[junit4:junit4]   1> org.eclipse.jetty.io.nio.SelectorManager$1.run(SelectorManager.java:285)
[junit4:junit4]   1> org.eclipse.jetty.util.thread.QueuedThreadPool.runJob(QueuedThreadPool.java:599)
[junit4:junit4]   1> org.eclipse.jetty.util.thread.QueuedThreadPool$3.run(QueuedThreadPool.java:534)
[junit4:junit4]   1> java.lang.Thread.run(Thread.java:722)
[junit4:junit4]   1> 
[junit4:junit4]   1> Thread[qtp11031280-377,5,TGRP-BasicDistributedZkTest]
[junit4:junit4]   1> sun.misc.Unsafe.park(Native Method)
[junit4:junit4]   1> java.util.concurrent.locks.LockSupport.parkNanos(LockSupport.java:226)
[junit4:junit4]   1> java.util.concurrent.locks.AbstractQueuedSynchronizer$ConditionObject.awaitNanos(AbstractQueuedSynchronizer.java:2082)
[junit4:junit4]   1> org.eclipse.jetty.util.BlockingArrayQueue.poll(BlockingArrayQueue.java:337)
[junit4:junit4]   1> org.eclipse.jetty.util.thread.QueuedThreadPool.idleJobPoll(QueuedThreadPool.java:517)
[junit4:junit4]   1> org.eclipse.jetty.util.thread.QueuedThreadPool.access$600(QueuedThreadPool.java:39)
[junit4:junit4]   1> org.eclipse.jetty.util.thread.QueuedThreadPool$3.run(QueuedThreadPool.java:563)
[junit4:junit4]   1> java.lang.Thread.run(Thread.java:722)
[junit4:junit4]   1> 
[junit4:junit4]   1> Thread[qtp28086316-350,5,TGRP-BasicDistributedZkTest]
[junit4:junit4]   1> sun.misc.Unsafe.park(Native Method)
[junit4:junit4]   1> java.util.concurrent.locks.LockSupport.parkNanos(LockSupport.java:226)
[junit4:junit4]   1> java.util.concurrent.locks.AbstractQueuedSynchronizer$ConditionObject.awaitNanos(AbstractQueuedSynchronizer.java:2082)
[junit4:junit4]   1> org.eclipse.jetty.util.BlockingArrayQueue.poll(BlockingArrayQueue.java:337)
[junit4:junit4]   1> org.eclipse.jetty.util.thread.QueuedThreadPool.idleJobPoll(QueuedThreadPool.java:517)
[junit4:junit4]   1> org.eclipse.jetty.util.thread.QueuedThreadPool.access$600(QueuedThreadPool.java:39)
[junit4:junit4]   1> org.eclipse.jetty.util.thread.QueuedThreadPool$3.run(QueuedThreadPool.java:563)
[junit4:junit4]   1> java.lang.Thread.run(Thread.java:722)
[junit4:junit4]   1> 
[junit4:junit4]   1> Thread[qtp3185543-403,5,TGRP-BasicDistributedZkTest]
[junit4:junit4]   1> sun.misc.Unsafe.park(Native Method)
[junit4:junit4]   1> java.util.concurrent.locks.LockSupport.parkNanos(LockSupport.java:226)
[junit4:junit4]   1> java.util.concurrent.locks.AbstractQueuedSynchronizer$ConditionObject.awaitNanos(AbstractQueuedSynchronizer.java:2082)
[junit4:junit4]   1> org.eclipse.jetty.util.BlockingArrayQueue.poll(BlockingArrayQueue.java:337)
[junit4:junit4]   1> org.eclipse.jetty.util.thread.QueuedThreadPool.idleJobPoll(QueuedThreadPool.java:517)
[junit4:junit4]   1> org.eclipse.jetty.util.thread.QueuedThreadPool.access$600(QueuedThreadPool.java:39)
[junit4:junit4]   1> org.eclipse.jetty.util.thread.QueuedThreadPool$3.run(QueuedThreadPool.java:563)
[junit4:junit4]   1> java.lang.Thread.run(Thread.java:722)
[junit4:junit4]   1> 
[junit4:junit4]   1> Thread[qtp24950648-368,5,TGRP-BasicDistributedZkTest]
[junit4:junit4]   1> sun.misc.Unsafe.park(Native Method)
[junit4:junit4]   1> java.util.concurrent.locks.LockSupport.parkNanos(LockSupport.java:226)
[junit4:junit4]   1> java.util.concurrent.locks.AbstractQueuedSynchronizer$ConditionObject.awaitNanos(AbstractQueuedSynchronizer.java:2082)
[junit4:junit4]   1> org.eclipse.jetty.util.BlockingArrayQueue.poll(BlockingArrayQueue.java:337)
[junit4:junit4]   1> org.eclipse.jetty.util.thread.QueuedThreadPool.idleJobPoll(QueuedThreadPool.java:517)
[junit4:junit4]   1> org.eclipse.jetty.util.thread.QueuedThreadPool.access$600(QueuedThreadPool.java:39)
[junit4:junit4]   1> org.eclipse.jetty.util.thread.QueuedThreadPool$3.run(QueuedThreadPool.java:563)
[junit4:junit4]   1> java.lang.Thread.run(Thread.java:722)
[junit4:junit4]   1> 
[junit4:junit4]   1> Thread[qtp28086316-352,5,TGRP-BasicDistributedZkTest]
[junit4:junit4]   1> sun.misc.Unsafe.park(Native Method)
[junit4:junit4]   1> java.util.concurrent.locks.LockSupport.parkNanos(LockSupport.java:226)
[junit4:junit4]   1> java.util.concurrent.locks.AbstractQueuedSynchronizer$ConditionObject.awaitNanos(AbstractQueuedSynchronizer.java:2082)
[junit4:junit4]   1> org.eclipse.jetty.util.BlockingArrayQueue.poll(BlockingArrayQueue.java:337)
[junit4:junit4]   1> org.eclipse.jetty.util.thread.QueuedThreadPool.idleJobPoll(QueuedThreadPool.java:517)
[junit4:junit4]   1> org.eclipse.jetty.util.thread.QueuedThreadPool.access$600(QueuedThreadPool.java:39)
[junit4:junit4]   1> org.eclipse.jetty.util.thread.QueuedThreadPool$3.run(QueuedThreadPool.java:563)
[junit4:junit4]   1> java.lang.Thread.run(Thread.java:722)
[junit4:junit4]   1> 
[junit4:junit4]   1> Thread[Finalizer,8,system]
[junit4:junit4]   1> java.lang.Object.wait(Native Method)
[junit4:junit4]   1> java.lang.ref.ReferenceQueue.remove(ReferenceQueue.java:135)
[junit4:junit4]   1> java.lang.ref.ReferenceQueue.remove(ReferenceQueue.java:151)
[junit4:junit4]   1> java.lang.ref.Finalizer$FinalizerThread.run(Finalizer.java:177)
[junit4:junit4]   1> 
[junit4:junit4]   1> Thread[qtp24950648-365,5,TGRP-BasicDistributedZkTest]
[junit4:junit4]   1> sun.misc.Unsafe.park(Native Method)
[junit4:junit4]   1> java.util.concurrent.locks.LockSupport.parkNanos(LockSupport.java:226)
[junit4:junit4]   1> java.util.concurrent.locks.AbstractQueuedSynchronizer$ConditionObject.awaitNanos(AbstractQueuedSynchronizer.java:2082)
[junit4:junit4]   1> org.eclipse.jetty.util.BlockingArrayQueue.poll(BlockingArrayQueue.java:337)
[junit4:junit4]   1> org.eclipse.jetty.util.thread.QueuedThreadPool.idleJobPoll(QueuedThreadPool.java:517)
[junit4:junit4]   1> org.eclipse.jetty.util.thread.QueuedThreadPool.access$600(QueuedThreadPool.java:39)
[junit4:junit4]   1> org.eclipse.jetty.util.thread.QueuedThreadPool$3.run(QueuedThreadPool.java:563)
[junit4:junit4]   1> java.lang.Thread.run(Thread.java:722)
[junit4:junit4]   1> 
[junit4:junit4]   1> Thread[TEST-BasicDistributedZkTest.testDistribSearch-seed#[2C37AB2482B95E3B]-SendThread(127.0.0.1:63254),5,TGRP-BasicDistributedZkTest]
[junit4:junit4]   1> sun.nio.ch.WindowsSelectorImpl$SubSelector.poll0(Native Method)
[junit4:junit4]   1> sun.nio.ch.WindowsSelectorImpl$SubSelector.poll(WindowsSelectorImpl.java:295)
[junit4:junit4]   1> sun.nio.ch.WindowsSelectorImpl$SubSelector.access$400(WindowsSelectorImpl.java:277)
[junit4:junit4]   1> sun.nio.ch.WindowsSelectorImpl.doSelect(WindowsSelectorImpl.java:158)
[junit4:junit4]   1> sun.nio.ch.SelectorImpl.lockAndDoSelect(SelectorImpl.java:87)
[junit4:junit4]   1> sun.nio.ch.SelectorImpl.select(SelectorImpl.java:98)
[junit4:junit4]   1> org.apache.zookeeper.ClientCnxn$SendThread.run(ClientCnxn.java:1131)
[junit4:junit4]   1> 
[junit4:junit4]   1> Thread[qtp3185543-401,5,TGRP-BasicDistributedZkTest]
[junit4:junit4]   1> sun.misc.Unsafe.park(Native Method)
[junit4:junit4]   1> java.util.concurrent.locks.LockSupport.parkNanos(LockSupport.java:226)
[junit4:junit4]   1> java.util.concurrent.locks.AbstractQueuedSynchronizer$ConditionObject.awaitNanos(AbstractQueuedSynchronizer.java:2082)
[junit4:junit4]   1> org.eclipse.jetty.util.BlockingArrayQueue.poll(BlockingArrayQueue.java:337)
[junit4:junit4]   1> org.eclipse.jetty.util.thread.QueuedThreadPool.idleJobPoll(QueuedThreadPool.java:517)
[junit4:junit4]   1> org.eclipse.jetty.util.thread.QueuedThreadPool.access$600(QueuedThreadPool.java:39)
[junit4:junit4]   1> org.eclipse.jetty.util.thread.QueuedThreadPool$3.run(QueuedThreadPool.java:563)
[junit4:junit4]   1> java.lang.Thread.run(Thread.java:722)
[junit4:junit4]   1> 
[junit4:junit4]   1> Thread[qtp29472451-390,5,TGRP-BasicDistributedZkTest]
[junit4:junit4]   1> sun.misc.Unsafe.park(Native Method)
[junit4:junit4]   1> java.util.concurrent.locks.LockSupport.parkNanos(LockSupport.java:226)
[junit4:junit4]   1> java.util.concurrent.locks.AbstractQueuedSynchronizer$ConditionObject.awaitNanos(AbstractQueuedSynchronizer.java:2082)
[junit4:junit4]   1> org.eclipse.jetty.util.BlockingArrayQueue.poll(BlockingArrayQueue.java:337)
[junit4:junit4]   1> org.eclipse.jetty.util.thread.QueuedThreadPool.idleJobPoll(QueuedThreadPool.java:517)
[junit4:junit4]   1> org.eclipse.jetty.util.thread.QueuedThreadPool.access$600(QueuedThreadPool.java:39)
[junit4:junit4]   1> org.eclipse.jetty.util.thread.QueuedThreadPool$3.run(QueuedThreadPool.java:563)
[junit4:junit4]   1> java.lang.Thread.run(Thread.java:722)
[junit4:junit4]   1> 
[junit4:junit4]   1> Thread[qtp29472451-393,5,TGRP-BasicDistributedZkTest]
[junit4:junit4]   1> sun.misc.Unsafe.park(Native Method)
[junit4:junit4]   1> java.util.concurrent.locks.LockSupport.parkNanos(LockSupport.java:226)
[junit4:junit4]   1> java.util.concurrent.locks.AbstractQueuedSynchronizer$ConditionObject.awaitNanos(AbstractQueuedSynchronizer.java:2082)
[junit4:junit4]   1> org.eclipse.jetty.util.BlockingArrayQueue.poll(BlockingArrayQueue.java:337)
[junit4:junit4]   1> org.eclipse.jetty.util.thread.QueuedThreadPool.idleJobPoll(QueuedThreadPool.java:517)
[junit4:junit4]   1> org.eclipse.jetty.util.thread.QueuedThreadPool.access$600(QueuedThreadPool.java:39)
[junit4:junit4]   1> org.eclipse.jetty.util.thread.QueuedThreadPool$3.run(QueuedThreadPool.java:563)
[junit4:junit4]   1> java.lang.Thread.run(Thread.java:722)
[junit4:junit4]   1> 
[junit4:junit4]   1> Thread[TEST-BasicDistributedZkTest.testDistribSearch-seed#[2C37AB2482B95E3B]-EventThread,5,TGRP-BasicDistributedZkTest]
[junit4:junit4]   1> sun.misc.Unsafe.park(Native Method)
[junit4:junit4]   1> java.util.concurrent.locks.LockSupport.park(LockSupport.java:186)
[junit4:junit4]   1> java.util.concurrent.locks.AbstractQueuedSynchronizer$ConditionObject.await(AbstractQueuedSynchronizer.java:2043)
[junit4:junit4]   1> java.util.concurrent.LinkedBlockingQueue.take(LinkedBlockingQueue.java:442)
[junit4:junit4]   1> org.apache.zookeeper.ClientCnxn$EventThread.run(ClientCnxn.java:498)
[junit4:junit4]   1> 
[junit4:junit4]   1> Thread[TEST-BasicDistributedZkTest.testDistribSearch-seed#[2C37AB2482B95E3B]-EventThread,5,TGRP-BasicDistributedZkTest]
[junit4:junit4]   1> sun.misc.Unsafe.park(Native Method)
[junit4:junit4]   1> java.util.concurrent.locks.LockSupport.park(LockSupport.java:186)
[junit4:junit4]   1> java.util.concurrent.locks.AbstractQueuedSynchronizer$ConditionObject.await(AbstractQueuedSynchronizer.java:2043)
[junit4:junit4]   1> java.util.concurrent.LinkedBlockingQueue.take(LinkedBlockingQueue.java:442)
[junit4:junit4]   1> org.apache.zookeeper.ClientCnxn$EventThread.run(ClientCnxn.java:498)
[junit4:junit4]   1> 
[junit4:junit4]   1> Thread[qtp28086316-355,5,TGRP-BasicDistributedZkTest]
[junit4:junit4]   1> sun.misc.Unsafe.park(Native Method)
[junit4:junit4]   1> java.util.concurrent.locks.LockSupport.parkNanos(LockSupport.java:226)
[junit4:junit4]   1> java.util.concurrent.locks.AbstractQueuedSynchronizer$ConditionObject.awaitNanos(AbstractQueuedSynchronizer.java:2082)
[junit4:junit4]   1> org.eclipse.jetty.util.BlockingArrayQueue.poll(BlockingArrayQueue.java:337)
[junit4:junit4]   1> org.eclipse.jetty.util.thread.QueuedThreadPool.idleJobPoll(QueuedThreadPool.java:517)
[junit4:junit4]   1> org.eclipse.jetty.util.thread.QueuedThreadPool.access$600(QueuedThreadPool.java:39)
[junit4:junit4]   1> org.eclipse.jetty.util.thread.QueuedThreadPool$3.run(QueuedThreadPool.java:563)
[junit4:junit4]   1> java.lang.Thread.run(Thread.java:722)
[junit4:junit4]   1> 
[junit4:junit4]   1> Thread[qtp3185543-399 Acceptor0 SelectChannelConnector@0.0.0.0:63285,5,TGRP-BasicDistributedZkTest]
[junit4:junit4]   1> sun.nio.ch.ServerSocketChannelImpl.accept0(Native Method)
[junit4:junit4]   1> sun.nio.ch.ServerSocketChannelImpl.accept(ServerSocketChannelImpl.java:226)
[junit4:junit4]   1> org.eclipse.jetty.server.nio.SelectChannelConnector.accept(SelectChannelConnector.java:104)
[junit4:junit4]   1> org.eclipse.jetty.server.AbstractConnector$Acceptor.run(AbstractConnector.java:933)
[junit4:junit4]   1> org.eclipse.jetty.util.thread.QueuedThreadPool.runJob(QueuedThreadPool.java:599)
[junit4:junit4]   1> org.eclipse.jetty.util.thread.QueuedThreadPool$3.run(QueuedThreadPool.java:534)
[junit4:junit4]   1> java.lang.Thread.run(Thread.java:722)
[junit4:junit4]   1> 
[junit4:junit4]   1> Thread[TEST-BasicDistributedZkTest.testDistribSearch-seed#[2C37AB2482B95E3B],5,TGRP-BasicDistributedZkTest]
[junit4:junit4]   1> java.lang.Thread.dumpThreads(Native Method)
[junit4:junit4]   1> java.lang.Thread.getAllStackTraces(Thread.java:1618)
[junit4:junit4]   1> org.apache.solr.cloud.AbstractDistribZkTestBase.waitForRecoveriesToFinish(AbstractDistribZkTestBase.java:156)
[junit4:junit4]   1> org.apache.solr.cloud.AbstractDistribZkTestBase.waitForRecoveriesToFinish(AbstractDistribZkTestBase.java:115)
[junit4:junit4]   1> org.apache.solr.cloud.AbstractDistribZkTestBase.waitForRecoveriesToFinish(AbstractDistribZkTestBase.java:110)
[junit4:junit4]   1> org.apache.solr.cloud.AbstractFullDistribZkTestBase.waitForRecoveriesToFinish(AbstractFullDistribZkTestBase.java:553)
[junit4:junit4]   1> org.apache.solr.cloud.BasicDistributedZkTest.doTest(BasicDistributedZkTest.java:162)
[junit4:junit4]   1> org.apache.solr.BaseDistributedSearchTestCase.testDistribSearch(BaseDistributedSearchTestCase.java:695)
[junit4:junit4]   1> sun.reflect.NativeMethodAccessorImpl.invoke0(Native Method)
[junit4:junit4]   1> sun.reflect.NativeMethodAccessorImpl.invoke(NativeMethodAccessorImpl.java:57)
[junit4:junit4]   1> sun.reflect.DelegatingMethodAccessorImpl.invoke(DelegatingMethodAccessorImpl.java:43)
[junit4:junit4]   1> java.lang.reflect.Method.invoke(Method.java:601)
[junit4:junit4]   1> com.carrotsearch.randomizedtesting.RandomizedRunner.invoke(RandomizedRunner.java:1559)
[junit4:junit4]   1> com.carrotsearch.randomizedtesting.RandomizedRunner.access$600(RandomizedRunner.java:79)
[junit4:junit4]   1> com.carrotsearch.randomizedtesting.RandomizedRunner$6.evaluate(RandomizedRunner.java:737)
[junit4:junit4]   1> com.carrotsearch.randomizedtesting.RandomizedRunner$7.evaluate(RandomizedRunner.java:773)
[junit4:junit4]   1> com.carrotsearch.randomizedtesting.RandomizedRunner$8.evaluate(RandomizedRunner.java:787)
[junit4:junit4]   1> com.carrotsearch.randomizedtesting.rules.SystemPropertiesRestoreRule$1.evaluate(SystemPropertiesRestoreRule.java:53)
[junit4:junit4]   1> org.apache.lucene.util.TestRuleSetupTeardownChained$1.evaluate(TestRuleSetupTeardownChained.java:50)
[junit4:junit4]   1> org.apache.lucene.util.TestRuleFieldCacheSanity$1.evaluate(TestRuleFieldCacheSanity.java:51)
[junit4:junit4]   1> org.apache.lucene.util.AbstractBeforeAfterRule$1.evaluate(AbstractBeforeAfterRule.java:45)
[junit4:junit4]   1> com.carrotsearch.randomizedtesting.rules.SystemPropertiesInvariantRule$1.evaluate(SystemPropertiesInvariantRule.java:55)
[junit4:junit4]   1> org.apache.lucene.util.TestRuleThreadAndTestName$1.evaluate(TestRuleThreadAndTestName.java:48)
[junit4:junit4]   1> org.apache.lucene.util.TestRuleIgnoreAfterMaxFailures$1.evaluate(TestRuleIgnoreAfterMaxFailures.java:70)
[junit4:junit4]   1> org.apache.lucene.util.TestRuleMarkFailure$1.evaluate(TestRuleMarkFailure.java:48)
[junit4:junit4]   1> com.carrotsearch.randomizedtesting.rules.StatementAdapter.evaluate(StatementAdapter.java:36)
[junit4:junit4]   1> com.carrotsearch.randomizedtesting.ThreadLeakControl$StatementRunner.run(ThreadLeakControl.java:358)
[junit4:junit4]   1> com.carrotsearch.randomizedtesting.ThreadLeakControl.forkTimeoutingTask(ThreadLeakControl.java:782)
[junit4:junit4]   1> com.carrotsearch.randomizedtesting.ThreadLeakControl$3.evaluate(ThreadLeakControl.java:442)
[junit4:junit4]   1> com.carrotsearch.randomizedtesting.RandomizedRunner.runSingleTest(RandomizedRunner.java:746)
[junit4:junit4]   1> com.carrotsearch.randomizedtesting.RandomizedRunner$3.evaluate(RandomizedRunner.java:648)
[junit4:junit4]   1> com.carrotsearch.randomizedtesting.RandomizedRunner$4.evaluate(RandomizedRunner.java:682)
[junit4:junit4]   1> com.carrotsearch.randomizedtesting.RandomizedRunner$5.evaluate(RandomizedRunner.java:693)
[junit4:junit4]   1> com.carrotsearch.randomizedtesting.rules.StatementAdapter.evaluate(StatementAdapter.java:36)
[junit4:junit4]   1> com.carrotsearch.randomizedtesting.rules.SystemPropertiesRestoreRule$1.evaluate(SystemPropertiesRestoreRule.java:53)
[junit4:junit4]   1> org.apache.lucene.util.AbstractBeforeAfterRule$1.evaluate(AbstractBeforeAfterRule.java:45)
[junit4:junit4]   1> org.apache.lucene.util.TestRuleStoreClassName$1.evaluate(TestRuleStoreClassName.java:42)
[junit4:junit4]   1> com.carrotsearch.randomizedtesting.rules.SystemPropertiesInvariantRule$1.evaluate(SystemPropertiesInvariantRule.java:55)
[junit4:junit4]   1> com.carrotsearch.randomizedtesting.rules.NoShadowingOrOverridesOnMethodsRule$1.evaluate(NoShadowingOrOverridesOnMethodsRule.java:39)
[junit4:junit4]   1> com.carrotsearch.randomizedtesting.rules.NoShadowingOrOverridesOnMethodsRule$1.evaluate(NoShadowingOrOverridesOnMethodsRule.java:39)
[junit4:junit4]   1> com.carrotsearch.randomizedtesting.rules.StatementAdapter.evaluate(StatementAdapter.java:36)
[junit4:junit4]   1> org.apache.lucene.util.TestRuleAssertionsRequired$1.evaluate(TestRuleAssertionsRequired.java:43)
[junit4:junit4]   1> org.apache.lucene.util.TestRuleMarkFailure$1.evaluate(TestRuleMarkFailure.java:48)
[junit4:junit4]   1> org.apache.lucene.util.TestRuleIgnoreAfterMaxFailures$1.evaluate(TestRuleIgnoreAfterMaxFailures.java:70)
[junit4:junit4]   1> org.apache.lucene.util.TestRuleIgnoreTestSuites$1.evaluate(TestRuleIgnoreTestSuites.java:55)
[junit4:junit4]   1> com.carrotsearch.randomizedtesting.rules.StatementAdapter.evaluate(StatementAdapter.java:36)
[junit4:junit4]   1> com.carrotsearch.randomizedtesting.ThreadLeakControl$StatementRunner.run(ThreadLeakControl.java:358)
[junit4:junit4]   1> java.lang.Thread.run(Thread.java:722)
[junit4:junit4]   1> 
[junit4:junit4]   1> Thread[qtp28086316-349 Acceptor0 SelectChannelConnector@0.0.0.0:63261,5,TGRP-BasicDistributedZkTest]
[junit4:junit4]   1> sun.nio.ch.ServerSocketChannelImpl.accept0(Native Method)
[junit4:junit4]   1> sun.nio.ch.ServerSocketChannelImpl.accept(ServerSocketChannelImpl.java:226)
[junit4:junit4]   1> org.eclipse.jetty.server.nio.SelectChannelConnector.accept(SelectChannelConnector.java:104)
[junit4:junit4]   1> org.eclipse.jetty.server.AbstractConnector$Acceptor.run(AbstractConnector.java:933)
[junit4:junit4]   1> org.eclipse.jetty.util.thread.QueuedThreadPool.runJob(QueuedThreadPool.java:599)
[junit4:junit4]   1> org.eclipse.jetty.util.thread.QueuedThreadPool$3.run(QueuedThreadPool.java:534)
[junit4:junit4]   1> java.lang.Thread.run(Thread.java:722)
[junit4:junit4]   1> 
[junit4:junit4]   1> Thread[qtp29472451-392,5,TGRP-BasicDistributedZkTest]
[junit4:junit4]   1> sun.misc.Unsafe.park(Native Method)
[junit4:junit4]   1> java.util.concurrent.locks.LockSupport.parkNanos(LockSupport.java:226)
[junit4:junit4]   1> java.util.concurrent.locks.AbstractQueuedSynchronizer$ConditionObject.awaitNanos(AbstractQueuedSynchronizer.java:2082)
[junit4:junit4]   1> org.eclipse.jetty.util.BlockingArrayQueue.poll(BlockingArrayQueue.java:337)
[junit4:junit4]   1> org.eclipse.jetty.util.thread.QueuedThreadPool.idleJobPoll(QueuedThreadPool.java:517)
[junit4:junit4]   1> org.eclipse.jetty.util.thread.QueuedThreadPool.access$600(QueuedThreadPool.java:39)
[junit4:junit4]   1> org.eclipse.jetty.util.thread.QueuedThreadPool$3.run(QueuedThreadPool.java:563)
[junit4:junit4]   1> java.lang.Thread.run(Thread.java:722)
[junit4:junit4]   1> 
[junit4:junit4]   1> Thread[qtp29472451-387,5,TGRP-BasicDistributedZkTest]
[junit4:junit4]   1> sun.misc.Unsafe.park(Native Method)
[junit4:junit4]   1> java.util.concurrent.locks.LockSupport.parkNanos(LockSupport.java:226)
[junit4:junit4]   1> java.util.concurrent.locks.AbstractQueuedSynchronizer$ConditionObject.awaitNanos(AbstractQueuedSynchronizer.java:2082)
[junit4:junit4]   1> org.eclipse.jetty.util.BlockingArrayQueue.poll(BlockingArrayQueue.java:337)
[junit4:junit4]   1> org.eclipse.jetty.util.thread.QueuedThreadPool.idleJobPoll(QueuedThreadPool.java:517)
[junit4:junit4]   1> org.eclipse.jetty.util.thread.QueuedThreadPool.access$600(QueuedThreadPool.java:39)
[junit4:junit4]   1> org.eclipse.jetty.util.thread.QueuedThreadPool$3.run(QueuedThreadPool.java:563)
[junit4:junit4]   1> java.lang.Thread.run(Thread.java:722)
[junit4:junit4]   1> 
[junit4:junit4]   1> Thread[qtp3185543-402,5,TGRP-BasicDistributedZkTest]
[junit4:junit4]   1> sun.misc.Unsafe.park(Native Method)
[junit4:junit4]   1> java.util.concurrent.locks.LockSupport.parkNanos(LockSupport.java:226)
[junit4:junit4]   1> java.util.concurrent.locks.AbstractQueuedSynchronizer$ConditionObject.awaitNanos(AbstractQueuedSynchronizer.java:2082)
[junit4:junit4]   1> org.eclipse.jetty.util.BlockingArrayQueue.poll(BlockingArrayQueue.java:337)
[junit4:junit4]   1> org.eclipse.jetty.util.thread.QueuedThreadPool.idleJobPoll(QueuedThreadPool.java:517)
[junit4:junit4]   1> org.eclipse.jetty.util.thread.QueuedThreadPool.access$600(QueuedThreadPool.java:39)
[junit4:junit4]   1> org.eclipse.jetty.util.thread.QueuedThreadPool$3.run(QueuedThreadPool.java:563)
[junit4:junit4]   1> ja

[...truncated too long message...]

             "roles":null,
[junit4:junit4]   1>                 "state":"active",
[junit4:junit4]   1>                 "core":"collection1",
[junit4:junit4]   1>                 "collection":"collection1",
[junit4:junit4]   1>                 "node_name":"127.0.0.1:63273_solr",
[junit4:junit4]   1>                 "base_url":"http://127.0.0.1:63273/solr",
[junit4:junit4]   1>                 "leader":"true"},
[junit4:junit4]   1>               "127.0.0.1:63285_solr_collection1":{
[junit4:junit4]   1>                 "shard":"shard2",
[junit4:junit4]   1>                 "roles":null,
[junit4:junit4]   1>                 "state":"active",
[junit4:junit4]   1>                 "core":"collection1",
[junit4:junit4]   1>                 "collection":"collection1",
[junit4:junit4]   1>                 "node_name":"127.0.0.1:63285_solr",
[junit4:junit4]   1>                 "base_url":"http://127.0.0.1:63285/solr"}}}},
[junit4:junit4]   1>         "control_collection":{"control_shard":{"replicas":{"127.0.0.1:63261_solr_collection1":{
[junit4:junit4]   1>                 "shard":"control_shard",
[junit4:junit4]   1>                 "roles":null,
[junit4:junit4]   1>                 "state":"active",
[junit4:junit4]   1>                 "core":"collection1",
[junit4:junit4]   1>                 "collection":"control_collection",
[junit4:junit4]   1>                 "node_name":"127.0.0.1:63261_solr",
[junit4:junit4]   1>                 "base_url":"http://127.0.0.1:63261/solr",
[junit4:junit4]   1>                 "leader":"true"}}}}}
[junit4:junit4]   1>  /zookeeper (1)
[junit4:junit4]   1>  DATA:
[junit4:junit4]   1>      
[junit4:junit4]   1> 
[junit4:junit4]   2> NOTE: reproduce with: ant test  -Dtestcase=BasicDistributedZkTest -Dtests.method=testDistribSearch -Dtests.seed=2C37AB2482B95E3B -Dtests.slow=true -Dtests.locale=fr_BE -Dtests.timezone=Africa/Kampala -Dtests.file.encoding=UTF-8
[junit4:junit4] FAILURE  263s | BasicDistributedZkTest.testDistribSearch <<<
[junit4:junit4]    > Throwable #1: java.lang.AssertionError: There are still nodes recoverying - waited for 180 seconds
[junit4:junit4]    > 	at __randomizedtesting.SeedInfo.seed([2C37AB2482B95E3B:ADD1253CF5E63E07]:0)
[junit4:junit4]    > 	at org.junit.Assert.fail(Assert.java:93)
[junit4:junit4]    > 	at org.apache.solr.cloud.AbstractDistribZkTestBase.waitForRecoveriesToFinish(AbstractDistribZkTestBase.java:165)
[junit4:junit4]    > 	at org.apache.solr.cloud.AbstractDistribZkTestBase.waitForRecoveriesToFinish(AbstractDistribZkTestBase.java:115)
[junit4:junit4]    > 	at org.apache.solr.cloud.AbstractDistribZkTestBase.waitForRecoveriesToFinish(AbstractDistribZkTestBase.java:110)
[junit4:junit4]    > 	at org.apache.solr.cloud.AbstractFullDistribZkTestBase.waitForRecoveriesToFinish(AbstractFullDistribZkTestBase.java:553)
[junit4:junit4]    > 	at org.apache.solr.cloud.BasicDistributedZkTest.doTest(BasicDistributedZkTest.java:162)
[junit4:junit4]    > 	at org.apache.solr.BaseDistributedSearchTestCase.testDistribSearch(BaseDistributedSearchTestCase.java:695)
[junit4:junit4]    > 	at sun.reflect.NativeMethodAccessorImpl.invoke0(Native Method)
[junit4:junit4]    > 	at sun.reflect.NativeMethodAccessorImpl.invoke(NativeMethodAccessorImpl.java:57)
[junit4:junit4]    > 	at sun.reflect.DelegatingMethodAccessorImpl.invoke(DelegatingMethodAccessorImpl.java:43)
[junit4:junit4]    > 	at java.lang.reflect.Method.invoke(Method.java:601)
[junit4:junit4]    > 	at com.carrotsearch.randomizedtesting.RandomizedRunner.invoke(RandomizedRunner.java:1559)
[junit4:junit4]    > 	at com.carrotsearch.randomizedtesting.RandomizedRunner.access$600(RandomizedRunner.java:79)
[junit4:junit4]    > 	at com.carrotsearch.randomizedtesting.RandomizedRunner$6.evaluate(RandomizedRunner.java:737)
[junit4:junit4]    > 	at com.carrotsearch.randomizedtesting.RandomizedRunner$7.evaluate(RandomizedRunner.java:773)
[junit4:junit4]    > 	at com.carrotsearch.randomizedtesting.RandomizedRunner$8.evaluate(RandomizedRunner.java:787)
[junit4:junit4]    > 	at com.carrotsearch.randomizedtesting.rules.SystemPropertiesRestoreRule$1.evaluate(SystemPropertiesRestoreRule.java:53)
[junit4:junit4]    > 	at org.apache.lucene.util.TestRuleSetupTeardownChained$1.evaluate(TestRuleSetupTeardownChained.java:50)
[junit4:junit4]    > 	at org.apache.lucene.util.TestRuleFieldCacheSanity$1.evaluate(TestRuleFieldCacheSanity.java:51)
[junit4:junit4]    > 	at org.apache.lucene.util.AbstractBeforeAfterRule$1.evaluate(AbstractBeforeAfterRule.java:45)
[junit4:junit4]    > 	at com.carrotsearch.randomizedtesting.rules.SystemPropertiesInvariantRule$1.evaluate(SystemPropertiesInvariantRule.java:55)
[junit4:junit4]    > 	at org.apache.lucene.util.TestRuleThreadAndTestName$1.evaluate(TestRuleThreadAndTestName.java:48)
[junit4:junit4]    > 	at org.apache.lucene.util.TestRuleIgnoreAfterMaxFailures$1.evaluate(TestRuleIgnoreAfterMaxFailures.java:70)
[junit4:junit4]    > 	at org.apache.lucene.util.TestRuleMarkFailure$1.evaluate(TestRuleMarkFailure.java:48)
[junit4:junit4]    > 	at com.carrotsearch.randomizedtesting.rules.StatementAdapter.evaluate(StatementAdapter.java:36)
[junit4:junit4]    > 	at com.carrotsearch.randomizedtesting.ThreadLeakControl$StatementRunner.run(ThreadLeakControl.java:358)
[junit4:junit4]    > 	at com.carrotsearch.randomizedtesting.ThreadLeakControl.forkTimeoutingTask(ThreadLeakControl.java:782)
[junit4:junit4]    > 	at com.carrotsearch.randomizedtesting.ThreadLeakControl$3.evaluate(ThreadLeakControl.java:442)
[junit4:junit4]    > 	at com.carrotsearch.randomizedtesting.RandomizedRunner.runSingleTest(RandomizedRunner.java:746)
[junit4:junit4]    > 	at com.carrotsearch.randomizedtesting.RandomizedRunner$3.evaluate(RandomizedRunner.java:648)
[junit4:junit4]    > 	at com.carrotsearch.randomizedtesting.RandomizedRunner$4.evaluate(RandomizedRunner.java:682)
[junit4:junit4]    > 	at com.carrotsearch.randomizedtesting.RandomizedRunner$5.evaluate(RandomizedRunner.java:693)
[junit4:junit4]    > 	at com.carrotsearch.randomizedtesting.rules.StatementAdapter.evaluate(StatementAdapter.java:36)
[junit4:junit4]    > 	at com.carrotsearch.randomizedtesting.rules.SystemPropertiesRestoreRule$1.evaluate(SystemPropertiesRestoreRule.java:53)
[junit4:junit4]    > 	at org.apache.lucene.util.AbstractBeforeAfterRule$1.evaluate(AbstractBeforeAfterRule.java:45)
[junit4:junit4]    > 	at org.apache.lucene.util.TestRuleStoreClassName$1.evaluate(TestRuleStoreClassName.java:42)
[junit4:junit4]    > 	at com.carrotsearch.randomizedtesting.rules.SystemPropertiesInvariantRule$1.evaluate(SystemPropertiesInvariantRule.java:55)
[junit4:junit4]    > 	at com.carrotsearch.randomizedtesting.rules.NoShadowingOrOverridesOnMethodsRule$1.evaluate(NoShadowingOrOverridesOnMethodsRule.java:39)
[junit4:junit4]    > 	at com.carrotsearch.randomizedtesting.rules.NoShadowingOrOverridesOnMethodsRule$1.evaluate(NoShadowingOrOverridesOnMethodsRule.java:39)
[junit4:junit4]    > 	at com.carrotsearch.randomizedtesting.rules.StatementAdapter.evaluate(StatementAdapter.java:36)
[junit4:junit4]    > 	at org.apache.lucene.util.TestRuleAssertionsRequired$1.evaluate(TestRuleAssertionsRequired.java:43)
[junit4:junit4]    > 	at org.apache.lucene.util.TestRuleMarkFailure$1.evaluate(TestRuleMarkFailure.java:48)
[junit4:junit4]    > 	at org.apache.lucene.util.TestRuleIgnoreAfterMaxFailures$1.evaluate(TestRuleIgnoreAfterMaxFailures.java:70)
[junit4:junit4]    > 	at org.apache.lucene.util.TestRuleIgnoreTestSuites$1.evaluate(TestRuleIgnoreTestSuites.java:55)
[junit4:junit4]    > 	at com.carrotsearch.randomizedtesting.rules.StatementAdapter.evaluate(StatementAdapter.java:36)
[junit4:junit4]    > 	at com.carrotsearch.randomizedtesting.ThreadLeakControl$StatementRunner.run(ThreadLeakControl.java:358)
[junit4:junit4]    > 	at java.lang.Thread.run(Thread.java:722)
[junit4:junit4]   2> 262520 T337 oas.SolrTestCaseJ4.deleteCore ###deleteCore
[junit4:junit4]   2> NOTE: test params are: codec=Appending, sim=RandomSimilarityProvider(queryNorm=false,coord=yes): {}, locale=fr_BE, timezone=Africa/Kampala
[junit4:junit4]   2> NOTE: Windows 7 6.1 x86/Oracle Corporation 1.7.0_07 (32-bit)/cpus=2,threads=1,free=60121352,total=99614720
[junit4:junit4]   2> NOTE: All tests run in this JVM: [TestLMJelinekMercerSimilarityFactory, XmlUpdateRequestHandlerTest, PingRequestHandlerTest, OpenExchangeRatesOrgProviderTest, TestSurroundQueryParser, TestSolrJ, TestStressLucene, LeaderElectionIntegrationTest, TestXIncludeConfig, AutoCommitTest, TestMergePolicyConfig, QueryElevationComponentTest, MBeansHandlerTest, TestQuerySenderListener, CircularListTest, RecoveryZkTest, TestSuggestSpellingConverter, ZkControllerTest, SuggesterTSTTest, BasicDistributedZkTest]
[junit4:junit4] Completed in 262.55s, 1 test, 1 failure <<< FAILURES!

[...truncated 657 lines...]
BUILD FAILED
C:\Users\JenkinsSlave\workspace\Lucene-Solr-4.x-Windows\build.xml:335: The following error occurred while executing this line:
C:\Users\JenkinsSlave\workspace\Lucene-Solr-4.x-Windows\build.xml:39: The following error occurred while executing this line:
C:\Users\JenkinsSlave\workspace\Lucene-Solr-4.x-Windows\solr\build.xml:178: The following error occurred while executing this line:
C:\Users\JenkinsSlave\workspace\Lucene-Solr-4.x-Windows\lucene\module-build.xml:61: The following error occurred while executing this line:
C:\Users\JenkinsSlave\workspace\Lucene-Solr-4.x-Windows\lucene\common-build.xml:1163: The following error occurred while executing this line:
C:\Users\JenkinsSlave\workspace\Lucene-Solr-4.x-Windows\lucene\common-build.xml:827: There were test failures: 233 suites, 965 tests, 1 failure, 12 ignored (7 assumptions)

Total time: 44 minutes 6 seconds
Build step 'Invoke Ant' marked build as failure
Archiving artifacts
Recording test results
Description set: Java: 32bit/jdk1.7.0_07 -client -XX:+UseG1GC
Email was triggered for: Failure
Sending email for trigger: Failure



Mime
View raw message