lucene-dev mailing list archives

Site index · List index
Message view « Date » · « Thread »
Top « Date » · « Thread »
From Apache Jenkins Server <jenk...@builds.apache.org>
Subject [JENKINS-MAVEN] Lucene-Solr-Maven-4.x #169: POMs out of sync
Date Thu, 29 Nov 2012 11:20:37 GMT
Build: https://builds.apache.org/job/Lucene-Solr-Maven-4.x/169/

316 tests failed.
FAILED:  org.apache.solr.handler.dataimport.TestVariableResolverEndToEnd.org.apache.solr.handler.dataimport.TestVariableResolverEndToEnd

Error Message:
Could not initialize class org.apache.solr.handler.dataimport.AbstractDIHJdbcTestCase

Stack Trace:
java.lang.NoClassDefFoundError: Could not initialize class org.apache.solr.handler.dataimport.AbstractDIHJdbcTestCase
	at java.lang.Class.forName0(Native Method)
	at java.lang.Class.forName(Class.java:264)
	at com.carrotsearch.randomizedtesting.RandomizedRunner$1.run(RandomizedRunner.java:486)


FAILED:  org.apache.solr.analysis.TestFoldingMultitermExtrasQuery.org.apache.solr.analysis.TestFoldingMultitermExtrasQuery

Error Message:
Could not initialize class org.apache.solr.SolrTestCaseJ4

Stack Trace:
java.lang.NoClassDefFoundError: Could not initialize class org.apache.solr.SolrTestCaseJ4
	at java.lang.Class.forName0(Native Method)
	at java.lang.Class.forName(Class.java:264)
	at com.carrotsearch.randomizedtesting.RandomizedRunner$1.run(RandomizedRunner.java:486)


FAILED:  org.apache.solr.analysis.TestICUCollationKeyRangeQueries.org.apache.solr.analysis.TestICUCollationKeyRangeQueries

Error Message:
org/apache/log4j/Level

Stack Trace:
java.lang.NoClassDefFoundError: org/apache/log4j/Level
	at org.slf4j.LoggerFactory.bind(LoggerFactory.java:128)
	at org.slf4j.LoggerFactory.performInitialization(LoggerFactory.java:108)
	at org.slf4j.LoggerFactory.getILoggerFactory(LoggerFactory.java:279)
	at org.slf4j.LoggerFactory.getLogger(LoggerFactory.java:252)
	at org.slf4j.LoggerFactory.getLogger(LoggerFactory.java:265)
	at org.apache.solr.SolrTestCaseJ4.<clinit>(SolrTestCaseJ4.java:345)
	at java.lang.Class.forName0(Native Method)
	at java.lang.Class.forName(Class.java:264)
	at com.carrotsearch.randomizedtesting.RandomizedRunner$1.run(RandomizedRunner.java:486)
Caused by: java.lang.ClassNotFoundException: org.apache.log4j.Level
	at java.net.URLClassLoader$1.run(URLClassLoader.java:217)
	at java.security.AccessController.doPrivileged(Native Method)
	at java.net.URLClassLoader.findClass(URLClassLoader.java:205)
	at java.lang.ClassLoader.loadClass(ClassLoader.java:321)
	at sun.misc.Launcher$AppClassLoader.loadClass(Launcher.java:294)
	at java.lang.ClassLoader.loadClass(ClassLoader.java:266)
	... 9 more


FAILED:  org.apache.solr.schema.TestICUCollationField.org.apache.solr.schema.TestICUCollationField

Error Message:
Could not initialize class org.apache.solr.SolrTestCaseJ4

Stack Trace:
java.lang.NoClassDefFoundError: Could not initialize class org.apache.solr.SolrTestCaseJ4
	at java.lang.Class.forName0(Native Method)
	at java.lang.Class.forName(Class.java:264)
	at com.carrotsearch.randomizedtesting.RandomizedRunner$1.run(RandomizedRunner.java:486)


FAILED:  org.apache.solr.schema.TestICUCollationFieldOptions.org.apache.solr.schema.TestICUCollationFieldOptions

Error Message:
Could not initialize class org.apache.solr.SolrTestCaseJ4

Stack Trace:
java.lang.NoClassDefFoundError: Could not initialize class org.apache.solr.SolrTestCaseJ4
	at java.lang.Class.forName0(Native Method)
	at java.lang.Class.forName(Class.java:264)
	at com.carrotsearch.randomizedtesting.RandomizedRunner$1.run(RandomizedRunner.java:486)


FAILED:  org.apache.solr.handler.clustering.ClusteringComponentTest.org.apache.solr.handler.clustering.ClusteringComponentTest

Error Message:
Could not initialize class org.apache.solr.handler.clustering.AbstractClusteringTestCase

Stack Trace:
java.lang.NoClassDefFoundError: Could not initialize class org.apache.solr.handler.clustering.AbstractClusteringTestCase
	at java.lang.Class.forName0(Native Method)
	at java.lang.Class.forName(Class.java:264)
	at com.carrotsearch.randomizedtesting.RandomizedRunner$1.run(RandomizedRunner.java:486)


FAILED:  org.apache.solr.handler.clustering.DistributedClusteringComponentTest.org.apache.solr.handler.clustering.DistributedClusteringComponentTest

Error Message:
Could not initialize class org.apache.solr.SolrTestCaseJ4

Stack Trace:
java.lang.NoClassDefFoundError: Could not initialize class org.apache.solr.SolrTestCaseJ4
	at java.lang.Class.forName0(Native Method)
	at java.lang.Class.forName(Class.java:264)
	at com.carrotsearch.randomizedtesting.RandomizedRunner$1.run(RandomizedRunner.java:486)


FAILED:  org.apache.solr.handler.clustering.carrot2.CarrotClusteringEngineTest.org.apache.solr.handler.clustering.carrot2.CarrotClusteringEngineTest

Error Message:
org/apache/log4j/Level

Stack Trace:
java.lang.NoClassDefFoundError: org/apache/log4j/Level
	at org.slf4j.LoggerFactory.bind(LoggerFactory.java:128)
	at org.slf4j.LoggerFactory.performInitialization(LoggerFactory.java:108)
	at org.slf4j.LoggerFactory.getILoggerFactory(LoggerFactory.java:279)
	at org.slf4j.LoggerFactory.getLogger(LoggerFactory.java:252)
	at org.slf4j.LoggerFactory.getLogger(LoggerFactory.java:265)
	at org.apache.solr.SolrTestCaseJ4.<clinit>(SolrTestCaseJ4.java:345)
	at java.lang.Class.forName0(Native Method)
	at java.lang.Class.forName(Class.java:264)
	at com.carrotsearch.randomizedtesting.RandomizedRunner$1.run(RandomizedRunner.java:486)
Caused by: java.lang.ClassNotFoundException: org.apache.log4j.Level
	at java.net.URLClassLoader$1.run(URLClassLoader.java:217)
	at java.security.AccessController.doPrivileged(Native Method)
	at java.net.URLClassLoader.findClass(URLClassLoader.java:205)
	at java.lang.ClassLoader.loadClass(ClassLoader.java:321)
	at sun.misc.Launcher$AppClassLoader.loadClass(Launcher.java:294)
	at java.lang.ClassLoader.loadClass(ClassLoader.java:266)
	... 9 more


FAILED:  org.apache.solr.handler.dataimport.TestBuiltInEvaluators.org.apache.solr.handler.dataimport.TestBuiltInEvaluators

Error Message:
Could not initialize class org.apache.solr.handler.dataimport.AbstractDataImportHandlerTestCase

Stack Trace:
java.lang.NoClassDefFoundError: Could not initialize class org.apache.solr.handler.dataimport.AbstractDataImportHandlerTestCase
	at java.lang.Class.forName0(Native Method)
	at java.lang.Class.forName(Class.java:264)
	at com.carrotsearch.randomizedtesting.RandomizedRunner$1.run(RandomizedRunner.java:486)


FAILED:  org.apache.solr.handler.dataimport.TestClobTransformer.org.apache.solr.handler.dataimport.TestClobTransformer

Error Message:
Could not initialize class org.apache.solr.handler.dataimport.AbstractDataImportHandlerTestCase

Stack Trace:
java.lang.NoClassDefFoundError: Could not initialize class org.apache.solr.handler.dataimport.AbstractDataImportHandlerTestCase
	at java.lang.Class.forName0(Native Method)
	at java.lang.Class.forName(Class.java:264)
	at com.carrotsearch.randomizedtesting.RandomizedRunner$1.run(RandomizedRunner.java:486)


FAILED:  org.apache.solr.handler.dataimport.TestContentStreamDataSource.org.apache.solr.handler.dataimport.TestContentStreamDataSource

Error Message:
Could not initialize class org.apache.solr.handler.dataimport.AbstractDataImportHandlerTestCase

Stack Trace:
java.lang.NoClassDefFoundError: Could not initialize class org.apache.solr.handler.dataimport.AbstractDataImportHandlerTestCase
	at java.lang.Class.forName0(Native Method)
	at java.lang.Class.forName(Class.java:264)
	at com.carrotsearch.randomizedtesting.RandomizedRunner$1.run(RandomizedRunner.java:486)


FAILED:  org.apache.solr.handler.dataimport.TestContextImpl.org.apache.solr.handler.dataimport.TestContextImpl

Error Message:
Could not initialize class org.apache.solr.handler.dataimport.AbstractDataImportHandlerTestCase

Stack Trace:
java.lang.NoClassDefFoundError: Could not initialize class org.apache.solr.handler.dataimport.AbstractDataImportHandlerTestCase
	at java.lang.Class.forName0(Native Method)
	at java.lang.Class.forName(Class.java:264)
	at com.carrotsearch.randomizedtesting.RandomizedRunner$1.run(RandomizedRunner.java:486)


FAILED:  org.apache.solr.handler.dataimport.TestDataConfig.org.apache.solr.handler.dataimport.TestDataConfig

Error Message:
Could not initialize class org.apache.solr.handler.dataimport.AbstractDataImportHandlerTestCase

Stack Trace:
java.lang.NoClassDefFoundError: Could not initialize class org.apache.solr.handler.dataimport.AbstractDataImportHandlerTestCase
	at java.lang.Class.forName0(Native Method)
	at java.lang.Class.forName(Class.java:264)
	at com.carrotsearch.randomizedtesting.RandomizedRunner$1.run(RandomizedRunner.java:486)


FAILED:  org.apache.solr.handler.dataimport.TestDateFormatTransformer.org.apache.solr.handler.dataimport.TestDateFormatTransformer

Error Message:
Could not initialize class org.apache.solr.handler.dataimport.AbstractDataImportHandlerTestCase

Stack Trace:
java.lang.NoClassDefFoundError: Could not initialize class org.apache.solr.handler.dataimport.AbstractDataImportHandlerTestCase
	at java.lang.Class.forName0(Native Method)
	at java.lang.Class.forName(Class.java:264)
	at com.carrotsearch.randomizedtesting.RandomizedRunner$1.run(RandomizedRunner.java:486)


FAILED:  org.apache.solr.handler.dataimport.TestDocBuilder.org.apache.solr.handler.dataimport.TestDocBuilder

Error Message:
Could not initialize class org.apache.solr.handler.dataimport.AbstractDataImportHandlerTestCase

Stack Trace:
java.lang.NoClassDefFoundError: Could not initialize class org.apache.solr.handler.dataimport.AbstractDataImportHandlerTestCase
	at java.lang.Class.forName0(Native Method)
	at java.lang.Class.forName(Class.java:264)
	at com.carrotsearch.randomizedtesting.RandomizedRunner$1.run(RandomizedRunner.java:486)


FAILED:  org.apache.solr.handler.dataimport.TestDocBuilder2.org.apache.solr.handler.dataimport.TestDocBuilder2

Error Message:
Could not initialize class org.apache.solr.handler.dataimport.AbstractDataImportHandlerTestCase

Stack Trace:
java.lang.NoClassDefFoundError: Could not initialize class org.apache.solr.handler.dataimport.AbstractDataImportHandlerTestCase
	at java.lang.Class.forName0(Native Method)
	at java.lang.Class.forName(Class.java:264)
	at com.carrotsearch.randomizedtesting.RandomizedRunner$1.run(RandomizedRunner.java:486)


FAILED:  org.apache.solr.handler.dataimport.TestEntityProcessorBase.org.apache.solr.handler.dataimport.TestEntityProcessorBase

Error Message:
org/apache/log4j/Level

Stack Trace:
java.lang.NoClassDefFoundError: org/apache/log4j/Level
	at org.slf4j.LoggerFactory.bind(LoggerFactory.java:128)
	at org.slf4j.LoggerFactory.performInitialization(LoggerFactory.java:108)
	at org.slf4j.LoggerFactory.getILoggerFactory(LoggerFactory.java:279)
	at org.slf4j.LoggerFactory.getLogger(LoggerFactory.java:252)
	at org.slf4j.LoggerFactory.getLogger(LoggerFactory.java:265)
	at org.apache.solr.SolrTestCaseJ4.<clinit>(SolrTestCaseJ4.java:345)
	at java.lang.Class.forName0(Native Method)
	at java.lang.Class.forName(Class.java:264)
	at com.carrotsearch.randomizedtesting.RandomizedRunner$1.run(RandomizedRunner.java:486)
Caused by: java.lang.ClassNotFoundException: org.apache.log4j.Level
	at java.net.URLClassLoader$1.run(URLClassLoader.java:217)
	at java.security.AccessController.doPrivileged(Native Method)
	at java.net.URLClassLoader.findClass(URLClassLoader.java:205)
	at java.lang.ClassLoader.loadClass(ClassLoader.java:321)
	at sun.misc.Launcher$AppClassLoader.loadClass(Launcher.java:294)
	at java.lang.ClassLoader.loadClass(ClassLoader.java:266)
	... 9 more


FAILED:  org.apache.solr.handler.dataimport.TestEphemeralCache.org.apache.solr.handler.dataimport.TestEphemeralCache

Error Message:
Could not initialize class org.apache.solr.handler.dataimport.AbstractDataImportHandlerTestCase

Stack Trace:
java.lang.NoClassDefFoundError: Could not initialize class org.apache.solr.handler.dataimport.AbstractDataImportHandlerTestCase
	at java.lang.Class.forName0(Native Method)
	at java.lang.Class.forName(Class.java:264)
	at com.carrotsearch.randomizedtesting.RandomizedRunner$1.run(RandomizedRunner.java:486)


FAILED:  org.apache.solr.handler.dataimport.TestErrorHandling.org.apache.solr.handler.dataimport.TestErrorHandling

Error Message:
Could not initialize class org.apache.solr.handler.dataimport.AbstractDataImportHandlerTestCase

Stack Trace:
java.lang.NoClassDefFoundError: Could not initialize class org.apache.solr.handler.dataimport.AbstractDataImportHandlerTestCase
	at java.lang.Class.forName0(Native Method)
	at java.lang.Class.forName(Class.java:264)
	at com.carrotsearch.randomizedtesting.RandomizedRunner$1.run(RandomizedRunner.java:486)


FAILED:  org.apache.solr.handler.dataimport.TestFieldReader.org.apache.solr.handler.dataimport.TestFieldReader

Error Message:
Could not initialize class org.apache.solr.handler.dataimport.AbstractDataImportHandlerTestCase

Stack Trace:
java.lang.NoClassDefFoundError: Could not initialize class org.apache.solr.handler.dataimport.AbstractDataImportHandlerTestCase
	at java.lang.Class.forName0(Native Method)
	at java.lang.Class.forName(Class.java:264)
	at com.carrotsearch.randomizedtesting.RandomizedRunner$1.run(RandomizedRunner.java:486)


FAILED:  org.apache.solr.handler.dataimport.TestFileListEntityProcessor.org.apache.solr.handler.dataimport.TestFileListEntityProcessor

Error Message:
Could not initialize class org.apache.solr.handler.dataimport.AbstractDataImportHandlerTestCase

Stack Trace:
java.lang.NoClassDefFoundError: Could not initialize class org.apache.solr.handler.dataimport.AbstractDataImportHandlerTestCase
	at java.lang.Class.forName0(Native Method)
	at java.lang.Class.forName(Class.java:264)
	at com.carrotsearch.randomizedtesting.RandomizedRunner$1.run(RandomizedRunner.java:486)


FAILED:  org.apache.solr.handler.dataimport.TestFileListWithLineEntityProcessor.org.apache.solr.handler.dataimport.TestFileListWithLineEntityProcessor

Error Message:
Could not initialize class org.apache.solr.handler.dataimport.AbstractDataImportHandlerTestCase

Stack Trace:
java.lang.NoClassDefFoundError: Could not initialize class org.apache.solr.handler.dataimport.AbstractDataImportHandlerTestCase
	at java.lang.Class.forName0(Native Method)
	at java.lang.Class.forName(Class.java:264)
	at com.carrotsearch.randomizedtesting.RandomizedRunner$1.run(RandomizedRunner.java:486)


FAILED:  org.apache.solr.handler.dataimport.TestJdbcDataSource.org.apache.solr.handler.dataimport.TestJdbcDataSource

Error Message:
Could not initialize class org.apache.solr.handler.dataimport.AbstractDataImportHandlerTestCase

Stack Trace:
java.lang.NoClassDefFoundError: Could not initialize class org.apache.solr.handler.dataimport.AbstractDataImportHandlerTestCase
	at java.lang.Class.forName0(Native Method)
	at java.lang.Class.forName(Class.java:264)
	at com.carrotsearch.randomizedtesting.RandomizedRunner$1.run(RandomizedRunner.java:486)


FAILED:  org.apache.solr.handler.dataimport.TestLineEntityProcessor.org.apache.solr.handler.dataimport.TestLineEntityProcessor

Error Message:
Could not initialize class org.apache.solr.handler.dataimport.AbstractDataImportHandlerTestCase

Stack Trace:
java.lang.NoClassDefFoundError: Could not initialize class org.apache.solr.handler.dataimport.AbstractDataImportHandlerTestCase
	at java.lang.Class.forName0(Native Method)
	at java.lang.Class.forName(Class.java:264)
	at com.carrotsearch.randomizedtesting.RandomizedRunner$1.run(RandomizedRunner.java:486)


FAILED:  org.apache.solr.handler.dataimport.TestNestedChildren.org.apache.solr.handler.dataimport.TestNestedChildren

Error Message:
Could not initialize class org.apache.solr.handler.dataimport.AbstractDIHJdbcTestCase

Stack Trace:
java.lang.NoClassDefFoundError: Could not initialize class org.apache.solr.handler.dataimport.AbstractDIHJdbcTestCase
	at java.lang.Class.forName0(Native Method)
	at java.lang.Class.forName(Class.java:264)
	at com.carrotsearch.randomizedtesting.RandomizedRunner$1.run(RandomizedRunner.java:486)


FAILED:  org.apache.solr.handler.dataimport.TestNonWritablePersistFile.org.apache.solr.handler.dataimport.TestNonWritablePersistFile

Error Message:
Could not initialize class org.apache.solr.handler.dataimport.AbstractDataImportHandlerTestCase

Stack Trace:
java.lang.NoClassDefFoundError: Could not initialize class org.apache.solr.handler.dataimport.AbstractDataImportHandlerTestCase
	at java.lang.Class.forName0(Native Method)
	at java.lang.Class.forName(Class.java:264)
	at com.carrotsearch.randomizedtesting.RandomizedRunner$1.run(RandomizedRunner.java:486)


FAILED:  org.apache.solr.handler.dataimport.TestNumberFormatTransformer.org.apache.solr.handler.dataimport.TestNumberFormatTransformer

Error Message:
Could not initialize class org.apache.solr.handler.dataimport.AbstractDataImportHandlerTestCase

Stack Trace:
java.lang.NoClassDefFoundError: Could not initialize class org.apache.solr.handler.dataimport.AbstractDataImportHandlerTestCase
	at java.lang.Class.forName0(Native Method)
	at java.lang.Class.forName(Class.java:264)
	at com.carrotsearch.randomizedtesting.RandomizedRunner$1.run(RandomizedRunner.java:486)


FAILED:  org.apache.solr.handler.dataimport.TestPlainTextEntityProcessor.org.apache.solr.handler.dataimport.TestPlainTextEntityProcessor

Error Message:
Could not initialize class org.apache.solr.handler.dataimport.AbstractDataImportHandlerTestCase

Stack Trace:
java.lang.NoClassDefFoundError: Could not initialize class org.apache.solr.handler.dataimport.AbstractDataImportHandlerTestCase
	at java.lang.Class.forName0(Native Method)
	at java.lang.Class.forName(Class.java:264)
	at com.carrotsearch.randomizedtesting.RandomizedRunner$1.run(RandomizedRunner.java:486)


FAILED:  org.apache.solr.handler.dataimport.TestRegexTransformer.org.apache.solr.handler.dataimport.TestRegexTransformer

Error Message:
Could not initialize class org.apache.solr.handler.dataimport.AbstractDataImportHandlerTestCase

Stack Trace:
java.lang.NoClassDefFoundError: Could not initialize class org.apache.solr.handler.dataimport.AbstractDataImportHandlerTestCase
	at java.lang.Class.forName0(Native Method)
	at java.lang.Class.forName(Class.java:264)
	at com.carrotsearch.randomizedtesting.RandomizedRunner$1.run(RandomizedRunner.java:486)


FAILED:  org.apache.solr.handler.dataimport.TestScriptTransformer.org.apache.solr.handler.dataimport.TestScriptTransformer

Error Message:
Could not initialize class org.apache.solr.handler.dataimport.AbstractDataImportHandlerTestCase

Stack Trace:
java.lang.NoClassDefFoundError: Could not initialize class org.apache.solr.handler.dataimport.AbstractDataImportHandlerTestCase
	at java.lang.Class.forName0(Native Method)
	at java.lang.Class.forName(Class.java:264)
	at com.carrotsearch.randomizedtesting.RandomizedRunner$1.run(RandomizedRunner.java:486)


FAILED:  org.apache.solr.handler.dataimport.TestSimplePropertiesWriter.org.apache.solr.handler.dataimport.TestSimplePropertiesWriter

Error Message:
Could not initialize class org.apache.solr.handler.dataimport.AbstractDataImportHandlerTestCase

Stack Trace:
java.lang.NoClassDefFoundError: Could not initialize class org.apache.solr.handler.dataimport.AbstractDataImportHandlerTestCase
	at java.lang.Class.forName0(Native Method)
	at java.lang.Class.forName(Class.java:264)
	at com.carrotsearch.randomizedtesting.RandomizedRunner$1.run(RandomizedRunner.java:486)


FAILED:  org.apache.solr.handler.dataimport.TestSolrEntityProcessorEndToEnd.org.apache.solr.handler.dataimport.TestSolrEntityProcessorEndToEnd

Error Message:
Could not initialize class org.apache.solr.handler.dataimport.AbstractDataImportHandlerTestCase

Stack Trace:
java.lang.NoClassDefFoundError: Could not initialize class org.apache.solr.handler.dataimport.AbstractDataImportHandlerTestCase
	at java.lang.Class.forName0(Native Method)
	at java.lang.Class.forName(Class.java:264)
	at com.carrotsearch.randomizedtesting.RandomizedRunner$1.run(RandomizedRunner.java:486)


FAILED:  org.apache.solr.handler.dataimport.TestSolrEntityProcessorUnit.org.apache.solr.handler.dataimport.TestSolrEntityProcessorUnit

Error Message:
Could not initialize class org.apache.solr.handler.dataimport.AbstractDataImportHandlerTestCase

Stack Trace:
java.lang.NoClassDefFoundError: Could not initialize class org.apache.solr.handler.dataimport.AbstractDataImportHandlerTestCase
	at java.lang.Class.forName0(Native Method)
	at java.lang.Class.forName(Class.java:264)
	at com.carrotsearch.randomizedtesting.RandomizedRunner$1.run(RandomizedRunner.java:486)


FAILED:  org.apache.solr.handler.dataimport.TestSortedMapBackedCache.testCacheWithKeyLookup

Error Message:
null

Stack Trace:
java.lang.ExceptionInInitializerError
	at sun.reflect.NativeConstructorAccessorImpl.newInstance0(Native Method)
	at sun.reflect.NativeConstructorAccessorImpl.newInstance(NativeConstructorAccessorImpl.java:57)
	at sun.reflect.DelegatingConstructorAccessorImpl.newInstance(DelegatingConstructorAccessorImpl.java:45)
	at java.lang.reflect.Constructor.newInstance(Constructor.java:532)
	at org.junit.runners.BlockJUnit4ClassRunner.createTest(BlockJUnit4ClassRunner.java:187)
	at org.junit.runners.BlockJUnit4ClassRunner$1.runReflectiveCall(BlockJUnit4ClassRunner.java:236)
	at org.junit.internal.runners.model.ReflectiveCallable.run(ReflectiveCallable.java:15)
	at org.junit.runners.BlockJUnit4ClassRunner.methodBlock(BlockJUnit4ClassRunner.java:233)
	at org.junit.runners.BlockJUnit4ClassRunner.runChild(BlockJUnit4ClassRunner.java:68)
	at org.junit.runners.BlockJUnit4ClassRunner.runChild(BlockJUnit4ClassRunner.java:47)
	at org.junit.runners.ParentRunner$3.run(ParentRunner.java:231)
	at org.junit.runners.ParentRunner$1.schedule(ParentRunner.java:60)
	at org.junit.runners.ParentRunner.runChildren(ParentRunner.java:229)
	at org.junit.runners.ParentRunner.access$000(ParentRunner.java:50)
	at org.junit.runners.ParentRunner$2.evaluate(ParentRunner.java:222)
	at org.junit.runners.ParentRunner.run(ParentRunner.java:300)
	at org.apache.maven.surefire.junit4.JUnit4Provider.execute(JUnit4Provider.java:236)
	at org.apache.maven.surefire.junit4.JUnit4Provider.executeTestSet(JUnit4Provider.java:134)
	at org.apache.maven.surefire.junit4.JUnit4Provider.invoke(JUnit4Provider.java:113)
	at sun.reflect.NativeMethodAccessorImpl.invoke0(Native Method)
	at sun.reflect.NativeMethodAccessorImpl.invoke(NativeMethodAccessorImpl.java:57)
	at sun.reflect.DelegatingMethodAccessorImpl.invoke(DelegatingMethodAccessorImpl.java:43)
	at java.lang.reflect.Method.invoke(Method.java:616)
	at org.apache.maven.surefire.util.ReflectionUtils.invokeMethodWithArray(ReflectionUtils.java:189)
	at org.apache.maven.surefire.booter.ProviderFactory$ProviderProxy.invoke(ProviderFactory.java:165)
	at org.apache.maven.surefire.booter.ProviderFactory.invokeProvider(ProviderFactory.java:85)
	at org.apache.maven.surefire.booter.ForkedBooter.runSuitesInProcess(ForkedBooter.java:103)
	at org.apache.maven.surefire.booter.ForkedBooter.main(ForkedBooter.java:74)
Caused by: java.lang.IllegalStateException: org.slf4j.LoggerFactory could not be successfully initialized. See also http://www.slf4j.org/codes.html#unsuccessfulInit
	at org.slf4j.LoggerFactory.getILoggerFactory(LoggerFactory.java:288)
	at org.slf4j.LoggerFactory.getLogger(LoggerFactory.java:252)
	at org.slf4j.LoggerFactory.getLogger(LoggerFactory.java:265)
	at org.apache.solr.handler.dataimport.TestSortedMapBackedCache.<clinit>(TestSortedMapBackedCache.java:34)
	... 28 more


FAILED:  org.apache.solr.handler.dataimport.TestSortedMapBackedCache.testCacheWithOrderedLookup

Error Message:
Could not initialize class org.apache.solr.handler.dataimport.TestSortedMapBackedCache

Stack Trace:
java.lang.NoClassDefFoundError: Could not initialize class org.apache.solr.handler.dataimport.TestSortedMapBackedCache
	at sun.reflect.NativeConstructorAccessorImpl.newInstance0(Native Method)
	at sun.reflect.NativeConstructorAccessorImpl.newInstance(NativeConstructorAccessorImpl.java:57)
	at sun.reflect.DelegatingConstructorAccessorImpl.newInstance(DelegatingConstructorAccessorImpl.java:45)
	at java.lang.reflect.Constructor.newInstance(Constructor.java:532)
	at org.junit.runners.BlockJUnit4ClassRunner.createTest(BlockJUnit4ClassRunner.java:187)
	at org.junit.runners.BlockJUnit4ClassRunner$1.runReflectiveCall(BlockJUnit4ClassRunner.java:236)
	at org.junit.internal.runners.model.ReflectiveCallable.run(ReflectiveCallable.java:15)
	at org.junit.runners.BlockJUnit4ClassRunner.methodBlock(BlockJUnit4ClassRunner.java:233)
	at org.junit.runners.BlockJUnit4ClassRunner.runChild(BlockJUnit4ClassRunner.java:68)
	at org.junit.runners.BlockJUnit4ClassRunner.runChild(BlockJUnit4ClassRunner.java:47)
	at org.junit.runners.ParentRunner$3.run(ParentRunner.java:231)
	at org.junit.runners.ParentRunner$1.schedule(ParentRunner.java:60)
	at org.junit.runners.ParentRunner.runChildren(ParentRunner.java:229)
	at org.junit.runners.ParentRunner.access$000(ParentRunner.java:50)
	at org.junit.runners.ParentRunner$2.evaluate(ParentRunner.java:222)
	at org.junit.runners.ParentRunner.run(ParentRunner.java:300)
	at org.apache.maven.surefire.junit4.JUnit4Provider.execute(JUnit4Provider.java:236)
	at org.apache.maven.surefire.junit4.JUnit4Provider.executeTestSet(JUnit4Provider.java:134)
	at org.apache.maven.surefire.junit4.JUnit4Provider.invoke(JUnit4Provider.java:113)
	at sun.reflect.NativeMethodAccessorImpl.invoke0(Native Method)
	at sun.reflect.NativeMethodAccessorImpl.invoke(NativeMethodAccessorImpl.java:57)
	at sun.reflect.DelegatingMethodAccessorImpl.invoke(DelegatingMethodAccessorImpl.java:43)
	at java.lang.reflect.Method.invoke(Method.java:616)
	at org.apache.maven.surefire.util.ReflectionUtils.invokeMethodWithArray(ReflectionUtils.java:189)
	at org.apache.maven.surefire.booter.ProviderFactory$ProviderProxy.invoke(ProviderFactory.java:165)
	at org.apache.maven.surefire.booter.ProviderFactory.invokeProvider(ProviderFactory.java:85)
	at org.apache.maven.surefire.booter.ForkedBooter.runSuitesInProcess(ForkedBooter.java:103)
	at org.apache.maven.surefire.booter.ForkedBooter.main(ForkedBooter.java:74)


FAILED:  org.apache.solr.handler.dataimport.TestSortedMapBackedCache.testNullKeys

Error Message:
Could not initialize class org.apache.solr.handler.dataimport.TestSortedMapBackedCache

Stack Trace:
java.lang.NoClassDefFoundError: Could not initialize class org.apache.solr.handler.dataimport.TestSortedMapBackedCache
	at sun.reflect.NativeConstructorAccessorImpl.newInstance0(Native Method)
	at sun.reflect.NativeConstructorAccessorImpl.newInstance(NativeConstructorAccessorImpl.java:57)
	at sun.reflect.DelegatingConstructorAccessorImpl.newInstance(DelegatingConstructorAccessorImpl.java:45)
	at java.lang.reflect.Constructor.newInstance(Constructor.java:532)
	at org.junit.runners.BlockJUnit4ClassRunner.createTest(BlockJUnit4ClassRunner.java:187)
	at org.junit.runners.BlockJUnit4ClassRunner$1.runReflectiveCall(BlockJUnit4ClassRunner.java:236)
	at org.junit.internal.runners.model.ReflectiveCallable.run(ReflectiveCallable.java:15)
	at org.junit.runners.BlockJUnit4ClassRunner.methodBlock(BlockJUnit4ClassRunner.java:233)
	at org.junit.runners.BlockJUnit4ClassRunner.runChild(BlockJUnit4ClassRunner.java:68)
	at org.junit.runners.BlockJUnit4ClassRunner.runChild(BlockJUnit4ClassRunner.java:47)
	at org.junit.runners.ParentRunner$3.run(ParentRunner.java:231)
	at org.junit.runners.ParentRunner$1.schedule(ParentRunner.java:60)
	at org.junit.runners.ParentRunner.runChildren(ParentRunner.java:229)
	at org.junit.runners.ParentRunner.access$000(ParentRunner.java:50)
	at org.junit.runners.ParentRunner$2.evaluate(ParentRunner.java:222)
	at org.junit.runners.ParentRunner.run(ParentRunner.java:300)
	at org.apache.maven.surefire.junit4.JUnit4Provider.execute(JUnit4Provider.java:236)
	at org.apache.maven.surefire.junit4.JUnit4Provider.executeTestSet(JUnit4Provider.java:134)
	at org.apache.maven.surefire.junit4.JUnit4Provider.invoke(JUnit4Provider.java:113)
	at sun.reflect.NativeMethodAccessorImpl.invoke0(Native Method)
	at sun.reflect.NativeMethodAccessorImpl.invoke(NativeMethodAccessorImpl.java:57)
	at sun.reflect.DelegatingMethodAccessorImpl.invoke(DelegatingMethodAccessorImpl.java:43)
	at java.lang.reflect.Method.invoke(Method.java:616)
	at org.apache.maven.surefire.util.ReflectionUtils.invokeMethodWithArray(ReflectionUtils.java:189)
	at org.apache.maven.surefire.booter.ProviderFactory$ProviderProxy.invoke(ProviderFactory.java:165)
	at org.apache.maven.surefire.booter.ProviderFactory.invokeProvider(ProviderFactory.java:85)
	at org.apache.maven.surefire.booter.ForkedBooter.runSuitesInProcess(ForkedBooter.java:103)
	at org.apache.maven.surefire.booter.ForkedBooter.main(ForkedBooter.java:74)


FAILED:  org.apache.solr.handler.dataimport.TestSortedMapBackedCache.testCacheReopensWithUpdate

Error Message:
Could not initialize class org.apache.solr.handler.dataimport.TestSortedMapBackedCache

Stack Trace:
java.lang.NoClassDefFoundError: Could not initialize class org.apache.solr.handler.dataimport.TestSortedMapBackedCache
	at sun.reflect.NativeConstructorAccessorImpl.newInstance0(Native Method)
	at sun.reflect.NativeConstructorAccessorImpl.newInstance(NativeConstructorAccessorImpl.java:57)
	at sun.reflect.DelegatingConstructorAccessorImpl.newInstance(DelegatingConstructorAccessorImpl.java:45)
	at java.lang.reflect.Constructor.newInstance(Constructor.java:532)
	at org.junit.runners.BlockJUnit4ClassRunner.createTest(BlockJUnit4ClassRunner.java:187)
	at org.junit.runners.BlockJUnit4ClassRunner$1.runReflectiveCall(BlockJUnit4ClassRunner.java:236)
	at org.junit.internal.runners.model.ReflectiveCallable.run(ReflectiveCallable.java:15)
	at org.junit.runners.BlockJUnit4ClassRunner.methodBlock(BlockJUnit4ClassRunner.java:233)
	at org.junit.runners.BlockJUnit4ClassRunner.runChild(BlockJUnit4ClassRunner.java:68)
	at org.junit.runners.BlockJUnit4ClassRunner.runChild(BlockJUnit4ClassRunner.java:47)
	at org.junit.runners.ParentRunner$3.run(ParentRunner.java:231)
	at org.junit.runners.ParentRunner$1.schedule(ParentRunner.java:60)
	at org.junit.runners.ParentRunner.runChildren(ParentRunner.java:229)
	at org.junit.runners.ParentRunner.access$000(ParentRunner.java:50)
	at org.junit.runners.ParentRunner$2.evaluate(ParentRunner.java:222)
	at org.junit.runners.ParentRunner.run(ParentRunner.java:300)
	at org.apache.maven.surefire.junit4.JUnit4Provider.execute(JUnit4Provider.java:236)
	at org.apache.maven.surefire.junit4.JUnit4Provider.executeTestSet(JUnit4Provider.java:134)
	at org.apache.maven.surefire.junit4.JUnit4Provider.invoke(JUnit4Provider.java:113)
	at sun.reflect.NativeMethodAccessorImpl.invoke0(Native Method)
	at sun.reflect.NativeMethodAccessorImpl.invoke(NativeMethodAccessorImpl.java:57)
	at sun.reflect.DelegatingMethodAccessorImpl.invoke(DelegatingMethodAccessorImpl.java:43)
	at java.lang.reflect.Method.invoke(Method.java:616)
	at org.apache.maven.surefire.util.ReflectionUtils.invokeMethodWithArray(ReflectionUtils.java:189)
	at org.apache.maven.surefire.booter.ProviderFactory$ProviderProxy.invoke(ProviderFactory.java:165)
	at org.apache.maven.surefire.booter.ProviderFactory.invokeProvider(ProviderFactory.java:85)
	at org.apache.maven.surefire.booter.ForkedBooter.runSuitesInProcess(ForkedBooter.java:103)
	at org.apache.maven.surefire.booter.ForkedBooter.main(ForkedBooter.java:74)


FAILED:  org.apache.solr.handler.dataimport.TestSqlEntityProcessor.org.apache.solr.handler.dataimport.TestSqlEntityProcessor

Error Message:
Could not initialize class org.apache.solr.handler.dataimport.AbstractDIHJdbcTestCase

Stack Trace:
java.lang.NoClassDefFoundError: Could not initialize class org.apache.solr.handler.dataimport.AbstractDIHJdbcTestCase
	at java.lang.Class.forName0(Native Method)
	at java.lang.Class.forName(Class.java:264)
	at com.carrotsearch.randomizedtesting.RandomizedRunner$1.run(RandomizedRunner.java:486)


FAILED:  org.apache.solr.handler.dataimport.TestSqlEntityProcessorDelta.org.apache.solr.handler.dataimport.TestSqlEntityProcessorDelta

Error Message:
Could not initialize class org.apache.solr.handler.dataimport.AbstractSqlEntityProcessorTestCase

Stack Trace:
java.lang.NoClassDefFoundError: Could not initialize class org.apache.solr.handler.dataimport.AbstractSqlEntityProcessorTestCase
	at java.lang.Class.forName0(Native Method)
	at java.lang.Class.forName(Class.java:264)
	at com.carrotsearch.randomizedtesting.RandomizedRunner$1.run(RandomizedRunner.java:486)


FAILED:  org.apache.solr.handler.dataimport.TestTemplateTransformer.org.apache.solr.handler.dataimport.TestTemplateTransformer

Error Message:
Could not initialize class org.apache.solr.handler.dataimport.AbstractDataImportHandlerTestCase

Stack Trace:
java.lang.NoClassDefFoundError: Could not initialize class org.apache.solr.handler.dataimport.AbstractDataImportHandlerTestCase
	at java.lang.Class.forName0(Native Method)
	at java.lang.Class.forName(Class.java:264)
	at com.carrotsearch.randomizedtesting.RandomizedRunner$1.run(RandomizedRunner.java:486)


FAILED:  org.apache.solr.handler.dataimport.TestURLDataSource.org.apache.solr.handler.dataimport.TestURLDataSource

Error Message:
Could not initialize class org.apache.solr.handler.dataimport.AbstractDataImportHandlerTestCase

Stack Trace:
java.lang.NoClassDefFoundError: Could not initialize class org.apache.solr.handler.dataimport.AbstractDataImportHandlerTestCase
	at java.lang.Class.forName0(Native Method)
	at java.lang.Class.forName(Class.java:264)
	at com.carrotsearch.randomizedtesting.RandomizedRunner$1.run(RandomizedRunner.java:486)


FAILED:  org.apache.solr.handler.dataimport.TestVariableResolver.org.apache.solr.handler.dataimport.TestVariableResolver

Error Message:
Could not initialize class org.apache.solr.handler.dataimport.AbstractDataImportHandlerTestCase

Stack Trace:
java.lang.NoClassDefFoundError: Could not initialize class org.apache.solr.handler.dataimport.AbstractDataImportHandlerTestCase
	at java.lang.Class.forName0(Native Method)
	at java.lang.Class.forName(Class.java:264)
	at com.carrotsearch.randomizedtesting.RandomizedRunner$1.run(RandomizedRunner.java:486)


FAILED:  org.apache.solr.handler.dataimport.TestXPathEntityProcessor.org.apache.solr.handler.dataimport.TestXPathEntityProcessor

Error Message:
Could not initialize class org.apache.solr.handler.dataimport.AbstractDataImportHandlerTestCase

Stack Trace:
java.lang.NoClassDefFoundError: Could not initialize class org.apache.solr.handler.dataimport.AbstractDataImportHandlerTestCase
	at java.lang.Class.forName0(Native Method)
	at java.lang.Class.forName(Class.java:264)
	at com.carrotsearch.randomizedtesting.RandomizedRunner$1.run(RandomizedRunner.java:486)


FAILED:  org.apache.solr.handler.dataimport.TestXPathRecordReader.org.apache.solr.handler.dataimport.TestXPathRecordReader

Error Message:
Could not initialize class org.apache.solr.handler.dataimport.AbstractDataImportHandlerTestCase

Stack Trace:
java.lang.NoClassDefFoundError: Could not initialize class org.apache.solr.handler.dataimport.AbstractDataImportHandlerTestCase
	at java.lang.Class.forName0(Native Method)
	at java.lang.Class.forName(Class.java:264)
	at com.carrotsearch.randomizedtesting.RandomizedRunner$1.run(RandomizedRunner.java:486)


FAILED:  org.apache.solr.handler.extraction.ExtractingRequestHandlerTest.org.apache.solr.handler.extraction.ExtractingRequestHandlerTest

Error Message:
org/apache/log4j/Level

Stack Trace:
java.lang.NoClassDefFoundError: org/apache/log4j/Level
	at org.slf4j.LoggerFactory.bind(LoggerFactory.java:128)
	at org.slf4j.LoggerFactory.performInitialization(LoggerFactory.java:108)
	at org.slf4j.LoggerFactory.getILoggerFactory(LoggerFactory.java:279)
	at org.slf4j.LoggerFactory.getLogger(LoggerFactory.java:252)
	at org.slf4j.LoggerFactory.getLogger(LoggerFactory.java:265)
	at org.apache.solr.SolrTestCaseJ4.<clinit>(SolrTestCaseJ4.java:345)
	at java.lang.Class.forName0(Native Method)
	at java.lang.Class.forName(Class.java:264)
	at com.carrotsearch.randomizedtesting.RandomizedRunner$1.run(RandomizedRunner.java:486)
Caused by: java.lang.ClassNotFoundException: org.apache.log4j.Level
	at java.net.URLClassLoader$1.run(URLClassLoader.java:217)
	at java.security.AccessController.doPrivileged(Native Method)
	at java.net.URLClassLoader.findClass(URLClassLoader.java:205)
	at java.lang.ClassLoader.loadClass(ClassLoader.java:321)
	at sun.misc.Launcher$AppClassLoader.loadClass(Launcher.java:294)
	at java.lang.ClassLoader.loadClass(ClassLoader.java:266)
	... 9 more


FAILED:  org.apache.solr.update.processor.LangDetectLanguageIdentifierUpdateProcessorFactoryTest.org.apache.solr.update.processor.LangDetectLanguageIdentifierUpdateProcessorFactoryTest

Error Message:
Could not initialize class org.apache.solr.update.processor.LanguageIdentifierUpdateProcessorFactoryTestCase

Stack Trace:
java.lang.NoClassDefFoundError: Could not initialize class org.apache.solr.update.processor.LanguageIdentifierUpdateProcessorFactoryTestCase
	at java.lang.Class.forName0(Native Method)
	at java.lang.Class.forName(Class.java:264)
	at com.carrotsearch.randomizedtesting.RandomizedRunner$1.run(RandomizedRunner.java:486)


FAILED:  org.apache.solr.update.processor.TikaLanguageIdentifierUpdateProcessorFactoryTest.org.apache.solr.update.processor.TikaLanguageIdentifierUpdateProcessorFactoryTest

Error Message:
org/apache/log4j/Level

Stack Trace:
java.lang.NoClassDefFoundError: org/apache/log4j/Level
	at org.slf4j.LoggerFactory.bind(LoggerFactory.java:128)
	at org.slf4j.LoggerFactory.performInitialization(LoggerFactory.java:108)
	at org.slf4j.LoggerFactory.getILoggerFactory(LoggerFactory.java:279)
	at org.slf4j.LoggerFactory.getLogger(LoggerFactory.java:252)
	at org.slf4j.LoggerFactory.getLogger(LoggerFactory.java:265)
	at org.apache.solr.SolrTestCaseJ4.<clinit>(SolrTestCaseJ4.java:345)
	at java.lang.Class.forName0(Native Method)
	at java.lang.Class.forName(Class.java:264)
	at com.carrotsearch.randomizedtesting.RandomizedRunner$1.run(RandomizedRunner.java:486)
Caused by: java.lang.ClassNotFoundException: org.apache.log4j.Level
	at java.net.URLClassLoader$1.run(URLClassLoader.java:217)
	at java.security.AccessController.doPrivileged(Native Method)
	at java.net.URLClassLoader.findClass(URLClassLoader.java:205)
	at java.lang.ClassLoader.loadClass(ClassLoader.java:321)
	at sun.misc.Launcher$AppClassLoader.loadClass(Launcher.java:294)
	at java.lang.ClassLoader.loadClass(ClassLoader.java:266)
	... 9 more


FAILED:  org.apache.solr.uima.analysis.UIMAAnnotationsTokenizerFactoryTest.org.apache.solr.uima.analysis.UIMAAnnotationsTokenizerFactoryTest

Error Message:
Could not initialize class org.apache.solr.SolrTestCaseJ4

Stack Trace:
java.lang.NoClassDefFoundError: Could not initialize class org.apache.solr.SolrTestCaseJ4
	at java.lang.Class.forName0(Native Method)
	at java.lang.Class.forName(Class.java:264)
	at com.carrotsearch.randomizedtesting.RandomizedRunner$1.run(RandomizedRunner.java:486)


FAILED:  org.apache.solr.uima.analysis.UIMATypeAwareAnnotationsTokenizerFactoryTest.org.apache.solr.uima.analysis.UIMATypeAwareAnnotationsTokenizerFactoryTest

Error Message:
Could not initialize class org.apache.solr.SolrTestCaseJ4

Stack Trace:
java.lang.NoClassDefFoundError: Could not initialize class org.apache.solr.SolrTestCaseJ4
	at java.lang.Class.forName0(Native Method)
	at java.lang.Class.forName(Class.java:264)
	at com.carrotsearch.randomizedtesting.RandomizedRunner$1.run(RandomizedRunner.java:486)


FAILED:  org.apache.solr.uima.processor.UIMAUpdateRequestProcessorTest.org.apache.solr.uima.processor.UIMAUpdateRequestProcessorTest

Error Message:
org/apache/log4j/Level

Stack Trace:
java.lang.NoClassDefFoundError: org/apache/log4j/Level
	at org.slf4j.LoggerFactory.bind(LoggerFactory.java:128)
	at org.slf4j.LoggerFactory.performInitialization(LoggerFactory.java:108)
	at org.slf4j.LoggerFactory.getILoggerFactory(LoggerFactory.java:279)
	at org.slf4j.LoggerFactory.getLogger(LoggerFactory.java:252)
	at org.slf4j.LoggerFactory.getLogger(LoggerFactory.java:265)
	at org.apache.solr.SolrTestCaseJ4.<clinit>(SolrTestCaseJ4.java:345)
	at java.lang.Class.forName0(Native Method)
	at java.lang.Class.forName(Class.java:264)
	at com.carrotsearch.randomizedtesting.RandomizedRunner$1.run(RandomizedRunner.java:486)
Caused by: java.lang.ClassNotFoundException: org.apache.log4j.Level
	at java.net.URLClassLoader$1.run(URLClassLoader.java:217)
	at java.security.AccessController.doPrivileged(Native Method)
	at java.net.URLClassLoader.findClass(URLClassLoader.java:205)
	at java.lang.ClassLoader.loadClass(ClassLoader.java:321)
	at sun.misc.Launcher$AppClassLoader.loadClass(Launcher.java:294)
	at java.lang.ClassLoader.loadClass(ClassLoader.java:266)
	... 9 more


FAILED:  org.apache.solr.velocity.VelocityResponseWriterTest.org.apache.solr.velocity.VelocityResponseWriterTest

Error Message:
org/apache/log4j/Level

Stack Trace:
java.lang.NoClassDefFoundError: org/apache/log4j/Level
	at org.slf4j.LoggerFactory.bind(LoggerFactory.java:128)
	at org.slf4j.LoggerFactory.performInitialization(LoggerFactory.java:108)
	at org.slf4j.LoggerFactory.getILoggerFactory(LoggerFactory.java:279)
	at org.slf4j.LoggerFactory.getLogger(LoggerFactory.java:252)
	at org.slf4j.LoggerFactory.getLogger(LoggerFactory.java:265)
	at org.apache.solr.SolrTestCaseJ4.<clinit>(SolrTestCaseJ4.java:345)
	at java.lang.Class.forName0(Native Method)
	at java.lang.Class.forName(Class.java:264)
	at com.carrotsearch.randomizedtesting.RandomizedRunner$1.run(RandomizedRunner.java:486)
Caused by: java.lang.ClassNotFoundException: org.apache.log4j.Level
	at java.net.URLClassLoader$1.run(URLClassLoader.java:217)
	at java.security.AccessController.doPrivileged(Native Method)
	at java.net.URLClassLoader.findClass(URLClassLoader.java:205)
	at java.lang.ClassLoader.loadClass(ClassLoader.java:321)
	at sun.misc.Launcher$AppClassLoader.loadClass(Launcher.java:294)
	at java.lang.ClassLoader.loadClass(ClassLoader.java:266)
	... 9 more


FAILED:  org.apache.solr.AnalysisAfterCoreReloadTest.org.apache.solr.AnalysisAfterCoreReloadTest

Error Message:
Could not initialize class org.apache.solr.util.AbstractSolrTestCase

Stack Trace:
java.lang.NoClassDefFoundError: Could not initialize class org.apache.solr.util.AbstractSolrTestCase
	at java.lang.Class.forName0(Native Method)
	at java.lang.Class.forName(Class.java:264)
	at com.carrotsearch.randomizedtesting.RandomizedRunner$1.run(RandomizedRunner.java:486)


FAILED:  org.apache.solr.BasicFunctionalityTest.org.apache.solr.BasicFunctionalityTest

Error Message:
Could not initialize class org.apache.solr.SolrTestCaseJ4

Stack Trace:
java.lang.NoClassDefFoundError: Could not initialize class org.apache.solr.SolrTestCaseJ4
	at java.lang.Class.forName0(Native Method)
	at java.lang.Class.forName(Class.java:264)
	at com.carrotsearch.randomizedtesting.RandomizedRunner$1.run(RandomizedRunner.java:486)


FAILED:  org.apache.solr.ConvertedLegacyTest.org.apache.solr.ConvertedLegacyTest

Error Message:
Could not initialize class org.apache.solr.SolrTestCaseJ4

Stack Trace:
java.lang.NoClassDefFoundError: Could not initialize class org.apache.solr.SolrTestCaseJ4
	at java.lang.Class.forName0(Native Method)
	at java.lang.Class.forName(Class.java:264)
	at com.carrotsearch.randomizedtesting.RandomizedRunner$1.run(RandomizedRunner.java:486)


FAILED:  org.apache.solr.DisMaxRequestHandlerTest.org.apache.solr.DisMaxRequestHandlerTest

Error Message:
Could not initialize class org.apache.solr.SolrTestCaseJ4

Stack Trace:
java.lang.NoClassDefFoundError: Could not initialize class org.apache.solr.SolrTestCaseJ4
	at java.lang.Class.forName0(Native Method)
	at java.lang.Class.forName(Class.java:264)
	at com.carrotsearch.randomizedtesting.RandomizedRunner$1.run(RandomizedRunner.java:486)


FAILED:  org.apache.solr.EchoParamsTest.org.apache.solr.EchoParamsTest

Error Message:
Could not initialize class org.apache.solr.SolrTestCaseJ4

Stack Trace:
java.lang.NoClassDefFoundError: Could not initialize class org.apache.solr.SolrTestCaseJ4
	at java.lang.Class.forName0(Native Method)
	at java.lang.Class.forName(Class.java:264)
	at com.carrotsearch.randomizedtesting.RandomizedRunner$1.run(RandomizedRunner.java:486)


FAILED:  org.apache.solr.MinimalSchemaTest.org.apache.solr.MinimalSchemaTest

Error Message:
Could not initialize class org.apache.solr.SolrTestCaseJ4

Stack Trace:
java.lang.NoClassDefFoundError: Could not initialize class org.apache.solr.SolrTestCaseJ4
	at java.lang.Class.forName0(Native Method)
	at java.lang.Class.forName(Class.java:264)
	at com.carrotsearch.randomizedtesting.RandomizedRunner$1.run(RandomizedRunner.java:486)


FAILED:  org.apache.solr.OutputWriterTest.org.apache.solr.OutputWriterTest

Error Message:
Could not initialize class org.apache.solr.SolrTestCaseJ4

Stack Trace:
java.lang.NoClassDefFoundError: Could not initialize class org.apache.solr.SolrTestCaseJ4
	at java.lang.Class.forName0(Native Method)
	at java.lang.Class.forName(Class.java:264)
	at com.carrotsearch.randomizedtesting.RandomizedRunner$1.run(RandomizedRunner.java:486)


FAILED:  org.apache.solr.SampleTest.org.apache.solr.SampleTest

Error Message:
Could not initialize class org.apache.solr.SolrTestCaseJ4

Stack Trace:
java.lang.NoClassDefFoundError: Could not initialize class org.apache.solr.SolrTestCaseJ4
	at java.lang.Class.forName0(Native Method)
	at java.lang.Class.forName(Class.java:264)
	at com.carrotsearch.randomizedtesting.RandomizedRunner$1.run(RandomizedRunner.java:486)


FAILED:  org.apache.solr.SolrInfoMBeanTest.org.apache.solr.SolrInfoMBeanTest

Error Message:
Could not initialize class org.apache.solr.SolrTestCaseJ4

Stack Trace:
java.lang.NoClassDefFoundError: Could not initialize class org.apache.solr.SolrTestCaseJ4
	at java.lang.Class.forName0(Native Method)
	at java.lang.Class.forName(Class.java:264)
	at com.carrotsearch.randomizedtesting.RandomizedRunner$1.run(RandomizedRunner.java:486)


FAILED:  org.apache.solr.TestDistributedGrouping.org.apache.solr.TestDistributedGrouping

Error Message:
Could not initialize class org.apache.solr.BaseDistributedSearchTestCase

Stack Trace:
java.lang.NoClassDefFoundError: Could not initialize class org.apache.solr.BaseDistributedSearchTestCase
	at java.lang.Class.forName0(Native Method)
	at java.lang.Class.forName(Class.java:264)
	at com.carrotsearch.randomizedtesting.RandomizedRunner$1.run(RandomizedRunner.java:486)


FAILED:  org.apache.solr.TestDistributedSearch.org.apache.solr.TestDistributedSearch

Error Message:
Could not initialize class org.apache.solr.SolrTestCaseJ4

Stack Trace:
java.lang.NoClassDefFoundError: Could not initialize class org.apache.solr.SolrTestCaseJ4
	at java.lang.Class.forName0(Native Method)
	at java.lang.Class.forName(Class.java:264)
	at com.carrotsearch.randomizedtesting.RandomizedRunner$1.run(RandomizedRunner.java:486)


FAILED:  org.apache.solr.TestGroupingSearch.org.apache.solr.TestGroupingSearch

Error Message:
Could not initialize class org.apache.solr.SolrTestCaseJ4

Stack Trace:
java.lang.NoClassDefFoundError: Could not initialize class org.apache.solr.SolrTestCaseJ4
	at java.lang.Class.forName0(Native Method)
	at java.lang.Class.forName(Class.java:264)
	at com.carrotsearch.randomizedtesting.RandomizedRunner$1.run(RandomizedRunner.java:486)


FAILED:  org.apache.solr.TestJoin.org.apache.solr.TestJoin

Error Message:
Could not initialize class org.apache.solr.SolrTestCaseJ4

Stack Trace:
java.lang.NoClassDefFoundError: Could not initialize class org.apache.solr.SolrTestCaseJ4
	at java.lang.Class.forName0(Native Method)
	at java.lang.Class.forName(Class.java:264)
	at com.carrotsearch.randomizedtesting.RandomizedRunner$1.run(RandomizedRunner.java:486)


FAILED:  org.apache.solr.TestPluginEnable.org.apache.solr.TestPluginEnable

Error Message:
Could not initialize class org.apache.solr.SolrTestCaseJ4

Stack Trace:
java.lang.NoClassDefFoundError: Could not initialize class org.apache.solr.SolrTestCaseJ4
	at java.lang.Class.forName0(Native Method)
	at java.lang.Class.forName(Class.java:264)
	at com.carrotsearch.randomizedtesting.RandomizedRunner$1.run(RandomizedRunner.java:486)


FAILED:  org.apache.solr.TestRandomFaceting.org.apache.solr.TestRandomFaceting

Error Message:
Could not initialize class org.apache.solr.SolrTestCaseJ4

Stack Trace:
java.lang.NoClassDefFoundError: Could not initialize class org.apache.solr.SolrTestCaseJ4
	at java.lang.Class.forName0(Native Method)
	at java.lang.Class.forName(Class.java:264)
	at com.carrotsearch.randomizedtesting.RandomizedRunner$1.run(RandomizedRunner.java:486)


FAILED:  org.apache.solr.TestSolrCoreProperties.testSimple

Error Message:
Could not initialize class org.apache.solr.SolrTestCaseJ4

Stack Trace:
java.lang.NoClassDefFoundError: Could not initialize class org.apache.solr.SolrTestCaseJ4
	at org.apache.solr.TestSolrCoreProperties.setUpMe(TestSolrCoreProperties.java:122)
	at org.apache.solr.TestSolrCoreProperties.setUp(TestSolrCoreProperties.java:51)
	at sun.reflect.NativeMethodAccessorImpl.invoke0(Native Method)
	at sun.reflect.NativeMethodAccessorImpl.invoke(NativeMethodAccessorImpl.java:57)
	at sun.reflect.DelegatingMethodAccessorImpl.invoke(DelegatingMethodAccessorImpl.java:43)
	at java.lang.reflect.Method.invoke(Method.java:616)
	at com.carrotsearch.randomizedtesting.RandomizedRunner.invoke(RandomizedRunner.java:1559)
	at com.carrotsearch.randomizedtesting.RandomizedRunner.access$600(RandomizedRunner.java:79)
	at com.carrotsearch.randomizedtesting.RandomizedRunner$7.evaluate(RandomizedRunner.java:771)
	at com.carrotsearch.randomizedtesting.RandomizedRunner$8.evaluate(RandomizedRunner.java:787)
	at org.apache.lucene.util.TestRuleSetupTeardownChained$1.evaluate(TestRuleSetupTeardownChained.java:50)
	at org.apache.lucene.util.TestRuleFieldCacheSanity$1.evaluate(TestRuleFieldCacheSanity.java:51)
	at org.apache.lucene.util.AbstractBeforeAfterRule$1.evaluate(AbstractBeforeAfterRule.java:45)
	at com.carrotsearch.randomizedtesting.rules.SystemPropertiesInvariantRule$1.evaluate(SystemPropertiesInvariantRule.java:55)
	at org.apache.lucene.util.TestRuleThreadAndTestName$1.evaluate(TestRuleThreadAndTestName.java:48)
	at org.apache.lucene.util.TestRuleIgnoreAfterMaxFailures$1.evaluate(TestRuleIgnoreAfterMaxFailures.java:70)
	at org.apache.lucene.util.TestRuleMarkFailure$1.evaluate(TestRuleMarkFailure.java:48)
	at com.carrotsearch.randomizedtesting.rules.StatementAdapter.evaluate(StatementAdapter.java:36)
	at com.carrotsearch.randomizedtesting.ThreadLeakControl$StatementRunner.run(ThreadLeakControl.java:358)
	at com.carrotsearch.randomizedtesting.ThreadLeakControl.forkTimeoutingTask(ThreadLeakControl.java:782)
	at com.carrotsearch.randomizedtesting.ThreadLeakControl$3.evaluate(ThreadLeakControl.java:442)
	at com.carrotsearch.randomizedtesting.RandomizedRunner.runSingleTest(RandomizedRunner.java:746)
	at com.carrotsearch.randomizedtesting.RandomizedRunner$3.evaluate(RandomizedRunner.java:648)
	at com.carrotsearch.randomizedtesting.RandomizedRunner$4.evaluate(RandomizedRunner.java:682)
	at com.carrotsearch.randomizedtesting.RandomizedRunner$5.evaluate(RandomizedRunner.java:693)
	at org.apache.lucene.util.AbstractBeforeAfterRule$1.evaluate(AbstractBeforeAfterRule.java:45)
	at org.apache.lucene.util.TestRuleStoreClassName$1.evaluate(TestRuleStoreClassName.java:42)
	at com.carrotsearch.randomizedtesting.rules.SystemPropertiesInvariantRule$1.evaluate(SystemPropertiesInvariantRule.java:55)
	at com.carrotsearch.randomizedtesting.rules.NoShadowingOrOverridesOnMethodsRule$1.evaluate(NoShadowingOrOverridesOnMethodsRule.java:39)
	at com.carrotsearch.randomizedtesting.rules.NoShadowingOrOverridesOnMethodsRule$1.evaluate(NoShadowingOrOverridesOnMethodsRule.java:39)
	at com.carrotsearch.randomizedtesting.rules.StatementAdapter.evaluate(StatementAdapter.java:36)
	at org.apache.lucene.util.TestRuleAssertionsRequired$1.evaluate(TestRuleAssertionsRequired.java:43)
	at org.apache.lucene.util.TestRuleMarkFailure$1.evaluate(TestRuleMarkFailure.java:48)
	at org.apache.lucene.util.TestRuleIgnoreAfterMaxFailures$1.evaluate(TestRuleIgnoreAfterMaxFailures.java:70)
	at org.apache.lucene.util.TestRuleIgnoreTestSuites$1.evaluate(TestRuleIgnoreTestSuites.java:55)
	at com.carrotsearch.randomizedtesting.rules.StatementAdapter.evaluate(StatementAdapter.java:36)
	at com.carrotsearch.randomizedtesting.ThreadLeakControl$StatementRunner.run(ThreadLeakControl.java:358)
	at java.lang.Thread.run(Thread.java:679)


FAILED:  org.apache.solr.TestSolrCoreProperties.testSimple

Error Message:
null

Stack Trace:
java.lang.NullPointerException
	at org.apache.solr.TestSolrCoreProperties.tearDown(TestSolrCoreProperties.java:64)
	at sun.reflect.NativeMethodAccessorImpl.invoke0(Native Method)
	at sun.reflect.NativeMethodAccessorImpl.invoke(NativeMethodAccessorImpl.java:57)
	at sun.reflect.DelegatingMethodAccessorImpl.invoke(DelegatingMethodAccessorImpl.java:43)
	at java.lang.reflect.Method.invoke(Method.java:616)
	at com.carrotsearch.randomizedtesting.RandomizedRunner.invoke(RandomizedRunner.java:1559)
	at com.carrotsearch.randomizedtesting.RandomizedRunner.access$600(RandomizedRunner.java:79)
	at com.carrotsearch.randomizedtesting.RandomizedRunner$8.evaluate(RandomizedRunner.java:795)
	at org.apache.lucene.util.TestRuleSetupTeardownChained$1.evaluate(TestRuleSetupTeardownChained.java:50)
	at org.apache.lucene.util.TestRuleFieldCacheSanity$1.evaluate(TestRuleFieldCacheSanity.java:51)
	at org.apache.lucene.util.AbstractBeforeAfterRule$1.evaluate(AbstractBeforeAfterRule.java:45)
	at com.carrotsearch.randomizedtesting.rules.SystemPropertiesInvariantRule$1.evaluate(SystemPropertiesInvariantRule.java:55)
	at org.apache.lucene.util.TestRuleThreadAndTestName$1.evaluate(TestRuleThreadAndTestName.java:48)
	at org.apache.lucene.util.TestRuleIgnoreAfterMaxFailures$1.evaluate(TestRuleIgnoreAfterMaxFailures.java:70)
	at org.apache.lucene.util.TestRuleMarkFailure$1.evaluate(TestRuleMarkFailure.java:48)
	at com.carrotsearch.randomizedtesting.rules.StatementAdapter.evaluate(StatementAdapter.java:36)
	at com.carrotsearch.randomizedtesting.ThreadLeakControl$StatementRunner.run(ThreadLeakControl.java:358)
	at com.carrotsearch.randomizedtesting.ThreadLeakControl.forkTimeoutingTask(ThreadLeakControl.java:782)
	at com.carrotsearch.randomizedtesting.ThreadLeakControl$3.evaluate(ThreadLeakControl.java:442)
	at com.carrotsearch.randomizedtesting.RandomizedRunner.runSingleTest(RandomizedRunner.java:746)
	at com.carrotsearch.randomizedtesting.RandomizedRunner$3.evaluate(RandomizedRunner.java:648)
	at com.carrotsearch.randomizedtesting.RandomizedRunner$4.evaluate(RandomizedRunner.java:682)
	at com.carrotsearch.randomizedtesting.RandomizedRunner$5.evaluate(RandomizedRunner.java:693)
	at org.apache.lucene.util.AbstractBeforeAfterRule$1.evaluate(AbstractBeforeAfterRule.java:45)
	at org.apache.lucene.util.TestRuleStoreClassName$1.evaluate(TestRuleStoreClassName.java:42)
	at com.carrotsearch.randomizedtesting.rules.SystemPropertiesInvariantRule$1.evaluate(SystemPropertiesInvariantRule.java:55)
	at com.carrotsearch.randomizedtesting.rules.NoShadowingOrOverridesOnMethodsRule$1.evaluate(NoShadowingOrOverridesOnMethodsRule.java:39)
	at com.carrotsearch.randomizedtesting.rules.NoShadowingOrOverridesOnMethodsRule$1.evaluate(NoShadowingOrOverridesOnMethodsRule.java:39)
	at com.carrotsearch.randomizedtesting.rules.StatementAdapter.evaluate(StatementAdapter.java:36)
	at org.apache.lucene.util.TestRuleAssertionsRequired$1.evaluate(TestRuleAssertionsRequired.java:43)
	at org.apache.lucene.util.TestRuleMarkFailure$1.evaluate(TestRuleMarkFailure.java:48)
	at org.apache.lucene.util.TestRuleIgnoreAfterMaxFailures$1.evaluate(TestRuleIgnoreAfterMaxFailures.java:70)
	at org.apache.lucene.util.TestRuleIgnoreTestSuites$1.evaluate(TestRuleIgnoreTestSuites.java:55)
	at com.carrotsearch.randomizedtesting.rules.StatementAdapter.evaluate(StatementAdapter.java:36)
	at com.carrotsearch.randomizedtesting.ThreadLeakControl$StatementRunner.run(ThreadLeakControl.java:358)
	at java.lang.Thread.run(Thread.java:679)


FAILED:  org.apache.solr.TestTrie.org.apache.solr.TestTrie

Error Message:
Could not initialize class org.apache.solr.SolrTestCaseJ4

Stack Trace:
java.lang.NoClassDefFoundError: Could not initialize class org.apache.solr.SolrTestCaseJ4
	at java.lang.Class.forName0(Native Method)
	at java.lang.Class.forName(Class.java:264)
	at com.carrotsearch.randomizedtesting.RandomizedRunner$1.run(RandomizedRunner.java:486)


FAILED:  org.apache.solr.analysis.PathHierarchyTokenizerFactoryTest.org.apache.solr.analysis.PathHierarchyTokenizerFactoryTest

Error Message:
Could not initialize class org.apache.solr.SolrTestCaseJ4

Stack Trace:
java.lang.NoClassDefFoundError: Could not initialize class org.apache.solr.SolrTestCaseJ4
	at java.lang.Class.forName0(Native Method)
	at java.lang.Class.forName(Class.java:264)
	at com.carrotsearch.randomizedtesting.RandomizedRunner$1.run(RandomizedRunner.java:486)


FAILED:  org.apache.solr.analysis.TestCharFilters.org.apache.solr.analysis.TestCharFilters

Error Message:
Could not initialize class org.apache.solr.SolrTestCaseJ4

Stack Trace:
java.lang.NoClassDefFoundError: Could not initialize class org.apache.solr.SolrTestCaseJ4
	at java.lang.Class.forName0(Native Method)
	at java.lang.Class.forName(Class.java:264)
	at com.carrotsearch.randomizedtesting.RandomizedRunner$1.run(RandomizedRunner.java:486)


FAILED:  org.apache.solr.analysis.TestCollationKeyRangeQueries.org.apache.solr.analysis.TestCollationKeyRangeQueries

Error Message:
Could not initialize class org.apache.solr.SolrTestCaseJ4

Stack Trace:
java.lang.NoClassDefFoundError: Could not initialize class org.apache.solr.SolrTestCaseJ4
	at java.lang.Class.forName0(Native Method)
	at java.lang.Class.forName(Class.java:264)
	at com.carrotsearch.randomizedtesting.RandomizedRunner$1.run(RandomizedRunner.java:486)


FAILED:  org.apache.solr.analysis.TestLuceneMatchVersion.org.apache.solr.analysis.TestLuceneMatchVersion

Error Message:
Could not initialize class org.apache.solr.SolrTestCaseJ4

Stack Trace:
java.lang.NoClassDefFoundError: Could not initialize class org.apache.solr.SolrTestCaseJ4
	at java.lang.Class.forName0(Native Method)
	at java.lang.Class.forName(Class.java:264)
	at com.carrotsearch.randomizedtesting.RandomizedRunner$1.run(RandomizedRunner.java:486)


FAILED:  org.apache.solr.analysis.TestReversedWildcardFilterFactory.org.apache.solr.analysis.TestReversedWildcardFilterFactory

Error Message:
Could not initialize class org.apache.solr.SolrTestCaseJ4

Stack Trace:
java.lang.NoClassDefFoundError: Could not initialize class org.apache.solr.SolrTestCaseJ4
	at java.lang.Class.forName0(Native Method)
	at java.lang.Class.forName(Class.java:264)
	at com.carrotsearch.randomizedtesting.RandomizedRunner$1.run(RandomizedRunner.java:486)


FAILED:  org.apache.solr.analysis.TestWordDelimiterFilterFactory.org.apache.solr.analysis.TestWordDelimiterFilterFactory

Error Message:
Could not initialize class org.apache.solr.SolrTestCaseJ4

Stack Trace:
java.lang.NoClassDefFoundError: Could not initialize class org.apache.solr.SolrTestCaseJ4
	at java.lang.Class.forName0(Native Method)
	at java.lang.Class.forName(Class.java:264)
	at com.carrotsearch.randomizedtesting.RandomizedRunner$1.run(RandomizedRunner.java:486)


FAILED:  org.apache.solr.cloud.BasicDistributedZk2Test.org.apache.solr.cloud.BasicDistributedZk2Test

Error Message:
Could not initialize class org.apache.solr.cloud.AbstractFullDistribZkTestBase

Stack Trace:
java.lang.NoClassDefFoundError: Could not initialize class org.apache.solr.cloud.AbstractFullDistribZkTestBase
	at java.lang.Class.forName0(Native Method)
	at java.lang.Class.forName(Class.java:264)
	at com.carrotsearch.randomizedtesting.RandomizedRunner$1.run(RandomizedRunner.java:486)


FAILED:  org.apache.solr.cloud.BasicDistributedZkTest.org.apache.solr.cloud.BasicDistributedZkTest

Error Message:
Could not initialize class org.apache.solr.cloud.AbstractFullDistribZkTestBase

Stack Trace:
java.lang.NoClassDefFoundError: Could not initialize class org.apache.solr.cloud.AbstractFullDistribZkTestBase
	at java.lang.Class.forName0(Native Method)
	at java.lang.Class.forName(Class.java:264)
	at com.carrotsearch.randomizedtesting.RandomizedRunner$1.run(RandomizedRunner.java:486)


FAILED:  org.apache.solr.cloud.BasicZkTest.org.apache.solr.cloud.BasicZkTest

Error Message:
Could not initialize class org.apache.solr.SolrTestCaseJ4

Stack Trace:
java.lang.NoClassDefFoundError: Could not initialize class org.apache.solr.SolrTestCaseJ4
	at java.lang.Class.forName0(Native Method)
	at java.lang.Class.forName(Class.java:264)
	at com.carrotsearch.randomizedtesting.RandomizedRunner$1.run(RandomizedRunner.java:486)


FAILED:  org.apache.solr.cloud.ClusterStateTest.org.apache.solr.cloud.ClusterStateTest

Error Message:
Could not initialize class org.apache.solr.SolrTestCaseJ4

Stack Trace:
java.lang.NoClassDefFoundError: Could not initialize class org.apache.solr.SolrTestCaseJ4
	at java.lang.Class.forName0(Native Method)
	at java.lang.Class.forName(Class.java:264)
	at com.carrotsearch.randomizedtesting.RandomizedRunner$1.run(RandomizedRunner.java:486)


FAILED:  org.apache.solr.cloud.ClusterStateUpdateTest.org.apache.solr.cloud.ClusterStateUpdateTest

Error Message:
Could not initialize class org.apache.solr.SolrTestCaseJ4

Stack Trace:
java.lang.NoClassDefFoundError: Could not initialize class org.apache.solr.SolrTestCaseJ4
	at java.lang.Class.forName0(Native Method)
	at java.lang.Class.forName(Class.java:264)
	at com.carrotsearch.randomizedtesting.RandomizedRunner$1.run(RandomizedRunner.java:486)


FAILED:  org.apache.solr.cloud.FullSolrCloudDistribCmdsTest.org.apache.solr.cloud.FullSolrCloudDistribCmdsTest

Error Message:
Could not initialize class org.apache.solr.cloud.AbstractFullDistribZkTestBase

Stack Trace:
java.lang.NoClassDefFoundError: Could not initialize class org.apache.solr.cloud.AbstractFullDistribZkTestBase
	at java.lang.Class.forName0(Native Method)
	at java.lang.Class.forName(Class.java:264)
	at com.carrotsearch.randomizedtesting.RandomizedRunner$1.run(RandomizedRunner.java:486)


FAILED:  org.apache.solr.cloud.LeaderElectionIntegrationTest.org.apache.solr.cloud.LeaderElectionIntegrationTest

Error Message:
Could not initialize class org.apache.solr.SolrTestCaseJ4

Stack Trace:
java.lang.NoClassDefFoundError: Could not initialize class org.apache.solr.SolrTestCaseJ4
	at java.lang.Class.forName0(Native Method)
	at java.lang.Class.forName(Class.java:264)
	at com.carrotsearch.randomizedtesting.RandomizedRunner$1.run(RandomizedRunner.java:486)


FAILED:  org.apache.solr.cloud.LeaderElectionTest.org.apache.solr.cloud.LeaderElectionTest

Error Message:
Could not initialize class org.apache.solr.SolrTestCaseJ4

Stack Trace:
java.lang.NoClassDefFoundError: Could not initialize class org.apache.solr.SolrTestCaseJ4
	at java.lang.Class.forName0(Native Method)
	at java.lang.Class.forName(Class.java:264)
	at com.carrotsearch.randomizedtesting.RandomizedRunner$1.run(RandomizedRunner.java:486)


FAILED:  org.apache.solr.cloud.OverseerTest.org.apache.solr.cloud.OverseerTest

Error Message:
Could not initialize class org.apache.solr.SolrTestCaseJ4

Stack Trace:
java.lang.NoClassDefFoundError: Could not initialize class org.apache.solr.SolrTestCaseJ4
	at java.lang.Class.forName0(Native Method)
	at java.lang.Class.forName(Class.java:264)
	at com.carrotsearch.randomizedtesting.RandomizedRunner$1.run(RandomizedRunner.java:486)


FAILED:  org.apache.solr.cloud.RecoveryZkTest.org.apache.solr.cloud.RecoveryZkTest

Error Message:
Could not initialize class org.apache.solr.cloud.AbstractFullDistribZkTestBase

Stack Trace:
java.lang.NoClassDefFoundError: Could not initialize class org.apache.solr.cloud.AbstractFullDistribZkTestBase
	at java.lang.Class.forName0(Native Method)
	at java.lang.Class.forName(Class.java:264)
	at com.carrotsearch.randomizedtesting.RandomizedRunner$1.run(RandomizedRunner.java:486)


FAILED:  org.apache.solr.cloud.SyncSliceTest.org.apache.solr.cloud.SyncSliceTest

Error Message:
Could not initialize class org.apache.solr.BaseDistributedSearchTestCase

Stack Trace:
java.lang.NoClassDefFoundError: Could not initialize class org.apache.solr.BaseDistributedSearchTestCase
	at java.lang.Class.forName0(Native Method)
	at java.lang.Class.forName(Class.java:264)
	at com.carrotsearch.randomizedtesting.RandomizedRunner$1.run(RandomizedRunner.java:486)


FAILED:  org.apache.solr.cloud.TestHashPartitioner.org.apache.solr.cloud.TestHashPartitioner

Error Message:
Could not initialize class org.apache.solr.SolrTestCaseJ4

Stack Trace:
java.lang.NoClassDefFoundError: Could not initialize class org.apache.solr.SolrTestCaseJ4
	at java.lang.Class.forName0(Native Method)
	at java.lang.Class.forName(Class.java:264)
	at com.carrotsearch.randomizedtesting.RandomizedRunner$1.run(RandomizedRunner.java:486)


FAILED:  org.apache.solr.cloud.TestMultiCoreConfBootstrap.org.apache.solr.cloud.TestMultiCoreConfBootstrap

Error Message:
Could not initialize class org.apache.solr.SolrTestCaseJ4

Stack Trace:
java.lang.NoClassDefFoundError: Could not initialize class org.apache.solr.SolrTestCaseJ4
	at java.lang.Class.forName0(Native Method)
	at java.lang.Class.forName(Class.java:264)
	at com.carrotsearch.randomizedtesting.RandomizedRunner$1.run(RandomizedRunner.java:486)


FAILED:  org.apache.solr.cloud.ZkCLITest.org.apache.solr.cloud.ZkCLITest

Error Message:
Could not initialize class org.apache.solr.SolrTestCaseJ4

Stack Trace:
java.lang.NoClassDefFoundError: Could not initialize class org.apache.solr.SolrTestCaseJ4
	at java.lang.Class.forName0(Native Method)
	at java.lang.Class.forName(Class.java:264)
	at com.carrotsearch.randomizedtesting.RandomizedRunner$1.run(RandomizedRunner.java:486)


FAILED:  org.apache.solr.cloud.ZkControllerTest.org.apache.solr.cloud.ZkControllerTest

Error Message:
Could not initialize class org.apache.solr.SolrTestCaseJ4

Stack Trace:
java.lang.NoClassDefFoundError: Could not initialize class org.apache.solr.SolrTestCaseJ4
	at java.lang.Class.forName0(Native Method)
	at java.lang.Class.forName(Class.java:264)
	at com.carrotsearch.randomizedtesting.RandomizedRunner$1.run(RandomizedRunner.java:486)


FAILED:  org.apache.solr.cloud.ZkNodePropsTest.org.apache.solr.cloud.ZkNodePropsTest

Error Message:
Could not initialize class org.apache.solr.SolrTestCaseJ4

Stack Trace:
java.lang.NoClassDefFoundError: Could not initialize class org.apache.solr.SolrTestCaseJ4
	at java.lang.Class.forName0(Native Method)
	at java.lang.Class.forName(Class.java:264)
	at com.carrotsearch.randomizedtesting.RandomizedRunner$1.run(RandomizedRunner.java:486)


FAILED:  org.apache.solr.cloud.ZkSolrClientTest.org.apache.solr.cloud.ZkSolrClientTest

Error Message:
Could not initialize class org.apache.solr.util.AbstractSolrTestCase

Stack Trace:
java.lang.NoClassDefFoundError: Could not initialize class org.apache.solr.util.AbstractSolrTestCase
	at java.lang.Class.forName0(Native Method)
	at java.lang.Class.forName(Class.java:264)
	at com.carrotsearch.randomizedtesting.RandomizedRunner$1.run(RandomizedRunner.java:486)


FAILED:  org.apache.solr.core.AlternateDirectoryTest.org.apache.solr.core.AlternateDirectoryTest

Error Message:
Could not initialize class org.apache.solr.SolrTestCaseJ4

Stack Trace:
java.lang.NoClassDefFoundError: Could not initialize class org.apache.solr.SolrTestCaseJ4
	at java.lang.Class.forName0(Native Method)
	at java.lang.Class.forName(Class.java:264)
	at com.carrotsearch.randomizedtesting.RandomizedRunner$1.run(RandomizedRunner.java:486)


FAILED:  org.apache.solr.core.CoreContainerCoreInitFailuresTest.org.apache.solr.core.CoreContainerCoreInitFailuresTest

Error Message:
Could not initialize class org.apache.solr.SolrTestCaseJ4

Stack Trace:
java.lang.NoClassDefFoundError: Could not initialize class org.apache.solr.SolrTestCaseJ4
	at java.lang.Class.forName0(Native Method)
	at java.lang.Class.forName(Class.java:264)
	at com.carrotsearch.randomizedtesting.RandomizedRunner$1.run(RandomizedRunner.java:486)


FAILED:  org.apache.solr.core.IndexReaderFactoryTest.org.apache.solr.core.IndexReaderFactoryTest

Error Message:
Could not initialize class org.apache.solr.util.AbstractSolrTestCase

Stack Trace:
java.lang.NoClassDefFoundError: Could not initialize class org.apache.solr.util.AbstractSolrTestCase
	at java.lang.Class.forName0(Native Method)
	at java.lang.Class.forName(Class.java:264)
	at com.carrotsearch.randomizedtesting.RandomizedRunner$1.run(RandomizedRunner.java:486)


FAILED:  org.apache.solr.core.PluginInfoTest.testClassRequired

Error Message:
Could not initialize class org.apache.solr.util.AbstractSolrTestCase

Stack Trace:
java.lang.NoClassDefFoundError: Could not initialize class org.apache.solr.util.AbstractSolrTestCase
	at __randomizedtesting.SeedInfo.seed([464F687564E98F86:C60D47A2C2C5DEDA]:0)
	at org.apache.solr.core.PluginInfoTest.testClassRequired(PluginInfoTest.java:84)
	at sun.reflect.NativeMethodAccessorImpl.invoke0(Native Method)
	at sun.reflect.NativeMethodAccessorImpl.invoke(NativeMethodAccessorImpl.java:57)
	at sun.reflect.DelegatingMethodAccessorImpl.invoke(DelegatingMethodAccessorImpl.java:43)
	at java.lang.reflect.Method.invoke(Method.java:616)
	at com.carrotsearch.randomizedtesting.RandomizedRunner.invoke(RandomizedRunner.java:1559)
	at com.carrotsearch.randomizedtesting.RandomizedRunner.access$600(RandomizedRunner.java:79)
	at com.carrotsearch.randomizedtesting.RandomizedRunner$6.evaluate(RandomizedRunner.java:737)
	at com.carrotsearch.randomizedtesting.RandomizedRunner$7.evaluate(RandomizedRunner.java:773)
	at com.carrotsearch.randomizedtesting.RandomizedRunner$8.evaluate(RandomizedRunner.java:787)
	at org.apache.lucene.util.TestRuleSetupTeardownChained$1.evaluate(TestRuleSetupTeardownChained.java:50)
	at org.apache.lucene.util.TestRuleFieldCacheSanity$1.evaluate(TestRuleFieldCacheSanity.java:51)
	at org.apache.lucene.util.AbstractBeforeAfterRule$1.evaluate(AbstractBeforeAfterRule.java:45)
	at com.carrotsearch.randomizedtesting.rules.SystemPropertiesInvariantRule$1.evaluate(SystemPropertiesInvariantRule.java:55)
	at org.apache.lucene.util.TestRuleThreadAndTestName$1.evaluate(TestRuleThreadAndTestName.java:48)
	at org.apache.lucene.util.TestRuleIgnoreAfterMaxFailures$1.evaluate(TestRuleIgnoreAfterMaxFailures.java:70)
	at org.apache.lucene.util.TestRuleMarkFailure$1.evaluate(TestRuleMarkFailure.java:48)
	at com.carrotsearch.randomizedtesting.rules.StatementAdapter.evaluate(StatementAdapter.java:36)
	at com.carrotsearch.randomizedtesting.ThreadLeakControl$StatementRunner.run(ThreadLeakControl.java:358)
	at com.carrotsearch.randomizedtesting.ThreadLeakControl.forkTimeoutingTask(ThreadLeakControl.java:782)
	at com.carrotsearch.randomizedtesting.ThreadLeakControl$3.evaluate(ThreadLeakControl.java:442)
	at com.carrotsearch.randomizedtesting.RandomizedRunner.runSingleTest(RandomizedRunner.java:746)
	at com.carrotsearch.randomizedtesting.RandomizedRunner$3.evaluate(RandomizedRunner.java:648)
	at com.carrotsearch.randomizedtesting.RandomizedRunner$4.evaluate(RandomizedRunner.java:682)
	at com.carrotsearch.randomizedtesting.RandomizedRunner$5.evaluate(RandomizedRunner.java:693)
	at org.apache.lucene.util.AbstractBeforeAfterRule$1.evaluate(AbstractBeforeAfterRule.java:45)
	at org.apache.lucene.util.TestRuleStoreClassName$1.evaluate(TestRuleStoreClassName.java:42)
	at com.carrotsearch.randomizedtesting.rules.SystemPropertiesInvariantRule$1.evaluate(SystemPropertiesInvariantRule.java:55)
	at com.carrotsearch.randomizedtesting.rules.NoShadowingOrOverridesOnMethodsRule$1.evaluate(NoShadowingOrOverridesOnMethodsRule.java:39)
	at com.carrotsearch.randomizedtesting.rules.NoShadowingOrOverridesOnMethodsRule$1.evaluate(NoShadowingOrOverridesOnMethodsRule.java:39)
	at com.carrotsearch.randomizedtesting.rules.StatementAdapter.evaluate(StatementAdapter.java:36)
	at org.apache.lucene.util.TestRuleAssertionsRequired$1.evaluate(TestRuleAssertionsRequired.java:43)
	at org.apache.lucene.util.TestRuleMarkFailure$1.evaluate(TestRuleMarkFailure.java:48)
	at org.apache.lucene.util.TestRuleIgnoreAfterMaxFailures$1.evaluate(TestRuleIgnoreAfterMaxFailures.java:70)
	at org.apache.lucene.util.TestRuleIgnoreTestSuites$1.evaluate(TestRuleIgnoreTestSuites.java:55)
	at com.carrotsearch.randomizedtesting.rules.StatementAdapter.evaluate(StatementAdapter.java:36)
	at com.carrotsearch.randomizedtesting.ThreadLeakControl$StatementRunner.run(ThreadLeakControl.java:358)
	at java.lang.Thread.run(Thread.java:679)


FAILED:  org.apache.solr.core.PluginInfoTest.testNameRequired

Error Message:
Could not initialize class org.apache.solr.util.AbstractSolrTestCase

Stack Trace:
java.lang.NoClassDefFoundError: Could not initialize class org.apache.solr.util.AbstractSolrTestCase
	at __randomizedtesting.SeedInfo.seed([464F687564E98F86:5E163B9A8B781974]:0)
	at org.apache.solr.core.PluginInfoTest.testNameRequired(PluginInfoTest.java:67)
	at sun.reflect.NativeMethodAccessorImpl.invoke0(Native Method)
	at sun.reflect.NativeMethodAccessorImpl.invoke(NativeMethodAccessorImpl.java:57)
	at sun.reflect.DelegatingMethodAccessorImpl.invoke(DelegatingMethodAccessorImpl.java:43)
	at java.lang.reflect.Method.invoke(Method.java:616)
	at com.carrotsearch.randomizedtesting.RandomizedRunner.invoke(RandomizedRunner.java:1559)
	at com.carrotsearch.randomizedtesting.RandomizedRunner.access$600(RandomizedRunner.java:79)
	at com.carrotsearch.randomizedtesting.RandomizedRunner$6.evaluate(RandomizedRunner.java:737)
	at com.carrotsearch.randomizedtesting.RandomizedRunner$7.evaluate(RandomizedRunner.java:773)
	at com.carrotsearch.randomizedtesting.RandomizedRunner$8.evaluate(RandomizedRunner.java:787)
	at org.apache.lucene.util.TestRuleSetupTeardownChained$1.evaluate(TestRuleSetupTeardownChained.java:50)
	at org.apache.lucene.util.TestRuleFieldCacheSanity$1.evaluate(TestRuleFieldCacheSanity.java:51)
	at org.apache.lucene.util.AbstractBeforeAfterRule$1.evaluate(AbstractBeforeAfterRule.java:45)
	at com.carrotsearch.randomizedtesting.rules.SystemPropertiesInvariantRule$1.evaluate(SystemPropertiesInvariantRule.java:55)
	at org.apache.lucene.util.TestRuleThreadAndTestName$1.evaluate(TestRuleThreadAndTestName.java:48)
	at org.apache.lucene.util.TestRuleIgnoreAfterMaxFailures$1.evaluate(TestRuleIgnoreAfterMaxFailures.java:70)
	at org.apache.lucene.util.TestRuleMarkFailure$1.evaluate(TestRuleMarkFailure.java:48)
	at com.carrotsearch.randomizedtesting.rules.StatementAdapter.evaluate(StatementAdapter.java:36)
	at com.carrotsearch.randomizedtesting.ThreadLeakControl$StatementRunner.run(ThreadLeakControl.java:358)
	at com.carrotsearch.randomizedtesting.ThreadLeakControl.forkTimeoutingTask(ThreadLeakControl.java:782)
	at com.carrotsearch.randomizedtesting.ThreadLeakControl$3.evaluate(ThreadLeakControl.java:442)
	at com.carrotsearch.randomizedtesting.RandomizedRunner.runSingleTest(RandomizedRunner.java:746)
	at com.carrotsearch.randomizedtesting.RandomizedRunner$3.evaluate(RandomizedRunner.java:648)
	at com.carrotsearch.randomizedtesting.RandomizedRunner$4.evaluate(RandomizedRunner.java:682)
	at com.carrotsearch.randomizedtesting.RandomizedRunner$5.evaluate(RandomizedRunner.java:693)
	at org.apache.lucene.util.AbstractBeforeAfterRule$1.evaluate(AbstractBeforeAfterRule.java:45)
	at org.apache.lucene.util.TestRuleStoreClassName$1.evaluate(TestRuleStoreClassName.java:42)
	at com.carrotsearch.randomizedtesting.rules.SystemPropertiesInvariantRule$1.evaluate(SystemPropertiesInvariantRule.java:55)
	at com.carrotsearch.randomizedtesting.rules.NoShadowingOrOverridesOnMethodsRule$1.evaluate(NoShadowingOrOverridesOnMethodsRule.java:39)
	at com.carrotsearch.randomizedtesting.rules.NoShadowingOrOverridesOnMethodsRule$1.evaluate(NoShadowingOrOverridesOnMethodsRule.java:39)
	at com.carrotsearch.randomizedtesting.rules.StatementAdapter.evaluate(StatementAdapter.java:36)
	at org.apache.lucene.util.TestRuleAssertionsRequired$1.evaluate(TestRuleAssertionsRequired.java:43)
	at org.apache.lucene.util.TestRuleMarkFailure$1.evaluate(TestRuleMarkFailure.java:48)
	at org.apache.lucene.util.TestRuleIgnoreAfterMaxFailures$1.evaluate(TestRuleIgnoreAfterMaxFailures.java:70)
	at org.apache.lucene.util.TestRuleIgnoreTestSuites$1.evaluate(TestRuleIgnoreTestSuites.java:55)
	at com.carrotsearch.randomizedtesting.rules.StatementAdapter.evaluate(StatementAdapter.java:36)
	at com.carrotsearch.randomizedtesting.ThreadLeakControl$StatementRunner.run(ThreadLeakControl.java:358)
	at java.lang.Thread.run(Thread.java:679)


FAILED:  org.apache.solr.core.RAMDirectoryFactoryTest.test

Error Message:
Could not initialize class org.apache.log4j.Log4jLoggerFactory

Stack Trace:
java.lang.NoClassDefFoundError: Could not initialize class org.apache.log4j.Log4jLoggerFactory
	at __randomizedtesting.SeedInfo.seed([4EE8A31F47BF8303:C6BC9CC5E943EEFB]:0)
	at org.apache.log4j.LogManager.getLogger(LogManager.java:42)
	at org.slf4j.impl.Log4jLoggerFactory.getLogger(Log4jLoggerFactory.java:73)
	at org.slf4j.LoggerFactory.getLogger(LoggerFactory.java:253)
	at org.slf4j.LoggerFactory.getLogger(LoggerFactory.java:265)
	at org.apache.solr.core.CachingDirectoryFactory.<clinit>(CachingDirectoryFactory.java:55)
	at org.apache.solr.core.RAMDirectoryFactoryTest.dotestOpenReturnsTheSameForSamePath(RAMDirectoryFactoryTest.java:38)
	at org.apache.solr.core.RAMDirectoryFactoryTest.test(RAMDirectoryFactoryTest.java:32)
	at sun.reflect.NativeMethodAccessorImpl.invoke0(Native Method)
	at sun.reflect.NativeMethodAccessorImpl.invoke(NativeMethodAccessorImpl.java:57)
	at sun.reflect.DelegatingMethodAccessorImpl.invoke(DelegatingMethodAccessorImpl.java:43)
	at java.lang.reflect.Method.invoke(Method.java:616)
	at com.carrotsearch.randomizedtesting.RandomizedRunner.invoke(RandomizedRunner.java:1559)
	at com.carrotsearch.randomizedtesting.RandomizedRunner.access$600(RandomizedRunner.java:79)
	at com.carrotsearch.randomizedtesting.RandomizedRunner$6.evaluate(RandomizedRunner.java:737)
	at com.carrotsearch.randomizedtesting.RandomizedRunner$7.evaluate(RandomizedRunner.java:773)
	at com.carrotsearch.randomizedtesting.RandomizedRunner$8.evaluate(RandomizedRunner.java:787)
	at org.apache.lucene.util.TestRuleSetupTeardownChained$1.evaluate(TestRuleSetupTeardownChained.java:50)
	at org.apache.lucene.util.TestRuleFieldCacheSanity$1.evaluate(TestRuleFieldCacheSanity.java:51)
	at org.apache.lucene.util.AbstractBeforeAfterRule$1.evaluate(AbstractBeforeAfterRule.java:45)
	at com.carrotsearch.randomizedtesting.rules.SystemPropertiesInvariantRule$1.evaluate(SystemPropertiesInvariantRule.java:55)
	at org.apache.lucene.util.TestRuleThreadAndTestName$1.evaluate(TestRuleThreadAndTestName.java:48)
	at org.apache.lucene.util.TestRuleIgnoreAfterMaxFailures$1.evaluate(TestRuleIgnoreAfterMaxFailures.java:70)
	at org.apache.lucene.util.TestRuleMarkFailure$1.evaluate(TestRuleMarkFailure.java:48)
	at com.carrotsearch.randomizedtesting.rules.StatementAdapter.evaluate(StatementAdapter.java:36)
	at com.carrotsearch.randomizedtesting.ThreadLeakControl$StatementRunner.run(ThreadLeakControl.java:358)
	at com.carrotsearch.randomizedtesting.ThreadLeakControl.forkTimeoutingTask(ThreadLeakControl.java:782)
	at com.carrotsearch.randomizedtesting.ThreadLeakControl$3.evaluate(ThreadLeakControl.java:442)
	at com.carrotsearch.randomizedtesting.RandomizedRunner.runSingleTest(RandomizedRunner.java:746)
	at com.carrotsearch.randomizedtesting.RandomizedRunner$3.evaluate(RandomizedRunner.java:648)
	at com.carrotsearch.randomizedtesting.RandomizedRunner$4.evaluate(RandomizedRunner.java:682)
	at com.carrotsearch.randomizedtesting.RandomizedRunner$5.evaluate(RandomizedRunner.java:693)
	at org.apache.lucene.util.AbstractBeforeAfterRule$1.evaluate(AbstractBeforeAfterRule.java:45)
	at org.apache.lucene.util.TestRuleStoreClassName$1.evaluate(TestRuleStoreClassName.java:42)
	at com.carrotsearch.randomizedtesting.rules.SystemPropertiesInvariantRule$1.evaluate(SystemPropertiesInvariantRule.java:55)
	at com.carrotsearch.randomizedtesting.rules.NoShadowingOrOverridesOnMethodsRule$1.evaluate(NoShadowingOrOverridesOnMethodsRule.java:39)
	at com.carrotsearch.randomizedtesting.rules.NoShadowingOrOverridesOnMethodsRule$1.evaluate(NoShadowingOrOverridesOnMethodsRule.java:39)
	at com.carrotsearch.randomizedtesting.rules.StatementAdapter.evaluate(StatementAdapter.java:36)
	at org.apache.lucene.util.TestRuleAssertionsRequired$1.evaluate(TestRuleAssertionsRequired.java:43)
	at org.apache.lucene.util.TestRuleMarkFailure$1.evaluate(TestRuleMarkFailure.java:48)
	at org.apache.lucene.util.TestRuleIgnoreAfterMaxFailures$1.evaluate(TestRuleIgnoreAfterMaxFailures.java:70)
	at org.apache.lucene.util.TestRuleIgnoreTestSuites$1.evaluate(TestRuleIgnoreTestSuites.java:55)
	at com.carrotsearch.randomizedtesting.rules.StatementAdapter.evaluate(StatementAdapter.java:36)
	at com.carrotsearch.randomizedtesting.ThreadLeakControl$StatementRunner.run(ThreadLeakControl.java:358)
	at java.lang.Thread.run(Thread.java:679)


FAILED:  org.apache.solr.core.RequestHandlersTest.org.apache.solr.core.RequestHandlersTest

Error Message:
Could not initialize class org.apache.solr.SolrTestCaseJ4

Stack Trace:
java.lang.NoClassDefFoundError: Could not initialize class org.apache.solr.SolrTestCaseJ4
	at java.lang.Class.forName0(Native Method)
	at java.lang.Class.forName(Class.java:264)
	at com.carrotsearch.randomizedtesting.RandomizedRunner$1.run(RandomizedRunner.java:486)


FAILED:  org.apache.solr.core.ResourceLoaderTest.testBOMMarkers

Error Message:
Could not initialize class org.apache.solr.core.SolrResourceLoader

Stack Trace:
java.lang.NoClassDefFoundError: Could not initialize class org.apache.solr.core.SolrResourceLoader
	at __randomizedtesting.SeedInfo.seed([77791E09575D922C:D9B9F7F4804C1B8D]:0)
	at org.apache.solr.core.ResourceLoaderTest.testBOMMarkers(ResourceLoaderTest.java:103)
	at sun.reflect.NativeMethodAccessorImpl.invoke0(Native Method)
	at sun.reflect.NativeMethodAccessorImpl.invoke(NativeMethodAccessorImpl.java:57)
	at sun.reflect.DelegatingMethodAccessorImpl.invoke(DelegatingMethodAccessorImpl.java:43)
	at java.lang.reflect.Method.invoke(Method.java:616)
	at com.carrotsearch.randomizedtesting.RandomizedRunner.invoke(RandomizedRunner.java:1559)
	at com.carrotsearch.randomizedtesting.RandomizedRunner.access$600(RandomizedRunner.java:79)
	at com.carrotsearch.randomizedtesting.RandomizedRunner$6.evaluate(RandomizedRunner.java:737)
	at com.carrotsearch.randomizedtesting.RandomizedRunner$7.evaluate(RandomizedRunner.java:773)
	at com.carrotsearch.randomizedtesting.RandomizedRunner$8.evaluate(RandomizedRunner.java:787)
	at org.apache.lucene.util.TestRuleSetupTeardownChained$1.evaluate(TestRuleSetupTeardownChained.java:50)
	at org.apache.lucene.util.TestRuleFieldCacheSanity$1.evaluate(TestRuleFieldCacheSanity.java:51)
	at org.apache.lucene.util.AbstractBeforeAfterRule$1.evaluate(AbstractBeforeAfterRule.java:45)
	at com.carrotsearch.randomizedtesting.rules.SystemPropertiesInvariantRule$1.evaluate(SystemPropertiesInvariantRule.java:55)
	at org.apache.lucene.util.TestRuleThreadAndTestName$1.evaluate(TestRuleThreadAndTestName.java:48)
	at org.apache.lucene.util.TestRuleIgnoreAfterMaxFailures$1.evaluate(TestRuleIgnoreAfterMaxFailures.java:70)
	at org.apache.lucene.util.TestRuleMarkFailure$1.evaluate(TestRuleMarkFailure.java:48)
	at com.carrotsearch.randomizedtesting.rules.StatementAdapter.evaluate(StatementAdapter.java:36)
	at com.carrotsearch.randomizedtesting.ThreadLeakControl$StatementRunner.run(ThreadLeakControl.java:358)
	at com.carrotsearch.randomizedtesting.ThreadLeakControl.forkTimeoutingTask(ThreadLeakControl.java:782)
	at com.carrotsearch.randomizedtesting.ThreadLeakControl$3.evaluate(ThreadLeakControl.java:442)
	at com.carrotsearch.randomizedtesting.RandomizedRunner.runSingleTest(RandomizedRunner.java:746)
	at com.carrotsearch.randomizedtesting.RandomizedRunner$3.evaluate(RandomizedRunner.java:648)
	at com.carrotsearch.randomizedtesting.RandomizedRunner$4.evaluate(RandomizedRunner.java:682)
	at com.carrotsearch.randomizedtesting.RandomizedRunner$5.evaluate(RandomizedRunner.java:693)
	at org.apache.lucene.util.AbstractBeforeAfterRule$1.evaluate(AbstractBeforeAfterRule.java:45)
	at org.apache.lucene.util.TestRuleStoreClassName$1.evaluate(TestRuleStoreClassName.java:42)
	at com.carrotsearch.randomizedtesting.rules.SystemPropertiesInvariantRule$1.evaluate(SystemPropertiesInvariantRule.java:55)
	at com.carrotsearch.randomizedtesting.rules.NoShadowingOrOverridesOnMethodsRule$1.evaluate(NoShadowingOrOverridesOnMethodsRule.java:39)
	at com.carrotsearch.randomizedtesting.rules.NoShadowingOrOverridesOnMethodsRule$1.evaluate(NoShadowingOrOverridesOnMethodsRule.java:39)
	at com.carrotsearch.randomizedtesting.rules.StatementAdapter.evaluate(StatementAdapter.java:36)
	at org.apache.lucene.util.TestRuleAssertionsRequired$1.evaluate(TestRuleAssertionsRequired.java:43)
	at org.apache.lucene.util.TestRuleMarkFailure$1.evaluate(TestRuleMarkFailure.java:48)
	at org.apache.lucene.util.TestRuleIgnoreAfterMaxFailures$1.evaluate(TestRuleIgnoreAfterMaxFailures.java:70)
	at org.apache.lucene.util.TestRuleIgnoreTestSuites$1.evaluate(TestRuleIgnoreTestSuites.java:55)
	at com.carrotsearch.randomizedtesting.rules.StatementAdapter.evaluate(StatementAdapter.java:36)
	at com.carrotsearch.randomizedtesting.ThreadLeakControl$StatementRunner.run(ThreadLeakControl.java:358)
	at java.lang.Thread.run(Thread.java:679)


FAILED:  org.apache.solr.core.ResourceLoaderTest.testWrongEncoding

Error Message:
Could not initialize class org.apache.solr.core.SolrResourceLoader

Stack Trace:
java.lang.NoClassDefFoundError: Could not initialize class org.apache.solr.core.SolrResourceLoader
	at __randomizedtesting.SeedInfo.seed([77791E09575D922C:DF1832906447AD73]:0)
	at org.apache.solr.core.ResourceLoaderTest.testWrongEncoding(ResourceLoaderTest.java:129)
	at sun.reflect.NativeMethodAccessorImpl.invoke0(Native Method)
	at sun.reflect.NativeMethodAccessorImpl.invoke(NativeMethodAccessorImpl.java:57)
	at sun.reflect.DelegatingMethodAccessorImpl.invoke(DelegatingMethodAccessorImpl.java:43)
	at java.lang.reflect.Method.invoke(Method.java:616)
	at com.carrotsearch.randomizedtesting.RandomizedRunner.invoke(RandomizedRunner.java:1559)
	at com.carrotsearch.randomizedtesting.RandomizedRunner.access$600(RandomizedRunner.java:79)
	at com.carrotsearch.randomizedtesting.RandomizedRunner$6.evaluate(RandomizedRunner.java:737)
	at com.carrotsearch.randomizedtesting.RandomizedRunner$7.evaluate(RandomizedRunner.java:773)
	at com.carrotsearch.randomizedtesting.RandomizedRunner$8.evaluate(RandomizedRunner.java:787)
	at org.apache.lucene.util.TestRuleSetupTeardownChained$1.evaluate(TestRuleSetupTeardownChained.java:50)
	at org.apache.lucene.util.TestRuleFieldCacheSanity$1.evaluate(TestRuleFieldCacheSanity.java:51)
	at org.apache.lucene.util.AbstractBeforeAfterRule$1.evaluate(AbstractBeforeAfterRule.java:45)
	at com.carrotsearch.randomizedtesting.rules.SystemPropertiesInvariantRule$1.evaluate(SystemPropertiesInvariantRule.java:55)
	at org.apache.lucene.util.TestRuleThreadAndTestName$1.evaluate(TestRuleThreadAndTestName.java:48)
	at org.apache.lucene.util.TestRuleIgnoreAfterMaxFailures$1.evaluate(TestRuleIgnoreAfterMaxFailures.java:70)
	at org.apache.lucene.util.TestRuleMarkFailure$1.evaluate(TestRuleMarkFailure.java:48)
	at com.carrotsearch.randomizedtesting.rules.StatementAdapter.evaluate(StatementAdapter.java:36)
	at com.carrotsearch.randomizedtesting.ThreadLeakControl$StatementRunner.run(ThreadLeakControl.java:358)
	at com.carrotsearch.randomizedtesting.ThreadLeakControl.forkTimeoutingTask(ThreadLeakControl.java:782)
	at com.carrotsearch.randomizedtesting.ThreadLeakControl$3.evaluate(ThreadLeakControl.java:442)
	at com.carrotsearch.randomizedtesting.RandomizedRunner.runSingleTest(RandomizedRunner.java:746)
	at com.carrotsearch.randomizedtesting.RandomizedRunner$3.evaluate(RandomizedRunner.java:648)
	at com.carrotsearch.randomizedtesting.RandomizedRunner$4.evaluate(RandomizedRunner.java:682)
	at com.carrotsearch.randomizedtesting.RandomizedRunner$5.evaluate(RandomizedRunner.java:693)
	at org.apache.lucene.util.AbstractBeforeAfterRule$1.evaluate(AbstractBeforeAfterRule.java:45)
	at org.apache.lucene.util.TestRuleStoreClassName$1.evaluate(TestRuleStoreClassName.java:42)
	at com.carrotsearch.randomizedtesting.rules.SystemPropertiesInvariantRule$1.evaluate(SystemPropertiesInvariantRule.java:55)
	at com.carrotsearch.randomizedtesting.rules.NoShadowingOrOverridesOnMethodsRule$1.evaluate(NoShadowingOrOverridesOnMethodsRule.java:39)
	at com.carrotsearch.randomizedtesting.rules.NoShadowingOrOverridesOnMethodsRule$1.evaluate(NoShadowingOrOverridesOnMethodsRule.java:39)
	at com.carrotsearch.randomizedtesting.rules.StatementAdapter.evaluate(StatementAdapter.java:36)
	at org.apache.lucene.util.TestRuleAssertionsRequired$1.evaluate(TestRuleAssertionsRequired.java:43)
	at org.apache.lucene.util.TestRuleMarkFailure$1.evaluate(TestRuleMarkFailure.java:48)
	at org.apache.lucene.util.TestRuleIgnoreAfterMaxFailures$1.evaluate(TestRuleIgnoreAfterMaxFailures.java:70)
	at org.apache.lucene.util.TestRuleIgnoreTestSuites$1.evaluate(TestRuleIgnoreTestSuites.java:55)
	at com.carrotsearch.randomizedtesting.rules.StatementAdapter.evaluate(StatementAdapter.java:36)
	at com.carrotsearch.randomizedtesting.ThreadLeakControl$StatementRunner.run(ThreadLeakControl.java:358)
	at java.lang.Thread.run(Thread.java:679)


FAILED:  org.apache.solr.core.ResourceLoaderTest.testInstanceDir

Error Message:
Could not initialize class org.apache.solr.core.SolrResourceLoader

Stack Trace:
java.lang.NoClassDefFoundError: Could not initialize class org.apache.solr.core.SolrResourceLoader
	at __randomizedtesting.SeedInfo.seed([77791E09575D922C:D31800CAF424CAB5]:0)
	at org.apache.solr.core.ResourceLoaderTest.testInstanceDir(ResourceLoaderTest.java:46)
	at sun.reflect.NativeMethodAccessorImpl.invoke0(Native Method)
	at sun.reflect.NativeMethodAccessorImpl.invoke(NativeMethodAccessorImpl.java:57)
	at sun.reflect.DelegatingMethodAccessorImpl.invoke(DelegatingMethodAccessorImpl.java:43)
	at java.lang.reflect.Method.invoke(Method.java:616)
	at com.carrotsearch.randomizedtesting.RandomizedRunner.invoke(RandomizedRunner.java:1559)
	at com.carrotsearch.randomizedtesting.RandomizedRunner.access$600(RandomizedRunner.java:79)
	at com.carrotsearch.randomizedtesting.RandomizedRunner$6.evaluate(RandomizedRunner.java:737)
	at com.carrotsearch.randomizedtesting.RandomizedRunner$7.evaluate(RandomizedRunner.java:773)
	at com.carrotsearch.randomizedtesting.RandomizedRunner$8.evaluate(RandomizedRunner.java:787)
	at org.apache.lucene.util.TestRuleSetupTeardownChained$1.evaluate(TestRuleSetupTeardownChained.java:50)
	at org.apache.lucene.util.TestRuleFieldCacheSanity$1.evaluate(TestRuleFieldCacheSanity.java:51)
	at org.apache.lucene.util.AbstractBeforeAfterRule$1.evaluate(AbstractBeforeAfterRule.java:45)
	at com.carrotsearch.randomizedtesting.rules.SystemPropertiesInvariantRule$1.evaluate(SystemPropertiesInvariantRule.java:55)
	at org.apache.lucene.util.TestRuleThreadAndTestName$1.evaluate(TestRuleThreadAndTestName.java:48)
	at org.apache.lucene.util.TestRuleIgnoreAfterMaxFailures$1.evaluate(TestRuleIgnoreAfterMaxFailures.java:70)
	at org.apache.lucene.util.TestRuleMarkFailure$1.evaluate(TestRuleMarkFailure.java:48)
	at com.carrotsearch.randomizedtesting.rules.StatementAdapter.evaluate(StatementAdapter.java:36)
	at com.carrotsearch.randomizedtesting.ThreadLeakControl$StatementRunner.run(ThreadLeakControl.java:358)
	at com.carrotsearch.randomizedtesting.ThreadLeakControl.forkTimeoutingTask(ThreadLeakControl.java:782)
	at com.carrotsearch.randomizedtesting.ThreadLeakControl$3.evaluate(ThreadLeakControl.java:442)
	at com.carrotsearch.randomizedtesting.RandomizedRunner.runSingleTest(RandomizedRunner.java:746)
	at com.carrotsearch.randomizedtesting.RandomizedRunner$3.evaluate(RandomizedRunner.java:648)
	at com.carrotsearch.randomizedtesting.RandomizedRunner$4.evaluate(RandomizedRunner.java:682)
	at com.carrotsearch.randomizedtesting.RandomizedRunner$5.evaluate(RandomizedRunner.java:693)
	at org.apache.lucene.util.AbstractBeforeAfterRule$1.evaluate(AbstractBeforeAfterRule.java:45)
	at org.apache.lucene.util.TestRuleStoreClassName$1.evaluate(TestRuleStoreClassName.java:42)
	at com.carrotsearch.randomizedtesting.rules.SystemPropertiesInvariantRule$1.evaluate(SystemPropertiesInvariantRule.java:55)
	at com.carrotsearch.randomizedtesting.rules.NoShadowingOrOverridesOnMethodsRule$1.evaluate(NoShadowingOrOverridesOnMethodsRule.java:39)
	at com.carrotsearch.randomizedtesting.rules.NoShadowingOrOverridesOnMethodsRule$1.evaluate(NoShadowingOrOverridesOnMethodsRule.java:39)
	at com.carrotsearch.randomizedtesting.rules.StatementAdapter.evaluate(StatementAdapter.java:36)
	at org.apache.lucene.util.TestRuleAssertionsRequired$1.evaluate(TestRuleAssertionsRequired.java:43)
	at org.apache.lucene.util.TestRuleMarkFailure$1.evaluate(TestRuleMarkFailure.java:48)
	at org.apache.lucene.util.TestRuleIgnoreAfterMaxFailures$1.evaluate(TestRuleIgnoreAfterMaxFailures.java:70)
	at org.apache.lucene.util.TestRuleIgnoreTestSuites$1.evaluate(TestRuleIgnoreTestSuites.java:55)
	at com.carrotsearch.randomizedtesting.rules.StatementAdapter.evaluate(StatementAdapter.java:36)
	at com.carrotsearch.randomizedtesting.ThreadLeakControl$StatementRunner.run(ThreadLeakControl.java:358)
	at java.lang.Thread.run(Thread.java:679)


FAILED:  org.apache.solr.core.ResourceLoaderTest.testAwareCompatibility

Error Message:
Could not initialize class org.apache.solr.core.SolrResourceLoader

Stack Trace:
java.lang.NoClassDefFoundError: Could not initialize class org.apache.solr.core.SolrResourceLoader
	at __randomizedtesting.SeedInfo.seed([77791E09575D922C:35195C792E717B79]:0)
	at org.apache.solr.core.ResourceLoaderTest.testAwareCompatibility(ResourceLoaderTest.java:57)
	at sun.reflect.NativeMethodAccessorImpl.invoke0(Native Method)
	at sun.reflect.NativeMethodAccessorImpl.invoke(NativeMethodAccessorImpl.java:57)
	at sun.reflect.DelegatingMethodAccessorImpl.invoke(DelegatingMethodAccessorImpl.java:43)
	at java.lang.reflect.Method.invoke(Method.java:616)
	at com.carrotsearch.randomizedtesting.RandomizedRunner.invoke(RandomizedRunner.java:1559)
	at com.carrotsearch.randomizedtesting.RandomizedRunner.access$600(RandomizedRunner.java:79)
	at com.carrotsearch.randomizedtesting.RandomizedRunner$6.evaluate(RandomizedRunner.java:737)
	at com.carrotsearch.randomizedtesting.RandomizedRunner$7.evaluate(RandomizedRunner.java:773)
	at com.carrotsearch.randomizedtesting.RandomizedRunner$8.evaluate(RandomizedRunner.java:787)
	at org.apache.lucene.util.TestRuleSetupTeardownChained$1.evaluate(TestRuleSetupTeardownChained.java:50)
	at org.apache.lucene.util.TestRuleFieldCacheSanity$1.evaluate(TestRuleFieldCacheSanity.java:51)
	at org.apache.lucene.util.AbstractBeforeAfterRule$1.evaluate(AbstractBeforeAfterRule.java:45)
	at com.carrotsearch.randomizedtesting.rules.SystemPropertiesInvariantRule$1.evaluate(SystemPropertiesInvariantRule.java:55)
	at org.apache.lucene.util.TestRuleThreadAndTestName$1.evaluate(TestRuleThreadAndTestName.java:48)
	at org.apache.lucene.util.TestRuleIgnoreAfterMaxFailures$1.evaluate(TestRuleIgnoreAfterMaxFailures.java:70)
	at org.apache.lucene.util.TestRuleMarkFailure$1.evaluate(TestRuleMarkFailure.java:48)
	at com.carrotsearch.randomizedtesting.rules.StatementAdapter.evaluate(StatementAdapter.java:36)
	at com.carrotsearch.randomizedtesting.ThreadLeakControl$StatementRunner.run(ThreadLeakControl.java:358)
	at com.carrotsearch.randomizedtesting.ThreadLeakControl.forkTimeoutingTask(ThreadLeakControl.java:782)
	at com.carrotsearch.randomizedtesting.ThreadLeakControl$3.evaluate(ThreadLeakControl.java:442)
	at com.carrotsearch.randomizedtesting.RandomizedRunner.runSingleTest(RandomizedRunner.java:746)
	at com.carrotsearch.randomizedtesting.RandomizedRunner$3.evaluate(RandomizedRunner.java:648)
	at com.carrotsearch.randomizedtesting.RandomizedRunner$4.evaluate(RandomizedRunner.java:682)
	at com.carrotsearch.randomizedtesting.RandomizedRunner$5.evaluate(RandomizedRunner.java:693)
	at org.apache.lucene.util.AbstractBeforeAfterRule$1.evaluate(AbstractBeforeAfterRule.java:45)
	at org.apache.lucene.util.TestRuleStoreClassName$1.evaluate(TestRuleStoreClassName.java:42)
	at com.carrotsearch.randomizedtesting.rules.SystemPropertiesInvariantRule$1.evaluate(SystemPropertiesInvariantRule.java:55)
	at com.carrotsearch.randomizedtesting.rules.NoShadowingOrOverridesOnMethodsRule$1.evaluate(NoShadowingOrOverridesOnMethodsRule.java:39)
	at com.carrotsearch.randomizedtesting.rules.NoShadowingOrOverridesOnMethodsRule$1.evaluate(NoShadowingOrOverridesOnMethodsRule.java:39)
	at com.carrotsearch.randomizedtesting.rules.StatementAdapter.evaluate(StatementAdapter.java:36)
	at org.apache.lucene.util.TestRuleAssertionsRequired$1.evaluate(TestRuleAssertionsRequired.java:43)
	at org.apache.lucene.util.TestRuleMarkFailure$1.evaluate(TestRuleMarkFailure.java:48)
	at org.apache.lucene.util.TestRuleIgnoreAfterMaxFailures$1.evaluate(TestRuleIgnoreAfterMaxFailures.java:70)
	at org.apache.lucene.util.TestRuleIgnoreTestSuites$1.evaluate(TestRuleIgnoreTestSuites.java:55)
	at com.carrotsearch.randomizedtesting.rules.StatementAdapter.evaluate(StatementAdapter.java:36)
	at com.carrotsearch.randomizedtesting.ThreadLeakControl$StatementRunner.run(ThreadLeakControl.java:358)
	at java.lang.Thread.run(Thread.java:679)


FAILED:  org.apache.solr.core.SOLR749Test.org.apache.solr.core.SOLR749Test

Error Message:
Could not initialize class org.apache.solr.SolrTestCaseJ4

Stack Trace:
java.lang.NoClassDefFoundError: Could not initialize class org.apache.solr.SolrTestCaseJ4
	at java.lang.Class.forName0(Native Method)
	at java.lang.Class.forName(Class.java:264)
	at com.carrotsearch.randomizedtesting.RandomizedRunner$1.run(RandomizedRunner.java:486)


FAILED:  org.apache.solr.core.SolrCoreCheckLockOnStartupTest.org.apache.solr.core.SolrCoreCheckLockOnStartupTest

Error Message:
Could not initialize class org.apache.solr.SolrTestCaseJ4

Stack Trace:
java.lang.NoClassDefFoundError: Could not initialize class org.apache.solr.SolrTestCaseJ4
	at java.lang.Class.forName0(Native Method)
	at java.lang.Class.forName(Class.java:264)
	at com.carrotsearch.randomizedtesting.RandomizedRunner$1.run(RandomizedRunner.java:486)


FAILED:  org.apache.solr.core.SolrCoreTest.org.apache.solr.core.SolrCoreTest

Error Message:
Could not initialize class org.apache.solr.SolrTestCaseJ4

Stack Trace:
java.lang.NoClassDefFoundError: Could not initialize class org.apache.solr.SolrTestCaseJ4
	at java.lang.Class.forName0(Native Method)
	at java.lang.Class.forName(Class.java:264)
	at com.carrotsearch.randomizedtesting.RandomizedRunner$1.run(RandomizedRunner.java:486)


FAILED:  org.apache.solr.core.TestArbitraryIndexDir.org.apache.solr.core.TestArbitraryIndexDir

Error Message:
Could not initialize class org.apache.solr.util.AbstractSolrTestCase

Stack Trace:
java.lang.NoClassDefFoundError: Could not initialize class org.apache.solr.util.AbstractSolrTestCase
	at java.lang.Class.forName0(Native Method)
	at java.lang.Class.forName(Class.java:264)
	at com.carrotsearch.randomizedtesting.RandomizedRunner$1.run(RandomizedRunner.java:486)


FAILED:  org.apache.solr.core.TestBadConfig.org.apache.solr.core.TestBadConfig

Error Message:
Could not initialize class org.apache.solr.SolrTestCaseJ4

Stack Trace:
java.lang.NoClassDefFoundError: Could not initialize class org.apache.solr.SolrTestCaseJ4
	at java.lang.Class.forName0(Native Method)
	at java.lang.Class.forName(Class.java:264)
	at com.carrotsearch.randomizedtesting.RandomizedRunner$1.run(RandomizedRunner.java:486)


FAILED:  org.apache.solr.core.TestCodecSupport.org.apache.solr.core.TestCodecSupport

Error Message:
Could not initialize class org.apache.solr.SolrTestCaseJ4

Stack Trace:
java.lang.NoClassDefFoundError: Could not initialize class org.apache.solr.SolrTestCaseJ4
	at java.lang.Class.forName0(Native Method)
	at java.lang.Class.forName(Class.java:264)
	at com.carrotsearch.randomizedtesting.RandomizedRunner$1.run(RandomizedRunner.java:486)


FAILED:  org.apache.solr.core.TestConfig.org.apache.solr.core.TestConfig

Error Message:
Could not initialize class org.apache.solr.SolrTestCaseJ4

Stack Trace:
java.lang.NoClassDefFoundError: Could not initialize class org.apache.solr.SolrTestCaseJ4
	at java.lang.Class.forName0(Native Method)
	at java.lang.Class.forName(Class.java:264)
	at com.carrotsearch.randomizedtesting.RandomizedRunner$1.run(RandomizedRunner.java:486)


FAILED:  org.apache.solr.core.TestCoreContainer.org.apache.solr.core.TestCoreContainer

Error Message:
Could not initialize class org.apache.solr.SolrTestCaseJ4

Stack Trace:
java.lang.NoClassDefFoundError: Could not initialize class org.apache.solr.SolrTestCaseJ4
	at java.lang.Class.forName0(Native Method)
	at java.lang.Class.forName(Class.java:264)
	at com.carrotsearch.randomizedtesting.RandomizedRunner$1.run(RandomizedRunner.java:486)


FAILED:  org.apache.solr.core.TestJmxIntegration.org.apache.solr.core.TestJmxIntegration

Error Message:
Could not initialize class org.apache.solr.util.AbstractSolrTestCase

Stack Trace:
java.lang.NoClassDefFoundError: Could not initialize class org.apache.solr.util.AbstractSolrTestCase
	at java.lang.Class.forName0(Native Method)
	at java.lang.Class.forName(Class.java:264)
	at com.carrotsearch.randomizedtesting.RandomizedRunner$1.run(RandomizedRunner.java:486)


FAILED:  org.apache.solr.core.TestJmxMonitoredMap.testPutRemoveClear

Error Message:
Could not initialize class org.apache.solr.util.AbstractSolrTestCase

Stack Trace:
java.lang.NoClassDefFoundError: Could not initialize class org.apache.solr.util.AbstractSolrTestCase
	at __randomizedtesting.SeedInfo.seed([AE3AAF1A8EF621B4:3BC7346743255217]:0)
	at org.apache.solr.core.TestJmxMonitoredMap.setUp(TestJmxMonitoredMap.java:83)
	at sun.reflect.NativeMethodAccessorImpl.invoke0(Native Method)
	at sun.reflect.NativeMethodAccessorImpl.invoke(NativeMethodAccessorImpl.java:57)
	at sun.reflect.DelegatingMethodAccessorImpl.invoke(DelegatingMethodAccessorImpl.java:43)
	at java.lang.reflect.Method.invoke(Method.java:616)
	at com.carrotsearch.randomizedtesting.RandomizedRunner.invoke(RandomizedRunner.java:1559)
	at com.carrotsearch.randomizedtesting.RandomizedRunner.access$600(RandomizedRunner.java:79)
	at com.carrotsearch.randomizedtesting.RandomizedRunner$7.evaluate(RandomizedRunner.java:771)
	at com.carrotsearch.randomizedtesting.RandomizedRunner$8.evaluate(RandomizedRunner.java:787)
	at org.apache.lucene.util.TestRuleSetupTeardownChained$1.evaluate(TestRuleSetupTeardownChained.java:50)
	at org.apache.lucene.util.TestRuleFieldCacheSanity$1.evaluate(TestRuleFieldCacheSanity.java:51)
	at org.apache.lucene.util.AbstractBeforeAfterRule$1.evaluate(AbstractBeforeAfterRule.java:45)
	at com.carrotsearch.randomizedtesting.rules.SystemPropertiesInvariantRule$1.evaluate(SystemPropertiesInvariantRule.java:55)
	at org.apache.lucene.util.TestRuleThreadAndTestName$1.evaluate(TestRuleThreadAndTestName.java:48)
	at org.apache.lucene.util.TestRuleIgnoreAfterMaxFailures$1.evaluate(TestRuleIgnoreAfterMaxFailures.java:70)
	at org.apache.lucene.util.TestRuleMarkFailure$1.evaluate(TestRuleMarkFailure.java:48)
	at com.carrotsearch.randomizedtesting.rules.StatementAdapter.evaluate(StatementAdapter.java:36)
	at com.carrotsearch.randomizedtesting.ThreadLeakControl$StatementRunner.run(ThreadLeakControl.java:358)
	at com.carrotsearch.randomizedtesting.ThreadLeakControl.forkTimeoutingTask(ThreadLeakControl.java:782)
	at com.carrotsearch.randomizedtesting.ThreadLeakControl$3.evaluate(ThreadLeakControl.java:442)
	at com.carrotsearch.randomizedtesting.RandomizedRunner.runSingleTest(RandomizedRunner.java:746)
	at com.carrotsearch.randomizedtesting.RandomizedRunner$3.evaluate(RandomizedRunner.java:648)
	at com.carrotsearch.randomizedtesting.RandomizedRunner$4.evaluate(RandomizedRunner.java:682)
	at com.carrotsearch.randomizedtesting.RandomizedRunner$5.evaluate(RandomizedRunner.java:693)
	at org.apache.lucene.util.AbstractBeforeAfterRule$1.evaluate(AbstractBeforeAfterRule.java:45)
	at org.apache.lucene.util.TestRuleStoreClassName$1.evaluate(TestRuleStoreClassName.java:42)
	at com.carrotsearch.randomizedtesting.rules.SystemPropertiesInvariantRule$1.evaluate(SystemPropertiesInvariantRule.java:55)
	at com.carrotsearch.randomizedtesting.rules.NoShadowingOrOverridesOnMethodsRule$1.evaluate(NoShadowingOrOverridesOnMethodsRule.java:39)
	at com.carrotsearch.randomizedtesting.rules.NoShadowingOrOverridesOnMethodsRule$1.evaluate(NoShadowingOrOverridesOnMethodsRule.java:39)
	at com.carrotsearch.randomizedtesting.rules.StatementAdapter.evaluate(StatementAdapter.java:36)
	at org.apache.lucene.util.TestRuleAssertionsRequired$1.evaluate(TestRuleAssertionsRequired.java:43)
	at org.apache.lucene.util.TestRuleMarkFailure$1.evaluate(TestRuleMarkFailure.java:48)
	at org.apache.lucene.util.TestRuleIgnoreAfterMaxFailures$1.evaluate(TestRuleIgnoreAfterMaxFailures.java:70)
	at org.apache.lucene.util.TestRuleIgnoreTestSuites$1.evaluate(TestRuleIgnoreTestSuites.java:55)
	at com.carrotsearch.randomizedtesting.rules.StatementAdapter.evaluate(StatementAdapter.java:36)
	at com.carrotsearch.randomizedtesting.ThreadLeakControl$StatementRunner.run(ThreadLeakControl.java:358)
	at java.lang.Thread.run(Thread.java:679)


FAILED:  org.apache.solr.core.TestJmxMonitoredMap.testTypeName

Error Message:
Could not initialize class org.apache.solr.util.AbstractSolrTestCase

Stack Trace:
java.lang.NoClassDefFoundError: Could not initialize class org.apache.solr.util.AbstractSolrTestCase
	at __randomizedtesting.SeedInfo.seed([AE3AAF1A8EF621B4:93509B21C55308F7]:0)
	at org.apache.solr.core.TestJmxMonitoredMap.setUp(TestJmxMonitoredMap.java:83)
	at sun.reflect.NativeMethodAccessorImpl.invoke0(Native Method)
	at sun.reflect.NativeMethodAccessorImpl.invoke(NativeMethodAccessorImpl.java:57)
	at sun.reflect.DelegatingMethodAccessorImpl.invoke(DelegatingMethodAccessorImpl.java:43)
	at java.lang.reflect.Method.invoke(Method.java:616)
	at com.carrotsearch.randomizedtesting.RandomizedRunner.invoke(RandomizedRunner.java:1559)
	at com.carrotsearch.randomizedtesting.RandomizedRunner.access$600(RandomizedRunner.java:79)
	at com.carrotsearch.randomizedtesting.RandomizedRunner$7.evaluate(RandomizedRunner.java:771)
	at com.carrotsearch.randomizedtesting.RandomizedRunner$8.evaluate(RandomizedRunner.java:787)
	at org.apache.lucene.util.TestRuleSetupTeardownChained$1.evaluate(TestRuleSetupTeardownChained.java:50)
	at org.apache.lucene.util.TestRuleFieldCacheSanity$1.evaluate(TestRuleFieldCacheSanity.java:51)
	at org.apache.lucene.util.AbstractBeforeAfterRule$1.evaluate(AbstractBeforeAfterRule.java:45)
	at com.carrotsearch.randomizedtesting.rules.SystemPropertiesInvariantRule$1.evaluate(SystemPropertiesInvariantRule.java:55)
	at org.apache.lucene.util.TestRuleThreadAndTestName$1.evaluate(TestRuleThreadAndTestName.java:48)
	at org.apache.lucene.util.TestRuleIgnoreAfterMaxFailures$1.evaluate(TestRuleIgnoreAfterMaxFailures.java:70)
	at org.apache.lucene.util.TestRuleMarkFailure$1.evaluate(TestRuleMarkFailure.java:48)
	at com.carrotsearch.randomizedtesting.rules.StatementAdapter.evaluate(StatementAdapter.java:36)
	at com.carrotsearch.randomizedtesting.ThreadLeakControl$StatementRunner.run(ThreadLeakControl.java:358)
	at com.carrotsearch.randomizedtesting.ThreadLeakControl.forkTimeoutingTask(ThreadLeakControl.java:782)
	at com.carrotsearch.randomizedtesting.ThreadLeakControl$3.evaluate(ThreadLeakControl.java:442)
	at com.carrotsearch.randomizedtesting.RandomizedRunner.runSingleTest(RandomizedRunner.java:746)
	at com.carrotsearch.randomizedtesting.RandomizedRunner$3.evaluate(RandomizedRunner.java:648)
	at com.carrotsearch.randomizedtesting.RandomizedRunner$4.evaluate(RandomizedRunner.java:682)
	at com.carrotsearch.randomizedtesting.RandomizedRunner$5.evaluate(RandomizedRunner.java:693)
	at org.apache.lucene.util.AbstractBeforeAfterRule$1.evaluate(AbstractBeforeAfterRule.java:45)
	at org.apache.lucene.util.TestRuleStoreClassName$1.evaluate(TestRuleStoreClassName.java:42)
	at com.carrotsearch.randomizedtesting.rules.SystemPropertiesInvariantRule$1.evaluate(SystemPropertiesInvariantRule.java:55)
	at com.carrotsearch.randomizedtesting.rules.NoShadowingOrOverridesOnMethodsRule$1.evaluate(NoShadowingOrOverridesOnMethodsRule.java:39)
	at com.carrotsearch.randomizedtesting.rules.NoShadowingOrOverridesOnMethodsRule$1.evaluate(NoShadowingOrOverridesOnMethodsRule.java:39)
	at com.carrotsearch.randomizedtesting.rules.StatementAdapter.evaluate(StatementAdapter.java:36)
	at org.apache.lucene.util.TestRuleAssertionsRequired$1.evaluate(TestRuleAssertionsRequired.java:43)
	at org.apache.lucene.util.TestRuleMarkFailure$1.evaluate(TestRuleMarkFailure.java:48)
	at org.apache.lucene.util.TestRuleIgnoreAfterMaxFailures$1.evaluate(TestRuleIgnoreAfterMaxFailures.java:70)
	at org.apache.lucene.util.TestRuleIgnoreTestSuites$1.evaluate(TestRuleIgnoreTestSuites.java:55)
	at com.carrotsearch.randomizedtesting.rules.StatementAdapter.evaluate(StatementAdapter.java:36)
	at com.carrotsearch.randomizedtesting.ThreadLeakControl$StatementRunner.run(ThreadLeakControl.java:358)
	at java.lang.Thread.run(Thread.java:679)


FAILED:  org.apache.solr.core.TestMergePolicyConfig.org.apache.solr.core.TestMergePolicyConfig

Error Message:
Could not initialize class org.apache.solr.SolrTestCaseJ4

Stack Trace:
java.lang.NoClassDefFoundError: Could not initialize class org.apache.solr.SolrTestCaseJ4
	at java.lang.Class.forName0(Native Method)
	at java.lang.Class.forName(Class.java:264)
	at com.carrotsearch.randomizedtesting.RandomizedRunner$1.run(RandomizedRunner.java:486)


FAILED:  org.apache.solr.core.TestPropInject.org.apache.solr.core.TestPropInject

Error Message:
Could not initialize class org.apache.solr.util.AbstractSolrTestCase

Stack Trace:
java.lang.NoClassDefFoundError: Could not initialize class org.apache.solr.util.AbstractSolrTestCase
	at java.lang.Class.forName0(Native Method)
	at java.lang.Class.forName(Class.java:264)
	at com.carrotsearch.randomizedtesting.RandomizedRunner$1.run(RandomizedRunner.java:486)


FAILED:  org.apache.solr.core.TestPropInjectDefaults.org.apache.solr.core.TestPropInjectDefaults

Error Message:
Could not initialize class org.apache.solr.SolrTestCaseJ4

Stack Trace:
java.lang.NoClassDefFoundError: Could not initialize class org.apache.solr.SolrTestCaseJ4
	at java.lang.Class.forName0(Native Method)
	at java.lang.Class.forName(Class.java:264)
	at com.carrotsearch.randomizedtesting.RandomizedRunner$1.run(RandomizedRunner.java:486)


FAILED:  org.apache.solr.core.TestQuerySenderListener.org.apache.solr.core.TestQuerySenderListener

Error Message:
Could not initialize class org.apache.solr.SolrTestCaseJ4

Stack Trace:
java.lang.NoClassDefFoundError: Could not initialize class org.apache.solr.SolrTestCaseJ4
	at java.lang.Class.forName0(Native Method)
	at java.lang.Class.forName(Class.java:264)
	at com.carrotsearch.randomizedtesting.RandomizedRunner$1.run(RandomizedRunner.java:486)


FAILED:  org.apache.solr.core.TestQuerySenderNoQuery.org.apache.solr.core.TestQuerySenderNoQuery

Error Message:
Could not initialize class org.apache.solr.SolrTestCaseJ4

Stack Trace:
java.lang.NoClassDefFoundError: Could not initialize class org.apache.solr.SolrTestCaseJ4
	at java.lang.Class.forName0(Native Method)
	at java.lang.Class.forName(Class.java:264)
	at com.carrotsearch.randomizedtesting.RandomizedRunner$1.run(RandomizedRunner.java:486)


FAILED:  org.apache.solr.core.TestSolrDeletionPolicy1.org.apache.solr.core.TestSolrDeletionPolicy1

Error Message:
Could not initialize class org.apache.solr.SolrTestCaseJ4

Stack Trace:
java.lang.NoClassDefFoundError: Could not initialize class org.apache.solr.SolrTestCaseJ4
	at java.lang.Class.forName0(Native Method)
	at java.lang.Class.forName(Class.java:264)
	at com.carrotsearch.randomizedtesting.RandomizedRunner$1.run(RandomizedRunner.java:486)


FAILED:  org.apache.solr.core.TestSolrDeletionPolicy2.org.apache.solr.core.TestSolrDeletionPolicy2

Error Message:
Could not initialize class org.apache.solr.SolrTestCaseJ4

Stack Trace:
java.lang.NoClassDefFoundError: Could not initialize class org.apache.solr.SolrTestCaseJ4
	at java.lang.Class.forName0(Native Method)
	at java.lang.Class.forName(Class.java:264)
	at com.carrotsearch.randomizedtesting.RandomizedRunner$1.run(RandomizedRunner.java:486)


FAILED:  org.apache.solr.core.TestSolrIndexConfig.org.apache.solr.core.TestSolrIndexConfig

Error Message:
Could not initialize class org.apache.solr.SolrTestCaseJ4

Stack Trace:
java.lang.NoClassDefFoundError: Could not initialize class org.apache.solr.SolrTestCaseJ4
	at java.lang.Class.forName0(Native Method)
	at java.lang.Class.forName(Class.java:264)
	at com.carrotsearch.randomizedtesting.RandomizedRunner$1.run(RandomizedRunner.java:486)


FAILED:  org.apache.solr.core.TestSolrXMLSerializer.basicUsageTest

Error Message:
Could not initialize class org.apache.log4j.Log4jLoggerFactory

Stack Trace:
java.lang.NoClassDefFoundError: Could not initialize class org.apache.log4j.Log4jLoggerFactory
	at __randomizedtesting.SeedInfo.seed([34A5EC638CBE563:5E336C1223FD504B]:0)
	at org.apache.log4j.LogManager.getLogger(LogManager.java:42)
	at org.slf4j.impl.Log4jLoggerFactory.getLogger(Log4jLoggerFactory.java:73)
	at org.slf4j.LoggerFactory.getLogger(LoggerFactory.java:253)
	at org.slf4j.LoggerFactory.getLogger(LoggerFactory.java:265)
	at org.apache.solr.core.SolrXMLSerializer.<clinit>(SolrXMLSerializer.java:39)
	at org.apache.solr.core.TestSolrXMLSerializer.basicUsageTest(TestSolrXMLSerializer.java:68)
	at sun.reflect.NativeMethodAccessorImpl.invoke0(Native Method)
	at sun.reflect.NativeMethodAccessorImpl.invoke(NativeMethodAccessorImpl.java:57)
	at sun.reflect.DelegatingMethodAccessorImpl.invoke(DelegatingMethodAccessorImpl.java:43)
	at java.lang.reflect.Method.invoke(Method.java:616)
	at com.carrotsearch.randomizedtesting.RandomizedRunner.invoke(RandomizedRunner.java:1559)
	at com.carrotsearch.randomizedtesting.RandomizedRunner.access$600(RandomizedRunner.java:79)
	at com.carrotsearch.randomizedtesting.RandomizedRunner$6.evaluate(RandomizedRunner.java:737)
	at com.carrotsearch.randomizedtesting.RandomizedRunner$7.evaluate(RandomizedRunner.java:773)
	at com.carrotsearch.randomizedtesting.RandomizedRunner$8.evaluate(RandomizedRunner.java:787)
	at org.apache.lucene.util.TestRuleSetupTeardownChained$1.evaluate(TestRuleSetupTeardownChained.java:50)
	at org.apache.lucene.util.TestRuleFieldCacheSanity$1.evaluate(TestRuleFieldCacheSanity.java:51)
	at org.apache.lucene.util.AbstractBeforeAfterRule$1.evaluate(AbstractBeforeAfterRule.java:45)
	at com.carrotsearch.randomizedtesting.rules.SystemPropertiesInvariantRule$1.evaluate(SystemPropertiesInvariantRule.java:55)
	at org.apache.lucene.util.TestRuleThreadAndTestName$1.evaluate(TestRuleThreadAndTestName.java:48)
	at org.apache.lucene.util.TestRuleIgnoreAfterMaxFailures$1.evaluate(TestRuleIgnoreAfterMaxFailures.java:70)
	at org.apache.lucene.util.TestRuleMarkFailure$1.evaluate(TestRuleMarkFailure.java:48)
	at com.carrotsearch.randomizedtesting.rules.StatementAdapter.evaluate(StatementAdapter.java:36)
	at com.carrotsearch.randomizedtesting.ThreadLeakControl$StatementRunner.run(ThreadLeakControl.java:358)
	at com.carrotsearch.randomizedtesting.ThreadLeakControl.forkTimeoutingTask(ThreadLeakControl.java:782)
	at com.carrotsearch.randomizedtesting.ThreadLeakControl$3.evaluate(ThreadLeakControl.java:442)
	at com.carrotsearch.randomizedtesting.RandomizedRunner.runSingleTest(RandomizedRunner.java:746)
	at com.carrotsearch.randomizedtesting.RandomizedRunner$3.evaluate(RandomizedRunner.java:648)
	at com.carrotsearch.randomizedtesting.RandomizedRunner$4.evaluate(RandomizedRunner.java:682)
	at com.carrotsearch.randomizedtesting.RandomizedRunner$5.evaluate(RandomizedRunner.java:693)
	at org.apache.lucene.util.AbstractBeforeAfterRule$1.evaluate(AbstractBeforeAfterRule.java:45)
	at org.apache.lucene.util.TestRuleStoreClassName$1.evaluate(TestRuleStoreClassName.java:42)
	at com.carrotsearch.randomizedtesting.rules.SystemPropertiesInvariantRule$1.evaluate(SystemPropertiesInvariantRule.java:55)
	at com.carrotsearch.randomizedtesting.rules.NoShadowingOrOverridesOnMethodsRule$1.evaluate(NoShadowingOrOverridesOnMethodsRule.java:39)
	at com.carrotsearch.randomizedtesting.rules.NoShadowingOrOverridesOnMethodsRule$1.evaluate(NoShadowingOrOverridesOnMethodsRule.java:39)
	at com.carrotsearch.randomizedtesting.rules.StatementAdapter.evaluate(StatementAdapter.java:36)
	at org.apache.lucene.util.TestRuleAssertionsRequired$1.evaluate(TestRuleAssertionsRequired.java:43)
	at org.apache.lucene.util.TestRuleMarkFailure$1.evaluate(TestRuleMarkFailure.java:48)
	at org.apache.lucene.util.TestRuleIgnoreAfterMaxFailures$1.evaluate(TestRuleIgnoreAfterMaxFailures.java:70)
	at org.apache.lucene.util.TestRuleIgnoreTestSuites$1.evaluate(TestRuleIgnoreTestSuites.java:55)
	at com.carrotsearch.randomizedtesting.rules.StatementAdapter.evaluate(StatementAdapter.java:36)
	at com.carrotsearch.randomizedtesting.ThreadLeakControl$StatementRunner.run(ThreadLeakControl.java:358)
	at java.lang.Thread.run(Thread.java:679)


FAILED:  org.apache.solr.core.TestXIncludeConfig.org.apache.solr.core.TestXIncludeConfig

Error Message:
Could not initialize class org.apache.solr.util.AbstractSolrTestCase

Stack Trace:
java.lang.NoClassDefFoundError: Could not initialize class org.apache.solr.util.AbstractSolrTestCase
	at java.lang.Class.forName0(Native Method)
	at java.lang.Class.forName(Class.java:264)
	at com.carrotsearch.randomizedtesting.RandomizedRunner$1.run(RandomizedRunner.java:486)


FAILED:  org.apache.solr.handler.BinaryUpdateRequestHandlerTest.org.apache.solr.handler.BinaryUpdateRequestHandlerTest

Error Message:
Could not initialize class org.apache.solr.SolrTestCaseJ4

Stack Trace:
java.lang.NoClassDefFoundError: Could not initialize class org.apache.solr.SolrTestCaseJ4
	at java.lang.Class.forName0(Native Method)
	at java.lang.Class.forName(Class.java:264)
	at com.carrotsearch.randomizedtesting.RandomizedRunner$1.run(RandomizedRunner.java:486)


FAILED:  org.apache.solr.handler.CSVRequestHandlerTest.org.apache.solr.handler.CSVRequestHandlerTest

Error Message:
Could not initialize class org.apache.solr.SolrTestCaseJ4

Stack Trace:
java.lang.NoClassDefFoundError: Could not initialize class org.apache.solr.SolrTestCaseJ4
	at java.lang.Class.forName0(Native Method)
	at java.lang.Class.forName(Class.java:264)
	at com.carrotsearch.randomizedtesting.RandomizedRunner$1.run(RandomizedRunner.java:486)


FAILED:  org.apache.solr.handler.DocumentAnalysisRequestHandlerTest.org.apache.solr.handler.DocumentAnalysisRequestHandlerTest

Error Message:
Could not initialize class org.apache.solr.handler.AnalysisRequestHandlerTestBase

Stack Trace:
java.lang.NoClassDefFoundError: Could not initialize class org.apache.solr.handler.AnalysisRequestHandlerTestBase
	at java.lang.Class.forName0(Native Method)
	at java.lang.Class.forName(Class.java:264)
	at com.carrotsearch.randomizedtesting.RandomizedRunner$1.run(RandomizedRunner.java:486)


FAILED:  org.apache.solr.handler.FieldAnalysisRequestHandlerTest.org.apache.solr.handler.FieldAnalysisRequestHandlerTest

Error Message:
Could not initialize class org.apache.solr.SolrTestCaseJ4

Stack Trace:
java.lang.NoClassDefFoundError: Could not initialize class org.apache.solr.SolrTestCaseJ4
	at java.lang.Class.forName0(Native Method)
	at java.lang.Class.forName(Class.java:264)
	at com.carrotsearch.randomizedtesting.RandomizedRunner$1.run(RandomizedRunner.java:486)


FAILED:  org.apache.solr.handler.JsonLoaderTest.org.apache.solr.handler.JsonLoaderTest

Error Message:
Could not initialize class org.apache.solr.SolrTestCaseJ4

Stack Trace:
java.lang.NoClassDefFoundError: Could not initialize class org.apache.solr.SolrTestCaseJ4
	at java.lang.Class.forName0(Native Method)
	at java.lang.Class.forName(Class.java:264)
	at com.carrotsearch.randomizedtesting.RandomizedRunner$1.run(RandomizedRunner.java:486)


FAILED:  org.apache.solr.handler.MoreLikeThisHandlerTest.org.apache.solr.handler.MoreLikeThisHandlerTest

Error Message:
Could not initialize class org.apache.solr.SolrTestCaseJ4

Stack Trace:
java.lang.NoClassDefFoundError: Could not initialize class org.apache.solr.SolrTestCaseJ4
	at java.lang.Class.forName0(Native Method)
	at java.lang.Class.forName(Class.java:264)
	at com.carrotsearch.randomizedtesting.RandomizedRunner$1.run(RandomizedRunner.java:486)


FAILED:  org.apache.solr.handler.PingRequestHandlerTest.org.apache.solr.handler.PingRequestHandlerTest

Error Message:
Could not initialize class org.apache.solr.SolrTestCaseJ4

Stack Trace:
java.lang.NoClassDefFoundError: Could not initialize class org.apache.solr.SolrTestCaseJ4
	at java.lang.Class.forName0(Native Method)
	at java.lang.Class.forName(Class.java:264)
	at com.carrotsearch.randomizedtesting.RandomizedRunner$1.run(RandomizedRunner.java:486)


FAILED:  org.apache.solr.handler.StandardRequestHandlerTest.org.apache.solr.handler.StandardRequestHandlerTest

Error Message:
Could not initialize class org.apache.log4j.Log4jLoggerFactory

Stack Trace:
java.lang.NoClassDefFoundError: Could not initialize class org.apache.log4j.Log4jLoggerFactory
	at org.apache.log4j.LogManager.getLogger(LogManager.java:42)
	at org.slf4j.impl.Log4jLoggerFactory.getLogger(Log4jLoggerFactory.java:73)
	at org.slf4j.LoggerFactory.getLogger(LoggerFactory.java:253)
	at org.slf4j.LoggerFactory.getLogger(LoggerFactory.java:265)
	at org.apache.solr.util.AbstractSolrTestCase.<clinit>(AbstractSolrTestCase.java:129)
	at java.lang.Class.forName0(Native Method)
	at java.lang.Class.forName(Class.java:264)
	at com.carrotsearch.randomizedtesting.RandomizedRunner$1.run(RandomizedRunner.java:486)


FAILED:  org.apache.solr.handler.TestCSVLoader.org.apache.solr.handler.TestCSVLoader

Error Message:
Could not initialize class org.apache.solr.SolrTestCaseJ4

Stack Trace:
java.lang.NoClassDefFoundError: Could not initialize class org.apache.solr.SolrTestCaseJ4
	at java.lang.Class.forName0(Native Method)
	at java.lang.Class.forName(Class.java:264)
	at com.carrotsearch.randomizedtesting.RandomizedRunner$1.run(RandomizedRunner.java:486)


FAILED:  org.apache.solr.handler.TestReplicationHandler.org.apache.solr.handler.TestReplicationHandler

Error Message:
Could not initialize class org.apache.solr.SolrTestCaseJ4

Stack Trace:
java.lang.NoClassDefFoundError: Could not initialize class org.apache.solr.SolrTestCaseJ4
	at java.lang.Class.forName0(Native Method)
	at java.lang.Class.forName(Class.java:264)
	at com.carrotsearch.randomizedtesting.RandomizedRunner$1.run(RandomizedRunner.java:486)


FAILED:  org.apache.solr.handler.XmlUpdateRequestHandlerTest.org.apache.solr.handler.XmlUpdateRequestHandlerTest

Error Message:
Could not initialize class org.apache.solr.SolrTestCaseJ4

Stack Trace:
java.lang.NoClassDefFoundError: Could not initialize class org.apache.solr.SolrTestCaseJ4
	at java.lang.Class.forName0(Native Method)
	at java.lang.Class.forName(Class.java:264)
	at com.carrotsearch.randomizedtesting.RandomizedRunner$1.run(RandomizedRunner.java:486)


FAILED:  org.apache.solr.handler.XsltUpdateRequestHandlerTest.org.apache.solr.handler.XsltUpdateRequestHandlerTest

Error Message:
Could not initialize class org.apache.solr.SolrTestCaseJ4

Stack Trace:
java.lang.NoClassDefFoundError: Could not initialize class org.apache.solr.SolrTestCaseJ4
	at java.lang.Class.forName0(Native Method)
	at java.lang.Class.forName(Class.java:264)
	at com.carrotsearch.randomizedtesting.RandomizedRunner$1.run(RandomizedRunner.java:486)


FAILED:  org.apache.solr.handler.admin.CoreAdminHandlerTest.org.apache.solr.handler.admin.CoreAdminHandlerTest

Error Message:
Could not initialize class org.apache.solr.SolrTestCaseJ4

Stack Trace:
java.lang.NoClassDefFoundError: Could not initialize class org.apache.solr.SolrTestCaseJ4
	at java.lang.Class.forName0(Native Method)
	at java.lang.Class.forName(Class.java:264)
	at com.carrotsearch.randomizedtesting.RandomizedRunner$1.run(RandomizedRunner.java:486)


FAILED:  org.apache.solr.handler.admin.LoggingHandlerTest.org.apache.solr.handler.admin.LoggingHandlerTest

Error Message:
Could not initialize class org.apache.solr.SolrTestCaseJ4

Stack Trace:
java.lang.NoClassDefFoundError: Could not initialize class org.apache.solr.SolrTestCaseJ4
	at java.lang.Class.forName0(Native Method)
	at java.lang.Class.forName(Class.java:264)
	at com.carrotsearch.randomizedtesting.RandomizedRunner$1.run(RandomizedRunner.java:486)


FAILED:  org.apache.solr.handler.admin.LukeRequestHandlerTest.org.apache.solr.handler.admin.LukeRequestHandlerTest

Error Message:
Could not initialize class org.apache.solr.util.AbstractSolrTestCase

Stack Trace:
java.lang.NoClassDefFoundError: Could not initialize class org.apache.solr.util.AbstractSolrTestCase
	at java.lang.Class.forName0(Native Method)
	at java.lang.Class.forName(Class.java:264)
	at com.carrotsearch.randomizedtesting.RandomizedRunner$1.run(RandomizedRunner.java:486)


FAILED:  org.apache.solr.handler.admin.MBeansHandlerTest.org.apache.solr.handler.admin.MBeansHandlerTest

Error Message:
Could not initialize class org.apache.solr.SolrTestCaseJ4

Stack Trace:
java.lang.NoClassDefFoundError: Could not initialize class org.apache.solr.SolrTestCaseJ4
	at java.lang.Class.forName0(Native Method)
	at java.lang.Class.forName(Class.java:264)
	at com.carrotsearch.randomizedtesting.RandomizedRunner$1.run(RandomizedRunner.java:486)


FAILED:  org.apache.solr.handler.admin.ShowFileRequestHandlerTest.org.apache.solr.handler.admin.ShowFileRequestHandlerTest

Error Message:
Could not initialize class org.apache.solr.SolrTestCaseJ4

Stack Trace:
java.lang.NoClassDefFoundError: Could not initialize class org.apache.solr.SolrTestCaseJ4
	at java.lang.Class.forName0(Native Method)
	at java.lang.Class.forName(Class.java:264)
	at com.carrotsearch.randomizedtesting.RandomizedRunner$1.run(RandomizedRunner.java:486)


FAILED:  org.apache.solr.handler.admin.SystemInfoHandlerTest.testMagickGetter

Error Message:
Could not initialize class org.apache.log4j.Log4jLoggerFactory

Stack Trace:
java.lang.NoClassDefFoundError: Could not initialize class org.apache.log4j.Log4jLoggerFactory
	at __randomizedtesting.SeedInfo.seed([D7154B02460B51E:F96CB992CC141A07]:0)
	at org.apache.log4j.LogManager.getLogger(LogManager.java:42)
	at org.slf4j.impl.Log4jLoggerFactory.getLogger(Log4jLoggerFactory.java:73)
	at org.slf4j.LoggerFactory.getLogger(LoggerFactory.java:253)
	at org.slf4j.LoggerFactory.getLogger(LoggerFactory.java:265)
	at org.apache.solr.handler.admin.SystemInfoHandler.<clinit>(SystemInfoHandler.java:55)
	at org.apache.solr.handler.admin.SystemInfoHandlerTest.testMagickGetter(SystemInfoHandlerTest.java:41)
	at sun.reflect.NativeMethodAccessorImpl.invoke0(Native Method)
	at sun.reflect.NativeMethodAccessorImpl.invoke(NativeMethodAccessorImpl.java:57)
	at sun.reflect.DelegatingMethodAccessorImpl.invoke(DelegatingMethodAccessorImpl.java:43)
	at java.lang.reflect.Method.invoke(Method.java:616)
	at com.carrotsearch.randomizedtesting.RandomizedRunner.invoke(RandomizedRunner.java:1559)
	at com.carrotsearch.randomizedtesting.RandomizedRunner.access$600(RandomizedRunner.java:79)
	at com.carrotsearch.randomizedtesting.RandomizedRunner$6.evaluate(RandomizedRunner.java:737)
	at com.carrotsearch.randomizedtesting.RandomizedRunner$7.evaluate(RandomizedRunner.java:773)
	at com.carrotsearch.randomizedtesting.RandomizedRunner$8.evaluate(RandomizedRunner.java:787)
	at org.apache.lucene.util.TestRuleSetupTeardownChained$1.evaluate(TestRuleSetupTeardownChained.java:50)
	at org.apache.lucene.util.TestRuleFieldCacheSanity$1.evaluate(TestRuleFieldCacheSanity.java:51)
	at org.apache.lucene.util.AbstractBeforeAfterRule$1.evaluate(AbstractBeforeAfterRule.java:45)
	at com.carrotsearch.randomizedtesting.rules.SystemPropertiesInvariantRule$1.evaluate(SystemPropertiesInvariantRule.java:55)
	at org.apache.lucene.util.TestRuleThreadAndTestName$1.evaluate(TestRuleThreadAndTestName.java:48)
	at org.apache.lucene.util.TestRuleIgnoreAfterMaxFailures$1.evaluate(TestRuleIgnoreAfterMaxFailures.java:70)
	at org.apache.lucene.util.TestRuleMarkFailure$1.evaluate(TestRuleMarkFailure.java:48)
	at com.carrotsearch.randomizedtesting.rules.StatementAdapter.evaluate(StatementAdapter.java:36)
	at com.carrotsearch.randomizedtesting.ThreadLeakControl$StatementRunner.run(ThreadLeakControl.java:358)
	at com.carrotsearch.randomizedtesting.ThreadLeakControl.forkTimeoutingTask(ThreadLeakControl.java:782)
	at com.carrotsearch.randomizedtesting.ThreadLeakControl$3.evaluate(ThreadLeakControl.java:442)
	at com.carrotsearch.randomizedtesting.RandomizedRunner.runSingleTest(RandomizedRunner.java:746)
	at com.carrotsearch.randomizedtesting.RandomizedRunner$3.evaluate(RandomizedRunner.java:648)
	at com.carrotsearch.randomizedtesting.RandomizedRunner$4.evaluate(RandomizedRunner.java:682)
	at com.carrotsearch.randomizedtesting.RandomizedRunner$5.evaluate(RandomizedRunner.java:693)
	at org.apache.lucene.util.AbstractBeforeAfterRule$1.evaluate(AbstractBeforeAfterRule.java:45)
	at org.apache.lucene.util.TestRuleStoreClassName$1.evaluate(TestRuleStoreClassName.java:42)
	at com.carrotsearch.randomizedtesting.rules.SystemPropertiesInvariantRule$1.evaluate(SystemPropertiesInvariantRule.java:55)
	at com.carrotsearch.randomizedtesting.rules.NoShadowingOrOverridesOnMethodsRule$1.evaluate(NoShadowingOrOverridesOnMethodsRule.java:39)
	at com.carrotsearch.randomizedtesting.rules.NoShadowingOrOverridesOnMethodsRule$1.evaluate(NoShadowingOrOverridesOnMethodsRule.java:39)
	at com.carrotsearch.randomizedtesting.rules.StatementAdapter.evaluate(StatementAdapter.java:36)
	at org.apache.lucene.util.TestRuleAssertionsRequired$1.evaluate(TestRuleAssertionsRequired.java:43)
	at org.apache.lucene.util.TestRuleMarkFailure$1.evaluate(TestRuleMarkFailure.java:48)
	at org.apache.lucene.util.TestRuleIgnoreAfterMaxFailures$1.evaluate(TestRuleIgnoreAfterMaxFailures.java:70)
	at org.apache.lucene.util.TestRuleIgnoreTestSuites$1.evaluate(TestRuleIgnoreTestSuites.java:55)
	at com.carrotsearch.randomizedtesting.rules.StatementAdapter.evaluate(StatementAdapter.java:36)
	at com.carrotsearch.randomizedtesting.ThreadLeakControl$StatementRunner.run(ThreadLeakControl.java:358)
	at java.lang.Thread.run(Thread.java:679)


FAILED:  org.apache.solr.handler.component.BadComponentTest.org.apache.solr.handler.component.BadComponentTest

Error Message:
Could not initialize class org.apache.solr.SolrTestCaseJ4

Stack Trace:
java.lang.NoClassDefFoundError: Could not initialize class org.apache.solr.SolrTestCaseJ4
	at java.lang.Class.forName0(Native Method)
	at java.lang.Class.forName(Class.java:264)
	at com.carrotsearch.randomizedtesting.RandomizedRunner$1.run(RandomizedRunner.java:486)


FAILED:  org.apache.solr.handler.component.DebugComponentTest.org.apache.solr.handler.component.DebugComponentTest

Error Message:
Could not initialize class org.apache.solr.SolrTestCaseJ4

Stack Trace:
java.lang.NoClassDefFoundError: Could not initialize class org.apache.solr.SolrTestCaseJ4
	at java.lang.Class.forName0(Native Method)
	at java.lang.Class.forName(Class.java:264)
	at com.carrotsearch.randomizedtesting.RandomizedRunner$1.run(RandomizedRunner.java:486)


FAILED:  org.apache.solr.handler.component.DistributedQueryElevationComponentTest.org.apache.solr.handler.component.DistributedQueryElevationComponentTest

Error Message:
Could not initialize class org.apache.solr.BaseDistributedSearchTestCase

Stack Trace:
java.lang.NoClassDefFoundError: Could not initialize class org.apache.solr.BaseDistributedSearchTestCase
	at java.lang.Class.forName0(Native Method)
	at java.lang.Class.forName(Class.java:264)
	at com.carrotsearch.randomizedtesting.RandomizedRunner$1.run(RandomizedRunner.java:486)


FAILED:  org.apache.solr.handler.component.DistributedSpellCheckComponentTest.org.apache.solr.handler.component.DistributedSpellCheckComponentTest

Error Message:
Could not initialize class org.apache.solr.BaseDistributedSearchTestCase

Stack Trace:
java.lang.NoClassDefFoundError: Could not initialize class org.apache.solr.BaseDistributedSearchTestCase
	at java.lang.Class.forName0(Native Method)
	at java.lang.Class.forName(Class.java:264)
	at com.carrotsearch.randomizedtesting.RandomizedRunner$1.run(RandomizedRunner.java:486)


FAILED:  org.apache.solr.handler.component.DistributedTermsComponentTest.org.apache.solr.handler.component.DistributedTermsComponentTest

Error Message:
Could not initialize class org.apache.solr.BaseDistributedSearchTestCase

Stack Trace:
java.lang.NoClassDefFoundError: Could not initialize class org.apache.solr.BaseDistributedSearchTestCase
	at java.lang.Class.forName0(Native Method)
	at java.lang.Class.forName(Class.java:264)
	at com.carrotsearch.randomizedtesting.RandomizedRunner$1.run(RandomizedRunner.java:486)


FAILED:  org.apache.solr.handler.component.QueryElevationComponentTest.org.apache.solr.handler.component.QueryElevationComponentTest

Error Message:
Could not initialize class org.apache.solr.SolrTestCaseJ4

Stack Trace:
java.lang.NoClassDefFoundError: Could not initialize class org.apache.solr.SolrTestCaseJ4
	at java.lang.Class.forName0(Native Method)
	at java.lang.Class.forName(Class.java:264)
	at com.carrotsearch.randomizedtesting.RandomizedRunner$1.run(RandomizedRunner.java:486)


FAILED:  org.apache.solr.handler.component.ResponseLogComponentTest.org.apache.solr.handler.component.ResponseLogComponentTest

Error Message:
Could not initialize class org.apache.solr.SolrTestCaseJ4

Stack Trace:
java.lang.NoClassDefFoundError: Could not initialize class org.apache.solr.SolrTestCaseJ4
	at java.lang.Class.forName0(Native Method)
	at java.lang.Class.forName(Class.java:264)
	at com.carrotsearch.randomizedtesting.RandomizedRunner$1.run(RandomizedRunner.java:486)


FAILED:  org.apache.solr.handler.component.SearchHandlerTest.org.apache.solr.handler.component.SearchHandlerTest

Error Message:
Could not initialize class org.apache.solr.SolrTestCaseJ4

Stack Trace:
java.lang.NoClassDefFoundError: Could not initialize class org.apache.solr.SolrTestCaseJ4
	at java.lang.Class.forName0(Native Method)
	at java.lang.Class.forName(Class.java:264)
	at com.carrotsearch.randomizedtesting.RandomizedRunner$1.run(RandomizedRunner.java:486)


FAILED:  org.apache.solr.handler.component.SpellCheckComponentTest.org.apache.solr.handler.component.SpellCheckComponentTest

Error Message:
Could not initialize class org.apache.solr.SolrTestCaseJ4

Stack Trace:
java.lang.NoClassDefFoundError: Could not initialize class org.apache.solr.SolrTestCaseJ4
	at java.lang.Class.forName0(Native Method)
	at java.lang.Class.forName(Class.java:264)
	at com.carrotsearch.randomizedtesting.RandomizedRunner$1.run(RandomizedRunner.java:486)


FAILED:  org.apache.solr.handler.component.StatsComponentTest.org.apache.solr.handler.component.StatsComponentTest

Error Message:
Could not initialize class org.apache.solr.util.AbstractSolrTestCase

Stack Trace:
java.lang.NoClassDefFoundError: Could not initialize class org.apache.solr.util.AbstractSolrTestCase
	at java.lang.Class.forName0(Native Method)
	at java.lang.Class.forName(Class.java:264)
	at com.carrotsearch.randomizedtesting.RandomizedRunner$1.run(RandomizedRunner.java:486)


FAILED:  org.apache.solr.handler.component.TermVectorComponentDistributedTest.org.apache.solr.handler.component.TermVectorComponentDistributedTest

Error Message:
Could not initialize class org.apache.solr.BaseDistributedSearchTestCase

Stack Trace:
java.lang.NoClassDefFoundError: Could not initialize class org.apache.solr.BaseDistributedSearchTestCase
	at java.lang.Class.forName0(Native Method)
	at java.lang.Class.forName(Class.java:264)
	at com.carrotsearch.randomizedtesting.RandomizedRunner$1.run(RandomizedRunner.java:486)


FAILED:  org.apache.solr.handler.component.TermVectorComponentTest.org.apache.solr.handler.component.TermVectorComponentTest

Error Message:
Could not initialize class org.apache.solr.SolrTestCaseJ4

Stack Trace:
java.lang.NoClassDefFoundError: Could not initialize class org.apache.solr.SolrTestCaseJ4
	at java.lang.Class.forName0(Native Method)
	at java.lang.Class.forName(Class.java:264)
	at com.carrotsearch.randomizedtesting.RandomizedRunner$1.run(RandomizedRunner.java:486)


FAILED:  org.apache.solr.handler.component.TermsComponentTest.org.apache.solr.handler.component.TermsComponentTest

Error Message:
Detected both log4j-over-slf4j.jar AND slf4j-log4j12.jar on the class path, preempting StackOverflowError. See also http://www.slf4j.org/codes.html#log4jDelegationLoop for more details.

Stack Trace:
java.lang.IllegalStateException: Detected both log4j-over-slf4j.jar AND slf4j-log4j12.jar on the class path, preempting StackOverflowError. See also http://www.slf4j.org/codes.html#log4jDelegationLoop for more details.
	at org.apache.log4j.Log4jLoggerFactory.<clinit>(Log4jLoggerFactory.java:49)
	at org.apache.log4j.LogManager.getLogger(LogManager.java:42)
	at org.slf4j.impl.Log4jLoggerFactory.getLogger(Log4jLoggerFactory.java:73)
	at org.slf4j.LoggerFactory.getLogger(LoggerFactory.java:253)
	at org.slf4j.LoggerFactory.getLogger(LoggerFactory.java:265)
	at org.apache.solr.SolrTestCaseJ4.<clinit>(SolrTestCaseJ4.java:345)
	at java.lang.Class.forName0(Native Method)
	at java.lang.Class.forName(Class.java:264)
	at com.carrotsearch.randomizedtesting.RandomizedRunner$1.run(RandomizedRunner.java:486)


FAILED:  org.apache.solr.highlight.FastVectorHighlighterTest.org.apache.solr.highlight.FastVectorHighlighterTest

Error Message:
Could not initialize class org.apache.solr.SolrTestCaseJ4

Stack Trace:
java.lang.NoClassDefFoundError: Could not initialize class org.apache.solr.SolrTestCaseJ4
	at java.lang.Class.forName0(Native Method)
	at java.lang.Class.forName(Class.java:264)
	at com.carrotsearch.randomizedtesting.RandomizedRunner$1.run(RandomizedRunner.java:486)


FAILED:  org.apache.solr.highlight.HighlighterConfigTest.org.apache.solr.highlight.HighlighterConfigTest

Error Message:
Could not initialize class org.apache.solr.util.AbstractSolrTestCase

Stack Trace:
java.lang.NoClassDefFoundError: Could not initialize class org.apache.solr.util.AbstractSolrTestCase
	at java.lang.Class.forName0(Native Method)
	at java.lang.Class.forName(Class.java:264)
	at com.carrotsearch.randomizedtesting.RandomizedRunner$1.run(RandomizedRunner.java:486)


FAILED:  org.apache.solr.highlight.HighlighterTest.org.apache.solr.highlight.HighlighterTest

Error Message:
Could not initialize class org.apache.solr.SolrTestCaseJ4

Stack Trace:
java.lang.NoClassDefFoundError: Could not initialize class org.apache.solr.SolrTestCaseJ4
	at java.lang.Class.forName0(Native Method)
	at java.lang.Class.forName(Class.java:264)
	at com.carrotsearch.randomizedtesting.RandomizedRunner$1.run(RandomizedRunner.java:486)


FAILED:  org.apache.solr.request.JSONWriterTest.org.apache.solr.request.JSONWriterTest

Error Message:
Could not initialize class org.apache.solr.SolrTestCaseJ4

Stack Trace:
java.lang.NoClassDefFoundError: Could not initialize class org.apache.solr.SolrTestCaseJ4
	at java.lang.Class.forName0(Native Method)
	at java.lang.Class.forName(Class.java:264)
	at com.carrotsearch.randomizedtesting.RandomizedRunner$1.run(RandomizedRunner.java:486)


FAILED:  org.apache.solr.request.SimpleFacetsTest.org.apache.solr.request.SimpleFacetsTest

Error Message:
Could not initialize class org.apache.solr.SolrTestCaseJ4

Stack Trace:
java.lang.NoClassDefFoundError: Could not initialize class org.apache.solr.SolrTestCaseJ4
	at java.lang.Class.forName0(Native Method)
	at java.lang.Class.forName(Class.java:264)
	at com.carrotsearch.randomizedtesting.RandomizedRunner$1.run(RandomizedRunner.java:486)


FAILED:  org.apache.solr.request.TestBinaryResponseWriter.org.apache.solr.request.TestBinaryResponseWriter

Error Message:
Could not initialize class org.apache.solr.util.AbstractSolrTestCase

Stack Trace:
java.lang.NoClassDefFoundError: Could not initialize class org.apache.solr.util.AbstractSolrTestCase
	at java.lang.Class.forName0(Native Method)
	at java.lang.Class.forName(Class.java:264)
	at com.carrotsearch.randomizedtesting.RandomizedRunner$1.run(RandomizedRunner.java:486)


FAILED:  org.apache.solr.request.TestFaceting.org.apache.solr.request.TestFaceting

Error Message:
Could not initialize class org.apache.solr.SolrTestCaseJ4

Stack Trace:
java.lang.NoClassDefFoundError: Could not initialize class org.apache.solr.SolrTestCaseJ4
	at java.lang.Class.forName0(Native Method)
	at java.lang.Class.forName(Class.java:264)
	at com.carrotsearch.randomizedtesting.RandomizedRunner$1.run(RandomizedRunner.java:486)


FAILED:  org.apache.solr.request.TestRemoteStreaming.org.apache.solr.request.TestRemoteStreaming

Error Message:
Could not initialize class org.apache.solr.SolrJettyTestBase

Stack Trace:
java.lang.NoClassDefFoundError: Could not initialize class org.apache.solr.SolrJettyTestBase
	at java.lang.Class.forName0(Native Method)
	at java.lang.Class.forName(Class.java:264)
	at com.carrotsearch.randomizedtesting.RandomizedRunner$1.run(RandomizedRunner.java:486)


FAILED:  org.apache.solr.request.TestWriterPerf.org.apache.solr.request.TestWriterPerf

Error Message:
Could not initialize class org.apache.solr.util.AbstractSolrTestCase

Stack Trace:
java.lang.NoClassDefFoundError: Could not initialize class org.apache.solr.util.AbstractSolrTestCase
	at java.lang.Class.forName0(Native Method)
	at java.lang.Class.forName(Class.java:264)
	at com.carrotsearch.randomizedtesting.RandomizedRunner$1.run(RandomizedRunner.java:486)


FAILED:  org.apache.solr.response.TestCSVResponseWriter.org.apache.solr.response.TestCSVResponseWriter

Error Message:
Could not initialize class org.apache.solr.SolrTestCaseJ4

Stack Trace:
java.lang.NoClassDefFoundError: Could not initialize class org.apache.solr.SolrTestCaseJ4
	at java.lang.Class.forName0(Native Method)
	at java.lang.Class.forName(Class.java:264)
	at com.carrotsearch.randomizedtesting.RandomizedRunner$1.run(RandomizedRunner.java:486)


FAILED:  org.apache.solr.response.TestPHPSerializedResponseWriter.org.apache.solr.response.TestPHPSerializedResponseWriter

Error Message:
Could not initialize class org.apache.solr.SolrTestCaseJ4

Stack Trace:
java.lang.NoClassDefFoundError: Could not initialize class org.apache.solr.SolrTestCaseJ4
	at java.lang.Class.forName0(Native Method)
	at java.lang.Class.forName(Class.java:264)
	at com.carrotsearch.randomizedtesting.RandomizedRunner$1.run(RandomizedRunner.java:486)


FAILED:  org.apache.solr.schema.BadIndexSchemaTest.org.apache.solr.schema.BadIndexSchemaTest

Error Message:
Could not initialize class org.apache.solr.core.AbstractBadConfigTestBase

Stack Trace:
java.lang.NoClassDefFoundError: Could not initialize class org.apache.solr.core.AbstractBadConfigTestBase
	at java.lang.Class.forName0(Native Method)
	at java.lang.Class.forName(Class.java:264)
	at com.carrotsearch.randomizedtesting.RandomizedRunner$1.run(RandomizedRunner.java:486)


FAILED:  org.apache.solr.schema.CopyFieldTest.org.apache.solr.schema.CopyFieldTest

Error Message:
Could not initialize class org.apache.solr.SolrTestCaseJ4

Stack Trace:
java.lang.NoClassDefFoundError: Could not initialize class org.apache.solr.SolrTestCaseJ4
	at java.lang.Class.forName0(Native Method)
	at java.lang.Class.forName(Class.java:264)
	at com.carrotsearch.randomizedtesting.RandomizedRunner$1.run(RandomizedRunner.java:486)


FAILED:  org.apache.solr.schema.CurrencyFieldTest.org.apache.solr.schema.CurrencyFieldTest

Error Message:
Could not initialize class org.apache.solr.SolrTestCaseJ4

Stack Trace:
java.lang.NoClassDefFoundError: Could not initialize class org.apache.solr.SolrTestCaseJ4
	at java.lang.Class.forName0(Native Method)
	at java.lang.Class.forName(Class.java:264)
	at com.carrotsearch.randomizedtesting.RandomizedRunner$1.run(RandomizedRunner.java:486)


FAILED:  org.apache.solr.schema.DateFieldTest.testFormatter

Error Message:
Could not initialize class org.apache.log4j.Log4jLoggerFactory

Stack Trace:
java.lang.NoClassDefFoundError: Could not initialize class org.apache.log4j.Log4jLoggerFactory
	at __randomizedtesting.SeedInfo.seed([34D4249406B52492:17589B0CEE08BB0D]:0)
	at org.apache.log4j.LogManager.getLogger(LogManager.java:42)
	at org.slf4j.impl.Log4jLoggerFactory.getLogger(Log4jLoggerFactory.java:73)
	at org.slf4j.LoggerFactory.getLogger(LoggerFactory.java:253)
	at org.slf4j.LoggerFactory.getLogger(LoggerFactory.java:265)
	at org.apache.solr.schema.FieldType.<clinit>(FieldType.java:57)
	at org.apache.solr.schema.DateFieldTest.setUp(DateFieldTest.java:39)
	at sun.reflect.NativeMethodAccessorImpl.invoke0(Native Method)
	at sun.reflect.NativeMethodAccessorImpl.invoke(NativeMethodAccessorImpl.java:57)
	at sun.reflect.DelegatingMethodAccessorImpl.invoke(DelegatingMethodAccessorImpl.java:43)
	at java.lang.reflect.Method.invoke(Method.java:616)
	at com.carrotsearch.randomizedtesting.RandomizedRunner.invoke(RandomizedRunner.java:1559)
	at com.carrotsearch.randomizedtesting.RandomizedRunner.access$600(RandomizedRunner.java:79)
	at com.carrotsearch.randomizedtesting.RandomizedRunner$7.evaluate(RandomizedRunner.java:771)
	at com.carrotsearch.randomizedtesting.RandomizedRunner$8.evaluate(RandomizedRunner.java:787)
	at org.apache.lucene.util.TestRuleSetupTeardownChained$1.evaluate(TestRuleSetupTeardownChained.java:50)
	at org.apache.lucene.util.TestRuleFieldCacheSanity$1.evaluate(TestRuleFieldCacheSanity.java:51)
	at org.apache.lucene.util.AbstractBeforeAfterRule$1.evaluate(AbstractBeforeAfterRule.java:45)
	at com.carrotsearch.randomizedtesting.rules.SystemPropertiesInvariantRule$1.evaluate(SystemPropertiesInvariantRule.java:55)
	at org.apache.lucene.util.TestRuleThreadAndTestName$1.evaluate(TestRuleThreadAndTestName.java:48)
	at org.apache.lucene.util.TestRuleIgnoreAfterMaxFailures$1.evaluate(TestRuleIgnoreAfterMaxFailures.java:70)
	at org.apache.lucene.util.TestRuleMarkFailure$1.evaluate(TestRuleMarkFailure.java:48)
	at com.carrotsearch.randomizedtesting.rules.StatementAdapter.evaluate(StatementAdapter.java:36)
	at com.carrotsearch.randomizedtesting.ThreadLeakControl$StatementRunner.run(ThreadLeakControl.java:358)
	at com.carrotsearch.randomizedtesting.ThreadLeakControl.forkTimeoutingTask(ThreadLeakControl.java:782)
	at com.carrotsearch.randomizedtesting.ThreadLeakControl$3.evaluate(ThreadLeakControl.java:442)
	at com.carrotsearch.randomizedtesting.RandomizedRunner.runSingleTest(RandomizedRunner.java:746)
	at com.carrotsearch.randomizedtesting.RandomizedRunner$3.evaluate(RandomizedRunner.java:648)
	at com.carrotsearch.randomizedtesting.RandomizedRunner$4.evaluate(RandomizedRunner.java:682)
	at com.carrotsearch.randomizedtesting.RandomizedRunner$5.evaluate(RandomizedRunner.java:693)
	at org.apache.lucene.util.AbstractBeforeAfterRule$1.evaluate(AbstractBeforeAfterRule.java:45)
	at org.apache.lucene.util.TestRuleStoreClassName$1.evaluate(TestRuleStoreClassName.java:42)
	at com.carrotsearch.randomizedtesting.rules.SystemPropertiesInvariantRule$1.evaluate(SystemPropertiesInvariantRule.java:55)
	at com.carrotsearch.randomizedtesting.rules.NoShadowingOrOverridesOnMethodsRule$1.evaluate(NoShadowingOrOverridesOnMethodsRule.java:39)
	at com.carrotsearch.randomizedtesting.rules.NoShadowingOrOverridesOnMethodsRule$1.evaluate(NoShadowingOrOverridesOnMethodsRule.java:39)
	at com.carrotsearch.randomizedtesting.rules.StatementAdapter.evaluate(StatementAdapter.java:36)
	at org.apache.lucene.util.TestRuleAssertionsRequired$1.evaluate(TestRuleAssertionsRequired.java:43)
	at org.apache.lucene.util.TestRuleMarkFailure$1.evaluate(TestRuleMarkFailure.java:48)
	at org.apache.lucene.util.TestRuleIgnoreAfterMaxFailures$1.evaluate(TestRuleIgnoreAfterMaxFailures.java:70)
	at org.apache.lucene.util.TestRuleIgnoreTestSuites$1.evaluate(TestRuleIgnoreTestSuites.java:55)
	at com.carrotsearch.randomizedtesting.rules.StatementAdapter.evaluate(StatementAdapter.java:36)
	at com.carrotsearch.randomizedtesting.ThreadLeakControl$StatementRunner.run(ThreadLeakControl.java:358)
	at java.lang.Thread.run(Thread.java:679)


FAILED:  org.apache.solr.schema.DateFieldTest.testParseMath

Error Message:
Could not initialize class org.apache.solr.schema.DateField

Stack Trace:
java.lang.NoClassDefFoundError: Could not initialize class org.apache.solr.schema.DateField
	at __randomizedtesting.SeedInfo.seed([34D4249406B52492:B5AA0C65B75E8B6C]:0)
	at org.apache.solr.schema.DateFieldTest.setUp(DateFieldTest.java:39)
	at sun.reflect.GeneratedMethodAccessor1.invoke(Unknown Source)
	at sun.reflect.DelegatingMethodAccessorImpl.invoke(DelegatingMethodAccessorImpl.java:43)
	at java.lang.reflect.Method.invoke(Method.java:616)
	at com.carrotsearch.randomizedtesting.RandomizedRunner.invoke(RandomizedRunner.java:1559)
	at com.carrotsearch.randomizedtesting.RandomizedRunner.access$600(RandomizedRunner.java:79)
	at com.carrotsearch.randomizedtesting.RandomizedRunner$7.evaluate(RandomizedRunner.java:771)
	at com.carrotsearch.randomizedtesting.RandomizedRunner$8.evaluate(RandomizedRunner.java:787)
	at org.apache.lucene.util.TestRuleSetupTeardownChained$1.evaluate(TestRuleSetupTeardownChained.java:50)
	at org.apache.lucene.util.TestRuleFieldCacheSanity$1.evaluate(TestRuleFieldCacheSanity.java:51)
	at org.apache.lucene.util.AbstractBeforeAfterRule$1.evaluate(AbstractBeforeAfterRule.java:45)
	at com.carrotsearch.randomizedtesting.rules.SystemPropertiesInvariantRule$1.evaluate(SystemPropertiesInvariantRule.java:55)
	at org.apache.lucene.util.TestRuleThreadAndTestName$1.evaluate(TestRuleThreadAndTestName.java:48)
	at org.apache.lucene.util.TestRuleIgnoreAfterMaxFailures$1.evaluate(TestRuleIgnoreAfterMaxFailures.java:70)
	at org.apache.lucene.util.TestRuleMarkFailure$1.evaluate(TestRuleMarkFailure.java:48)
	at com.carrotsearch.randomizedtesting.rules.StatementAdapter.evaluate(StatementAdapter.java:36)
	at com.carrotsearch.randomizedtesting.ThreadLeakControl$StatementRunner.run(ThreadLeakControl.java:358)
	at com.carrotsearch.randomizedtesting.ThreadLeakControl.forkTimeoutingTask(ThreadLeakControl.java:782)
	at com.carrotsearch.randomizedtesting.ThreadLeakControl$3.evaluate(ThreadLeakControl.java:442)
	at com.carrotsearch.randomizedtesting.RandomizedRunner.runSingleTest(RandomizedRunner.java:746)
	at com.carrotsearch.randomizedtesting.RandomizedRunner$3.evaluate(RandomizedRunner.java:648)
	at com.carrotsearch.randomizedtesting.RandomizedRunner$4.evaluate(RandomizedRunner.java:682)
	at com.carrotsearch.randomizedtesting.RandomizedRunner$5.evaluate(RandomizedRunner.java:693)
	at org.apache.lucene.util.AbstractBeforeAfterRule$1.evaluate(AbstractBeforeAfterRule.java:45)
	at org.apache.lucene.util.TestRuleStoreClassName$1.evaluate(TestRuleStoreClassName.java:42)
	at com.carrotsearch.randomizedtesting.rules.SystemPropertiesInvariantRule$1.evaluate(SystemPropertiesInvariantRule.java:55)
	at com.carrotsearch.randomizedtesting.rules.NoShadowingOrOverridesOnMethodsRule$1.evaluate(NoShadowingOrOverridesOnMethodsRule.java:39)
	at com.carrotsearch.randomizedtesting.rules.NoShadowingOrOverridesOnMethodsRule$1.evaluate(NoShadowingOrOverridesOnMethodsRule.java:39)
	at com.carrotsearch.randomizedtesting.rules.StatementAdapter.evaluate(StatementAdapter.java:36)
	at org.apache.lucene.util.TestRuleAssertionsRequired$1.evaluate(TestRuleAssertionsRequired.java:43)
	at org.apache.lucene.util.TestRuleMarkFailure$1.evaluate(TestRuleMarkFailure.java:48)
	at org.apache.lucene.util.TestRuleIgnoreAfterMaxFailures$1.evaluate(TestRuleIgnoreAfterMaxFailures.java:70)
	at org.apache.lucene.util.TestRuleIgnoreTestSuites$1.evaluate(TestRuleIgnoreTestSuites.java:55)
	at com.carrotsearch.randomizedtesting.rules.StatementAdapter.evaluate(StatementAdapter.java:36)
	at com.carrotsearch.randomizedtesting.ThreadLeakControl$StatementRunner.run(ThreadLeakControl.java:358)
	at java.lang.Thread.run(Thread.java:679)


FAILED:  org.apache.solr.schema.DateFieldTest.testToInternalObj

Error Message:
Could not initialize class org.apache.solr.schema.DateField

Stack Trace:
java.lang.NoClassDefFoundError: Could not initialize class org.apache.solr.schema.DateField
	at __randomizedtesting.SeedInfo.seed([34D4249406B52492:4150BA5236AF5484]:0)
	at org.apache.solr.schema.DateFieldTest.setUp(DateFieldTest.java:39)
	at sun.reflect.GeneratedMethodAccessor1.invoke(Unknown Source)
	at sun.reflect.DelegatingMethodAccessorImpl.invoke(DelegatingMethodAccessorImpl.java:43)
	at java.lang.reflect.Method.invoke(Method.java:616)
	at com.carrotsearch.randomizedtesting.RandomizedRunner.invoke(RandomizedRunner.java:1559)
	at com.carrotsearch.randomizedtesting.RandomizedRunner.access$600(RandomizedRunner.java:79)
	at com.carrotsearch.randomizedtesting.RandomizedRunner$7.evaluate(RandomizedRunner.java:771)
	at com.carrotsearch.randomizedtesting.RandomizedRunner$8.evaluate(RandomizedRunner.java:787)
	at org.apache.lucene.util.TestRuleSetupTeardownChained$1.evaluate(TestRuleSetupTeardownChained.java:50)
	at org.apache.lucene.util.TestRuleFieldCacheSanity$1.evaluate(TestRuleFieldCacheSanity.java:51)
	at org.apache.lucene.util.AbstractBeforeAfterRule$1.evaluate(AbstractBeforeAfterRule.java:45)
	at com.carrotsearch.randomizedtesting.rules.SystemPropertiesInvariantRule$1.evaluate(SystemPropertiesInvariantRule.java:55)
	at org.apache.lucene.util.TestRuleThreadAndTestName$1.evaluate(TestRuleThreadAndTestName.java:48)
	at org.apache.lucene.util.TestRuleIgnoreAfterMaxFailures$1.evaluate(TestRuleIgnoreAfterMaxFailures.java:70)
	at org.apache.lucene.util.TestRuleMarkFailure$1.evaluate(TestRuleMarkFailure.java:48)
	at com.carrotsearch.randomizedtesting.rules.StatementAdapter.evaluate(StatementAdapter.java:36)
	at com.carrotsearch.randomizedtesting.ThreadLeakControl$StatementRunner.run(ThreadLeakControl.java:358)
	at com.carrotsearch.randomizedtesting.ThreadLeakControl.forkTimeoutingTask(ThreadLeakControl.java:782)
	at com.carrotsearch.randomizedtesting.ThreadLeakControl$3.evaluate(ThreadLeakControl.java:442)
	at com.carrotsearch.randomizedtesting.RandomizedRunner.runSingleTest(RandomizedRunner.java:746)
	at com.carrotsearch.randomizedtesting.RandomizedRunner$3.evaluate(RandomizedRunner.java:648)
	at com.carrotsearch.randomizedtesting.RandomizedRunner$4.evaluate(RandomizedRunner.java:682)
	at com.carrotsearch.randomizedtesting.RandomizedRunner$5.evaluate(RandomizedRunner.java:693)
	at org.apache.lucene.util.AbstractBeforeAfterRule$1.evaluate(AbstractBeforeAfterRule.java:45)
	at org.apache.lucene.util.TestRuleStoreClassName$1.evaluate(TestRuleStoreClassName.java:42)
	at com.carrotsearch.randomizedtesting.rules.SystemPropertiesInvariantRule$1.evaluate(SystemPropertiesInvariantRule.java:55)
	at com.carrotsearch.randomizedtesting.rules.NoShadowingOrOverridesOnMethodsRule$1.evaluate(NoShadowingOrOverridesOnMethodsRule.java:39)
	at com.carrotsearch.randomizedtesting.rules.NoShadowingOrOverridesOnMethodsRule$1.evaluate(NoShadowingOrOverridesOnMethodsRule.java:39)
	at com.carrotsearch.randomizedtesting.rules.StatementAdapter.evaluate(StatementAdapter.java:36)
	at org.apache.lucene.util.TestRuleAssertionsRequired$1.evaluate(TestRuleAssertionsRequired.java:43)
	at org.apache.lucene.util.TestRuleMarkFailure$1.evaluate(TestRuleMarkFailure.java:48)
	at org.apache.lucene.util.TestRuleIgnoreAfterMaxFailures$1.evaluate(TestRuleIgnoreAfterMaxFailures.java:70)
	at org.apache.lucene.util.TestRuleIgnoreTestSuites$1.evaluate(TestRuleIgnoreTestSuites.java:55)
	at com.carrotsearch.randomizedtesting.rules.StatementAdapter.evaluate(StatementAdapter.java:36)
	at com.carrotsearch.randomizedtesting.ThreadLeakControl$StatementRunner.run(ThreadLeakControl.java:358)
	at java.lang.Thread.run(Thread.java:679)


FAILED:  org.apache.solr.schema.DateFieldTest.testCreateField

Error Message:
Could not initialize class org.apache.solr.schema.DateField

Stack Trace:
java.lang.NoClassDefFoundError: Could not initialize class org.apache.solr.schema.DateField
	at __randomizedtesting.SeedInfo.seed([34D4249406B52492:EAB7040177D4BDA]:0)
	at org.apache.solr.schema.DateFieldTest.setUp(DateFieldTest.java:39)
	at sun.reflect.GeneratedMethodAccessor1.invoke(Unknown Source)
	at sun.reflect.DelegatingMethodAccessorImpl.invoke(DelegatingMethodAccessorImpl.java:43)
	at java.lang.reflect.Method.invoke(Method.java:616)
	at com.carrotsearch.randomizedtesting.RandomizedRunner.invoke(RandomizedRunner.java:1559)
	at com.carrotsearch.randomizedtesting.RandomizedRunner.access$600(RandomizedRunner.java:79)
	at com.carrotsearch.randomizedtesting.RandomizedRunner$7.evaluate(RandomizedRunner.java:771)
	at com.carrotsearch.randomizedtesting.RandomizedRunner$8.evaluate(RandomizedRunner.java:787)
	at org.apache.lucene.util.TestRuleSetupTeardownChained$1.evaluate(TestRuleSetupTeardownChained.java:50)
	at org.apache.lucene.util.TestRuleFieldCacheSanity$1.evaluate(TestRuleFieldCacheSanity.java:51)
	at org.apache.lucene.util.AbstractBeforeAfterRule$1.evaluate(AbstractBeforeAfterRule.java:45)
	at com.carrotsearch.randomizedtesting.rules.SystemPropertiesInvariantRule$1.evaluate(SystemPropertiesInvariantRule.java:55)
	at org.apache.lucene.util.TestRuleThreadAndTestName$1.evaluate(TestRuleThreadAndTestName.java:48)
	at org.apache.lucene.util.TestRuleIgnoreAfterMaxFailures$1.evaluate(TestRuleIgnoreAfterMaxFailures.java:70)
	at org.apache.lucene.util.TestRuleMarkFailure$1.evaluate(TestRuleMarkFailure.java:48)
	at com.carrotsearch.randomizedtesting.rules.StatementAdapter.evaluate(StatementAdapter.java:36)
	at com.carrotsearch.randomizedtesting.ThreadLeakControl$StatementRunner.run(ThreadLeakControl.java:358)
	at com.carrotsearch.randomizedtesting.ThreadLeakControl.forkTimeoutingTask(ThreadLeakControl.java:782)
	at com.carrotsearch.randomizedtesting.ThreadLeakControl$3.evaluate(ThreadLeakControl.java:442)
	at com.carrotsearch.randomizedtesting.RandomizedRunner.runSingleTest(RandomizedRunner.java:746)
	at com.carrotsearch.randomizedtesting.RandomizedRunner$3.evaluate(RandomizedRunner.java:648)
	at com.carrotsearch.randomizedtesting.RandomizedRunner$4.evaluate(RandomizedRunner.java:682)
	at com.carrotsearch.randomizedtesting.RandomizedRunner$5.evaluate(RandomizedRunner.java:693)
	at org.apache.lucene.util.AbstractBeforeAfterRule$1.evaluate(AbstractBeforeAfterRule.java:45)
	at org.apache.lucene.util.TestRuleStoreClassName$1.evaluate(TestRuleStoreClassName.java:42)
	at com.carrotsearch.randomizedtesting.rules.SystemPropertiesInvariantRule$1.evaluate(SystemPropertiesInvariantRule.java:55)
	at com.carrotsearch.randomizedtesting.rules.NoShadowingOrOverridesOnMethodsRule$1.evaluate(NoShadowingOrOverridesOnMethodsRule.java:39)
	at com.carrotsearch.randomizedtesting.rules.NoShadowingOrOverridesOnMethodsRule$1.evaluate(NoShadowingOrOverridesOnMethodsRule.java:39)
	at com.carrotsearch.randomizedtesting.rules.StatementAdapter.evaluate(StatementAdapter.java:36)
	at org.apache.lucene.util.TestRuleAssertionsRequired$1.evaluate(TestRuleAssertionsRequired.java:43)
	at org.apache.lucene.util.TestRuleMarkFailure$1.evaluate(TestRuleMarkFailure.java:48)
	at org.apache.lucene.util.TestRuleIgnoreAfterMaxFailures$1.evaluate(TestRuleIgnoreAfterMaxFailures.java:70)
	at org.apache.lucene.util.TestRuleIgnoreTestSuites$1.evaluate(TestRuleIgnoreTestSuites.java:55)
	at com.carrotsearch.randomizedtesting.rules.StatementAdapter.evaluate(StatementAdapter.java:36)
	at com.carrotsearch.randomizedtesting.ThreadLeakControl$StatementRunner.run(ThreadLeakControl.java:358)
	at java.lang.Thread.run(Thread.java:679)


FAILED:  org.apache.solr.schema.DateFieldTest.testRoundTrip

Error Message:
Could not initialize class org.apache.solr.schema.DateField

Stack Trace:
java.lang.NoClassDefFoundError: Could not initialize class org.apache.solr.schema.DateField
	at __randomizedtesting.SeedInfo.seed([34D4249406B52492:361A7ED29EB9A339]:0)
	at org.apache.solr.schema.DateFieldTest.setUp(DateFieldTest.java:39)
	at sun.reflect.GeneratedMethodAccessor1.invoke(Unknown Source)
	at sun.reflect.DelegatingMethodAccessorImpl.invoke(DelegatingMethodAccessorImpl.java:43)
	at java.lang.reflect.Method.invoke(Method.java:616)
	at com.carrotsearch.randomizedtesting.RandomizedRunner.invoke(RandomizedRunner.java:1559)
	at com.carrotsearch.randomizedtesting.RandomizedRunner.access$600(RandomizedRunner.java:79)
	at com.carrotsearch.randomizedtesting.RandomizedRunner$7.evaluate(RandomizedRunner.java:771)
	at com.carrotsearch.randomizedtesting.RandomizedRunner$8.evaluate(RandomizedRunner.java:787)
	at org.apache.lucene.util.TestRuleSetupTeardownChained$1.evaluate(TestRuleSetupTeardownChained.java:50)
	at org.apache.lucene.util.TestRuleFieldCacheSanity$1.evaluate(TestRuleFieldCacheSanity.java:51)
	at org.apache.lucene.util.AbstractBeforeAfterRule$1.evaluate(AbstractBeforeAfterRule.java:45)
	at com.carrotsearch.randomizedtesting.rules.SystemPropertiesInvariantRule$1.evaluate(SystemPropertiesInvariantRule.java:55)
	at org.apache.lucene.util.TestRuleThreadAndTestName$1.evaluate(TestRuleThreadAndTestName.java:48)
	at org.apache.lucene.util.TestRuleIgnoreAfterMaxFailures$1.evaluate(TestRuleIgnoreAfterMaxFailures.java:70)
	at org.apache.lucene.util.TestRuleMarkFailure$1.evaluate(TestRuleMarkFailure.java:48)
	at com.carrotsearch.randomizedtesting.rules.StatementAdapter.evaluate(StatementAdapter.java:36)
	at com.carrotsearch.randomizedtesting.ThreadLeakControl$StatementRunner.run(ThreadLeakControl.java:358)
	at com.carrotsearch.randomizedtesting.ThreadLeakControl.forkTimeoutingTask(ThreadLeakControl.java:782)
	at com.carrotsearch.randomizedtesting.ThreadLeakControl$3.evaluate(ThreadLeakControl.java:442)
	at com.carrotsearch.randomizedtesting.RandomizedRunner.runSingleTest(RandomizedRunner.java:746)
	at com.carrotsearch.randomizedtesting.RandomizedRunner$3.evaluate(RandomizedRunner.java:648)
	at com.carrotsearch.randomizedtesting.RandomizedRunner$4.evaluate(RandomizedRunner.java:682)
	at com.carrotsearch.randomizedtesting.RandomizedRunner$5.evaluate(RandomizedRunner.java:693)
	at org.apache.lucene.util.AbstractBeforeAfterRule$1.evaluate(AbstractBeforeAfterRule.java:45)
	at org.apache.lucene.util.TestRuleStoreClassName$1.evaluate(TestRuleStoreClassName.java:42)
	at com.carrotsearch.randomizedtesting.rules.SystemPropertiesInvariantRule$1.evaluate(SystemPropertiesInvariantRule.java:55)
	at com.carrotsearch.randomizedtesting.rules.NoShadowingOrOverridesOnMethodsRule$1.evaluate(NoShadowingOrOverridesOnMethodsRule.java:39)
	at com.carrotsearch.randomizedtesting.rules.NoShadowingOrOverridesOnMethodsRule$1.evaluate(NoShadowingOrOverridesOnMethodsRule.java:39)
	at com.carrotsearch.randomizedtesting.rules.StatementAdapter.evaluate(StatementAdapter.java:36)
	at org.apache.lucene.util.TestRuleAssertionsRequired$1.evaluate(TestRuleAssertionsRequired.java:43)
	at org.apache.lucene.util.TestRuleMarkFailure$1.evaluate(TestRuleMarkFailure.java:48)
	at org.apache.lucene.util.TestRuleIgnoreAfterMaxFailures$1.evaluate(TestRuleIgnoreAfterMaxFailures.java:70)
	at org.apache.lucene.util.TestRuleIgnoreTestSuites$1.evaluate(TestRuleIgnoreTestSuites.java:55)
	at com.carrotsearch.randomizedtesting.rules.StatementAdapter.evaluate(StatementAdapter.java:36)
	at com.carrotsearch.randomizedtesting.ThreadLeakControl$StatementRunner.run(ThreadLeakControl.java:358)
	at java.lang.Thread.run(Thread.java:679)


FAILED:  org.apache.solr.schema.DateFieldTest.testToObject

Error Message:
Could not initialize class org.apache.solr.schema.DateField

Stack Trace:
java.lang.NoClassDefFoundError: Could not initialize class org.apache.solr.schema.DateField
	at __randomizedtesting.SeedInfo.seed([34D4249406B52492:20C842CF38B025A3]:0)
	at org.apache.solr.schema.DateFieldTest.setUp(DateFieldTest.java:39)
	at sun.reflect.GeneratedMethodAccessor1.invoke(Unknown Source)
	at sun.reflect.DelegatingMethodAccessorImpl.invoke(DelegatingMethodAccessorImpl.java:43)
	at java.lang.reflect.Method.invoke(Method.java:616)
	at com.carrotsearch.randomizedtesting.RandomizedRunner.invoke(RandomizedRunner.java:1559)
	at com.carrotsearch.randomizedtesting.RandomizedRunner.access$600(RandomizedRunner.java:79)
	at com.carrotsearch.randomizedtesting.RandomizedRunner$7.evaluate(RandomizedRunner.java:771)
	at com.carrotsearch.randomizedtesting.RandomizedRunner$8.evaluate(RandomizedRunner.java:787)
	at org.apache.lucene.util.TestRuleSetupTeardownChained$1.evaluate(TestRuleSetupTeardownChained.java:50)
	at org.apache.lucene.util.TestRuleFieldCacheSanity$1.evaluate(TestRuleFieldCacheSanity.java:51)
	at org.apache.lucene.util.AbstractBeforeAfterRule$1.evaluate(AbstractBeforeAfterRule.java:45)
	at com.carrotsearch.randomizedtesting.rules.SystemPropertiesInvariantRule$1.evaluate(SystemPropertiesInvariantRule.java:55)
	at org.apache.lucene.util.TestRuleThreadAndTestName$1.evaluate(TestRuleThreadAndTestName.java:48)
	at org.apache.lucene.util.TestRuleIgnoreAfterMaxFailures$1.evaluate(TestRuleIgnoreAfterMaxFailures.java:70)
	at org.apache.lucene.util.TestRuleMarkFailure$1.evaluate(TestRuleMarkFailure.java:48)
	at com.carrotsearch.randomizedtesting.rules.StatementAdapter.evaluate(StatementAdapter.java:36)
	at com.carrotsearch.randomizedtesting.ThreadLeakControl$StatementRunner.run(ThreadLeakControl.java:358)
	at com.carrotsearch.randomizedtesting.ThreadLeakControl.forkTimeoutingTask(ThreadLeakControl.java:782)
	at com.carrotsearch.randomizedtesting.ThreadLeakControl$3.evaluate(ThreadLeakControl.java:442)
	at com.carrotsearch.randomizedtesting.RandomizedRunner.runSingleTest(RandomizedRunner.java:746)
	at com.carrotsearch.randomizedtesting.RandomizedRunner$3.evaluate(RandomizedRunner.java:648)
	at com.carrotsearch.randomizedtesting.RandomizedRunner$4.evaluate(RandomizedRunner.java:682)
	at com.carrotsearch.randomizedtesting.RandomizedRunner$5.evaluate(RandomizedRunner.java:693)
	at org.apache.lucene.util.AbstractBeforeAfterRule$1.evaluate(AbstractBeforeAfterRule.java:45)
	at org.apache.lucene.util.TestRuleStoreClassName$1.evaluate(TestRuleStoreClassName.java:42)
	at com.carrotsearch.randomizedtesting.rules.SystemPropertiesInvariantRule$1.evaluate(SystemPropertiesInvariantRule.java:55)
	at com.carrotsearch.randomizedtesting.rules.NoShadowingOrOverridesOnMethodsRule$1.evaluate(NoShadowingOrOverridesOnMethodsRule.java:39)
	at com.carrotsearch.randomizedtesting.rules.NoShadowingOrOverridesOnMethodsRule$1.evaluate(NoShadowingOrOverridesOnMethodsRule.java:39)
	at com.carrotsearch.randomizedtesting.rules.StatementAdapter.evaluate(StatementAdapter.java:36)
	at org.apache.lucene.util.TestRuleAssertionsRequired$1.evaluate(TestRuleAssertionsRequired.java:43)
	at org.apache.lucene.util.TestRuleMarkFailure$1.evaluate(TestRuleMarkFailure.java:48)
	at org.apache.lucene.util.TestRuleIgnoreAfterMaxFailures$1.evaluate(TestRuleIgnoreAfterMaxFailures.java:70)
	at org.apache.lucene.util.TestRuleIgnoreTestSuites$1.evaluate(TestRuleIgnoreTestSuites.java:55)
	at com.carrotsearch.randomizedtesting.rules.StatementAdapter.evaluate(StatementAdapter.java:36)
	at com.carrotsearch.randomizedtesting.ThreadLeakControl$StatementRunner.run(ThreadLeakControl.java:358)
	at java.lang.Thread.run(Thread.java:679)


FAILED:  org.apache.solr.schema.DateFieldTest.testToInternal

Error Message:
Could not initialize class org.apache.solr.schema.DateField

Stack Trace:
java.lang.NoClassDefFoundError: Could not initialize class org.apache.solr.schema.DateField
	at __randomizedtesting.SeedInfo.seed([34D4249406B52492:761E30C523BF7E58]:0)
	at org.apache.solr.schema.DateFieldTest.setUp(DateFieldTest.java:39)
	at sun.reflect.GeneratedMethodAccessor1.invoke(Unknown Source)
	at sun.reflect.DelegatingMethodAccessorImpl.invoke(DelegatingMethodAccessorImpl.java:43)
	at java.lang.reflect.Method.invoke(Method.java:616)
	at com.carrotsearch.randomizedtesting.RandomizedRunner.invoke(RandomizedRunner.java:1559)
	at com.carrotsearch.randomizedtesting.RandomizedRunner.access$600(RandomizedRunner.java:79)
	at com.carrotsearch.randomizedtesting.RandomizedRunner$7.evaluate(RandomizedRunner.java:771)
	at com.carrotsearch.randomizedtesting.RandomizedRunner$8.evaluate(RandomizedRunner.java:787)
	at org.apache.lucene.util.TestRuleSetupTeardownChained$1.evaluate(TestRuleSetupTeardownChained.java:50)
	at org.apache.lucene.util.TestRuleFieldCacheSanity$1.evaluate(TestRuleFieldCacheSanity.java:51)
	at org.apache.lucene.util.AbstractBeforeAfterRule$1.evaluate(AbstractBeforeAfterRule.java:45)
	at com.carrotsearch.randomizedtesting.rules.SystemPropertiesInvariantRule$1.evaluate(SystemPropertiesInvariantRule.java:55)
	at org.apache.lucene.util.TestRuleThreadAndTestName$1.evaluate(TestRuleThreadAndTestName.java:48)
	at org.apache.lucene.util.TestRuleIgnoreAfterMaxFailures$1.evaluate(TestRuleIgnoreAfterMaxFailures.java:70)
	at org.apache.lucene.util.TestRuleMarkFailure$1.evaluate(TestRuleMarkFailure.java:48)
	at com.carrotsearch.randomizedtesting.rules.StatementAdapter.evaluate(StatementAdapter.java:36)
	at com.carrotsearch.randomizedtesting.ThreadLeakControl$StatementRunner.run(ThreadLeakControl.java:358)
	at com.carrotsearch.randomizedtesting.ThreadLeakControl.forkTimeoutingTask(ThreadLeakControl.java:782)
	at com.carrotsearch.randomizedtesting.ThreadLeakControl$3.evaluate(ThreadLeakControl.java:442)
	at com.carrotsearch.randomizedtesting.RandomizedRunner.runSingleTest(RandomizedRunner.java:746)
	at com.carrotsearch.randomizedtesting.RandomizedRunner$3.evaluate(RandomizedRunner.java:648)
	at com.carrotsearch.randomizedtesting.RandomizedRunner$4.evaluate(RandomizedRunner.java:682)
	at com.carrotsearch.randomizedtesting.RandomizedRunner$5.evaluate(RandomizedRunner.java:693)
	at org.apache.lucene.util.AbstractBeforeAfterRule$1.evaluate(AbstractBeforeAfterRule.java:45)
	at org.apache.lucene.util.TestRuleStoreClassName$1.evaluate(TestRuleStoreClassName.java:42)
	at com.carrotsearch.randomizedtesting.rules.SystemPropertiesInvariantRule$1.evaluate(SystemPropertiesInvariantRule.java:55)
	at com.carrotsearch.randomizedtesting.rules.NoShadowingOrOverridesOnMethodsRule$1.evaluate(NoShadowingOrOverridesOnMethodsRule.java:39)
	at com.carrotsearch.randomizedtesting.rules.NoShadowingOrOverridesOnMethodsRule$1.evaluate(NoShadowingOrOverridesOnMethodsRule.java:39)
	at com.carrotsearch.randomizedtesting.rules.StatementAdapter.evaluate(StatementAdapter.java:36)
	at org.apache.lucene.util.TestRuleAssertionsRequired$1.evaluate(TestRuleAssertionsRequired.java:43)
	at org.apache.lucene.util.TestRuleMarkFailure$1.evaluate(TestRuleMarkFailure.java:48)
	at org.apache.lucene.util.TestRuleIgnoreAfterMaxFailures$1.evaluate(TestRuleIgnoreAfterMaxFailures.java:70)
	at org.apache.lucene.util.TestRuleIgnoreTestSuites$1.evaluate(TestRuleIgnoreTestSuites.java:55)
	at com.carrotsearch.randomizedtesting.rules.StatementAdapter.evaluate(StatementAdapter.java:36)
	at com.carrotsearch.randomizedtesting.ThreadLeakControl$StatementRunner.run(ThreadLeakControl.java:358)
	at java.lang.Thread.run(Thread.java:679)


FAILED:  org.apache.solr.schema.ExternalFileFieldSortTest.org.apache.solr.schema.ExternalFileFieldSortTest

Error Message:
Could not initialize class org.apache.solr.SolrTestCaseJ4

Stack Trace:
java.lang.NoClassDefFoundError: Could not initialize class org.apache.solr.SolrTestCaseJ4
	at java.lang.Class.forName0(Native Method)
	at java.lang.Class.forName(Class.java:264)
	at com.carrotsearch.randomizedtesting.RandomizedRunner$1.run(RandomizedRunner.java:486)


FAILED:  org.apache.solr.schema.IndexSchemaRuntimeFieldTest.org.apache.solr.schema.IndexSchemaRuntimeFieldTest

Error Message:
Could not initialize class org.apache.solr.SolrTestCaseJ4

Stack Trace:
java.lang.NoClassDefFoundError: Could not initialize class org.apache.solr.SolrTestCaseJ4
	at java.lang.Class.forName0(Native Method)
	at java.lang.Class.forName(Class.java:264)
	at com.carrotsearch.randomizedtesting.RandomizedRunner$1.run(RandomizedRunner.java:486)


FAILED:  org.apache.solr.schema.IndexSchemaTest.org.apache.solr.schema.IndexSchemaTest

Error Message:
Could not initialize class org.apache.solr.SolrTestCaseJ4

Stack Trace:
java.lang.NoClassDefFoundError: Could not initialize class org.apache.solr.SolrTestCaseJ4
	at java.lang.Class.forName0(Native Method)
	at java.lang.Class.forName(Class.java:264)
	at com.carrotsearch.randomizedtesting.RandomizedRunner$1.run(RandomizedRunner.java:486)


FAILED:  org.apache.solr.schema.MultiTermTest.org.apache.solr.schema.MultiTermTest

Error Message:
Could not initialize class org.apache.solr.SolrTestCaseJ4

Stack Trace:
java.lang.NoClassDefFoundError: Could not initialize class org.apache.solr.SolrTestCaseJ4
	at java.lang.Class.forName0(Native Method)
	at java.lang.Class.forName(Class.java:264)
	at com.carrotsearch.randomizedtesting.RandomizedRunner$1.run(RandomizedRunner.java:486)


FAILED:  org.apache.solr.schema.NotRequiredUniqueKeyTest.org.apache.solr.schema.NotRequiredUniqueKeyTest

Error Message:
Could not initialize class org.apache.solr.SolrTestCaseJ4

Stack Trace:
java.lang.NoClassDefFoundError: Could not initialize class org.apache.solr.SolrTestCaseJ4
	at java.lang.Class.forName0(Native Method)
	at java.lang.Class.forName(Class.java:264)
	at com.carrotsearch.randomizedtesting.RandomizedRunner$1.run(RandomizedRunner.java:486)


FAILED:  org.apache.solr.schema.NumericFieldsTest.org.apache.solr.schema.NumericFieldsTest

Error Message:
Could not initialize class org.apache.solr.SolrTestCaseJ4

Stack Trace:
java.lang.NoClassDefFoundError: Could not initialize class org.apache.solr.SolrTestCaseJ4
	at java.lang.Class.forName0(Native Method)
	at java.lang.Class.forName(Class.java:264)
	at com.carrotsearch.randomizedtesting.RandomizedRunner$1.run(RandomizedRunner.java:486)


FAILED:  org.apache.solr.schema.OpenExchangeRatesOrgProviderTest.org.apache.solr.schema.OpenExchangeRatesOrgProviderTest

Error Message:
Could not initialize class org.apache.solr.SolrTestCaseJ4

Stack Trace:
java.lang.NoClassDefFoundError: Could not initialize class org.apache.solr.SolrTestCaseJ4
	at java.lang.Class.forName0(Native Method)
	at java.lang.Class.forName(Class.java:264)
	at com.carrotsearch.randomizedtesting.RandomizedRunner$1.run(RandomizedRunner.java:486)


FAILED:  org.apache.solr.schema.PolyFieldTest.org.apache.solr.schema.PolyFieldTest

Error Message:
Could not initialize class org.apache.solr.SolrTestCaseJ4

Stack Trace:
java.lang.NoClassDefFoundError: Could not initialize class org.apache.solr.SolrTestCaseJ4
	at java.lang.Class.forName0(Native Method)
	at java.lang.Class.forName(Class.java:264)
	at com.carrotsearch.randomizedtesting.RandomizedRunner$1.run(RandomizedRunner.java:486)


FAILED:  org.apache.solr.schema.PreAnalyzedFieldTest.testValidSimple

Error Message:
org.apache.solr.schema.FieldType

Stack Trace:
java.lang.NoClassDefFoundError: org.apache.solr.schema.FieldType
	at __randomizedtesting.SeedInfo.seed([75EA77CD546B5290:644801F4AA5CDC9D]:0)
	at org.apache.solr.schema.PreAnalyzedFieldTest.setUp(PreAnalyzedFieldTest.java:75)
	at sun.reflect.GeneratedMethodAccessor1.invoke(Unknown Source)
	at sun.reflect.DelegatingMethodAccessorImpl.invoke(DelegatingMethodAccessorImpl.java:43)
	at java.lang.reflect.Method.invoke(Method.java:616)
	at com.carrotsearch.randomizedtesting.RandomizedRunner.invoke(RandomizedRunner.java:1559)
	at com.carrotsearch.randomizedtesting.RandomizedRunner.access$600(RandomizedRunner.java:79)
	at com.carrotsearch.randomizedtesting.RandomizedRunner$7.evaluate(RandomizedRunner.java:771)
	at com.carrotsearch.randomizedtesting.RandomizedRunner$8.evaluate(RandomizedRunner.java:787)
	at org.apache.lucene.util.TestRuleSetupTeardownChained$1.evaluate(TestRuleSetupTeardownChained.java:50)
	at org.apache.lucene.util.TestRuleFieldCacheSanity$1.evaluate(TestRuleFieldCacheSanity.java:51)
	at org.apache.lucene.util.AbstractBeforeAfterRule$1.evaluate(AbstractBeforeAfterRule.java:45)
	at com.carrotsearch.randomizedtesting.rules.SystemPropertiesInvariantRule$1.evaluate(SystemPropertiesInvariantRule.java:55)
	at org.apache.lucene.util.TestRuleThreadAndTestName$1.evaluate(TestRuleThreadAndTestName.java:48)
	at org.apache.lucene.util.TestRuleIgnoreAfterMaxFailures$1.evaluate(TestRuleIgnoreAfterMaxFailures.java:70)
	at org.apache.lucene.util.TestRuleMarkFailure$1.evaluate(TestRuleMarkFailure.java:48)
	at com.carrotsearch.randomizedtesting.rules.StatementAdapter.evaluate(StatementAdapter.java:36)
	at com.carrotsearch.randomizedtesting.ThreadLeakControl$StatementRunner.run(ThreadLeakControl.java:358)
	at com.carrotsearch.randomizedtesting.ThreadLeakControl.forkTimeoutingTask(ThreadLeakControl.java:782)
	at com.carrotsearch.randomizedtesting.ThreadLeakControl$3.evaluate(ThreadLeakControl.java:442)
	at com.carrotsearch.randomizedtesting.RandomizedRunner.runSingleTest(RandomizedRunner.java:746)
	at com.carrotsearch.randomizedtesting.RandomizedRunner$3.evaluate(RandomizedRunner.java:648)
	at com.carrotsearch.randomizedtesting.RandomizedRunner$4.evaluate(RandomizedRunner.java:682)
	at com.carrotsearch.randomizedtesting.RandomizedRunner$5.evaluate(RandomizedRunner.java:693)
	at org.apache.lucene.util.AbstractBeforeAfterRule$1.evaluate(AbstractBeforeAfterRule.java:45)
	at org.apache.lucene.util.TestRuleStoreClassName$1.evaluate(TestRuleStoreClassName.java:42)
	at com.carrotsearch.randomizedtesting.rules.SystemPropertiesInvariantRule$1.evaluate(SystemPropertiesInvariantRule.java:55)
	at com.carrotsearch.randomizedtesting.rules.NoShadowingOrOverridesOnMethodsRule$1.evaluate(NoShadowingOrOverridesOnMethodsRule.java:39)
	at com.carrotsearch.randomizedtesting.rules.NoShadowingOrOverridesOnMethodsRule$1.evaluate(NoShadowingOrOverridesOnMethodsRule.java:39)
	at com.carrotsearch.randomizedtesting.rules.StatementAdapter.evaluate(StatementAdapter.java:36)
	at org.apache.lucene.util.TestRuleAssertionsRequired$1.evaluate(TestRuleAssertionsRequired.java:43)
	at org.apache.lucene.util.TestRuleMarkFailure$1.evaluate(TestRuleMarkFailure.java:48)
	at org.apache.lucene.util.TestRuleIgnoreAfterMaxFailures$1.evaluate(TestRuleIgnoreAfterMaxFailures.java:70)
	at org.apache.lucene.util.TestRuleIgnoreTestSuites$1.evaluate(TestRuleIgnoreTestSuites.java:55)
	at com.carrotsearch.randomizedtesting.rules.StatementAdapter.evaluate(StatementAdapter.java:36)
	at com.carrotsearch.randomizedtesting.ThreadLeakControl$StatementRunner.run(ThreadLeakControl.java:358)
	at java.lang.Thread.run(Thread.java:679)


FAILED:  org.apache.solr.schema.PreAnalyzedFieldTest.testParsers

Error Message:
org.apache.solr.schema.FieldType

Stack Trace:
java.lang.NoClassDefFoundError: org.apache.solr.schema.FieldType
	at __randomizedtesting.SeedInfo.seed([75EA77CD546B5290:820B1CB154E54769]:0)
	at org.apache.solr.schema.PreAnalyzedFieldTest.setUp(PreAnalyzedFieldTest.java:75)
	at sun.reflect.GeneratedMethodAccessor1.invoke(Unknown Source)
	at sun.reflect.DelegatingMethodAccessorImpl.invoke(DelegatingMethodAccessorImpl.java:43)
	at java.lang.reflect.Method.invoke(Method.java:616)
	at com.carrotsearch.randomizedtesting.RandomizedRunner.invoke(RandomizedRunner.java:1559)
	at com.carrotsearch.randomizedtesting.RandomizedRunner.access$600(RandomizedRunner.java:79)
	at com.carrotsearch.randomizedtesting.RandomizedRunner$7.evaluate(RandomizedRunner.java:771)
	at com.carrotsearch.randomizedtesting.RandomizedRunner$8.evaluate(RandomizedRunner.java:787)
	at org.apache.lucene.util.TestRuleSetupTeardownChained$1.evaluate(TestRuleSetupTeardownChained.java:50)
	at org.apache.lucene.util.TestRuleFieldCacheSanity$1.evaluate(TestRuleFieldCacheSanity.java:51)
	at org.apache.lucene.util.AbstractBeforeAfterRule$1.evaluate(AbstractBeforeAfterRule.java:45)
	at com.carrotsearch.randomizedtesting.rules.SystemPropertiesInvariantRule$1.evaluate(SystemPropertiesInvariantRule.java:55)
	at org.apache.lucene.util.TestRuleThreadAndTestName$1.evaluate(TestRuleThreadAndTestName.java:48)
	at org.apache.lucene.util.TestRuleIgnoreAfterMaxFailures$1.evaluate(TestRuleIgnoreAfterMaxFailures.java:70)
	at org.apache.lucene.util.TestRuleMarkFailure$1.evaluate(TestRuleMarkFailure.java:48)
	at com.carrotsearch.randomizedtesting.rules.StatementAdapter.evaluate(StatementAdapter.java:36)
	at com.carrotsearch.randomizedtesting.ThreadLeakControl$StatementRunner.run(ThreadLeakControl.java:358)
	at com.carrotsearch.randomizedtesting.ThreadLeakControl.forkTimeoutingTask(ThreadLeakControl.java:782)
	at com.carrotsearch.randomizedtesting.ThreadLeakControl$3.evaluate(ThreadLeakControl.java:442)
	at com.carrotsearch.randomizedtesting.RandomizedRunner.runSingleTest(RandomizedRunner.java:746)
	at com.carrotsearch.randomizedtesting.RandomizedRunner$3.evaluate(RandomizedRunner.java:648)
	at com.carrotsearch.randomizedtesting.RandomizedRunner$4.evaluate(RandomizedRunner.java:682)
	at com.carrotsearch.randomizedtesting.RandomizedRunner$5.evaluate(RandomizedRunner.java:693)
	at org.apache.lucene.util.AbstractBeforeAfterRule$1.evaluate(AbstractBeforeAfterRule.java:45)
	at org.apache.lucene.util.TestRuleStoreClassName$1.evaluate(TestRuleStoreClassName.java:42)
	at com.carrotsearch.randomizedtesting.rules.SystemPropertiesInvariantRule$1.evaluate(SystemPropertiesInvariantRule.java:55)
	at com.carrotsearch.randomizedtesting.rules.NoShadowingOrOverridesOnMethodsRule$1.evaluate(NoShadowingOrOverridesOnMethodsRule.java:39)
	at com.carrotsearch.randomizedtesting.rules.NoShadowingOrOverridesOnMethodsRule$1.evaluate(NoShadowingOrOverridesOnMethodsRule.java:39)
	at com.carrotsearch.randomizedtesting.rules.StatementAdapter.evaluate(StatementAdapter.java:36)
	at org.apache.lucene.util.TestRuleAssertionsRequired$1.evaluate(TestRuleAssertionsRequired.java:43)
	at org.apache.lucene.util.TestRuleMarkFailure$1.evaluate(TestRuleMarkFailure.java:48)
	at org.apache.lucene.util.TestRuleIgnoreAfterMaxFailures$1.evaluate(TestRuleIgnoreAfterMaxFailures.java:70)
	at org.apache.lucene.util.TestRuleIgnoreTestSuites$1.evaluate(TestRuleIgnoreTestSuites.java:55)
	at com.carrotsearch.randomizedtesting.rules.StatementAdapter.evaluate(StatementAdapter.java:36)
	at com.carrotsearch.randomizedtesting.ThreadLeakControl$StatementRunner.run(ThreadLeakControl.java:358)
	at java.lang.Thread.run(Thread.java:679)


FAILED:  org.apache.solr.schema.PreAnalyzedFieldTest.testInvalidSimple

Error Message:
org.apache.solr.schema.FieldType

Stack Trace:
java.lang.NoClassDefFoundError: org.apache.solr.schema.FieldType
	at __randomizedtesting.SeedInfo.seed([75EA77CD546B5290:952C9D66B687EF1B]:0)
	at org.apache.solr.schema.PreAnalyzedFieldTest.setUp(PreAnalyzedFieldTest.java:75)
	at sun.reflect.GeneratedMethodAccessor1.invoke(Unknown Source)
	at sun.reflect.DelegatingMethodAccessorImpl.invoke(DelegatingMethodAccessorImpl.java:43)
	at java.lang.reflect.Method.invoke(Method.java:616)
	at com.carrotsearch.randomizedtesting.RandomizedRunner.invoke(RandomizedRunner.java:1559)
	at com.carrotsearch.randomizedtesting.RandomizedRunner.access$600(RandomizedRunner.java:79)
	at com.carrotsearch.randomizedtesting.RandomizedRunner$7.evaluate(RandomizedRunner.java:771)
	at com.carrotsearch.randomizedtesting.RandomizedRunner$8.evaluate(RandomizedRunner.java:787)
	at org.apache.lucene.util.TestRuleSetupTeardownChained$1.evaluate(TestRuleSetupTeardownChained.java:50)
	at org.apache.lucene.util.TestRuleFieldCacheSanity$1.evaluate(TestRuleFieldCacheSanity.java:51)
	at org.apache.lucene.util.AbstractBeforeAfterRule$1.evaluate(AbstractBeforeAfterRule.java:45)
	at com.carrotsearch.randomizedtesting.rules.SystemPropertiesInvariantRule$1.evaluate(SystemPropertiesInvariantRule.java:55)
	at org.apache.lucene.util.TestRuleThreadAndTestName$1.evaluate(TestRuleThreadAndTestName.java:48)
	at org.apache.lucene.util.TestRuleIgnoreAfterMaxFailures$1.evaluate(TestRuleIgnoreAfterMaxFailures.java:70)
	at org.apache.lucene.util.TestRuleMarkFailure$1.evaluate(TestRuleMarkFailure.java:48)
	at com.carrotsearch.randomizedtesting.rules.StatementAdapter.evaluate(StatementAdapter.java:36)
	at com.carrotsearch.randomizedtesting.ThreadLeakControl$StatementRunner.run(ThreadLeakControl.java:358)
	at com.carrotsearch.randomizedtesting.ThreadLeakControl.forkTimeoutingTask(ThreadLeakControl.java:782)
	at com.carrotsearch.randomizedtesting.ThreadLeakControl$3.evaluate(ThreadLeakControl.java:442)
	at com.carrotsearch.randomizedtesting.RandomizedRunner.runSingleTest(RandomizedRunner.java:746)
	at com.carrotsearch.randomizedtesting.RandomizedRunner$3.evaluate(RandomizedRunner.java:648)
	at com.carrotsearch.randomizedtesting.RandomizedRunner$4.evaluate(RandomizedRunner.java:682)
	at com.carrotsearch.randomizedtesting.RandomizedRunner$5.evaluate(RandomizedRunner.java:693)
	at org.apache.lucene.util.AbstractBeforeAfterRule$1.evaluate(AbstractBeforeAfterRule.java:45)
	at org.apache.lucene.util.TestRuleStoreClassName$1.evaluate(TestRuleStoreClassName.java:42)
	at com.carrotsearch.randomizedtesting.rules.SystemPropertiesInvariantRule$1.evaluate(SystemPropertiesInvariantRule.java:55)
	at com.carrotsearch.randomizedtesting.rules.NoShadowingOrOverridesOnMethodsRule$1.evaluate(NoShadowingOrOverridesOnMethodsRule.java:39)
	at com.carrotsearch.randomizedtesting.rules.NoShadowingOrOverridesOnMethodsRule$1.evaluate(NoShadowingOrOverridesOnMethodsRule.java:39)
	at com.carrotsearch.randomizedtesting.rules.StatementAdapter.evaluate(StatementAdapter.java:36)
	at org.apache.lucene.util.TestRuleAssertionsRequired$1.evaluate(TestRuleAssertionsRequired.java:43)
	at org.apache.lucene.util.TestRuleMarkFailure$1.evaluate(TestRuleMarkFailure.java:48)
	at org.apache.lucene.util.TestRuleIgnoreAfterMaxFailures$1.evaluate(TestRuleIgnoreAfterMaxFailures.java:70)
	at org.apache.lucene.util.TestRuleIgnoreTestSuites$1.evaluate(TestRuleIgnoreTestSuites.java:55)
	at com.carrotsearch.randomizedtesting.rules.StatementAdapter.evaluate(StatementAdapter.java:36)
	at com.carrotsearch.randomizedtesting.ThreadLeakControl$StatementRunner.run(ThreadLeakControl.java:358)
	at java.lang.Thread.run(Thread.java:679)


FAILED:  org.apache.solr.schema.PrimitiveFieldTypeTest.org.apache.solr.schema.PrimitiveFieldTypeTest

Error Message:
Could not initialize class org.apache.solr.SolrTestCaseJ4

Stack Trace:
java.lang.NoClassDefFoundError: Could not initialize class org.apache.solr.SolrTestCaseJ4
	at java.lang.Class.forName0(Native Method)
	at java.lang.Class.forName(Class.java:264)
	at com.carrotsearch.randomizedtesting.RandomizedRunner$1.run(RandomizedRunner.java:486)


FAILED:  org.apache.solr.schema.RequiredFieldsTest.org.apache.solr.schema.RequiredFieldsTest

Error Message:
Could not initialize class org.apache.solr.SolrTestCaseJ4

Stack Trace:
java.lang.NoClassDefFoundError: Could not initialize class org.apache.solr.SolrTestCaseJ4
	at java.lang.Class.forName0(Native Method)
	at java.lang.Class.forName(Class.java:264)
	at com.carrotsearch.randomizedtesting.RandomizedRunner$1.run(RandomizedRunner.java:486)


FAILED:  org.apache.solr.schema.TestBinaryField.testSimple

Error Message:
Could not initialize class org.apache.log4j.Log4jLoggerFactory

Stack Trace:
java.lang.NoClassDefFoundError: Could not initialize class org.apache.log4j.Log4jLoggerFactory
	at org.apache.log4j.LogManager.getLogger(LogManager.java:42)
	at org.slf4j.impl.Log4jLoggerFactory.getLogger(Log4jLoggerFactory.java:73)
	at org.slf4j.LoggerFactory.getLogger(LoggerFactory.java:253)
	at org.slf4j.LoggerFactory.getLogger(LoggerFactory.java:265)
	at org.apache.solr.core.SolrResourceLoader.<clinit>(SolrResourceLoader.java:70)
	at org.apache.solr.schema.TestBinaryField.setUp(TestBinaryField.java:71)
	at sun.reflect.GeneratedMethodAccessor1.invoke(Unknown Source)
	at sun.reflect.DelegatingMethodAccessorImpl.invoke(DelegatingMethodAccessorImpl.java:43)
	at java.lang.reflect.Method.invoke(Method.java:616)
	at com.carrotsearch.randomizedtesting.RandomizedRunner.invoke(RandomizedRunner.java:1559)
	at com.carrotsearch.randomizedtesting.RandomizedRunner.access$600(RandomizedRunner.java:79)
	at com.carrotsearch.randomizedtesting.RandomizedRunner$7.evaluate(RandomizedRunner.java:771)
	at com.carrotsearch.randomizedtesting.RandomizedRunner$8.evaluate(RandomizedRunner.java:787)
	at com.carrotsearch.randomizedtesting.rules.SystemPropertiesRestoreRule$1.evaluate(SystemPropertiesRestoreRule.java:53)
	at org.apache.lucene.util.TestRuleSetupTeardownChained$1.evaluate(TestRuleSetupTeardownChained.java:50)
	at org.apache.lucene.util.TestRuleFieldCacheSanity$1.evaluate(TestRuleFieldCacheSanity.java:51)
	at org.apache.lucene.util.AbstractBeforeAfterRule$1.evaluate(AbstractBeforeAfterRule.java:45)
	at com.carrotsearch.randomizedtesting.rules.SystemPropertiesInvariantRule$1.evaluate(SystemPropertiesInvariantRule.java:55)
	at org.apache.lucene.util.TestRuleThreadAndTestName$1.evaluate(TestRuleThreadAndTestName.java:48)
	at org.apache.lucene.util.TestRuleIgnoreAfterMaxFailures$1.evaluate(TestRuleIgnoreAfterMaxFailures.java:70)
	at org.apache.lucene.util.TestRuleMarkFailure$1.evaluate(TestRuleMarkFailure.java:48)
	at com.carrotsearch.randomizedtesting.rules.StatementAdapter.evaluate(StatementAdapter.java:36)
	at com.carrotsearch.randomizedtesting.ThreadLeakControl$StatementRunner.run(ThreadLeakControl.java:358)
	at com.carrotsearch.randomizedtesting.ThreadLeakControl.forkTimeoutingTask(ThreadLeakControl.java:782)
	at com.carrotsearch.randomizedtesting.ThreadLeakControl$3.evaluate(ThreadLeakControl.java:442)
	at com.carrotsearch.randomizedtesting.RandomizedRunner.runSingleTest(RandomizedRunner.java:746)
	at com.carrotsearch.randomizedtesting.RandomizedRunner$3.evaluate(RandomizedRunner.java:648)
	at com.carrotsearch.randomizedtesting.RandomizedRunner$4.evaluate(RandomizedRunner.java:682)
	at com.carrotsearch.randomizedtesting.RandomizedRunner$5.evaluate(RandomizedRunner.java:693)
	at org.apache.lucene.util.AbstractBeforeAfterRule$1.evaluate(AbstractBeforeAfterRule.java:45)
	at org.apache.lucene.util.TestRuleStoreClassName$1.evaluate(TestRuleStoreClassName.java:42)
	at com.carrotsearch.randomizedtesting.rules.SystemPropertiesInvariantRule$1.evaluate(SystemPropertiesInvariantRule.java:55)
	at com.carrotsearch.randomizedtesting.rules.NoShadowingOrOverridesOnMethodsRule$1.evaluate(NoShadowingOrOverridesOnMethodsRule.java:39)
	at com.carrotsearch.randomizedtesting.rules.NoShadowingOrOverridesOnMethodsRule$1.evaluate(NoShadowingOrOverridesOnMethodsRule.java:39)
	at com.carrotsearch.randomi

[...truncated too long message...]

adLeakControl.java:358)
	at com.carrotsearch.randomizedtesting.ThreadLeakControl.forkTimeoutingTask(ThreadLeakControl.java:782)
	at com.carrotsearch.randomizedtesting.ThreadLeakControl$3.evaluate(ThreadLeakControl.java:442)
	at com.carrotsearch.randomizedtesting.RandomizedRunner.runSingleTest(RandomizedRunner.java:746)
	at com.carrotsearch.randomizedtesting.RandomizedRunner$3.evaluate(RandomizedRunner.java:648)
	at com.carrotsearch.randomizedtesting.RandomizedRunner$4.evaluate(RandomizedRunner.java:682)
	at com.carrotsearch.randomizedtesting.RandomizedRunner$5.evaluate(RandomizedRunner.java:693)
	at org.apache.lucene.util.AbstractBeforeAfterRule$1.evaluate(AbstractBeforeAfterRule.java:45)
	at org.apache.lucene.util.TestRuleStoreClassName$1.evaluate(TestRuleStoreClassName.java:42)
	at com.carrotsearch.randomizedtesting.rules.SystemPropertiesInvariantRule$1.evaluate(SystemPropertiesInvariantRule.java:55)
	at com.carrotsearch.randomizedtesting.rules.NoShadowingOrOverridesOnMethodsRule$1.evaluate(NoShadowingOrOverridesOnMethodsRule.java:39)
	at com.carrotsearch.randomizedtesting.rules.NoShadowingOrOverridesOnMethodsRule$1.evaluate(NoShadowingOrOverridesOnMethodsRule.java:39)
	at com.carrotsearch.randomizedtesting.rules.StatementAdapter.evaluate(StatementAdapter.java:36)
	at org.apache.lucene.util.TestRuleAssertionsRequired$1.evaluate(TestRuleAssertionsRequired.java:43)
	at org.apache.lucene.util.TestRuleMarkFailure$1.evaluate(TestRuleMarkFailure.java:48)
	at org.apache.lucene.util.TestRuleIgnoreAfterMaxFailures$1.evaluate(TestRuleIgnoreAfterMaxFailures.java:70)
	at org.apache.lucene.util.TestRuleIgnoreTestSuites$1.evaluate(TestRuleIgnoreTestSuites.java:55)
	at com.carrotsearch.randomizedtesting.rules.StatementAdapter.evaluate(StatementAdapter.java:36)
	at com.carrotsearch.randomizedtesting.ThreadLeakControl$StatementRunner.run(ThreadLeakControl.java:358)
	at java.lang.Thread.run(Thread.java:679)


FAILED:  org.apache.solr.common.util.ContentStreamTest.testURLStream

Error Message:
Could not initialize class org.apache.solr.core.SolrResourceLoader

Stack Trace:
java.lang.NoClassDefFoundError: Could not initialize class org.apache.solr.core.SolrResourceLoader
	at __randomizedtesting.SeedInfo.seed([14D06C31DA92FB1B:24547B182E262D9F]:0)
	at org.apache.solr.common.util.ContentStreamTest.testURLStream(ContentStreamTest.java:63)
	at sun.reflect.NativeMethodAccessorImpl.invoke0(Native Method)
	at sun.reflect.NativeMethodAccessorImpl.invoke(NativeMethodAccessorImpl.java:57)
	at sun.reflect.DelegatingMethodAccessorImpl.invoke(DelegatingMethodAccessorImpl.java:43)
	at java.lang.reflect.Method.invoke(Method.java:616)
	at com.carrotsearch.randomizedtesting.RandomizedRunner.invoke(RandomizedRunner.java:1559)
	at com.carrotsearch.randomizedtesting.RandomizedRunner.access$600(RandomizedRunner.java:79)
	at com.carrotsearch.randomizedtesting.RandomizedRunner$6.evaluate(RandomizedRunner.java:737)
	at com.carrotsearch.randomizedtesting.RandomizedRunner$7.evaluate(RandomizedRunner.java:773)
	at com.carrotsearch.randomizedtesting.RandomizedRunner$8.evaluate(RandomizedRunner.java:787)
	at org.apache.lucene.util.TestRuleSetupTeardownChained$1.evaluate(TestRuleSetupTeardownChained.java:50)
	at org.apache.lucene.util.TestRuleFieldCacheSanity$1.evaluate(TestRuleFieldCacheSanity.java:51)
	at org.apache.lucene.util.AbstractBeforeAfterRule$1.evaluate(AbstractBeforeAfterRule.java:45)
	at com.carrotsearch.randomizedtesting.rules.SystemPropertiesInvariantRule$1.evaluate(SystemPropertiesInvariantRule.java:55)
	at org.apache.lucene.util.TestRuleThreadAndTestName$1.evaluate(TestRuleThreadAndTestName.java:48)
	at org.apache.lucene.util.TestRuleIgnoreAfterMaxFailures$1.evaluate(TestRuleIgnoreAfterMaxFailures.java:70)
	at org.apache.lucene.util.TestRuleMarkFailure$1.evaluate(TestRuleMarkFailure.java:48)
	at com.carrotsearch.randomizedtesting.rules.StatementAdapter.evaluate(StatementAdapter.java:36)
	at com.carrotsearch.randomizedtesting.ThreadLeakControl$StatementRunner.run(ThreadLeakControl.java:358)
	at com.carrotsearch.randomizedtesting.ThreadLeakControl.forkTimeoutingTask(ThreadLeakControl.java:782)
	at com.carrotsearch.randomizedtesting.ThreadLeakControl$3.evaluate(ThreadLeakControl.java:442)
	at com.carrotsearch.randomizedtesting.RandomizedRunner.runSingleTest(RandomizedRunner.java:746)
	at com.carrotsearch.randomizedtesting.RandomizedRunner$3.evaluate(RandomizedRunner.java:648)
	at com.carrotsearch.randomizedtesting.RandomizedRunner$4.evaluate(RandomizedRunner.java:682)
	at com.carrotsearch.randomizedtesting.RandomizedRunner$5.evaluate(RandomizedRunner.java:693)
	at org.apache.lucene.util.AbstractBeforeAfterRule$1.evaluate(AbstractBeforeAfterRule.java:45)
	at org.apache.lucene.util.TestRuleStoreClassName$1.evaluate(TestRuleStoreClassName.java:42)
	at com.carrotsearch.randomizedtesting.rules.SystemPropertiesInvariantRule$1.evaluate(SystemPropertiesInvariantRule.java:55)
	at com.carrotsearch.randomizedtesting.rules.NoShadowingOrOverridesOnMethodsRule$1.evaluate(NoShadowingOrOverridesOnMethodsRule.java:39)
	at com.carrotsearch.randomizedtesting.rules.NoShadowingOrOverridesOnMethodsRule$1.evaluate(NoShadowingOrOverridesOnMethodsRule.java:39)
	at com.carrotsearch.randomizedtesting.rules.StatementAdapter.evaluate(StatementAdapter.java:36)
	at org.apache.lucene.util.TestRuleAssertionsRequired$1.evaluate(TestRuleAssertionsRequired.java:43)
	at org.apache.lucene.util.TestRuleMarkFailure$1.evaluate(TestRuleMarkFailure.java:48)
	at org.apache.lucene.util.TestRuleIgnoreAfterMaxFailures$1.evaluate(TestRuleIgnoreAfterMaxFailures.java:70)
	at org.apache.lucene.util.TestRuleIgnoreTestSuites$1.evaluate(TestRuleIgnoreTestSuites.java:55)
	at com.carrotsearch.randomizedtesting.rules.StatementAdapter.evaluate(StatementAdapter.java:36)
	at com.carrotsearch.randomizedtesting.ThreadLeakControl$StatementRunner.run(ThreadLeakControl.java:358)
	at java.lang.Thread.run(Thread.java:679)


FAILED:  org.apache.solr.common.util.TestNamedListCodec.testRandom

Error Message:
Could not initialize class org.apache.solr.BaseDistributedSearchTestCase

Stack Trace:
java.lang.NoClassDefFoundError: Could not initialize class org.apache.solr.BaseDistributedSearchTestCase
	at __randomizedtesting.SeedInfo.seed([2435C5AB15D8072E:5679E0A4A4B8B15D]:0)
	at org.apache.solr.common.util.TestNamedListCodec.testRandom(TestNamedListCodec.java:255)
	at sun.reflect.NativeMethodAccessorImpl.invoke0(Native Method)
	at sun.reflect.NativeMethodAccessorImpl.invoke(NativeMethodAccessorImpl.java:57)
	at sun.reflect.DelegatingMethodAccessorImpl.invoke(DelegatingMethodAccessorImpl.java:43)
	at java.lang.reflect.Method.invoke(Method.java:616)
	at com.carrotsearch.randomizedtesting.RandomizedRunner.invoke(RandomizedRunner.java:1559)
	at com.carrotsearch.randomizedtesting.RandomizedRunner.access$600(RandomizedRunner.java:79)
	at com.carrotsearch.randomizedtesting.RandomizedRunner$6.evaluate(RandomizedRunner.java:737)
	at com.carrotsearch.randomizedtesting.RandomizedRunner$7.evaluate(RandomizedRunner.java:773)
	at com.carrotsearch.randomizedtesting.RandomizedRunner$8.evaluate(RandomizedRunner.java:787)
	at org.apache.lucene.util.TestRuleSetupTeardownChained$1.evaluate(TestRuleSetupTeardownChained.java:50)
	at org.apache.lucene.util.TestRuleFieldCacheSanity$1.evaluate(TestRuleFieldCacheSanity.java:51)
	at org.apache.lucene.util.AbstractBeforeAfterRule$1.evaluate(AbstractBeforeAfterRule.java:45)
	at com.carrotsearch.randomizedtesting.rules.SystemPropertiesInvariantRule$1.evaluate(SystemPropertiesInvariantRule.java:55)
	at org.apache.lucene.util.TestRuleThreadAndTestName$1.evaluate(TestRuleThreadAndTestName.java:48)
	at org.apache.lucene.util.TestRuleIgnoreAfterMaxFailures$1.evaluate(TestRuleIgnoreAfterMaxFailures.java:70)
	at org.apache.lucene.util.TestRuleMarkFailure$1.evaluate(TestRuleMarkFailure.java:48)
	at com.carrotsearch.randomizedtesting.rules.StatementAdapter.evaluate(StatementAdapter.java:36)
	at com.carrotsearch.randomizedtesting.ThreadLeakControl$StatementRunner.run(ThreadLeakControl.java:358)
	at com.carrotsearch.randomizedtesting.ThreadLeakControl.forkTimeoutingTask(ThreadLeakControl.java:782)
	at com.carrotsearch.randomizedtesting.ThreadLeakControl$3.evaluate(ThreadLeakControl.java:442)
	at com.carrotsearch.randomizedtesting.RandomizedRunner.runSingleTest(RandomizedRunner.java:746)
	at com.carrotsearch.randomizedtesting.RandomizedRunner$3.evaluate(RandomizedRunner.java:648)
	at com.carrotsearch.randomizedtesting.RandomizedRunner$4.evaluate(RandomizedRunner.java:682)
	at com.carrotsearch.randomizedtesting.RandomizedRunner$5.evaluate(RandomizedRunner.java:693)
	at org.apache.lucene.util.AbstractBeforeAfterRule$1.evaluate(AbstractBeforeAfterRule.java:45)
	at org.apache.lucene.util.TestRuleStoreClassName$1.evaluate(TestRuleStoreClassName.java:42)
	at com.carrotsearch.randomizedtesting.rules.SystemPropertiesInvariantRule$1.evaluate(SystemPropertiesInvariantRule.java:55)
	at com.carrotsearch.randomizedtesting.rules.NoShadowingOrOverridesOnMethodsRule$1.evaluate(NoShadowingOrOverridesOnMethodsRule.java:39)
	at com.carrotsearch.randomizedtesting.rules.NoShadowingOrOverridesOnMethodsRule$1.evaluate(NoShadowingOrOverridesOnMethodsRule.java:39)
	at com.carrotsearch.randomizedtesting.rules.StatementAdapter.evaluate(StatementAdapter.java:36)
	at org.apache.lucene.util.TestRuleAssertionsRequired$1.evaluate(TestRuleAssertionsRequired.java:43)
	at org.apache.lucene.util.TestRuleMarkFailure$1.evaluate(TestRuleMarkFailure.java:48)
	at org.apache.lucene.util.TestRuleIgnoreAfterMaxFailures$1.evaluate(TestRuleIgnoreAfterMaxFailures.java:70)
	at org.apache.lucene.util.TestRuleIgnoreTestSuites$1.evaluate(TestRuleIgnoreTestSuites.java:55)
	at com.carrotsearch.randomizedtesting.rules.StatementAdapter.evaluate(StatementAdapter.java:36)
	at com.carrotsearch.randomizedtesting.ThreadLeakControl$StatementRunner.run(ThreadLeakControl.java:358)
	at java.lang.Thread.run(Thread.java:679)




Build Log:
[...truncated 6977 lines...]



Mime
View raw message