lucene-dev mailing list archives

Site index · List index
Message view « Date » · « Thread »
Top « Date » · « Thread »
From Apache Jenkins Server <jenk...@builds.apache.org>
Subject [JENKINS] Lucene-Solr-NightlyTests-trunk - Build # 83 - Still Failing
Date Tue, 06 Nov 2012 15:45:55 GMT
Build: https://builds.apache.org/job/Lucene-Solr-NightlyTests-trunk/83/

4 tests failed.
FAILED:  junit.framework.TestSuite.org.apache.solr.request.TestRemoteStreaming

Error Message:
4 threads leaked from SUITE scope at org.apache.solr.request.TestRemoteStreaming:     1) Thread[id=36, name=qtp1867825290-36 Acceptor0 SelectChannelConnector@0.0.0.0:18647, state=RUNNABLE, group=TGRP-TestRemoteStreaming]         at sun.nio.ch.ServerSocketChannelImpl.accept0(Native Method)         at sun.nio.ch.ServerSocketChannelImpl.accept(ServerSocketChannelImpl.java:163)         at org.eclipse.jetty.server.nio.SelectChannelConnector.accept(SelectChannelConnector.java:104)         at org.eclipse.jetty.server.AbstractConnector$Acceptor.run(AbstractConnector.java:933)         at org.eclipse.jetty.util.thread.QueuedThreadPool.runJob(QueuedThreadPool.java:599)         at org.eclipse.jetty.util.thread.QueuedThreadPool$3.run(QueuedThreadPool.java:534)         at java.lang.Thread.run(Thread.java:679)    2) Thread[id=37, name=qtp1867825290-37 Acceptor1 SelectChannelConnector@0.0.0.0:18647, state=BLOCKED, group=TGRP-TestRemoteStreaming]         at sun.nio.ch.ServerSocketChannelImpl.accept(ServerSocketChannelImpl.java:147)         at org.eclipse.jetty.server.nio.SelectChannelConnector.accept(SelectChannelConnector.java:104)         at org.eclipse.jetty.server.AbstractConnector$Acceptor.run(AbstractConnector.java:933)         at org.eclipse.jetty.util.thread.QueuedThreadPool.runJob(QueuedThreadPool.java:599)         at org.eclipse.jetty.util.thread.QueuedThreadPool$3.run(QueuedThreadPool.java:534)         at java.lang.Thread.run(Thread.java:679)    3) Thread[id=38, name=qtp1867825290-38 Acceptor2 SelectChannelConnector@0.0.0.0:18647, state=BLOCKED, group=TGRP-TestRemoteStreaming]         at sun.nio.ch.ServerSocketChannelImpl.accept(ServerSocketChannelImpl.java:147)         at org.eclipse.jetty.server.nio.SelectChannelConnector.accept(SelectChannelConnector.java:104)         at org.eclipse.jetty.server.AbstractConnector$Acceptor.run(AbstractConnector.java:933)         at org.eclipse.jetty.util.thread.QueuedThreadPool.runJob(QueuedThreadPool.java:599)         at org.eclipse.jetty.util.thread.QueuedThreadPool$3.run(QueuedThreadPool.java:534)         at java.lang.Thread.run(Thread.java:679)    4) Thread[id=39, name=qtp1867825290-39 Acceptor3 SelectChannelConnector@0.0.0.0:18647, state=BLOCKED, group=TGRP-TestRemoteStreaming]         at sun.nio.ch.ServerSocketChannelImpl.accept(ServerSocketChannelImpl.java:147)         at org.eclipse.jetty.server.nio.SelectChannelConnector.accept(SelectChannelConnector.java:104)         at org.eclipse.jetty.server.AbstractConnector$Acceptor.run(AbstractConnector.java:933)         at org.eclipse.jetty.util.thread.QueuedThreadPool.runJob(QueuedThreadPool.java:599)         at org.eclipse.jetty.util.thread.QueuedThreadPool$3.run(QueuedThreadPool.java:534)         at java.lang.Thread.run(Thread.java:679)

Stack Trace:
com.carrotsearch.randomizedtesting.ThreadLeakError: 4 threads leaked from SUITE scope at org.apache.solr.request.TestRemoteStreaming: 
   1) Thread[id=36, name=qtp1867825290-36 Acceptor0 SelectChannelConnector@0.0.0.0:18647, state=RUNNABLE, group=TGRP-TestRemoteStreaming]
        at sun.nio.ch.ServerSocketChannelImpl.accept0(Native Method)
        at sun.nio.ch.ServerSocketChannelImpl.accept(ServerSocketChannelImpl.java:163)
        at org.eclipse.jetty.server.nio.SelectChannelConnector.accept(SelectChannelConnector.java:104)
        at org.eclipse.jetty.server.AbstractConnector$Acceptor.run(AbstractConnector.java:933)
        at org.eclipse.jetty.util.thread.QueuedThreadPool.runJob(QueuedThreadPool.java:599)
        at org.eclipse.jetty.util.thread.QueuedThreadPool$3.run(QueuedThreadPool.java:534)
        at java.lang.Thread.run(Thread.java:679)
   2) Thread[id=37, name=qtp1867825290-37 Acceptor1 SelectChannelConnector@0.0.0.0:18647, state=BLOCKED, group=TGRP-TestRemoteStreaming]
        at sun.nio.ch.ServerSocketChannelImpl.accept(ServerSocketChannelImpl.java:147)
        at org.eclipse.jetty.server.nio.SelectChannelConnector.accept(SelectChannelConnector.java:104)
        at org.eclipse.jetty.server.AbstractConnector$Acceptor.run(AbstractConnector.java:933)
        at org.eclipse.jetty.util.thread.QueuedThreadPool.runJob(QueuedThreadPool.java:599)
        at org.eclipse.jetty.util.thread.QueuedThreadPool$3.run(QueuedThreadPool.java:534)
        at java.lang.Thread.run(Thread.java:679)
   3) Thread[id=38, name=qtp1867825290-38 Acceptor2 SelectChannelConnector@0.0.0.0:18647, state=BLOCKED, group=TGRP-TestRemoteStreaming]
        at sun.nio.ch.ServerSocketChannelImpl.accept(ServerSocketChannelImpl.java:147)
        at org.eclipse.jetty.server.nio.SelectChannelConnector.accept(SelectChannelConnector.java:104)
        at org.eclipse.jetty.server.AbstractConnector$Acceptor.run(AbstractConnector.java:933)
        at org.eclipse.jetty.util.thread.QueuedThreadPool.runJob(QueuedThreadPool.java:599)
        at org.eclipse.jetty.util.thread.QueuedThreadPool$3.run(QueuedThreadPool.java:534)
        at java.lang.Thread.run(Thread.java:679)
   4) Thread[id=39, name=qtp1867825290-39 Acceptor3 SelectChannelConnector@0.0.0.0:18647, state=BLOCKED, group=TGRP-TestRemoteStreaming]
        at sun.nio.ch.ServerSocketChannelImpl.accept(ServerSocketChannelImpl.java:147)
        at org.eclipse.jetty.server.nio.SelectChannelConnector.accept(SelectChannelConnector.java:104)
        at org.eclipse.jetty.server.AbstractConnector$Acceptor.run(AbstractConnector.java:933)
        at org.eclipse.jetty.util.thread.QueuedThreadPool.runJob(QueuedThreadPool.java:599)
        at org.eclipse.jetty.util.thread.QueuedThreadPool$3.run(QueuedThreadPool.java:534)
        at java.lang.Thread.run(Thread.java:679)
	at __randomizedtesting.SeedInfo.seed([8A7C242F25B7715C]:0)


FAILED:  junit.framework.TestSuite.org.apache.solr.request.TestRemoteStreaming

Error Message:
There are still zombie threads that couldn't be terminated:    1) Thread[id=36, name=qtp1867825290-36 Acceptor0 SelectChannelConnector@0.0.0.0:18647, state=RUNNABLE, group=TGRP-TestRemoteStreaming]         at sun.nio.ch.ServerSocketChannelImpl.accept0(Native Method)         at sun.nio.ch.ServerSocketChannelImpl.accept(ServerSocketChannelImpl.java:163)         at org.eclipse.jetty.server.nio.SelectChannelConnector.accept(SelectChannelConnector.java:104)         at org.eclipse.jetty.server.AbstractConnector$Acceptor.run(AbstractConnector.java:933)         at org.eclipse.jetty.util.thread.QueuedThreadPool.runJob(QueuedThreadPool.java:599)         at org.eclipse.jetty.util.thread.QueuedThreadPool$3.run(QueuedThreadPool.java:534)         at java.lang.Thread.run(Thread.java:679)    2) Thread[id=37, name=qtp1867825290-37 Acceptor1 SelectChannelConnector@0.0.0.0:18647, state=BLOCKED, group=TGRP-TestRemoteStreaming]         at sun.nio.ch.ServerSocketChannelImpl.accept(ServerSocketChannelImpl.java:147)         at org.eclipse.jetty.server.nio.SelectChannelConnector.accept(SelectChannelConnector.java:104)         at org.eclipse.jetty.server.AbstractConnector$Acceptor.run(AbstractConnector.java:933)         at org.eclipse.jetty.util.thread.QueuedThreadPool.runJob(QueuedThreadPool.java:599)         at org.eclipse.jetty.util.thread.QueuedThreadPool$3.run(QueuedThreadPool.java:534)         at java.lang.Thread.run(Thread.java:679)    3) Thread[id=38, name=qtp1867825290-38 Acceptor2 SelectChannelConnector@0.0.0.0:18647, state=BLOCKED, group=TGRP-TestRemoteStreaming]         at sun.nio.ch.ServerSocketChannelImpl.accept(ServerSocketChannelImpl.java:147)         at org.eclipse.jetty.server.nio.SelectChannelConnector.accept(SelectChannelConnector.java:104)         at org.eclipse.jetty.server.AbstractConnector$Acceptor.run(AbstractConnector.java:933)         at org.eclipse.jetty.util.thread.QueuedThreadPool.runJob(QueuedThreadPool.java:599)         at org.eclipse.jetty.util.thread.QueuedThreadPool$3.run(QueuedThreadPool.java:534)         at java.lang.Thread.run(Thread.java:679)    4) Thread[id=39, name=qtp1867825290-39 Acceptor3 SelectChannelConnector@0.0.0.0:18647, state=BLOCKED, group=TGRP-TestRemoteStreaming]         at sun.nio.ch.ServerSocketChannelImpl.accept(ServerSocketChannelImpl.java:147)         at org.eclipse.jetty.server.nio.SelectChannelConnector.accept(SelectChannelConnector.java:104)         at org.eclipse.jetty.server.AbstractConnector$Acceptor.run(AbstractConnector.java:933)         at org.eclipse.jetty.util.thread.QueuedThreadPool.runJob(QueuedThreadPool.java:599)         at org.eclipse.jetty.util.thread.QueuedThreadPool$3.run(QueuedThreadPool.java:534)         at java.lang.Thread.run(Thread.java:679)

Stack Trace:
com.carrotsearch.randomizedtesting.ThreadLeakError: There are still zombie threads that couldn't be terminated:
   1) Thread[id=36, name=qtp1867825290-36 Acceptor0 SelectChannelConnector@0.0.0.0:18647, state=RUNNABLE, group=TGRP-TestRemoteStreaming]
        at sun.nio.ch.ServerSocketChannelImpl.accept0(Native Method)
        at sun.nio.ch.ServerSocketChannelImpl.accept(ServerSocketChannelImpl.java:163)
        at org.eclipse.jetty.server.nio.SelectChannelConnector.accept(SelectChannelConnector.java:104)
        at org.eclipse.jetty.server.AbstractConnector$Acceptor.run(AbstractConnector.java:933)
        at org.eclipse.jetty.util.thread.QueuedThreadPool.runJob(QueuedThreadPool.java:599)
        at org.eclipse.jetty.util.thread.QueuedThreadPool$3.run(QueuedThreadPool.java:534)
        at java.lang.Thread.run(Thread.java:679)
   2) Thread[id=37, name=qtp1867825290-37 Acceptor1 SelectChannelConnector@0.0.0.0:18647, state=BLOCKED, group=TGRP-TestRemoteStreaming]
        at sun.nio.ch.ServerSocketChannelImpl.accept(ServerSocketChannelImpl.java:147)
        at org.eclipse.jetty.server.nio.SelectChannelConnector.accept(SelectChannelConnector.java:104)
        at org.eclipse.jetty.server.AbstractConnector$Acceptor.run(AbstractConnector.java:933)
        at org.eclipse.jetty.util.thread.QueuedThreadPool.runJob(QueuedThreadPool.java:599)
        at org.eclipse.jetty.util.thread.QueuedThreadPool$3.run(QueuedThreadPool.java:534)
        at java.lang.Thread.run(Thread.java:679)
   3) Thread[id=38, name=qtp1867825290-38 Acceptor2 SelectChannelConnector@0.0.0.0:18647, state=BLOCKED, group=TGRP-TestRemoteStreaming]
        at sun.nio.ch.ServerSocketChannelImpl.accept(ServerSocketChannelImpl.java:147)
        at org.eclipse.jetty.server.nio.SelectChannelConnector.accept(SelectChannelConnector.java:104)
        at org.eclipse.jetty.server.AbstractConnector$Acceptor.run(AbstractConnector.java:933)
        at org.eclipse.jetty.util.thread.QueuedThreadPool.runJob(QueuedThreadPool.java:599)
        at org.eclipse.jetty.util.thread.QueuedThreadPool$3.run(QueuedThreadPool.java:534)
        at java.lang.Thread.run(Thread.java:679)
   4) Thread[id=39, name=qtp1867825290-39 Acceptor3 SelectChannelConnector@0.0.0.0:18647, state=BLOCKED, group=TGRP-TestRemoteStreaming]
        at sun.nio.ch.ServerSocketChannelImpl.accept(ServerSocketChannelImpl.java:147)
        at org.eclipse.jetty.server.nio.SelectChannelConnector.accept(SelectChannelConnector.java:104)
        at org.eclipse.jetty.server.AbstractConnector$Acceptor.run(AbstractConnector.java:933)
        at org.eclipse.jetty.util.thread.QueuedThreadPool.runJob(QueuedThreadPool.java:599)
        at org.eclipse.jetty.util.thread.QueuedThreadPool$3.run(QueuedThreadPool.java:534)
        at java.lang.Thread.run(Thread.java:679)
	at __randomizedtesting.SeedInfo.seed([8A7C242F25B7715C]:0)


FAILED:  junit.framework.TestSuite.org.apache.solr.servlet.CacheHeaderTest

Error Message:
4 threads leaked from SUITE scope at org.apache.solr.servlet.CacheHeaderTest:     1) Thread[id=24, name=qtp2103606155-24 Acceptor1 SelectChannelConnector@0.0.0.0:31781, state=RUNNABLE, group=TGRP-CacheHeaderTest]         at sun.nio.ch.ServerSocketChannelImpl.accept0(Native Method)         at sun.nio.ch.ServerSocketChannelImpl.accept(ServerSocketChannelImpl.java:163)         at org.eclipse.jetty.server.nio.SelectChannelConnector.accept(SelectChannelConnector.java:104)         at org.eclipse.jetty.server.AbstractConnector$Acceptor.run(AbstractConnector.java:933)         at org.eclipse.jetty.util.thread.QueuedThreadPool.runJob(QueuedThreadPool.java:599)         at org.eclipse.jetty.util.thread.QueuedThreadPool$3.run(QueuedThreadPool.java:534)         at java.lang.Thread.run(Thread.java:679)    2) Thread[id=25, name=qtp2103606155-25 Acceptor2 SelectChannelConnector@0.0.0.0:31781, state=BLOCKED, group=TGRP-CacheHeaderTest]         at sun.nio.ch.ServerSocketChannelImpl.accept(ServerSocketChannelImpl.java:147)         at org.eclipse.jetty.server.nio.SelectChannelConnector.accept(SelectChannelConnector.java:104)         at org.eclipse.jetty.server.AbstractConnector$Acceptor.run(AbstractConnector.java:933)         at org.eclipse.jetty.util.thread.QueuedThreadPool.runJob(QueuedThreadPool.java:599)         at org.eclipse.jetty.util.thread.QueuedThreadPool$3.run(QueuedThreadPool.java:534)         at java.lang.Thread.run(Thread.java:679)    3) Thread[id=26, name=qtp2103606155-26 Acceptor3 SelectChannelConnector@0.0.0.0:31781, state=BLOCKED, group=TGRP-CacheHeaderTest]         at sun.nio.ch.ServerSocketChannelImpl.accept(ServerSocketChannelImpl.java:147)         at org.eclipse.jetty.server.nio.SelectChannelConnector.accept(SelectChannelConnector.java:104)         at org.eclipse.jetty.server.AbstractConnector$Acceptor.run(AbstractConnector.java:933)         at org.eclipse.jetty.util.thread.QueuedThreadPool.runJob(QueuedThreadPool.java:599)         at org.eclipse.jetty.util.thread.QueuedThreadPool$3.run(QueuedThreadPool.java:534)         at java.lang.Thread.run(Thread.java:679)    4) Thread[id=23, name=qtp2103606155-23 Acceptor0 SelectChannelConnector@0.0.0.0:31781, state=BLOCKED, group=TGRP-CacheHeaderTest]         at sun.nio.ch.ServerSocketChannelImpl.accept(ServerSocketChannelImpl.java:147)         at org.eclipse.jetty.server.nio.SelectChannelConnector.accept(SelectChannelConnector.java:104)         at org.eclipse.jetty.server.AbstractConnector$Acceptor.run(AbstractConnector.java:933)         at org.eclipse.jetty.util.thread.QueuedThreadPool.runJob(QueuedThreadPool.java:599)         at org.eclipse.jetty.util.thread.QueuedThreadPool$3.run(QueuedThreadPool.java:534)         at java.lang.Thread.run(Thread.java:679)

Stack Trace:
com.carrotsearch.randomizedtesting.ThreadLeakError: 4 threads leaked from SUITE scope at org.apache.solr.servlet.CacheHeaderTest: 
   1) Thread[id=24, name=qtp2103606155-24 Acceptor1 SelectChannelConnector@0.0.0.0:31781, state=RUNNABLE, group=TGRP-CacheHeaderTest]
        at sun.nio.ch.ServerSocketChannelImpl.accept0(Native Method)
        at sun.nio.ch.ServerSocketChannelImpl.accept(ServerSocketChannelImpl.java:163)
        at org.eclipse.jetty.server.nio.SelectChannelConnector.accept(SelectChannelConnector.java:104)
        at org.eclipse.jetty.server.AbstractConnector$Acceptor.run(AbstractConnector.java:933)
        at org.eclipse.jetty.util.thread.QueuedThreadPool.runJob(QueuedThreadPool.java:599)
        at org.eclipse.jetty.util.thread.QueuedThreadPool$3.run(QueuedThreadPool.java:534)
        at java.lang.Thread.run(Thread.java:679)
   2) Thread[id=25, name=qtp2103606155-25 Acceptor2 SelectChannelConnector@0.0.0.0:31781, state=BLOCKED, group=TGRP-CacheHeaderTest]
        at sun.nio.ch.ServerSocketChannelImpl.accept(ServerSocketChannelImpl.java:147)
        at org.eclipse.jetty.server.nio.SelectChannelConnector.accept(SelectChannelConnector.java:104)
        at org.eclipse.jetty.server.AbstractConnector$Acceptor.run(AbstractConnector.java:933)
        at org.eclipse.jetty.util.thread.QueuedThreadPool.runJob(QueuedThreadPool.java:599)
        at org.eclipse.jetty.util.thread.QueuedThreadPool$3.run(QueuedThreadPool.java:534)
        at java.lang.Thread.run(Thread.java:679)
   3) Thread[id=26, name=qtp2103606155-26 Acceptor3 SelectChannelConnector@0.0.0.0:31781, state=BLOCKED, group=TGRP-CacheHeaderTest]
        at sun.nio.ch.ServerSocketChannelImpl.accept(ServerSocketChannelImpl.java:147)
        at org.eclipse.jetty.server.nio.SelectChannelConnector.accept(SelectChannelConnector.java:104)
        at org.eclipse.jetty.server.AbstractConnector$Acceptor.run(AbstractConnector.java:933)
        at org.eclipse.jetty.util.thread.QueuedThreadPool.runJob(QueuedThreadPool.java:599)
        at org.eclipse.jetty.util.thread.QueuedThreadPool$3.run(QueuedThreadPool.java:534)
        at java.lang.Thread.run(Thread.java:679)
   4) Thread[id=23, name=qtp2103606155-23 Acceptor0 SelectChannelConnector@0.0.0.0:31781, state=BLOCKED, group=TGRP-CacheHeaderTest]
        at sun.nio.ch.ServerSocketChannelImpl.accept(ServerSocketChannelImpl.java:147)
        at org.eclipse.jetty.server.nio.SelectChannelConnector.accept(SelectChannelConnector.java:104)
        at org.eclipse.jetty.server.AbstractConnector$Acceptor.run(AbstractConnector.java:933)
        at org.eclipse.jetty.util.thread.QueuedThreadPool.runJob(QueuedThreadPool.java:599)
        at org.eclipse.jetty.util.thread.QueuedThreadPool$3.run(QueuedThreadPool.java:534)
        at java.lang.Thread.run(Thread.java:679)
	at __randomizedtesting.SeedInfo.seed([8A7C242F25B7715C]:0)


FAILED:  junit.framework.TestSuite.org.apache.solr.servlet.CacheHeaderTest

Error Message:
There are still zombie threads that couldn't be terminated:    1) Thread[id=24, name=qtp2103606155-24 Acceptor1 SelectChannelConnector@0.0.0.0:31781, state=RUNNABLE, group=TGRP-CacheHeaderTest]         at sun.nio.ch.ServerSocketChannelImpl.accept0(Native Method)         at sun.nio.ch.ServerSocketChannelImpl.accept(ServerSocketChannelImpl.java:163)         at org.eclipse.jetty.server.nio.SelectChannelConnector.accept(SelectChannelConnector.java:104)         at org.eclipse.jetty.server.AbstractConnector$Acceptor.run(AbstractConnector.java:933)         at org.eclipse.jetty.util.thread.QueuedThreadPool.runJob(QueuedThreadPool.java:599)         at org.eclipse.jetty.util.thread.QueuedThreadPool$3.run(QueuedThreadPool.java:534)         at java.lang.Thread.run(Thread.java:679)    2) Thread[id=25, name=qtp2103606155-25 Acceptor2 SelectChannelConnector@0.0.0.0:31781, state=BLOCKED, group=TGRP-CacheHeaderTest]         at sun.nio.ch.ServerSocketChannelImpl.accept(ServerSocketChannelImpl.java:147)         at org.eclipse.jetty.server.nio.SelectChannelConnector.accept(SelectChannelConnector.java:104)         at org.eclipse.jetty.server.AbstractConnector$Acceptor.run(AbstractConnector.java:933)         at org.eclipse.jetty.util.thread.QueuedThreadPool.runJob(QueuedThreadPool.java:599)         at org.eclipse.jetty.util.thread.QueuedThreadPool$3.run(QueuedThreadPool.java:534)         at java.lang.Thread.run(Thread.java:679)    3) Thread[id=26, name=qtp2103606155-26 Acceptor3 SelectChannelConnector@0.0.0.0:31781, state=BLOCKED, group=TGRP-CacheHeaderTest]         at sun.nio.ch.ServerSocketChannelImpl.accept(ServerSocketChannelImpl.java:147)         at org.eclipse.jetty.server.nio.SelectChannelConnector.accept(SelectChannelConnector.java:104)         at org.eclipse.jetty.server.AbstractConnector$Acceptor.run(AbstractConnector.java:933)         at org.eclipse.jetty.util.thread.QueuedThreadPool.runJob(QueuedThreadPool.java:599)         at org.eclipse.jetty.util.thread.QueuedThreadPool$3.run(QueuedThreadPool.java:534)         at java.lang.Thread.run(Thread.java:679)    4) Thread[id=23, name=qtp2103606155-23 Acceptor0 SelectChannelConnector@0.0.0.0:31781, state=BLOCKED, group=TGRP-CacheHeaderTest]         at sun.nio.ch.ServerSocketChannelImpl.accept(ServerSocketChannelImpl.java:147)         at org.eclipse.jetty.server.nio.SelectChannelConnector.accept(SelectChannelConnector.java:104)         at org.eclipse.jetty.server.AbstractConnector$Acceptor.run(AbstractConnector.java:933)         at org.eclipse.jetty.util.thread.QueuedThreadPool.runJob(QueuedThreadPool.java:599)         at org.eclipse.jetty.util.thread.QueuedThreadPool$3.run(QueuedThreadPool.java:534)         at java.lang.Thread.run(Thread.java:679)

Stack Trace:
com.carrotsearch.randomizedtesting.ThreadLeakError: There are still zombie threads that couldn't be terminated:
   1) Thread[id=24, name=qtp2103606155-24 Acceptor1 SelectChannelConnector@0.0.0.0:31781, state=RUNNABLE, group=TGRP-CacheHeaderTest]
        at sun.nio.ch.ServerSocketChannelImpl.accept0(Native Method)
        at sun.nio.ch.ServerSocketChannelImpl.accept(ServerSocketChannelImpl.java:163)
        at org.eclipse.jetty.server.nio.SelectChannelConnector.accept(SelectChannelConnector.java:104)
        at org.eclipse.jetty.server.AbstractConnector$Acceptor.run(AbstractConnector.java:933)
        at org.eclipse.jetty.util.thread.QueuedThreadPool.runJob(QueuedThreadPool.java:599)
        at org.eclipse.jetty.util.thread.QueuedThreadPool$3.run(QueuedThreadPool.java:534)
        at java.lang.Thread.run(Thread.java:679)
   2) Thread[id=25, name=qtp2103606155-25 Acceptor2 SelectChannelConnector@0.0.0.0:31781, state=BLOCKED, group=TGRP-CacheHeaderTest]
        at sun.nio.ch.ServerSocketChannelImpl.accept(ServerSocketChannelImpl.java:147)
        at org.eclipse.jetty.server.nio.SelectChannelConnector.accept(SelectChannelConnector.java:104)
        at org.eclipse.jetty.server.AbstractConnector$Acceptor.run(AbstractConnector.java:933)
        at org.eclipse.jetty.util.thread.QueuedThreadPool.runJob(QueuedThreadPool.java:599)
        at org.eclipse.jetty.util.thread.QueuedThreadPool$3.run(QueuedThreadPool.java:534)
        at java.lang.Thread.run(Thread.java:679)
   3) Thread[id=26, name=qtp2103606155-26 Acceptor3 SelectChannelConnector@0.0.0.0:31781, state=BLOCKED, group=TGRP-CacheHeaderTest]
        at sun.nio.ch.ServerSocketChannelImpl.accept(ServerSocketChannelImpl.java:147)
        at org.eclipse.jetty.server.nio.SelectChannelConnector.accept(SelectChannelConnector.java:104)
        at org.eclipse.jetty.server.AbstractConnector$Acceptor.run(AbstractConnector.java:933)
        at org.eclipse.jetty.util.thread.QueuedThreadPool.runJob(QueuedThreadPool.java:599)
        at org.eclipse.jetty.util.thread.QueuedThreadPool$3.run(QueuedThreadPool.java:534)
        at java.lang.Thread.run(Thread.java:679)
   4) Thread[id=23, name=qtp2103606155-23 Acceptor0 SelectChannelConnector@0.0.0.0:31781, state=BLOCKED, group=TGRP-CacheHeaderTest]
        at sun.nio.ch.ServerSocketChannelImpl.accept(ServerSocketChannelImpl.java:147)
        at org.eclipse.jetty.server.nio.SelectChannelConnector.accept(SelectChannelConnector.java:104)
        at org.eclipse.jetty.server.AbstractConnector$Acceptor.run(AbstractConnector.java:933)
        at org.eclipse.jetty.util.thread.QueuedThreadPool.runJob(QueuedThreadPool.java:599)
        at org.eclipse.jetty.util.thread.QueuedThreadPool$3.run(QueuedThreadPool.java:534)
        at java.lang.Thread.run(Thread.java:679)
	at __randomizedtesting.SeedInfo.seed([8A7C242F25B7715C]:0)




Build Log:
[...truncated 7766 lines...]
[junit4:junit4] Suite: org.apache.solr.servlet.CacheHeaderTest
[junit4:junit4]   2> 0 T16 oas.SolrTestCaseJ4.initCore ####initCore
[junit4:junit4]   2> Creating dataDir: /usr/home/hudson/hudson-slave/workspace/Lucene-Solr-NightlyTests-trunk/solr/build/solr-core/test/J0/./solrtest-CacheHeaderTest-1352216703103
[junit4:junit4]   2> 1 T16 oas.SolrTestCaseJ4.initCore ####initCore end
[junit4:junit4]   2> 548 T16 oejs.Server.doStart jetty-8.1.2.v20120308
[junit4:junit4]   2> 955 T16 oejs.AbstractConnector.doStart Started SelectChannelConnector@0.0.0.0:31781
[junit4:junit4]   2> 1010 T16 oasc.SolrResourceLoader.locateSolrHome JNDI not configured for solr (NoInitialContextEx)
[junit4:junit4]   2> 1011 T16 oasc.SolrResourceLoader.locateSolrHome using system property solr.solr.home: solr/
[junit4:junit4]   2> 1011 T16 oasc.SolrResourceLoader.<init> new SolrResourceLoader for deduced Solr Home: 'solr/'
[junit4:junit4]   2> 1058 T16 oass.SolrDispatchFilter.init SolrDispatchFilter.init()
[junit4:junit4]   2> 1059 T16 oasc.SolrResourceLoader.locateSolrHome JNDI not configured for solr (NoInitialContextEx)
[junit4:junit4]   2> 1059 T16 oasc.SolrResourceLoader.locateSolrHome using system property solr.solr.home: solr/
[junit4:junit4]   2> 1060 T16 oasc.CoreContainer$Initializer.initialize looking for solr.xml: /usr/home/hudson/hudson-slave/workspace/Lucene-Solr-NightlyTests-trunk/solr/build/solr-core/test/J0/solr/solr.xml
[junit4:junit4]   2> 1060 T16 oasc.CoreContainer.<init> New CoreContainer 1724874714
[junit4:junit4]   2> 1061 T16 oasc.CoreContainer$Initializer.initialize no solr.xml file found - using default
[junit4:junit4]   2> 1062 T16 oasc.CoreContainer.load Loading CoreContainer using Solr Home: 'solr/'
[junit4:junit4]   2> 1062 T16 oasc.SolrResourceLoader.<init> new SolrResourceLoader for directory: 'solr/'
[junit4:junit4]   2> 1101 T16 oasc.CoreContainer.load Registering Log Listener
[junit4:junit4]   2> 1171 T16 oasc.CoreContainer.create Creating SolrCore 'collection1' using instanceDir: solr/collection1
[junit4:junit4]   2> 1173 T16 oasc.SolrResourceLoader.<init> new SolrResourceLoader for directory: 'solr/collection1/'
[junit4:junit4]   2> 1250 T16 oasc.SolrConfig.<init> Using Lucene MatchVersion: LUCENE_50
[junit4:junit4]   2> 1321 T16 oasc.SolrConfig.<init> Loaded SolrConfig: solrconfig.xml
[junit4:junit4]   2> 1327 T16 oass.IndexSchema.readSchema Reading Solr Schema
[junit4:junit4]   2> 1368 T16 oass.IndexSchema.readSchema Schema name=test
[junit4:junit4]   2> 2075 T16 oass.OpenExchangeRatesOrgProvider.init Initialized with rates=open-exchange-rates.json, refreshInterval=1440.
[junit4:junit4]   2> 2095 T16 oass.IndexSchema.readSchema default search field in schema is text
[junit4:junit4]   2> 2100 T16 oass.IndexSchema.readSchema unique key field: id
[junit4:junit4]   2> 2151 T16 oass.FileExchangeRateProvider.reload Reloading exchange rates from file currency.xml
[junit4:junit4]   2> 2168 T16 oass.FileExchangeRateProvider.reload Reloading exchange rates from file currency.xml
[junit4:junit4]   2> 2175 T16 oass.OpenExchangeRatesOrgProvider.reload Reloading exchange rates from open-exchange-rates.json
[junit4:junit4]   2> 2183 T16 oass.OpenExchangeRatesOrgProvider.reload Reloading exchange rates from open-exchange-rates.json
[junit4:junit4]   2> 2188 T16 oasc.SolrCore.<init> [collection1] Opening new SolrCore at solr/collection1/, dataDir=/usr/home/hudson/hudson-slave/workspace/Lucene-Solr-NightlyTests-trunk/solr/build/solr-core/test/J0/solrtest-CacheHeaderTest-1352216703103/
[junit4:junit4]   2> 2189 T16 oasc.JmxMonitoredMap.<init> JMX monitoring is enabled. Adding Solr mbeans to JMX Server: com.sun.jmx.mbeanserver.JmxMBeanServer@4b85c17
[junit4:junit4]   2> 2191 T16 oasc.SolrCore.initDirectoryFactory org.apache.solr.core.MockDirectoryFactory
[junit4:junit4]   2> 2193 T16 oasc.CachingDirectoryFactory.injectLockFactory WARNING No lockType configured for MockDirWrapper(NRTCachingDirectory(org.apache.lucene.store.RAMDirectory@66d7a9c9 lockFactory=org.apache.lucene.store.SingleInstanceLockFactory@58cbffde; maxCacheMB=0.001953125 maxMergeSizeMB=0.7177734375)) assuming 'simple'
[junit4:junit4]   2> 2194 T16 oasc.CachingDirectoryFactory.get return new directory for /usr/home/hudson/hudson-slave/workspace/Lucene-Solr-NightlyTests-trunk/solr/build/solr-core/test/J0/solrtest-CacheHeaderTest-1352216703103 forceNew:false
[junit4:junit4]   2> 2195 T16 oasc.CachingDirectoryFactory.close Releasing directory:/usr/home/hudson/hudson-slave/workspace/Lucene-Solr-NightlyTests-trunk/solr/build/solr-core/test/J0/solrtest-CacheHeaderTest-1352216703103
[junit4:junit4]   2> 2195 T16 oasc.SolrCore.getNewIndexDir New index directory detected: old=null new=/usr/home/hudson/hudson-slave/workspace/Lucene-Solr-NightlyTests-trunk/solr/build/solr-core/test/J0/solrtest-CacheHeaderTest-1352216703103/index/
[junit4:junit4]   2> 2196 T16 oasc.SolrCore.initIndex WARNING [collection1] Solr index directory '/usr/home/hudson/hudson-slave/workspace/Lucene-Solr-NightlyTests-trunk/solr/build/solr-core/test/J0/solrtest-CacheHeaderTest-1352216703103/index' doesn't exist. Creating new index...
[junit4:junit4]   2> 2197 T16 oasc.CachingDirectoryFactory.get return new directory for /usr/home/hudson/hudson-slave/workspace/Lucene-Solr-NightlyTests-trunk/solr/build/solr-core/test/J0/solrtest-CacheHeaderTest-1352216703103/index forceNew:false
[junit4:junit4]   2> 2201 T16 oasc.SolrDeletionPolicy.onCommit SolrDeletionPolicy.onCommit: commits:num=1
[junit4:junit4]   2> 		commit{dir=BaseDirectoryWrapper(org.apache.lucene.store.RAMDirectory@71e852be lockFactory=org.apache.lucene.store.NativeFSLockFactory@7844a013),segFN=segments_1,generation=1,filenames=[segments_1]
[junit4:junit4]   2> 2201 T16 oasc.SolrDeletionPolicy.updateCommits newest commit = 1[segments_1]
[junit4:junit4]   2> 2202 T16 oasc.CachingDirectoryFactory.close Releasing directory:/usr/home/hudson/hudson-slave/workspace/Lucene-Solr-NightlyTests-trunk/solr/build/solr-core/test/J0/solrtest-CacheHeaderTest-1352216703103/index
[junit4:junit4]   2> 2203 T16 oasc.SolrCore.initWriters created xml: solr.XMLResponseWriter
[junit4:junit4]   2> 2207 T16 oasup.UpdateRequestProcessorChain.init inserting DistributedUpdateProcessorFactory into updateRequestProcessorChain "dedupe"
[junit4:junit4]   2> 2208 T16 oasup.UpdateRequestProcessorChain.init inserting DistributedUpdateProcessorFactory into updateRequestProcessorChain "dedupe-allfields"
[junit4:junit4]   2> 2209 T16 oasup.UpdateRequestProcessorChain.init inserting DistributedUpdateProcessorFactory into updateRequestProcessorChain "stored_sig"
[junit4:junit4]   2> 2209 T16 oasup.UpdateRequestProcessorChain.init inserting DistributedUpdateProcessorFactory into updateRequestProcessorChain "uniq-fields"
[junit4:junit4]   2> 2211 T16 oasup.UpdateRequestProcessorChain.init inserting DistributedUpdateProcessorFactory into updateRequestProcessorChain "distrib-dup-test-chain-implicit"
[junit4:junit4]   2> 2212 T16 oasc.RequestHandlers.initHandlersFromConfig adding lazy requestHandler: solr.ReplicationHandler
[junit4:junit4]   2> 2213 T16 oasc.RequestHandlers.initHandlersFromConfig created /replication: solr.ReplicationHandler
[junit4:junit4]   2> 2215 T16 oasc.RequestHandlers.initHandlersFromConfig created standard: solr.StandardRequestHandler
[junit4:junit4]   2> 2218 T16 oasc.RequestHandlers.initHandlersFromConfig created /get: solr.RealTimeGetHandler
[junit4:junit4]   2> 2219 T16 oasc.RequestHandlers.initHandlersFromConfig created dismax: solr.SearchHandler
[junit4:junit4]   2> 2221 T16 oasc.RequestHandlers.initHandlersFromConfig created mock: org.apache.solr.core.MockQuerySenderListenerReqHandler
[junit4:junit4]   2> 2222 T16 oasc.RequestHandlers.initHandlersFromConfig created /admin/: org.apache.solr.handler.admin.AdminHandlers
[junit4:junit4]   2> 2223 T16 oasc.RequestHandlers.initHandlersFromConfig created defaults: solr.StandardRequestHandler
[junit4:junit4]   2> 2224 T16 oasc.RequestHandlers.initHandlersFromConfig adding lazy requestHandler: solr.StandardRequestHandler
[junit4:junit4]   2> 2224 T16 oasc.RequestHandlers.initHandlersFromConfig created lazy: solr.StandardRequestHandler
[junit4:junit4]   2> 2226 T16 oasc.RequestHandlers.initHandlersFromConfig created /update: solr.UpdateRequestHandler
[junit4:junit4]   2> 2228 T16 oasc.RequestHandlers.initHandlersFromConfig created /terms: org.apache.solr.handler.component.SearchHandler
[junit4:junit4]   2> 2230 T16 oasc.RequestHandlers.initHandlersFromConfig created spellCheckCompRH: org.apache.solr.handler.component.SearchHandler
[junit4:junit4]   2> 2232 T16 oasc.RequestHandlers.initHandlersFromConfig created spellCheckCompRH_Direct: org.apache.solr.handler.component.SearchHandler
[junit4:junit4]   2> 2233 T16 oasc.RequestHandlers.initHandlersFromConfig created spellCheckWithWordbreak: org.apache.solr.handler.component.SearchHandler
[junit4:junit4]   2> 2235 T16 oasc.RequestHandlers.initHandlersFromConfig created spellCheckWithWordbreak_Direct: org.apache.solr.handler.component.SearchHandler
[junit4:junit4]   2> 2237 T16 oasc.RequestHandlers.initHandlersFromConfig created spellCheckCompRH1: org.apache.solr.handler.component.SearchHandler
[junit4:junit4]   2> 2239 T16 oasc.RequestHandlers.initHandlersFromConfig created tvrh: org.apache.solr.handler.component.SearchHandler
[junit4:junit4]   2> 2240 T16 oasc.RequestHandlers.initHandlersFromConfig created /mlt: solr.MoreLikeThisHandler
[junit4:junit4]   2> 2242 T16 oasc.RequestHandlers.initHandlersFromConfig created /debug/dump: solr.DumpRequestHandler
[junit4:junit4]   2> 2247 T16 oashl.XMLLoader.init xsltCacheLifetimeSeconds=60
[junit4:junit4]   2> 2251 T16 oasc.SolrCore.initDeprecatedSupport WARNING solrconfig.xml uses deprecated <admin/gettableFiles>, Please update your config to use the ShowFileRequestHandler.
[junit4:junit4]   2> 2253 T16 oasc.SolrCore.initDeprecatedSupport WARNING adding ShowFileRequestHandler with hidden files: []
[junit4:junit4]   2> 2256 T16 oasc.CachingDirectoryFactory.close Releasing directory:/usr/home/hudson/hudson-slave/workspace/Lucene-Solr-NightlyTests-trunk/solr/build/solr-core/test/J0/solrtest-CacheHeaderTest-1352216703103
[junit4:junit4]   2> 2256 T16 oass.SolrIndexSearcher.<init> Opening Searcher@db951f2 main
[junit4:junit4]   2> 2257 T16 oasu.CommitTracker.<init> Hard AutoCommit: disabled
[junit4:junit4]   2> 2257 T16 oasu.CommitTracker.<init> Soft AutoCommit: disabled
[junit4:junit4]   2> 2258 T16 oashc.SpellCheckComponent.inform Initializing spell checkers
[junit4:junit4]   2> 2292 T16 oass.DirectSolrSpellChecker.init init: {name=direct,classname=DirectSolrSpellChecker,field=lowerfilt,minQueryLength=3}
[junit4:junit4]   2> 2337 T16 oashc.HttpShardHandlerFactory.getParameter Setting socketTimeout to: 0
[junit4:junit4]   2> 2338 T16 oashc.HttpShardHandlerFactory.getParameter Setting urlScheme to: http://
[junit4:junit4]   2> 2338 T16 oashc.HttpShardHandlerFactory.getParameter Setting connTimeout to: 0
[junit4:junit4]   2> 2339 T16 oashc.HttpShardHandlerFactory.getParameter Setting maxConnectionsPerHost to: 20
[junit4:junit4]   2> 2339 T16 oashc.HttpShardHandlerFactory.getParameter Setting corePoolSize to: 0
[junit4:junit4]   2> 2340 T16 oashc.HttpShardHandlerFactory.getParameter Setting maximumPoolSize to: 2147483647
[junit4:junit4]   2> 2340 T16 oashc.HttpShardHandlerFactory.getParameter Setting maxThreadIdleTime to: 5
[junit4:junit4]   2> 2340 T16 oashc.HttpShardHandlerFactory.getParameter Setting sizeOfQueue to: -1
[junit4:junit4]   2> 2341 T16 oashc.HttpShardHandlerFactory.getParameter Setting fairnessPolicy to: false
[junit4:junit4]   2> 2341 T16 oascsi.HttpClientUtil.createClient Creating new http client, config:maxConnectionsPerHost=20&maxConnections=10000&socketTimeout=0&connTimeout=0&retry=false
[junit4:junit4]   2> 2367 T31 oasc.SolrCore.registerSearcher [collection1] Registered new searcher Searcher@db951f2 main{StandardDirectoryReader(segments_1:1)}
[junit4:junit4]   2> 2376 T16 oasc.CoreContainer.registerCore registering core: collection1
[junit4:junit4]   2> 2377 T16 oass.SolrDispatchFilter.init user.dir=/usr/home/hudson/hudson-slave/workspace/Lucene-Solr-NightlyTests-trunk/solr/build/solr-core/test/J0
[junit4:junit4]   2> 2377 T16 oass.SolrDispatchFilter.init SolrDispatchFilter.init() done
[junit4:junit4]   2> 2378 T16 oas.SolrJettyTestBase.createJetty Jetty Assigned Port#31781
[junit4:junit4]   2> 2385 T16 oas.SolrTestCaseJ4.setUp ###Starting testCacheVetoException
[junit4:junit4]   2> 2404 T16 oascsi.HttpClientUtil.createClient Creating new http client, config:maxConnections=128&maxConnectionsPerHost=32&followRedirects=false
[junit4:junit4]   2> ASYNC  NEW_CORE C1 name=collection1 org.apache.solr.core.SolrCore@2e0ca6ae
[junit4:junit4]   2> 3731 T28 C1 oasc.SolrException.log Ignoring exception matching ignore_exception
[junit4:junit4]   2> 3732 T28 C1 REQ [collection1] webapp=/solr path=/select params={qt=standard&q=xyz_ignore_exception:solr} status=400 QTime=265 
[junit4:junit4]   2> 3881 T16 oas.SolrTestCaseJ4.tearDown ###Ending testCacheVetoException
[junit4:junit4]   2> 3889 T16 oas.SolrTestCaseJ4.setUp ###Starting testCacheVetoHandler
[junit4:junit4]   2> 3940 T30 C1 oasc.CachingDirectoryFactory.close Releasing directory:/usr/home/hudson/hudson-slave/workspace/Lucene-Solr-NightlyTests-trunk/solr/build/solr-core/test/J0/solrtest-CacheHeaderTest-1352216703103
[junit4:junit4]   2> 3942 T30 C1 oasc.SolrDeletionPolicy.onInit SolrDeletionPolicy.onInit: commits:num=1
[junit4:junit4]   2> 		commit{dir=BaseDirectoryWrapper(org.apache.lucene.store.RAMDirectory@71e852be lockFactory=org.apache.lucene.store.NativeFSLockFactory@7844a013),segFN=segments_1,generation=1,filenames=[segments_1]
[junit4:junit4]   2> 3942 T30 C1 oasc.SolrDeletionPolicy.updateCommits newest commit = 1[segments_1]
[junit4:junit4]   2> 3946 T30 C1 UPDATE [collection1] webapp=/solr path=/update params={stream.contentType=text/csv&stream.file=/usr/home/hudson/hudson-slave/workspace/Lucene-Solr-NightlyTests-trunk/solr/build/solr-core/test/J0/cachetest_csv6976069760tmp} {add=[100, 101, 102]} 0 34
[junit4:junit4]   2> 3961 T16 oas.SolrTestCaseJ4.tearDown ###Ending testCacheVetoHandler
[junit4:junit4]   2> 3970 T16 oas.SolrTestCaseJ4.setUp ###Starting testCacheControl
[junit4:junit4]   2> 4035 T29 C1 REQ [collection1] webapp=/solr path=/select params={qt=standard&q=solr} hits=0 status=0 QTime=63 
[junit4:junit4]   2> 4051 T28 C1 REQ [collection1] webapp=/solr path=/select params={qt=standard&q=solr} hits=0 status=0 QTime=0 
[junit4:junit4]   2> 4059 T30 C1 REQ [collection1] webapp=/solr path=/select params={q=solr&qt=standard} hits=0 status=0 QTime=1 
[junit4:junit4]   2> 4060 T16 oas.SolrTestCaseJ4.tearDown ###Ending testCacheControl
[junit4:junit4]   2> 4068 T16 oas.SolrTestCaseJ4.setUp ###Starting testEtag
[junit4:junit4]   2> 4071 T29 C1 REQ [collection1] webapp=/solr path=/select params={qt=standard&q=solr} hits=0 status=0 QTime=1 
[junit4:junit4]   2> 4079 T28 C1 REQ [collection1] webapp=/solr path=/select params={qt=standard&q=solr} hits=0 status=0 QTime=5 
[junit4:junit4]   2> 4093 T30 C1 REQ [collection1] webapp=/solr path=/select params={qt=standard&q=solr} hits=0 status=0 QTime=1 
[junit4:junit4]   2> 4096 T29 C1 REQ [collection1] webapp=/solr path=/select params={qt=standard&q=solr} hits=0 status=0 QTime=0 
[junit4:junit4]   2> 4100 T28 C1 REQ [collection1] webapp=/solr path=/select params={qt=standard&q=solr} hits=0 status=0 QTime=1 
[junit4:junit4]   2> 4104 T30 C1 REQ [collection1] webapp=/solr path=/select params={qt=standard&q=solr} hits=0 status=0 QTime=1 
[junit4:junit4]   2> 4113 T30 C1 REQ [collection1] webapp=/solr path=/select params={qt=standard&q=solr} hits=0 status=0 QTime=1 
[junit4:junit4]   2> 4115 T29 C1 REQ [collection1] webapp=/solr path=/select params={qt=standard&q=solr} hits=0 status=0 QTime=0 
[junit4:junit4]   2> 4116 T16 oas.SolrTestCaseJ4.tearDown ###Ending testEtag
[junit4:junit4]   2> 4124 T16 oas.SolrTestCaseJ4.setUp ###Starting testLastModified
[junit4:junit4]   2> 4128 T28 C1 REQ [collection1] webapp=/solr path=/select params={qt=standard&q=solr} hits=0 status=0 QTime=1 
[junit4:junit4]   2> 4143 T28 C1 REQ [collection1] webapp=/solr path=/select params={qt=standard&q=solr} hits=0 status=0 QTime=0 
[junit4:junit4]   2> 4151 T29 C1 REQ [collection1] webapp=/solr path=/select params={qt=standard&q=solr} hits=0 status=0 QTime=1 
[junit4:junit4]   2> 4155 T28 C1 REQ [collection1] webapp=/solr path=/select params={qt=standard&q=solr} hits=0 status=0 QTime=1 
[junit4:junit4]   2> 4161 T28 C1 REQ [collection1] webapp=/solr path=/select params={qt=standard&q=solr} hits=0 status=0 QTime=1 
[junit4:junit4]   2> 4167 T29 C1 REQ [collection1] webapp=/solr path=/select params={qt=standard&q=solr} hits=0 status=0 QTime=1 
[junit4:junit4]   2> 4167 T16 oas.SolrTestCaseJ4.tearDown ###Ending testLastModified
[junit4:junit4]   2> 4215 T16 oasc.CoreContainer.shutdown Shutting down CoreContainer instance=1724874714
[junit4:junit4]   2> 4215 T16 oasc.SolrCore.close [collection1]  CLOSING SolrCore org.apache.solr.core.SolrCore@2e0ca6ae
[junit4:junit4]   2> 4240 T16 oasu.DirectUpdateHandler2.close closing DirectUpdateHandler2{commits=0,autocommits=0,soft autocommits=0,optimizes=0,rollbacks=0,expungeDeletes=0,docsPending=3,adds=3,deletesById=0,deletesByQuery=0,errors=0,cumulative_adds=3,cumulative_deletesById=0,cumulative_deletesByQuery=0,cumulative_errors=0}
[junit4:junit4]   2> 4241 T16 oasc.SolrCore.decrefSolrCoreState Closing SolrCoreState
[junit4:junit4]   2> 4242 T16 oasu.DefaultSolrCoreState.closeIndexWriter SolrCoreState ref count has reached 0 - closing IndexWriter
[junit4:junit4]   2> 4242 T16 oasu.DefaultSolrCoreState.closeIndexWriter closing IndexWriter with IndexWriterCloser
[junit4:junit4]   2> 4245 T16 C1 oasc.SolrDeletionPolicy.onCommit SolrDeletionPolicy.onCommit: commits:num=2
[junit4:junit4]   2> 		commit{dir=BaseDirectoryWrapper(org.apache.lucene.store.RAMDirectory@71e852be lockFactory=org.apache.lucene.store.NativeFSLockFactory@7844a013),segFN=segments_1,generation=1,filenames=[segments_1]
[junit4:junit4]   2> 		commit{dir=BaseDirectoryWrapper(org.apache.lucene.store.RAMDirectory@71e852be lockFactory=org.apache.lucene.store.NativeFSLockFactory@7844a013),segFN=segments_2,generation=2,filenames=[_0_4.len, _0_1.len, _0_3.len, _0_5.len, segments_2, _0.inf, _0.si, _0.pst, _0.fld]
[junit4:junit4]   2> 4245 T16 C1 oasc.SolrDeletionPolicy.updateCommits newest commit = 2[_0_4.len, _0_1.len, _0_3.len, _0_5.len, segments_2, _0.inf, _0.si, _0.pst, _0.fld]
[junit4:junit4]   2> 4246 T16 C1 oasc.CachingDirectoryFactory.close Releasing directory:/usr/home/hudson/hudson-slave/workspace/Lucene-Solr-NightlyTests-trunk/solr/build/solr-core/test/J0/solrtest-CacheHeaderTest-1352216703103/index
[junit4:junit4]   2> 4247 T16 oasc.SolrCore.closeSearcher [collection1] Closing main searcher on request.
[junit4:junit4]   2> 4247 T16 oasc.CachingDirectoryFactory.close Releasing directory:/usr/home/hudson/hudson-slave/workspace/Lucene-Solr-NightlyTests-trunk/solr/build/solr-core/test/J0/solrtest-CacheHeaderTest-1352216703103/index
[junit4:junit4]   2> 4326 T16 oejsh.ContextHandler.doStop stopped o.e.j.s.ServletContextHandler{/solr,null}
[junit4:junit4]   2> 4428 T16 oejut.QueuedThreadPool.doStop WARNING 4 threads could not be stopped
[junit4:junit4]   2> 4428 T16 oas.SolrTestCaseJ4.deleteCore ###deleteCore
[junit4:junit4]   2> 4440 T15 ccr.ThreadLeakControl.checkThreadLeaks WARNING Will linger awaiting termination of 4 leaked thread(s).
[junit4:junit4]   2> 24524 T15 ccr.ThreadLeakControl.checkThreadLeaks SEVERE 4 threads leaked from SUITE scope at org.apache.solr.servlet.CacheHeaderTest: 
[junit4:junit4]   2> 	   1) Thread[id=24, name=qtp2103606155-24 Acceptor1 SelectChannelConnector@0.0.0.0:31781, state=RUNNABLE, group=TGRP-CacheHeaderTest]
[junit4:junit4]   2> 	        at sun.nio.ch.ServerSocketChannelImpl.accept0(Native Method)
[junit4:junit4]   2> 	        at sun.nio.ch.ServerSocketChannelImpl.accept(ServerSocketChannelImpl.java:163)
[junit4:junit4]   2> 	        at org.eclipse.jetty.server.nio.SelectChannelConnector.accept(SelectChannelConnector.java:104)
[junit4:junit4]   2> 	        at org.eclipse.jetty.server.AbstractConnector$Acceptor.run(AbstractConnector.java:933)
[junit4:junit4]   2> 	        at org.eclipse.jetty.util.thread.QueuedThreadPool.runJob(QueuedThreadPool.java:599)
[junit4:junit4]   2> 	        at org.eclipse.jetty.util.thread.QueuedThreadPool$3.run(QueuedThreadPool.java:534)
[junit4:junit4]   2> 	        at java.lang.Thread.run(Thread.java:679)
[junit4:junit4]   2> 	   2) Thread[id=25, name=qtp2103606155-25 Acceptor2 SelectChannelConnector@0.0.0.0:31781, state=BLOCKED, group=TGRP-CacheHeaderTest]
[junit4:junit4]   2> 	        at sun.nio.ch.ServerSocketChannelImpl.accept(ServerSocketChannelImpl.java:147)
[junit4:junit4]   2> 	        at org.eclipse.jetty.server.nio.SelectChannelConnector.accept(SelectChannelConnector.java:104)
[junit4:junit4]   2> 	        at org.eclipse.jetty.server.AbstractConnector$Acceptor.run(AbstractConnector.java:933)
[junit4:junit4]   2> 	        at org.eclipse.jetty.util.thread.QueuedThreadPool.runJob(QueuedThreadPool.java:599)
[junit4:junit4]   2> 	        at org.eclipse.jetty.util.thread.QueuedThreadPool$3.run(QueuedThreadPool.java:534)
[junit4:junit4]   2> 	        at java.lang.Thread.run(Thread.java:679)
[junit4:junit4]   2> 	   3) Thread[id=26, name=qtp2103606155-26 Acceptor3 SelectChannelConnector@0.0.0.0:31781, state=BLOCKED, group=TGRP-CacheHeaderTest]
[junit4:junit4]   2> 	        at sun.nio.ch.ServerSocketChannelImpl.accept(ServerSocketChannelImpl.java:147)
[junit4:junit4]   2> 	        at org.eclipse.jetty.server.nio.SelectChannelConnector.accept(SelectChannelConnector.java:104)
[junit4:junit4]   2> 	        at org.eclipse.jetty.server.AbstractConnector$Acceptor.run(AbstractConnector.java:933)
[junit4:junit4]   2> 	        at org.eclipse.jetty.util.thread.QueuedThreadPool.runJob(QueuedThreadPool.java:599)
[junit4:junit4]   2> 	        at org.eclipse.jetty.util.thread.QueuedThreadPool$3.run(QueuedThreadPool.java:534)
[junit4:junit4]   2> 	        at java.lang.Thread.run(Thread.java:679)
[junit4:junit4]   2> 	   4) Thread[id=23, name=qtp2103606155-23 Acceptor0 SelectChannelConnector@0.0.0.0:31781, state=BLOCKED, group=TGRP-CacheHeaderTest]
[junit4:junit4]   2> 	        at sun.nio.ch.ServerSocketChannelImpl.accept(ServerSocketChannelImpl.java:147)
[junit4:junit4]   2> 	        at org.eclipse.jetty.server.nio.SelectChannelConnector.accept(SelectChannelConnector.java:104)
[junit4:junit4]   2> 	        at org.eclipse.jetty.server.AbstractConnector$Acceptor.run(AbstractConnector.java:933)
[junit4:junit4]   2> 	        at org.eclipse.jetty.util.thread.QueuedThreadPool.runJob(QueuedThreadPool.java:599)
[junit4:junit4]   2> 	        at org.eclipse.jetty.util.thread.QueuedThreadPool$3.run(QueuedThreadPool.java:534)
[junit4:junit4]   2> 	        at java.lang.Thread.run(Thread.java:679)
[junit4:junit4]   2> 24525 T15 ccr.ThreadLeakControl.tryToInterruptAll Starting to interrupt leaked threads:
[junit4:junit4]   2> 	   1) Thread[id=24, name=qtp2103606155-24 Acceptor1 SelectChannelConnector@0.0.0.0:31781, state=RUNNABLE, group=TGRP-CacheHeaderTest]
[junit4:junit4]   2> 	   2) Thread[id=25, name=qtp2103606155-25 Acceptor2 SelectChannelConnector@0.0.0.0:31781, state=BLOCKED, group=TGRP-CacheHeaderTest]
[junit4:junit4]   2> 	   3) Thread[id=26, name=qtp2103606155-26 Acceptor3 SelectChannelConnector@0.0.0.0:31781, state=BLOCKED, group=TGRP-CacheHeaderTest]
[junit4:junit4]   2> 	   4) Thread[id=23, name=qtp2103606155-23 Acceptor0 SelectChannelConnector@0.0.0.0:31781, state=BLOCKED, group=TGRP-CacheHeaderTest]
[junit4:junit4]   2> 27569 T15 ccr.ThreadLeakControl.tryToInterruptAll SEVERE There are still zombie threads that couldn't be terminated:
[junit4:junit4]   2> 	   1) Thread[id=24, name=qtp2103606155-24 Acceptor1 SelectChannelConnector@0.0.0.0:31781, state=RUNNABLE, group=TGRP-CacheHeaderTest]
[junit4:junit4]   2> 	        at sun.nio.ch.ServerSocketChannelImpl.accept0(Native Method)
[junit4:junit4]   2> 	        at sun.nio.ch.ServerSocketChannelImpl.accept(ServerSocketChannelImpl.java:163)
[junit4:junit4]   2> 	        at org.eclipse.jetty.server.nio.SelectChannelConnector.accept(SelectChannelConnector.java:104)
[junit4:junit4]   2> 	        at org.eclipse.jetty.server.AbstractConnector$Acceptor.run(AbstractConnector.java:933)
[junit4:junit4]   2> 	        at org.eclipse.jetty.util.thread.QueuedThreadPool.runJob(QueuedThreadPool.java:599)
[junit4:junit4]   2> 	        at org.eclipse.jetty.util.thread.QueuedThreadPool$3.run(QueuedThreadPool.java:534)
[junit4:junit4]   2> 	        at java.lang.Thread.run(Thread.java:679)
[junit4:junit4]   2> 	   2) Thread[id=25, name=qtp2103606155-25 Acceptor2 SelectChannelConnector@0.0.0.0:31781, state=BLOCKED, group=TGRP-CacheHeaderTest]
[junit4:junit4]   2> 	        at sun.nio.ch.ServerSocketChannelImpl.accept(ServerSocketChannelImpl.java:147)
[junit4:junit4]   2> 	        at org.eclipse.jetty.server.nio.SelectChannelConnector.accept(SelectChannelConnector.java:104)
[junit4:junit4]   2> 	        at org.eclipse.jetty.server.AbstractConnector$Acceptor.run(AbstractConnector.java:933)
[junit4:junit4]   2> 	        at org.eclipse.jetty.util.thread.QueuedThreadPool.runJob(QueuedThreadPool.java:599)
[junit4:junit4]   2> 	        at org.eclipse.jetty.util.thread.QueuedThreadPool$3.run(QueuedThreadPool.java:534)
[junit4:junit4]   2> 	        at java.lang.Thread.run(Thread.java:679)
[junit4:junit4]   2> 	   3) Thread[id=26, name=qtp2103606155-26 Acceptor3 SelectChannelConnector@0.0.0.0:31781, state=BLOCKED, group=TGRP-CacheHeaderTest]
[junit4:junit4]   2> 	        at sun.nio.ch.ServerSocketChannelImpl.accept(ServerSocketChannelImpl.java:147)
[junit4:junit4]   2> 	        at org.eclipse.jetty.server.nio.SelectChannelConnector.accept(SelectChannelConnector.java:104)
[junit4:junit4]   2> 	        at org.eclipse.jetty.server.AbstractConnector$Acceptor.run(AbstractConnector.java:933)
[junit4:junit4]   2> 	        at org.eclipse.jetty.util.thread.QueuedThreadPool.runJob(QueuedThreadPool.java:599)
[junit4:junit4]   2> 	        at org.eclipse.jetty.util.thread.QueuedThreadPool$3.run(QueuedThreadPool.java:534)
[junit4:junit4]   2> 	        at java.lang.Thread.run(Thread.java:679)
[junit4:junit4]   2> 	   4) Thread[id=23, name=qtp2103606155-23 Acceptor0 SelectChannelConnector@0.0.0.0:31781, state=BLOCKED, group=TGRP-CacheHeaderTest]
[junit4:junit4]   2> 	        at sun.nio.ch.ServerSocketChannelImpl.accept(ServerSocketChannelImpl.java:147)
[junit4:junit4]   2> 	        at org.eclipse.jetty.server.nio.SelectChannelConnector.accept(SelectChannelConnector.java:104)
[junit4:junit4]   2> 	        at org.eclipse.jetty.server.AbstractConnector$Acceptor.run(AbstractConnector.java:933)
[junit4:junit4]   2> 	        at org.eclipse.jetty.util.thread.QueuedThreadPool.runJob(QueuedThreadPool.java:599)
[junit4:junit4]   2> 	        at org.eclipse.jetty.util.thread.QueuedThreadPool$3.run(QueuedThreadPool.java:534)
[junit4:junit4]   2> 	        at java.lang.Thread.run(Thread.java:679)
[junit4:junit4]   2> NOTE: test params are: codec=SimpleText, sim=DefaultSimilarity, locale=ar_OM, timezone=US/Indiana-Starke
[junit4:junit4]   2> NOTE: FreeBSD 9.0-RELEASE amd64/Sun Microsystems Inc. 1.6.0_32 (64-bit)/cpus=16,threads=5,free=457513232,total=492830720
[junit4:junit4]   2> NOTE: All tests run in this JVM: [FileBasedSpellCheckerTest, CacheHeaderTest]
[junit4:junit4]   2> NOTE: download the large Jenkins line-docs file by running 'ant get-jenkins-line-docs' in the lucene directory.
[junit4:junit4]   2> NOTE: reproduce with: ant test  -Dtestcase=CacheHeaderTest -Dtests.seed=8A7C242F25B7715C -Dtests.multiplier=3 -Dtests.nightly=true -Dtests.slow=true -Dtests.linedocsfile=/home/hudson/lucene-data/enwiki.random.lines.txt -Dtests.locale=ar_OM -Dtests.timezone=US/Indiana-Starke -Dtests.file.encoding=ISO8859-1
[junit4:junit4] ERROR   0.00s J0 | CacheHeaderTest (suite) <<<
[junit4:junit4]    > Throwable #1: com.carrotsearch.randomizedtesting.ThreadLeakError: 4 threads leaked from SUITE scope at org.apache.solr.servlet.CacheHeaderTest: 
[junit4:junit4]    >    1) Thread[id=24, name=qtp2103606155-24 Acceptor1 SelectChannelConnector@0.0.0.0:31781, state=RUNNABLE, group=TGRP-CacheHeaderTest]
[junit4:junit4]    >         at sun.nio.ch.ServerSocketChannelImpl.accept0(Native Method)
[junit4:junit4]    >         at sun.nio.ch.ServerSocketChannelImpl.accept(ServerSocketChannelImpl.java:163)
[junit4:junit4]    >         at org.eclipse.jetty.server.nio.SelectChannelConnector.accept(SelectChannelConnector.java:104)
[junit4:junit4]    >         at org.eclipse.jetty.server.AbstractConnector$Acceptor.run(AbstractConnector.java:933)
[junit4:junit4]    >         at org.eclipse.jetty.util.thread.QueuedThreadPool.runJob(QueuedThreadPool.java:599)
[junit4:junit4]    >         at org.eclipse.jetty.util.thread.QueuedThreadPool$3.run(QueuedThreadPool.java:534)
[junit4:junit4]    >         at java.lang.Thread.run(Thread.java:679)
[junit4:junit4]    >    2) Thread[id=25, name=qtp2103606155-25 Acceptor2 SelectChannelConnector@0.0.0.0:31781, state=BLOCKED, group=TGRP-CacheHeaderTest]
[junit4:junit4]    >         at sun.nio.ch.ServerSocketChannelImpl.accept(ServerSocketChannelImpl.java:147)
[junit4:junit4]    >         at org.eclipse.jetty.server.nio.SelectChannelConnector.accept(SelectChannelConnector.java:104)
[junit4:junit4]    >         at org.eclipse.jetty.server.AbstractConnector$Acceptor.run(AbstractConnector.java:933)
[junit4:junit4]    >         at org.eclipse.jetty.util.thread.QueuedThreadPool.runJob(QueuedThreadPool.java:599)
[junit4:junit4]    >         at org.eclipse.jetty.util.thread.QueuedThreadPool$3.run(QueuedThreadPool.java:534)
[junit4:junit4]    >         at java.lang.Thread.run(Thread.java:679)
[junit4:junit4]    >    3) Thread[id=26, name=qtp2103606155-26 Acceptor3 SelectChannelConnector@0.0.0.0:31781, state=BLOCKED, group=TGRP-CacheHeaderTest]
[junit4:junit4]    >         at sun.nio.ch.ServerSocketChannelImpl.accept(ServerSocketChannelImpl.java:147)
[junit4:junit4]    >         at org.eclipse.jetty.server.nio.SelectChannelConnector.accept(SelectChannelConnector.java:104)
[junit4:junit4]    >         at org.eclipse.jetty.server.AbstractConnector$Acceptor.run(AbstractConnector.java:933)
[junit4:junit4]    >         at org.eclipse.jetty.util.thread.QueuedThreadPool.runJob(QueuedThreadPool.java:599)
[junit4:junit4]    >         at org.eclipse.jetty.util.thread.QueuedThreadPool$3.run(QueuedThreadPool.java:534)
[junit4:junit4]    >         at java.lang.Thread.run(Thread.java:679)
[junit4:junit4]    >    4) Thread[id=23, name=qtp2103606155-23 Acceptor0 SelectChannelConnector@0.0.0.0:31781, state=BLOCKED, group=TGRP-CacheHeaderTest]
[junit4:junit4]    >         at sun.nio.ch.ServerSocketChannelImpl.accept(ServerSocketChannelImpl.java:147)
[junit4:junit4]    >         at org.eclipse.jetty.server.nio.SelectChannelConnector.accept(SelectChannelConnector.java:104)
[junit4:junit4]    >         at org.eclipse.jetty.server.AbstractConnector$Acceptor.run(AbstractConnector.java:933)
[junit4:junit4]    >         at org.eclipse.jetty.util.thread.QueuedThreadPool.runJob(QueuedThreadPool.java:599)
[junit4:junit4]    >         at org.eclipse.jetty.util.thread.QueuedThreadPool$3.run(QueuedThreadPool.java:534)
[junit4:junit4]    >         at java.lang.Thread.run(Thread.java:679)
[junit4:junit4]    > 	at __randomizedtesting.SeedInfo.seed([8A7C242F25B7715C]:0)
[junit4:junit4]    > Throwable #2: com.carrotsearch.randomizedtesting.ThreadLeakError: There are still zombie threads that couldn't be terminated:
[junit4:junit4]    >    1) Thread[id=24, name=qtp2103606155-24 Acceptor1 SelectChannelConnector@0.0.0.0:31781, state=RUNNABLE, group=TGRP-CacheHeaderTest]
[junit4:junit4]    >         at sun.nio.ch.ServerSocketChannelImpl.accept0(Native Method)
[junit4:junit4]    >         at sun.nio.ch.ServerSocketChannelImpl.accept(ServerSocketChannelImpl.java:163)
[junit4:junit4]    >         at org.eclipse.jetty.server.nio.SelectChannelConnector.accept(SelectChannelConnector.java:104)
[junit4:junit4]    >         at org.eclipse.jetty.server.AbstractConnector$Acceptor.run(AbstractConnector.java:933)
[junit4:junit4]    >         at org.eclipse.jetty.util.thread.QueuedThreadPool.runJob(QueuedThreadPool.java:599)
[junit4:junit4]    >         at org.eclipse.jetty.util.thread.QueuedThreadPool$3.run(QueuedThreadPool.java:534)
[junit4:junit4]    >         at java.lang.Thread.run(Thread.java:679)
[junit4:junit4]    >    2) Thread[id=25, name=qtp2103606155-25 Acceptor2 SelectChannelConnector@0.0.0.0:31781, state=BLOCKED, group=TGRP-CacheHeaderTest]
[junit4:junit4]    >         at sun.nio.ch.ServerSocketChannelImpl.accept(ServerSocketChannelImpl.java:147)
[junit4:junit4]    >         at org.eclipse.jetty.server.nio.SelectChannelConnector.accept(SelectChannelConnector.java:104)
[junit4:junit4]    >         at org.eclipse.jetty.server.AbstractConnector$Acceptor.run(AbstractConnector.java:933)
[junit4:junit4]    >         at org.eclipse.jetty.util.thread.QueuedThreadPool.runJob(QueuedThreadPool.java:599)
[junit4:junit4]    >         at org.eclipse.jetty.util.thread.QueuedThreadPool$3.run(QueuedThreadPool.java:534)
[junit4:junit4]    >         at java.lang.Thread.run(Thread.java:679)
[junit4:junit4]    >    3) Thread[id=26, name=qtp2103606155-26 Acceptor3 SelectChannelConnector@0.0.0.0:31781, state=BLOCKED, group=TGRP-CacheHeaderTest]
[junit4:junit4]    >         at sun.nio.ch.ServerSocketChannelImpl.accept(ServerSocketChannelImpl.java:147)
[junit4:junit4]    >         at org.eclipse.jetty.server.nio.SelectChannelConnector.accept(SelectChannelConnector.java:104)
[junit4:junit4]    >         at org.eclipse.jetty.server.AbstractConnector$Acceptor.run(AbstractConnector.java:933)
[junit4:junit4]    >         at org.eclipse.jetty.util.thread.QueuedThreadPool.runJob(QueuedThreadPool.java:599)
[junit4:junit4]    >         at org.eclipse.jetty.util.thread.QueuedThreadPool$3.run(QueuedThreadPool.java:534)
[junit4:junit4]    >         at java.lang.Thread.run(Thread.java:679)
[junit4:junit4]    >    4) Thread[id=23, name=qtp2103606155-23 Acceptor0 SelectChannelConnector@0.0.0.0:31781, state=BLOCKED, group=TGRP-CacheHeaderTest]
[junit4:junit4]    >         at sun.nio.ch.ServerSocketChannelImpl.accept(ServerSocketChannelImpl.java:147)
[junit4:junit4]    >         at org.eclipse.jetty.server.nio.SelectChannelConnector.accept(SelectChannelConnector.java:104)
[junit4:junit4]    >         at org.eclipse.jetty.server.AbstractConnector$Acceptor.run(AbstractConnector.java:933)
[junit4:junit4]    >         at org.eclipse.jetty.util.thread.QueuedThreadPool.runJob(QueuedThreadPool.java:599)
[junit4:junit4]    >         at org.eclipse.jetty.util.thread.QueuedThreadPool$3.run(QueuedThreadPool.java:534)
[junit4:junit4]    >         at java.lang.Thread.run(Thread.java:679)
[junit4:junit4]    > 	at __randomizedtesting.SeedInfo.seed([8A7C242F25B7715C]:0)
[junit4:junit4] Completed on J0 in 27.77s, 5 tests, 2 errors <<< FAILURES!

[...truncated 175 lines...]
[junit4:junit4] Suite: org.apache.solr.request.TestRemoteStreaming
[junit4:junit4]   2> 0 T29 oas.SolrTestCaseJ4.initCore ####initCore
[junit4:junit4]   2> Creating dataDir: /usr/home/hudson/hudson-slave/workspace/Lucene-Solr-NightlyTests-trunk/solr/build/solr-core/test/J1/./solrtest-TestRemoteStreaming-1352216706015
[junit4:junit4]   2> 1 T29 oas.SolrTestCaseJ4.initCore ####initCore end
[junit4:junit4]   2> 618 T29 oejs.Server.doStart jetty-8.1.2.v20120308
[junit4:junit4]   2> 1018 T29 oejs.AbstractConnector.doStart Started SelectChannelConnector@0.0.0.0:18647
[junit4:junit4]   2> 1045 T29 oasc.SolrResourceLoader.locateSolrHome JNDI not configured for solr (NoInitialContextEx)
[junit4:junit4]   2> 1046 T29 oasc.SolrResourceLoader.locateSolrHome using system property solr.solr.home: solr/
[junit4:junit4]   2> 1046 T29 oasc.SolrResourceLoader.<init> new SolrResourceLoader for deduced Solr Home: 'solr/'
[junit4:junit4]   2> 1086 T29 oass.SolrDispatchFilter.init SolrDispatchFilter.init()
[junit4:junit4]   2> 1087 T29 oasc.SolrResourceLoader.locateSolrHome JNDI not configured for solr (NoInitialContextEx)
[junit4:junit4]   2> 1088 T29 oasc.SolrResourceLoader.locateSolrHome using system property solr.solr.home: solr/
[junit4:junit4]   2> 1088 T29 oasc.CoreContainer$Initializer.initialize looking for solr.xml: /usr/home/hudson/hudson-slave/workspace/Lucene-Solr-NightlyTests-trunk/solr/build/solr-core/test/J1/solr/solr.xml
[junit4:junit4]   2> 1088 T29 oasc.CoreContainer.<init> New CoreContainer 587199138
[junit4:junit4]   2> 1089 T29 oasc.CoreContainer$Initializer.initialize no solr.xml file found - using default
[junit4:junit4]   2> 1090 T29 oasc.CoreContainer.load Loading CoreContainer using Solr Home: 'solr/'
[junit4:junit4]   2> 1090 T29 oasc.SolrResourceLoader.<init> new SolrResourceLoader for directory: 'solr/'
[junit4:junit4]   2> 1128 T29 oasc.CoreContainer.load Registering Log Listener
[junit4:junit4]   2> 1174 T29 oasc.CoreContainer.create Creating SolrCore 'collection1' using instanceDir: solr/collection1
[junit4:junit4]   2> 1176 T29 oasc.SolrResourceLoader.<init> new SolrResourceLoader for directory: 'solr/collection1/'
[junit4:junit4]   2> 1253 T29 oasc.SolrConfig.<init> Using Lucene MatchVersion: LUCENE_50
[junit4:junit4]   2> 1328 T29 oasc.SolrConfig.<init> Loaded SolrConfig: solrconfig.xml
[junit4:junit4]   2> 1331 T29 oass.IndexSchema.readSchema Reading Solr Schema
[junit4:junit4]   2> 1364 T29 oass.IndexSchema.readSchema Schema name=test
[junit4:junit4]   2> 1849 T29 oass.OpenExchangeRatesOrgProvider.init Initialized with rates=open-exchange-rates.json, refreshInterval=1440.
[junit4:junit4]   2> 1860 T29 oass.IndexSchema.readSchema default search field in schema is text
[junit4:junit4]   2> 1863 T29 oass.IndexSchema.readSchema unique key field: id
[junit4:junit4]   2> 1891 T29 oass.FileExchangeRateProvider.reload Reloading exchange rates from file currency.xml
[junit4:junit4]   2> 1901 T29 oass.FileExchangeRateProvider.reload Reloading exchange rates from file currency.xml
[junit4:junit4]   2> 1906 T29 oass.OpenExchangeRatesOrgProvider.reload Reloading exchange rates from open-exchange-rates.json
[junit4:junit4]   2> 1911 T29 oass.OpenExchangeRatesOrgProvider.reload Reloading exchange rates from open-exchange-rates.json
[junit4:junit4]   2> 1914 T29 oasc.SolrCore.<init> [collection1] Opening new SolrCore at solr/collection1/, dataDir=/usr/home/hudson/hudson-slave/workspace/Lucene-Solr-NightlyTests-trunk/solr/build/solr-core/test/J1/solrtest-TestRemoteStreaming-1352216706015/
[junit4:junit4]   2> 1915 T29 oasc.JmxMonitoredMap.<init> JMX monitoring is enabled. Adding Solr mbeans to JMX Server: com.sun.jmx.mbeanserver.JmxMBeanServer@44739f3f
[junit4:junit4]   2> 1916 T29 oasc.SolrCore.initDirectoryFactory org.apache.solr.core.MockDirectoryFactory
[junit4:junit4]   2> 1916 T29 oasc.CachingDirectoryFactory.injectLockFactory WARNING No lockType configured for BaseDirectoryWrapper(org.apache.lucene.store.RAMDirectory@45e4d960 lockFactory=org.apache.lucene.store.SingleInstanceLockFactory@337b5179) assuming 'simple'
[junit4:junit4]   2> 1917 T29 oasc.CachingDirectoryFactory.get return new directory for /usr/home/hudson/hudson-slave/workspace/Lucene-Solr-NightlyTests-trunk/solr/build/solr-core/test/J1/solrtest-TestRemoteStreaming-1352216706015 forceNew:false
[junit4:junit4]   2> 1917 T29 oasc.CachingDirectoryFactory.close Releasing directory:/usr/home/hudson/hudson-slave/workspace/Lucene-Solr-NightlyTests-trunk/solr/build/solr-core/test/J1/solrtest-TestRemoteStreaming-1352216706015
[junit4:junit4]   2> 1918 T29 oasc.SolrCore.getNewIndexDir New index directory detected: old=null new=/usr/home/hudson/hudson-slave/workspace/Lucene-Solr-NightlyTests-trunk/solr/build/solr-core/test/J1/solrtest-TestRemoteStreaming-1352216706015/index/
[junit4:junit4]   2> 1918 T29 oasc.SolrCore.initIndex WARNING [collection1] Solr index directory '/usr/home/hudson/hudson-slave/workspace/Lucene-Solr-NightlyTests-trunk/solr/build/solr-core/test/J1/solrtest-TestRemoteStreaming-1352216706015/index' doesn't exist. Creating new index...
[junit4:junit4]   2> 1919 T29 oasc.CachingDirectoryFactory.get return new directory for /usr/home/hudson/hudson-slave/workspace/Lucene-Solr-NightlyTests-trunk/solr/build/solr-core/test/J1/solrtest-TestRemoteStreaming-1352216706015/index forceNew:false
[junit4:junit4]   2> 1930 T29 oasc.SolrDeletionPolicy.onCommit SolrDeletionPolicy.onCommit: commits:num=1
[junit4:junit4]   2> 		commit{dir=MockDirWrapper(org.apache.lucene.store.RAMDirectory@5636bc0a lockFactory=org.apache.lucene.store.NativeFSLockFactory@6bd46c20),segFN=segments_1,generation=1,filenames=[segments_1]
[junit4:junit4]   2> 1930 T29 oasc.SolrDeletionPolicy.updateCommits newest commit = 1[segments_1]
[junit4:junit4]   2> 1931 T29 oasc.CachingDirectoryFactory.close Releasing directory:/usr/home/hudson/hudson-slave/workspace/Lucene-Solr-NightlyTests-trunk/solr/build/solr-core/test/J1/solrtest-TestRemoteStreaming-1352216706015/index
[junit4:junit4]   2> 1932 T29 oasc.SolrCore.initWriters created xml: solr.XMLResponseWriter
[junit4:junit4]   2> 1934 T29 oasup.UpdateRequestProcessorChain.init inserting DistributedUpdateProcessorFactory into updateRequestProcessorChain "dedupe"
[junit4:junit4]   2> 1934 T29 oasup.UpdateRequestProcessorChain.init inserting DistributedUpdateProcessorFactory into updateRequestProcessorChain "dedupe-allfields"
[junit4:junit4]   2> 1935 T29 oasup.UpdateRequestProcessorChain.init inserting DistributedUpdateProcessorFactory into updateRequestProcessorChain "stored_sig"
[junit4:junit4]   2> 1935 T29 oasup.UpdateRequestProcessorChain.init inserting DistributedUpdateProcessorFactory into updateRequestProcessorChain "uniq-fields"
[junit4:junit4]   2> 1936 T29 oasup.UpdateRequestProcessorChain.init inserting DistributedUpdateProcessorFactory into updateRequestProcessorChain "distrib-dup-test-chain-implicit"
[junit4:junit4]   2> 1937 T29 oasc.RequestHandlers.initHandlersFromConfig adding lazy requestHandler: solr.ReplicationHandler
[junit4:junit4]   2> 1937 T29 oasc.RequestHandlers.initHandlersFromConfig created /replication: solr.ReplicationHandler
[junit4:junit4]   2> 1939 T29 oasc.RequestHandlers.initHandlersFromConfig created standard: solr.StandardRequestHandler
[junit4:junit4]   2> 1940 T29 oasc.RequestHandlers.initHandlersFromConfig created /get: solr.RealTimeGetHandler
[junit4:junit4]   2> 1942 T29 oasc.RequestHandlers.initHandlersFromConfig created dismax: solr.SearchHandler
[junit4:junit4]   2> 1943 T29 oasc.RequestHandlers.initHandlersFromConfig created mock: org.apache.solr.core.MockQuerySenderListenerReqHandler
[junit4:junit4]   2> 1944 T29 oasc.RequestHandlers.initHandlersFromConfig created /admin/: org.apache.solr.handler.admin.AdminHandlers
[junit4:junit4]   2> 1946 T29 oasc.RequestHandlers.initHandlersFromConfig created defaults: solr.StandardRequestHandler
[junit4:junit4]   2> 1946 T29 oasc.RequestHandlers.initHandlersFromConfig adding lazy requestHandler: solr.StandardRequestHandler
[junit4:junit4]   2> 1947 T29 oasc.RequestHandlers.initHandlersFromConfig created lazy: solr.StandardRequestHandler
[junit4:junit4]   2> 1948 T29 oasc.RequestHandlers.initHandlersFromConfig created /update: solr.UpdateRequestHandler
[junit4:junit4]   2> 1950 T29 oasc.RequestHandlers.initHandlersFromConfig created /terms: org.apache.solr.handler.component.SearchHandler
[junit4:junit4]   2> 1951 T29 oasc.RequestHandlers.initHandlersFromConfig created spellCheckCompRH: org.apache.solr.handler.component.SearchHandler
[junit4:junit4]   2> 1953 T29 oasc.RequestHandlers.initHandlersFromConfig created spellCheckCompRH_Direct: org.apache.solr.handler.component.SearchHandler
[junit4:junit4]   2> 1954 T29 oasc.RequestHandlers.initHandlersFromConfig created spellCheckWithWordbreak: org.apache.solr.handler.component.SearchHandler
[junit4:junit4]   2> 1956 T29 oasc.RequestHandlers.initHandlersFromConfig created spellCheckWithWordbreak_Direct: org.apache.solr.handler.component.SearchHandler
[junit4:junit4]   2> 1957 T29 oasc.RequestHandlers.initHandlersFromConfig created spellCheckCompRH1: org.apache.solr.handler.component.SearchHandler
[junit4:junit4]   2> 1959 T29 oasc.RequestHandlers.initHandlersFromConfig created tvrh: org.apache.solr.handler.component.SearchHandler
[junit4:junit4]   2> 1960 T29 oasc.RequestHandlers.initHandlersFromConfig created /mlt: solr.MoreLikeThisHandler
[junit4:junit4]   2> 1962 T29 oasc.RequestHandlers.initHandlersFromConfig created /debug/dump: solr.DumpRequestHandler
[junit4:junit4]   2> 1967 T29 oashl.XMLLoader.init xsltCacheLifetimeSeconds=60
[junit4:junit4]   2> 1971 T29 oasc.SolrCore.initDeprecatedSupport WARNING solrconfig.xml uses deprecated <admin/gettableFiles>, Please update your config to use the ShowFileRequestHandler.
[junit4:junit4]   2> 1973 T29 oasc.SolrCore.initDeprecatedSupport WARNING adding ShowFileRequestHandler with hidden files: []
[junit4:junit4]   2> 1976 T29 oasc.CachingDirectoryFactory.close Releasing directory:/usr/home/hudson/hudson-slave/workspace/Lucene-Solr-NightlyTests-trunk/solr/build/solr-core/test/J1/solrtest-TestRemoteStreaming-1352216706015
[junit4:junit4]   2> 1976 T29 oass.SolrIndexSearcher.<init> Opening Searcher@e1641c0 main
[junit4:junit4]   2> 1977 T29 oasu.CommitTracker.<init> Hard AutoCommit: disabled
[junit4:junit4]   2> 1978 T29 oasu.CommitTracker.<init> Soft AutoCommit: disabled
[junit4:junit4]   2> 1978 T29 oashc.SpellCheckComponent.inform Initializing spell checkers
[junit4:junit4]   2> 1998 T29 oass.DirectSolrSpellChecker.init init: {name=direct,classname=DirectSolrSpellChecker,field=lowerfilt,minQueryLength=3}
[junit4:junit4]   2> 2043 T29 oashc.HttpShardHandlerFactory.getParameter Setting socketTimeout to: 0
[junit4:junit4]   2> 2044 T29 oashc.HttpShardHandlerFactory.getParameter Setting urlScheme to: http://
[junit4:junit4]   2> 2044 T29 oashc.HttpShardHandlerFactory.getParameter Setting connTimeout to: 0
[junit4:junit4]   2> 2045 T29 oashc.HttpShardHandlerFactory.getParameter Setting maxConnectionsPerHost to: 20
[junit4:junit4]   2> 2045 T29 oashc.HttpShardHandlerFactory.getParameter Setting corePoolSize to: 0
[junit4:junit4]   2> 2045 T29 oashc.HttpShardHandlerFactory.getParameter Setting maximumPoolSize to: 2147483647
[junit4:junit4]   2> 2046 T29 oashc.HttpShardHandlerFactory.getParameter Setting maxThreadIdleTime to: 5
[junit4:junit4]   2> 2046 T29 oashc.HttpShardHandlerFactory.getParameter Setting sizeOfQueue to: -1
[junit4:junit4]   2> 2046 T29 oashc.HttpShardHandlerFactory.getParameter Setting fairnessPolicy to: false
[junit4:junit4]   2> 2047 T29 oascsi.HttpClientUtil.createClient Creating new http client, config:maxConnectionsPerHost=20&maxConnections=10000&socketTimeout=0&connTimeout=0&retry=false
[junit4:junit4]   2> 2070 T44 oasc.SolrCore.registerSearcher [collection1] Registered new searcher Searcher@e1641c0 main{StandardDirectoryReader(segments_1:1)}
[junit4:junit4]   2> 2079 T29 oasc.CoreContainer.registerCore registering core: collection1
[junit4:junit4]   2> 2079 T29 oass.SolrDispatchFilter.init user.dir=/usr/home/hudson/hudson-slave/workspace/Lucene-Solr-NightlyTests-trunk/solr/build/solr-core/test/J1
[junit4:junit4]   2> 2079 T29 oass.SolrDispatchFilter.init SolrDispatchFilter.init() done
[junit4:junit4]   2> 2080 T29 oas.SolrJettyTestBase.createJetty Jetty Assigned Port#18647
[junit4:junit4]   2> 2087 T29 oas.SolrTestCaseJ4.setUp ###Starting testQtUpdateFails
[junit4:junit4]   2> 2132 T29 oascsi.HttpClientUtil.createClient Creating new http client, config:maxConnections=128&maxConnectionsPerHost=32&followRedirects=false
[junit4:junit4]   2> ASYNC  NEW_CORE C1 name=collection1 org.apache.solr.core.SolrCore@4bbf8a41
[junit4:junit4]   2> 3127 T40 C1 oasc.CachingDirectoryFactory.close Releasing directory:/usr/home/hudson/hudson-slave/workspace/Lucene-Solr-NightlyTests-trunk/solr/build/solr-core/test/J1/solrtest-TestRemoteStreaming-1352216706015
[junit4:junit4]   2> 3130 T40 C1 oasc.SolrDeletionPolicy.onInit SolrDeletionPolicy.onInit: commits:num=1
[junit4:junit4]   2> 		commit{dir=MockDirWrapper(org.apache.lucene.store.RAMDirectory@5636bc0a lockFactory=org.apache.lucene.store.NativeFSLockFactory@6bd46c20),segFN=segments_1,generation=1,filenames=[segments_1]
[junit4:junit4]   2> 3131 T40 C1 oasc.SolrDeletionPolicy.updateCommits newest commit = 1[segments_1]
[junit4:junit4]   2> 3133 T40 C1 UPDATE [collection1] webapp=/solr path=/update params={wt=javabin&version=2} {add=[1234]} 0 17
[junit4:junit4]   2> 3307 T43 C1 oasu.DirectUpdateHandler2.commit start commit{flags=0,_version_=0,optimize=false,openSearcher=true,waitSearcher=true,expungeDeletes=false,softCommit=false}
[junit4:junit4]   2> 3328 T43 C1 oasc.SolrDeletionPolicy.onCommit SolrDeletionPolicy.onCommit: commits:num=2
[junit4:junit4]   2> 		commit{dir=MockDirWrapper(org.apache.lucene.store.RAMDirectory@5636bc0a lockFactory=org.apache.lucene.store.NativeFSLockFactory@6bd46c20),segFN=segments_1,generation=1,filenames=[segments_1]
[junit4:junit4]   2> 		commit{dir=MockDirWrapper(org.apache.lucene.store.RAMDirectory@5636bc0a lockFactory=org.apache.lucene.store.NativeFSLockFactory@6bd46c20),segFN=segments_2,generation=2,filenames=[_0_Lucene40_0.tim, _0.fnm, _0_Lucene40_0.frq, _0_nrm.cfe, segments_2, _0.fdx, _0_nrm.cfs, _0.si, _0_Lucene40_0.prx, _0.fdt, _0_Lucene40_0.tip]
[junit4:junit4]   2> 3328 T43 C1 oasc.SolrDeletionPolicy.updateCommits newest commit = 2[_0_Lucene40_0.tim, _0.fnm, _0_Lucene40_0.frq, _0_nrm.cfe, segments_2, _0.fdx, _0_nrm.cfs, _0.si, _0_Lucene40_0.prx, _0.fdt, _0_Lucene40_0.tip]
[junit4:junit4]   2> 3329 T43 C1 oasc.CachingDirectoryFactory.close Releasing directory:/usr/home/hudson/hudson-slave/workspace/Lucene-Solr-NightlyTests-trunk/solr/build/solr-core/test/J1/solrtest-TestRemoteStreaming-1352216706015
[junit4:junit4]   2> 3349 T43 C1 oass.SolrIndexSearcher.<init> Opening Searcher@78952527 main
[junit4:junit4]   2> 3350 T43 C1 oasu.DirectUpdateHandler2.commit end_commit_flush
[junit4:junit4]   2> 3354 T44 oasc.SolrCore.registerSearcher [collection1] Registered new searcher Searcher@78952527 main{StandardDirectoryReader(segments_2:3 _0(5.0):C1)}
[junit4:junit4]   2> 3355 T44 oasc.CachingDirectoryFactory.close Releasing directory:/usr/home/hudson/hudson-slave/workspace/Lucene-Solr-NightlyTests-trunk/solr/build/solr-core/test/J1/solrtest-TestRemoteStreaming-1352216706015/index
[junit4:junit4]   2> 3355 T43 C1 UPDATE [collection1] webapp=/solr path=/update params={waitSearcher=true&wt=javabin&commit=true&softCommit=false&version=2} {commit=} 0 48
[junit4:junit4]   2> 3483 T42 C1 REQ [collection1] webapp=/solr path=/select params={wt=javabin&q=id:1234&version=2} hits=1 status=0 QTime=94 
[junit4:junit4]   2> 3489 T29 oas.SolrTestCaseJ4.tearDown ###Ending testQtUpdateFails
[junit4:junit4]   2> 3501 T29 oas.SolrTestCaseJ4.setUp ###Starting testStreamUrl
[junit4:junit4]   2> 3507 T42 C1 UPDATE [collection1] webapp=/solr path=/update params={wt=javabin&version=2} {add=[1234]} 0 2
[junit4:junit4]   2> 3511 T40 C1 oasu.DirectUpdateHandler2.commit start commit{flags=0,_version_=0,optimize=false,openSearcher=true,waitSearcher=true,expungeDeletes=false,softCommit=false}
[junit4:junit4]   2> 3524 T40 C1 oasc.SolrDeletionPolicy.onCommit SolrDeletionPolicy.onCommit: commits:num=2
[junit4:junit4]   2> 		commit{dir=MockDirWrapper(org.apache.lucene.store.RAMDirectory@5636bc0a lockFactory=org.apache.lucene.store.NativeFSLockFactory@6bd46c20),segFN=segments_2,generation=2,filenames=[_0_Lucene40_0.tim, _0.fnm, _0_Lucene40_0.frq, _0_nrm.cfe, segments_2, _0.fdx, _0_nrm.cfs, _0.si, _0_Lucene40_0.prx, _0.fdt, _0_Lucene40_0.tip]
[junit4:junit4]   2> 		commit{dir=MockDirWrapper(org.apache.lucene.store.RAMDirectory@5636bc0a lockFactory=org.apache.lucene.store.NativeFSLockFactory@6bd46c20),segFN=segments_3,generation=3,filenames=[_1_Lucene40_0.tim, _1.fdx, _1_nrm.cfs, _1.fdt, _1.si, _1_Lucene40_0.frq, _1.fnm, segments_3, _1_Lucene40_0.prx, _1_Lucene40_0.tip, _1_nrm.cfe]
[junit4:junit4]   2> 3525 T40 C1 oasc.SolrDeletionPolicy.updateCommits newest commit = 3[_1_Lucene40_0.tim, _1.fdx, _1_nrm.cfs, _1.fdt, _1.si, _1_Lucene40_0.frq, _1.fnm, segments_3, _1_Lucene40_0.prx, _1_Lucene40_0.tip, _1_nrm.cfe]
[junit4:junit4]   2> 3526 T40 C1 oasc.CachingDirectoryFactory.close Releasing directory:/usr/home/hudson/hudson-slave/workspace/Lucene-Solr-NightlyTests-trunk/solr/build/solr-core/test/J1/solrtest-TestRemoteStreaming-1352216706015
[junit4:junit4]   2> 3529 T40 C1 oass.SolrIndexSearcher.<init> Opening Searcher@7ac4b626 main
[junit4:junit4]   2> 3530 T40 C1 oasu.DirectUpdateHandler2.commit end_commit_flush
[junit4:junit4]   2> 3534 T44 oasc.SolrCore.registerSearcher [collection1] Registered new searcher Searcher@7ac4b626 main{StandardDirectoryReader(segments_3:7 _1(5.0):C1)}
[junit4:junit4]   2> 3536 T44 oasc.CachingDirectoryFactory.close Releasing directory:/usr/home/hudson/hudson-slave/workspace/Lucene-Solr-NightlyTests-trunk/solr/build/solr-core/test/J1/solrtest-TestRemoteStreaming-1352216706015/index
[junit4:junit4]   2> 3536 T40 C1 UPDATE [collection1] webapp=/solr path=/update params={waitSearcher=true&wt=javabin&commit=true&softCommit=false&version=2} {commit=} 0 25
[junit4:junit4]   2> 3542 T43 C1 REQ [collection1] webapp=/solr path=/select params={wt=javabin&q=id:1234&version=2} hits=1 status=0 QTime=2 
[junit4:junit4]   2> 3571 T40 C1 REQ [collection1] webapp=/solr path=/select params={wt=csv&q=*:*&fl=id} hits=1 status=0 QTime=7 
[junit4:junit4]   2> 3599 T42 C1 REQ [collection1] webapp=/solr path=/debug/dump params={wt=xml&stream.url=http://127.0.0.1:18647/solr/select?q%3D*:*%26fl%3Did%26wt%3Dcsv} status=0 QTime=37 
[junit4:junit4]   2> 3608 T29 oas.SolrTestCaseJ4.tearDown ###Ending testStreamUrl
[junit4:junit4]   2> 3619 T29 oas.SolrTestCaseJ4.setUp ###Starting testNoUrlAccess
[junit4:junit4]   2> 3625 T43 C1 UPDATE [collection1] webapp=/solr path=/update params={wt=javabin&version=2} {add=[1234]} 0 2
[junit4:junit4]   2> 3629 T40 C1 oasu.DirectUpdateHandler2.commit start commit{flags=0,_version_=0,optimize=false,openSearcher=true,waitSearcher=true,expungeDeletes=false,softCommit=false}
[junit4:junit4]   2> 3633 T40 C1 oasc.SolrDeletionPolicy.onCommit SolrDeletionPolicy.onCommit: commits:num=2
[junit4:junit4]   2> 		commit{dir=MockDirWrapper(org.apache.lucene.store.RAMDirectory@5636bc0a lockFactory=org.apache.lucene.store.NativeFSLockFactory@6bd46c20),segFN=segments_3,generation=3,filenames=[_1_Lucene40_0.tim, _1.fdx, _1_nrm.cfs, _1.fdt, _1.si, _1_Lucene40_0.frq, _1.fnm, segments_3, _1_Lucene40_0.prx, _1_Lucene40_0.tip, _1_nrm.cfe]
[junit4:junit4]   2> 		commit{dir=MockDirWrapper(org.apache.lucene.store.RAMDirectory@5636bc0a lockFactory=org.apache.lucene.store.NativeFSLockFactory@6bd46c20),segFN=segments_4,generation=4,filenames=[_2.si, _2_Lucene40_0.tip, _2_nrm.cfe, _2_Lucene40_0.frq, _2_Lucene40_0.prx, _2.fdt, _2_Lucene40_0.tim, _2_nrm.cfs, _2.fdx, _2.fnm, segments_4]
[junit4:junit4]   2> 3633 T40 C1 oasc.SolrDeletionPolicy.updateCommits newest commit = 4[_2.si, _2_Lucene40_0.tip, _2_nrm.cfe, _2_Lucene40_0.frq, _2_Lucene40_0.prx, _2.fdt, _2_Lucene40_0.tim, _2_nrm.cfs, _2.fdx, _2.fnm, segments_4]
[junit4:junit4]   2> 3634 T40 C1 oasc.CachingDirectoryFactory.close Releasing directory:/usr/home/hudson/hudson-slave/workspace/Lucene-Solr-NightlyTests-trunk/solr/build/solr-core/test/J1/solrtest-TestRemoteStreaming-1352216706015
[junit4:junit4]   2> 3636 T40 C1 oass.SolrIndexSearcher.<init> Opening Searcher@56ec1e6f main
[junit4:junit4]   2> 3637 T40 C1 oasu.DirectUpdateHandler2.commit end_commit_flush
[junit4:junit4]   2> 3641 T44 oasc.SolrCore.registerSearcher [collection1] Registered new searcher Searcher@56ec1e6f main{StandardDirectoryReader(segments_4:11 _2(5.0):C1)}
[junit4:junit4]   2> 3642 T44 oasc.CachingDirectoryFactory.close Releasing directory:/usr/home/hudson/hudson-slave/workspace/Lucene-Solr-NightlyTests-trunk/solr/build/solr-core/test/J1/solrtest-TestRemoteStreaming-1352216706015/index
[junit4:junit4]   2> 3643 T40 C1 UPDATE [collection1] webapp=/solr path=/update params={waitSearcher=true&wt=javabin&commit=true&softCommit=false&version=2} {commit=} 0 14
[junit4:junit4]   2> 3647 T42 C1 REQ [collection1] webapp=/solr path=/select params={wt=javabin&q=id:1234&version=2} hits=1 status=0 QTime=1 
[junit4:junit4]   2> 3653 T43 C1 REQ [collection1] webapp=/solr path=/select params={wt=javabin&stream.url=http://127.0.0.1:18647/solr/update?commit%3Dtrue%26stream.body%3D%253Cdelete%253E%253Cquery%253E*%253A*%253C%252Fquery%253E%253C%252Fdelete%253E&q=*:*&version=2} hits=1 status=0 QTime=0 
[junit4:junit4]   2> 3658 T40 C1 REQ [collection1] webapp=/solr path=/select params={wt=javabin&q=id:1234&version=2} hits=1 status=0 QTime=1 
[junit4:junit4]   2> 3659 T29 oas.SolrTestCaseJ4.tearDown ###Ending testNoUrlAccess
[junit4:junit4]   2> 3666 T29 oas.SolrTestCaseJ4.setUp ###Starting testMakeDeleteAllUrl
[junit4:junit4]   2> 3671 T42 C1 UPDATE [collection1] webapp=/solr path=/update params={wt=javabin&version=2} {add=[1234]} 0 2
[junit4:junit4]   2> 3677 T43 C1 oasu.DirectUpdateHandler2.commit start commit{flags=0,_version_=0,optimize=false,openSearcher=true,waitSearcher=true,expungeDeletes=false,softCommit=false}
[junit4:junit4]   2> 3685 T43 C1 oasc.SolrDeletionPolicy.onCommit SolrDeletionPolicy.onCommit: commits:num=2
[junit4:junit4]   2> 		commit{dir=MockDirWrapper(org.apache.lucene.store.RAMDirectory@5636bc0a lockFactory=org.apache.lucene.store.NativeFSLockFactory@6bd46c20),segFN=segments_4,generation=4,filenames=[_2.si, _2_Lucene40_0.tip, _2_nrm.cfe, _2_Lucene40_0.frq, _2_Lucene40_0.prx, _2.fdt, _2_Lucene40_0.tim, _2_nrm.cfs, _2.fdx, _2.fnm, segments_4]
[junit4:junit4]   2> 		commit{dir=MockDirWrapper(org.apache.lucene.store.RAMDirectory@5636bc0a lockFactory=org.apache.lucene.store.NativeFSLockFactory@6bd46c20),segFN=segments_5,generation=5,filenames=[_3.fdx, _3_nrm.cfe, _3_Lucene40_0.tip, _3_nrm.cfs, _3_Lucene40_0.frq, _3_Lucene40_0.tim, _3_Lucene40_0.prx, _3.si, _3.fdt, _3.fnm, segments_5]
[junit4:junit4]   2> 3686 T43 C1 oasc.SolrDeletionPolicy.updateCommits newest commit = 5[_3.fdx, _3_nrm.cfe, _3_Lucene40_0.tip, _3_nrm.cfs, _3_Lucene40_0.frq, _3_Lucene40_0.tim, _3_Lucene40_0.prx, _3.si, _3.fdt, _3.fnm, segments_5]
[junit4:junit4]   2> 3688 T43 C1 oasc.CachingDirectoryFactory.close Releasing directory:/usr/home/hudson/hudson-slave/workspace/Lucene-Solr-NightlyTests-trunk/solr/build/solr-core/test/J1/solrtest-TestRemoteStreaming-1352216706015
[junit4:junit4]   2> 3692 T43 C1 oass.SolrIndexSearcher.<init> Opening Searcher@7730661d main
[junit4:junit4]   2> 3693 T43 C1 oasu.DirectUpdateHandler2.commit end_commit_flush
[junit4:junit4]   2> 3699 T44 oasc.SolrCore.registerSearcher [collection1] Registered new searcher Searcher@7730661d main{StandardDirectoryReader(segments_5:15 _3(5.0):C1)}
[junit4:junit4]   2> 3701 T44 oasc.CachingDirectoryFactory.close Releasing directory:/usr/home/hudson/hudson-slave/workspace/Lucene-Solr-NightlyTests-trunk/solr/build/solr-core/test/J1/solrtest-TestRemoteStreaming-1352216706015/index
[junit4:junit4]   2> 3702 T43 C1 UPDATE [collection1] webapp=/solr path=/update params={waitSearcher=true&wt=javabin&commit=true&softCommit=false&version=2} {commit=} 0 25
[junit4:junit4]   2> 3706 T40 C1 REQ [collection1] webapp=/solr path=/select params={wt=javabin&q=id:1234&version=2} hits=1 status=0 QTime=1 
[junit4:junit4]   2> 3709 T42 C1 oasu.DirectUpdateHandler2.deleteAll [collection1] REMOVING ALL DOCUMENTS FROM INDEX
[junit4:junit4]   2> 3710 T42 C1 oasu.DirectUpdateHandler2.commit start commit{flags=0,_version_=0,optimize=false,openSearcher=true,waitSearcher=true,expungeDeletes=false,softCommit=false}
[junit4:junit4]   2> 3711 T42 C1 oasc.SolrDeletionPolicy.onCommit SolrDeletionPolicy.onCommit: commits:num=2
[junit4:junit4]   2> 		commit{dir=MockDirWrapper(org.apache.lucene.store.RAMDirectory@5636bc0a lockFactory=org.apache.lucene.store.NativeFSLockFactory@6bd46c20),segFN=segments_5,generation=5,filenames=[_3.fdx, _3_nrm.cfe, _3_Lucene40_0.tip, _3_nrm.cfs, _3_Lucene40_0.frq, _3_Lucene40_0.tim, _3_Lucene40_0.prx, _3.si, _3.fdt, _3.fnm, segments_5]
[junit4:junit4]   2> 		commit{dir=MockDirWrapper(org.apache.lucene.store.RAMDirectory@5636bc0a lockFactory=org.apache.lucene.store.NativeFSLockFactory@6bd46c20),segFN=segments_6,generation=6,filenames=[segments_6]
[junit4:junit4]   2> 3712 T42 C1 oasc.SolrDeletionPolicy.updateCommits newest commit = 6[segments_6]
[junit4:junit4]   2> 3713 T42 C1 oasc.CachingDirectoryFactory.close Releasing directory:/usr/home/hudson/hudson-slave/workspace/Lucene-Solr-NightlyTests-trunk/solr/build/solr-core/test/J1/solrtest-TestRemoteStreaming-1352216706015
[junit4:junit4]   2> 3714 T42 C1 oass.SolrIndexSearcher.<init> Opening Searcher@1339a0dc main
[junit4:junit4]   2> 3714 T42 C1 oasu.DirectUpdateHandler2.commit end_commit_flush
[junit4:junit4]   2> 3718 T44 oasc.SolrCore.registerSearcher [collection1] Registered new searcher Searcher@1339a0dc main{StandardDirectoryReader(segments_6:16)}
[junit4:junit4]   2> 3719 T42 C1 UPDATE [collection1] webapp=/solr path=/update params={commit=true&stream.body=<delete><query>*:*</query></delete>} {deleteByQuery=*:*,commit=} 0 10
[junit4:junit4]   2> 3721 T42 C1 oasc.CachingDirectoryFactory.close Releasing directory:/usr/home/hudson/hudson-slave/workspace/Lucene-Solr-NightlyTests-trunk/solr/build/solr-core/test/J1/solrtest-TestRemoteStreaming-1352216706015/index
[junit4:junit4]   2> 3725 T43 C1 REQ [collection1] webapp=/solr path=/select params={wt=javabin&q=id:1234&version=2} hits=0 status=0 QTime=1 
[junit4:junit4]   2> 3726 T29 oas.SolrTestCaseJ4.tearDown ###Ending testMakeDeleteAllUrl
[junit4:junit4]   2> 3775 T29 oasc.CoreContainer.shutdown Shutting down CoreContainer instance=587199138
[junit4:junit4]   2> 3775 T29 oasc.SolrCore.close [collection1]  CLOSING SolrCore org.apache.solr.core.SolrCore@4bbf8a41
[junit4:junit4]   2> 3807 T29 oasu.DirectUpdateHandler2.close closing DirectUpdateHandler2{commits=5,autocommits=0,soft autocommits=0,optimizes=0,rollbacks=0,expungeDeletes=0,docsPending=0,adds=0,deletesById=0,deletesByQuery=0,errors=0,cumulative_adds=4,cumulative_deletesById=0,cumulative_deletesByQuery=1,cumulative_errors=0}
[junit4:junit4]   2> 3808 T29 oasc.SolrCore.decrefSolrCoreState Closing SolrCoreState
[junit4:junit4]   2> 3808 T29 oasu.DefaultSolrCoreState.closeIndexWriter SolrCoreState ref count has reached 0 - closing IndexWriter
[junit4:junit4]   2> 3809 T29 oasu.DefaultSolrCoreState.closeIndexWriter closing IndexWriter with IndexWriterCloser
[junit4:junit4]   2> 3810 T29 C1 oasc.CachingDirectoryFactory.close Releasing directory:/usr/home/hudson/hudson-slave/workspace/Lucene-Solr-NightlyTests-trunk/solr/build/solr-core/test/J1/solrtest-TestRemoteStreaming-1352216706015/index
[junit4:junit4]   2> 3811 T29 oasc.SolrCore.closeSearcher [collection1] Closing main searcher on request.
[junit4:junit4]   2> 3812 T29 oasc.CachingDirectoryFactory.close Releasing directory:/usr/home/hudson/hudson-slave/workspace/Lucene-Solr-NightlyTests-trunk/solr/build/solr-core/test/J1/solrtest-TestRemoteStreaming-1352216706015/index
[junit4:junit4]   2> 3813 T29 oejsh.ContextHandler.doStop stopped o.e.j.s.ServletContextHandler{/solr,null}
[junit4:junit4]   2> 3914 T29 oejut.QueuedThreadPool.doStop WARNING 4 threads could not be stopped
[junit4:junit4]   2> 3914 T29 oas.SolrTestCaseJ4.deleteCore ###deleteCore
[junit4:junit4]   2> 3928 T28 ccr.ThreadLeakControl.checkThreadLeaks WARNING Will linger awaiting termination of 4 leaked thread(s).
[junit4:junit4]   2> 24022 T28 ccr.ThreadLeakControl.checkThreadLeaks SEVERE 4 threads leaked from SUITE scope at org.apache.solr.request.TestRemoteStreaming: 
[junit4:junit4]   2> 	   1) Thread[id=36, name=qtp1867825290-36 Acceptor0 SelectChannelConnector@0.0.0.0:18647, state=RUNNABLE, group=TGRP-TestRemoteStreaming]
[junit4:junit4]   2> 	        at sun.nio.ch.ServerSocketChannelImpl.accept0(Native Method)
[junit4:junit4]   2> 	        at sun.nio.ch.ServerSocketChannelImpl.accept(ServerSocketChannelImpl.java:163)
[junit4:junit4]   2> 	        at org.eclipse.jetty.server.nio.SelectChannelConnector.accept(SelectChannelConnector.java:104)
[junit4:junit4]   2> 	        at org.eclipse.jetty.server.AbstractConnector$Acceptor.run(AbstractConnector.java:933)
[junit4:junit4]   2> 	        at org.eclipse.jetty.util.thread.QueuedThreadPool.runJob(QueuedThreadPool.java:599)
[junit4:junit4]   2> 	        at org.eclipse.jetty.util.thread.QueuedThreadPool$3.run(QueuedThreadPool.java:534)
[junit4:junit4]   2> 	        at java.lang.Thread.run(Thread.java:679)
[junit4:junit4]   2> 	   2) Thread[id=37, name=qtp1867825290-37 Acceptor1 SelectChannelConnector@0.0.0.0:18647, state=BLOCKED, group=TGRP-TestRemoteStreaming]
[junit4:junit4]   2> 	        at sun.nio.ch.ServerSocketChannelImpl.accept(ServerSocketChannelImpl.java:147)
[junit4:junit4]   2> 	        at org.eclipse.jetty.server.nio.SelectChannelConnector.accept(SelectChannelConnector.java:104)
[junit4:junit4]   2> 	        at org.eclipse.jetty.server.AbstractConnector$Acceptor.run(AbstractConnector.java:933)
[junit4:junit4]   2> 	        at org.eclipse.jetty.util.thread.QueuedThreadPool.runJob(QueuedThreadPool.java:599)
[junit4:junit4]   2> 	        at org.eclipse.jetty.util.thread.QueuedThreadPool$3.run(QueuedThreadPool.java:534)
[junit4:junit4]   2> 	        at java.lang.Thread.run(Thread.java:679)
[junit4:junit4]   2> 	   3) Thread[id=38, name=qtp1867825290-38 Acceptor2 SelectChannelConnector@0.0.0.0:18647, state=BLOCKED, group=TGRP-TestRemoteStreaming]
[junit4:junit4]   2> 	        at sun.nio.ch.ServerSocketChannelImpl.accept(ServerSocketChannelImpl.java:147)
[junit4:junit4]   2> 	        at org.eclipse.jetty.server.nio.SelectChannelConnector.accept(SelectChannelConnector.java:104)
[junit4:junit4]   2> 	        at org.eclipse.jetty.server.AbstractConnector$Acceptor.run(AbstractConnector.java:933)
[junit4:junit4]   2> 	        at org.eclipse.jetty.util.thread.QueuedThreadPool.runJob(QueuedThreadPool.java:599)
[junit4:junit4]   2> 	        at org.eclipse.jetty.util.thread.QueuedThreadPool$3.run(QueuedThreadPool.java:534)
[junit4:junit4]   2> 	        at java.lang.Thread.run(Thread.java:679)
[junit4:junit4]   2> 	   4) Thread[id=39, name=qtp1867825290-39 Acceptor3 SelectChannelConnector@0.0.0.0:18647, state=BLOCKED, group=TGRP-TestRemoteStreaming]
[junit4:junit4]   2> 	        at sun.nio.ch.ServerSocketChannelImpl.accept(ServerSocketChannelImpl.java:147)
[junit4:junit4]   2> 	        at org.eclipse.jetty.server.nio.SelectChannelConnector.accept(SelectChannelConnector.java:104)
[junit4:junit4]   2> 	        at org.eclipse.jetty.server.AbstractConnector$Acceptor.run(AbstractConnector.java:933)
[junit4:junit4]   2> 	        at org.eclipse.jetty.util.thread.QueuedThreadPool.runJob(QueuedThreadPool.java:599)
[junit4:junit4]   2> 	        at org.eclipse.jetty.util.thread.QueuedThreadPool$3.run(QueuedThreadPool.java:534)
[junit4:junit4]   2> 	        at java.lang.Thread.run(Thread.java:679)
[junit4:junit4]   2> 24023 T28 ccr.ThreadLeakControl.tryToInterruptAll Starting to interrupt leaked threads:
[junit4:junit4]   2> 	   1) Thread[id=36, name=qtp1867825290-36 Acceptor0 SelectChannelConnector@0.0.0.0:18647, state=RUNNABLE, group=TGRP-TestRemoteStreaming]
[junit4:junit4]   2> 	   2) Thread[id=37, name=qtp1867825290-37 Acceptor1 SelectChannelConnector@0.0.0.0:18647, state=BLOCKED, group=TGRP-TestRemoteStreaming]
[junit4:junit4]   2> 	   3) Thread[id=38, name=qtp1867825290-38 Acceptor2 SelectChannelConnector@0.0.0.0:18647, state=BLOCKED, group=TGRP-TestRemoteStreaming]
[junit4:junit4]   2> 	   4) Thread[id=39, name=qtp1867825290-39 Acceptor3 SelectChannelConnector@0.0.0.0:18647, state=BLOCKED, group=TGRP-TestRemoteStreaming]
[junit4:junit4]   2> 27066 T28 ccr.ThreadLeakControl.tryToInterruptAll SEVERE There are still zombie threads that couldn't be terminated:
[junit4:junit4]   2> 	   1) Thread[id=36, name=qtp1867825290-36 Acceptor0 SelectChannelConnector@0.0.0.0:18647, state=RUNNABLE, group=TGRP-TestRemoteStreaming]
[junit4:junit4]   2> 	        at sun.nio.ch.ServerSocketChannelImpl.accept0(Native Method)
[junit4:junit4]   2> 	        at sun.nio.ch.ServerSocketChannelImpl.accept(ServerSocketChannelImpl.java:163)
[junit4:junit4]   2> 	        at org.eclipse.jetty.server.nio.SelectChannelConnector.accept(SelectChannelConnector.java:104)
[junit4:junit4]   2> 	        at org.eclipse.jetty.server.AbstractConnector$Acceptor.run(AbstractConnector.java:933)
[junit4:junit4]   2> 	        at org.eclipse.jetty.util.thread.QueuedThreadPool.runJob(QueuedThreadPool.java:599)
[junit4:junit4]   2> 	        at org.eclipse.jetty.util.thread.QueuedThreadPool$3.run(QueuedThreadPool.java:534)
[junit4:junit4]   2> 	        at java.lang.Thread.run(Thread.java:679)
[junit4:junit4]   2> 	   2) Thread[id=37, name=qtp1867825290-37 Acceptor1 SelectChannelConnector@0.0.0.0:18647, state=BLOCKED, group=TGRP-TestRemoteStreaming]
[junit4:junit4]   2> 	        at sun.nio.ch.ServerSocketChannelImpl.accept(ServerSocketChannelImpl.java:147)
[junit4:junit4]   2> 	        at org.eclipse.jetty.server.nio.SelectChannelConnector.accept(SelectChannelConnector.java:104)
[junit4:junit4]   2> 	        at org.eclipse.jetty.server.AbstractConnector$Acceptor.run(AbstractConnector.java:933)
[junit4:junit4]   2> 	        at org.eclipse.jetty.util.thread.QueuedThreadPool.runJob(QueuedThreadPool.java:599)
[junit4:junit4]   2> 	        at org.eclipse.jetty.util.thread.QueuedThreadPool$3.run(QueuedThreadPool.java:534)
[junit4:junit4]   2> 	        at java.lang.Thread.run(Thread.java:679)
[junit4:junit4]   2> 	   3) Thread[id=38, name=qtp1867825290-38 Acceptor2 SelectChannelConnector@0.0.0.0:18647, state=BLOCKED, group=TGRP-TestRemoteStreaming]
[junit4:junit4]   2> 	        at sun.nio.ch.ServerSocketChannelImpl.accept(ServerSocketChannelImpl.java:147)
[junit4:junit4]   2> 	        at org.eclipse.jetty.server.nio.SelectChannelConnector.accept(SelectChannelConnector.java:104)
[junit4:junit4]   2> 	        at org.eclipse.jetty.server.AbstractConnector$Acceptor.run(AbstractConnector.java:933)
[junit4:junit4]   2> 	        at org.eclipse.jetty.util.thread.QueuedThreadPool.runJob(QueuedThreadPool.java:599)
[junit4:junit4]   2> 	        at org.eclipse.jetty.util.thread.QueuedThreadPool$3.run(QueuedThreadPool.java:534)
[junit4:junit4]   2> 	        at java.lang.Thread.run(Thread.java:679)
[junit4:junit4]   2> 	   4) Thread[id=39, name=qtp1867825290-39 Acceptor3 SelectChannelConnector@0.0.0.0:18647, state=BLOCKED, group=TGRP-TestRemoteStreaming]
[junit4:junit4]   2> 	        at sun.nio.ch.ServerSocketChannelImpl.accept(ServerSocketChannelImpl.java:147)
[junit4:junit4]   2> 	        at org.eclipse.jetty.server.nio.SelectChannelConnector.accept(SelectChannelConnector.java:104)
[junit4:junit4]   2> 	        at org.eclipse.jetty.server.AbstractConnector$Acceptor.run(AbstractConnector.java:933)
[junit4:junit4]   2> 	        at org.eclipse.jetty.util.thread.QueuedThreadPool.runJob(QueuedThreadPool.java:599)
[junit4:junit4]   2> 	        at org.eclipse.jetty.util.thread.QueuedThreadPool$3.run(QueuedThreadPool.java:534)
[junit4:junit4]   2> 	        at java.lang.Thread.run(Thread.java:679)
[junit4:junit4]   2> NOTE: test params are: codec=Lucene40, sim=DefaultSimilarity, locale=bg_BG, timezone=Asia/Novokuznetsk
[junit4:junit4]   2> NOTE: FreeBSD 9.0-RELEASE amd64/Sun Microsystems Inc. 1.6.0_32 (64-bit)/cpus=16,threads=5,free=371174456,total=485687296
[junit4:junit4]   2> NOTE: All tests run in this JVM: [DocumentAnalysisRequestHandlerTest, TestSolrDeletionPolicy1, TestRemoteStreaming]
[junit4:junit4]   2> NOTE: download the large Jenkins line-docs file by running 'ant get-jenkins-line-docs' in the lucene directory.
[junit4:junit4]   2> NOTE: reproduce with: ant test  -Dtestcase=TestRemoteStreaming -Dtests.seed=8A7C242F25B7715C -Dtests.multiplier=3 -Dtests.nightly=true -Dtests.slow=true -Dtests.linedocsfile=/home/hudson/lucene-data/enwiki.random.lines.txt -Dtests.locale=bg_BG -Dtests.timezone=Asia/Novokuznetsk -Dtests.file.encoding=ISO8859-1
[junit4:junit4] ERROR   0.00s J1 | TestRemoteStreaming (suite) <<<
[junit4:junit4]    > Throwable #1: com.carrotsearch.randomizedtesting.ThreadLeakError: 4 threads leaked from SUITE scope at org.apache.solr.request.TestRemoteStreaming: 
[junit4:junit4]    >    1) Thread[id=36, name=qtp1867825290-36 Acceptor0 SelectChannelConnector@0.0.0.0:18647, state=RUNNABLE, group=TGRP-TestRemoteStreaming]
[junit4:junit4]    >         at sun.nio.ch.ServerSocketChannelImpl.accept0(Native Method)
[junit4:junit4]    >         at sun.nio.ch.ServerSocketChannelImpl.accept(ServerSocketChannelImpl.java:163)
[junit4:junit4]    >         at org.eclipse.jetty.server.nio.SelectChannelConnector.accept(SelectChannelConnector.java:104)
[junit4:junit4]    >         at org.eclipse.jetty.server.AbstractConnector$Acceptor.run(AbstractConnector.java:933)
[junit4:junit4]    >         at org.eclipse.jetty.util.thread.QueuedThreadPool.runJob(QueuedThreadPool.java:599)
[junit4:junit4]    >         at org.eclipse.jetty.util.thread.QueuedThreadPool$3.run(QueuedThreadPool.java:534)
[junit4:junit4]    >         at java.lang.Thread.run(Thread.java:679)
[junit4:junit4]    >    2) Thread[id=37, name=qtp1867825290-37 Acceptor1 SelectChannelConnector@0.0.0.0:18647, state=BLOCKED, group=TGRP-TestRemoteStreaming]
[junit4:junit4]    >         at sun.nio.ch.ServerSocketChannelImpl.accept(ServerSocketChannelImpl.java:147)
[junit4:junit4]    >         at org.eclipse.jetty.server.nio.SelectChannelConnector.accept(SelectChannelConnector.java:104)
[junit4:junit4]    >         at org.eclipse.jetty.server.AbstractConnector$Acceptor.run(AbstractConnector.java:933)
[junit4:junit4]    >         at org.eclipse.jetty.util.thread.QueuedThreadPool.runJob(QueuedThreadPool.java:599)
[junit4:junit4]    >         at org.eclipse.jetty.util.thread.QueuedThreadPool$3.run(QueuedThreadPool.java:534)
[junit4:junit4]    >         at java.lang.Thread.run(Thread.java:679)
[junit4:junit4]    >    3) Thread[id=38, name=qtp1867825290-38 Acceptor2 SelectChannelConnector@0.0.0.0:18647, state=BLOCKED, group=TGRP-TestRemoteStreaming]
[junit4:junit4]    >         at sun.nio.ch.ServerSocketChannelImpl.accept(ServerSocketChannelImpl.java:147)
[junit4:junit4]    >         at org.eclipse.jetty.server.nio.SelectChannelConnector.accept(SelectChannelConnector.java:104)
[junit4:junit4]    >         at org.eclipse.jetty.server.AbstractConnector$Acceptor.run(AbstractConnector.java:933)
[junit4:junit4]    >         at org.eclipse.jetty.util.thread.QueuedThreadPool.runJob(QueuedThreadPool.java:599)
[junit4:junit4]    >         at org.eclipse.jetty.util.thread.QueuedThreadPool$3.run(QueuedThreadPool.java:534)
[junit4:junit4]    >         at java.lang.Thread.run(Thread.java:679)
[junit4:junit4]    >    4) Thread[id=39, name=qtp1867825290-39 Acceptor3 SelectChannelConnector@0.0.0.0:18647, state=BLOCKED, group=TGRP-TestRemoteStreaming]
[junit4:junit4]    >         at sun.nio.ch.ServerSocketChannelImpl.accept(ServerSocketChannelImpl.java:147)
[junit4:junit4]    >         at org.eclipse.jetty.server.nio.SelectChannelConnector.accept(SelectChannelConnector.java:104)
[junit4:junit4]    >         at org.eclipse.jetty.server.AbstractConnector$Acceptor.run(AbstractConnector.java:933)
[junit4:junit4]    >         at org.eclipse.jetty.util.thread.QueuedThreadPool.runJob(QueuedThreadPool.java:599)
[junit4:junit4]    >         at org.eclipse.jetty.util.thread.QueuedThreadPool$3.run(QueuedThreadPool.java:534)
[junit4:junit4]    >         at java.lang.Thread.run(Thread.java:679)
[junit4:junit4]    > 	at __randomizedtesting.SeedInfo.seed([8A7C242F25B7715C]:0)
[junit4:junit4]    > Throwable #2: com.carrotsearch.randomizedtesting.ThreadLeakError: There are still zombie threads that couldn't be terminated:
[junit4:junit4]    >    1) Thread[id=36, name=qtp1867825290-36 Acceptor0 SelectChannelConnector@0.0.0.0:18647, state=RUNNABLE, group=TGRP-TestRemoteStreaming]
[junit4:junit4]    >         at sun.nio.ch.ServerSocketChannelImpl.accept0(Native Method)
[junit4:junit4]    >         at sun.nio.ch.ServerSocketChannelImpl.accept(ServerSocketChannelImpl.java:163)
[junit4:junit4]    >         at org.eclipse.jetty.server.nio.SelectChannelConnector.accept(SelectChannelConnector.java:104)
[junit4:junit4]    >         at org.eclipse.jetty.server.AbstractConnector$Acceptor.run(AbstractConnector.java:933)
[junit4:junit4]    >         at org.eclipse.jetty.util.thread.QueuedThreadPool.runJob(QueuedThreadPool.java:599)
[junit4:junit4]    >         at org.eclipse.jetty.util.thread.QueuedThreadPool$3.run(QueuedThreadPool.java:534)
[junit4:junit4]    >         at java.lang.Thread.run(Thread.java:679)
[junit4:junit4]    >    2) Thread[id=37, name=qtp1867825290-37 Acceptor1 SelectChannelConnector@0.0.0.0:18647, state=BLOCKED, group=TGRP-TestRemoteStreaming]
[junit4:junit4]    >         at sun.nio.ch.ServerSocketChannelImpl.accept(ServerSocketChannelImpl.java:147)
[junit4:junit4]    >         at org.eclipse.jetty.server.nio.SelectChannelConnector.accept(SelectChannelConnector.java:104)
[junit4:junit4]    >         at org.eclipse.jetty.server.AbstractConnector$Acceptor.run(AbstractConnector.java:933)
[junit4:junit4]    >         at org.eclipse.jetty.util.thread.QueuedThreadPool.runJob(QueuedThreadPool.java:599)
[junit4:junit4]    >         at org.eclipse.jetty.util.thread.QueuedThreadPool$3.run(QueuedThreadPool.java:534)
[junit4:junit4]    >         at java.lang.Thread.run(Thread.java:679)
[junit4:junit4]    >    3) Thread[id=38, name=qtp1867825290-38 Acceptor2 SelectChannelConnector@0.0.0.0:18647, state=BLOCKED, group=TGRP-TestRemoteStreaming]
[junit4:junit4]    >         at sun.nio.ch.ServerSocketChannelImpl.accept(ServerSocketChannelImpl.java:147)
[junit4:junit4]    >         at org.eclipse.jetty.server.nio.SelectChannelConnector.accept(SelectChannelConnector.java:104)
[junit4:junit4]    >         at org.eclipse.jetty.server.AbstractConnector$Acceptor.run(AbstractConnector.java:933)
[junit4:junit4]    >         at org.eclipse.jetty.util.thread.QueuedThreadPool.runJob(QueuedThreadPool.java:599)
[junit4:junit4]    >         at org.eclipse.jetty.util.thread.QueuedThreadPool$3.run(QueuedThreadPool.java:534)
[junit4:junit4]    >         at java.lang.Thread.run(Thread.java:679)
[junit4:junit4]    >    4) Thread[id=39, name=qtp1867825290-39 Acceptor3 SelectChannelConnector@0.0.0.0:18647, state=BLOCKED, group=TGRP-TestRemoteStreaming]
[junit4:junit4]    >         at sun.nio.ch.ServerSocketChannelImpl.accept(ServerSocketChannelImpl.java:147)
[junit4:junit4]    >         at org.eclipse.jetty.server.nio.SelectChannelConnector.accept(SelectChannelConnector.java:104)
[junit4:junit4]    >         at org.eclipse.jetty.server.AbstractConnector$Acceptor.run(AbstractConnector.java:933)
[junit4:junit4]    >         at org.eclipse.jetty.util.thread.QueuedThreadPool.runJob(QueuedThreadPool.java:599)
[junit4:junit4]    >         at org.eclipse.jetty.util.thread.QueuedThreadPool$3.run(QueuedThreadPool.java:534)
[junit4:junit4]    >         at java.lang.Thread.run(Thread.java:679)
[junit4:junit4]    > 	at __randomizedtesting.SeedInfo.seed([8A7C242F25B7715C]:0)
[junit4:junit4] Completed on J1 in 27.19s, 4 tests, 2 errors <<< FAILURES!

[...truncated 515 lines...]
BUILD FAILED
/usr/home/hudson/hudson-slave/workspace/Lucene-Solr-NightlyTests-trunk/build.xml:335: The following error occurred while executing this line:
/usr/home/hudson/hudson-slave/workspace/Lucene-Solr-NightlyTests-trunk/build.xml:39: The following error occurred while executing this line:
/usr/home/hudson/hudson-slave/workspace/Lucene-Solr-NightlyTests-trunk/solr/build.xml:178: The following error occurred while executing this line:
/usr/home/hudson/hudson-slave/workspace/Lucene-Solr-NightlyTests-trunk/lucene/module-build.xml:61: The following error occurred while executing this line:
/usr/home/hudson/hudson-slave/workspace/Lucene-Solr-NightlyTests-trunk/lucene/common-build.xml:1163: The following error occurred while executing this line:
/usr/home/hudson/hudson-slave/workspace/Lucene-Solr-NightlyTests-trunk/lucene/common-build.xml:827: There were test failures: 233 suites, 965 tests, 4 suite-level errors, 863 ignored

Total time: 67 minutes 30 seconds
Build step 'Invoke Ant' marked build as failure
Archiving artifacts
Recording test results
Email was triggered for: Failure
Sending email for trigger: Failure



Mime
View raw message