lucene-dev mailing list archives

Site index · List index
Message view « Date » · « Thread »
Top « Date » · « Thread »
From Policeman Jenkins Server <jenk...@sd-datasolutions.de>
Subject [JENKINS] Lucene-Solr-trunk-Windows (64bit/jdk1.7.0_09) - Build # 1562 - Still Failing!
Date Mon, 12 Nov 2012 02:40:42 GMT
Build: http://jenkins.sd-datasolutions.de/job/Lucene-Solr-trunk-Windows/1562/
Java: 64bit/jdk1.7.0_09 -XX:+UseG1GC

1 tests failed.
FAILED:  org.apache.lucene.index.TestConcurrentMergeScheduler.testMaxMergeCount

Error Message:
count should be <= maxMergeCount (= 3)

Stack Trace:
java.lang.IllegalArgumentException: count should be <= maxMergeCount (= 3)
	at __randomizedtesting.SeedInfo.seed([1F60016F5E0CD693:C80790DCE2CD4915]:0)
	at org.apache.lucene.index.ConcurrentMergeScheduler.setMaxThreadCount(ConcurrentMergeScheduler.java:90)
	at org.apache.lucene.index.TestConcurrentMergeScheduler.testMaxMergeCount(TestConcurrentMergeScheduler.java:303)
	at sun.reflect.NativeMethodAccessorImpl.invoke0(Native Method)
	at sun.reflect.NativeMethodAccessorImpl.invoke(NativeMethodAccessorImpl.java:57)
	at sun.reflect.DelegatingMethodAccessorImpl.invoke(DelegatingMethodAccessorImpl.java:43)
	at java.lang.reflect.Method.invoke(Method.java:601)
	at com.carrotsearch.randomizedtesting.RandomizedRunner.invoke(RandomizedRunner.java:1559)
	at com.carrotsearch.randomizedtesting.RandomizedRunner.access$600(RandomizedRunner.java:79)
	at com.carrotsearch.randomizedtesting.RandomizedRunner$6.evaluate(RandomizedRunner.java:737)
	at com.carrotsearch.randomizedtesting.RandomizedRunner$7.evaluate(RandomizedRunner.java:773)
	at com.carrotsearch.randomizedtesting.RandomizedRunner$8.evaluate(RandomizedRunner.java:787)
	at org.apache.lucene.util.TestRuleSetupTeardownChained$1.evaluate(TestRuleSetupTeardownChained.java:50)
	at org.apache.lucene.util.TestRuleFieldCacheSanity$1.evaluate(TestRuleFieldCacheSanity.java:51)
	at org.apache.lucene.util.AbstractBeforeAfterRule$1.evaluate(AbstractBeforeAfterRule.java:45)
	at com.carrotsearch.randomizedtesting.rules.SystemPropertiesInvariantRule$1.evaluate(SystemPropertiesInvariantRule.java:55)
	at org.apache.lucene.util.TestRuleThreadAndTestName$1.evaluate(TestRuleThreadAndTestName.java:48)
	at org.apache.lucene.util.TestRuleIgnoreAfterMaxFailures$1.evaluate(TestRuleIgnoreAfterMaxFailures.java:70)
	at org.apache.lucene.util.TestRuleMarkFailure$1.evaluate(TestRuleMarkFailure.java:48)
	at com.carrotsearch.randomizedtesting.rules.StatementAdapter.evaluate(StatementAdapter.java:36)
	at com.carrotsearch.randomizedtesting.ThreadLeakControl$StatementRunner.run(ThreadLeakControl.java:358)
	at com.carrotsearch.randomizedtesting.ThreadLeakControl.forkTimeoutingTask(ThreadLeakControl.java:782)
	at com.carrotsearch.randomizedtesting.ThreadLeakControl$3.evaluate(ThreadLeakControl.java:442)
	at com.carrotsearch.randomizedtesting.RandomizedRunner.runSingleTest(RandomizedRunner.java:746)
	at com.carrotsearch.randomizedtesting.RandomizedRunner$3.evaluate(RandomizedRunner.java:648)
	at com.carrotsearch.randomizedtesting.RandomizedRunner$4.evaluate(RandomizedRunner.java:682)
	at com.carrotsearch.randomizedtesting.RandomizedRunner$5.evaluate(RandomizedRunner.java:693)
	at org.apache.lucene.util.AbstractBeforeAfterRule$1.evaluate(AbstractBeforeAfterRule.java:45)
	at org.apache.lucene.util.TestRuleStoreClassName$1.evaluate(TestRuleStoreClassName.java:42)
	at com.carrotsearch.randomizedtesting.rules.SystemPropertiesInvariantRule$1.evaluate(SystemPropertiesInvariantRule.java:55)
	at com.carrotsearch.randomizedtesting.rules.NoShadowingOrOverridesOnMethodsRule$1.evaluate(NoShadowingOrOverridesOnMethodsRule.java:39)
	at com.carrotsearch.randomizedtesting.rules.NoShadowingOrOverridesOnMethodsRule$1.evaluate(NoShadowingOrOverridesOnMethodsRule.java:39)
	at com.carrotsearch.randomizedtesting.rules.StatementAdapter.evaluate(StatementAdapter.java:36)
	at org.apache.lucene.util.TestRuleAssertionsRequired$1.evaluate(TestRuleAssertionsRequired.java:43)
	at org.apache.lucene.util.TestRuleMarkFailure$1.evaluate(TestRuleMarkFailure.java:48)
	at org.apache.lucene.util.TestRuleIgnoreAfterMaxFailures$1.evaluate(TestRuleIgnoreAfterMaxFailures.java:70)
	at org.apache.lucene.util.TestRuleIgnoreTestSuites$1.evaluate(TestRuleIgnoreTestSuites.java:55)
	at com.carrotsearch.randomizedtesting.rules.StatementAdapter.evaluate(StatementAdapter.java:36)
	at com.carrotsearch.randomizedtesting.ThreadLeakControl$StatementRunner.run(ThreadLeakControl.java:358)
	at java.lang.Thread.run(Thread.java:722)




Build Log:
[...truncated 725 lines...]
[junit4:junit4] Suite: org.apache.lucene.index.TestConcurrentMergeScheduler
[junit4:junit4]   2> NOTE: reproduce with: ant test  -Dtestcase=TestConcurrentMergeScheduler
-Dtests.method=testMaxMergeCount -Dtests.seed=1F60016F5E0CD693 -Dtests.slow=true -Dtests.locale=ca_ES
-Dtests.timezone=America/Iqaluit -Dtests.file.encoding=Cp1252
[junit4:junit4] ERROR   0.01s | TestConcurrentMergeScheduler.testMaxMergeCount <<<
[junit4:junit4]    > Throwable #1: java.lang.IllegalArgumentException: count should be
<= maxMergeCount (= 3)
[junit4:junit4]    > 	at __randomizedtesting.SeedInfo.seed([1F60016F5E0CD693:C80790DCE2CD4915]:0)
[junit4:junit4]    > 	at org.apache.lucene.index.ConcurrentMergeScheduler.setMaxThreadCount(ConcurrentMergeScheduler.java:90)
[junit4:junit4]    > 	at org.apache.lucene.index.TestConcurrentMergeScheduler.testMaxMergeCount(TestConcurrentMergeScheduler.java:303)
[junit4:junit4]    > 	at sun.reflect.NativeMethodAccessorImpl.invoke0(Native Method)
[junit4:junit4]    > 	at sun.reflect.NativeMethodAccessorImpl.invoke(NativeMethodAccessorImpl.java:57)
[junit4:junit4]    > 	at sun.reflect.DelegatingMethodAccessorImpl.invoke(DelegatingMethodAccessorImpl.java:43)
[junit4:junit4]    > 	at java.lang.reflect.Method.invoke(Method.java:601)
[junit4:junit4]    > 	at com.carrotsearch.randomizedtesting.RandomizedRunner.invoke(RandomizedRunner.java:1559)
[junit4:junit4]    > 	at com.carrotsearch.randomizedtesting.RandomizedRunner.access$600(RandomizedRunner.java:79)
[junit4:junit4]    > 	at com.carrotsearch.randomizedtesting.RandomizedRunner$6.evaluate(RandomizedRunner.java:737)
[junit4:junit4]    > 	at com.carrotsearch.randomizedtesting.RandomizedRunner$7.evaluate(RandomizedRunner.java:773)
[junit4:junit4]    > 	at com.carrotsearch.randomizedtesting.RandomizedRunner$8.evaluate(RandomizedRunner.java:787)
[junit4:junit4]    > 	at org.apache.lucene.util.TestRuleSetupTeardownChained$1.evaluate(TestRuleSetupTeardownChained.java:50)
[junit4:junit4]    > 	at org.apache.lucene.util.TestRuleFieldCacheSanity$1.evaluate(TestRuleFieldCacheSanity.java:51)
[junit4:junit4]    > 	at org.apache.lucene.util.AbstractBeforeAfterRule$1.evaluate(AbstractBeforeAfterRule.java:45)
[junit4:junit4]    > 	at com.carrotsearch.randomizedtesting.rules.SystemPropertiesInvariantRule$1.evaluate(SystemPropertiesInvariantRule.java:55)
[junit4:junit4]    > 	at org.apache.lucene.util.TestRuleThreadAndTestName$1.evaluate(TestRuleThreadAndTestName.java:48)
[junit4:junit4]    > 	at org.apache.lucene.util.TestRuleIgnoreAfterMaxFailures$1.evaluate(TestRuleIgnoreAfterMaxFailures.java:70)
[junit4:junit4]    > 	at org.apache.lucene.util.TestRuleMarkFailure$1.evaluate(TestRuleMarkFailure.java:48)
[junit4:junit4]    > 	at com.carrotsearch.randomizedtesting.rules.StatementAdapter.evaluate(StatementAdapter.java:36)
[junit4:junit4]    > 	at com.carrotsearch.randomizedtesting.ThreadLeakControl$StatementRunner.run(ThreadLeakControl.java:358)
[junit4:junit4]    > 	at com.carrotsearch.randomizedtesting.ThreadLeakControl.forkTimeoutingTask(ThreadLeakControl.java:782)
[junit4:junit4]    > 	at com.carrotsearch.randomizedtesting.ThreadLeakControl$3.evaluate(ThreadLeakControl.java:442)
[junit4:junit4]    > 	at com.carrotsearch.randomizedtesting.RandomizedRunner.runSingleTest(RandomizedRunner.java:746)
[junit4:junit4]    > 	at com.carrotsearch.randomizedtesting.RandomizedRunner$3.evaluate(RandomizedRunner.java:648)
[junit4:junit4]    > 	at com.carrotsearch.randomizedtesting.RandomizedRunner$4.evaluate(RandomizedRunner.java:682)
[junit4:junit4]    > 	at com.carrotsearch.randomizedtesting.RandomizedRunner$5.evaluate(RandomizedRunner.java:693)
[junit4:junit4]    > 	at org.apache.lucene.util.AbstractBeforeAfterRule$1.evaluate(AbstractBeforeAfterRule.java:45)
[junit4:junit4]    > 	at org.apache.lucene.util.TestRuleStoreClassName$1.evaluate(TestRuleStoreClassName.java:42)
[junit4:junit4]    > 	at com.carrotsearch.randomizedtesting.rules.SystemPropertiesInvariantRule$1.evaluate(SystemPropertiesInvariantRule.java:55)
[junit4:junit4]    > 	at com.carrotsearch.randomizedtesting.rules.NoShadowingOrOverridesOnMethodsRule$1.evaluate(NoShadowingOrOverridesOnMethodsRule.java:39)
[junit4:junit4]    > 	at com.carrotsearch.randomizedtesting.rules.NoShadowingOrOverridesOnMethodsRule$1.evaluate(NoShadowingOrOverridesOnMethodsRule.java:39)
[junit4:junit4]    > 	at com.carrotsearch.randomizedtesting.rules.StatementAdapter.evaluate(StatementAdapter.java:36)
[junit4:junit4]    > 	at org.apache.lucene.util.TestRuleAssertionsRequired$1.evaluate(TestRuleAssertionsRequired.java:43)
[junit4:junit4]    > 	at org.apache.lucene.util.TestRuleMarkFailure$1.evaluate(TestRuleMarkFailure.java:48)
[junit4:junit4]    > 	at org.apache.lucene.util.TestRuleIgnoreAfterMaxFailures$1.evaluate(TestRuleIgnoreAfterMaxFailures.java:70)
[junit4:junit4]    > 	at org.apache.lucene.util.TestRuleIgnoreTestSuites$1.evaluate(TestRuleIgnoreTestSuites.java:55)
[junit4:junit4]    > 	at com.carrotsearch.randomizedtesting.rules.StatementAdapter.evaluate(StatementAdapter.java:36)
[junit4:junit4]    > 	at com.carrotsearch.randomizedtesting.ThreadLeakControl$StatementRunner.run(ThreadLeakControl.java:358)
[junit4:junit4]    > 	at java.lang.Thread.run(Thread.java:722)
[junit4:junit4]   2> NOTE: test params are: codec=Compressing(storedFieldsFormat=CompressingStoredFieldsFormat(compressionMode=FAST_DECOMPRESSION,
chunkSize=12)), sim=DefaultSimilarity, locale=ca_ES, timezone=America/Iqaluit
[junit4:junit4]   2> NOTE: Windows 7 6.1 amd64/Oracle Corporation 1.7.0_09 (64-bit)/cpus=2,threads=1,free=171732248,total=536870912
[junit4:junit4]   2> NOTE: All tests run in this JVM: [TestNumericTokenStream, TestMockDirectoryWrapper,
TestFieldInfos, TestArrayUtil, TestSimilarity2, ThrowInUncaught, Test2BPostings, TestByteBlockPool,
TestDemo, TestIndexFileDeleter, TestAssertions, TestFieldMaskingSpanQuery, TestMultiPhraseQuery,
TestBooleanQuery, TestCustomSearcherSort, TestBitVector, TestNoMergeScheduler, Nested2, Nested1,
Nested3, TestMultiLevelSkipList, InTestMethod, InBeforeClass, InAfterClass, NonStringProperties,
Before3, Before3, TestFilterIterator, TestCharsRef, TestMaxTermFrequency, TestStressIndexing2,
TestTermScorer, TestScorerPerf, TestDocumentsWriterStallControl, TestSentinelIntSet, TestRecyclingIntBlockAllocator,
TestOpenBitSet, TestCharTermAttributeImpl, TestSpecialOperations, TestIndexWriterNRTIsCurrent,
TestLucene40PostingsFormat, TestPerFieldPostingsFormat2, TestTermRangeQuery, TestForTooMuchCloning,
TestFilterAtomicReader, TestSubScorerFreqs, TestDeletionPolicy, TestPositionIncrement, TestBagOfPositions,
TestIndexWriterMerging, TestForceMergeForever, TestTermsEnum, Nested1, TestDocument, TestIndexCommit,
TestMockAnalyzer, TestOmitNorms, TestMultiFields, TestPayloadsOnVectors, Nested1, TestBlockPostingsFormat3,
TestParallelTermEnum, TestSimilarityProvider, TestRegexpRandom, TestCrash, TestTieredMergePolicy,
Nested1, TestNumericRangeQuery32, TestTermdocPerf, TestNamedSPILoader, TestFuzzyQuery, TestSimpleAttributeImpl,
TestField, TestAttributeSource, TestFilteredQuery, TestLazyProxSkipping, TestParallelAtomicReader,
TestDuelingCodecs, TestNewestSegment, TestAutomatonQueryUnicode, TestSort, TestRamUsageEstimator,
TestNRTCachingDirectory, TestFieldCacheSanityChecker, TestConsistentFieldNumbers, TestTermVectorsReader,
TestPerFieldPostingsFormat, TestFlex, TestBasics, TestMultiValuedNumericRangeQuery, TestSimpleSearchEquivalence,
TestDirectoryReaderReopen, TestNumericUtils, TestBlockPostingsFormat, TestSearchWithThreads,
TestBytesRefHash, TestIndexInput, TestExternalCodecs, TestFixedBitSet, TestPayloadNearQuery,
TestSpanExplanationsOfNonMatches, TestDeterminism, TestDocumentWriter, TestPositiveScoresOnlyCollector,
TestFieldCacheTermsFilter, TestMergeSchedulerExternal, TestLockFactory, TestUTF32ToUTF8, TestPagedBytes,
MultiCollectorTest, TestForUtil, TestParallelCompositeReader, TestSloppyPhraseQuery2, TestTimeLimitingCollector,
TestWindowsMMap, TestAtomicUpdate, TestDocCount, TestSmallFloat, TestSpans, TestComplexExplanationsOfNonMatches,
TestSetOnce, Nested, Nested, TestDocTermOrds, TestBooleanScorer, TestCustomNorms, TestMultiTermConstantScore,
TestLock, TestWeakIdentityMap, TestComplexExplanations, TestWorstCaseTestBehavior, TestTermsEnum2,
TestIndexWriterDelete, TestBinaryDocument, TestIndexWriterWithThreads, TestSpanMultiTermQueryWrapper,
TestWildcard, TestDocIdSet, TestOmitPositions, TestStressIndexing, TestSnapshotDeletionPolicy,
TestFlushByRamOrCountsPolicy, TestSizeBoundedForceMerge, TestPerSegmentDeletes, TestIndexWriterMergePolicy,
TestTermVectorsWriter, TestBlockPostingsFormat2, TestReaderClosed, TestCharFilter, TestBasicOperations,
TestBooleanQueryVisitSubscorers, TestPostingsFormat, TestSimpleExplanations, TestTopDocsCollector,
Test2BPositions, TestIndexWriterConfig, TestBagOfPostings, TestHugeRamFile, TestDocumentsWriterDeleteQueue,
TestRandomStoredFields, TestReuseDocsEnum, TestTermVectors, TestDeterminizeLexicon, Test2BTerms,
TestFileSwitchDirectory, TestBooleanOr, TestBinaryTerms, TestPackedInts, TestFSTs, TestGraphTokenizers,
TestNorms, TestIndexWriterReader, TestLookaheadTokenFilter, TestShardSearching, TestBoolean2,
TestIndexWriterExceptions, TestNumericRangeQuery64, TestSearcherManager, TestNRTThreads, TestByteSlices,
TestAddIndexes, TestIndexWriter, TestMultiMMap, TestLucene40PostingsReader, TestNeverDelete,
TestTopDocsMerge, TestSearchAfter, TestMinimize, TestSloppyPhraseQuery, TestPersistentSnapshotDeletionPolicy,
TestBackwardsCompatibility, TestNRTManager, TestIndexWriterUnicode, TestBufferedIndexInput,
TestIndexWriterForceMerge, TestCollectionUtil, TestLongPostings, TestIndexWriterCommit, TestDirectoryReader,
TestToken, TestTypePromotion, TestCompoundFile, TestRegexpRandom2, TestNRTReaderWithThreads,
TestDocValuesIndexing, TestConcurrentMergeScheduler]
[junit4:junit4] Completed in 2.17s, 5 tests, 1 error <<< FAILURES!

[...truncated 375 lines...]
BUILD FAILED
C:\Users\JenkinsSlave\workspace\Lucene-Solr-trunk-Windows\build.xml:337: The following error
occurred while executing this line:
C:\Users\JenkinsSlave\workspace\Lucene-Solr-trunk-Windows\build.xml:39: The following error
occurred while executing this line:
C:\Users\JenkinsSlave\workspace\Lucene-Solr-trunk-Windows\lucene\build.xml:50: The following
error occurred while executing this line:
C:\Users\JenkinsSlave\workspace\Lucene-Solr-trunk-Windows\lucene\common-build.xml:1163: The
following error occurred while executing this line:
C:\Users\JenkinsSlave\workspace\Lucene-Solr-trunk-Windows\lucene\common-build.xml:827: There
were test failures: 319 suites, 1829 tests, 1 error, 20 ignored (9 assumptions)

Total time: 8 minutes 4 seconds
Build step 'Invoke Ant' marked build as failure
Archiving artifacts
Recording test results
Description set: Java: 64bit/jdk1.7.0_09 -XX:+UseG1GC
Email was triggered for: Failure
Sending email for trigger: Failure



Mime
View raw message