lucene-dev mailing list archives

Site index · List index
Message view « Date » · « Thread »
Top « Date » · « Thread »
From Policeman Jenkins Server <jenk...@sd-datasolutions.de>
Subject [JENKINS] Lucene-Solr-trunk-Linux (32bit/jdk1.7.0_09) - Build # 2207 - Failure!
Date Mon, 05 Nov 2012 03:55:19 GMT
Build: http://jenkins.sd-datasolutions.de/job/Lucene-Solr-trunk-Linux/2207/
Java: 32bit/jdk1.7.0_09 -client -XX:+UseParallelGC

2 tests failed.
FAILED:  junit.framework.TestSuite.org.apache.solr.TestSolrCoreProperties

Error Message:
2 threads leaked from SUITE scope at org.apache.solr.TestSolrCoreProperties:     1) Thread[id=24,
name=metrics-meter-tick-thread-2, state=WAITING, group=TGRP-TestSolrCoreProperties]      
  at sun.misc.Unsafe.park(Native Method)         at java.util.concurrent.locks.LockSupport.park(LockSupport.java:186)
        at java.util.concurrent.locks.AbstractQueuedSynchronizer$ConditionObject.await(AbstractQueuedSynchronizer.java:2043)
        at java.util.concurrent.ScheduledThreadPoolExecutor$DelayedWorkQueue.take(ScheduledThreadPoolExecutor.java:1085)
        at java.util.concurrent.ScheduledThreadPoolExecutor$DelayedWorkQueue.take(ScheduledThreadPoolExecutor.java:807)
        at java.util.concurrent.ThreadPoolExecutor.getTask(ThreadPoolExecutor.java:1043) 
       at java.util.concurrent.ThreadPoolExecutor.runWorker(ThreadPoolExecutor.java:1103)
        at java.util.concurrent.ThreadPoolExecutor$Worker.run(ThreadPoolExecutor.java:603)
        at java.lang.Thread.run(Thread.java:722)    2) Thread[id=23, name=metrics-meter-tick-thread-1,
state=TIMED_WAITING, group=TGRP-TestSolrCoreProperties]         at sun.misc.Unsafe.park(Native
Method)         at java.util.concurrent.locks.LockSupport.parkNanos(LockSupport.java:226)
        at java.util.concurrent.locks.AbstractQueuedSynchronizer$ConditionObject.awaitNanos(AbstractQueuedSynchronizer.java:2082)
        at java.util.concurrent.ScheduledThreadPoolExecutor$DelayedWorkQueue.take(ScheduledThreadPoolExecutor.java:1090)
        at java.util.concurrent.ScheduledThreadPoolExecutor$DelayedWorkQueue.take(ScheduledThreadPoolExecutor.java:807)
        at java.util.concurrent.ThreadPoolExecutor.getTask(ThreadPoolExecutor.java:1043) 
       at java.util.concurrent.ThreadPoolExecutor.runWorker(ThreadPoolExecutor.java:1103)
        at java.util.concurrent.ThreadPoolExecutor$Worker.run(ThreadPoolExecutor.java:603)
        at java.lang.Thread.run(Thread.java:722)

Stack Trace:
com.carrotsearch.randomizedtesting.ThreadLeakError: 2 threads leaked from SUITE scope at org.apache.solr.TestSolrCoreProperties:

   1) Thread[id=24, name=metrics-meter-tick-thread-2, state=WAITING, group=TGRP-TestSolrCoreProperties]
        at sun.misc.Unsafe.park(Native Method)
        at java.util.concurrent.locks.LockSupport.park(LockSupport.java:186)
        at java.util.concurrent.locks.AbstractQueuedSynchronizer$ConditionObject.await(AbstractQueuedSynchronizer.java:2043)
        at java.util.concurrent.ScheduledThreadPoolExecutor$DelayedWorkQueue.take(ScheduledThreadPoolExecutor.java:1085)
        at java.util.concurrent.ScheduledThreadPoolExecutor$DelayedWorkQueue.take(ScheduledThreadPoolExecutor.java:807)
        at java.util.concurrent.ThreadPoolExecutor.getTask(ThreadPoolExecutor.java:1043)
        at java.util.concurrent.ThreadPoolExecutor.runWorker(ThreadPoolExecutor.java:1103)
        at java.util.concurrent.ThreadPoolExecutor$Worker.run(ThreadPoolExecutor.java:603)
        at java.lang.Thread.run(Thread.java:722)
   2) Thread[id=23, name=metrics-meter-tick-thread-1, state=TIMED_WAITING, group=TGRP-TestSolrCoreProperties]
        at sun.misc.Unsafe.park(Native Method)
        at java.util.concurrent.locks.LockSupport.parkNanos(LockSupport.java:226)
        at java.util.concurrent.locks.AbstractQueuedSynchronizer$ConditionObject.awaitNanos(AbstractQueuedSynchronizer.java:2082)
        at java.util.concurrent.ScheduledThreadPoolExecutor$DelayedWorkQueue.take(ScheduledThreadPoolExecutor.java:1090)
        at java.util.concurrent.ScheduledThreadPoolExecutor$DelayedWorkQueue.take(ScheduledThreadPoolExecutor.java:807)
        at java.util.concurrent.ThreadPoolExecutor.getTask(ThreadPoolExecutor.java:1043)
        at java.util.concurrent.ThreadPoolExecutor.runWorker(ThreadPoolExecutor.java:1103)
        at java.util.concurrent.ThreadPoolExecutor$Worker.run(ThreadPoolExecutor.java:603)
        at java.lang.Thread.run(Thread.java:722)
	at __randomizedtesting.SeedInfo.seed([D641E7CB765DCFC1]:0)


FAILED:  junit.framework.TestSuite.org.apache.solr.TestSolrCoreProperties

Error Message:
There are still zombie threads that couldn't be terminated:    1) Thread[id=24, name=metrics-meter-tick-thread-2,
state=WAITING, group=TGRP-TestSolrCoreProperties]         at sun.misc.Unsafe.park(Native Method)
        at java.util.concurrent.locks.LockSupport.park(LockSupport.java:186)         at java.util.concurrent.locks.AbstractQueuedSynchronizer$ConditionObject.await(AbstractQueuedSynchronizer.java:2043)
        at java.util.concurrent.ScheduledThreadPoolExecutor$DelayedWorkQueue.take(ScheduledThreadPoolExecutor.java:1085)
        at java.util.concurrent.ScheduledThreadPoolExecutor$DelayedWorkQueue.take(ScheduledThreadPoolExecutor.java:807)
        at java.util.concurrent.ThreadPoolExecutor.getTask(ThreadPoolExecutor.java:1043) 
       at java.util.concurrent.ThreadPoolExecutor.runWorker(ThreadPoolExecutor.java:1103)
        at java.util.concurrent.ThreadPoolExecutor$Worker.run(ThreadPoolExecutor.java:603)
        at java.lang.Thread.run(Thread.java:722)    2) Thread[id=23, name=metrics-meter-tick-thread-1,
state=TIMED_WAITING, group=TGRP-TestSolrCoreProperties]         at sun.misc.Unsafe.park(Native
Method)         at java.util.concurrent.locks.LockSupport.parkNanos(LockSupport.java:226)
        at java.util.concurrent.locks.AbstractQueuedSynchronizer$ConditionObject.awaitNanos(AbstractQueuedSynchronizer.java:2082)
        at java.util.concurrent.ScheduledThreadPoolExecutor$DelayedWorkQueue.take(ScheduledThreadPoolExecutor.java:1090)
        at java.util.concurrent.ScheduledThreadPoolExecutor$DelayedWorkQueue.take(ScheduledThreadPoolExecutor.java:807)
        at java.util.concurrent.ThreadPoolExecutor.getTask(ThreadPoolExecutor.java:1043) 
       at java.util.concurrent.ThreadPoolExecutor.runWorker(ThreadPoolExecutor.java:1103)
        at java.util.concurrent.ThreadPoolExecutor$Worker.run(ThreadPoolExecutor.java:603)
        at java.lang.Thread.run(Thread.java:722)

Stack Trace:
com.carrotsearch.randomizedtesting.ThreadLeakError: There are still zombie threads that couldn't
be terminated:
   1) Thread[id=24, name=metrics-meter-tick-thread-2, state=WAITING, group=TGRP-TestSolrCoreProperties]
        at sun.misc.Unsafe.park(Native Method)
        at java.util.concurrent.locks.LockSupport.park(LockSupport.java:186)
        at java.util.concurrent.locks.AbstractQueuedSynchronizer$ConditionObject.await(AbstractQueuedSynchronizer.java:2043)
        at java.util.concurrent.ScheduledThreadPoolExecutor$DelayedWorkQueue.take(ScheduledThreadPoolExecutor.java:1085)
        at java.util.concurrent.ScheduledThreadPoolExecutor$DelayedWorkQueue.take(ScheduledThreadPoolExecutor.java:807)
        at java.util.concurrent.ThreadPoolExecutor.getTask(ThreadPoolExecutor.java:1043)
        at java.util.concurrent.ThreadPoolExecutor.runWorker(ThreadPoolExecutor.java:1103)
        at java.util.concurrent.ThreadPoolExecutor$Worker.run(ThreadPoolExecutor.java:603)
        at java.lang.Thread.run(Thread.java:722)
   2) Thread[id=23, name=metrics-meter-tick-thread-1, state=TIMED_WAITING, group=TGRP-TestSolrCoreProperties]
        at sun.misc.Unsafe.park(Native Method)
        at java.util.concurrent.locks.LockSupport.parkNanos(LockSupport.java:226)
        at java.util.concurrent.locks.AbstractQueuedSynchronizer$ConditionObject.awaitNanos(AbstractQueuedSynchronizer.java:2082)
        at java.util.concurrent.ScheduledThreadPoolExecutor$DelayedWorkQueue.take(ScheduledThreadPoolExecutor.java:1090)
        at java.util.concurrent.ScheduledThreadPoolExecutor$DelayedWorkQueue.take(ScheduledThreadPoolExecutor.java:807)
        at java.util.concurrent.ThreadPoolExecutor.getTask(ThreadPoolExecutor.java:1043)
        at java.util.concurrent.ThreadPoolExecutor.runWorker(ThreadPoolExecutor.java:1103)
        at java.util.concurrent.ThreadPoolExecutor$Worker.run(ThreadPoolExecutor.java:603)
        at java.lang.Thread.run(Thread.java:722)
	at __randomizedtesting.SeedInfo.seed([D641E7CB765DCFC1]:0)




Build Log:
[...truncated 8457 lines...]
[junit4:junit4] Suite: org.apache.solr.TestSolrCoreProperties
[junit4:junit4]   2> 29255 T11 oejs.Server.doStart jetty-8.1.2.v20120308
[junit4:junit4]   2> 29349 T11 oejs.AbstractConnector.doStart Started SelectChannelConnector@0.0.0.0:39295
[junit4:junit4]   2> 29394 T11 oasc.SolrResourceLoader.locateSolrHome JNDI not configured
for solr (NoInitialContextEx)
[junit4:junit4]   2> 29394 T11 oasc.SolrResourceLoader.locateSolrHome using system property
solr.solr.home: ./org.apache.solr.TestSolrCoreProperties-1352087469391
[junit4:junit4]   2> 29395 T11 oasc.SolrResourceLoader.<init> new SolrResourceLoader
for deduced Solr Home: './org.apache.solr.TestSolrCoreProperties-1352087469391/'
[junit4:junit4]   2> 29562 T11 oass.SolrDispatchFilter.init SolrDispatchFilter.init()
[junit4:junit4]   2> 29565 T11 oasc.SolrResourceLoader.locateSolrHome JNDI not configured
for solr (NoInitialContextEx)
[junit4:junit4]   2> 29565 T11 oasc.SolrResourceLoader.locateSolrHome using system property
solr.solr.home: ./org.apache.solr.TestSolrCoreProperties-1352087469391
[junit4:junit4]   2> 29575 T11 oasc.CoreContainer$Initializer.initialize looking for solr.xml:
/mnt/ssd/jenkins/workspace/Lucene-Solr-trunk-Linux/solr/build/solr-core/test/J1/./org.apache.solr.TestSolrCoreProperties-1352087469391/solr.xml
[junit4:junit4]   2> 29577 T11 oasc.CoreContainer.<init> New CoreContainer 6864973
[junit4:junit4]   2> 29578 T11 oasc.CoreContainer$Initializer.initialize no solr.xml file
found - using default
[junit4:junit4]   2> 29578 T11 oasc.CoreContainer.load Loading CoreContainer using Solr
Home: './org.apache.solr.TestSolrCoreProperties-1352087469391/'
[junit4:junit4]   2> 29579 T11 oasc.SolrResourceLoader.<init> new SolrResourceLoader
for directory: './org.apache.solr.TestSolrCoreProperties-1352087469391/'
[junit4:junit4]   2> 29612 T11 oasc.CoreContainer.load Registering Log Listener
[junit4:junit4]   2> 29687 T11 oasc.CoreContainer.create Creating SolrCore 'collection1'
using instanceDir: ./org.apache.solr.TestSolrCoreProperties-1352087469391/collection1
[junit4:junit4]   2> 29688 T11 oasc.SolrResourceLoader.<init> new SolrResourceLoader
for directory: './org.apache.solr.TestSolrCoreProperties-1352087469391/collection1/'
[junit4:junit4]   2> 29737 T11 oasc.SolrConfig.<init> Using Lucene MatchVersion:
LUCENE_50
[junit4:junit4]   2> 29836 T11 oasc.SolrConfig.<init> Loaded SolrConfig: solrconfig.xml
[junit4:junit4]   2> 29845 T11 oass.IndexSchema.readSchema Reading Solr Schema
[junit4:junit4]   2> 29849 T11 oass.IndexSchema.readSchema Schema name=test
[junit4:junit4]   2> 29897 T11 oass.IndexSchema.readSchema unique key field: id
[junit4:junit4]   2> 29936 T11 oasc.SolrCore.<init> [collection1] Opening new SolrCore
at ./org.apache.solr.TestSolrCoreProperties-1352087469391/collection1/, dataDir=./org.apache.solr.TestSolrCoreProperties-1352087469391/collection1/data/
[junit4:junit4]   2> 29937 T11 oasc.SolrCore.<init> JMX monitoring not detected for
core: collection1
[junit4:junit4]   2> 29941 T11 oasc.SolrCore.initDirectoryFactory org.apache.solr.core.MockDirectoryFactory
[junit4:junit4]   2> 29968 T11 oasc.CachingDirectoryFactory.injectLockFactory WARNING No
lockType configured for MockDirWrapper(NRTCachingDirectory(org.apache.lucene.store.RAMDirectory@4b0d4c
lockFactory=org.apache.lucene.store.SingleInstanceLockFactory@15623d0; maxCacheMB=0.447265625
maxMergeSizeMB=0.029296875)) assuming 'simple'
[junit4:junit4]   2> 29970 T11 oasc.CachingDirectoryFactory.get return new directory for
/mnt/ssd/jenkins/workspace/Lucene-Solr-trunk-Linux/solr/build/solr-core/test/J1/./org.apache.solr.TestSolrCoreProperties-1352087469391/collection1/data
forceNew:false
[junit4:junit4]   2> 29970 T11 oasc.CachingDirectoryFactory.close Releasing directory:/mnt/ssd/jenkins/workspace/Lucene-Solr-trunk-Linux/solr/build/solr-core/test/J1/./org.apache.solr.TestSolrCoreProperties-1352087469391/collection1/data
[junit4:junit4]   2> 29971 T11 oasc.SolrCore.getNewIndexDir New index directory detected:
old=null new=./org.apache.solr.TestSolrCoreProperties-1352087469391/collection1/data/index/
[junit4:junit4]   2> 29971 T11 oasc.SolrCore.initIndex WARNING [collection1] Solr index
directory './org.apache.solr.TestSolrCoreProperties-1352087469391/collection1/data/index'
doesn't exist. Creating new index...
[junit4:junit4]   2> 29980 T11 oasc.CachingDirectoryFactory.get return new directory for
/mnt/ssd/jenkins/workspace/Lucene-Solr-trunk-Linux/solr/build/solr-core/test/J1/./org.apache.solr.TestSolrCoreProperties-1352087469391/collection1/data/index
forceNew:false
[junit4:junit4]   2> 30076 T11 oasc.SolrDeletionPolicy.onCommit SolrDeletionPolicy.onCommit:
commits:num=1
[junit4:junit4]   2> 		commit{dir=MockDirWrapper(org.apache.lucene.store.RAMDirectory@1dfd492
lockFactory=org.apache.lucene.store.SingleInstanceLockFactory@7ba533),segFN=segments_1,generation=1,filenames=[segments_1]
[junit4:junit4]   2> 30077 T11 oasc.SolrDeletionPolicy.updateCommits newest commit = 1[segments_1]
[junit4:junit4]   2> 30078 T11 oasc.CachingDirectoryFactory.close Releasing directory:/mnt/ssd/jenkins/workspace/Lucene-Solr-trunk-Linux/solr/build/solr-core/test/J1/./org.apache.solr.TestSolrCoreProperties-1352087469391/collection1/data/index
[junit4:junit4]   2> 30277 T11 oasc.RequestHandlers.initHandlersFromConfig created standard:
solr.StandardRequestHandler
[junit4:junit4]   2> 30278 T11 oasc.RequestHandlers.initHandlersFromConfig created defaults:
solr.StandardRequestHandler
[junit4:junit4]   2> 30279 T11 oasc.RequestHandlers.initHandlersFromConfig adding lazy
requestHandler: solr.StandardRequestHandler
[junit4:junit4]   2> 30280 T11 oasc.RequestHandlers.initHandlersFromConfig created lazy:
solr.StandardRequestHandler
[junit4:junit4]   2> 30288 T11 oasc.RequestHandlers.initHandlersFromConfig created /update:
solr.UpdateRequestHandler
[junit4:junit4]   2> 30322 T11 oashl.XMLLoader.init xsltCacheLifetimeSeconds=60
[junit4:junit4]   2> 30330 T11 oasc.CachingDirectoryFactory.close Releasing directory:/mnt/ssd/jenkins/workspace/Lucene-Solr-trunk-Linux/solr/build/solr-core/test/J1/./org.apache.solr.TestSolrCoreProperties-1352087469391/collection1/data
[junit4:junit4]   2> 30343 T11 oass.SolrIndexSearcher.<init> Opening Searcher@12906e4
main
[junit4:junit4]   2> 30362 T11 oasu.CommitTracker.<init> Hard AutoCommit: disabled
[junit4:junit4]   2> 30363 T11 oasu.CommitTracker.<init> Soft AutoCommit: disabled
[junit4:junit4]   2> 30385 T11 oashc.HttpShardHandlerFactory.getParameter Setting socketTimeout
to: 0
[junit4:junit4]   2> 30386 T11 oashc.HttpShardHandlerFactory.getParameter Setting urlScheme
to: http://
[junit4:junit4]   2> 30386 T11 oashc.HttpShardHandlerFactory.getParameter Setting connTimeout
to: 0
[junit4:junit4]   2> 30387 T11 oashc.HttpShardHandlerFactory.getParameter Setting maxConnectionsPerHost
to: 20
[junit4:junit4]   2> 30387 T11 oashc.HttpShardHandlerFactory.getParameter Setting corePoolSize
to: 0
[junit4:junit4]   2> 30388 T11 oashc.HttpShardHandlerFactory.getParameter Setting maximumPoolSize
to: 2147483647
[junit4:junit4]   2> 30388 T11 oashc.HttpShardHandlerFactory.getParameter Setting maxThreadIdleTime
to: 5
[junit4:junit4]   2> 30389 T11 oashc.HttpShardHandlerFactory.getParameter Setting sizeOfQueue
to: -1
[junit4:junit4]   2> 30389 T11 oashc.HttpShardHandlerFactory.getParameter Setting fairnessPolicy
to: false
[junit4:junit4]   2> 30398 T11 oascsi.HttpClientUtil.createClient Creating new http client,
config:maxConnectionsPerHost=20&maxConnections=10000&socketTimeout=0&connTimeout=0&retry=false
[junit4:junit4]   2> 30562 T11 oasc.CoreContainer.registerCore registering core: collection1
[junit4:junit4]   2> 30562 T25 oasc.SolrCore.registerSearcher [collection1] Registered
new searcher Searcher@12906e4 main{StandardDirectoryReader(segments_1:1)}
[junit4:junit4]   2> 30562 T11 oass.SolrDispatchFilter.init user.dir=/mnt/ssd/jenkins/workspace/Lucene-Solr-trunk-Linux/solr/build/solr-core/test/J1
[junit4:junit4]   2> 30563 T11 oass.SolrDispatchFilter.init SolrDispatchFilter.init() done
[junit4:junit4]   2> 30576 T11 oascsi.HttpClientUtil.createClient Creating new http client,
config:maxConnections=128&maxConnectionsPerHost=32&followRedirects=false
[junit4:junit4]   2> ASYNC  NEW_CORE C0 name=collection1 org.apache.solr.core.SolrCore@1773f53
[junit4:junit4]   2> 31070 T21 C0 REQ [collection1] webapp=/solr path=/select params={wt=javabin&q=*:*&version=2}
hits=0 status=0 QTime=76 
[junit4:junit4]   2> 31130 T11 oasc.CoreContainer.shutdown Shutting down CoreContainer
instance=6864973
[junit4:junit4]   2> 31131 T11 oasc.SolrCore.close [collection1]  CLOSING SolrCore org.apache.solr.core.SolrCore@1773f53
[junit4:junit4]   2> 31132 T11 oasu.DirectUpdateHandler2.close closing DirectUpdateHandler2{commits=0,autocommits=0,soft
autocommits=0,optimizes=0,rollbacks=0,expungeDeletes=0,docsPending=0,adds=0,deletesById=0,deletesByQuery=0,errors=0,cumulative_adds=0,cumulative_deletesById=0,cumulative_deletesByQuery=0,cumulative_errors=0}
[junit4:junit4]   2> 31132 T11 oasc.SolrCore.decrefSolrCoreState Closing SolrCoreState
[junit4:junit4]   2> 31133 T11 oasu.DefaultSolrCoreState.closeIndexWriter SolrCoreState
ref count has reached 0 - closing IndexWriter
[junit4:junit4]   2> 31134 T11 oasu.DefaultSolrCoreState.closeIndexWriter closing IndexWriter
with IndexWriterCloser
[junit4:junit4]   2> 31137 T11 oasc.SolrCore.closeSearcher [collection1] Closing main searcher
on request.
[junit4:junit4]   2> 31138 T11 oasc.CachingDirectoryFactory.close Releasing directory:/mnt/ssd/jenkins/workspace/Lucene-Solr-trunk-Linux/solr/build/solr-core/test/J1/./org.apache.solr.TestSolrCoreProperties-1352087469391/collection1/data/index
[junit4:junit4]   2> 31142 T11 oejsh.ContextHandler.doStop stopped o.e.j.s.ServletContextHandler{/solr,null}
[junit4:junit4]   2> 31206 T10 ccr.ThreadLeakControl.checkThreadLeaks WARNING Will linger
awaiting termination of 2 leaked thread(s).
[junit4:junit4]   2> 51279 T10 ccr.ThreadLeakControl.checkThreadLeaks SEVERE 2 threads
leaked from SUITE scope at org.apache.solr.TestSolrCoreProperties: 
[junit4:junit4]   2> 	   1) Thread[id=24, name=metrics-meter-tick-thread-2, state=WAITING,
group=TGRP-TestSolrCoreProperties]
[junit4:junit4]   2> 	        at sun.misc.Unsafe.park(Native Method)
[junit4:junit4]   2> 	        at java.util.concurrent.locks.LockSupport.park(LockSupport.java:186)
[junit4:junit4]   2> 	        at java.util.concurrent.locks.AbstractQueuedSynchronizer$ConditionObject.await(AbstractQueuedSynchronizer.java:2043)
[junit4:junit4]   2> 	        at java.util.concurrent.ScheduledThreadPoolExecutor$DelayedWorkQueue.take(ScheduledThreadPoolExecutor.java:1085)
[junit4:junit4]   2> 	        at java.util.concurrent.ScheduledThreadPoolExecutor$DelayedWorkQueue.take(ScheduledThreadPoolExecutor.java:807)
[junit4:junit4]   2> 	        at java.util.concurrent.ThreadPoolExecutor.getTask(ThreadPoolExecutor.java:1043)
[junit4:junit4]   2> 	        at java.util.concurrent.ThreadPoolExecutor.runWorker(ThreadPoolExecutor.java:1103)
[junit4:junit4]   2> 	        at java.util.concurrent.ThreadPoolExecutor$Worker.run(ThreadPoolExecutor.java:603)
[junit4:junit4]   2> 	        at java.lang.Thread.run(Thread.java:722)
[junit4:junit4]   2> 	   2) Thread[id=23, name=metrics-meter-tick-thread-1, state=TIMED_WAITING,
group=TGRP-TestSolrCoreProperties]
[junit4:junit4]   2> 	        at sun.misc.Unsafe.park(Native Method)
[junit4:junit4]   2> 	        at java.util.concurrent.locks.LockSupport.parkNanos(LockSupport.java:226)
[junit4:junit4]   2> 	        at java.util.concurrent.locks.AbstractQueuedSynchronizer$ConditionObject.awaitNanos(AbstractQueuedSynchronizer.java:2082)
[junit4:junit4]   2> 	        at java.util.concurrent.ScheduledThreadPoolExecutor$DelayedWorkQueue.take(ScheduledThreadPoolExecutor.java:1090)
[junit4:junit4]   2> 	        at java.util.concurrent.ScheduledThreadPoolExecutor$DelayedWorkQueue.take(ScheduledThreadPoolExecutor.java:807)
[junit4:junit4]   2> 	        at java.util.concurrent.ThreadPoolExecutor.getTask(ThreadPoolExecutor.java:1043)
[junit4:junit4]   2> 	        at java.util.concurrent.ThreadPoolExecutor.runWorker(ThreadPoolExecutor.java:1103)
[junit4:junit4]   2> 	        at java.util.concurrent.ThreadPoolExecutor$Worker.run(ThreadPoolExecutor.java:603)
[junit4:junit4]   2> 	        at java.lang.Thread.run(Thread.java:722)
[junit4:junit4]   2> 51280 T10 ccr.ThreadLeakControl.tryToInterruptAll Starting to interrupt
leaked threads:
[junit4:junit4]   2> 	   1) Thread[id=24, name=metrics-meter-tick-thread-2, state=WAITING,
group=TGRP-TestSolrCoreProperties]
[junit4:junit4]   2> 	   2) Thread[id=23, name=metrics-meter-tick-thread-1, state=TIMED_WAITING,
group=TGRP-TestSolrCoreProperties]
[junit4:junit4]   2> 54288 T10 ccr.ThreadLeakControl.tryToInterruptAll SEVERE There are
still zombie threads that couldn't be terminated:
[junit4:junit4]   2> 	   1) Thread[id=24, name=metrics-meter-tick-thread-2, state=WAITING,
group=TGRP-TestSolrCoreProperties]
[junit4:junit4]   2> 	        at sun.misc.Unsafe.park(Native Method)
[junit4:junit4]   2> 	        at java.util.concurrent.locks.LockSupport.park(LockSupport.java:186)
[junit4:junit4]   2> 	        at java.util.concurrent.locks.AbstractQueuedSynchronizer$ConditionObject.await(AbstractQueuedSynchronizer.java:2043)
[junit4:junit4]   2> 	        at java.util.concurrent.ScheduledThreadPoolExecutor$DelayedWorkQueue.take(ScheduledThreadPoolExecutor.java:1085)
[junit4:junit4]   2> 	        at java.util.concurrent.ScheduledThreadPoolExecutor$DelayedWorkQueue.take(ScheduledThreadPoolExecutor.java:807)
[junit4:junit4]   2> 	        at java.util.concurrent.ThreadPoolExecutor.getTask(ThreadPoolExecutor.java:1043)
[junit4:junit4]   2> 	        at java.util.concurrent.ThreadPoolExecutor.runWorker(ThreadPoolExecutor.java:1103)
[junit4:junit4]   2> 	        at java.util.concurrent.ThreadPoolExecutor$Worker.run(ThreadPoolExecutor.java:603)
[junit4:junit4]   2> 	        at java.lang.Thread.run(Thread.java:722)
[junit4:junit4]   2> 	   2) Thread[id=23, name=metrics-meter-tick-thread-1, state=TIMED_WAITING,
group=TGRP-TestSolrCoreProperties]
[junit4:junit4]   2> 	        at sun.misc.Unsafe.park(Native Method)
[junit4:junit4]   2> 	        at java.util.concurrent.locks.LockSupport.parkNanos(LockSupport.java:226)
[junit4:junit4]   2> 	        at java.util.concurrent.locks.AbstractQueuedSynchronizer$ConditionObject.awaitNanos(AbstractQueuedSynchronizer.java:2082)
[junit4:junit4]   2> 	        at java.util.concurrent.ScheduledThreadPoolExecutor$DelayedWorkQueue.take(ScheduledThreadPoolExecutor.java:1090)
[junit4:junit4]   2> 	        at java.util.concurrent.ScheduledThreadPoolExecutor$DelayedWorkQueue.take(ScheduledThreadPoolExecutor.java:807)
[junit4:junit4]   2> 	        at java.util.concurrent.ThreadPoolExecutor.getTask(ThreadPoolExecutor.java:1043)
[junit4:junit4]   2> 	        at java.util.concurrent.ThreadPoolExecutor.runWorker(ThreadPoolExecutor.java:1103)
[junit4:junit4]   2> 	        at java.util.concurrent.ThreadPoolExecutor$Worker.run(ThreadPoolExecutor.java:603)
[junit4:junit4]   2> 	        at java.lang.Thread.run(Thread.java:722)
[junit4:junit4]   2> NOTE: test params are: codec=Lucene40, sim=DefaultSimilarity, locale=en_AU,
timezone=Canada/Newfoundland
[junit4:junit4]   2> NOTE: Linux 3.2.0-32-generic i386/Oracle Corporation 1.7.0_09 (32-bit)/cpus=8,threads=3,free=24058464,total=147849216
[junit4:junit4]   2> NOTE: All tests run in this JVM: [TestHashPartitioner, TestSolrCoreProperties]
[junit4:junit4]   2> NOTE: reproduce with: ant test  -Dtestcase=TestSolrCoreProperties
-Dtests.seed=D641E7CB765DCFC1 -Dtests.multiplier=3 -Dtests.slow=true -Dtests.locale=en_AU
-Dtests.timezone=Canada/Newfoundland -Dtests.file.encoding=US-ASCII
[junit4:junit4] ERROR   0.00s J1 | TestSolrCoreProperties (suite) <<<
[junit4:junit4]    > Throwable #1: com.carrotsearch.randomizedtesting.ThreadLeakError:
2 threads leaked from SUITE scope at org.apache.solr.TestSolrCoreProperties: 
[junit4:junit4]    >    1) Thread[id=24, name=metrics-meter-tick-thread-2, state=WAITING,
group=TGRP-TestSolrCoreProperties]
[junit4:junit4]    >         at sun.misc.Unsafe.park(Native Method)
[junit4:junit4]    >         at java.util.concurrent.locks.LockSupport.park(LockSupport.java:186)
[junit4:junit4]    >         at java.util.concurrent.locks.AbstractQueuedSynchronizer$ConditionObject.await(AbstractQueuedSynchronizer.java:2043)
[junit4:junit4]    >         at java.util.concurrent.ScheduledThreadPoolExecutor$DelayedWorkQueue.take(ScheduledThreadPoolExecutor.java:1085)
[junit4:junit4]    >         at java.util.concurrent.ScheduledThreadPoolExecutor$DelayedWorkQueue.take(ScheduledThreadPoolExecutor.java:807)
[junit4:junit4]    >         at java.util.concurrent.ThreadPoolExecutor.getTask(ThreadPoolExecutor.java:1043)
[junit4:junit4]    >         at java.util.concurrent.ThreadPoolExecutor.runWorker(ThreadPoolExecutor.java:1103)
[junit4:junit4]    >         at java.util.concurrent.ThreadPoolExecutor$Worker.run(ThreadPoolExecutor.java:603)
[junit4:junit4]    >         at java.lang.Thread.run(Thread.java:722)
[junit4:junit4]    >    2) Thread[id=23, name=metrics-meter-tick-thread-1, state=TIMED_WAITING,
group=TGRP-TestSolrCoreProperties]
[junit4:junit4]    >         at sun.misc.Unsafe.park(Native Method)
[junit4:junit4]    >         at java.util.concurrent.locks.LockSupport.parkNanos(LockSupport.java:226)
[junit4:junit4]    >         at java.util.concurrent.locks.AbstractQueuedSynchronizer$ConditionObject.awaitNanos(AbstractQueuedSynchronizer.java:2082)
[junit4:junit4]    >         at java.util.concurrent.ScheduledThreadPoolExecutor$DelayedWorkQueue.take(ScheduledThreadPoolExecutor.java:1090)
[junit4:junit4]    >         at java.util.concurrent.ScheduledThreadPoolExecutor$DelayedWorkQueue.take(ScheduledThreadPoolExecutor.java:807)
[junit4:junit4]    >         at java.util.concurrent.ThreadPoolExecutor.getTask(ThreadPoolExecutor.java:1043)
[junit4:junit4]    >         at java.util.concurrent.ThreadPoolExecutor.runWorker(ThreadPoolExecutor.java:1103)
[junit4:junit4]    >         at java.util.concurrent.ThreadPoolExecutor$Worker.run(ThreadPoolExecutor.java:603)
[junit4:junit4]    >         at java.lang.Thread.run(Thread.java:722)
[junit4:junit4]    > 	at __randomizedtesting.SeedInfo.seed([D641E7CB765DCFC1]:0)
[junit4:junit4]    > Throwable #2: com.carrotsearch.randomizedtesting.ThreadLeakError:
There are still zombie threads that couldn't be terminated:
[junit4:junit4]    >    1) Thread[id=24, name=metrics-meter-tick-thread-2, state=WAITING,
group=TGRP-TestSolrCoreProperties]
[junit4:junit4]    >         at sun.misc.Unsafe.park(Native Method)
[junit4:junit4]    >         at java.util.concurrent.locks.LockSupport.park(LockSupport.java:186)
[junit4:junit4]    >         at java.util.concurrent.locks.AbstractQueuedSynchronizer$ConditionObject.await(AbstractQueuedSynchronizer.java:2043)
[junit4:junit4]    >         at java.util.concurrent.ScheduledThreadPoolExecutor$DelayedWorkQueue.take(ScheduledThreadPoolExecutor.java:1085)
[junit4:junit4]    >         at java.util.concurrent.ScheduledThreadPoolExecutor$DelayedWorkQueue.take(ScheduledThreadPoolExecutor.java:807)
[junit4:junit4]    >         at java.util.concurrent.ThreadPoolExecutor.getTask(ThreadPoolExecutor.java:1043)
[junit4:junit4]    >         at java.util.concurrent.ThreadPoolExecutor.runWorker(ThreadPoolExecutor.java:1103)
[junit4:junit4]    >         at java.util.concurrent.ThreadPoolExecutor$Worker.run(ThreadPoolExecutor.java:603)
[junit4:junit4]    >         at java.lang.Thread.run(Thread.java:722)
[junit4:junit4]    >    2) Thread[id=23, name=metrics-meter-tick-thread-1, state=TIMED_WAITING,
group=TGRP-TestSolrCoreProperties]
[junit4:junit4]    >         at sun.misc.Unsafe.park(Native Method)
[junit4:junit4]    >         at java.util.concurrent.locks.LockSupport.parkNanos(LockSupport.java:226)
[junit4:junit4]    >         at java.util.concurrent.locks.AbstractQueuedSynchronizer$ConditionObject.awaitNanos(AbstractQueuedSynchronizer.java:2082)
[junit4:junit4]    >         at java.util.concurrent.ScheduledThreadPoolExecutor$DelayedWorkQueue.take(ScheduledThreadPoolExecutor.java:1090)
[junit4:junit4]    >         at java.util.concurrent.ScheduledThreadPoolExecutor$DelayedWorkQueue.take(ScheduledThreadPoolExecutor.java:807)
[junit4:junit4]    >         at java.util.concurrent.ThreadPoolExecutor.getTask(ThreadPoolExecutor.java:1043)
[junit4:junit4]    >         at java.util.concurrent.ThreadPoolExecutor.runWorker(ThreadPoolExecutor.java:1103)
[junit4:junit4]    >         at java.util.concurrent.ThreadPoolExecutor$Worker.run(ThreadPoolExecutor.java:603)
[junit4:junit4]    >         at java.lang.Thread.run(Thread.java:722)
[junit4:junit4]    > 	at __randomizedtesting.SeedInfo.seed([D641E7CB765DCFC1]:0)
[junit4:junit4] Completed on J1 in 25.23s, 1 test, 2 errors <<< FAILURES!

[...truncated 683 lines...]
BUILD FAILED
/mnt/ssd/jenkins/workspace/Lucene-Solr-trunk-Linux/build.xml:335: The following error occurred
while executing this line:
/mnt/ssd/jenkins/workspace/Lucene-Solr-trunk-Linux/build.xml:39: The following error occurred
while executing this line:
/mnt/ssd/jenkins/workspace/Lucene-Solr-trunk-Linux/solr/build.xml:178: The following error
occurred while executing this line:
/mnt/ssd/jenkins/workspace/Lucene-Solr-trunk-Linux/lucene/module-build.xml:61: The following
error occurred while executing this line:
/mnt/ssd/jenkins/workspace/Lucene-Solr-trunk-Linux/lucene/common-build.xml:1163: The following
error occurred while executing this line:
/mnt/ssd/jenkins/workspace/Lucene-Solr-trunk-Linux/lucene/common-build.xml:827: There were
test failures: 233 suites, 965 tests, 2 suite-level errors, 686 ignored

Total time: 18 minutes 38 seconds
Build step 'Invoke Ant' marked build as failure
Archiving artifacts
Recording test results
Description set: Java: 32bit/jdk1.7.0_09 -client -XX:+UseParallelGC
Email was triggered for: Failure
Sending email for trigger: Failure



Mime
View raw message