lucene-dev mailing list archives

Site index · List index
Message view « Date » · « Thread »
Top « Date » · « Thread »
From Policeman Jenkins Server <jenk...@sd-datasolutions.de>
Subject [JENKINS] Lucene-Solr-4.x-Windows (32bit/jdk1.6.0_37) - Build # 1584 - Failure!
Date Tue, 13 Nov 2012 06:12:37 GMT
Build: http://jenkins.sd-datasolutions.de/job/Lucene-Solr-4.x-Windows/1584/
Java: 32bit/jdk1.6.0_37 -client -XX:+UseSerialGC

1 tests failed.
REGRESSION:  org.apache.lucene.index.TestConcurrentMergeScheduler.testMaxMergeCount

Error Message:
count should be <= maxMergeCount (= 3)

Stack Trace:
java.lang.IllegalArgumentException: count should be <= maxMergeCount (= 3)
	at __randomizedtesting.SeedInfo.seed([B8B8E062D5F6FFD9:6FDF71D16937605F]:0)
	at org.apache.lucene.index.ConcurrentMergeScheduler.setMaxThreadCount(ConcurrentMergeScheduler.java:90)
	at org.apache.lucene.index.TestConcurrentMergeScheduler.testMaxMergeCount(TestConcurrentMergeScheduler.java:303)
	at sun.reflect.NativeMethodAccessorImpl.invoke0(Native Method)
	at sun.reflect.NativeMethodAccessorImpl.invoke(NativeMethodAccessorImpl.java:39)
	at sun.reflect.DelegatingMethodAccessorImpl.invoke(DelegatingMethodAccessorImpl.java:25)
	at java.lang.reflect.Method.invoke(Method.java:597)
	at com.carrotsearch.randomizedtesting.RandomizedRunner.invoke(RandomizedRunner.java:1559)
	at com.carrotsearch.randomizedtesting.RandomizedRunner.access$600(RandomizedRunner.java:79)
	at com.carrotsearch.randomizedtesting.RandomizedRunner$6.evaluate(RandomizedRunner.java:737)
	at com.carrotsearch.randomizedtesting.RandomizedRunner$7.evaluate(RandomizedRunner.java:773)
	at com.carrotsearch.randomizedtesting.RandomizedRunner$8.evaluate(RandomizedRunner.java:787)
	at org.apache.lucene.util.TestRuleSetupTeardownChained$1.evaluate(TestRuleSetupTeardownChained.java:50)
	at org.apache.lucene.util.TestRuleFieldCacheSanity$1.evaluate(TestRuleFieldCacheSanity.java:51)
	at org.apache.lucene.util.AbstractBeforeAfterRule$1.evaluate(AbstractBeforeAfterRule.java:45)
	at com.carrotsearch.randomizedtesting.rules.SystemPropertiesInvariantRule$1.evaluate(SystemPropertiesInvariantRule.java:55)
	at org.apache.lucene.util.TestRuleThreadAndTestName$1.evaluate(TestRuleThreadAndTestName.java:48)
	at org.apache.lucene.util.TestRuleIgnoreAfterMaxFailures$1.evaluate(TestRuleIgnoreAfterMaxFailures.java:70)
	at org.apache.lucene.util.TestRuleMarkFailure$1.evaluate(TestRuleMarkFailure.java:48)
	at com.carrotsearch.randomizedtesting.rules.StatementAdapter.evaluate(StatementAdapter.java:36)
	at com.carrotsearch.randomizedtesting.ThreadLeakControl$StatementRunner.run(ThreadLeakControl.java:358)
	at com.carrotsearch.randomizedtesting.ThreadLeakControl.forkTimeoutingTask(ThreadLeakControl.java:782)
	at com.carrotsearch.randomizedtesting.ThreadLeakControl$3.evaluate(ThreadLeakControl.java:442)
	at com.carrotsearch.randomizedtesting.RandomizedRunner.runSingleTest(RandomizedRunner.java:746)
	at com.carrotsearch.randomizedtesting.RandomizedRunner$3.evaluate(RandomizedRunner.java:648)
	at com.carrotsearch.randomizedtesting.RandomizedRunner$4.evaluate(RandomizedRunner.java:682)
	at com.carrotsearch.randomizedtesting.RandomizedRunner$5.evaluate(RandomizedRunner.java:693)
	at org.apache.lucene.util.AbstractBeforeAfterRule$1.evaluate(AbstractBeforeAfterRule.java:45)
	at org.apache.lucene.util.TestRuleStoreClassName$1.evaluate(TestRuleStoreClassName.java:42)
	at com.carrotsearch.randomizedtesting.rules.SystemPropertiesInvariantRule$1.evaluate(SystemPropertiesInvariantRule.java:55)
	at com.carrotsearch.randomizedtesting.rules.NoShadowingOrOverridesOnMethodsRule$1.evaluate(NoShadowingOrOverridesOnMethodsRule.java:39)
	at com.carrotsearch.randomizedtesting.rules.NoShadowingOrOverridesOnMethodsRule$1.evaluate(NoShadowingOrOverridesOnMethodsRule.java:39)
	at com.carrotsearch.randomizedtesting.rules.StatementAdapter.evaluate(StatementAdapter.java:36)
	at org.apache.lucene.util.TestRuleAssertionsRequired$1.evaluate(TestRuleAssertionsRequired.java:43)
	at org.apache.lucene.util.TestRuleMarkFailure$1.evaluate(TestRuleMarkFailure.java:48)
	at org.apache.lucene.util.TestRuleIgnoreAfterMaxFailures$1.evaluate(TestRuleIgnoreAfterMaxFailures.java:70)
	at org.apache.lucene.util.TestRuleIgnoreTestSuites$1.evaluate(TestRuleIgnoreTestSuites.java:55)
	at com.carrotsearch.randomizedtesting.rules.StatementAdapter.evaluate(StatementAdapter.java:36)
	at com.carrotsearch.randomizedtesting.ThreadLeakControl$StatementRunner.run(ThreadLeakControl.java:358)
	at java.lang.Thread.run(Thread.java:662)




Build Log:
[...truncated 842 lines...]
[junit4:junit4] Suite: org.apache.lucene.index.TestConcurrentMergeScheduler
[junit4:junit4]   2> NOTE: reproduce with: ant test  -Dtestcase=TestConcurrentMergeScheduler
-Dtests.method=testMaxMergeCount -Dtests.seed=B8B8E062D5F6FFD9 -Dtests.slow=true -Dtests.locale=es_CR
-Dtests.timezone=Indian/Chagos -Dtests.file.encoding=ISO-8859-1
[junit4:junit4] ERROR   0.01s | TestConcurrentMergeScheduler.testMaxMergeCount <<<
[junit4:junit4]    > Throwable #1: java.lang.IllegalArgumentException: count should be
<= maxMergeCount (= 3)
[junit4:junit4]    > 	at __randomizedtesting.SeedInfo.seed([B8B8E062D5F6FFD9:6FDF71D16937605F]:0)
[junit4:junit4]    > 	at org.apache.lucene.index.ConcurrentMergeScheduler.setMaxThreadCount(ConcurrentMergeScheduler.java:90)
[junit4:junit4]    > 	at org.apache.lucene.index.TestConcurrentMergeScheduler.testMaxMergeCount(TestConcurrentMergeScheduler.java:303)
[junit4:junit4]    > 	at sun.reflect.NativeMethodAccessorImpl.invoke0(Native Method)
[junit4:junit4]    > 	at sun.reflect.NativeMethodAccessorImpl.invoke(NativeMethodAccessorImpl.java:39)
[junit4:junit4]    > 	at sun.reflect.DelegatingMethodAccessorImpl.invoke(DelegatingMethodAccessorImpl.java:25)
[junit4:junit4]    > 	at java.lang.reflect.Method.invoke(Method.java:597)
[junit4:junit4]    > 	at com.carrotsearch.randomizedtesting.RandomizedRunner.invoke(RandomizedRunner.java:1559)
[junit4:junit4]    > 	at com.carrotsearch.randomizedtesting.RandomizedRunner.access$600(RandomizedRunner.java:79)
[junit4:junit4]    > 	at com.carrotsearch.randomizedtesting.RandomizedRunner$6.evaluate(RandomizedRunner.java:737)
[junit4:junit4]    > 	at com.carrotsearch.randomizedtesting.RandomizedRunner$7.evaluate(RandomizedRunner.java:773)
[junit4:junit4]    > 	at com.carrotsearch.randomizedtesting.RandomizedRunner$8.evaluate(RandomizedRunner.java:787)
[junit4:junit4]    > 	at org.apache.lucene.util.TestRuleSetupTeardownChained$1.evaluate(TestRuleSetupTeardownChained.java:50)
[junit4:junit4]    > 	at org.apache.lucene.util.TestRuleFieldCacheSanity$1.evaluate(TestRuleFieldCacheSanity.java:51)
[junit4:junit4]    > 	at org.apache.lucene.util.AbstractBeforeAfterRule$1.evaluate(AbstractBeforeAfterRule.java:45)
[junit4:junit4]    > 	at com.carrotsearch.randomizedtesting.rules.SystemPropertiesInvariantRule$1.evaluate(SystemPropertiesInvariantRule.java:55)
[junit4:junit4]    > 	at org.apache.lucene.util.TestRuleThreadAndTestName$1.evaluate(TestRuleThreadAndTestName.java:48)
[junit4:junit4]    > 	at org.apache.lucene.util.TestRuleIgnoreAfterMaxFailures$1.evaluate(TestRuleIgnoreAfterMaxFailures.java:70)
[junit4:junit4]    > 	at org.apache.lucene.util.TestRuleMarkFailure$1.evaluate(TestRuleMarkFailure.java:48)
[junit4:junit4]    > 	at com.carrotsearch.randomizedtesting.rules.StatementAdapter.evaluate(StatementAdapter.java:36)
[junit4:junit4]    > 	at com.carrotsearch.randomizedtesting.ThreadLeakControl$StatementRunner.run(ThreadLeakControl.java:358)
[junit4:junit4]    > 	at com.carrotsearch.randomizedtesting.ThreadLeakControl.forkTimeoutingTask(ThreadLeakControl.java:782)
[junit4:junit4]    > 	at com.carrotsearch.randomizedtesting.ThreadLeakControl$3.evaluate(ThreadLeakControl.java:442)
[junit4:junit4]    > 	at com.carrotsearch.randomizedtesting.RandomizedRunner.runSingleTest(RandomizedRunner.java:746)
[junit4:junit4]    > 	at com.carrotsearch.randomizedtesting.RandomizedRunner$3.evaluate(RandomizedRunner.java:648)
[junit4:junit4]    > 	at com.carrotsearch.randomizedtesting.RandomizedRunner$4.evaluate(RandomizedRunner.java:682)
[junit4:junit4]    > 	at com.carrotsearch.randomizedtesting.RandomizedRunner$5.evaluate(RandomizedRunner.java:693)
[junit4:junit4]    > 	at org.apache.lucene.util.AbstractBeforeAfterRule$1.evaluate(AbstractBeforeAfterRule.java:45)
[junit4:junit4]    > 	at org.apache.lucene.util.TestRuleStoreClassName$1.evaluate(TestRuleStoreClassName.java:42)
[junit4:junit4]    > 	at com.carrotsearch.randomizedtesting.rules.SystemPropertiesInvariantRule$1.evaluate(SystemPropertiesInvariantRule.java:55)
[junit4:junit4]    > 	at com.carrotsearch.randomizedtesting.rules.NoShadowingOrOverridesOnMethodsRule$1.evaluate(NoShadowingOrOverridesOnMethodsRule.java:39)
[junit4:junit4]    > 	at com.carrotsearch.randomizedtesting.rules.NoShadowingOrOverridesOnMethodsRule$1.evaluate(NoShadowingOrOverridesOnMethodsRule.java:39)
[junit4:junit4]    > 	at com.carrotsearch.randomizedtesting.rules.StatementAdapter.evaluate(StatementAdapter.java:36)
[junit4:junit4]    > 	at org.apache.lucene.util.TestRuleAssertionsRequired$1.evaluate(TestRuleAssertionsRequired.java:43)
[junit4:junit4]    > 	at org.apache.lucene.util.TestRuleMarkFailure$1.evaluate(TestRuleMarkFailure.java:48)
[junit4:junit4]    > 	at org.apache.lucene.util.TestRuleIgnoreAfterMaxFailures$1.evaluate(TestRuleIgnoreAfterMaxFailures.java:70)
[junit4:junit4]    > 	at org.apache.lucene.util.TestRuleIgnoreTestSuites$1.evaluate(TestRuleIgnoreTestSuites.java:55)
[junit4:junit4]    > 	at com.carrotsearch.randomizedtesting.rules.StatementAdapter.evaluate(StatementAdapter.java:36)
[junit4:junit4]    > 	at com.carrotsearch.randomizedtesting.ThreadLeakControl$StatementRunner.run(ThreadLeakControl.java:358)
[junit4:junit4]    > 	at java.lang.Thread.run(Thread.java:662)
[junit4:junit4]   2> NOTE: test params are: codec=Appending, sim=RandomSimilarityProvider(queryNorm=false,coord=crazy):
{content=IB LL-DZ(0.3)}, locale=es_CR, timezone=Indian/Chagos
[junit4:junit4]   2> NOTE: Windows 7 6.1 x86/Sun Microsystems Inc. 1.6.0_37 (32-bit)/cpus=2,threads=1,free=189764832,total=241221632
[junit4:junit4]   2> NOTE: All tests run in this JVM: [TestCustomSearcherSort, TestSearchWithThreads,
TestFlushByRamOrCountsPolicy, TestCloseableThreadLocal, TestNumericUtils, TestFieldValueFilter,
TestSearcherManager, TestOpenBitSet, TestFieldCacheRangeFilter, TestTopScoreDocCollector,
TestCopyBytes, Nested, Nested, Nested, Nested, Nested, Nested, Nested, Nested, Nested, Nested,
Nested, Nested, Nested, Nested, Nested, Nested, Nested, Nested, Nested, Nested, Nested, Nested,
TestNearSpansOrdered, TestIndexWriterDelete, TestCrash, Nested, TestDoubleBarrelLRUCache,
TestBinaryDocument, TestSpecialOperations, TestIntsRef, TestRegexpRandom2, TestPrefixQuery,
TestDocValuesScoring, TestIndexWriterNRTIsCurrent, TestDocument, TestGraphTokenizers, TestTermInfosReaderIndex,
TestSetOnce, TestFieldCache, TestDoc, TestDeterminizeLexicon, TestSearchAfter, TestFieldCacheSanityChecker,
TestConstantScoreQuery, TestPrefixInBooleanQuery, TestCustomNorms, TestCharsRef, Test2BDocs,
TestTermVectorsReader, TestDuelingCodecs, TestBooleanScorer, TestSegmentTermDocs, Nested1,
TestSloppyPhraseQuery, TestIndexFileDeleter, TestNGramPhraseQuery, TestIndexWriterMerging,
TestTermScorer, TestPerFieldPostingsFormat, TestPostingsFormat, TestDirectoryReaderReopen,
TestAssertions, TestFieldMaskingSpanQuery, Test2BPositions, TestPerSegmentDeletes, TestNRTReaderWithThreads,
TestStressAdvance, TestIsCurrent, TestBitVector, TestField, TestFuzzyQuery, TestPackedInts,
TestIndexWriterUnicode, TestIndexWriterMergePolicy, TestOmitPositions, TestLazyProxSkipping,
TestMergeSchedulerExternal, TestRAMDirectory, Nested1, TestLookaheadTokenFilter, TestDeterminism,
TestIntBlockPool, TestMultiTermConstantScore, TestSpanFirstQuery, TestSpanExplanationsOfNonMatches,
TestExternalCodecs, TestFilteredSearch, TestIndexWriterCommit, TestSpanExplanations, TestPagedBytes,
TestByteBlockPool, TestAllFilesHaveCodecHeader, TestRegexpRandom, TestLockFactory, Nested1,
TestTransactionRollback, TestSimpleAttributeImpl, TestReaderClosed, TestTermVectorsWriter,
TestSegmentReader, TestDemo, TestSizeBoundedForceMerge, TestBlockPostingsFormat3, TestPayloads,
TestVersion, TestForTooMuchCloning, TestAttributeSource, TestIndexWriterWithThreads, TestRecyclingByteBlockAllocator,
TestOmitNorms, TestTermsEnum, TestCharTermAttributeImpl, TestFieldsReader, TestComplexExplanationsOfNonMatches,
TestSpanSearchEquivalence, TestBlockPostingsFormat, TestPhraseQuery, TestNumericRangeQuery32,
Nested1, TestLock, TestTopDocsMerge, TestIOUtils, TestForUtil, TestCachingCollector, TestPrefixRandom,
TestTerm, TestBinaryTerms, TestDocumentsWriterStallControl, TestArrayUtil, TestShardSearching,
Nested, Nested, TestComplexExplanations, TestPayloadsOnVectors, TestCrashCausesCorruptIndex,
TestSpansAdvanced, TestRollback, TestPerFieldPostingsFormat2, NestedSetupChain, NestedTeardownChain,
TestPositiveScoresOnlyCollector, TestSmallFloat, TestPayloadSpans, TestDocsAndPositions, TestNoMergeScheduler,
TestUniqueTermCount, TestPersistentSnapshotDeletionPolicy, Test2BPostings, TestBytesRefHash,
TestMultiFields, Test4GBStoredFields, TestMaxTermFrequency, TestRandomStoredFields, TestSubScorerFreqs,
TestIndexWriterOnJRECrash, TestTypePromotion, TestHugeRamFile, TestTermVectors, TestSurrogates,
TestDocumentsWriterDeleteQueue, TestSimilarity, TestNumericRangeQuery64, TestFilterIterator,
TestBufferedIndexInput, TestSimpleExplanations, TestSearchForDuplicates, TestPrefixFilter,
TestBooleanQuery, TestCharFilter, TestPriorityQueue, TestIndexWriterLockRelease, TestScorerPerf,
TestParallelCompositeReader, TestSimpleExplanationsOfNonMatches, TestFSTs, TestNorms, TestIndexWriterReader,
TestBoolean2, TestIndexWriterExceptions, TestNRTThreads, TestBasics, TestByteSlices, TestDeletionPolicy,
TestAddIndexes, TestAtomicUpdate, TestIndexWriter, TestMultiMMap, TestLucene40PostingsReader,
TestTimeLimitingCollector, TestNeverDelete, TestMinimize, TestBackwardsCompatibility, TestNRTManager,
TestSort, TestNRTCachingDirectory, TestIndexWriterForceMerge, TestCollectionUtil, TestLongPostings,
TestDirectoryReader, TestFixedBitSet, TestToken, TestWeakIdentityMap, TestCompoundFile, TestStressIndexing,
TestSnapshotDeletionPolicy, TestMockAnalyzer, TestTieredMergePolicy, TestDocValuesIndexing,
TestConcurrentMergeScheduler]
[junit4:junit4] Completed in 2.86s, 5 tests, 1 error <<< FAILURES!

[...truncated 392 lines...]
BUILD FAILED
C:\Users\JenkinsSlave\workspace\Lucene-Solr-4.x-Windows\build.xml:337: The following error
occurred while executing this line:
C:\Users\JenkinsSlave\workspace\Lucene-Solr-4.x-Windows\build.xml:39: The following error
occurred while executing this line:
C:\Users\JenkinsSlave\workspace\Lucene-Solr-4.x-Windows\lucene\build.xml:50: The following
error occurred while executing this line:
C:\Users\JenkinsSlave\workspace\Lucene-Solr-4.x-Windows\lucene\common-build.xml:1163: The
following error occurred while executing this line:
C:\Users\JenkinsSlave\workspace\Lucene-Solr-4.x-Windows\lucene\common-build.xml:827: There
were test failures: 325 suites, 1862 tests, 1 error, 23 ignored (12 assumptions)

Total time: 8 minutes 23 seconds
Build step 'Invoke Ant' marked build as failure
Archiving artifacts
Recording test results
Description set: Java: 32bit/jdk1.6.0_37 -client -XX:+UseSerialGC
Email was triggered for: Failure
Sending email for trigger: Failure



Mime
View raw message