lucene-dev mailing list archives

Site index · List index
Message view « Date » · « Thread »
Top « Date » · « Thread »
From Policeman Jenkins Server <jenk...@sd-datasolutions.de>
Subject [JENKINS] Lucene-Solr-trunk-Windows (32bit/jdk1.7.0_09) - Build # 1491 - Failure!
Date Thu, 08 Nov 2012 19:24:41 GMT
Build: http://jenkins.sd-datasolutions.de/job/Lucene-Solr-trunk-Windows/1491/
Java: 32bit/jdk1.7.0_09 -client -XX:+UseSerialGC

1 tests failed.
REGRESSION:  org.apache.lucene.search.TestShardSearching.testSimple

Error Message:


Stack Trace:
java.lang.AssertionError
	at __randomizedtesting.SeedInfo.seed([2BB4508607BA88F3:1307747820495C22]:0)
	at org.apache.lucene.search.TestShardSearching.testSimple(TestShardSearching.java:247)
	at sun.reflect.NativeMethodAccessorImpl.invoke0(Native Method)
	at sun.reflect.NativeMethodAccessorImpl.invoke(NativeMethodAccessorImpl.java:57)
	at sun.reflect.DelegatingMethodAccessorImpl.invoke(DelegatingMethodAccessorImpl.java:43)
	at java.lang.reflect.Method.invoke(Method.java:601)
	at com.carrotsearch.randomizedtesting.RandomizedRunner.invoke(RandomizedRunner.java:1559)
	at com.carrotsearch.randomizedtesting.RandomizedRunner.access$600(RandomizedRunner.java:79)
	at com.carrotsearch.randomizedtesting.RandomizedRunner$6.evaluate(RandomizedRunner.java:737)
	at com.carrotsearch.randomizedtesting.RandomizedRunner$7.evaluate(RandomizedRunner.java:773)
	at com.carrotsearch.randomizedtesting.RandomizedRunner$8.evaluate(RandomizedRunner.java:787)
	at org.apache.lucene.util.TestRuleSetupTeardownChained$1.evaluate(TestRuleSetupTeardownChained.java:50)
	at org.apache.lucene.util.TestRuleFieldCacheSanity$1.evaluate(TestRuleFieldCacheSanity.java:51)
	at org.apache.lucene.util.AbstractBeforeAfterRule$1.evaluate(AbstractBeforeAfterRule.java:45)
	at com.carrotsearch.randomizedtesting.rules.SystemPropertiesInvariantRule$1.evaluate(SystemPropertiesInvariantRule.java:55)
	at org.apache.lucene.util.TestRuleThreadAndTestName$1.evaluate(TestRuleThreadAndTestName.java:48)
	at org.apache.lucene.util.TestRuleIgnoreAfterMaxFailures$1.evaluate(TestRuleIgnoreAfterMaxFailures.java:70)
	at org.apache.lucene.util.TestRuleMarkFailure$1.evaluate(TestRuleMarkFailure.java:48)
	at com.carrotsearch.randomizedtesting.rules.StatementAdapter.evaluate(StatementAdapter.java:36)
	at com.carrotsearch.randomizedtesting.ThreadLeakControl$StatementRunner.run(ThreadLeakControl.java:358)
	at com.carrotsearch.randomizedtesting.ThreadLeakControl.forkTimeoutingTask(ThreadLeakControl.java:782)
	at com.carrotsearch.randomizedtesting.ThreadLeakControl$3.evaluate(ThreadLeakControl.java:442)
	at com.carrotsearch.randomizedtesting.RandomizedRunner.runSingleTest(RandomizedRunner.java:746)
	at com.carrotsearch.randomizedtesting.RandomizedRunner$3.evaluate(RandomizedRunner.java:648)
	at com.carrotsearch.randomizedtesting.RandomizedRunner$4.evaluate(RandomizedRunner.java:682)
	at com.carrotsearch.randomizedtesting.RandomizedRunner$5.evaluate(RandomizedRunner.java:693)
	at org.apache.lucene.util.AbstractBeforeAfterRule$1.evaluate(AbstractBeforeAfterRule.java:45)
	at org.apache.lucene.util.TestRuleStoreClassName$1.evaluate(TestRuleStoreClassName.java:42)
	at com.carrotsearch.randomizedtesting.rules.SystemPropertiesInvariantRule$1.evaluate(SystemPropertiesInvariantRule.java:55)
	at com.carrotsearch.randomizedtesting.rules.NoShadowingOrOverridesOnMethodsRule$1.evaluate(NoShadowingOrOverridesOnMethodsRule.java:39)
	at com.carrotsearch.randomizedtesting.rules.NoShadowingOrOverridesOnMethodsRule$1.evaluate(NoShadowingOrOverridesOnMethodsRule.java:39)
	at com.carrotsearch.randomizedtesting.rules.StatementAdapter.evaluate(StatementAdapter.java:36)
	at org.apache.lucene.util.TestRuleAssertionsRequired$1.evaluate(TestRuleAssertionsRequired.java:43)
	at org.apache.lucene.util.TestRuleMarkFailure$1.evaluate(TestRuleMarkFailure.java:48)
	at org.apache.lucene.util.TestRuleIgnoreAfterMaxFailures$1.evaluate(TestRuleIgnoreAfterMaxFailures.java:70)
	at org.apache.lucene.util.TestRuleIgnoreTestSuites$1.evaluate(TestRuleIgnoreTestSuites.java:55)
	at com.carrotsearch.randomizedtesting.rules.StatementAdapter.evaluate(StatementAdapter.java:36)
	at com.carrotsearch.randomizedtesting.ThreadLeakControl$StatementRunner.run(ThreadLeakControl.java:358)
	at java.lang.Thread.run(Thread.java:722)




Build Log:
[...truncated 734 lines...]
[junit4:junit4] Suite: org.apache.lucene.search.TestShardSearching
[junit4:junit4]   2> NOTE: reproduce with: ant test  -Dtestcase=TestShardSearching -Dtests.method=testSimple
-Dtests.seed=2BB4508607BA88F3 -Dtests.slow=true -Dtests.locale=ca -Dtests.timezone=NST -Dtests.file.encoding=US-ASCII
[junit4:junit4] FAILURE 3.63s | TestShardSearching.testSimple <<<
[junit4:junit4]    > Throwable #1: java.lang.AssertionError
[junit4:junit4]    > 	at __randomizedtesting.SeedInfo.seed([2BB4508607BA88F3:1307747820495C22]:0)
[junit4:junit4]    > 	at org.apache.lucene.search.TestShardSearching.testSimple(TestShardSearching.java:247)
[junit4:junit4]    > 	at sun.reflect.NativeMethodAccessorImpl.invoke0(Native Method)
[junit4:junit4]    > 	at sun.reflect.NativeMethodAccessorImpl.invoke(NativeMethodAccessorImpl.java:57)
[junit4:junit4]    > 	at sun.reflect.DelegatingMethodAccessorImpl.invoke(DelegatingMethodAccessorImpl.java:43)
[junit4:junit4]    > 	at java.lang.reflect.Method.invoke(Method.java:601)
[junit4:junit4]    > 	at com.carrotsearch.randomizedtesting.RandomizedRunner.invoke(RandomizedRunner.java:1559)
[junit4:junit4]    > 	at com.carrotsearch.randomizedtesting.RandomizedRunner.access$600(RandomizedRunner.java:79)
[junit4:junit4]    > 	at com.carrotsearch.randomizedtesting.RandomizedRunner$6.evaluate(RandomizedRunner.java:737)
[junit4:junit4]    > 	at com.carrotsearch.randomizedtesting.RandomizedRunner$7.evaluate(RandomizedRunner.java:773)
[junit4:junit4]    > 	at com.carrotsearch.randomizedtesting.RandomizedRunner$8.evaluate(RandomizedRunner.java:787)
[junit4:junit4]    > 	at org.apache.lucene.util.TestRuleSetupTeardownChained$1.evaluate(TestRuleSetupTeardownChained.java:50)
[junit4:junit4]    > 	at org.apache.lucene.util.TestRuleFieldCacheSanity$1.evaluate(TestRuleFieldCacheSanity.java:51)
[junit4:junit4]    > 	at org.apache.lucene.util.AbstractBeforeAfterRule$1.evaluate(AbstractBeforeAfterRule.java:45)
[junit4:junit4]    > 	at com.carrotsearch.randomizedtesting.rules.SystemPropertiesInvariantRule$1.evaluate(SystemPropertiesInvariantRule.java:55)
[junit4:junit4]    > 	at org.apache.lucene.util.TestRuleThreadAndTestName$1.evaluate(TestRuleThreadAndTestName.java:48)
[junit4:junit4]    > 	at org.apache.lucene.util.TestRuleIgnoreAfterMaxFailures$1.evaluate(TestRuleIgnoreAfterMaxFailures.java:70)
[junit4:junit4]    > 	at org.apache.lucene.util.TestRuleMarkFailure$1.evaluate(TestRuleMarkFailure.java:48)
[junit4:junit4]    > 	at com.carrotsearch.randomizedtesting.rules.StatementAdapter.evaluate(StatementAdapter.java:36)
[junit4:junit4]    > 	at com.carrotsearch.randomizedtesting.ThreadLeakControl$StatementRunner.run(ThreadLeakControl.java:358)
[junit4:junit4]    > 	at com.carrotsearch.randomizedtesting.ThreadLeakControl.forkTimeoutingTask(ThreadLeakControl.java:782)
[junit4:junit4]    > 	at com.carrotsearch.randomizedtesting.ThreadLeakControl$3.evaluate(ThreadLeakControl.java:442)
[junit4:junit4]    > 	at com.carrotsearch.randomizedtesting.RandomizedRunner.runSingleTest(RandomizedRunner.java:746)
[junit4:junit4]    > 	at com.carrotsearch.randomizedtesting.RandomizedRunner$3.evaluate(RandomizedRunner.java:648)
[junit4:junit4]    > 	at com.carrotsearch.randomizedtesting.RandomizedRunner$4.evaluate(RandomizedRunner.java:682)
[junit4:junit4]    > 	at com.carrotsearch.randomizedtesting.RandomizedRunner$5.evaluate(RandomizedRunner.java:693)
[junit4:junit4]    > 	at org.apache.lucene.util.AbstractBeforeAfterRule$1.evaluate(AbstractBeforeAfterRule.java:45)
[junit4:junit4]    > 	at org.apache.lucene.util.TestRuleStoreClassName$1.evaluate(TestRuleStoreClassName.java:42)
[junit4:junit4]    > 	at com.carrotsearch.randomizedtesting.rules.SystemPropertiesInvariantRule$1.evaluate(SystemPropertiesInvariantRule.java:55)
[junit4:junit4]    > 	at com.carrotsearch.randomizedtesting.rules.NoShadowingOrOverridesOnMethodsRule$1.evaluate(NoShadowingOrOverridesOnMethodsRule.java:39)
[junit4:junit4]    > 	at com.carrotsearch.randomizedtesting.rules.NoShadowingOrOverridesOnMethodsRule$1.evaluate(NoShadowingOrOverridesOnMethodsRule.java:39)
[junit4:junit4]    > 	at com.carrotsearch.randomizedtesting.rules.StatementAdapter.evaluate(StatementAdapter.java:36)
[junit4:junit4]    > 	at org.apache.lucene.util.TestRuleAssertionsRequired$1.evaluate(TestRuleAssertionsRequired.java:43)
[junit4:junit4]    > 	at org.apache.lucene.util.TestRuleMarkFailure$1.evaluate(TestRuleMarkFailure.java:48)
[junit4:junit4]    > 	at org.apache.lucene.util.TestRuleIgnoreAfterMaxFailures$1.evaluate(TestRuleIgnoreAfterMaxFailures.java:70)
[junit4:junit4]    > 	at org.apache.lucene.util.TestRuleIgnoreTestSuites$1.evaluate(TestRuleIgnoreTestSuites.java:55)
[junit4:junit4]    > 	at com.carrotsearch.randomizedtesting.rules.StatementAdapter.evaluate(StatementAdapter.java:36)
[junit4:junit4]    > 	at com.carrotsearch.randomizedtesting.ThreadLeakControl$StatementRunner.run(ThreadLeakControl.java:358)
[junit4:junit4]    > 	at java.lang.Thread.run(Thread.java:722)
[junit4:junit4]   2> NOTE: test params are: codec=Asserting, sim=DefaultSimilarity, locale=ca,
timezone=NST
[junit4:junit4]   2> NOTE: Windows 7 6.1 x86/Oracle Corporation 1.7.0_09 (32-bit)/cpus=2,threads=1,free=74990912,total=183087104
[junit4:junit4]   2> NOTE: All tests run in this JVM: [TestCachingCollector, TestTypePromotion,
TestFieldCacheSanityChecker, TestPrefixRandom, TestIndexWriterWithThreads, TestIndexFileDeleter,
TestIOUtils, TestPayloadSpans, TestTopDocsCollector, TestBooleanMinShouldMatch, TestComplexExplanations,
TestFieldInfos, TestCloseableThreadLocal, TestTermVectorsWriter, TestWeakIdentityMap, TestMixedCodecs,
Nested, TestDeterminizeLexicon, TestIndexWriterExceptions, TestMultiFields, TestAddIndexes,
Nested1, TestHugeRamFile, TestReaderClosed, TestDateTools, TestPayloads, TestTerm, TestMatchAllDocsQuery,
TestMultiTermQueryRewrites, TestRamUsageEstimatorOnWildAnimals, TestDirectoryReaderReopen,
TestNRTReaderWithThreads, TestTermRangeQuery, TestIndexWriterNRTIsCurrent, TestByteBlockPool,
TestDocValuesIndexing, TestTopDocsMerge, TestRegexpQuery, TestFilterIterator, TestNRTCachingDirectory,
TestArrayUtil, TestVersion, TestFileSwitchDirectory, TestScorerPerf, TestSegmentReader, TestIsCurrent,
TestAttributeSource, TestNGramPhraseQuery, TestLucene40PostingsFormat, TestFieldMaskingSpanQuery,
TestBooleanQuery, TestExternalCodecs, TestIndexWriterDelete, TestSpecialOperations, ThrowInUncaught,
TestPayloadExplanations, TestNRTThreads, TestDoc, TestRandomStoredFields, TestDirectory, TestPostingsFormat,
TestElevationComparator, TestSpansAdvanced2, TestMockDirectoryWrapper, TestNRTManager, TestPrefixCodedTerms,
TestSimilarityProvider, TestByteSlices, TestBinaryTerms, TestIndexWriterUnicode, TestBooleanScorer,
TestSpanExplanations, TestCharFilter, TestTimeLimitingCollector, TestPhrasePrefixQuery, TestTermRangeFilter,
TestFlushByRamOrCountsPolicy, TestNumericTokenStream, TestBytesRef, TestSearcherManager, TestCollectionUtil,
TestPerSegmentDeletes, TestIndexWriterConfig, TestSimilarityBase, TestParallelAtomicReader,
TestSpans, TestOpenBitSet, TestIndexWriter, Test2BPostingsBytes, TestOmitPositions, TestOmitTf,
TestSimilarity, TestAssertions, TestStressIndexing2, TestConsistentFieldNumbers, TestNoMergePolicy,
TestByteArrayDataInput, TestBagOfPostings, TestNewestSegment, TestDemo, TestNumericUtils,
TestBagOfPositions, TestBufferedIndexInput, TestNot, TestStressNRT, TestGraphTokenizers, TestWildcard,
TestIntsRef, InBeforeClass, InAfterClass, NonStringProperties, InTestMethod, TestCrash, TestSimilarity2,
TestSearchWithThreads, TestDocument, TestMaxTermFrequency, TestRAMDirectory, TestSegmentTermDocs,
TestMultiTermConstantScore, TestFlex, TestComplexExplanationsOfNonMatches, Nested1, TestNearSpansOrdered,
TestMultiPhraseQuery, Test2BTerms, TestQueryWrapperFilter, TestSearchAfter, TestCachingTokenFilter,
TestTermVectors, TestWorstCaseTestBehavior, TestMultiThreadTermVectors, TestRecyclingByteBlockAllocator,
TestForceMergeForever, TestMockAnalyzer, TestDocumentsWriterStallControl, TestCompiledAutomaton,
TestIndexWriterForceMerge, TestTermsEnum2, TestSegmentMerger, TestCrashCausesCorruptIndex,
TestUniqueTermCount, Nested1, TestPerFieldPostingsFormat2, TestNoDeletionPolicy, TestRollback,
TestSort, TestDoubleBarrelLRUCache, TestTermdocPerf, TestField, TestDocCount, TestFixedBitSet,
TestBlockPostingsFormat3, TestDocIdSet, TestPayloadNearQuery, TestBytesRefHash, TestPrefixQuery,
TestSimpleExplanationsOfNonMatches, TestSubScorerFreqs, Nested, Nested, TestLucene40PostingsReader,
TestSloppyPhraseQuery, TestRamUsageEstimator, TestPackedInts, TestFSTs, TestNorms, TestIndexWriterReader,
TestLookaheadTokenFilter, TestShardSearching]
[junit4:junit4] Completed in 4.43s, 1 test, 1 failure <<< FAILURES!

[...truncated 480 lines...]
BUILD FAILED
C:\Users\JenkinsSlave\workspace\Lucene-Solr-trunk-Windows\build.xml:335: The following error
occurred while executing this line:
C:\Users\JenkinsSlave\workspace\Lucene-Solr-trunk-Windows\build.xml:39: The following error
occurred while executing this line:
C:\Users\JenkinsSlave\workspace\Lucene-Solr-trunk-Windows\lucene\build.xml:50: The following
error occurred while executing this line:
C:\Users\JenkinsSlave\workspace\Lucene-Solr-trunk-Windows\lucene\common-build.xml:1163: The
following error occurred while executing this line:
C:\Users\JenkinsSlave\workspace\Lucene-Solr-trunk-Windows\lucene\common-build.xml:827: There
were test failures: 319 suites, 1828 tests, 1 failure, 23 ignored (12 assumptions)

Total time: 9 minutes 2 seconds
Build step 'Invoke Ant' marked build as failure
Archiving artifacts
Recording test results
Description set: Java: 32bit/jdk1.7.0_09 -client -XX:+UseSerialGC
Email was triggered for: Failure
Sending email for trigger: Failure



Mime
View raw message