lucene-dev mailing list archives

Site index · List index
Message view « Date » · « Thread »
Top « Date » · « Thread »
From Policeman Jenkins Server <jenk...@sd-datasolutions.de>
Subject [JENKINS] Lucene-Solr-trunk-Windows (64bit/jdk1.7.0_09) - Build # 1561 - Still Failing!
Date Mon, 12 Nov 2012 01:43:20 GMT
Build: http://jenkins.sd-datasolutions.de/job/Lucene-Solr-trunk-Windows/1561/
Java: 64bit/jdk1.7.0_09 -XX:+UseSerialGC

1 tests failed.
FAILED:  org.apache.lucene.index.TestConcurrentMergeScheduler.testMaxMergeCount

Error Message:
count should be <= maxMergeCount (= 3)

Stack Trace:
java.lang.IllegalArgumentException: count should be <= maxMergeCount (= 3)
	at __randomizedtesting.SeedInfo.seed([CE1B8023AE54FE59:197C1190129561DF]:0)
	at org.apache.lucene.index.ConcurrentMergeScheduler.setMaxThreadCount(ConcurrentMergeScheduler.java:90)
	at org.apache.lucene.index.TestConcurrentMergeScheduler.testMaxMergeCount(TestConcurrentMergeScheduler.java:303)
	at sun.reflect.NativeMethodAccessorImpl.invoke0(Native Method)
	at sun.reflect.NativeMethodAccessorImpl.invoke(NativeMethodAccessorImpl.java:57)
	at sun.reflect.DelegatingMethodAccessorImpl.invoke(DelegatingMethodAccessorImpl.java:43)
	at java.lang.reflect.Method.invoke(Method.java:601)
	at com.carrotsearch.randomizedtesting.RandomizedRunner.invoke(RandomizedRunner.java:1559)
	at com.carrotsearch.randomizedtesting.RandomizedRunner.access$600(RandomizedRunner.java:79)
	at com.carrotsearch.randomizedtesting.RandomizedRunner$6.evaluate(RandomizedRunner.java:737)
	at com.carrotsearch.randomizedtesting.RandomizedRunner$7.evaluate(RandomizedRunner.java:773)
	at com.carrotsearch.randomizedtesting.RandomizedRunner$8.evaluate(RandomizedRunner.java:787)
	at org.apache.lucene.util.TestRuleSetupTeardownChained$1.evaluate(TestRuleSetupTeardownChained.java:50)
	at org.apache.lucene.util.TestRuleFieldCacheSanity$1.evaluate(TestRuleFieldCacheSanity.java:51)
	at org.apache.lucene.util.AbstractBeforeAfterRule$1.evaluate(AbstractBeforeAfterRule.java:45)
	at com.carrotsearch.randomizedtesting.rules.SystemPropertiesInvariantRule$1.evaluate(SystemPropertiesInvariantRule.java:55)
	at org.apache.lucene.util.TestRuleThreadAndTestName$1.evaluate(TestRuleThreadAndTestName.java:48)
	at org.apache.lucene.util.TestRuleIgnoreAfterMaxFailures$1.evaluate(TestRuleIgnoreAfterMaxFailures.java:70)
	at org.apache.lucene.util.TestRuleMarkFailure$1.evaluate(TestRuleMarkFailure.java:48)
	at com.carrotsearch.randomizedtesting.rules.StatementAdapter.evaluate(StatementAdapter.java:36)
	at com.carrotsearch.randomizedtesting.ThreadLeakControl$StatementRunner.run(ThreadLeakControl.java:358)
	at com.carrotsearch.randomizedtesting.ThreadLeakControl.forkTimeoutingTask(ThreadLeakControl.java:782)
	at com.carrotsearch.randomizedtesting.ThreadLeakControl$3.evaluate(ThreadLeakControl.java:442)
	at com.carrotsearch.randomizedtesting.RandomizedRunner.runSingleTest(RandomizedRunner.java:746)
	at com.carrotsearch.randomizedtesting.RandomizedRunner$3.evaluate(RandomizedRunner.java:648)
	at com.carrotsearch.randomizedtesting.RandomizedRunner$4.evaluate(RandomizedRunner.java:682)
	at com.carrotsearch.randomizedtesting.RandomizedRunner$5.evaluate(RandomizedRunner.java:693)
	at org.apache.lucene.util.AbstractBeforeAfterRule$1.evaluate(AbstractBeforeAfterRule.java:45)
	at org.apache.lucene.util.TestRuleStoreClassName$1.evaluate(TestRuleStoreClassName.java:42)
	at com.carrotsearch.randomizedtesting.rules.SystemPropertiesInvariantRule$1.evaluate(SystemPropertiesInvariantRule.java:55)
	at com.carrotsearch.randomizedtesting.rules.NoShadowingOrOverridesOnMethodsRule$1.evaluate(NoShadowingOrOverridesOnMethodsRule.java:39)
	at com.carrotsearch.randomizedtesting.rules.NoShadowingOrOverridesOnMethodsRule$1.evaluate(NoShadowingOrOverridesOnMethodsRule.java:39)
	at com.carrotsearch.randomizedtesting.rules.StatementAdapter.evaluate(StatementAdapter.java:36)
	at org.apache.lucene.util.TestRuleAssertionsRequired$1.evaluate(TestRuleAssertionsRequired.java:43)
	at org.apache.lucene.util.TestRuleMarkFailure$1.evaluate(TestRuleMarkFailure.java:48)
	at org.apache.lucene.util.TestRuleIgnoreAfterMaxFailures$1.evaluate(TestRuleIgnoreAfterMaxFailures.java:70)
	at org.apache.lucene.util.TestRuleIgnoreTestSuites$1.evaluate(TestRuleIgnoreTestSuites.java:55)
	at com.carrotsearch.randomizedtesting.rules.StatementAdapter.evaluate(StatementAdapter.java:36)
	at com.carrotsearch.randomizedtesting.ThreadLeakControl$StatementRunner.run(ThreadLeakControl.java:358)
	at java.lang.Thread.run(Thread.java:722)




Build Log:
[...truncated 716 lines...]
[junit4:junit4] Suite: org.apache.lucene.index.TestConcurrentMergeScheduler
[junit4:junit4]   2> NOTE: reproduce with: ant test  -Dtestcase=TestConcurrentMergeScheduler
-Dtests.method=testMaxMergeCount -Dtests.seed=CE1B8023AE54FE59 -Dtests.slow=true -Dtests.locale=fi_FI
-Dtests.timezone=Asia/Yekaterinburg -Dtests.file.encoding=Cp1252
[junit4:junit4] ERROR   0.01s | TestConcurrentMergeScheduler.testMaxMergeCount <<<
[junit4:junit4]    > Throwable #1: java.lang.IllegalArgumentException: count should be
<= maxMergeCount (= 3)
[junit4:junit4]    > 	at __randomizedtesting.SeedInfo.seed([CE1B8023AE54FE59:197C1190129561DF]:0)
[junit4:junit4]    > 	at org.apache.lucene.index.ConcurrentMergeScheduler.setMaxThreadCount(ConcurrentMergeScheduler.java:90)
[junit4:junit4]    > 	at org.apache.lucene.index.TestConcurrentMergeScheduler.testMaxMergeCount(TestConcurrentMergeScheduler.java:303)
[junit4:junit4]    > 	at sun.reflect.NativeMethodAccessorImpl.invoke0(Native Method)
[junit4:junit4]    > 	at sun.reflect.NativeMethodAccessorImpl.invoke(NativeMethodAccessorImpl.java:57)
[junit4:junit4]    > 	at sun.reflect.DelegatingMethodAccessorImpl.invoke(DelegatingMethodAccessorImpl.java:43)
[junit4:junit4]    > 	at java.lang.reflect.Method.invoke(Method.java:601)
[junit4:junit4]    > 	at com.carrotsearch.randomizedtesting.RandomizedRunner.invoke(RandomizedRunner.java:1559)
[junit4:junit4]    > 	at com.carrotsearch.randomizedtesting.RandomizedRunner.access$600(RandomizedRunner.java:79)
[junit4:junit4]    > 	at com.carrotsearch.randomizedtesting.RandomizedRunner$6.evaluate(RandomizedRunner.java:737)
[junit4:junit4]    > 	at com.carrotsearch.randomizedtesting.RandomizedRunner$7.evaluate(RandomizedRunner.java:773)
[junit4:junit4]    > 	at com.carrotsearch.randomizedtesting.RandomizedRunner$8.evaluate(RandomizedRunner.java:787)
[junit4:junit4]    > 	at org.apache.lucene.util.TestRuleSetupTeardownChained$1.evaluate(TestRuleSetupTeardownChained.java:50)
[junit4:junit4]    > 	at org.apache.lucene.util.TestRuleFieldCacheSanity$1.evaluate(TestRuleFieldCacheSanity.java:51)
[junit4:junit4]    > 	at org.apache.lucene.util.AbstractBeforeAfterRule$1.evaluate(AbstractBeforeAfterRule.java:45)
[junit4:junit4]    > 	at com.carrotsearch.randomizedtesting.rules.SystemPropertiesInvariantRule$1.evaluate(SystemPropertiesInvariantRule.java:55)
[junit4:junit4]    > 	at org.apache.lucene.util.TestRuleThreadAndTestName$1.evaluate(TestRuleThreadAndTestName.java:48)
[junit4:junit4]    > 	at org.apache.lucene.util.TestRuleIgnoreAfterMaxFailures$1.evaluate(TestRuleIgnoreAfterMaxFailures.java:70)
[junit4:junit4]    > 	at org.apache.lucene.util.TestRuleMarkFailure$1.evaluate(TestRuleMarkFailure.java:48)
[junit4:junit4]    > 	at com.carrotsearch.randomizedtesting.rules.StatementAdapter.evaluate(StatementAdapter.java:36)
[junit4:junit4]    > 	at com.carrotsearch.randomizedtesting.ThreadLeakControl$StatementRunner.run(ThreadLeakControl.java:358)
[junit4:junit4]    > 	at com.carrotsearch.randomizedtesting.ThreadLeakControl.forkTimeoutingTask(ThreadLeakControl.java:782)
[junit4:junit4]    > 	at com.carrotsearch.randomizedtesting.ThreadLeakControl$3.evaluate(ThreadLeakControl.java:442)
[junit4:junit4]    > 	at com.carrotsearch.randomizedtesting.RandomizedRunner.runSingleTest(RandomizedRunner.java:746)
[junit4:junit4]    > 	at com.carrotsearch.randomizedtesting.RandomizedRunner$3.evaluate(RandomizedRunner.java:648)
[junit4:junit4]    > 	at com.carrotsearch.randomizedtesting.RandomizedRunner$4.evaluate(RandomizedRunner.java:682)
[junit4:junit4]    > 	at com.carrotsearch.randomizedtesting.RandomizedRunner$5.evaluate(RandomizedRunner.java:693)
[junit4:junit4]    > 	at org.apache.lucene.util.AbstractBeforeAfterRule$1.evaluate(AbstractBeforeAfterRule.java:45)
[junit4:junit4]    > 	at org.apache.lucene.util.TestRuleStoreClassName$1.evaluate(TestRuleStoreClassName.java:42)
[junit4:junit4]    > 	at com.carrotsearch.randomizedtesting.rules.SystemPropertiesInvariantRule$1.evaluate(SystemPropertiesInvariantRule.java:55)
[junit4:junit4]    > 	at com.carrotsearch.randomizedtesting.rules.NoShadowingOrOverridesOnMethodsRule$1.evaluate(NoShadowingOrOverridesOnMethodsRule.java:39)
[junit4:junit4]    > 	at com.carrotsearch.randomizedtesting.rules.NoShadowingOrOverridesOnMethodsRule$1.evaluate(NoShadowingOrOverridesOnMethodsRule.java:39)
[junit4:junit4]    > 	at com.carrotsearch.randomizedtesting.rules.StatementAdapter.evaluate(StatementAdapter.java:36)
[junit4:junit4]    > 	at org.apache.lucene.util.TestRuleAssertionsRequired$1.evaluate(TestRuleAssertionsRequired.java:43)
[junit4:junit4]    > 	at org.apache.lucene.util.TestRuleMarkFailure$1.evaluate(TestRuleMarkFailure.java:48)
[junit4:junit4]    > 	at org.apache.lucene.util.TestRuleIgnoreAfterMaxFailures$1.evaluate(TestRuleIgnoreAfterMaxFailures.java:70)
[junit4:junit4]    > 	at org.apache.lucene.util.TestRuleIgnoreTestSuites$1.evaluate(TestRuleIgnoreTestSuites.java:55)
[junit4:junit4]    > 	at com.carrotsearch.randomizedtesting.rules.StatementAdapter.evaluate(StatementAdapter.java:36)
[junit4:junit4]    > 	at com.carrotsearch.randomizedtesting.ThreadLeakControl$StatementRunner.run(ThreadLeakControl.java:358)
[junit4:junit4]    > 	at java.lang.Thread.run(Thread.java:722)
[junit4:junit4]   2> NOTE: test params are: codec=Lucene41: {content=Pulsing41(freqCutoff=4
minBlockSize=27 maxBlockSize=92), id=PostingsFormat(name=Lucene41WithOrds)}, sim=DefaultSimilarity,
locale=fi_FI, timezone=Asia/Yekaterinburg
[junit4:junit4]   2> NOTE: Windows 7 6.1 amd64/Oracle Corporation 1.7.0_09 (64-bit)/cpus=2,threads=1,free=31404200,total=277266432
[junit4:junit4]   2> NOTE: All tests run in this JVM: [TestIndexFileDeleter, TestLockFactory,
TestBoolean2, Nested1, TestBagOfPositions, TestBasics, Test2BDocs, TestForceMergeForever,
TestTermsEnum2, TestCollectionUtil, TestTermVectorsReader, TestMultiTermQueryRewrites, TestSpecialOperations,
TestMultiLevelSkipList, TestSloppyPhraseQuery, TestDocsAndPositions, TestSpanExplanationsOfNonMatches,
TestNRTManager, TestTopDocsMerge, TestFilterAtomicReader, TestConstantScoreQuery, TestIntBlockPool,
TestRAMDirectory, TestDoc, TestAttributeSource, TestVersionComparator, TestDocValuesIndexing,
TestNumericRangeQuery64, TestPayloadTermQuery, TestField, NestedTeardownChain, NestedSetupChain,
TestTermsEnum, TestPhrasePrefixQuery, TestCheckIndex, TestPerFieldPostingsFormat2, TestOmitNorms,
TestDemo, TestIntsRef, TestFieldCacheRangeFilter, TestByteArrayDataInput, TestNorms, TestTermScorer,
TestMinimize, TestLevenshteinAutomata, TestIOUtils, TestAutomatonQuery, TestRollback, TestUTF32ToUTF8,
TestIndexWriterOnDiskFull, TestSpansAdvanced, TestOmitPositions, TestNearSpansOrdered, TestToken,
TestDocTermOrds, TestFilterIterator, TestRamUsageEstimator, TestSloppyPhraseQuery2, TestRegexpRandom,
TestHugeRamFile, TestSimilarityBase, Test2BPostings, TestSumDocFreq, TestAssertions, Nested,
TestMockCharFilter, TestMultiThreadTermVectors, TestCustomSearcherSort, TestTopDocsCollector,
TestSearchAfter, TestMultiValuedNumericRangeQuery, TestQueryWrapperFilter, TestSentinelIntSet,
TestMixedCodecs, TestDocumentsWriterDeleteQueue, TestNumericUtils, TestPayloadsOnVectors,
TestSearchWithThreads, TestBitUtil, TestPrefixRandom, TestRollingBuffer, TestPackedInts, TestDirectoryReaderReopen,
TestBlockPostingsFormat2, TestSmallFloat, TestIndexWriterWithThreads, TestBinaryTerms, TestDirectoryReader,
TestComplexExplanationsOfNonMatches, MultiCollectorTest, TestIndexWriterLockRelease, TestCachingWrapperFilter,
TestPositiveScoresOnlyCollector, TestTermVectorsWriter, Nested1, TestOmitTf, TestBufferedIndexInput,
TestBlockPostingsFormat, TestPriorityQueue, TestAtomicUpdate, TestIsCurrent, TestIndexWriter,
TestDocValuesScoring, TestPersistentSnapshotDeletionPolicy, TestParallelAtomicReader, TestStressIndexing,
TestPrefixInBooleanQuery, TestDateTools, TestIndexCommit, TestIndexWriterExceptions, TestDisjunctionMaxQuery,
TestIndexWriterConfig, TestPostingsOffsets, TestUniqueTermCount, TestNewestSegment, TestMaxTermFrequency,
TestGraphTokenizers, TestFuzzyQuery, Test2BPostingsBytes, TestBooleanQuery, TestFilteredSearch,
TestSpanFirstQuery, TestDeletionPolicy, TestTermRangeFilter, TestTransactions, TestRegexpQuery,
TestSpans, TestPayloadExplanations, TestShardSearching, TestRegexpRandom2, TestPrefixQuery,
TestSegmentMerger, TestCachingTokenFilter, TestSearcherManager, TestTimeLimitingCollector,
TestCharFilter, TestSimilarity, TestSegmentTermEnum, TestFlex, TestNoMergePolicy, TestCachingCollector,
TestTwoPhaseCommitTool, TestNumericRangeQuery32, TestReaderClosed, TestRandomStoredFields,
TestDuelingCodecs, TestNoMergeScheduler, Nested1, TestTransactionRollback, TestDateSort, TestCompiledAutomaton,
TestSimilarity2, TestSpanSearchEquivalence, TestRamUsageEstimatorOnWildAnimals, TestSimpleExplanations,
Nested, Nested, Nested, Nested, Nested, Nested, Nested, Nested, Nested, Nested, Nested, Nested,
Nested, Nested, Nested, Nested, Nested, Nested, Nested, Nested, Nested, TestSearch, TestDoubleBarrelLRUCache,
TestSimpleExplanationsOfNonMatches, TestReuseDocsEnum, TestIndexWriterOnJRECrash, TestFSTs,
TestIndexWriterReader, TestLookaheadTokenFilter, TestNRTThreads, TestByteSlices, TestAddIndexes,
TestIndexWriterMerging, TestMultiMMap, TestLucene40PostingsReader, TestOpenBitSet, TestIndexWriterMergePolicy,
TestNeverDelete, TestFlushByRamOrCountsPolicy, TestBackwardsCompatibility, TestSort, TestIndexWriterUnicode,
TestArrayUtil, TestIndexWriterDelete, TestNRTCachingDirectory, TestIndexWriterForceMerge,
TestPagedBytes, TestLongPostings, TestIndexWriterCommit, TestFixedBitSet, TestWeakIdentityMap,
TestTypePromotion, TestCompoundFile, TestCustomNorms, TestSnapshotDeletionPolicy, TestMockAnalyzer,
TestDeterminizeLexicon, TestDocumentsWriterStallControl, TestIndexWriterNRTIsCurrent, TestNRTReaderWithThreads,
TestTieredMergePolicy, TestConcurrentMergeScheduler]
[junit4:junit4] Completed in 1.41s, 5 tests, 1 error <<< FAILURES!

[...truncated 386 lines...]
BUILD FAILED
C:\Users\JenkinsSlave\workspace\Lucene-Solr-trunk-Windows\build.xml:337: The following error
occurred while executing this line:
C:\Users\JenkinsSlave\workspace\Lucene-Solr-trunk-Windows\build.xml:39: The following error
occurred while executing this line:
C:\Users\JenkinsSlave\workspace\Lucene-Solr-trunk-Windows\lucene\build.xml:50: The following
error occurred while executing this line:
C:\Users\JenkinsSlave\workspace\Lucene-Solr-trunk-Windows\lucene\common-build.xml:1163: The
following error occurred while executing this line:
C:\Users\JenkinsSlave\workspace\Lucene-Solr-trunk-Windows\lucene\common-build.xml:827: There
were test failures: 319 suites, 1829 tests, 1 error, 21 ignored (10 assumptions)

Total time: 7 minutes 25 seconds
Build step 'Invoke Ant' marked build as failure
Archiving artifacts
Recording test results
Description set: Java: 64bit/jdk1.7.0_09 -XX:+UseSerialGC
Email was triggered for: Failure
Sending email for trigger: Failure



Mime
View raw message