lucene-dev mailing list archives

Site index · List index
Message view « Date » · « Thread »
Top « Date » · « Thread »
From Policeman Jenkins Server <jenk...@sd-datasolutions.de>
Subject [JENKINS] Lucene-Solr-4.x-Linux (64bit/jdk1.8.0-ea-b58) - Build # 2267 - Failure!
Date Thu, 08 Nov 2012 12:11:40 GMT
Build: http://jenkins.sd-datasolutions.de/job/Lucene-Solr-4.x-Linux/2267/
Java: 64bit/jdk1.8.0-ea-b58 -XX:+UseSerialGC

4 tests failed.
REGRESSION:  org.apache.solr.handler.dataimport.TestSqlEntityProcessorDelta.testSingleEntity

Error Message:
Exception during query

Stack Trace:
java.lang.RuntimeException: Exception during query
	at __randomizedtesting.SeedInfo.seed([103A3F6EAC3C5255:7E8543F2C3D1BDD6]:0)
	at org.apache.solr.SolrTestCaseJ4.assertQ(SolrTestCaseJ4.java:513)
	at org.apache.solr.SolrTestCaseJ4.assertQ(SolrTestCaseJ4.java:480)
	at org.apache.solr.handler.dataimport.AbstractDIHJdbcTestCase.singleEntity(AbstractDIHJdbcTestCase.java:102)
	at org.apache.solr.handler.dataimport.TestSqlEntityProcessorDelta.testSingleEntity(TestSqlEntityProcessorDelta.java:44)
	at sun.reflect.NativeMethodAccessorImpl.invoke0(Native Method)
	at sun.reflect.NativeMethodAccessorImpl.invoke(NativeMethodAccessorImpl.java:57)
	at sun.reflect.DelegatingMethodAccessorImpl.invoke(DelegatingMethodAccessorImpl.java:43)
	at java.lang.reflect.Method.invoke(Method.java:474)
	at com.carrotsearch.randomizedtesting.RandomizedRunner.invoke(RandomizedRunner.java:1559)
	at com.carrotsearch.randomizedtesting.RandomizedRunner.access$600(RandomizedRunner.java:79)
	at com.carrotsearch.randomizedtesting.RandomizedRunner$6.evaluate(RandomizedRunner.java:737)
	at com.carrotsearch.randomizedtesting.RandomizedRunner$7.evaluate(RandomizedRunner.java:773)
	at com.carrotsearch.randomizedtesting.RandomizedRunner$8.evaluate(RandomizedRunner.java:787)
	at com.carrotsearch.randomizedtesting.rules.SystemPropertiesRestoreRule$1.evaluate(SystemPropertiesRestoreRule.java:53)
	at org.apache.lucene.util.TestRuleSetupTeardownChained$1.evaluate(TestRuleSetupTeardownChained.java:50)
	at org.apache.lucene.util.TestRuleFieldCacheSanity$1.evaluate(TestRuleFieldCacheSanity.java:51)
	at org.apache.lucene.util.AbstractBeforeAfterRule$1.evaluate(AbstractBeforeAfterRule.java:45)
	at com.carrotsearch.randomizedtesting.rules.SystemPropertiesInvariantRule$1.evaluate(SystemPropertiesInvariantRule.java:55)
	at org.apache.lucene.util.TestRuleThreadAndTestName$1.evaluate(TestRuleThreadAndTestName.java:48)
	at org.apache.lucene.util.TestRuleIgnoreAfterMaxFailures$1.evaluate(TestRuleIgnoreAfterMaxFailures.java:70)
	at org.apache.lucene.util.TestRuleMarkFailure$1.evaluate(TestRuleMarkFailure.java:48)
	at com.carrotsearch.randomizedtesting.rules.StatementAdapter.evaluate(StatementAdapter.java:36)
	at com.carrotsearch.randomizedtesting.ThreadLeakControl$StatementRunner.run(ThreadLeakControl.java:358)
	at com.carrotsearch.randomizedtesting.ThreadLeakControl.forkTimeoutingTask(ThreadLeakControl.java:782)
	at com.carrotsearch.randomizedtesting.ThreadLeakControl$3.evaluate(ThreadLeakControl.java:442)
	at com.carrotsearch.randomizedtesting.RandomizedRunner.runSingleTest(RandomizedRunner.java:746)
	at com.carrotsearch.randomizedtesting.RandomizedRunner$3.evaluate(RandomizedRunner.java:648)
	at com.carrotsearch.randomizedtesting.RandomizedRunner$4.evaluate(RandomizedRunner.java:682)
	at com.carrotsearch.randomizedtesting.RandomizedRunner$5.evaluate(RandomizedRunner.java:693)
	at com.carrotsearch.randomizedtesting.rules.StatementAdapter.evaluate(StatementAdapter.java:36)
	at com.carrotsearch.randomizedtesting.rules.SystemPropertiesRestoreRule$1.evaluate(SystemPropertiesRestoreRule.java:53)
	at org.apache.lucene.util.AbstractBeforeAfterRule$1.evaluate(AbstractBeforeAfterRule.java:45)
	at org.apache.lucene.util.TestRuleStoreClassName$1.evaluate(TestRuleStoreClassName.java:42)
	at com.carrotsearch.randomizedtesting.rules.SystemPropertiesInvariantRule$1.evaluate(SystemPropertiesInvariantRule.java:55)
	at com.carrotsearch.randomizedtesting.rules.NoShadowingOrOverridesOnMethodsRule$1.evaluate(NoShadowingOrOverridesOnMethodsRule.java:39)
	at com.carrotsearch.randomizedtesting.rules.NoShadowingOrOverridesOnMethodsRule$1.evaluate(NoShadowingOrOverridesOnMethodsRule.java:39)
	at com.carrotsearch.randomizedtesting.rules.StatementAdapter.evaluate(StatementAdapter.java:36)
	at org.apache.lucene.util.TestRuleAssertionsRequired$1.evaluate(TestRuleAssertionsRequired.java:43)
	at org.apache.lucene.util.TestRuleMarkFailure$1.evaluate(TestRuleMarkFailure.java:48)
	at org.apache.lucene.util.TestRuleIgnoreAfterMaxFailures$1.evaluate(TestRuleIgnoreAfterMaxFailures.java:70)
	at org.apache.lucene.util.TestRuleIgnoreTestSuites$1.evaluate(TestRuleIgnoreTestSuites.java:55)
	at com.carrotsearch.randomizedtesting.rules.StatementAdapter.evaluate(StatementAdapter.java:36)
	at com.carrotsearch.randomizedtesting.ThreadLeakControl$StatementRunner.run(ThreadLeakControl.java:358)
	at java.lang.Thread.run(Thread.java:722)
Caused by: java.lang.RuntimeException: REQUEST FAILED: xpath=//*[@numFound='19']
	xml response was: <?xml version="1.0" encoding="UTF-8"?>
<response>
<lst name="responseHeader"><int name="status">0</int><int name="QTime">1</int><lst name="params"><str name="version">2.2</str><str name="qt">standard</str><str name="q">*:*</str><str name="rows">20</str><str name="start">0</str></lst></lst><result name="response" numFound="20" start="0"><doc><arr name="NAME_mult_s"><str>Jacob</str></arr><str name="id">1</str><arr name="COUNTRY_CODES_mult_s"><str>NZ</str></arr><date name="timestamp">2012-11-08T12:11:31.17Z</date></doc><doc><arr name="NAME_mult_s"><str>Ethan</str></arr><str name="id">2</str><arr name="COUNTRY_CODES_mult_s"><str>NU</str></arr><date name="timestamp">2012-11-08T12:11:31.17Z</date></doc><doc><arr name="NAME_mult_s"><str>Michael</str></arr><str name="id">3</str><arr name="COUNTRY_CODES_mult_s"><str>NR</str></arr><date name="timestamp">2012-11-08T12:11:31.17Z</date></doc><doc><arr name="NAME_mult_s"><str>Jayden</str></arr><str name="id">4</str><arr name="COUNTRY_CODES_mult_s"><str>NP</str></arr><date name="timestamp">2012-11-08T12:11:31.17Z</date></doc><doc><arr name="NAME_mult_s"><str>William</str></arr><str name="id">5</str><arr name="COUNTRY_CODES_mult_s"><str>NO</str></arr><date name="timestamp">2012-11-08T12:11:31.17Z</date></doc><doc><arr name="NAME_mult_s"><str>Alexander</str></arr><str name="id">6</str><arr name="COUNTRY_CODES_mult_s"><str>NL</str></arr><date name="timestamp">2012-11-08T12:11:31.17Z</date></doc><doc><arr name="NAME_mult_s"><str>Noah</str></arr><str name="id">7</str><arr name="COUNTRY_CODES_mult_s"><str>NI</str></arr><date name="timestamp">2012-11-08T12:11:31.17Z</date></doc><doc><arr name="NAME_mult_s"><str>Daniel</str></arr><str name="id">8</str><arr name="COUNTRY_CODES_mult_s"><str>NG</str></arr><date name="timestamp">2012-11-08T12:11:31.17Z</date></doc><doc><arr name="NAME_mult_s"><str>Aiden</str></arr><str name="id">9</str><arr name="COUNTRY_CODES_mult_s"><str>NF</str></arr><date name="timestamp">2012-11-08T12:11:31.17Z</date></doc><doc><arr name="NAME_mult_s"><str>Anthony</str></arr><str name="id">10</str><arr name="COUNTRY_CODES_mult_s"><str>NE</str></arr><date name="timestamp">2012-11-08T12:11:31.17Z</date></doc><doc><arr name="NAME_mult_s"><str>Emma</str></arr><str name="id">11</str><arr name="COUNTRY_CODES_mult_s"><str>NL</str></arr><date name="timestamp">2012-11-08T12:11:31.17Z</date></doc><doc><arr name="NAME_mult_s"><str>Grace</str></arr><str name="id">12</str><arr name="COUNTRY_CODES_mult_s"><str>NI</str></arr><date name="timestamp">2012-11-08T12:11:31.17Z</date></doc><doc><arr name="NAME_mult_s"><str>Hailey</str></arr><str name="id">13</str><arr name="COUNTRY_CODES_mult_s"><str>NG</str></arr><date name="timestamp">2012-11-08T12:11:31.17Z</date></doc><doc><arr name="NAME_mult_s"><str>Isabella</str></arr><str name="id">14</str><arr name="COUNTRY_CODES_mult_s"><str>NF</str></arr><date name="timestamp">2012-11-08T12:11:31.17Z</date></doc><doc><arr name="NAME_mult_s"><str>Lily</str></arr><str name="id">15</str><arr name="COUNTRY_CODES_mult_s"><str>NE</str></arr><date name="timestamp">2012-11-08T12:11:31.17Z</date></doc><doc><arr name="NAME_mult_s"><str>Madison</str></arr><str name="id">16</str><arr name="COUNTRY_CODES_mult_s"><str>NC</str></arr><date name="timestamp">2012-11-08T12:11:31.17Z</date></doc><doc><arr name="NAME_mult_s"><str>Mia</str></arr><str name="id">17</str><arr name="COUNTRY_CODES_mult_s"><str>NA</str></arr><date name="timestamp">2012-11-08T12:11:31.17Z</date></doc><doc><arr name="NAME_mult_s"><str>Natalie</str></arr><str name="id">18</str><arr name="COUNTRY_CODES_mult_s"><str>NZ</str></arr><date name="timestamp">2012-11-08T12:11:31.17Z</date></doc><doc><arr name="NAME_mult_s"><str>Olivia</str></arr><str name="id">19</str><arr name="COUNTRY_CODES_mult_s"><str>NU</str></arr><date name="timestamp">2012-11-08T12:11:31.17Z</date></doc><doc><arr name="NAME_mult_s"><str>Samantha</str></arr><str name="id">20</str><arr name="COUNTRY_CODES_mult_s"><str>NR</str></arr><date name="timestamp">2012-11-08T12:11:31.17Z</date></doc></result>
</response>

	request was:version=2.2&qt=standard&q=*:*&rows=20&start=0
	at org.apache.solr.SolrTestCaseJ4.assertQ(SolrTestCaseJ4.java:506)
	... 43 more


REGRESSION:  org.apache.solr.handler.dataimport.TestSqlEntityProcessorDelta.testWithComplexTransformer

Error Message:
Exception during query

Stack Trace:
java.lang.RuntimeException: Exception during query
	at __randomizedtesting.SeedInfo.seed([103A3F6EAC3C5255:7A304EE5C7CA5CE8]:0)
	at org.apache.solr.SolrTestCaseJ4.assertQ(SolrTestCaseJ4.java:513)
	at org.apache.solr.SolrTestCaseJ4.assertQ(SolrTestCaseJ4.java:480)
	at org.apache.solr.handler.dataimport.AbstractDIHJdbcTestCase.complexTransform(AbstractDIHJdbcTestCase.java:120)
	at org.apache.solr.handler.dataimport.TestSqlEntityProcessorDelta.testWithComplexTransformer(TestSqlEntityProcessorDelta.java:58)
	at sun.reflect.NativeMethodAccessorImpl.invoke0(Native Method)
	at sun.reflect.NativeMethodAccessorImpl.invoke(NativeMethodAccessorImpl.java:57)
	at sun.reflect.DelegatingMethodAccessorImpl.invoke(DelegatingMethodAccessorImpl.java:43)
	at java.lang.reflect.Method.invoke(Method.java:474)
	at com.carrotsearch.randomizedtesting.RandomizedRunner.invoke(RandomizedRunner.java:1559)
	at com.carrotsearch.randomizedtesting.RandomizedRunner.access$600(RandomizedRunner.java:79)
	at com.carrotsearch.randomizedtesting.RandomizedRunner$6.evaluate(RandomizedRunner.java:737)
	at com.carrotsearch.randomizedtesting.RandomizedRunner$7.evaluate(RandomizedRunner.java:773)
	at com.carrotsearch.randomizedtesting.RandomizedRunner$8.evaluate(RandomizedRunner.java:787)
	at com.carrotsearch.randomizedtesting.rules.SystemPropertiesRestoreRule$1.evaluate(SystemPropertiesRestoreRule.java:53)
	at org.apache.lucene.util.TestRuleSetupTeardownChained$1.evaluate(TestRuleSetupTeardownChained.java:50)
	at org.apache.lucene.util.TestRuleFieldCacheSanity$1.evaluate(TestRuleFieldCacheSanity.java:51)
	at org.apache.lucene.util.AbstractBeforeAfterRule$1.evaluate(AbstractBeforeAfterRule.java:45)
	at com.carrotsearch.randomizedtesting.rules.SystemPropertiesInvariantRule$1.evaluate(SystemPropertiesInvariantRule.java:55)
	at org.apache.lucene.util.TestRuleThreadAndTestName$1.evaluate(TestRuleThreadAndTestName.java:48)
	at org.apache.lucene.util.TestRuleIgnoreAfterMaxFailures$1.evaluate(TestRuleIgnoreAfterMaxFailures.java:70)
	at org.apache.lucene.util.TestRuleMarkFailure$1.evaluate(TestRuleMarkFailure.java:48)
	at com.carrotsearch.randomizedtesting.rules.StatementAdapter.evaluate(StatementAdapter.java:36)
	at com.carrotsearch.randomizedtesting.ThreadLeakControl$StatementRunner.run(ThreadLeakControl.java:358)
	at com.carrotsearch.randomizedtesting.ThreadLeakControl.forkTimeoutingTask(ThreadLeakControl.java:782)
	at com.carrotsearch.randomizedtesting.ThreadLeakControl$3.evaluate(ThreadLeakControl.java:442)
	at com.carrotsearch.randomizedtesting.RandomizedRunner.runSingleTest(RandomizedRunner.java:746)
	at com.carrotsearch.randomizedtesting.RandomizedRunner$3.evaluate(RandomizedRunner.java:648)
	at com.carrotsearch.randomizedtesting.RandomizedRunner$4.evaluate(RandomizedRunner.java:682)
	at com.carrotsearch.randomizedtesting.RandomizedRunner$5.evaluate(RandomizedRunner.java:693)
	at com.carrotsearch.randomizedtesting.rules.StatementAdapter.evaluate(StatementAdapter.java:36)
	at com.carrotsearch.randomizedtesting.rules.SystemPropertiesRestoreRule$1.evaluate(SystemPropertiesRestoreRule.java:53)
	at org.apache.lucene.util.AbstractBeforeAfterRule$1.evaluate(AbstractBeforeAfterRule.java:45)
	at org.apache.lucene.util.TestRuleStoreClassName$1.evaluate(TestRuleStoreClassName.java:42)
	at com.carrotsearch.randomizedtesting.rules.SystemPropertiesInvariantRule$1.evaluate(SystemPropertiesInvariantRule.java:55)
	at com.carrotsearch.randomizedtesting.rules.NoShadowingOrOverridesOnMethodsRule$1.evaluate(NoShadowingOrOverridesOnMethodsRule.java:39)
	at com.carrotsearch.randomizedtesting.rules.NoShadowingOrOverridesOnMethodsRule$1.evaluate(NoShadowingOrOverridesOnMethodsRule.java:39)
	at com.carrotsearch.randomizedtesting.rules.StatementAdapter.evaluate(StatementAdapter.java:36)
	at org.apache.lucene.util.TestRuleAssertionsRequired$1.evaluate(TestRuleAssertionsRequired.java:43)
	at org.apache.lucene.util.TestRuleMarkFailure$1.evaluate(TestRuleMarkFailure.java:48)
	at org.apache.lucene.util.TestRuleIgnoreAfterMaxFailures$1.evaluate(TestRuleIgnoreAfterMaxFailures.java:70)
	at org.apache.lucene.util.TestRuleIgnoreTestSuites$1.evaluate(TestRuleIgnoreTestSuites.java:55)
	at com.carrotsearch.randomizedtesting.rules.StatementAdapter.evaluate(StatementAdapter.java:36)
	at com.carrotsearch.randomizedtesting.ThreadLeakControl$StatementRunner.run(ThreadLeakControl.java:358)
	at java.lang.Thread.run(Thread.java:722)
Caused by: java.lang.RuntimeException: REQUEST FAILED: xpath=//*[@numFound='22']
	xml response was: <?xml version="1.0" encoding="UTF-8"?>
<response>
<lst name="responseHeader"><int name="status">0</int><int name="QTime">1</int><lst name="params"><str name="version">2.2</str><str name="qt">standard</str><str name="q">id:TripleThreat-1-*</str><str name="rows">20</str><str name="start">0</str></lst></lst><result name="response" numFound="20" start="0"><doc><arr name="NAME_mult_s"><str>Jacob</str><str>bocaJ</str></arr><arr name="COUNTRY_CODES_mult_s"><str>NZ</str><str>ZN</str></arr><str name="id">TripleThreat-1-1</str><date name="timestamp">2012-11-08T12:11:31.393Z</date></doc><doc><arr name="NAME_mult_s"><str>Ethan</str><str>nahtE</str></arr><arr name="COUNTRY_CODES_mult_s"><str>NU</str><str>UN</str></arr><str name="id">TripleThreat-1-2</str><date name="timestamp">2012-11-08T12:11:31.393Z</date></doc><doc><arr name="NAME_mult_s"><str>Michael</str><str>leahciM</str></arr><arr name="COUNTRY_CODES_mult_s"><str>NR</str><str>RN</str></arr><str name="id">TripleThreat-1-3</str><date name="timestamp">2012-11-08T12:11:31.393Z</date></doc><doc><arr name="NAME_mult_s"><str>Jayden</str><str>nedyaJ</str></arr><arr name="COUNTRY_CODES_mult_s"><str>NP</str><str>PN</str></arr><str name="id">TripleThreat-1-4</str><date name="timestamp">2012-11-08T12:11:31.393Z</date></doc><doc><arr name="NAME_mult_s"><str>William</str><str>mailliW</str></arr><arr name="COUNTRY_CODES_mult_s"><str>NO</str><str>ON</str></arr><str name="id">TripleThreat-1-5</str><date name="timestamp">2012-11-08T12:11:31.393Z</date></doc><doc><arr name="NAME_mult_s"><str>Alexander</str><str>rednaxelA</str></arr><arr name="COUNTRY_CODES_mult_s"><str>NL</str><str>LN</str></arr><str name="id">TripleThreat-1-6</str><date name="timestamp">2012-11-08T12:11:31.393Z</date></doc><doc><arr name="NAME_mult_s"><str>Noah</str><str>haoN</str></arr><arr name="COUNTRY_CODES_mult_s"><str>NI</str><str>IN</str></arr><str name="id">TripleThreat-1-7</str><date name="timestamp">2012-11-08T12:11:31.393Z</date></doc><doc><arr name="NAME_mult_s"><str>Daniel</str><str>leinaD</str></arr><arr name="COUNTRY_CODES_mult_s"><str>NG</str><str>GN</str></arr><str name="id">TripleThreat-1-8</str><date name="timestamp">2012-11-08T12:11:31.393Z</date></doc><doc><arr name="NAME_mult_s"><str>Aiden</str><str>nediA</str></arr><arr name="COUNTRY_CODES_mult_s"><str>NF</str><str>FN</str></arr><str name="id">TripleThreat-1-9</str><date name="timestamp">2012-11-08T12:11:31.393Z</date></doc><doc><arr name="NAME_mult_s"><str>Anthony</str><str>ynohtnA</str></arr><arr name="COUNTRY_CODES_mult_s"><str>NE</str><str>EN</str></arr><str name="id">TripleThreat-1-10</str><date name="timestamp">2012-11-08T12:11:31.393Z</date></doc><doc><arr name="NAME_mult_s"><str>Emma</str><str>ammE</str></arr><arr name="COUNTRY_CODES_mult_s"><str>NL</str><str>LN</str></arr><str name="id">TripleThreat-1-11</str><date name="timestamp">2012-11-08T12:11:31.393Z</date></doc><doc><arr name="NAME_mult_s"><str>Grace</str><str>ecarG</str></arr><arr name="COUNTRY_CODES_mult_s"><str>NI</str><str>IN</str></arr><str name="id">TripleThreat-1-12</str><date name="timestamp">2012-11-08T12:11:31.393Z</date></doc><doc><arr name="NAME_mult_s"><str>Hailey</str><str>yeliaH</str></arr><arr name="COUNTRY_CODES_mult_s"><str>NG</str><str>GN</str></arr><str name="id">TripleThreat-1-13</str><date name="timestamp">2012-11-08T12:11:31.393Z</date></doc><doc><arr name="NAME_mult_s"><str>Isabella</str><str>allebasI</str></arr><arr name="COUNTRY_CODES_mult_s"><str>NF</str><str>FN</str></arr><str name="id">TripleThreat-1-14</str><date name="timestamp">2012-11-08T12:11:31.393Z</date></doc><doc><arr name="NAME_mult_s"><str>Lily</str><str>yliL</str></arr><arr name="COUNTRY_CODES_mult_s"><str>NE</str><str>EN</str></arr><str name="id">TripleThreat-1-15</str><date name="timestamp">2012-11-08T12:11:31.393Z</date></doc><doc><arr name="NAME_mult_s"><str>Madison</str><str>nosidaM</str></arr><arr name="COUNTRY_CODES_mult_s"><str>NC</str><str>CN</str></arr><str name="id">TripleThreat-1-16</str><date name="timestamp">2012-11-08T12:11:31.393Z</date></doc><doc><arr name="NAME_mult_s"><str>Mia</str><str>aiM</str></arr><arr name="COUNTRY_CODES_mult_s"><str>NA</str><str>AN</str></arr><str name="id">TripleThreat-1-17</str><date name="timestamp">2012-11-08T12:11:31.393Z</date></doc><doc><arr name="NAME_mult_s"><str>Natalie</str><str>eilataN</str></arr><arr name="COUNTRY_CODES_mult_s"><str>NZ</str><str>ZN</str></arr><str name="id">TripleThreat-1-18</str><date name="timestamp">2012-11-08T12:11:31.393Z</date></doc><doc><arr name="NAME_mult_s"><str>Olivia</str><str>aivilO</str></arr><arr name="COUNTRY_CODES_mult_s"><str>NU</str><str>UN</str></arr><str name="id">TripleThreat-1-19</str><date name="timestamp">2012-11-08T12:11:31.393Z</date></doc><doc><arr name="NAME_mult_s"><str>Samantha</str><str>ahtnamaS</str></arr><arr name="COUNTRY_CODES_mult_s"><str>NR</str><str>RN</str></arr><str name="id">TripleThreat-1-20</str><date name="timestamp">2012-11-08T12:11:31.393Z</date></doc></result>
</response>

	request was:version=2.2&qt=standard&q=id:TripleThreat-1-*&rows=20&start=0
	at org.apache.solr.SolrTestCaseJ4.assertQ(SolrTestCaseJ4.java:506)
	... 43 more


REGRESSION:  org.apache.solr.handler.dataimport.TestSqlEntityProcessorDelta.testChildEntities

Error Message:
Exception during query

Stack Trace:
java.lang.RuntimeException: Exception during query
	at __randomizedtesting.SeedInfo.seed([103A3F6EAC3C5255:9F59D08A97B54FD6]:0)
	at org.apache.solr.SolrTestCaseJ4.assertQ(SolrTestCaseJ4.java:513)
	at org.apache.solr.SolrTestCaseJ4.assertQ(SolrTestCaseJ4.java:480)
	at org.apache.solr.handler.dataimport.TestSqlEntityProcessorDelta.validateChanges(TestSqlEntityProcessorDelta.java:99)
	at org.apache.solr.handler.dataimport.TestSqlEntityProcessorDelta.testChildEntities(TestSqlEntityProcessorDelta.java:67)
	at sun.reflect.NativeMethodAccessorImpl.invoke0(Native Method)
	at sun.reflect.NativeMethodAccessorImpl.invoke(NativeMethodAccessorImpl.java:57)
	at sun.reflect.DelegatingMethodAccessorImpl.invoke(DelegatingMethodAccessorImpl.java:43)
	at java.lang.reflect.Method.invoke(Method.java:474)
	at com.carrotsearch.randomizedtesting.RandomizedRunner.invoke(RandomizedRunner.java:1559)
	at com.carrotsearch.randomizedtesting.RandomizedRunner.access$600(RandomizedRunner.java:79)
	at com.carrotsearch.randomizedtesting.RandomizedRunner$6.evaluate(RandomizedRunner.java:737)
	at com.carrotsearch.randomizedtesting.RandomizedRunner$7.evaluate(RandomizedRunner.java:773)
	at com.carrotsearch.randomizedtesting.RandomizedRunner$8.evaluate(RandomizedRunner.java:787)
	at com.carrotsearch.randomizedtesting.rules.SystemPropertiesRestoreRule$1.evaluate(SystemPropertiesRestoreRule.java:53)
	at org.apache.lucene.util.TestRuleSetupTeardownChained$1.evaluate(TestRuleSetupTeardownChained.java:50)
	at org.apache.lucene.util.TestRuleFieldCacheSanity$1.evaluate(TestRuleFieldCacheSanity.java:51)
	at org.apache.lucene.util.AbstractBeforeAfterRule$1.evaluate(AbstractBeforeAfterRule.java:45)
	at com.carrotsearch.randomizedtesting.rules.SystemPropertiesInvariantRule$1.evaluate(SystemPropertiesInvariantRule.java:55)
	at org.apache.lucene.util.TestRuleThreadAndTestName$1.evaluate(TestRuleThreadAndTestName.java:48)
	at org.apache.lucene.util.TestRuleIgnoreAfterMaxFailures$1.evaluate(TestRuleIgnoreAfterMaxFailures.java:70)
	at org.apache.lucene.util.TestRuleMarkFailure$1.evaluate(TestRuleMarkFailure.java:48)
	at com.carrotsearch.randomizedtesting.rules.StatementAdapter.evaluate(StatementAdapter.java:36)
	at com.carrotsearch.randomizedtesting.ThreadLeakControl$StatementRunner.run(ThreadLeakControl.java:358)
	at com.carrotsearch.randomizedtesting.ThreadLeakControl.forkTimeoutingTask(ThreadLeakControl.java:782)
	at com.carrotsearch.randomizedtesting.ThreadLeakControl$3.evaluate(ThreadLeakControl.java:442)
	at com.carrotsearch.randomizedtesting.RandomizedRunner.runSingleTest(RandomizedRunner.java:746)
	at com.carrotsearch.randomizedtesting.RandomizedRunner$3.evaluate(RandomizedRunner.java:648)
	at com.carrotsearch.randomizedtesting.RandomizedRunner$4.evaluate(RandomizedRunner.java:682)
	at com.carrotsearch.randomizedtesting.RandomizedRunner$5.evaluate(RandomizedRunner.java:693)
	at com.carrotsearch.randomizedtesting.rules.StatementAdapter.evaluate(StatementAdapter.java:36)
	at com.carrotsearch.randomizedtesting.rules.SystemPropertiesRestoreRule$1.evaluate(SystemPropertiesRestoreRule.java:53)
	at org.apache.lucene.util.AbstractBeforeAfterRule$1.evaluate(AbstractBeforeAfterRule.java:45)
	at org.apache.lucene.util.TestRuleStoreClassName$1.evaluate(TestRuleStoreClassName.java:42)
	at com.carrotsearch.randomizedtesting.rules.SystemPropertiesInvariantRule$1.evaluate(SystemPropertiesInvariantRule.java:55)
	at com.carrotsearch.randomizedtesting.rules.NoShadowingOrOverridesOnMethodsRule$1.evaluate(NoShadowingOrOverridesOnMethodsRule.java:39)
	at com.carrotsearch.randomizedtesting.rules.NoShadowingOrOverridesOnMethodsRule$1.evaluate(NoShadowingOrOverridesOnMethodsRule.java:39)
	at com.carrotsearch.randomizedtesting.rules.StatementAdapter.evaluate(StatementAdapter.java:36)
	at org.apache.lucene.util.TestRuleAssertionsRequired$1.evaluate(TestRuleAssertionsRequired.java:43)
	at org.apache.lucene.util.TestRuleMarkFailure$1.evaluate(TestRuleMarkFailure.java:48)
	at org.apache.lucene.util.TestRuleIgnoreAfterMaxFailures$1.evaluate(TestRuleIgnoreAfterMaxFailures.java:70)
	at org.apache.lucene.util.TestRuleIgnoreTestSuites$1.evaluate(TestRuleIgnoreTestSuites.java:55)
	at com.carrotsearch.randomizedtesting.rules.StatementAdapter.evaluate(StatementAdapter.java:36)
	at com.carrotsearch.randomizedtesting.ThreadLeakControl$StatementRunner.run(ThreadLeakControl.java:358)
	at java.lang.Thread.run(Thread.java:722)
Caused by: java.lang.RuntimeException: REQUEST FAILED: xpath=substring(//doc/str[@name='COUNTRY_NAME_s'], 1, 8)='MODIFIED'
	xml response was: <?xml version="1.0" encoding="UTF-8"?>
<response>
<lst name="responseHeader"><int name="status">0</int><int name="QTime">1</int><lst name="params"><str name="version">2.2</str><str name="qt">standard</str><str name="q">COUNTRY_CODE_s:NE</str><str name="rows">20</str><str name="start">0</str></lst></lst><result name="response" numFound="2" start="0"><doc><arr name="NAME_mult_s"><str>Anthony</str></arr><str name="id">10</str><arr name="COUNTRY_CODES_mult_s"><str>NE</str></arr><str name="COUNTRY_NAME_s">Niger</str><str name="COUNTRY_CODE_s">NE</str><date name="timestamp">2012-11-08T12:11:31.687Z</date></doc><doc><arr name="NAME_mult_s"><str>Lily</str></arr><str name="id">15</str><arr name="COUNTRY_CODES_mult_s"><str>NE</str></arr><str name="COUNTRY_NAME_s">Niger</str><str name="COUNTRY_CODE_s">NE</str><date name="timestamp">2012-11-08T12:11:31.687Z</date></doc></result>
</response>

	request was:version=2.2&qt=standard&q=COUNTRY_CODE_s:NE&rows=20&start=0
	at org.apache.solr.SolrTestCaseJ4.assertQ(SolrTestCaseJ4.java:506)
	... 43 more


REGRESSION:  org.apache.solr.handler.dataimport.TestSqlEntityProcessorDelta.testWithSimpleTransformer

Error Message:
Exception during query

Stack Trace:
java.lang.RuntimeException: Exception during query
	at __randomizedtesting.SeedInfo.seed([103A3F6EAC3C5255:7F7E178476EA3E58]:0)
	at org.apache.solr.SolrTestCaseJ4.assertQ(SolrTestCaseJ4.java:513)
	at org.apache.solr.SolrTestCaseJ4.assertQ(SolrTestCaseJ4.java:480)
	at org.apache.solr.handler.dataimport.AbstractDIHJdbcTestCase.simpleTransform(AbstractDIHJdbcTestCase.java:108)
	at org.apache.solr.handler.dataimport.TestSqlEntityProcessorDelta.testWithSimpleTransformer(TestSqlEntityProcessorDelta.java:51)
	at sun.reflect.NativeMethodAccessorImpl.invoke0(Native Method)
	at sun.reflect.NativeMethodAccessorImpl.invoke(NativeMethodAccessorImpl.java:57)
	at sun.reflect.DelegatingMethodAccessorImpl.invoke(DelegatingMethodAccessorImpl.java:43)
	at java.lang.reflect.Method.invoke(Method.java:474)
	at com.carrotsearch.randomizedtesting.RandomizedRunner.invoke(RandomizedRunner.java:1559)
	at com.carrotsearch.randomizedtesting.RandomizedRunner.access$600(RandomizedRunner.java:79)
	at com.carrotsearch.randomizedtesting.RandomizedRunner$6.evaluate(RandomizedRunner.java:737)
	at com.carrotsearch.randomizedtesting.RandomizedRunner$7.evaluate(RandomizedRunner.java:773)
	at com.carrotsearch.randomizedtesting.RandomizedRunner$8.evaluate(RandomizedRunner.java:787)
	at com.carrotsearch.randomizedtesting.rules.SystemPropertiesRestoreRule$1.evaluate(SystemPropertiesRestoreRule.java:53)
	at org.apache.lucene.util.TestRuleSetupTeardownChained$1.evaluate(TestRuleSetupTeardownChained.java:50)
	at org.apache.lucene.util.TestRuleFieldCacheSanity$1.evaluate(TestRuleFieldCacheSanity.java:51)
	at org.apache.lucene.util.AbstractBeforeAfterRule$1.evaluate(AbstractBeforeAfterRule.java:45)
	at com.carrotsearch.randomizedtesting.rules.SystemPropertiesInvariantRule$1.evaluate(SystemPropertiesInvariantRule.java:55)
	at org.apache.lucene.util.TestRuleThreadAndTestName$1.evaluate(TestRuleThreadAndTestName.java:48)
	at org.apache.lucene.util.TestRuleIgnoreAfterMaxFailures$1.evaluate(TestRuleIgnoreAfterMaxFailures.java:70)
	at org.apache.lucene.util.TestRuleMarkFailure$1.evaluate(TestRuleMarkFailure.java:48)
	at com.carrotsearch.randomizedtesting.rules.StatementAdapter.evaluate(StatementAdapter.java:36)
	at com.carrotsearch.randomizedtesting.ThreadLeakControl$StatementRunner.run(ThreadLeakControl.java:358)
	at com.carrotsearch.randomizedtesting.ThreadLeakControl.forkTimeoutingTask(ThreadLeakControl.java:782)
	at com.carrotsearch.randomizedtesting.ThreadLeakControl$3.evaluate(ThreadLeakControl.java:442)
	at com.carrotsearch.randomizedtesting.RandomizedRunner.runSingleTest(RandomizedRunner.java:746)
	at com.carrotsearch.randomizedtesting.RandomizedRunner$3.evaluate(RandomizedRunner.java:648)
	at com.carrotsearch.randomizedtesting.RandomizedRunner$4.evaluate(RandomizedRunner.java:682)
	at com.carrotsearch.randomizedtesting.RandomizedRunner$5.evaluate(RandomizedRunner.java:693)
	at com.carrotsearch.randomizedtesting.rules.StatementAdapter.evaluate(StatementAdapter.java:36)
	at com.carrotsearch.randomizedtesting.rules.SystemPropertiesRestoreRule$1.evaluate(SystemPropertiesRestoreRule.java:53)
	at org.apache.lucene.util.AbstractBeforeAfterRule$1.evaluate(AbstractBeforeAfterRule.java:45)
	at org.apache.lucene.util.TestRuleStoreClassName$1.evaluate(TestRuleStoreClassName.java:42)
	at com.carrotsearch.randomizedtesting.rules.SystemPropertiesInvariantRule$1.evaluate(SystemPropertiesInvariantRule.java:55)
	at com.carrotsearch.randomizedtesting.rules.NoShadowingOrOverridesOnMethodsRule$1.evaluate(NoShadowingOrOverridesOnMethodsRule.java:39)
	at com.carrotsearch.randomizedtesting.rules.NoShadowingOrOverridesOnMethodsRule$1.evaluate(NoShadowingOrOverridesOnMethodsRule.java:39)
	at com.carrotsearch.randomizedtesting.rules.StatementAdapter.evaluate(StatementAdapter.java:36)
	at org.apache.lucene.util.TestRuleAssertionsRequired$1.evaluate(TestRuleAssertionsRequired.java:43)
	at org.apache.lucene.util.TestRuleMarkFailure$1.evaluate(TestRuleMarkFailure.java:48)
	at org.apache.lucene.util.TestRuleIgnoreAfterMaxFailures$1.evaluate(TestRuleIgnoreAfterMaxFailures.java:70)
	at org.apache.lucene.util.TestRuleIgnoreTestSuites$1.evaluate(TestRuleIgnoreTestSuites.java:55)
	at com.carrotsearch.randomizedtesting.rules.StatementAdapter.evaluate(StatementAdapter.java:36)
	at com.carrotsearch.randomizedtesting.ThreadLeakControl$StatementRunner.run(ThreadLeakControl.java:358)
	at java.lang.Thread.run(Thread.java:722)
Caused by: java.lang.RuntimeException: REQUEST FAILED: xpath=//*[@numFound='16']
	xml response was: <?xml version="1.0" encoding="UTF-8"?>
<response>
<lst name="responseHeader"><int name="status">0</int><int name="QTime">1</int><lst name="params"><str name="version">2.2</str><str name="qt">standard</str><str name="q">AddAColumn_s:Added</str><str name="rows">20</str><str name="start">0</str></lst></lst><result name="response" numFound="20" start="0"><doc><arr name="NAME_mult_s"><str>Jacob</str></arr><str name="id">1</str><arr name="COUNTRY_CODES_mult_s"><str>NZ</str></arr><str name="AddAColumn_s">Added</str><date name="timestamp">2012-11-08T12:11:31.821Z</date></doc><doc><arr name="NAME_mult_s"><str>Ethan</str></arr><str name="id">2</str><arr name="COUNTRY_CODES_mult_s"><str>NU</str></arr><str name="AddAColumn_s">Added</str><date name="timestamp">2012-11-08T12:11:31.821Z</date></doc><doc><arr name="NAME_mult_s"><str>Michael</str></arr><str name="id">3</str><arr name="COUNTRY_CODES_mult_s"><str>NR</str></arr><str name="AddAColumn_s">Added</str><date name="timestamp">2012-11-08T12:11:31.821Z</date></doc><doc><arr name="NAME_mult_s"><str>Jayden</str></arr><str name="id">4</str><arr name="COUNTRY_CODES_mult_s"><str>NP</str></arr><str name="AddAColumn_s">Added</str><date name="timestamp">2012-11-08T12:11:31.821Z</date></doc><doc><arr name="NAME_mult_s"><str>William</str></arr><str name="id">5</str><arr name="COUNTRY_CODES_mult_s"><str>NO</str></arr><str name="AddAColumn_s">Added</str><date name="timestamp">2012-11-08T12:11:31.821Z</date></doc><doc><arr name="NAME_mult_s"><str>Alexander</str></arr><str name="id">6</str><arr name="COUNTRY_CODES_mult_s"><str>NL</str></arr><str name="AddAColumn_s">Added</str><date name="timestamp">2012-11-08T12:11:31.821Z</date></doc><doc><arr name="NAME_mult_s"><str>Noah</str></arr><str name="id">7</str><arr name="COUNTRY_CODES_mult_s"><str>NI</str></arr><str name="AddAColumn_s">Added</str><date name="timestamp">2012-11-08T12:11:31.821Z</date></doc><doc><arr name="NAME_mult_s"><str>Daniel</str></arr><str name="id">8</str><arr name="COUNTRY_CODES_mult_s"><str>NG</str></arr><str name="AddAColumn_s">Added</str><date name="timestamp">2012-11-08T12:11:31.821Z</date></doc><doc><arr name="NAME_mult_s"><str>Aiden</str></arr><str name="id">9</str><arr name="COUNTRY_CODES_mult_s"><str>NF</str></arr><str name="AddAColumn_s">Added</str><date name="timestamp">2012-11-08T12:11:31.821Z</date></doc><doc><arr name="NAME_mult_s"><str>Anthony</str></arr><str name="id">10</str><arr name="COUNTRY_CODES_mult_s"><str>NE</str></arr><str name="AddAColumn_s">Added</str><date name="timestamp">2012-11-08T12:11:31.821Z</date></doc><doc><arr name="NAME_mult_s"><str>Emma</str></arr><str name="id">11</str><arr name="COUNTRY_CODES_mult_s"><str>NL</str></arr><str name="AddAColumn_s">Added</str><date name="timestamp">2012-11-08T12:11:31.821Z</date></doc><doc><arr name="NAME_mult_s"><str>Grace</str></arr><str name="id">12</str><arr name="COUNTRY_CODES_mult_s"><str>NI</str></arr><str name="AddAColumn_s">Added</str><date name="timestamp">2012-11-08T12:11:31.821Z</date></doc><doc><arr name="NAME_mult_s"><str>Hailey</str></arr><str name="id">13</str><arr name="COUNTRY_CODES_mult_s"><str>NG</str></arr><str name="AddAColumn_s">Added</str><date name="timestamp">2012-11-08T12:11:31.821Z</date></doc><doc><arr name="NAME_mult_s"><str>Isabella</str></arr><str name="id">14</str><arr name="COUNTRY_CODES_mult_s"><str>NF</str></arr><str name="AddAColumn_s">Added</str><date name="timestamp">2012-11-08T12:11:31.821Z</date></doc><doc><arr name="NAME_mult_s"><str>Lily</str></arr><str name="id">15</str><arr name="COUNTRY_CODES_mult_s"><str>NE</str></arr><str name="AddAColumn_s">Added</str><date name="timestamp">2012-11-08T12:11:31.821Z</date></doc><doc><arr name="NAME_mult_s"><str>Madison</str></arr><str name="id">16</str><arr name="COUNTRY_CODES_mult_s"><str>NC</str></arr><str name="AddAColumn_s">Added</str><date name="timestamp">2012-11-08T12:11:31.821Z</date></doc><doc><arr name="NAME_mult_s"><str>Mia</str></arr><str name="id">17</str><arr name="COUNTRY_CODES_mult_s"><str>NA</str></arr><str name="AddAColumn_s">Added</str><date name="timestamp">2012-11-08T12:11:31.821Z</date></doc><doc><arr name="NAME_mult_s"><str>Natalie</str></arr><str name="id">18</str><arr name="COUNTRY_CODES_mult_s"><str>NZ</str></arr><str name="AddAColumn_s">Added</str><date name="timestamp">2012-11-08T12:11:31.821Z</date></doc><doc><arr name="NAME_mult_s"><str>Olivia</str></arr><str name="id">19</str><arr name="COUNTRY_CODES_mult_s"><str>NU</str></arr><str name="AddAColumn_s">Added</str><date name="timestamp">2012-11-08T12:11:31.821Z</date></doc><doc><arr name="NAME_mult_s"><str>Samantha</str></arr><str name="id">20</str><arr name="COUNTRY_CODES_mult_s"><str>NR</str></arr><str name="AddAColumn_s">Added</str><date name="timestamp">2012-11-08T12:11:31.821Z</date></doc></result>
</response>

	request was:version=2.2&qt=standard&q=AddAColumn_s:Added&rows=20&start=0
	at org.apache.solr.SolrTestCaseJ4.assertQ(SolrTestCaseJ4.java:506)
	... 43 more




Build Log:
[...truncated 11359 lines...]
[junit4:junit4] Suite: org.apache.solr.handler.dataimport.TestSqlEntityProcessorDelta
[junit4:junit4]   2> 6 T46 oas.SolrTestCaseJ4.initCore ####initCore
[junit4:junit4]   2> Creating dataDir: /mnt/ssd/jenkins/workspace/Lucene-Solr-4.x-Linux/solr/build/contrib/solr-dataimporthandler/test/J1/./solrtest-TestSqlEntityProcessorDelta-1352376690725
[junit4:junit4]   2> 8 T46 oasc.SolrResourceLoader.<init> new SolrResourceLoader for directory: '/mnt/ssd/jenkins/workspace/Lucene-Solr-4.x-Linux/solr/build/contrib/solr-dataimporthandler/test-files/dih/solr/collection1/'
[junit4:junit4]   2> 47 T46 oasc.SolrConfig.<init> Using Lucene MatchVersion: LUCENE_41
[junit4:junit4]   2> 87 T46 oasc.SolrConfig.<init> Loaded SolrConfig: dataimport-solrconfig.xml
[junit4:junit4]   2> 88 T46 oass.IndexSchema.readSchema Reading Solr Schema
[junit4:junit4]   2> 95 T46 oass.IndexSchema.readSchema Schema name=dih_test
[junit4:junit4]   2> 141 T46 oass.IndexSchema.readSchema default search field in schema is desc
[junit4:junit4]   2> 142 T46 oass.IndexSchema.readSchema query parser default operator is OR
[junit4:junit4]   2> 143 T46 oass.IndexSchema.readSchema unique key field: id
[junit4:junit4]   2> 145 T46 oasc.SolrResourceLoader.locateSolrHome JNDI not configured for solr (NoInitialContextEx)
[junit4:junit4]   2> 145 T46 oasc.SolrResourceLoader.locateSolrHome using system property solr.solr.home: /mnt/ssd/jenkins/workspace/Lucene-Solr-4.x-Linux/solr/build/contrib/solr-dataimporthandler/test-files/dih/solr
[junit4:junit4]   2> 146 T46 oasc.SolrResourceLoader.<init> new SolrResourceLoader for directory: '/mnt/ssd/jenkins/workspace/Lucene-Solr-4.x-Linux/solr/build/contrib/solr-dataimporthandler/test-files/dih/solr/'
[junit4:junit4]   2> 153 T46 oasc.CoreContainer.<init> New CoreContainer 1009800546
[junit4:junit4]   2> 154 T46 oasc.SolrCore.<init> [collection1] Opening new SolrCore at /mnt/ssd/jenkins/workspace/Lucene-Solr-4.x-Linux/solr/build/contrib/solr-dataimporthandler/test-files/dih/solr/collection1/, dataDir=/mnt/ssd/jenkins/workspace/Lucene-Solr-4.x-Linux/solr/build/contrib/solr-dataimporthandler/test/J1/./solrtest-TestSqlEntityProcessorDelta-1352376690725/
[junit4:junit4]   2> 154 T46 oasc.SolrCore.<init> JMX monitoring not detected for core: collection1
[junit4:junit4]   2> 154 T46 oasc.SolrCore.initListeners [collection1] Added SolrEventListener for newSearcher: org.apache.solr.core.QuerySenderListener{queries=[{q=solr,start=0,rows=10}, {q=rocks,start=0,rows=10}, {q=static newSearcher warming query from solrconfig.xml}]}
[junit4:junit4]   2> 155 T46 oasc.SolrCore.initListeners [collection1] Added SolrEventListener for firstSearcher: org.apache.solr.core.QuerySenderListener{queries=[]}
[junit4:junit4]   2> 155 T46 oasc.SolrCore.getNewIndexDir New index directory detected: old=null new=/mnt/ssd/jenkins/workspace/Lucene-Solr-4.x-Linux/solr/build/contrib/solr-dataimporthandler/test/J1/./solrtest-TestSqlEntityProcessorDelta-1352376690725/index/
[junit4:junit4]   2> 156 T46 oasc.SolrCore.initIndex WARNING [collection1] Solr index directory '/mnt/ssd/jenkins/workspace/Lucene-Solr-4.x-Linux/solr/build/contrib/solr-dataimporthandler/test/J1/./solrtest-TestSqlEntityProcessorDelta-1352376690725/index' doesn't exist. Creating new index...
[junit4:junit4]   2> 156 T46 oasc.CachingDirectoryFactory.get return new directory for /mnt/ssd/jenkins/workspace/Lucene-Solr-4.x-Linux/solr/build/contrib/solr-dataimporthandler/test/J1/./solrtest-TestSqlEntityProcessorDelta-1352376690725/index forceNew:false
[junit4:junit4]   2> 159 T46 oasc.SolrDeletionPolicy.onCommit SolrDeletionPolicy.onCommit: commits:num=1
[junit4:junit4]   2> 		commit{dir=MockDirWrapper(org.apache.lucene.store.RAMDirectory@935b3cd lockFactory=org.apache.lucene.store.NativeFSLockFactory@74ded67c),segFN=segments_1,generation=1,filenames=[segments_1]
[junit4:junit4]   2> 159 T46 oasc.SolrDeletionPolicy.updateCommits newest commit = 1
[junit4:junit4]   2> 161 T46 oasup.UpdateRequestProcessorChain.init inserting DistributedUpdateProcessorFactory into updateRequestProcessorChain "" (default)
[junit4:junit4]   2> 161 T46 oasc.RequestHandlers.initHandlersFromConfig created standard: solr.StandardRequestHandler
[junit4:junit4]   2> 161 T46 oasc.RequestHandlers.initHandlersFromConfig created /dataimport: org.apache.solr.handler.dataimport.DataImportHandler
[junit4:junit4]   2> 162 T46 oasc.RequestHandlers.initHandlersFromConfig created /search: org.apache.solr.handler.component.SearchHandler
[junit4:junit4]   2> 162 T46 oasc.RequestHandlers.initHandlersFromConfig created /update: solr.UpdateRequestHandler
[junit4:junit4]   2> 165 T46 oashl.XMLLoader.init xsltCacheLifetimeSeconds=60
[junit4:junit4]   2> 168 T46 oass.SolrIndexSearcher.<init> Opening Searcher@3d162405 main
[junit4:junit4]   2> 168 T46 oass.SolrIndexSearcher.getIndexDir WARNING WARNING: Directory impl does not support setting indexDir: org.apache.lucene.store.MockDirectoryWrapper
[junit4:junit4]   2> 169 T46 oasu.CommitTracker.<init> Hard AutoCommit: disabled
[junit4:junit4]   2> 169 T46 oasu.CommitTracker.<init> Soft AutoCommit: disabled
[junit4:junit4]   2> 169 T46 oashc.HttpShardHandlerFactory.getParameter Setting socketTimeout to: 0
[junit4:junit4]   2> 169 T46 oashc.HttpShardHandlerFactory.getParameter Setting urlScheme to: http://
[junit4:junit4]   2> 170 T46 oashc.HttpShardHandlerFactory.getParameter Setting connTimeout to: 0
[junit4:junit4]   2> 170 T46 oashc.HttpShardHandlerFactory.getParameter Setting maxConnectionsPerHost to: 20
[junit4:junit4]   2> 170 T46 oashc.HttpShardHandlerFactory.getParameter Setting corePoolSize to: 0
[junit4:junit4]   2> 170 T46 oashc.HttpShardHandlerFactory.getParameter Setting maximumPoolSize to: 2147483647
[junit4:junit4]   2> 171 T46 oashc.HttpShardHandlerFactory.getParameter Setting maxThreadIdleTime to: 5
[junit4:junit4]   2> 171 T46 oashc.HttpShardHandlerFactory.getParameter Setting sizeOfQueue to: -1
[junit4:junit4]   2> 171 T46 oashc.HttpShardHandlerFactory.getParameter Setting fairnessPolicy to: false
[junit4:junit4]   2> 171 T46 oascsi.HttpClientUtil.createClient Creating new http client, config:maxConnectionsPerHost=20&maxConnections=10000&socketTimeout=0&connTimeout=0&retry=false
[junit4:junit4]   2> 176 T46 oasc.CoreContainer.register registering core: collection1
[junit4:junit4]   2> 177 T47 oasc.QuerySenderListener.newSearcher QuerySenderListener sending requests to Searcher@3d162405 main{StandardDirectoryReader(segments_1:1)}
[junit4:junit4]   2> 177 T46 oas.SolrTestCaseJ4.initCore ####initCore end
[junit4:junit4]   2> 178 T47 oasc.QuerySenderListener.newSearcher QuerySenderListener done.
[junit4:junit4]   2> 179 T47 oasc.SolrCore.registerSearcher [collection1] Registered new searcher Searcher@3d162405 main{StandardDirectoryReader(segments_1:1)}
[junit4:junit4]   2> 181 T46 oas.SolrTestCaseJ4.setUp ###Starting testSingleEntity
[junit4:junit4]   2> ASYNC  NEW_CORE C2 name=collection1 org.apache.solr.core.SolrCore@7745e872
[junit4:junit4]   2> 219 T46 C2 oasu.DirectUpdateHandler2.deleteAll [collection1] REMOVING ALL DOCUMENTS FROM INDEX
[junit4:junit4]   2> 222 T46 C2 oasc.SolrDeletionPolicy.onInit SolrDeletionPolicy.onInit: commits:num=1
[junit4:junit4]   2> 		commit{dir=MockDirWrapper(org.apache.lucene.store.RAMDirectory@935b3cd lockFactory=org.apache.lucene.store.NativeFSLockFactory@74ded67c),segFN=segments_1,generation=1,filenames=[segments_1]
[junit4:junit4]   2> 222 T46 C2 oasc.SolrDeletionPolicy.updateCommits newest commit = 1
[junit4:junit4]   2> 223 T46 C2 UPDATE [collection1] webapp=null path=null params={} {deleteByQuery=*:*} 0 15
[junit4:junit4]   2> 237 T46 C2 oasu.DirectUpdateHandler2.commit start commit{flags=0,_version_=0,optimize=false,openSearcher=true,waitSearcher=true,expungeDeletes=false,softCommit=false}
[junit4:junit4]   2> 238 T46 C2 oasc.SolrDeletionPolicy.onCommit SolrDeletionPolicy.onCommit: commits:num=2
[junit4:junit4]   2> 		commit{dir=MockDirWrapper(org.apache.lucene.store.RAMDirectory@935b3cd lockFactory=org.apache.lucene.store.NativeFSLockFactory@74ded67c),segFN=segments_1,generation=1,filenames=[segments_1]
[junit4:junit4]   2> 		commit{dir=MockDirWrapper(org.apache.lucene.store.RAMDirectory@935b3cd lockFactory=org.apache.lucene.store.NativeFSLockFactory@74ded67c),segFN=segments_2,generation=2,filenames=[segments_2]
[junit4:junit4]   2> 238 T46 C2 oasc.SolrDeletionPolicy.updateCommits newest commit = 2
[junit4:junit4]   2> 239 T46 C2 oass.SolrIndexSearcher.<init> Opening Searcher@518677ee main
[junit4:junit4]   2> 240 T46 C2 oass.SolrIndexSearcher.getIndexDir WARNING WARNING: Directory impl does not support setting indexDir: org.apache.lucene.store.MockDirectoryWrapper
[junit4:junit4]   2> 241 T46 C2 oasu.DirectUpdateHandler2.commit end_commit_flush
[junit4:junit4]   2> 241 T47 oasc.QuerySenderListener.newSearcher QuerySenderListener sending requests to Searcher@518677ee main{StandardDirectoryReader(segments_2:2)}
[junit4:junit4]   2> 242 T47 C2 REQ [collection1] webapp=null path=null params={distrib=false&q=solr&event=newSearcher&rows=10&start=0} hits=0 status=0 QTime=1 
[junit4:junit4]   2> 242 T47 C2 REQ [collection1] webapp=null path=null params={distrib=false&q=rocks&event=newSearcher&rows=10&start=0} hits=0 status=0 QTime=0 
[junit4:junit4]   2> 243 T47 C2 REQ [collection1] webapp=null path=null params={distrib=false&q=static+newSearcher+warming+query+from+solrconfig.xml&event=newSearcher} hits=0 status=0 QTime=1 
[junit4:junit4]   2> 243 T47 oasc.QuerySenderListener.newSearcher QuerySenderListener done.
[junit4:junit4]   2> 244 T47 oasc.SolrCore.registerSearcher [collection1] Registered new searcher Searcher@518677ee main{StandardDirectoryReader(segments_2:2)}
[junit4:junit4]   2> 244 T46 C2 UPDATE [collection1] webapp=null path=null params={} {commit=} 0 7
[junit4:junit4]   2> 454 T46 C2 oashdc.ConfigParseUtil.verifyWithSchema id is a required field in SolrSchema . But not found in DataConfig
[junit4:junit4]   2> 455 T46 C2 oashd.DataImporter.loadDataConfig Data Configuration loaded successfully
[junit4:junit4]   2> 455 T46 C2 oashd.DataImporter.doFullImport Starting Full Import
[junit4:junit4]   2> 455 T46 C2 oashd.SimplePropertiesWriter.readIndexerProperties WARNING Unable to read: dataimport.properties
[junit4:junit4]   2> 468 T46 C2 oasu.DirectUpdateHandler2.deleteAll [collection1] REMOVING ALL DOCUMENTS FROM INDEX
[junit4:junit4]   2> 472 T46 C2 oashd.JdbcDataSource$1.call Creating a connection for entity People with URL: jdbc:hsqldb:mem:.
[junit4:junit4]   2> 472 T46 C2 oashd.JdbcDataSource$1.call Time taken for getConnection(): 0
[junit4:junit4]   2> 504 T46 C2 oashd.DocBuilder.finish Import completed successfully
[junit4:junit4]   2> 504 T46 C2 oasu.DirectUpdateHandler2.commit start commit{flags=0,_version_=0,optimize=false,openSearcher=true,waitSearcher=true,expungeDeletes=false,softCommit=false}
[junit4:junit4]   2> 525 T46 C2 oasc.SolrDeletionPolicy.onCommit SolrDeletionPolicy.onCommit: commits:num=2
[junit4:junit4]   2> 		commit{dir=MockDirWrapper(org.apache.lucene.store.RAMDirectory@935b3cd lockFactory=org.apache.lucene.store.NativeFSLockFactory@74ded67c),segFN=segments_2,generation=2,filenames=[segments_2]
[junit4:junit4]   2> 		commit{dir=MockDirWrapper(org.apache.lucene.store.RAMDirectory@935b3cd lockFactory=org.apache.lucene.store.NativeFSLockFactory@74ded67c),segFN=segments_3,generation=3,filenames=[_0_Lucene40_0.tip, segments_3, _0.fdt, _0.fdx, _0.si, _0.fnm, _0_Lucene40_0.frq, _0_Lucene40_0.tim]
[junit4:junit4]   2> 526 T46 C2 oasc.SolrDeletionPolicy.updateCommits newest commit = 3
[junit4:junit4]   2> 528 T46 C2 oass.SolrIndexSearcher.<init> Opening Searcher@79d0decf main
[junit4:junit4]   2> 529 T46 C2 oass.SolrIndexSearcher.getIndexDir WARNING WARNING: Directory impl does not support setting indexDir: org.apache.lucene.store.MockDirectoryWrapper
[junit4:junit4]   2> 529 T46 C2 oasu.DirectUpdateHandler2.commit end_commit_flush
[junit4:junit4]   2> 530 T47 oasc.QuerySenderListener.newSearcher QuerySenderListener sending requests to Searcher@79d0decf main{StandardDirectoryReader(segments_3:5 _0(4.1):C20)}
[junit4:junit4]   2> 530 T47 C2 REQ [collection1] webapp=null path=null params={distrib=false&q=solr&event=newSearcher&rows=10&start=0} hits=0 status=0 QTime=0 
[junit4:junit4]   2> 531 T47 C2 REQ [collection1] webapp=null path=null params={distrib=false&q=rocks&event=newSearcher&rows=10&start=0} hits=0 status=0 QTime=1 
[junit4:junit4]   2> 531 T47 C2 REQ [collection1] webapp=null path=null params={distrib=false&q=static+newSearcher+warming+query+from+solrconfig.xml&event=newSearcher} hits=0 status=0 QTime=0 
[junit4:junit4]   2> 532 T47 oasc.QuerySenderListener.newSearcher QuerySenderListener done.
[junit4:junit4]   2> 532 T47 oasc.SolrCore.registerSearcher [collection1] Registered new searcher Searcher@79d0decf main{StandardDirectoryReader(segments_3:5 _0(4.1):C20)}
[junit4:junit4]   2> 533 T46 C2 oashd.SimplePropertiesWriter.readIndexerProperties WARNING Unable to read: dataimport.properties
[junit4:junit4]   2> 534 T46 C2 oashd.SimplePropertiesWriter.persist Wrote last indexed time to dataimport.properties
[junit4:junit4]   2> 534 T46 C2 oashd.DocBuilder.execute Time taken = 0:0:0.78
[junit4:junit4]   2> 534 T46 C2 UPDATE [collection1] webapp=null path=null params={commit=true&clean=true&dataConfig=<dataConfig>+%0a<dataSource+name%3D"hsqldb"+driver%3D"org.hsqldb.jdbcDriver"+url%3D"jdbc:hsqldb:mem:."+/>+%0a<document+name%3D"TestSqlEntityProcessor">+%0a<entity+name%3D"People"+pk%3D"ID"+processor%3D"SqlEntityProcessor"+dataSource%3D"hsqldb"+query%3D"SELECT+ID,+NAME,+COUNTRY_CODE+FROM+PEOPLE+WHERE+DELETED+!%3D+'Y'+"+deletedPkQuery%3D"SELECT+ID+FROM+PEOPLE+WHERE+DELETED%3D'Y'+AND+last_modified+%26gt;%3D'${dih.last_index_time}'+"+deltaImportQuery%3D"SELECT+ID,+NAME,+COUNTRY_CODE+FROM+PEOPLE+where+ID%3D${dih.delta.ID}+"+deltaQuery%3D"SELECT+ID+FROM+PEOPLE+WHERE+DELETED!%3D'Y'+AND+last_modified+%26gt;%3D'${dih.last_index_time}'+UNION+DISTINCT+SELECT+ID+FROM+PEOPLE+WHERE+DELETED!%3D'Y'+AND+COUNTRY_CODE+IN+(SELECT+CODE+FROM+COUNTRIES+WHERE+last_modified+%26gt;%3D'${dih.last_index_time}')+"+>+%0a<field+column%3D"NAME"+name%3D"NAME_mult_s"+/>+%0a<field+column%3D"COUNTRY_CODE"+name%3D"COUNTRY_CODES_mult_s"+/>+%0a</entity>+%0a</document>+%0a</dataConfig>+%0a&command=full-import&indent=true&synchronous=true} {deleteByQuery=*:*,add=[1, 2, 3, 4, 5, 6, 7, 8, 9, 10, ... (20 adds)],commit=} 0 83
[junit4:junit4]   2> 539 T46 C2 REQ [collection1] webapp=null path=null params={version=2.2&qt=standard&q=*:*&rows=20&start=0} hits=20 status=0 QTime=4 
[junit4:junit4]   2> 549 T46 C2 REQ [collection1] webapp=null path=null params={indent=true} status=0 QTime=0 
[junit4:junit4]   2> 557 T46 C2 oashdc.ConfigParseUtil.verifyWithSchema id is a required field in SolrSchema . But not found in DataConfig
[junit4:junit4]   2> 557 T46 C2 oashd.DataImporter.loadDataConfig Data Configuration loaded successfully
[junit4:junit4]   2> 558 T46 C2 oashd.DataImporter.doDeltaImport Starting Delta Import
[junit4:junit4]   2> 558 T46 C2 oashd.SimplePropertiesWriter.readIndexerProperties Read dataimport.properties
[junit4:junit4]   2> 559 T46 C2 oashd.DocBuilder.doDelta Starting delta collection.
[junit4:junit4]   2> 559 T46 C2 oashd.DocBuilder.collectDelta Running ModifiedRowKey() for Entity: People
[junit4:junit4]   2> 559 T46 C2 oashd.JdbcDataSource$1.call Creating a connection for entity People with URL: jdbc:hsqldb:mem:.
[junit4:junit4]   2> 560 T46 C2 oashd.JdbcDataSource$1.call Time taken for getConnection(): 0
[junit4:junit4]   2> 569 T46 C2 oashd.DocBuilder.collectDelta Completed ModifiedRowKey for Entity: People rows obtained : 0
[junit4:junit4]   2> 569 T46 C2 oashd.DocBuilder.collectDelta Completed DeletedRowKey for Entity: People rows obtained : 0
[junit4:junit4]   2> 570 T46 C2 oashd.DocBuilder.collectDelta Completed parentDeltaQuery for Entity: People
[junit4:junit4]   2> 570 T46 C2 oashd.DocBuilder.doDelta Delta Import completed successfully
[junit4:junit4]   2> 571 T46 C2 oashd.DocBuilder.execute Time taken = 0:0:0.13
[junit4:junit4]   2> 571 T46 C2 UPDATE [collection1] webapp=null path=null params={commit=true&clean=false&dataConfig=<dataConfig>+%0a<dataSource+name%3D"hsqldb"+driver%3D"org.hsqldb.jdbcDriver"+url%3D"jdbc:hsqldb:mem:."+/>+%0a<document+name%3D"TestSqlEntityProcessor">+%0a<entity+name%3D"People"+pk%3D"People.ID"+processor%3D"SqlEntityProcessor"+dataSource%3D"hsqldb"+query%3D"SELECT+ID,+NAME,+COUNTRY_CODE+FROM+PEOPLE+WHERE+DELETED+!%3D+'Y'+"+deletedPkQuery%3D"SELECT+ID+FROM+PEOPLE+WHERE+DELETED%3D'Y'+AND+last_modified+%26gt;%3D'${dih.last_index_time}'+"+deltaImportQuery%3D"SELECT+ID,+NAME,+COUNTRY_CODE+FROM+PEOPLE+where+ID%3D${dih.delta.ID}+"+deltaQuery%3D"SELECT+ID+FROM+PEOPLE+WHERE+DELETED!%3D'Y'+AND+last_modified+%26gt;%3D'${dih.last_index_time}'+UNION+DISTINCT+SELECT+ID+FROM+PEOPLE+WHERE+DELETED!%3D'Y'+AND+COUNTRY_CODE+IN+(SELECT+CODE+FROM+COUNTRIES+WHERE+last_modified+%26gt;%3D'${dih.last_index_time}')+"+>+%0a<field+column%3D"NAME"+name%3D"NAME_mult_s"+/>+%0a<field+column%3D"COUNTRY_CODE"+name%3D"COUNTRY_CODES_mult_s"+/>+%0a</entity>+%0a</document>+%0a</dataConfig>+%0a&command=delta-import&indent=true&synchronous=true} {} 0 18
[junit4:junit4]   2> 573 T46 C2 REQ [collection1] webapp=null path=null params={version=2.2&qt=standard&q=*:*&rows=20&start=0} hits=20 status=0 QTime=1 
[junit4:junit4]   2> 585 T46 oas.SolrTestCaseJ4.assertQ SEVERE REQUEST FAILED: xpath=//*[@numFound='19']
[junit4:junit4]   2> 		xml response was: <?xml version="1.0" encoding="UTF-8"?>
[junit4:junit4]   2> 	<response>
[junit4:junit4]   2> 	<lst name="responseHeader"><int name="status">0</int><int name="QTime">1</int><lst name="params"><str name="version">2.2</str><str name="qt">standard</str><str name="q">*:*</str><str name="rows">20</str><str name="start">0</str></lst></lst><result name="response" numFound="20" start="0"><doc><arr name="NAME_mult_s"><str>Jacob</str></arr><str name="id">1</str><arr name="COUNTRY_CODES_mult_s"><str>NZ</str></arr><date name="timestamp">2012-11-08T12:11:31.17Z</date></doc><doc><arr name="NAME_mult_s"><str>Ethan</str></arr><str name="id">2</str><arr name="COUNTRY_CODES_mult_s"><str>NU</str></arr><date name="timestamp">2012-11-08T12:11:31.17Z</date></doc><doc><arr name="NAME_mult_s"><str>Michael</str></arr><str name="id">3</str><arr name="COUNTRY_CODES_mult_s"><str>NR</str></arr><date name="timestamp">2012-11-08T12:11:31.17Z</date></doc><doc><arr name="NAME_mult_s"><str>Jayden</str></arr><str name="id">4</str><arr name="COUNTRY_CODES_mult_s"><str>NP</str></arr><date name="timestamp">2012-11-08T12:11:31.17Z</date></doc><doc><arr name="NAME_mult_s"><str>William</str></arr><str name="id">5</str><arr name="COUNTRY_CODES_mult_s"><str>NO</str></arr><date name="timestamp">2012-11-08T12:11:31.17Z</date></doc><doc><arr name="NAME_mult_s"><str>Alexander</str></arr><str name="id">6</str><arr name="COUNTRY_CODES_mult_s"><str>NL</str></arr><date name="timestamp">2012-11-08T12:11:31.17Z</date></doc><doc><arr name="NAME_mult_s"><str>Noah</str></arr><str name="id">7</str><arr name="COUNTRY_CODES_mult_s"><str>NI</str></arr><date name="timestamp">2012-11-08T12:11:31.17Z</date></doc><doc><arr name="NAME_mult_s"><str>Daniel</str></arr><str name="id">8</str><arr name="COUNTRY_CODES_mult_s"><str>NG</str></arr><date name="timestamp">2012-11-08T12:11:31.17Z</date></doc><doc><arr name="NAME_mult_s"><str>Aiden</str></arr><str name="id">9</str><arr name="COUNTRY_CODES_mult_s"><str>NF</str></arr><date name="timestamp">2012-11-08T12:11:31.17Z</date></doc><doc><arr name="NAME_mult_s"><str>Anthony</str></arr><str name="id">10</str><arr name="COUNTRY_CODES_mult_s"><str>NE</str></arr><date name="timestamp">2012-11-08T12:11:31.17Z</date></doc><doc><arr name="NAME_mult_s"><str>Emma</str></arr><str name="id">11</str><arr name="COUNTRY_CODES_mult_s"><str>NL</str></arr><date name="timestamp">2012-11-08T12:11:31.17Z</date></doc><doc><arr name="NAME_mult_s"><str>Grace</str></arr><str name="id">12</str><arr name="COUNTRY_CODES_mult_s"><str>NI</str></arr><date name="timestamp">2012-11-08T12:11:31.17Z</date></doc><doc><arr name="NAME_mult_s"><str>Hailey</str></arr><str name="id">13</str><arr name="COUNTRY_CODES_mult_s"><str>NG</str></arr><date name="timestamp">2012-11-08T12:11:31.17Z</date></doc><doc><arr name="NAME_mult_s"><str>Isabella</str></arr><str name="id">14</str><arr name="COUNTRY_CODES_mult_s"><str>NF</str></arr><date name="timestamp">2012-11-08T12:11:31.17Z</date></doc><doc><arr name="NAME_mult_s"><str>Lily</str></arr><str name="id">15</str><arr name="COUNTRY_CODES_mult_s"><str>NE</str></arr><date name="timestamp">2012-11-08T12:11:31.17Z</date></doc><doc><arr name="NAME_mult_s"><str>Madison</str></arr><str name="id">16</str><arr name="COUNTRY_CODES_mult_s"><str>NC</str></arr><date name="timestamp">2012-11-08T12:11:31.17Z</date></doc><doc><arr name="NAME_mult_s"><str>Mia</str></arr><str name="id">17</str><arr name="COUNTRY_CODES_mult_s"><str>NA</str></arr><date name="timestamp">2012-11-08T12:11:31.17Z</date></doc><doc><arr name="NAME_mult_s"><str>Natalie</str></arr><str name="id">18</str><arr name="COUNTRY_CODES_mult_s"><str>NZ</str></arr><date name="timestamp">2012-11-08T12:11:31.17Z</date></doc><doc><arr name="NAME_mult_s"><str>Olivia</str></arr><str name="id">19</str><arr name="COUNTRY_CODES_mult_s"><str>NU</str></arr><date name="timestamp">2012-11-08T12:11:31.17Z</date></doc><doc><arr name="NAME_mult_s"><str>Samantha</str></arr><str name="id">20</str><arr name="COUNTRY_CODES_mult_s"><str>NR</str></arr><date name="timestamp">2012-11-08T12:11:31.17Z</date></doc></result>
[junit4:junit4]   2> 	</response>
[junit4:junit4]   2> 	
[junit4:junit4]   2> 		request was:version=2.2&qt=standard&q=*:*&rows=20&start=0
[junit4:junit4]   2> 588 T46 oasc.SolrException.log SEVERE REQUEST FAILED: version=2.2&qt=standard&q=*:*&rows=20&start=0:java.lang.RuntimeException: REQUEST FAILED: xpath=//*[@numFound='19']
[junit4:junit4]   2> 		xml response was: <?xml version="1.0" encoding="UTF-8"?>
[junit4:junit4]   2> 	<response>
[junit4:junit4]   2> 	<lst name="responseHeader"><int name="status">0</int><int name="QTime">1</int><lst name="params"><str name="version">2.2</str><str name="qt">standard</str><str name="q">*:*</str><str name="rows">20</str><str name="start">0</str></lst></lst><result name="response" numFound="20" start="0"><doc><arr name="NAME_mult_s"><str>Jacob</str></arr><str name="id">1</str><arr name="COUNTRY_CODES_mult_s"><str>NZ</str></arr><date name="timestamp">2012-11-08T12:11:31.17Z</date></doc><doc><arr name="NAME_mult_s"><str>Ethan</str></arr><str name="id">2</str><arr name="COUNTRY_CODES_mult_s"><str>NU</str></arr><date name="timestamp">2012-11-08T12:11:31.17Z</date></doc><doc><arr name="NAME_mult_s"><str>Michael</str></arr><str name="id">3</str><arr name="COUNTRY_CODES_mult_s"><str>NR</str></arr><date name="timestamp">2012-11-08T12:11:31.17Z</date></doc><doc><arr name="NAME_mult_s"><str>Jayden</str></arr><str name="id">4</str><arr name="COUNTRY_CODES_mult_s"><str>NP</str></arr><date name="timestamp">2012-11-08T12:11:31.17Z</date></doc><doc><arr name="NAME_mult_s"><str>William</str></arr><str name="id">5</str><arr name="COUNTRY_CODES_mult_s"><str>NO</str></arr><date name="timestamp">2012-11-08T12:11:31.17Z</date></doc><doc><arr name="NAME_mult_s"><str>Alexander</str></arr><str name="id">6</str><arr name="COUNTRY_CODES_mult_s"><str>NL</str></arr><date name="timestamp">2012-11-08T12:11:31.17Z</date></doc><doc><arr name="NAME_mult_s"><str>Noah</str></arr><str name="id">7</str><arr name="COUNTRY_CODES_mult_s"><str>NI</str></arr><date name="timestamp">2012-11-08T12:11:31.17Z</date></doc><doc><arr name="NAME_mult_s"><str>Daniel</str></arr><str name="id">8</str><arr name="COUNTRY_CODES_mult_s"><str>NG</str></arr><date name="timestamp">2012-11-08T12:11:31.17Z</date></doc><doc><arr name="NAME_mult_s"><str>Aiden</str></arr><str name="id">9</str><arr name="COUNTRY_CODES_mult_s"><str>NF</str></arr><date name="timestamp">2012-11-08T12:11:31.17Z</date></doc><doc><arr name="NAME_mult_s"><str>Anthony</str></arr><str name="id">10</str><arr name="COUNTRY_CODES_mult_s"><str>NE</str></arr><date name="timestamp">2012-11-08T12:11:31.17Z</date></doc><doc><arr name="NAME_mult_s"><str>Emma</str></arr><str name="id">11</str><arr name="COUNTRY_CODES_mult_s"><str>NL</str></arr><date name="timestamp">2012-11-08T12:11:31.17Z</date></doc><doc><arr name="NAME_mult_s"><str>Grace</str></arr><str name="id">12</str><arr name="COUNTRY_CODES_mult_s"><str>NI</str></arr><date name="timestamp">2012-11-08T12:11:31.17Z</date></doc><doc><arr name="NAME_mult_s"><str>Hailey</str></arr><str name="id">13</str><arr name="COUNTRY_CODES_mult_s"><str>NG</str></arr><date name="timestamp">2012-11-08T12:11:31.17Z</date></doc><doc><arr name="NAME_mult_s"><str>Isabella</str></arr><str name="id">14</str><arr name="COUNTRY_CODES_mult_s"><str>NF</str></arr><date name="timestamp">2012-11-08T12:11:31.17Z</date></doc><doc><arr name="NAME_mult_s"><str>Lily</str></arr><str name="id">15</str><arr name="COUNTRY_CODES_mult_s"><str>NE</str></arr><date name="timestamp">2012-11-08T12:11:31.17Z</date></doc><doc><arr name="NAME_mult_s"><str>Madison</str></arr><str name="id">16</str><arr name="COUNTRY_CODES_mult_s"><str>NC</str></arr><date name="timestamp">2012-11-08T12:11:31.17Z</date></doc><doc><arr name="NAME_mult_s"><str>Mia</str></arr><str name="id">17</str><arr name="COUNTRY_CODES_mult_s"><str>NA</str></arr><date name="timestamp">2012-11-08T12:11:31.17Z</date></doc><doc><arr name="NAME_mult_s"><str>Natalie</str></arr><str name="id">18</str><arr name="COUNTRY_CODES_mult_s"><str>NZ</str></arr><date name="timestamp">2012-11-08T12:11:31.17Z</date></doc><doc><arr name="NAME_mult_s"><str>Olivia</str></arr><str name="id">19</str><arr name="COUNTRY_CODES_mult_s"><str>NU</str></arr><date name="timestamp">2012-11-08T12:11:31.17Z</date></doc><doc><arr name="NAME_mult_s"><str>Samantha</str></arr><str name="id">20</str><arr name="COUNTRY_CODES_mult_s"><str>NR</str></arr><date name="timestamp">2012-11-08T12:11:31.17Z</date></doc></result>
[junit4:junit4]   2> 	</response>
[junit4:junit4]   2> 	
[junit4:junit4]   2> 		request was:version=2.2&qt=standard&q=*:*&rows=20&start=0
[junit4:junit4]   2> 		at org.apache.solr.SolrTestCaseJ4.assertQ(SolrTestCaseJ4.java:506)
[junit4:junit4]   2> 		at org.apache.solr.SolrTestCaseJ4.assertQ(SolrTestCaseJ4.java:480)
[junit4:junit4]   2> 		at org.apache.solr.handler.dataimport.AbstractDIHJdbcTestCase.singleEntity(AbstractDIHJdbcTestCase.java:102)
[junit4:junit4]   2> 		at org.apache.solr.handler.dataimport.TestSqlEntityProcessorDelta.testSingleEntity(TestSqlEntityProcessorDelta.java:44)
[junit4:junit4]   2> 		at sun.reflect.NativeMethodAccessorImpl.invoke0(Native Method)
[junit4:junit4]   2> 		at sun.reflect.NativeMethodAccessorImpl.invoke(NativeMethodAccessorImpl.java:57)
[junit4:junit4]   2> 		at sun.reflect.DelegatingMethodAccessorImpl.invoke(DelegatingMethodAccessorImpl.java:43)
[junit4:junit4]   2> 		at java.lang.reflect.Method.invoke(Method.java:474)
[junit4:junit4]   2> 		at com.carrotsearch.randomizedtesting.RandomizedRunner.invoke(RandomizedRunner.java:1559)
[junit4:junit4]   2> 		at com.carrotsearch.randomizedtesting.RandomizedRunner.access$600(RandomizedRunner.java:79)
[junit4:junit4]   2> 		at com.carrotsearch.randomizedtesting.RandomizedRunner$6.evaluate(RandomizedRunner.java:737)
[junit4:junit4]   2> 		at com.carrotsearch.randomizedtesting.RandomizedRunner$7.evaluate(RandomizedRunner.java:773)
[junit4:junit4]   2> 		at com.carrotsearch.randomizedtesting.RandomizedRunner$8.evaluate(RandomizedRunner.java:787)
[junit4:junit4]   2> 		at com.carrotsearch.randomizedtesting.rules.SystemPropertiesRestoreRule$1.evaluate(SystemPropertiesRestoreRule.java:53)
[junit4:junit4]   2> 		at org.apache.lucene.util.TestRuleSetupTeardownChained$1.evaluate(TestRuleSetupTeardownChained.java:50)
[junit4:junit4]   2> 		at org.apache.lucene.util.TestRuleFieldCacheSanity$1.evaluate(TestRuleFieldCacheSanity.java:51)
[junit4:junit4]   2> 		at org.apache.lucene.util.AbstractBeforeAfterRule$1.evaluate(AbstractBeforeAfterRule.java:45)
[junit4:junit4]   2> 		at com.carrotsearch.randomizedtesting.rules.SystemPropertiesInvariantRule$1.evaluate(SystemPropertiesInvariantRule.java:55)
[junit4:junit4]   2> 		at org.apache.lucene.util.TestRuleThreadAndTestName$1.evaluate(TestRuleThreadAndTestName.java:48)
[junit4:junit4]   2> 		at org.apache.lucene.util.TestRuleIgnoreAfterMaxFailures$1.evaluate(TestRuleIgnoreAfterMaxFailures.java:70)
[junit4:junit4]   2> 		at org.apache.lucene.util.TestRuleMarkFailure$1.evaluate(TestRuleMarkFailure.java:48)
[junit4:junit4]   2> 		at com.carrotsearch.randomizedtesting.rules.StatementAdapter.evaluate(StatementAdapter.java:36)
[junit4:junit4]   2> 		at com.carrotsearch.randomizedtesting.ThreadLeakControl$StatementRunner.run(ThreadLeakControl.java:358)
[junit4:junit4]   2> 		at com.carrotsearch.randomizedtesting.ThreadLeakControl.forkTimeoutingTask(ThreadLeakControl.java:782)
[junit4:junit4]   2> 		at com.carrotsearch.randomizedtesting.ThreadLeakControl$3.evaluate(ThreadLeakControl.java:442)
[junit4:junit4]   2> 		at com.carrotsearch.randomizedtesting.RandomizedRunner.runSingleTest(RandomizedRunner.java:746)
[junit4:junit4]   2> 		at com.carrotsearch.randomizedtesting.RandomizedRunner$3.evaluate(RandomizedRunner.java:648)
[junit4:junit4]   2> 		at com.carrotsearch.randomizedtesting.RandomizedRunner$4.evaluate(RandomizedRunner.java:682)
[junit4:junit4]   2> 		at com.carrotsearch.randomizedtesting.RandomizedRunner$5.evaluate(RandomizedRunner.java:693)
[junit4:junit4]   2> 		at com.carrotsearch.randomizedtesting.rules.StatementAdapter.evaluate(StatementAdapter.java:36)
[junit4:junit4]   2> 		at com.carrotsearch.randomizedtesting.rules.SystemPropertiesRestoreRule$1.evaluate(SystemPropertiesRestoreRule.java:53)
[junit4:junit4]   2> 		at org.apache.lucene.util.AbstractBeforeAfterRule$1.evaluate(AbstractBeforeAfterRule.java:45)
[junit4:junit4]   2> 		at org.apache.lucene.util.TestRuleStoreClassName$1.evaluate(TestRuleStoreClassName.java:42)
[junit4:junit4]   2> 		at com.carrotsearch.randomizedtesting.rules.SystemPropertiesInvariantRule$1.evaluate(SystemPropertiesInvariantRule.java:55)
[junit4:junit4]   2> 		at com.carrotsearch.randomizedtesting.rules.NoShadowingOrOverridesOnMethodsRule$1.evaluate(NoShadowingOrOverridesOnMethodsRule.java:39)
[junit4:junit4]   2> 		at com.carrotsearch.randomizedtesting.rules.NoShadowingOrOverridesOnMethodsRule$1.evaluate(NoShadowingOrOverridesOnMethodsRule.java:39)
[junit4:junit4]   2> 		at com.carrotsearch.randomizedtesting.rules.StatementAdapter.evaluate(StatementAdapter.java:36)
[junit4:junit4]   2> 		at org.apache.lucene.util.TestRuleAssertionsRequired$1.evaluate(TestRuleAssertionsRequired.java:43)
[junit4:junit4]   2> 		at org.apache.lucene.util.TestRuleMarkFailure$1.evaluate(TestRuleMarkFailure.java:48)
[junit4:junit4]   2> 		at org.apache.lucene.util.TestRuleIgnoreAfterMaxFailures$1.evaluate(TestRuleIgnoreAfterMaxFailures.java:70)
[junit4:junit4]   2> 		at org.apache.lucene.util.TestRuleIgnoreTestSuites$1.evaluate(TestRuleIgnoreTestSuites.java:55)
[junit4:junit4]   2> 		at com.carrotsearch.randomizedtesting.rules.StatementAdapter.evaluate(StatementAdapter.java:36)
[junit4:junit4]   2> 		at com.carrotsearch.randomizedtesting.ThreadLeakControl$StatementRunner.run(ThreadLeakControl.java:358)
[junit4:junit4]   2> 		at java.lang.Thread.run(Thread.java:722)
[junit4:junit4]   2> 	
[junit4:junit4]   2> 591 T46 oashd.AbstractDataImportHandlerTestCase.tearDown Looking for dataimport.properties at: /mnt/ssd/jenkins/workspace/Lucene-Solr-4.x-Linux/solr/build/contrib/solr-dataimporthandler/test/J1/solr/collection1/conf/dataimport.properties
[junit4:junit4]   2> 591 T46 oas.SolrTestCaseJ4.tearDown ###Ending testSingleEntity
[junit4:junit4]   2> NOTE: reproduce with: ant test  -Dtestcase=TestSqlEntityProcessorDelta -Dtests.method=testSingleEntity -Dtests.seed=103A3F6EAC3C5255 -Dtests.multiplier=3 -Dtests.slow=true -Dtests.locale=th_TH_TH_#u-nu-thai -Dtests.timezone=Asia/Chongqing -Dtests.file.encoding=UTF-8
[junit4:junit4] ERROR   0.47s J1 | TestSqlEntityProcessorDelta.testSingleEntity <<<
[junit4:junit4]    > Throwable #1: java.lang.RuntimeException: Exception during query
[junit4:junit4]    > 	at __randomizedtesting.SeedInfo.seed([103A3F6EAC3C5255:7E8543F2C3D1BDD6]:0)
[junit4:junit4]    > 	at org.apache.solr.SolrTestCaseJ4.assertQ(SolrTestCaseJ4.java:513)
[junit4:junit4]    > 	at org.apache.solr.SolrTestCaseJ4.assertQ(SolrTestCaseJ4.java:480)
[junit4:junit4]    > 	at org.apache.solr.handler.dataimport.AbstractDIHJdbcTestCase.singleEntity(AbstractDIHJdbcTestCase.java:102)
[junit4:junit4]    > 	at org.apache.solr.handler.dataimport.TestSqlEntityProcessorDelta.testSingleEntity(TestSqlEntityProcessorDelta.java:44)
[junit4:junit4]    > 	at sun.reflect.NativeMethodAccessorImpl.invoke0(Native Method)
[junit4:junit4]    > 	at sun.reflect.NativeMethodAccessorImpl.invoke(NativeMethodAccessorImpl.java:57)
[junit4:junit4]    > 	at sun.reflect.DelegatingMethodAccessorImpl.invoke(DelegatingMethodAccessorImpl.java:43)
[junit4:junit4]    > 	at java.lang.reflect.Method.invoke(Method.java:474)
[junit4:junit4]    > 	at com.carrotsearch.randomizedtesting.RandomizedRunner.invoke(RandomizedRunner.java:1559)
[junit4:junit4]    > 	at com.carrotsearch.randomizedtesting.RandomizedRunner.access$600(RandomizedRunner.java:79)
[junit4:junit4]    > 	at com.carrotsearch.randomizedtesting.RandomizedRunner$6.evaluate(RandomizedRunner.java:737)
[junit4:junit4]    > 	at com.carrotsearch.randomizedtesting.RandomizedRunner$7.evaluate(RandomizedRunner.java:773)
[junit4:junit4]    > 	at com.carrotsearch.randomizedtesting.RandomizedRunner$8.evaluate(RandomizedRunner.java:787)
[junit4:junit4]    > 	at com.carrotsearch.randomizedtesting.rules.SystemPropertiesRestoreRule$1.evaluate(SystemPropertiesRestoreRule.java:53)
[junit4:junit4]    > 	at org.apache.lucene.util.TestRuleSetupTeardownChained$1.evaluate(TestRuleSetupTeardownChained.java:50)
[junit4:junit4]    > 	at org.apache.lucene.util.TestRuleFieldCacheSanity$1.evaluate(TestRuleFieldCacheSanity.java:51)
[junit4:junit4]    > 	at org.apache.lucene.util.AbstractBeforeAfterRule$1.evaluate(AbstractBeforeAfterRule.java:45)
[junit4:junit4]    > 	at com.carrotsearch.randomizedtesting.rules.SystemPropertiesInvariantRule$1.evaluate(SystemPropertiesInvariantRule.java:55)
[junit4:junit4]    > 	at org.apache.lucene.util.TestRuleThreadAndTestName$1.evaluate(TestRuleThreadAndTestName.java:48)
[junit4:junit4]    > 	at org.apache.lucene.util.TestRuleIgnoreAfterMaxFailures$1.evaluate(TestRuleIgnoreAfterMaxFailures.java:70)
[junit4:junit4]    > 	at org.apache.lucene.util.TestRuleMarkFailure$1.evaluate(TestRuleMarkFailure.java:48)
[junit4:junit4]    > 	at com.carrotsearch.randomizedtesting.rules.StatementAdapter.evaluate(StatementAdapter.java:36)
[junit4:junit4]    > 	at com.carrotsearch.randomizedtesting.ThreadLeakControl$StatementRunner.run(ThreadLeakControl.java:358)
[junit4:junit4]    > 	at com.carrotsearch.randomizedtesting.ThreadLeakControl.forkTimeoutingTask(ThreadLeakControl.java:782)
[junit4:junit4]    > 	at com.carrotsearch.randomizedtesting.ThreadLeakControl$3.evaluate(ThreadLeakControl.java:442)
[junit4:junit4]    > 	at com.carrotsearch.randomizedtesting.RandomizedRunner.runSingleTest(RandomizedRunner.java:746)
[junit4:junit4]    > 	at com.carrotsearch.randomizedtesting.RandomizedRunner$3.evaluate(RandomizedRunner.java:648)
[junit4:junit4]    > 	at com.carrotsearch.randomizedtesting.RandomizedRunner$4.evaluate(RandomizedRunner.java:682)
[junit4:junit4]    > 	at com.carrotsearch.randomizedtesting.RandomizedRunner$5.evaluate(RandomizedRunner.java:693)
[junit4:junit4]    > 	at com.carrotsearch.randomizedtesting.rules.StatementAdapter.evaluate(StatementAdapter.java:36)
[junit4:junit4]    > 	at com.carrotsearch.randomizedtesting.rules.SystemPropertiesRestoreRule$1.evaluate(SystemPropertiesRestoreRule.java:53)
[junit4:junit4]    > 	at org.apache.lucene.util.AbstractBeforeAfterRule$1.evaluate(AbstractBeforeAfterRule.java:45)
[junit4:junit4]    > 	at org.apache.lucene.util.TestRuleStoreClassName$1.evaluate(TestRuleStoreClassName.java:42)
[junit4:junit4]    > 	at com.carrotsearch.randomizedtesting.rules.SystemPropertiesInvariantRule$1.evaluate(SystemPropertiesInvariantRule.java:55)
[junit4:junit4]    > 	at com.carrotsearch.randomizedtesting.rules.NoShadowingOrOverridesOnMethodsRule$1.evaluate(NoShadowingOrOverridesOnMethodsRule.java:39)
[junit4:junit4]    > 	at com.carrotsearch.randomizedtesting.rules.NoShadowingOrOverridesOnMethodsRule$1.evaluate(NoShadowingOrOverridesOnMethodsRule.java:39)
[junit4:junit4]    > 	at com.carrotsearch.randomizedtesting.rules.StatementAdapter.evaluate(StatementAdapter.java:36)
[junit4:junit4]    > 	at org.apache.lucene.util.TestRuleAssertionsRequired$1.evaluate(TestRuleAssertionsRequired.java:43)
[junit4:junit4]    > 	at org.apache.lucene.util.TestRuleMarkFailure$1.evaluate(TestRuleMarkFailure.java:48)
[junit4:junit4]    > 	at org.apache.lucene.util.TestRuleIgnoreAfterMaxFailures$1.evaluate(TestRuleIgnoreAfterMaxFailures.java:70)
[junit4:junit4]    > 	at org.apache.lucene.util.TestRuleIgnoreTestSuites$1.evaluate(TestRuleIgnoreTestSuites.java:55)
[junit4:junit4]    > 	at com.carrotsearch.randomizedtesting.rules.StatementAdapter.evaluate(StatementAdapter.java:36)
[junit4:junit4]    > 	at com.carrotsearch.randomizedtesting.ThreadLeakControl$StatementRunner.run(ThreadLeakControl.java:358)
[junit4:junit4]    > 	at java.lang.Thread.run(Thread.java:722)
[junit4:junit4]    > Caused by: java.lang.RuntimeException: REQUEST FAILED: xpath=//*[@numFound='19']
[junit4:junit4]    > 	xml response was: <?xml version="1.0" encoding="UTF-8"?>
[junit4:junit4]    > <response>
[junit4:junit4]    > <lst name="responseHeader"><int name="status">0</int><int name="QTime">1</int><lst name="params"><str name="version">2.2</str><str name="qt">standard</str><str name="q">*:*</str><str name="rows">20</str><str name="start">0</str></lst></lst><result name="response" numFound="20" start="0"><doc><arr name="NAME_mult_s"><str>Jacob</str></arr><str name="id">1</str><arr name="COUNTRY_CODES_mult_s"><str>NZ</str></arr><date name="timestamp">2012-11-08T12:11:31.17Z</date></doc><doc><arr name="NAME_mult_s"><str>Ethan</str></arr><str name="id">2</str><arr name="COUNTRY_CODES_mult_s"><str>NU</str></arr><date name="timestamp">2012-11-08T12:11:31.17Z</date></doc><doc><arr name="NAME_mult_s"><str>Michael</str></arr><str name="id">3</str><arr name="COUNTRY_CODES_mult_s"><str>NR</str></arr><date name="timestamp">2012-11-08T12:11:31.17Z</date></doc><doc><arr name="NAME_mult_s"><str>Jayden</str></arr><str name="id">4</str><arr name="COUNTRY_CODES_mult_s"><str>NP</str></arr><date name="timestamp">2012-11-08T12:11:31.17Z</date></doc><doc><arr name="NAME_mult_s"><str>William</str></arr><str name="id">5</str><arr name="COUNTRY_CODES_mult_s"><str>NO</str></arr><date name="timestamp">2012-11-08T12:11:31.17Z</date></doc><doc><arr name="NAME_mult_s"><str>Alexander</str></arr><str name="id">6</str><arr name="COUNTRY_CODES_mult_s"><str>NL</str></arr><date name="timestamp">2012-11-08T12:11:31.17Z</date></doc><doc><arr name="NAME_mult_s"><str>Noah</str></arr><str name="id">7</str><arr name="COUNTRY_CODES_mult_s"><str>NI</str></arr><date name="timestamp">2012-11-08T12:11:31.17Z</date></doc><doc><arr name="NAME_mult_s"><str>Daniel</str></arr><str name="id">8</str><arr name="COUNTRY_CODES_mult_s"><str>NG</str></arr><date name="timestamp">2012-11-08T12:11:31.17Z</date></doc><doc><arr name="NAME_mult_s"><str>Aiden</str></arr><str name="id">9</str><arr name="COUNTRY_CODES_mult_s"><str>NF</str></arr><date name="timestamp">2012-11-08T12:11:31.17Z</date></doc><doc><arr name="NAME_mult_s"><str>Anthony</str></arr><str name="id">10</str><arr name="COUNTRY_CODES_mult_s"><str>NE</str></arr><date name="timestamp">2012-11-08T12:11:31.17Z</date></doc><doc><arr name="NAME_mult_s"><str>Emma</str></arr><str name="id">11</str><arr name="COUNTRY_CODES_mult_s"><str>NL</str></arr><date name="timestamp">2012-11-08T12:11:31.17Z</date></doc><doc><arr name="NAME_mult_s"><str>Grace</str></arr><str name="id">12</str><arr name="COUNTRY_CODES_mult_s"><str>NI</str></arr><date name="timestamp">2012-11-08T12:11:31.17Z</date></doc><doc><arr name="NAME_mult_s"><str>Hailey</str></arr><str name="id">13</str><arr name="COUNTRY_CODES_mult_s"><str>NG</str></arr><date name="timestamp">2012-11-08T12:11:31.17Z</date></doc><doc><arr name="NAME_mult_s"><str>Isabella</str></arr><str name="id">14</str><arr name="COUNTRY_CODES_mult_s"><str>NF</str></arr><date name="timestamp">2012-11-08T12:11:31.17Z</date></doc><doc><arr name="NAME_mult_s"><str>Lily</str></arr><str name="id">15</str><arr name="COUNTRY_CODES_mult_s"><str>NE</str></arr><date name="timestamp">2012-11-08T12:11:31.17Z</date></doc><doc><arr name="NAME_mult_s"><str>Madison</str></arr><str name="id">16</str><arr name="COUNTRY_CODES_mult_s"><str>NC</str></arr><date name="timestamp">2012-11-08T12:11:31.17Z</date></doc><doc><arr name="NAME_mult_s"><str>Mia</str></arr><str name="id">17</str><arr name="COUNTRY_CODES_mult_s"><str>NA</str></arr><date name="timestamp">2012-11-08T12:11:31.17Z</date></doc><doc><arr name="NAME_mult_s"><str>Natalie</str></arr><str name="id">18</str><arr name="COUNTRY_CODES_mult_s"><str>NZ</str></arr><date name="timestamp">2012-11-08T12:11:31.17Z</date></doc><doc><arr name="NAME_mult_s"><str>Olivia</str></arr><str name="id">19</str><arr name="COUNTRY_CODES_mult_s"><str>NU</str></arr><date name="timestamp">2012-11-08T12:11:31.17Z</date></doc><doc><arr name="NAME_mult_s"><str>Samantha</str></arr><str name="id">20</str><arr name="COUNTRY_CODES_mult_s"><str>NR</str></arr><date name="timestamp">2012-11-08T12:11:31.17Z</date></doc></result>
[junit4:junit4]    > </response>
[junit4:junit4]    > 
[junit4:junit4]    > 	request was:version=2.2&qt=standard&q=*:*&rows=20&start=0
[junit4:junit4]    > 	at org.apache.solr.SolrTestCaseJ4.assertQ(SolrTestCaseJ4.java:506)
[junit4:junit4]    > 	... 43 more
[junit4:junit4]   2> 647 T46 oas.SolrTestCaseJ4.setUp ###Starting testWithComplexTransformer
[junit4:junit4]   2> 651 T46 C2 oasu.DirectUpdateHandler2.deleteAll [collection1] REMOVING ALL DOCUMENTS FROM INDEX
[junit4:junit4]   2> 652 T46 C2 UPDATE [collection1] webapp=null path=null params={} {deleteByQuery=*:*} 0 1
[junit4:junit4]   2> 659 T46 C2 oasu.DirectUpdateHandler2.commit start commit{flags=0,_version_=0,optimize=false,openSearcher=true,waitSearcher=true,expungeDeletes=false,softCommit=false}
[junit4:junit4]   2> 660 T46 C2 oasc.SolrDeletionPolicy.onCommit SolrDeletionPolicy.onCommit: commits:num=2
[junit4:junit4]   2> 		commit{dir=MockDirWrapper(org.apache.lucene.store.RAMDirectory@935b3cd lockFactory=org.apache.lucene.store.NativeFSLockFactory@74ded67c),segFN=segments_3,generation=3,filenames=[_0_Lucene40_0.tip, segments_3, _0.fdt, _0.fdx, _0.si, _0.fnm, _0_Lucene40_0.frq, _0_Lucene40_0.tim]
[junit4:junit4]   2> 		commit{dir=MockDirWrapper(org.apache.lucene.store.RAMDirectory@935b3cd lockFactory=org.apache.lucene.store.NativeFSLockFactory@74ded67c),segFN=segments_4,generation=4,filenames=[segments_4]
[junit4:junit4]   2> 660 T46 C2 oasc.SolrDeletionPolicy.updateCommits newest commit = 4
[junit4:junit4]   2> 662 T46 C2 oass.SolrIndexSearcher.<init> Opening Searcher@45f262ad main
[junit4:junit4]   2> 663 T46 C2 oass.SolrIndexSearcher.getIndexDir WARNING WARNING: Directory impl does not support setting indexDir: org.apache.lucene.store.MockDirectoryWrapper
[junit4:junit4]   2> 663 T46 C2 oasu.DirectUpdateHandler2.commit end_commit_flush
[junit4:junit4]   2> 664 T47 oasc.QuerySenderListener.newSearcher QuerySenderListener sending requests to Searcher@45f262ad main{StandardDirectoryReader(segments_4:6)}
[junit4:junit4]   2> 664 T47 C2 REQ [collection1] webapp=null path=null params={distrib=false&q=solr&event=newSearcher&rows=10&start=0} hits=0 status=0 QTime=0 
[junit4:junit4]   2> 665 T47 C2 REQ [collection1] webapp=null path=null params={distrib=false&q=rocks&event=newSearcher&rows=10&start=0} hits=0 status=0 QTime=1 
[junit4:junit4]   2> 665 T47 C2 REQ [collection1] webapp=null path=null params={distrib=false&q=static+newSearcher+warming+query+from+solrconfig.xml&event=newSearcher} hits=0 status=0 QTime=0 
[junit4:junit4]   2> 665 T47 oasc.QuerySenderListener.newSearcher QuerySenderListener done.
[junit4:junit4]   2> 665 T47 oasc.SolrCore.registerSearcher [collection1] Registered new searcher Searcher@45f262ad main{StandardDirectoryReader(segments_4:6)}
[junit4:junit4]   2> 666 T46 C2 UPDATE [collection1] webapp=null path=null params={} {commit=} 0 8
[junit4:junit4]   2> 676 T46 C2 oashdc.ConfigParseUtil.verifyWithSchema id is a required field in SolrSchema . But not found in DataConfig
[junit4:junit4]   2> 676 T46 C2 oashd.DataImporter.loadDataConfig Data Configuration loaded successfully
[junit4:junit4]   2> 676 T46 C2 oashd.DataImporter.doFullImport Starting Full Import
[junit4:junit4]   2> 677 T46 C2 oashd.SimplePropertiesWriter.readIndexerProperties Read dataimport.properties
[junit4:junit4]   2> 678 T46 C2 oasu.DirectUpdateHandler2.deleteAll [collection1] REMOVING ALL DOCUMENTS FROM INDEX
[junit4:junit4]   2> 678 T46 C2 oashd.JdbcDataSource$1.call Creating a connection for entity People with URL: jdbc:hsqldb:mem:.
[junit4:junit4]   2> 679 T46 C2 oashd.JdbcDataSource$1.call Time taken for getConnection(): 0
[junit4:junit4]   2> 729 T46 C2 oashd.DocBuilder.finish Import completed successfully
[junit4:junit4]   2> 729 T46 C2 oasu.DirectUpdateHandler2.commit start commit{flags=0,_version_=0,optimize=false,openSearcher=true,waitSearcher=true,expungeDeletes=false,softCommit=false}
[junit4:junit4]   2> 741 T46 C2 oasc.SolrDeletionPolicy.onCommit SolrDeletionPolicy.onCommit: commits:num=2
[junit4:junit4]   2> 		commit{dir=MockDirWrapper(org.apache.lucene.store.RAMDirectory@935b3cd lockFactory=org.apache.lucene.store.NativeFSLockFactory@74ded67c),segFN=segments_4,generation=4,filenames=[segments_4]
[junit4:junit4]   2> 		commit{dir=MockDirWrapper(org.apache.lucene.store.RAMDirectory@935b3cd lockFactory=org.apache.lucene.store.NativeFSLockFactory@74ded67c),segFN=segments_5,generation=5,filenames=[_1.fdt, _1.fdx, _1_Lucene40_0.frq, _1.si, _1_Lucene40_0.tim, _1_Lucene40_0.tip, _1.fnm, segments_5]
[junit4:junit4]   2> 742 T46 C2 oasc.SolrDeletionPolicy.updateCommits newest commit = 5
[junit4:junit4]   2> 744 T46 C2 oass.SolrIndexSearcher.<init> Opening Searcher@4759d881 main
[junit4:junit4]   2> 745 T46 C2 oass.SolrIndexSearcher.getIndexDir WARNING WARNING: Directory impl does not support setting indexDir: org.apache.lucene.store.MockDirectoryWrapper
[junit4:junit4]   2> 745 T46 C2 oasu.DirectUpdateHandler2.commit end_commit_flush
[junit4:junit4]   2> 746 T47 oasc.QuerySenderListener.newSearcher QuerySenderListener sending requests to Searcher@4759d881 main{StandardDirectoryReader(segments_5:9 _1(4.1):C60)}
[junit4:junit4]   2> 746 T47 C2 REQ [collection1] webapp=null path=null params={distrib=false&q=solr&event=newSearcher&rows=10&start=0} hits=0 status=0 QTime=0 
[junit4:junit4]   2> 747 T47 C2 REQ [collection1] webapp=null path=null params={distrib=false&q=rocks&event=newSearcher&rows=10&start=0} hits=0 status=0 QTime=0 
[junit4:junit4]   2> 747 T47 C2 REQ [collection1] webapp=null path=null params={distrib=false&q=static+newSearcher+warming+query+from+solrconfig.xml&event=newSearcher} hits=0 status=0 QTime=0 
[junit4:junit4]   2> 747 T47 oasc.QuerySenderListener.newSearcher QuerySenderListener done.
[junit4:junit4]   2> 748 T47 oasc.SolrCore.registerSearcher [collection1] Registered new searcher Searcher@4759d881 main{StandardDirectoryReader(segments_5:9 _1(4.1):C60)}
[junit4:junit4]   2> 749 T46 C2 oashd.SimplePropertiesWriter.readIndexerProperties Read dataimport.properties
[junit4:junit4]   2> 750 T46 C2 oashd.SimplePropertiesWriter.persist Wrote last indexed time to dataimport.properties
[junit4:junit4]   2> 750 T46 C2 oashd.DocBuilder.execute Time taken = 0:0:0.73
[junit4:junit4]   2> 750 T46 C2 UPDATE [collection1] webapp=null path=null params={commit=true&clean=true&dataConfig=<dataConfig>+%0a<dataSource+name%3D"hsqldb"+driver%3D"org.hsqldb.jdbcDriver"+url%3D"jdbc:hsqldb:mem:."+/>+%0a<document+name%3D"TestSqlEntityProcessor">+%0a<entity+name%3D"People"+pk%3D"People.ID"+processor%3D"SqlEntityProcessor"+dataSource%3D"hsqldb"+transformer%3D"TripleThreatTransformer"+query%3D"SELECT+ID,+NAME,+COUNTRY_CODE+FROM+PEOPLE+WHERE+DELETED+!%3D+'Y'+"+deletedPkQuery%3D"SELECT+ID+FROM+PEOPLE+WHERE+DELETED%3D'Y'+AND+last_modified+%26gt;%3D'${dih.last_index_time}'+"+deltaImportQuery%3D"SELECT+ID,+NAME,+COUNTRY_CODE+FROM+PEOPLE+where+ID%3D${dih.delta.ID}+"+deltaQuery%3D"SELECT+ID+FROM+PEOPLE+WHERE+DELETED!%3D'Y'+AND+last_modified+%26gt;%3D'${dih.last_index_time}'+UNION+DISTINCT+SELECT+ID+FROM+PEOPLE+WHERE+DELETED!%3D'Y'+AND+COUNTRY_CODE+IN+(SELECT+CODE+FROM+COUNTRIES+WHERE+last_modified+%26gt;%3D'${dih.last_index_time}')+"+>+%0a<field+column%3D"NAME"+name%3D"NAME_mult_s"+/>+%0a<field+column%3D"COUNTRY_CODE"+name%3D"COUNTRY_CODES_mult_s"+/>+%0a</entity>+%0a</document>+%0a</dataConfig>+%0a&command=full-import&indent=true&synchronous=true} {deleteByQuery=*:*,add=[1, TripleThreat-1-1, TripleThreat-2-1, 2, TripleThreat-1-2, TripleThreat-2-2, 3, TripleThreat-1-3, TripleThreat-2-3, 4, ... (60 adds)],commit=} 0 76
[junit4:junit4]   2> 854 T46 C2 REQ [collection1] webapp=null path=null params={q=*:*&sort=id+asc&rows=60} hits=60 status=0 QTime=100 
[junit4:junit4]   2> 870 T46 C2 REQ [collection1] webapp=null path=null params={version=2.2&qt=standard&q=id:TripleThreat-1-*&rows=20&start=0} hits=20 status=0 QTime=5 
[junit4:junit4]   2> 876 T46 C2 REQ [collection1] webapp=null path=null params={version=2.2&qt=standard&q=id:TripleThreat-2-*&rows=20&start=0} hits=20 status=0 QTime=2 
[junit4:junit4]   2> 884 T46 C2 REQ [collection1] webapp=null path=null params={version=2.2&qt=standard&q=AddAColumn_s:Added&rows=20&start=0} hits=20 status=0 QTime=1 
[junit4:junit4]   2> 889 T46 C2 REQ [collection1] webapp=null path=null params={indent=true} status=0 QTime=0 
[junit4:junit4]   2> 890 T46 C2 REQ [collection1] webapp=null path=null params={indent=true} status=0 QTime=0 
[junit4:junit4]   2> 897 T46 C2 oashdc.ConfigParseUtil.verifyWithSchema id is a required field in SolrSchema . But not found in DataConfig
[junit4:junit4]   2> 898 T46 C2 oashd.DataImporter.loadDataConfig Data Configuration loaded successfully
[junit4:junit4]   2> 898 T46 C2 oashd.DataImporter.doDeltaImport Starting Delta Import
[junit4:junit4]   2> 899 T46 C2 oashd.SimplePropertiesWriter.readIndexerProperties Read dataimport.properties
[junit4:junit4]   2> 900 T46 C2 oashd.DocBuilder.doDelta Starting delta collection.
[junit4:junit4]   2> 900 T46 C2 oashd.DocBuilder.collectDelta Running ModifiedRowKey() for Entity: People
[junit4:junit4]   2> 901 T46 C2 oashd.JdbcDataSource$1.call Creating a connection for entity People with URL: jdbc:hsqldb:mem:.
[junit4:junit4]   2> 901 T46 C2 oashd.JdbcDataSource$1.call Time taken for getConnection(): 0
[junit4:junit4]   2> 905 T46 C2 oashd.DocBuilder.collectDelta Completed ModifiedRowKey for Entity: People rows obtained : 0
[junit4:junit4]   2> 906 T46 C2 oashd.DocBuilder.collectDelta Completed DeletedRowKey for Entity: People rows obtained : 0
[junit4:junit4]   2> 906 T46 C2 oashd.DocBuilder.collectDelta Completed parentDeltaQuery for Entity: People
[junit4:junit4]   2> 907 T46 C2 oashd.DocBuilder.doDelta Delta Import completed successfully
[junit4:junit4]   2> 907 T46 C2 oashd.DocBuilder.execute Time taken = 0:0:0.8
[junit4:junit4]   2> 908 T46 C2 UPDATE [collection1] webapp=null path=null params={commit=true&clean=false&dataConfig=<dataConfig>+%0a<dataSource+name%3D"hsqldb"+driver%3D"org.hsqldb.jdbcDriver"+url%3D"jdbc:hsqldb:mem:."+/>+%0a<document+name%3D"TestSqlEntityProcessor">+%0a<entity+name%3D"People"+pk%3D"People.ID"+processor%3D"SqlEntityProcessor"+dataSource%3D"hsqldb"+transformer%3D"TripleThreatTransformer"+query%3D"SELECT+ID,+NAME,+COUNTRY_CODE+FROM+PEOPLE+WHERE+DELETED+!%3D+'Y'+"+deletedPkQuery%3D"SELECT+ID+FROM+PEOPLE+WHERE+DELETED%3D'Y'+AND+last_modified+%26gt;%3D'${dih.last_index_time}'+"+deltaImportQuery%3D"SELECT+ID,+NAME,+COUNTRY_CODE+FROM+PEOPLE+where+ID%3D${dih.delta.ID}+"+deltaQuery%3D"SELECT+ID+FROM+PEOPLE+WHERE+DELETED!%3D'Y'+AND+last_modified+%26gt;%3D'${dih.last_index_time}'+UNION+DISTINCT+SELECT+ID+FROM+PEOPLE+WHERE+DELETED!%3D'Y'+AND+COUNTRY_CODE+IN+(SELECT+CODE+FROM+COUNTRIES+WHERE+last_modified+%26gt;%3D'${dih.last_index_time}')+"+>+%0a<field+column%3D"NAME"+name%3D"NAME_mult_s"+/>+%0a<field+column%3D"COUNTRY_CODE"+name%3D"COUNTRY_CODES_mult_s"+/>+%0a</entity>+%0a</document>+%0a</dataConfig>+%0a&command=delta-import&indent=true&synchronous=true} {} 0 15
[junit4:junit4]   2> 910 T46 C2 REQ [collection1] webapp=null path=null params={q=*:*&sort=id+asc&rows=48} hits=60 status=0 QTime=1 
[junit4:junit4]   2> 917 T46 C2 REQ [collection1] webapp=null path=null params={version=2.2&qt=standard&q=id:TripleThreat-1-*&rows=20&start=0} hits=20 status=0 QTime=1 
[junit4:junit4]   2> 924 T46 oas.SolrTestCaseJ4.assertQ SEVERE REQUEST FAILED: xpath=//*[@numFound='22']
[junit4:junit4]   2> 		xml response was: <?xml version="1.0" encoding="UTF-8"?>
[junit4:junit4]   2> 	<response>
[junit4:junit4]   2> 	<lst name="responseHeader"><int name="status">0</int><int name="QTime">1</int><lst name="params"><str name="version">2.2</str><str name="qt">standard</str><str name="q">id:TripleThreat-1-*</str><str name="rows">20</str><str name="start">0</str></lst></lst><result name="response" numFound="20" start="0"><doc><arr name="NAME_mult_s"><str>Jacob</str><str>bocaJ</str></arr><arr name="COUNTRY_CODES_mult_s"><str>NZ</str><str>ZN</str></arr><str name="id">TripleThreat-1-1</str><date name="timestamp">2012-11-08T12:11:31.393Z</date></doc><doc><arr name="NAME_mult_s"><str>Ethan</str><str>nahtE</str></arr><arr name="COUNTRY_CODES_mult_s"><str>NU</str><str>UN</str></arr><str name="id">TripleThreat-1-2</str><date name="timestamp">2012-11-08T12:11:31.393Z</date></doc><doc><arr name="NAME_mult_s"><str>Michael</str><str>leahciM</str></arr><arr name="COUNTRY_CODES_mult_s"><str>NR</str><str>RN</str></arr><str name="id">TripleThreat-1-3</str><date name="timestamp">2012-11-08T12:11:31.393Z</date></doc><doc><arr name="NAME_mult_s"><str>Jayden</str><str>nedyaJ</str></arr><arr name="COUNTRY_CODES_mult_s"><str>NP</str><str>PN</str></arr><str name="id">TripleThreat-1-4</str><date name="timestamp">2012-11-08T12:11:31.393Z</date></doc><doc><arr name="NAME_mult_s"><str>William</str><str>mailliW</str></arr><arr name="COUNTRY_CODES_mult_s"><str>NO</str><str>ON</str></arr><str name="id">TripleThreat-1-5</str><date name="timestamp">2012-11-08T12:11:31.393Z</date></doc><doc><arr name="NAME_mult_s"><str>Alexander</str><str>rednaxelA</str></arr><arr name="COUNTRY_CODES_mult_s"><str>NL</str><str>LN</str></arr><str name="id">TripleThreat-1-6</str><date name="timestamp">2012-11-08T12:11:31.393Z</date></doc><doc><arr name="NAME_mult_s"><str>Noah</str><str>haoN</str></arr><arr name="COUNTRY_CODES_mult_s"><str>NI</str><str>IN</str></arr><str name="id">TripleThreat-1-7</str><date name="timestamp">2012-11-08T12:11:31.393Z</date></doc><doc><arr name="NAME_mult_s"><str>Daniel</str><str>leinaD</str></arr><arr name="COUNTRY_CODES_mult_s"><str>NG</str><str>GN</str></arr><str name="id">TripleThreat-1-8</str><date name="timestamp">2012-11-08T12:11:31.393Z</date></doc><doc><arr name="NAME_mult_s"><str>Aiden</str><str>nediA</str></arr><arr name="COUNTRY_CODES_mult_s"><str>NF</str><str>FN</str></arr><str name="id">TripleThreat-1-9</str><date name="timestamp">2012-11-08T12:11:31.393Z</date></doc><doc><arr name="NAME_mult_s"><str>Anthony</str><str>ynohtnA</str></arr><arr name="COUNTRY_CODES_mult_s"><str>NE</str><str>EN</str></arr><str name="id">TripleThreat-1-10</str><date name="timestamp">2012-11-08T12:11:31.393Z</date></doc><doc><arr name="NAME_mult_s"><str>Emma</str><str>ammE</str></arr><arr name="COUNTRY_CODES_mult_s"><str>NL</str><str>LN</str></arr><str name="id">TripleThreat-1-11</str><date name="timestamp">2012-11-08T12:11:31.393Z</date></doc><doc><arr name="NAME_mult_s"><str>Grace</str><str>ecarG</str></arr><arr name="COUNTRY_CODES_mult_s"><str>NI</str><str>IN</str></arr><str name="id">TripleThreat-1-12</str><date name="timestamp">2012-11-08T12:11:31.393Z</date></doc><doc><arr name="NAME_mult_s"><str>Hailey</str><str>yeliaH</str></arr><arr name="COUNTRY_CODES_mult_s"><str>NG</str><str>GN</str></arr><str name="id">TripleThreat-1-13</str><date name="timestamp">2012-11-08T12:11:31.393Z</date></doc><doc><arr name="NAME_mult_s"><str>Isabella</str><str>allebasI</str></arr><arr name="COUNTRY_CODES_mult_s"><str>NF</str><str>FN</str></arr><str name="id">TripleThreat-1-14</str><date name="timestamp">2012-11-08T12:11:31.393Z</date></doc><doc><arr name="NAME_mult_s"><str>Lily</str><str>yliL</str></arr><arr name="COUNTRY_CODES_mult_s"><str>NE</str><str>EN</str></arr><str name="id">TripleThreat-1-15</str><date name="timestamp">2012-11-08T12:11:31.393Z</date></doc><doc><arr name="NAME_mult_s"><str>Madison</str><str>nosidaM</str></arr><arr name="COUNTRY_CODES_mult_s"><str>NC</str><str>CN</str></arr><str name="id">TripleThreat-1-16</str><date name="timestamp">2012-11-08T12:11:31.393Z</date></doc><doc><arr name="NAME_mult_s"><str>Mia</str><str>aiM</str></arr><arr name="COUNTRY_CODES_mult_s"><str>NA</str><str>AN</str></arr><str name="id">TripleThreat-1-17</str><date name="timestamp">2012-11-08T12:11:31.393Z</date></doc><doc><arr name="NAME_mult_s"><str>Natalie</str><str>eilataN</str></arr><arr name="COUNTRY_CODES_mult_s"><str>NZ</str><str>ZN</str></arr><str name="id">TripleThreat-1-18</str><date name="timestamp">2012-11-08T12:11:31.393Z</date></doc><doc><arr name="NAME_mult_s"><str>Olivia</str><str>aivilO</str></arr><arr name="COUNTRY_CODES_mult_s"><str>NU</str><str>UN</str></arr><str name="id">TripleThreat-1-19</str><date name="timestamp">2012-11-08T12:11:31.393Z</date></doc><doc><arr name="NAME_mult_s"><str>Samantha</str><str>ahtnamaS</str></arr><arr name="COUNTRY_CODES_mult_s"><str>NR</str><str>RN</str></arr><str name="id">TripleThreat-1-20</str><date name="timestamp">2012-11-08T12:11:31.393Z</date></doc></result>
[junit4:junit4]   2> 	</response>
[junit4:junit4]   2> 	
[junit4:junit4]   2> 		request was:version=2.2&qt=standard&q=id:TripleThreat-1-*&rows=20&start=0
[junit4:junit4]   2> 925 T46 oasc.SolrException.log SEVERE REQUEST FAILED: version=2.2&qt=standard&q=id:TripleThreat-1-*&rows=20&start=0:java.lang.RuntimeException: REQUEST FAILED: xpath=//*[@numFound='22']
[junit4:junit4]   2> 		xml response was: <?xml version="1.0" encoding="UTF-8"?>
[junit4:junit4]   2> 	<response>
[junit4:junit4]   2> 	<lst name="responseHeader"><int name="status">0</int><int name="QTime">1</int><lst name="params"><str name="version">2.2</str><str name="qt">standard</str><str name="q">id:TripleThreat-1-*</str><str name="rows">20</str><str name="start">0</str></lst></lst><result name="response" numFound="20" start="0"><doc><arr name="NAME_mult_s"><str>Jacob</str><str>bocaJ</str></arr><arr name="COUNTRY_CODES_mult_s"><str>NZ</str><str>ZN</str></arr><str name="id">TripleThreat-1-1</str><date name="timestamp">2012-11-08T12:11:31.393Z</date></doc><doc><arr name="NAME_mult_s"><str>Ethan</str><str>nahtE</str></arr><arr name="COUNTRY_CODES_mult_s"><str>NU</str><str>UN</str></arr><str name="id">TripleThreat-1-2</str><date name="timestamp">2012-11-08T12:11:31.393Z</date></doc><doc><arr name="NAME_mult_s"><str>Michael</str><str>leahciM</str></arr><arr name="COUNTRY_CODES_mult_s"><str>NR</str><str>RN</str></arr><str name="id">TripleThreat-1-3</str><date name="timestamp">2012-11-08T12:11:31.393Z</date></doc><doc><arr name="NAME_mult_s"><str>Jayden</str><str>nedyaJ</str></arr><arr name="COUNTRY_CODES_mult_s"><str>NP</str><str>PN</str></arr><str name="id">TripleThreat-1-4</str><date name="timestamp">2012-11-08T12:11:31.393Z</date></doc><doc><arr name="NAME_mult_s"><str>William</str><str>mailliW</str></arr><arr name="COUNTRY_CODES_mult_s"><str>NO</str><str>ON</str></arr><str name="id">TripleThreat-1-5</str><date name="timestamp">2012-11-08T12:11:31.393Z</date></doc><doc><arr name="NAME_mult_s"><str>Alexander</str><str>rednaxelA</str></arr><arr name="COUNTRY_CODES_mult_s"><str>NL</str><str>LN</str></arr><str name="id">TripleThreat-1-6</str><date name="timestamp">2012-11-08T12:11:31.393Z</date></doc><doc><arr name="NAME_mult_s"><str>Noah</str><str>haoN</str></arr><arr name="COUNTRY_CODES_mult_s"><str>NI</str><str>IN</str></arr><str name="id">TripleThreat-1-7</str><date name="timestamp">2012-11-08T12:11:31.393Z</date></doc><doc><arr name="NAME_mult_s"><str>Daniel</str><str>leinaD</str></arr><arr name="COUNTRY_CODES_mult_s"><str>NG</str><str>GN</str></arr><str name="id">TripleThreat-1-8</str><date name="timestamp">2012-11-08T12:11:31.393Z</date></doc><doc><arr name="NAME_mult_s"><str>Aiden</str><str>nediA</str></arr><arr name="COUNTRY_CODES_mult_s"><str>NF</str><str>FN</str></arr><str name="id">TripleThreat-1-9</str><date name="timestamp">2012-11-08T12:11:31.393Z</date></doc><doc><arr name="NAME_mult_s"><str>Anthony</str><str>ynohtnA</str></arr><arr name="COUNTRY_CODES_mult_s"><str>NE</str><str>EN</str></arr><str name="id">TripleThreat-1-10</str><date name="timestamp">2012-11-08T12:11:31.393Z</date></doc><doc><arr name="NAME_mult_s"><str>Emma</str><str>ammE</str></arr><arr name="COUNTRY_CODES_mult_s"><str>NL</str><str>LN</str></arr><str name="id">TripleThreat-1-11</str><date name="timestamp">2012-11-08T12:11:31.393Z</date></doc><doc><arr name="NAME_mult_s"><str>Grace</str><str>ecarG</str></arr><arr name="COUNTRY_CODES_mult_s"><str>NI</str><str>IN</str></arr><str name="id">TripleThreat-1-12</str><date name="timestamp">2012-11-08T12:11:31.393Z</date></doc><doc><arr name="NAME_mult_s"><str>Hailey</str><str>yeliaH</str></arr><arr name="COUNTRY_CODES_mult_s"><str>NG</str><str>GN</str></arr><str name="id">TripleThreat-1-13</str><date name="timestamp">2012-11-08T12:11:31.393Z</date></doc><doc><arr name="NAME_mult_s"><str>Isabella</str><str>allebasI</str></arr><arr name="COUNTRY_CODES_mult_s"><str>NF</str><str>FN</str></arr><str name="id">TripleThreat-1-14</str><date name="timestamp">2012-11-08T12:11:31.393Z</date></doc><doc><arr name="NAME_mult_s"><str>Lily</str><str>yliL</str></arr><arr name="COUNTRY_CODES_mult_s"><str>NE</str><str>EN</str></arr><str name="id">TripleThreat-1-15</str><date name="timestamp">2012-11-08T12:11:31.393Z</date></doc><doc><arr name="NAME_mult_s"><str>Madison</str><str>nosidaM</str></arr><arr name="COUNTRY_CODES_mult_s"><str>NC</str><str>CN</str></arr><str name="id">TripleThreat-1-16</str><date name="timestamp">2012-11-08T12:11:31.393Z</date></doc><doc><arr name="NAME_mult_s"><str>Mia</str><str>aiM</str></arr><arr name="COUNTRY_CODES_mult_s"><str>NA</str><str>AN</str></arr><str name="id">TripleThreat-1-17</str><date name="timestamp">2012-11-08T12:11:31.393Z</date></doc><doc><arr name="NAME_mult_s"><str>Natalie</str><str>eilataN</str></arr><arr name="COUNTRY_CODES_mult_s"><str>NZ</str><str>ZN</str></arr><str name="id">TripleThreat-1-18</str><date name="timestamp">2012-11-08T12:11:31.393Z</date></doc><doc><arr name="NAME_mult_s"><str>Olivia</str><str>aivilO</str></arr><arr name="COUNTRY_CODES_mult_s"><str>NU</str><str>UN</str></arr><str name="id">TripleThreat-1-19</str><date name="timestamp">2012-11-08T12:11:31.393Z</date></doc><doc><arr name="NAME_mult_s"><str>Samantha</str><str>ahtnamaS</str></arr><arr name="COUNTRY_CODES_mult_s"><str>NR</str><str>RN</str></arr><str name="id">TripleThreat-1-20</str><date name="timestamp">2012-11-08T12:11:31.393Z</date></doc></result>
[junit4:junit4]   2> 	</response>
[junit4:junit4]   2> 	
[junit4:junit4]   2> 		request was:version=2.2&qt=standard&q=id:TripleThreat-1-*&rows=20&start=0
[junit4:junit4]   2> 		at org.apache.solr.SolrTestCaseJ4.assertQ(SolrTestCaseJ4.java:506)
[junit4:junit4]   2> 		at org.apache.solr.SolrTestCaseJ4.assertQ(SolrTestCaseJ4.java:480)
[junit4:junit4]   2> 		at org.apache.solr.handler.dataimport.AbstractDIHJdbcTestCase.complexTransform(AbstractDIHJdbcTestCase.java:120)
[junit4:junit4]   2> 		at org.apache.solr.handler.dataimport.TestSqlEntityProcessorDelta.testWithComplexTransformer(TestSqlEntityProcessorDelta.java:58)
[junit4:junit4]   2> 		at sun.reflect.NativeMethodAccessorImpl.invoke0(Native Method)
[junit4:junit4]   2> 		at sun.reflect.NativeMethodAccessorImpl.invoke(NativeMethodAccessorImpl.java:57)
[junit4:junit4]   2> 		at sun.reflect.DelegatingMethodAccessorImpl.invoke(DelegatingMethodAccessorImpl.java:43)
[junit4:junit4]   2> 		at java.lang.reflect.Method.invoke(Method.java:474)
[junit4:junit4]   2> 		at com.carrotsearch.randomizedtesting.RandomizedRunner.invoke(RandomizedRunner.java:1559)
[junit4:junit4]   2> 		at com.carrotsearch.randomizedtesting.RandomizedRunner.access$600(RandomizedRunner.java:79)
[junit4:junit4]   2> 		at com.carrotsearch.randomizedtesting.RandomizedRunner$6.evaluate(RandomizedRunner.java:737)
[junit4:junit4]   2> 		at com.carrotsearch.randomizedtesting.RandomizedRunner$7.evaluate(RandomizedRunner.java:773)
[junit4:junit4]   2> 		at com.carrotsearch.randomizedtesting.RandomizedRunner$8.evaluate(RandomizedRunner.java:787)
[junit4:junit4]   2> 		at com.carrotsearch.randomizedtesting.rules.SystemPropertiesRestoreRule$1.evaluate(SystemPropertiesRestoreRule.java:53)
[junit4:junit4]   2> 		at org.apache.lucene.util.TestRuleSetupTeardownChained$1.evaluate(TestRuleSetupTeardownChained.java:50)
[junit4:junit4]   2> 		at org.apache.lucene.util.TestRuleFieldCacheSanity$1.evaluate(TestRuleFieldCacheSanity.java:51)
[junit4:junit4]   2> 		at org.apache.lucene.util.AbstractBeforeAfterRule$1.evaluate(AbstractBeforeAfterRule.java:45)
[junit4:junit4]   2> 		at com.carrotsearch.randomizedtesting.rules.SystemPropertiesInvariantRule$1.evaluate(SystemPropertiesInvariantRule.java:55)
[junit4:junit4]   2> 		at org.apache.lucene.util.TestRuleThreadAndTestName$1.evaluate(TestRuleThreadAndTestName.java:48)
[junit4:junit4]   2> 		at org.apache.lucene.util.TestRuleIgnoreAfterMaxFailures$1.evaluate(TestRuleIgnoreAfterMaxFailures.java:70)
[junit4:junit4]   2> 		at org.apache.lucene.util.TestRuleMarkFailure$1.evaluate(TestRuleMarkFailure.java:48)
[junit4:junit4]   2> 		at com.carrotsearch.randomizedtesting.rules.StatementAdapter.evaluate(StatementAdapter.java:36)
[junit4:junit4]   2> 		at com.carrotsearch.randomizedtesting.ThreadLeakControl$StatementRunner.run(ThreadLeakControl.java:358)
[junit4:junit4]   2> 		at com.carrotsearch.randomizedtesting.ThreadLeakControl.forkTimeoutingTask(ThreadLeakControl.java:782)
[junit4:junit4]   2> 		at com.carrotsearch.randomizedtesting.ThreadLeakControl$3.evaluate(ThreadLeakControl.java:442)
[junit4:junit4]   2> 		at com.carrotsearch.randomizedtesting.RandomizedRunner.runSingleTest(RandomizedRunner.java:746)
[junit4:junit4]   2> 		at com.carrotsearch.randomizedtesting.RandomizedRunner$3.evaluate(RandomizedRunner.java:648)
[junit4:junit4]   2> 		at com.carrotsearch.randomizedtesting.RandomizedRunner$4.evaluate(RandomizedRunner.java:682)
[junit4:junit4]   2> 		at com.carrotsearch.randomizedtesting.RandomizedRunner$5.evaluate(RandomizedRunner.java:693)
[junit4:junit4]   2> 		at com.carrotsearch.randomizedtesting.rules.StatementAdapter.evaluate(StatementAdapter.java:36)
[junit4:junit4]   2> 		at com.carrotsearch.randomizedtesting.rules.SystemPropertiesRestoreRule$1.evaluate(SystemPropertiesRestoreRule.java:53)
[junit4:junit4]   2> 		at org.apache.lucene.util.AbstractBeforeAfterRule$1.evaluate(AbstractBeforeAfterRule.java:45)
[junit4:junit4]   2> 		at org.apache.lucene.util.TestRuleStoreClassName$1.evaluate(TestRuleStoreClassName.java:42)
[junit4:junit4]   2> 		at com.carrotsearch.randomizedtesting.rules.SystemPropertiesInvariantRule$1.evaluate(SystemPropertiesInvariantRule.java:55)
[junit4:junit4]   2> 		at com.carrotsearch.randomizedtesting.rules.NoShadowingOrOverridesOnMethodsRule$1.evaluate(NoShadowingOrOverridesOnMethodsRule.java:39)
[junit4:junit4]   2> 		at com.carrotsearch.randomizedtesting.rules.NoShadowingOrOverridesOnMethodsRule$1.evaluate(NoShadowingOrOverridesOnMethodsRule.java:39)
[junit4:junit4]   2> 		at com.carrotsearch.randomizedtesting.rules.StatementAdapter.evaluate(StatementAdapter.java:36)
[junit4:junit4]   2> 		at org.apache.lucene.util.TestRuleAssertionsRequired$1.evaluate(TestRuleAssertionsRequired.java:43)
[junit4:junit4]   2> 		at org.apache.lucene.util.TestRuleMarkFailure$1.evaluate(TestRuleMarkFailure.java:48)
[junit4:junit4]   2> 		at org.apache.lucene.util.TestRuleIgnoreAfterMaxFailures$1.evaluate(TestRuleIgnoreAfterMaxFailures.java:70)
[junit4:junit4]   2> 		at org.apache.lucene.util.TestRuleIgnoreTestSuites$1.evaluate(TestRuleIgnoreTestSuites.java:55)
[junit4:junit4]   2> 		at com.carrotsearch.randomizedtesting.rules.StatementAdapter.evaluate(StatementAdapter.java:36)
[junit4:junit4]   2> 		at com.carrotsearch.randomizedtesting.ThreadLeakControl$StatementRunner.run(ThreadLeakControl.java:358)
[junit4:junit4]   2> 		at java.lang.Thread.run(Thread.java:722)
[junit4:junit4]   2> 	
[junit4:junit4]   2> 938 T46 oashd.AbstractDataImportHandlerTestCase.tearDown Looking for dataimport.properties at: /mnt/ssd/jenkins/workspace/Lucene-Solr-4.x-Linux/solr/build/contrib/solr-dataimporthandler/test/J1/solr/collection1/conf/dataimport.properties
[junit4:junit4]   2> 939 T46 oas.SolrTestCaseJ4.tearDown ###Ending testWithComplexTransformer
[junit4:junit4]   2> NOTE: reproduce with: ant test  -Dtestcase=TestSqlEntityProcessorDelta -Dtests.method=testWithComplexTransformer -Dtests.seed=103A3F6EAC3C5255 -Dtests.multiplier=3 -Dtests.slow=true -Dtests.locale=th_TH_TH_#u-nu-thai -Dtests.timezone=Asia/Chongqing -Dtests.file.encoding=UTF-8
[junit4:junit4] ERROR   0.30s J1 | TestSqlEntityProcessorDelta.testWithComplexTransformer <<<
[junit4:junit4]    > Throwable #1: java.lang.RuntimeException: Exception during query
[junit4:junit4]    > 	at __randomizedtesting.SeedInfo.seed([103A3F6EAC3C5255:7A304EE5C7CA5CE8]:0)
[junit4:junit4]    > 	at org.apache.solr.SolrTestCaseJ4.assertQ(SolrTestCaseJ4.java:513)
[junit4:junit4]    > 	at org.apache.solr.SolrTestCaseJ4.assertQ(SolrTestCaseJ4.java:480)
[junit4:junit4]    > 	at org.apache.solr.handler.dataimport.AbstractDIHJdbcTestCase.complexTransform(AbstractDIHJdbcTestCase.java:120)
[junit4:junit4]    > 	at org.apache.solr.handler.dataimport.TestSqlEntityProcessorDelta.testWithComplexTransformer(TestSqlEntityProcessorDelta.java:58)
[junit4:junit4]    > 	at sun.reflect.NativeMethodAccessorImpl.invoke0(Native Method)
[junit4:junit4]    > 	at sun.reflect.NativeMethodAccessorImpl.invoke(NativeMethodAccessorImpl.java:57)
[junit4:junit4]    > 	at sun.reflect.DelegatingMethodAccessorImpl.invoke(DelegatingMethodAccessorImpl.java:43)
[junit4:junit4]    > 	at java.lang.reflect.Method.invoke(Method.java:474)
[junit4:junit4]    > 	at com.carrotsearch.randomizedtesting.RandomizedRunner.invoke(RandomizedRunner.java:1559)
[junit4:junit4]    > 	at com.carrotsearch.randomizedtesting.RandomizedRunner.access$600(RandomizedRunner.java:79)
[junit4:junit4]    > 	at com.carrotsearch.randomizedtesting.RandomizedRunner$6.evaluate(RandomizedRunner.java:737)
[junit4:junit4]    > 	at com.carrotsearch.randomizedtesting.RandomizedRunner$7.evaluate(RandomizedRunner.java:773)
[junit4:junit4]    > 	at com.carrotsearch.randomizedtesting.RandomizedRunner$8.evaluate(RandomizedRunner.java:787)
[junit4:junit4]    > 	at com.carrotsearch.randomizedtesting.rules.SystemPropertiesRestoreRule$1.evaluate(SystemPropertiesRestoreRule.java:53)
[junit4:junit4]    > 	at org.apache.lucene.util.TestRuleSetupTeardownChained$1.evaluate(TestRuleSetupTeardownChained.java:50)
[junit4:junit4]    > 	at org.apache.lucene.util.TestRuleFieldCacheSanity$1.evaluate(TestRuleFieldCacheSanity.java:51)
[junit4:junit4]    > 	at org.apache.lucene.util.AbstractBeforeAfterRule$1.evaluate(AbstractBeforeAfterRule.java:45)
[junit4:junit4]    > 	at com.carrotsearch.randomizedtesting.rules.SystemPropertiesInvariantRule$1.evaluate(SystemPropertiesInvariantRule.java:55)
[junit4:junit4]    > 	at org.apache.lucene.util.TestRuleThreadAndTestName$1.evaluate(TestRuleThreadAndTestName.java:48)
[junit4:junit4]    > 	at org.apache.lucene.util.TestRuleIgnoreAfterMaxFailures$1.evaluate(TestRuleIgnoreAfterMaxFailures.java:70)
[junit4:junit4]    > 	at org.apache.lucene.util.TestRuleMarkFailure$1.evaluate(TestRuleMarkFailure.java:48)
[junit4:junit4]    > 	at com.carrotsearch.randomizedtesting.rules.StatementAdapter.evaluate(StatementAdapter.java:36)
[junit4:junit4]    > 	at com.carrotsearch.randomizedtesting.ThreadLeakControl$StatementRunner.run(ThreadLeakControl.java:358)
[junit4:junit4]    > 	at com.carrotsearch.randomizedtesting.ThreadLeakControl.forkTimeoutingTask(ThreadLeakControl.java:782)
[junit4:junit4]    > 	at com.carrotsearch.randomizedtesting.ThreadLeakControl$3.evaluate(ThreadLeakControl.java:442)
[junit4:junit4]    > 	at com.carrotsearch.randomizedtesting.RandomizedRunner.runSingleTest(RandomizedRunner.java:746)
[junit4:junit4]    > 	at com.carrotsearch.randomizedtesting.RandomizedRunner$3.evaluate(RandomizedRunner.java:648)
[junit4:junit4]    > 	at com.carrotsearch.randomizedtesting.RandomizedRunner$4.evaluate(RandomizedRunner.java:682)
[junit4:junit4]    > 	at com.carrotsearch.randomizedtesting.RandomizedRunner$5.evaluate(RandomizedRunner.java:693)
[junit4:junit4]    > 	at com.carrotsearch.randomizedtesting.rules.StatementAdapter.evaluate(StatementAdapter.java:36)
[junit4:junit4]    > 	at com.carrotsearch.randomizedtesting.rules.SystemPropertiesRestoreRule$1.evaluate(SystemPropertiesRestoreRule.java:53)
[junit4:junit4]    > 	at org.apache.lucene.util.AbstractBeforeAfterRule$1.evaluate(AbstractBeforeAfterRule.java:45)
[junit4:junit4]    > 	at org.apache.lucene.util.TestRuleStoreClassName$1.evaluate(TestRuleStoreClassName.java:42)
[junit4:junit4]    > 	at com.carrotsearch.randomizedtesting.rules.SystemPropertiesInvariantRule$1.evaluate(SystemPropertiesInvariantRule.java:55)
[junit4:junit4]    > 	at com.carrotsearch.randomizedtesting.rules.NoShadowingOrOverridesOnMethodsRule$1.evaluate(NoShadowingOrOverridesOnMethodsRule.java:39)
[junit4:junit4]    > 	at com.carrotsearch.randomizedtesting.rules.NoShadowingOrOverridesOnMethodsRule$1.evaluate(NoShadowingOrOverridesOnMethodsRule.java:39)
[junit4:junit4]    > 	at com.carrotsearch.randomizedtesting.rules.StatementAdapter.evaluate(StatementAdapter.java:36)
[junit4:junit4]    > 	at org.apache.lucene.util.TestRuleAssertionsRequired$1.evaluate(TestRuleAssertionsRequired.java:43)
[junit4:junit4]    > 	at org.apache.lucene.util.TestRuleMarkFailure$1.evaluate(TestRuleMarkFailure.java:48)
[junit4:junit4]    > 	at org.apache.lucene.util.TestRuleIgnoreAfterMaxFailures$1.evaluate(TestRuleIgnoreAfterMaxFailures.java:70)
[junit4:junit4]    > 	at org.apache.lucene.util.TestRuleIgnoreTestSuites$1.evaluate(TestRuleIgnoreTestSuites.java:55)
[junit4:junit4]    > 	at com.carrotsearch.randomizedtesting.rules.StatementAdapter.evaluate(StatementAdapter.java:36)
[junit4:junit4]    > 	at com.carrotsearch.randomizedtesting.ThreadLeakControl$StatementRunner.run(ThreadLeakControl.java:358)
[junit4:junit4]    > 	at java.lang.Thread.run(Thread.java:722)
[junit4:junit4]    > Caused by: java.lang.RuntimeException: REQUEST FAILED: xpath=//*[@numFound='22']
[junit4:junit4]    > 	xml response was: <?xml version="1.0" encoding="UTF-8"?>
[junit4:junit4]    > <response>
[junit4:junit4]    > <lst name="responseHeader"><int name="status">0</int><int name="QTime">1</int><lst name="params"><str name="version">2.2</str><str name="qt">standard</str><str name="q">id:TripleThreat-1-*</str><str name="rows">20</str><str name="start">0</str></lst></lst><result name="response" numFound="20" start="0"><doc><arr name="NAME_mult_s"><str>Jacob</str><str>bocaJ</str></arr><arr name="COUNTRY_CODES_mult_s"><str>NZ</str><str>ZN</str></arr><str name="id">TripleThreat-1-1</str><date name="timestamp">2012-11-08T12:11:31.393Z</date></doc><doc><arr name="NAME_mult_s"><str>Ethan</str><str>nahtE</str></arr><arr name="COUNTRY_CODES_mult_s"><str>NU</str><str>UN</str></arr><str name="id">TripleThreat-1-2</str><date name="timestamp">2012-11-08T12:11:31.393Z</date></doc><doc><arr name="NAME_mult_s"><str>Michael</str><str>leahciM</str></arr><arr name="COUNTRY_CODES_mult_s"><str>NR</str><str>RN</str></arr><str name="id">TripleThreat-1-3</str><date name="timestamp">2012-11-08T12:11:31.393Z</date></doc><doc><arr name="NAME_mult_s"><str>Jayden</str><str>nedyaJ</str></arr><arr name="COUNTRY_CODES_mult_s"><str>NP</str><str>PN</str></arr><str name="id">TripleThreat-1-4</str><date name="timestamp">2012-11-08T12:11:31.393Z</date></doc><doc><arr name="NAME_mult_s"><str>William</str><str>mailliW</str></arr><arr name="COUNTRY_CODES_mult_s"><str>NO</str><str>ON</str></arr><str name="id">TripleThreat-1-5</str><date name="timestamp">2012-11-08T12:11:31.393Z</date></doc><doc><arr name="NAME_mult_s"><str>Alexander</str><str>rednaxelA</str></arr><arr name="COUNTRY_CODES_mult_s"><str>NL</str><str>LN</str></arr><str name="id">TripleThreat-1-6</str><date name="timestamp">2012-11-08T12:11:31.393Z</date></doc><doc><arr name="NAME_mult_s"><str>Noah</str><str>haoN</str></arr><arr name="COUNTRY_CODES_mult_s"><str>NI</str><str>IN</str></arr><str name="id">TripleThreat-1-7</str><date name="timestamp">2012-11-08T12:11:31.393Z</date></doc><doc><arr name="NAME_mult_s"><str>Daniel</str><str>leinaD</str></arr><arr name="COUNTRY_CODES_mult_s"><str>NG</str><str>GN</str></arr><str name="id">TripleThreat-1-8</str><date name="timestamp">2012-11-08T12:11:31.393Z</date></doc><doc><arr name="NAME_mult_s"><str>Aiden</str><str>nediA</str></arr><arr name="COUNTRY_CODES_mult_s"><str>NF</str><str>FN</str></arr><str name="id">TripleThreat-1-9</str><date name="timestamp">2012-11-08T12:11:31.393Z</date></doc><doc><arr name="NAME_mult_s"><str>Anthony</str><str>ynohtnA</str></arr><arr name="COUNTRY_CODES_mult_s"><str>NE</str><str>EN</str></arr><str name="id">TripleThreat-1-10</str><date name="timestamp">2012-11-08T12:11:31.393Z</date></doc><doc><arr name="NAME_mult_s"><str>Emma</str><str>ammE</str></arr><arr name="COUNTRY_CODES_mult_s"><str>NL</str><str>LN</str></arr><str name="id">TripleThreat-1-11</str><date name="timestamp">2012-11-08T12:11:31.393Z</date></doc><doc><arr name="NAME_mult_s"><str>Grace</str><str>ecarG</str></arr><arr name="COUNTRY_CODES_mult_s"><str>NI</str><str>IN</str></arr><str name="id">TripleThreat-1-12</str><date name="timestamp">2012-11-08T12:11:31.393Z</date></doc><doc><arr name="NAME_mult_s"><str>Hailey</str><str>yeliaH</str></arr><arr name="COUNTRY_CODES_mult_s"><str>NG</str><str>GN</str></arr><str name="id">TripleThreat-1-13</str><date name="timestamp">2012-11-08T12:11:31.393Z</date></doc><doc><arr name="NAME_mult_s"><str>Isabella</str><str>allebasI</str></arr><arr name="COUNTRY_CODES_mult_s"><str>NF</str><str>FN</str></arr><str name="id">TripleThreat-1-14</str><date name="timestamp">2012-11-08T12:11:31.393Z</date></doc><doc><arr name="NAME_mult_s"><str>Lily</str><str>yliL</str></arr><arr name="COUNTRY_CODES_mult_s"><str>NE</str><str>EN</str></arr><str name="id">TripleThreat-1-15</str><date name="timestamp">2012-11-08T12:11:31.393Z</date></doc><doc><arr name="NAME_mult_s"><str>Madison</str><str>nosidaM</str></arr><arr name="COUNTRY_CODES_mult_s"><str>NC</str><str>CN</str></arr><str name="id">TripleThreat-1-16</str><date name="timestamp">2012-11-08T12:11:31.393Z</date></doc><doc><arr name="NAME_mult_s"><str>Mia</str><str>aiM</str></arr><arr name="COUNTRY_CODES_mult_s"><str>NA</str><str>AN</str></arr><str name="id">TripleThreat-1-17</str><date name="timestamp">2012-11-08T12:11:31.393Z</date></doc><doc><arr name="NAME_mult_s"><str>Natalie</str><str>eilataN</str></arr><arr name="COUNTRY_CODES_mult_s"><str>NZ</str><str>ZN</str></arr><str name="id">TripleThreat-1-18</str><date name="timestamp">2012-11-08T12:11:31.393Z</date></doc><doc><arr name="NAME_mult_s"><str>Olivia</str><str>aivilO</str></arr><arr name="COUNTRY_CODES_mult_s"><str>NU</str><str>UN</str></arr><str name="id">TripleThreat-1-19</str><date name="timestamp">2012-11-08T12:11:31.393Z</date></doc><doc><arr name="NAME_mult_s"><str>Samantha</str><str>ahtnamaS</str></arr><arr name="COUNTRY_CODES_mult_s"><str>NR</str><str>RN</str></arr><str name="id">TripleThreat-1-20</str><date name="timestamp">2012-11-08T12:11:31.393Z</date></doc></result>
[junit4:junit4]    > </response>
[junit4:junit4]    > 
[junit4:junit4]    > 	request was:version=2.2&qt=standard&q=id:TripleThreat-1-*&rows=20&start=0
[junit4:junit4]    > 	at org.apache.solr.SolrTestCaseJ4.assertQ(SolrTestCaseJ4.java:506)
[junit4:junit4]    > 	... 43 more
[junit4:junit4]   2> 949 T46 oas.SolrTestCaseJ4.setUp ###Starting testChildEntities
[junit4:junit4]   2> 952 T46 C2 oasu.DirectUpdateHandler2.deleteAll [collection1] REMOVING ALL DOCUMENTS FROM INDEX
[junit4:junit4]   2> 953 T46 C2 UPDATE [collection1] webapp=null path=null params={} {deleteByQuery=*:*} 0 1
[junit4:junit4]   2> 957 T46 C2 oasu.DirectUpdateHandler2.commit start commit{flags=0,_version_=0,optimize=false,openSearcher=true,waitSearcher=true,expungeDeletes=false,softCommit=false}
[junit4:junit4]   2> 958 T46 C2 oasc.SolrDeletionPolicy.onCommit SolrDeletionPolicy.onCommit: commits:num=2
[junit4:junit4]   2> 		commit{dir=MockDirWrapper(org.apache.lucene.store.RAMDirectory@935b3cd lockFactory=org.apache.lucene.store.NativeFSLockFactory@74ded67c),segFN=segments_5,generation=5,filenames=[_1.fdt, _1.fdx, _1_Lucene40_0.frq, _1.si, _1_Lucene40_0.tim, _1_Lucene40_0.tip, _1.fnm, segments_5]
[junit4:junit4]   2> 		commit{dir=MockDirWrapper(org.apache.lucene.store.RAMDirectory@935b3cd lockFactory=org.apache.lucene.store.NativeFSLockFactory@74ded67c),segFN=segments_6,generation=6,filenames=[segments_6]
[junit4:junit4]   2> 959 T46 C2 oasc.SolrDeletionPolicy.updateCommits newest commit = 6
[junit4:junit4]   2> 960 T46 C2 oass.SolrIndexSearcher.<init> Opening Searcher@2b7a73c1 main
[junit4:junit4]   2> 960 T46 C2 oass.SolrIndexSearcher.getIndexDir WARNING WARNING: Directory impl does not support setting indexDir: org.apache.lucene.store.MockDirectoryWrapper
[junit4:junit4]   2> 960 T46 C2 oasu.DirectUpdateHandler2.commit end_commit_flush
[junit4:junit4]   2> 961 T47 oasc.QuerySenderListener.newSearcher QuerySenderListener sending requests to Searcher@2b7a73c1 main{StandardDirectoryReader(segments_6:10)}
[junit4:junit4]   2> 961 T47 C2 REQ [collection1] webapp=null path=null params={distrib=false&q=solr&event=newSearcher&rows=10&start=0} hits=0 status=0 QTime=0 
[junit4:junit4]   2> 962 T47 C2 REQ [collection1] webapp=null path=null params={distrib=false&q=rocks&event=newSearcher&rows=10&start=0} hits=0 status=0 QTime=0 
[junit4:junit4]   2> 962 T47 C2 REQ [collection1] webapp=null path=null params={distrib=false&q=static+newSearcher+warming+query+from+solrconfig.xml&event=newSearcher} hits=0 status=0 QTime=0 
[junit4:junit4]   2> 962 T47 oasc.QuerySenderListener.newSearcher QuerySenderListener done.
[junit4:junit4]   2> 963 T47 oasc.SolrCore.registerSearcher [collection1] Registered new searcher Searcher@2b7a73c1 main{StandardDirectoryReader(segments_6:10)}
[junit4:junit4]   2> 963 T46 C2 UPDATE [collection1] webapp=null path=null params={} {commit=} 0 6
[junit4:junit4]   2> 971 T46 C2 oashdc.ConfigParseUtil.verifyWithSchema id is a required field in SolrSchema . But not found in DataConfig
[junit4:junit4]   2> 972 T46 C2 oashd.DataImporter.loadDataConfig Data Configuration loaded successfully
[junit4:junit4]   2> 972 T46 C2 oashd.DataImporter.doFullImport Starting Full Import
[junit4:junit4]   2> 973 T46 C2 oashd.SimplePropertiesWriter.readIndexerProperties Read dataimport.properties
[junit4:junit4]   2> 974 T46 C2 oasu.DirectUpdateHandler2.deleteAll [collection1] REMOVING ALL DOCUMENTS FROM INDEX
[junit4:junit4]   2> 975 T46 C2 oashd.JdbcDataSource$1.call Creating a connection for entity People with URL: jdbc:hsqldb:mem:.
[junit4:junit4]   2> 976 T46 C2 oashd.JdbcDataSource$1.call Time taken for getConnection(): 0
[junit4:junit4]   2> 977 T46 C2 oashd.JdbcDataSource$1.call Creating a connection for entity Countries with URL: jdbc:hsqldb:mem:.
[junit4:junit4]   2> 977 T46 C2 oashd.JdbcDataSource$1.call Time taken for getConnection(): 0
[junit4:junit4]   2> 992 T46 C2 oashd.DocBuilder.finish Import completed successfully
[junit4:junit4]   2> 992 T46 C2 oasu.DirectUpdateHandler2.commit start commit{flags=0,_version_=0,optimize=false,openSearcher=true,waitSearcher=true,expungeDeletes=false,softCommit=false}
[junit4:junit4]   2> 997 T46 C2 oasc.SolrDeletionPolicy.onCommit SolrDeletionPolicy.onCommit: commits:num=2
[junit4:junit4]   2> 		commit{dir=MockDirWrapper(org.apache.lucene.store.RAMDirectory@935b3cd lockFactory=org.apache.lucene.store.NativeFSLockFactory@74ded67c),segFN=segments_6,generation=6,filenames=[segments_6]
[junit4:junit4]   2> 		commit{dir=MockDirWrapper(org.apache.lucene.store.RAMDirectory@935b3cd lockFactory=org.apache.lucene.store.NativeFSLockFactory@74ded67c),segFN=segments_7,generation=7,filenames=[_2_Lucene40_0.frq, _2_Lucene40_0.tim, _2_Lucene40_0.tip, segments_7, _2.si, _2.fdt, _2.fdx, _2.fnm]
[junit4:junit4]   2> 998 T46 C2 oasc.SolrDeletionPolicy.updateCommits newest commit = 7
[junit4:junit4]   2> 1000 T46 C2 oass.SolrIndexSearcher.<init> Opening Searcher@25cd81a main
[junit4:junit4]   2> 1000 T46 C2 oass.SolrIndexSearcher.getIndexDir WARNING WARNING: Directory impl does not support setting indexDir: org.apache.lucene.store.MockDirectoryWrapper
[junit4:junit4]   2> 1001 T46 C2 oasu.DirectUpdateHandler2.commit end_commit_flush
[junit4:junit4]   2> 1003 T47 oasc.QuerySenderListener.newSearcher QuerySenderListener sending requests to Searcher@25cd81a main{StandardDirectoryReader(segments_7:13 _2(4.1):C20)}
[junit4:junit4]   2> 1004 T47 C2 REQ [collection1] webapp=null path=null params={distrib=false&q=solr&event=newSearcher&rows=10&start=0} hits=0 status=0 QTime=1 
[junit4:junit4]   2> 1004 T47 C2 REQ [collection1] webapp=null path=null params={distrib=false&q=rocks&event=newSearcher&rows=10&start=0} hits=0 status=0 QTime=0 
[junit4:junit4]   2> 1005 T47 C2 REQ [collection1] webapp=null path=null params={distrib=false&q=static+newSearcher+warming+query+from+solrconfig.xml&event=newSearcher} hits=0 status=0 QTime=1 
[junit4:junit4]   2> 1005 T47 oasc.QuerySenderListener.newSearcher QuerySenderListener done.
[junit4:junit4]   2> 1005 T47 oasc.SolrCore.registerSearcher [collection1] Registered new searcher Searcher@25cd81a main{StandardDirectoryReader(segments_7:13 _2(4.1):C20)}
[junit4:junit4]   2> 1007 T46 C2 oashd.SimplePropertiesWriter.readIndexerProperties Read dataimport.properties
[junit4:junit4]   2> 1007 T46 C2 oashd.SimplePropertiesWriter.persist Wrote last indexed time to dataimport.properties
[junit4:junit4]   2> 1008 T46 C2 oashd.DocBuilder.execute Time taken = 0:0:0.35
[junit4:junit4]   2> 1008 T46 C2 UPDATE [collection1] webapp=null path=null params={commit=true&clean=true&dataConfig=<dataConfig>+%0a<dataSource+name%3D"hsqldb"+driver%3D"org.hsqldb.jdbcDriver"+url%3D"jdbc:hsqldb:mem:."+/>+%0a<document+name%3D"TestSqlEntityProcessor">+%0a<entity+name%3D"People"+pk%3D"ID"+processor%3D"SqlEntityProcessor"+dataSource%3D"hsqldb"+query%3D"SELECT+ID,+NAME,+COUNTRY_CODE+FROM+PEOPLE+WHERE+DELETED+!%3D+'Y'+"+deletedPkQuery%3D"SELECT+ID+FROM+PEOPLE+WHERE+DELETED%3D'Y'+AND+last_modified+%26gt;%3D'${dih.last_index_time}'+"+deltaImportQuery%3D"SELECT+ID,+NAME,+COUNTRY_CODE+FROM+PEOPLE+where+ID%3D${dih.delta.ID}+"+deltaQuery%3D"SELECT+ID+FROM+PEOPLE+WHERE+DELETED!%3D'Y'+AND+last_modified+%26gt;%3D'${dih.last_index_time}'+UNION+DISTINCT+SELECT+ID+FROM+PEOPLE+WHERE+DELETED!%3D'Y'+AND+COUNTRY_CODE+IN+(SELECT+CODE+FROM+COUNTRIES+WHERE+last_modified+%26gt;%3D'${dih.last_index_time}')+"+>+%0a<field+column%3D"NAME"+name%3D"NAME_mult_s"+/>+%0a<field+column%3D"COUNTRY_CODE"+name%3D"COUNTRY_CODES_mult_s"+/>+%0a<entity+name%3D"Countries"+pk%3D"Countries.CODE"+dataSource%3D"hsqldb"+processor%3D"SqlEntityProcessor"+query%3D"SELECT+CODE,+COUNTRY_NAME+FROM+COUNTRIES+WHERE+DELETED+!%3D+'Y'+AND+CODE%3D'${People.COUNTRY_CODE}'+"+>+%0a<field+column%3D"CODE"+name%3D"COUNTRY_CODE_s"+/>+%0a<field+column%3D"COUNTRY_NAME"+name%3D"COUNTRY_NAME_s"+/>+%0a</entity>+%0a</entity>+%0a</document>+%0a</dataConfig>+%0a&command=full-import&indent=true&synchronous=true} {deleteByQuery=*:*,add=[1, 2, 3, 4, 5, 6, 7, 8, 9, 10, ... (20 adds)],commit=} 0 40
[junit4:junit4]   2> 1010 T46 C2 REQ [collection1] webapp=null path=null params={version=2.2&qt=standard&q=*:*&rows=20&start=0} hits=20 status=0 QTime=1 
[junit4:junit4]   2> 1016 T46 C2 REQ [collection1] webapp=null path=null params={version=2.2&qt=standard&q=NAME_mult_s:Jayden&rows=20&start=0} hits=1 status=0 QTime=0 
[junit4:junit4]   2> 1022 T46 C2 REQ [collection1] webapp=null path=null params={version=2.2&qt=standard&q=COUNTRY_CODES_mult_s:NR&rows=20&start=0} hits=2 status=0 QTime=0 
[junit4:junit4]   2> 1027 T46 C2 REQ [collection1] webapp=null path=null params={indent=true} status=0 QTime=0 
[junit4:junit4]   2> 1027 T46 C2 REQ [collection1] webapp=null path=null params={indent=true} status=0 QTime=0 
[junit4:junit4]   2> 1032 T46 C2 oashdc.ConfigParseUtil.verifyWithSchema id is a required field in SolrSchema . But not found in DataConfig
[junit4:junit4]   2> 1033 T46 C2 oashd.DataImporter.loadDataConfig Data Configuration loaded successfully
[junit4:junit4]   2> 1033 T46 C2 oashd.DataImporter.doDeltaImport Starting Delta Import
[junit4:junit4]   2> 1034 T46 C2 oashd.SimplePropertiesWriter.readIndexerProperties Read dataimport.properties
[junit4:junit4]   2> 1035 T46 C2 oashd.DocBuilder.doDelta Starting delta collection.
[junit4:junit4]   2> 1035 T46 C2 oashd.DocBuilder.collectDelta Running ModifiedRowKey() for Entity: Countries
[junit4:junit4]   2> 1036 T46 C2 oashd.DocBuilder.collectDelta Completed ModifiedRowKey for Entity: Countries rows obtained : 0
[junit4:junit4]   2> 1036 T46 C2 oashd.DocBuilder.collectDelta Completed DeletedRowKey for Entity: Countries rows obtained : 0
[junit4:junit4]   2> 1037 T46 C2 oashd.DocBuilder.collectDelta Completed parentDeltaQuery for Entity: Countries
[junit4:junit4]   2> 1037 T46 C2 oashd.DocBuilder.collectDelta Running ModifiedRowKey() for Entity: People
[junit4:junit4]   2> 1038 T46 C2 oashd.JdbcDataSource$1.call Creating a connection for entity People with URL: jdbc:hsqldb:mem:.
[junit4:junit4]   2> 1038 T46 C2 oashd.JdbcDataSource$1.call Time taken for getConnection(): 0
[junit4:junit4]   2> 1041 T46 C2 oashd.DocBuilder.collectDelta Completed ModifiedRowKey for Entity: People rows obtained : 0
[junit4:junit4]   2> 1042 T46 C2 oashd.DocBuilder.collectDelta Completed DeletedRowKey for Entity: People rows obtained : 0
[junit4:junit4]   2> 1042 T46 C2 oashd.DocBuilder.collectDelta Completed parentDeltaQuery for Entity: People
[junit4:junit4]   2> 1043 T46 C2 oashd.DocBuilder.doDelta Delta Import completed successfully
[junit4:junit4]   2> 1043 T46 C2 oashd.DocBuilder.execute Time taken = 0:0:0.9
[junit4:junit4]   2> 1044 T46 C2 UPDATE [collection1] webapp=null path=null params={commit=true&clean=false&dataConfig=<dataConfig>+%0a<dataSource+name%3D"hsqldb"+driver%3D"org.hsqldb.jdbcDriver"+url%3D"jdbc:hsqldb:mem:."+/>+%0a<document+name%3D"TestSqlEntityProcessor">+%0a<entity+name%3D"People"+pk%3D"People.ID"+processor%3D"SqlEntityProcessor"+dataSource%3D"hsqldb"+transformer%3D"AddAColumnTransformer"+query%3D"SELECT+ID,+NAME,+COUNTRY_CODE+FROM+PEOPLE+WHERE+DELETED+!%3D+'Y'+"+deletedPkQuery%3D"SELECT+ID+FROM+PEOPLE+WHERE+DELETED%3D'Y'+AND+last_modified+%26gt;%3D'${dih.last_index_time}'+"+deltaImportQuery%3D"SELECT+ID,+NAME,+COUNTRY_CODE+FROM+PEOPLE+where+ID%3D${dih.delta.ID}+"+deltaQuery%3D"SELECT+ID+FROM+PEOPLE+WHERE+DELETED!%3D'Y'+AND+last_modified+%26gt;%3D'${dih.last_index_time}'+UNION+DISTINCT+SELECT+ID+FROM+PEOPLE+WHERE+DELETED!%3D'Y'+AND+COUNTRY_CODE+IN+(SELECT+CODE+FROM+COUNTRIES+WHERE+last_modified+%26gt;%3D'${dih.last_index_time}')+"+>+%0a<field+column%3D"NAME"+name%3D"NAME_mult_s"+/>+%0a<field+column%3D"COUNTRY_CODE"+name%3D"COUNTRY_CODES_mult_s"+/>+%0a<entity+name%3D"Countries"+pk%3D"Countries.CODE"+dataSource%3D"hsqldb"+processor%3D"SqlEntityProcessor"+query%3D"SELECT+CODE,+COUNTRY_NAME+FROM+COUNTRIES+WHERE+DELETED+!%3D+'Y'+AND+CODE%3D'${People.COUNTRY_CODE}'+"+>+%0a<field+column%3D"CODE"+name%3D"COUNTRY_CODE_s"+/>+%0a<field+column%3D"COUNTRY_NAME"+name%3D"COUNTRY_NAME_s"+/>+%0a</entity>+%0a</entity>+%0a</document>+%0a</dataConfig>+%0a&command=delta-import&indent=true&synchronous=true} {} 0 14
[junit4:junit4]   2> 1045 T46 C2 REQ [collection1] webapp=null path=null params={version=2.2&qt=standard&q=*:*&rows=20&start=0} hits=20 status=0 QTime=0 
[junit4:junit4]   2> 1050 T46 C2 REQ [collection1] webapp=null path=null params={version=2.2&qt=standard&q=NAME_mult_s:Jayden&rows=20&start=0} hits=1 status=0 QTime=0 
[junit4:junit4]   2> 1056 T46 C2 REQ [collection1] webapp=null path=null params={version=2.2&qt=standard&q=COUNTRY_CODES_mult_s:NR&rows=20&start=0} hits=2 status=0 QTime=1 
[junit4:junit4]   2> 1061 T46 C2 REQ [collection1] webapp=null path=null params={version=2.2&qt=standard&q=COUNTRY_CODE_s:NE&rows=20&start=0} hits=2 status=0 QTime=1 
[junit4:junit4]   2> 1066 T46 oas.SolrTestCaseJ4.assertQ SEVERE REQUEST FAILED: xpath=substring(//doc/str[@name='COUNTRY_NAME_s'], 1, 8)='MODIFIED'
[junit4:junit4]   2> 		xml response was: <?xml version="1.0" encoding="UTF-8"?>
[junit4:junit4]   2> 	<response>
[junit4:junit4]   2> 	<lst name="responseHeader"><int name="status">0</int><int name="QTime">1</int><lst name="params"><str name="version">2.2</str><str name="qt">standard</str><str name="q">COUNTRY_CODE_s:NE</str><str name="rows">20</str><str name="start">0</str></lst></lst><result name="response" numFound="2" start="0"><doc><arr name="NAME_mult_s"><str>Anthony</str></arr><str name="id">10</str><arr name="COUNTRY_CODES_mult_s"><str>NE</str></arr><str name="COUNTRY_NAME_s">Niger</str><str name="COUNTRY_CODE_s">NE</str><date name="timestamp">2012-11-08T12:11:31.687Z</date></doc><doc><arr name="NAME_mult_s"><str>Lily</str></arr><str name="id">15</str><arr name="COUNTRY_CODES_mult_s"><str>NE</str></arr><str name="COUNTRY_NAME_s">Niger</str><str name="COUNTRY_CODE_s">NE</str><date name="timestamp">2012-11-08T12:11:31.687Z</date></doc></result>
[junit4:junit4]   2> 	</response>
[junit4:junit4]   2> 	
[junit4:junit4]   2> 		request was:version=2.2&qt=standard&q=COUNTRY_CODE_s:NE&rows=20&start=0
[junit4:junit4]   2> 1067 T46 oasc.SolrException.log SEVERE REQUEST FAILED: version=2.2&qt=standard&q=COUNTRY_CODE_s:NE&rows=20&start=0:java.lang.RuntimeException: REQUEST FAILED: xpath=substring(//doc/str[@name='COUNTRY_NAME_s'], 1, 8)='MODIFIED'
[junit4:junit4]   2> 		xml response was: <?xml version="1.0" encoding="UTF-8"?>
[junit4:junit4]   2> 	<response>
[junit4:junit4]   2> 	<lst name="responseHeader"><int name="status">0</int><int name="QTime">1</int><lst name="params"><str name="version">2.2</str><str name="qt">standard</str><str name="q">COUNTRY_CODE_s:NE</str><str name="rows">20</str><str name="start">0</str></lst></lst><result name="response" numFound="2" start="0"><doc><arr name="NAME_mult_s"><str>Anthony</str></arr><str name="id">10</str><arr name="COUNTRY_CODES_mult_s"><str>NE</str></arr><str name="COUNTRY_NAME_s">Niger</str><str name="COUNTRY_CODE_s">NE</str><date name="timestamp">2012-11-08T12:11:31.687Z</date></doc><doc><arr name="NAME_mult_s"><str>Lily</str></arr><str name="id">15</str><arr name="COUNTRY_CODES_mult_s"><str>NE</str></arr><str name="COUNTRY_NAME_s">Niger</str><str name="COUNTRY_CODE_s">NE</str><date name="timestamp">2012-11-08T12:11:31.687Z</date></doc></result>
[junit4:junit4]   2> 	</response>
[junit4:junit4]   2> 	
[junit4:junit4]   2> 		request was:version=2.2&qt=standard&q=COUNTRY_CODE_s:NE&rows=20&start=0
[junit4:junit4]   2> 		at org.apache.solr.SolrTestCaseJ4.assertQ(SolrTestCaseJ4.java:506)
[junit4:junit4]   2> 		at org.apache.solr.SolrTestCaseJ4.assertQ(SolrTestCaseJ4.java:480)
[junit4:junit4]   2> 		at org.apache.solr.handler.dataimport.TestSqlEntityProcessorDelta.validateChanges(TestSqlEntityProcessorDelta.java:99)
[junit4:junit4]   2> 		at org.apache.solr.handler.dataimport.TestSqlEntityProcessorDelta.testChildEntities(TestSqlEntityProcessorDelta.java:67)
[junit4:junit4]   2> 		at sun.reflect.NativeMethodAccessorImpl.invoke0(Native Method)
[junit4:junit4]   2> 		at sun.reflect.NativeMethodAccessorImpl.invoke(NativeMethodAccessorImpl.java:57)
[junit4:junit4]   2> 		at sun.reflect.DelegatingMethodAccessorImpl.invoke(DelegatingMethodAccessorImpl.java:43)
[junit4:junit4]   2> 		at java.lang.reflect.Method.invoke(Method.java:474)
[junit4:junit4]   2> 		at com.carrotsearch.randomizedtesting.RandomizedRunner.invoke(RandomizedRunner.java:1559)
[junit4:junit4]   2> 		at com.carrotsearch.randomizedtesting.RandomizedRunner.access$600(RandomizedRunner.java:79)
[junit4:junit4]   2> 		at com.carrotsearch.randomizedtesting.RandomizedRunner$6.evaluate(RandomizedRunner.java:737)
[junit4:junit4]   2> 		at com.carrotsearch.randomizedtesting.RandomizedRunner$7.evaluate(RandomizedRunner.java:773)
[junit4:junit4]   2> 		at com.carrotsearch.randomizedtesting.RandomizedRunner$8.evaluate(RandomizedRunner.java:787)
[junit4:junit4]   2> 		at com.carrotsearch.randomizedtesting.rules.SystemPropertiesRestoreRule$1.evaluate(SystemPropertiesRestoreRule.java:53)
[junit4:junit4]   2> 		at org.apache.lucene.util.TestRuleSetupTeardownChained$1.evaluate(TestRuleSetupTeardownChained.java:50)
[junit4:junit4]   2> 		at org.apache.lucene.util.TestRuleFieldCacheSanity$1.evaluate(TestRuleFieldCacheSanity.java:51)
[junit4:junit4]   2> 		at org.apache.lucene.util.AbstractBeforeAfterRule$1.evaluate(AbstractBeforeAfterRule.java:45)
[junit4:junit4]   2> 		at com.carrotsearch.randomizedtesting.rules.SystemPropertiesInvariantRule$1.evaluate(SystemPropertiesInvariantRule.java:55)
[junit4:junit4]   2> 		at org.apache.lucene.util.TestRuleThreadAndTestName$1.evaluate(TestRuleThreadAndTestName.java:48)
[junit4:junit4]   2> 		at org.apache.lucene.util.TestRuleIgnoreAfterMaxFailures$1.evaluate(TestRuleIgnoreAfterMaxFailures.java:70)
[junit4:junit4]   2> 		at org.apache.lucene.util.TestRuleMarkFailure$1.evaluate(TestRuleMarkFailure.java:48)
[junit4:junit4]   2> 		at com.carrotsearch.randomizedtesting.rules.StatementAdapter.evaluate(StatementAdapter.java:36)
[junit4:junit4]   2> 		at com.carrotsearch.randomizedtesting.ThreadLeakControl$StatementRunner.run(ThreadLeakControl.java:358)
[junit4:junit4]   2> 		at com.carrotsearch.randomizedtesting.ThreadLeakControl.forkTimeoutingTask(ThreadLeakControl.java:782)
[junit4:junit4]   2> 		at com.carrotsearch.randomizedtesting.ThreadLeakControl$3.evaluate(ThreadLeakControl.java:442)
[junit4:junit4]   2> 		at com.carrotsearch.randomizedtesting.RandomizedRunner.runSingleTest(RandomizedRunner.java:746)
[junit4:junit4]   2> 		at com.carrotsearch.randomizedtesting.RandomizedRunner$3.evaluate(RandomizedRunner.java:648)
[junit4:junit4]   2> 		at com.carrotsearch.randomizedtesting.RandomizedRunner$4.evaluate(RandomizedRunner.java:682)
[junit4:junit4]   2> 		at com.carrotsearch.randomizedtesting.RandomizedRunner$5.evaluate(RandomizedRunner.java:693)
[junit4:junit4]   2> 		at com.carrotsearch.randomizedtesting.rules.StatementAdapter.evaluate(StatementAdapter.java:36)
[junit4:junit4]   2> 		at com.carrotsearch.randomizedtesting.rules.SystemPropertiesRestoreRule$1.evaluate(SystemPropertiesRestoreRule.java:53)
[junit4:junit4]   2> 		at org.apache.lucene.util.AbstractBeforeAfterRule$1.evaluate(AbstractBeforeAfterRule.java:45)
[junit4:junit4]   2> 		at org.apache.lucene.util.TestRuleStoreClassName$1.evaluate(TestRuleStoreClassName.java:42)
[junit4:junit4]   2> 		at com.carrotsearch.randomizedtesting.rules.SystemPropertiesInvariantRule$1.evaluate(SystemPropertiesInvariantRule.java:55)
[junit4:junit4]   2> 		at com.carrotsearch.randomizedtesting.rules.NoShadowingOrOverridesOnMethodsRule$1.evaluate(NoShadowingOrOverridesOnMethodsRule.java:39)
[junit4:junit4]   2> 		at com.carrotsearch.randomizedtesting.rules.NoShadowingOrOverridesOnMethodsRule$1.evaluate(NoShadowingOrOverridesOnMethodsRule.java:39)
[junit4:junit4]   2> 		at com.carrotsearch.randomizedtesting.rules.StatementAdapter.evaluate(StatementAdapter.java:36)
[junit4:junit4]   2> 		at org.apache.lucene.util.TestRuleAssertionsRequired$1.evaluate(TestRuleAssertionsRequired.java:43)
[junit4:junit4]   2> 		at org.apache.lucene.util.TestRuleMarkFailure$1.evaluate(TestRuleMarkFailure.java:48)
[junit4:junit4]   2> 		at org.apache.lucene.util.TestRuleIgnoreAfterMaxFailures$1.evaluate(TestRuleIgnoreAfterMaxFailures.java:70)
[junit4:junit4]   2> 		at org.apache.lucene.util.TestRuleIgnoreTestSuites$1.evaluate(TestRuleIgnoreTestSuites.java:55)
[junit4:junit4]   2> 		at com.carrotsearch.randomizedtesting.rules.StatementAdapter.evaluate(StatementAdapter.java:36)
[junit4:junit4]   2> 		at com.carrotsearch.randomizedtesting.ThreadLeakControl$StatementRunner.run(ThreadLeakControl.java:358)
[junit4:junit4]   2> 		at java.lang.Thread.run(Thread.java:722)
[junit4:junit4]   2> 	
[junit4:junit4]   2> 1068 T46 oashd.AbstractDataImportHandlerTestCase.tearDown Looking for dataimport.properties at: /mnt/ssd/jenkins/workspace/Lucene-Solr-4.x-Linux/solr/build/contrib/solr-dataimporthandler/test/J1/solr/collection1/conf/dataimport.properties
[junit4:junit4]   2> 1069 T46 oas.SolrTestCaseJ4.tearDown ###Ending testChildEntities
[junit4:junit4]   2> NOTE: reproduce with: ant test  -Dtestcase=TestSqlEntityProcessorDelta -Dtests.method=testChildEntities -Dtests.seed=103A3F6EAC3C5255 -Dtests.multiplier=3 -Dtests.slow=true -Dtests.locale=th_TH_TH_#u-nu-thai -Dtests.timezone=Asia/Chongqing -Dtests.file.encoding=UTF-8
[junit4:junit4] ERROR   0.13s J1 | TestSqlEntityProcessorDelta.testChildEntities <<<
[junit4:junit4]    > Throwable #1: java.lang.RuntimeException: Exception during query
[junit4:junit4]    > 	at __randomizedtesting.SeedInfo.seed([103A3F6EAC3C5255:9F59D08A97B54FD6]:0)
[junit4:junit4]    > 	at org.apache.solr.SolrTestCaseJ4.assertQ(SolrTestCaseJ4.java:513)
[junit4:junit4]    > 	at org.apache.solr.SolrTestCaseJ4.assertQ(SolrTestCaseJ4.java:480)
[junit4:junit4]    > 	at org.apache.solr.handler.dataimport.TestSqlEntityProcessorDelta.validateChanges(TestSqlEntityProcessorDelta.java:99)
[junit4:junit4]    > 	at org.apache.solr.handler.dataimport.TestSqlEntityProcessorDelta.testChildEntities(TestSqlEntityProcessorDelta.java:67)
[junit4:junit4]    > 	at sun.reflect.NativeMethodAccessorImpl.invoke0(Native Method)
[junit4:junit4]    > 	at sun.reflect.NativeMethodAccessorImpl.invoke(NativeMethodAccessorImpl.java:57)
[junit4:junit4]    > 	at sun.reflect.DelegatingMethodAccessorImpl.invoke(DelegatingMethodAccessorImpl.java:43)
[junit4:junit4]    > 	at java.lang.reflect.Method.invoke(Method.java:474)
[junit4:junit4]    > 	at com.carrotsearch.randomizedtesting.RandomizedRunner.invoke(RandomizedRunner.java:1559)
[junit4:junit4]    > 	at com.carrotsearch.randomizedtesting.RandomizedRunner.access$600(RandomizedRunner.java:79)
[junit4:junit4]    > 	at com.carrotsearch.randomizedtesting.RandomizedRunner$6.evaluate(RandomizedRunner.java:737)
[junit4:junit4]    > 	at com.carrotsearch.randomizedtesting.RandomizedRunner$7.evaluate(RandomizedRunner.java:773)
[junit4:junit4]    > 	at com.carrotsearch.randomizedtesting.RandomizedRunner$8.evaluate(RandomizedRunner.java:787)
[junit4:junit4]    > 	at com.carrotsearch.randomizedtesting.rules.SystemPropertiesRestoreRule$1.evaluate(SystemPropertiesRestoreRule.java:53)
[junit4:junit4]    > 	at org.apache.lucene.util.TestRuleSetupTeardownChained$1.evaluate(TestRuleSetupTeardownChained.java:50)
[junit4:junit4]    > 	at org.apache.lucene.util.TestRuleFieldCacheSanity$1.evaluate(TestRuleFieldCacheSanity.java:51)
[junit4:junit4]    > 	at org.apache.lucene.util.AbstractBeforeAfterRule$1.evaluate(AbstractBeforeAfterRule.java:45)
[junit4:junit4]    > 	at com.carrotsearch.randomizedtesting.rules.SystemPropertiesInvariantRule$1.evaluate(SystemPropertiesInvariantRule.java:55)
[junit4:junit4]    > 	at org.apache.lucene.util.TestRuleThreadAndTestName$1.evaluate(TestRuleThreadAndTestName.java:48)
[junit4:junit4]    > 	at org.apache.lucene.util.TestRuleIgnoreAfterMaxFailures$1.evaluate(TestRuleIgnoreAfterMaxFailures.java:70)
[junit4:junit4]    > 	at org.apache.lucene.util.TestRuleMarkFailure$1.evaluate(TestRuleMarkFailure.java:48)
[junit4:junit4]    > 	at com.carrotsearch.randomizedtesting.rules.StatementAdapter.evaluate(StatementAdapter.java:36)
[junit4:junit4]    > 	at com.carrotsearch.randomizedtesting.ThreadLeakControl$StatementRunner.run(ThreadLeakControl.java:358)
[junit4:junit4]    > 	at com.carrotsearch.randomizedtesting.ThreadLeakControl.forkTimeoutingTask(ThreadLeakControl.java:782)
[junit4:junit4]    > 	at com.carrotsearch.randomizedtesting.ThreadLeakControl$3.evaluate(ThreadLeakControl.java:442)
[junit4:junit4]    > 	at com.carrotsearch.randomizedtesting.RandomizedRunner.runSingleTest(RandomizedRunner.java:746)
[junit4:junit4]    > 	at com.carrotsearch.randomizedtesting.RandomizedRunner$3.evaluate(RandomizedRunner.java:648)
[junit4:junit4]    > 	at com.carrotsearch.randomizedtesting.RandomizedRunner$4.evaluate(RandomizedRunner.java:682)
[junit4:junit4]    > 	at com.carrotsearch.randomizedtesting.RandomizedRunner$5.evaluate(RandomizedRunner.java:693)
[junit4:junit4]    > 	at com.carrotsearch.randomizedtesting.rules.StatementAdapter.evaluate(StatementAdapter.java:36)
[junit4:junit4]    > 	at com.carrotsearch.randomizedtesting.rules.SystemPropertiesRestoreRule$1.evaluate(SystemPropertiesRestoreRule.java:53)
[junit4:junit4]    > 	at org.apache.lucene.util.AbstractBeforeAfterRule$1.evaluate(AbstractBeforeAfterRule.java:45)
[junit4:junit4]    > 	at org.apache.lucene.util.TestRuleStoreClassName$1.evaluate(TestRuleStoreClassName.java:42)
[junit4:junit4]    > 	at com.carrotsearch.randomizedtesting.rules.SystemPropertiesInvariantRule$1.evaluate(SystemPropertiesInvariantRule.java:55)
[junit4:junit4]    > 	at com.carrotsearch.randomizedtesting.rules.NoShadowingOrOverridesOnMethodsRule$1.evaluate(NoShadowingOrOverridesOnMethodsRule.java:39)
[junit4:junit4]    > 	at com.carrotsearch.randomizedtesting.rules.NoShadowingOrOverridesOnMethodsRule$1.evaluate(NoShadowingOrOverridesOnMethodsRule.java:39)
[junit4:junit4]    > 	at com.carrotsearch.randomizedtesting.rules.StatementAdapter.evaluate(StatementAdapter.java:36)
[junit4:junit4]    > 	at org.apache.lucene.util.TestRuleAssertionsRequired$1.evaluate(TestRuleAssertionsRequired.java:43)
[junit4:junit4]    > 	at org.apache.lucene.util.TestRuleMarkFailure$1.evaluate(TestRuleMarkFailure.java:48)
[junit4:junit4]    > 	at org.apache.lucene.util.TestRuleIgnoreAfterMaxFailures$1.evaluate(TestRuleIgnoreAfterMaxFailures.java:70)
[junit4:junit4]    > 	at org.apache.lucene.util.TestRuleIgnoreTestSuites$1.evaluate(TestRuleIgnoreTestSuites.java:55)
[junit4:junit4]    > 	at com.carrotsearch.randomizedtesting.rules.StatementAdapter.evaluate(StatementAdapter.java:36)
[junit4:junit4]    > 	at com.carrotsearch.randomizedtesting.ThreadLeakControl$StatementRunner.run(ThreadLeakControl.java:358)
[junit4:junit4]    > 	at java.lang.Thread.run(Thread.java:722)
[junit4:junit4]    > Caused by: java.lang.RuntimeException: REQUEST FAILED: xpath=substring(//doc/str[@name='COUNTRY_NAME_s'], 1, 8)='MODIFIED'
[junit4:junit4]    > 	xml response was: <?xml version="1.0" encoding="UTF-8"?>
[junit4:junit4]    > <response>
[junit4:junit4]    > <lst name="responseHeader"><int name="status">0</int><int name="QTime">1</int><lst name="params"><str name="version">2.2</str><str name="qt">standard</str><str name="q">COUNTRY_CODE_s:NE</str><str name="rows">20</str><str name="start">0</str></lst></lst><result name="response" numFound="2" start="0"><doc><arr name="NAME_mult_s"><str>Anthony</str></arr><str name="id">10</str><arr name="COUNTRY_CODES_mult_s"><str>NE</str></arr><str name="COUNTRY_NAME_s">Niger</str><str name="COUNTRY_CODE_s">NE</str><date name="timestamp">2012-11-08T12:11:31.687Z</date></doc><doc><arr name="NAME_mult_s"><str>Lily</str></arr><str name="id">15</str><arr name="COUNTRY_CODES_mult_s"><str>NE</str></arr><str name="COUNTRY_NAME_s">Niger</str><str name="COUNTRY_CODE_s">NE</str><date name="timestamp">2012-11-08T12:11:31.687Z</date></doc></result>
[junit4:junit4]    > </response>
[junit4:junit4]    > 
[junit4:junit4]    > 	request was:version=2.2&qt=standard&q=COUNTRY_CODE_s:NE&rows=20&start=0
[junit4:junit4]    > 	at org.apache.solr.SolrTestCaseJ4.assertQ(SolrTestCaseJ4.java:506)
[junit4:junit4]    > 	... 43 more
[junit4:junit4]   2> 1079 T46 oas.SolrTestCaseJ4.setUp ###Starting testWithSimpleTransformer
[junit4:junit4]   2> 1082 T46 C2 oasu.DirectUpdateHandler2.deleteAll [collection1] REMOVING ALL DOCUMENTS FROM INDEX
[junit4:junit4]   2> 1083 T46 C2 UPDATE [collection1] webapp=null path=null params={} {deleteByQuery=*:*} 0 1
[junit4:junit4]   2> 1089 T46 C2 oasu.DirectUpdateHandler2.commit start commit{flags=0,_version_=0,optimize=false,openSearcher=true,waitSearcher=true,expungeDeletes=false,softCommit=false}
[junit4:junit4]   2> 1090 T46 C2 oasc.SolrDeletionPolicy.onCommit SolrDeletionPolicy.onCommit: commits:num=2
[junit4:junit4]   2> 		commit{dir=MockDirWrapper(org.apache.lucene.store.RAMDirectory@935b3cd lockFactory=org.apache.lucene.store.NativeFSLockFactory@74ded67c),segFN=segments_7,generation=7,filenames=[_2_Lucene40_0.frq, _2_Lucene40_0.tim, _2_Lucene40_0.tip, segments_7, _2.si, _2.fdt, _2.fdx, _2.fnm]
[junit4:junit4]   2> 		commit{dir=MockDirWrapper(org.apache.lucene.store.RAMDirectory@935b3cd lockFactory=org.apache.lucene.store.NativeFSLockFactory@74ded67c),segFN=segments_8,generation=8,filenames=[segments_8]
[junit4:junit4]   2> 1090 T46 C2 oasc.SolrDeletionPolicy.updateCommits newest commit = 8
[junit4:junit4]   2> 1092 T46 C2 oass.SolrIndexSearcher.<init> Opening Searcher@efef86 main
[junit4:junit4]   2> 1092 T46 C2 oass.SolrIndexSearcher.getIndexDir WARNING WARNING: Directory impl does not support setting indexDir: org.apache.lucene.store.MockDirectoryWrapper
[junit4:junit4]   2> 1093 T46 C2 oasu.DirectUpdateHandler2.commit end_commit_flush
[junit4:junit4]   2> 1093 T47 oasc.QuerySenderListener.newSearcher QuerySenderListener sending requests to Searcher@efef86 main{StandardDirectoryReader(segments_8:14)}
[junit4:junit4]   2> 1094 T47 C2 REQ [collection1] webapp=null path=null params={distrib=false&q=solr&event=newSearcher&rows=10&start=0} hits=0 status=0 QTime=1 
[junit4:junit4]   2> 1094 T47 C2 REQ [collection1] webapp=null path=null params={distrib=false&q=rocks&event=newSearcher&rows=10&start=0} hits=0 status=0 QTime=0 
[junit4:junit4]   2> 1095 T47 C2 REQ [collection1] webapp=null path=null params={distrib=false&q=static+newSearcher+warming+query+from+solrconfig.xml&event=newSearcher} hits=0 status=0 QTime=1 
[junit4:junit4]   2> 1095 T47 oasc.QuerySenderListener.newSearcher QuerySenderListener done.
[junit4:junit4]   2> 1095 T47 oasc.SolrCore.registerSearcher [collection1] Registered new searcher Searcher@efef86 main{StandardDirectoryReader(segments_8:14)}
[junit4:junit4]   2> 1096 T46 C2 UPDATE [collection1] webapp=null path=null params={} {commit=} 0 8
[junit4:junit4]   2> 1104 T46 C2 oashdc.ConfigParseUtil.verifyWithSchema id is a required field in SolrSchema . But not found in DataConfig
[junit4:junit4]   2> 1105 T46 C2 oashd.DataImporter.loadDataConfig Data Configuration loaded successfully
[junit4:junit4]   2> 1105 T46 C2 oashd.DataImporter.doFullImport Starting Full Import
[junit4:junit4]   2> 1106 T46 C2 oashd.SimplePropertiesWriter.readIndexerProperties Read dataimport.properties
[junit4:junit4]   2> 1107 T46 C2 oasu.DirectUpdateHandler2.deleteAll [collection1] REMOVING ALL DOCUMENTS FROM INDEX
[junit4:junit4]   2> 1108 T46 C2 oashd.JdbcDataSource$1.call Creating a connection for entity People with URL: jdbc:hsqldb:mem:.
[junit4:junit4]   2> 1108 T46 C2 oashd.JdbcDataSource$1.call Time taken for getConnection(): 0
[junit4:junit4]   2> 1139 T46 C2 oashd.DocBuilder.finish Import completed successfully
[junit4:junit4]   2> 1140 T46 C2 oasu.DirectUpdateHandler2.commit start commit{flags=0,_version_=0,optimize=false,openSearcher=true,waitSearcher=true,expungeDeletes=false,softCommit=false}
[junit4:junit4]   2> 1145 T46 C2 oasc.SolrDeletionPolicy.onCommit SolrDeletionPolicy.onCommit: commits:num=2
[junit4:junit4]   2> 		commit{dir=MockDirWrapper(org.apache.lucene.store.RAMDirectory@935b3cd lockFactory=org.apache.lucene.store.NativeFSLockFactory@74ded67c),segFN=segments_8,generation=8,filenames=[segments_8]
[junit4:junit4]   2> 		commit{dir=MockDirWrapper(org.apache.lucene.store.RAMDirectory@935b3cd lockFactory=org.apache.lucene.store.NativeFSLockFactory@74ded67c),segFN=segments_9,generation=9,filenames=[_3.fdt, _3.fnm, _3_Lucene40_0.frq, _3_Lucene40_0.tim, _3.fdx, segments_9, _3_Lucene40_0.tip, _3.si]
[junit4:junit4]   2> 1145 T46 C2 oasc.SolrDeletionPolicy.updateCommits newest commit = 9
[junit4:junit4]   2> 1147 T46 C2 oass.SolrIndexSearcher.<init> Opening Searcher@15747c0f main
[junit4:junit4]   2> 1148 T46 C2 oass.SolrIndexSearcher.getIndexDir WARNING WARNING: Directory impl does not support setting indexDir: org.apache.lucene.store.MockDirectoryWrapper
[junit4:junit4]   2> 1148 T46 C2 oasu.DirectUpdateHandler2.commit end_commit_flush
[junit4:junit4]   2> 1150 T47 oasc.QuerySenderListener.newSearcher QuerySenderListener sending requests to Searcher@15747c0f main{StandardDirectoryReader(segments_9:17 _3(4.1):C20)}
[junit4:junit4]   2> 1151 T47 C2 REQ [collection1] webapp=null path=null params={distrib=false&q=solr&event=newSearcher&rows=10&start=0} hits=0 status=0 QTime=0 
[junit4:junit4]   2> 1151 T47 C2 REQ [collection1] webapp=null path=null params={distrib=false&q=rocks&event=newSearcher&rows=10&start=0} hits=0 status=0 QTime=0 
[junit4:junit4]   2> 1152 T47 C2 REQ [collection1] webapp=null path=null params={distrib=false&q=static+newSearcher+warming+query+from+solrconfig.xml&event=newSearcher} hits=0 status=0 QTime=0 
[junit4:junit4]   2> 1152 T47 oasc.QuerySenderListener.newSearcher QuerySenderListener done.
[junit4:junit4]   2> 1153 T47 oasc.SolrCore.registerSearcher [collection1] Registered new searcher Searcher@15747c0f main{StandardDirectoryReader(segments_9:17 _3(4.1):C20)}
[junit4:junit4]   2> 1153 T46 C2 oashd.SimplePropertiesWriter.readIndexerProperties Read dataimport.properties
[junit4:junit4]   2> 1154 T46 C2 oashd.SimplePropertiesWriter.persist Wrote last indexed time to dataimport.properties
[junit4:junit4]   2> 1155 T46 C2 oashd.DocBuilder.execute Time taken = 0:0:0.49
[junit4:junit4]   2> 1155 T46 C2 UPDATE [collection1] webapp=null path=null params={commit=true&clean=true&dataConfig=<dataConfig>+%0a<dataSource+name%3D"hsqldb"+driver%3D"org.hsqldb.jdbcDriver"+url%3D"jdbc:hsqldb:mem:."+/>+%0a<document+name%3D"TestSqlEntityProcessor">+%0a<entity+name%3D"People"+pk%3D"ID"+processor%3D"SqlEntityProcessor"+dataSource%3D"hsqldb"+transformer%3D"AddAColumnTransformer"+query%3D"SELECT+ID,+NAME,+COUNTRY_CODE+FROM+PEOPLE+WHERE+DELETED+!%3D+'Y'+"+deletedPkQuery%3D"SELECT+ID+FROM+PEOPLE+WHERE+DELETED%3D'Y'+AND+last_modified+%26gt;%3D'${dih.last_index_time}'+"+deltaImportQuery%3D"SELECT+ID,+NAME,+COUNTRY_CODE+FROM+PEOPLE+where+ID%3D${dih.delta.ID}+"+deltaQuery%3D"SELECT+ID+FROM+PEOPLE+WHERE+DELETED!%3D'Y'+AND+last_modified+%26gt;%3D'${dih.last_index_time}'+UNION+DISTINCT+SELECT+ID+FROM+PEOPLE+WHERE+DELETED!%3D'Y'+AND+COUNTRY_CODE+IN+(SELECT+CODE+FROM+COUNTRIES+WHERE+last_modified+%26gt;%3D'${dih.last_index_time}')+"+>+%0a<field+column%3D"NAME"+name%3D"NAME_mult_s"+/>+%0a<field+column%3D"COUNTRY_CODE"+name%3D"COUNTRY_CODES_mult_s"+/>+%0a</entity>+%0a</document>+%0a</dataConfig>+%0a&command=full-import&indent=true&synchronous=true} {deleteByQuery=*:*,add=[1, 2, 3, 4, 5, 6, 7, 8, 9, 10, ... (20 adds)],commit=} 0 53
[junit4:junit4]   2> 1157 T46 C2 REQ [collection1] webapp=null path=null params={version=2.2&qt=standard&q=AddAColumn_s:Added&rows=20&start=0} hits=20 status=0 QTime=1 
[junit4:junit4]   2> 1162 T46 C2 REQ [collection1] webapp=null path=null params={indent=true} status=0 QTime=1 
[junit4:junit4]   2> 1167 T46 C2 oashdc.ConfigParseUtil.verifyWithSchema id is a required field in SolrSchema . But not found in DataConfig
[junit4:junit4]   2> 1168 T46 C2 oashd.DataImporter.loadDataConfig Data Configuration loaded successfully
[junit4:junit4]   2> 1168 T46 C2 oashd.DataImporter.doDeltaImport Starting Delta Import
[junit4:junit4]   2> 1169 T46 C2 oashd.SimplePropertiesWriter.readIndexerProperties Read dataimport.properties
[junit4:junit4]   2> 1170 T46 C2 oashd.DocBuilder.doDelta Starting delta collection.
[junit4:junit4]   2> 1170 T46 C2 oashd.DocBuilder.collectDelta Running ModifiedRowKey() for Entity: People
[junit4:junit4]   2> 1171 T46 C2 oashd.JdbcDataSource$1.call Creating a connection for entity People with URL: jdbc:hsqldb:mem:.
[junit4:junit4]   2> 1172 T46 C2 oashd.JdbcDataSource$1.call Time taken for getConnection(): 1
[junit4:junit4]   2> 1182 T46 C2 oashd.DocBuilder.collectDelta Completed ModifiedRowKey for Entity: People rows obtained : 0
[junit4:junit4]   2> 1183 T46 C2 oashd.DocBuilder.collectDelta Completed DeletedRowKey for Entity: People rows obtained : 0
[junit4:junit4]   2> 1183 T46 C2 oashd.DocBuilder.collectDelta Completed parentDeltaQuery for Entity: People
[junit4:junit4]   2> 1184 T46 C2 oashd.DocBuilder.doDelta Delta Import completed successfully
[junit4:junit4]   2> 1184 T46 C2 oashd.DocBuilder.execute Time taken = 0:0:0.15
[junit4:junit4]   2> 1185 T46 C2 UPDATE [collection1] webapp=null path=null params={commit=true&clean=false&dataConfig=<dataConfig>+%0a<dataSource+name%3D"hsqldb"+driver%3D"org.hsqldb.jdbcDriver"+url%3D"jdbc:hsqldb:mem:."+/>+%0a<document+name%3D"TestSqlEntityProcessor">+%0a<entity+name%3D"People"+pk%3D"People.ID"+processor%3D"SqlEntityProcessor"+dataSource%3D"hsqldb"+transformer%3D"AddAColumnTransformer"+query%3D"SELECT+ID,+NAME,+COUNTRY_CODE+FROM+PEOPLE+WHERE+DELETED+!%3D+'Y'+"+deletedPkQuery%3D"SELECT+ID+FROM+PEOPLE+WHERE+DELETED%3D'Y'+AND+last_modified+%26gt;%3D'${dih.last_index_time}'+"+deltaImportQuery%3D"SELECT+ID,+NAME,+COUNTRY_CODE+FROM+PEOPLE+where+ID%3D${dih.delta.ID}+"+deltaQuery%3D"SELECT+ID+FROM+PEOPLE+WHERE+DELETED!%3D'Y'+AND+last_modified+%26gt;%3D'${dih.last_index_time}'+UNION+DISTINCT+SELECT+ID+FROM+PEOPLE+WHERE+DELETED!%3D'Y'+AND+COUNTRY_CODE+IN+(SELECT+CODE+FROM+COUNTRIES+WHERE+last_modified+%26gt;%3D'${dih.last_index_time}')+"+>+%0a<field+column%3D"NAME"+name%3D"NAME_mult_s"+/>+%0a<field+column%3D"COUNTRY_CODE"+name%3D"COUNTRY_CODES_mult_s"+/>+%0a</entity>+%0a</document>+%0a</dataConfig>+%0a&command=delta-import&indent=true&synchronous=true} {} 0 21
[junit4:junit4]   2> 1186 T46 C2 REQ [collection1] webapp=null path=null params={version=2.2&qt=standard&q=AddAColumn_s:Added&rows=20&start=0} hits=20 status=0 QTime=1 
[junit4:junit4]   2> 1192 T46 oas.SolrTestCaseJ4.assertQ SEVERE REQUEST FAILED: xpath=//*[@numFound='16']
[junit4:junit4]   2> 		xml response was: <?xml version="1.0" encoding="UTF-8"?>
[junit4:junit4]   2> 	<response>
[junit4:junit4]   2> 	<lst name="responseHeader"><int name="status">0</int><int name="QTime">1</int><lst name="params"><str name="version">2.2</str><str name="qt">standard</str><str name="q">AddAColumn_s:Added</str><str name="rows">20</str><str name="start">0</str></lst></lst><result name="response" numFound="20" start="0"><doc><arr name="NAME_mult_s"><str>Jacob</str></arr><str name="id">1</str><arr name="COUNTRY_CODES_mult_s"><str>NZ</str></arr><str name="AddAColumn_s">Added</str><date name="timestamp">2012-11-08T12:11:31.821Z</date></doc><doc><arr name="NAME_mult_s"><str>Ethan</str></arr><str name="id">2</str><arr name="COUNTRY_CODES_mult_s"><str>NU</str></arr><str name="AddAColumn_s">Added</str><date name="timestamp">2012-11-08T12:11:31.821Z</date></doc><doc><arr name="NAME_mult_s"><str>Michael</str></arr><str name="id">3</str><arr name="COUNTRY_CODES_mult_s"><str>NR</str></arr><str name="AddAColumn_s">Added</str><date name="timestamp">2012-11-08T12:11:31.821Z</date></doc><doc><arr name="NAME_mult_s"><str>Jayden</str></arr><str name="id">4</str><arr name="COUNTRY_CODES_mult_s"><str>NP</str></arr><str name="AddAColumn_s">Added</str><date name="timestamp">2012-11-08T12:11:31.821Z</date></doc><doc><arr name="NAME_mult_s"><str>William</str></arr><str name="id">5</str><arr name="COUNTRY_CODES_mult_s"><str>NO</str></arr><str name="AddAColumn_s">Added</str><date name="timestamp">2012-11-08T12:11:31.821Z</date></doc><doc><arr name="NAME_mult_s"><str>Alexander</str></arr><str name="id">6</str><arr name="COUNTRY_CODES_mult_s"><str>NL</str></arr><str name="AddAColumn_s">Added</str><date name="timestamp">2012-11-08T12:11:31.821Z</date></doc><doc><arr name="NAME_mult_s"><str>Noah</str></arr><str name="id">7</str><arr name="COUNTRY_CODES_mult_s"><str>NI</str></arr><str name="AddAColumn_s">Added</str><date name="timestamp">2012-11-08T12:11:31.821Z</date></doc><doc><arr name="NAME_mult_s"><str>Daniel</str></arr><str name="id">8</str><arr name="COUNTRY_CODES_mult_s"><str>NG</str></arr><str name="AddAColumn_s">Added</str><date name="timestamp">2012-11-08T12:11:31.821Z</date></doc><doc><arr name="NAME_mult_s"><str>Aiden</str></arr><str name="id">9</str><arr name="COUNTRY_CODES_mult_s"><str>NF</str></arr><str name="AddAColumn_s">Added</str><date name="timestamp">2012-11-08T12:11:31.821Z</date></doc><doc><arr name="NAME_mult_s"><str>Anthony</str></arr><str name="id">10</str><arr name="COUNTRY_CODES_mult_s"><str>NE</str></arr><str name="AddAColumn_s">Added</str><date name="timestamp">2012-11-08T12:11:31.821Z</date></doc><doc><arr name="NAME_mult_s"><str>Emma</str></arr><str name="id">11</str><arr name="COUNTRY_CODES_mult_s"><str>NL</str></arr><str name="AddAColumn_s">Added</str><date name="timestamp">2012-11-08T12:11:31.821Z</date></doc><doc><arr name="NAME_mult_s"><str>Grace</str></arr><str name="id">12</str><arr name="COUNTRY_CODES_mult_s"><str>NI</str></arr><str name="AddAColumn_s">Added</str><date name="timestamp">2012-11-08T12:11:31.821Z</date></doc><doc><arr name="NAME_mult_s"><str>Hailey</str></arr><str name="id">13</str><arr name="COUNTRY_CODES_mult_s"><str>NG</str></arr><str name="AddAColumn_s">Added</str><date name="timestamp">2012-11-08T12:11:31.821Z</date></doc><doc><arr name="NAME_mult_s"><str>Isabella</str></arr><str name="id">14</str><arr name="COUNTRY_CODES_mult_s"><str>NF</str></arr><str name="AddAColumn_s">Added</str><date name="timestamp">2012-11-08T12:11:31.821Z</date></doc><doc><arr name="NAME_mult_s"><str>Lily</str></arr><str name="id">15</str><arr name="COUNTRY_CODES_mult_s"><str>NE</str></arr><str name="AddAColumn_s">Added</str><date name="timestamp">2012-11-08T12:11:31.821Z</date></doc><doc><arr name="NAME_mult_s"><str>Madison</str></arr><str name="id">16</str><arr name="COUNTRY_CODES_mult_s"><str>NC</str></arr><str name="AddAColumn_s">Added</str><date name="timestamp">2012-11-08T12:11:31.821Z</date></doc><doc><arr name="NAME_mult_s"><str>Mia</str></arr><str name="id">17</str><arr name="COUNTRY_CODES_mult_s"><str>NA</str></arr><str name="AddAColumn_s">Added</str><date name="timestamp">2012-11-08T12:11:31.821Z</date></doc><doc><arr name="NAME_mult_s"><str>Natalie</str></arr><str name="id">18</str><arr name="COUNTRY_CODES_mult_s"><str>NZ</str></arr><str name="AddAColumn_s">Added</str><date name="timestamp">2012-11-08T12:11:31.821Z</date></doc><doc><arr name="NAME_mult_s"><str>Olivia</str></arr><str name="id">19</str><arr name="COUNTRY_CODES_mult_s"><str>NU</str></arr><str name="AddAColumn_s">Added</str><date name="timestamp">2012-11-08T12:11:31.821Z</date></doc><doc><arr name="NAME_mult_s"><str>Samantha</str></arr><str name="id">20</str><arr name="COUNTRY_CODES_mult_s"><str>NR</str></arr><str name="AddAColumn_s">Added</str><date name="timestamp">2012-11-08T12:11:31.821Z</date></doc></result>
[junit4:junit4]   2> 	</response>
[junit4:junit4]   2> 	
[junit4:junit4]   2> 		request was:version=2.2&qt=standard&q=AddAColumn_s:Added&rows=20&start=0
[junit4:junit4]   2> 1194 T46 oasc.SolrException.log SEVERE REQUEST FAILED: version=2.2&qt=standard&q=AddAColumn_s:Added&rows=20&start=0:java.lang.RuntimeException: REQUEST FAILED: xpath=//*[@numFound='16']
[junit4:junit4]   2> 		xml response was: <?xml version="1.0" encoding="UTF-8"?>
[junit4:junit4]   2> 	<response>
[junit4:junit4]   2> 	<lst name="responseHeader"><int name="status">0</int><int name="QTime">1</int><lst name="params"><str name="version">2.2</str><str name="qt">standard</str><str name="q">AddAColumn_s:Added</str><str name="rows">20</str><str name="start">0</str></lst></lst><result name="response" numFound="20" start="0"><doc><arr name="NAME_mult_s"><str>Jacob</str></arr><str name="id">1</str><arr name="COUNTRY_CODES_mult_s"><str>NZ</str></arr><str name="AddAColumn_s">Added</str><date name="timestamp">2012-11-08T12:11:31.821Z</date></doc><doc><arr name="NAME_mult_s"><str>Ethan</str></arr><str name="id">2</str><arr name="COUNTRY_CODES_mult_s"><str>NU</str></arr><str name="AddAColumn_s">Added</str><date name="timestamp">2012-11-08T12:11:31.821Z</date></doc><doc><arr name="NAME_mult_s"><str>Michael</str></arr><str name="id">3</str><arr name="COUNTRY_CODES_mult_s"><str>NR</str></arr><str name="AddAColumn_s">Added</str><date name="timestamp">2012-11-08T12:11:31.821Z</date></doc><doc><arr name="NAME_mult_s"><str>Jayden</str></arr><str name="id">4</str><arr name="COUNTRY_CODES_mult_s"><str>NP</str></arr><str name="AddAColumn_s">Added</str><date name="timestamp">2012-11-08T12:11:31.821Z</date></doc><doc><arr name="NAME_mult_s"><str>William</str></arr><str name="id">5</str><arr name="COUNTRY_CODES_mult_s"><str>NO</str></arr><str name="AddAColumn_s">Added</str><date name="timestamp">2012-11-08T12:11:31.821Z</date></doc><doc><arr name="NAME_mult_s"><str>Alexander</str></arr><str name="id">6</str><arr name="COUNTRY_CODES_mult_s"><str>NL</str></arr><str name="AddAColumn_s">Added</str><date name="timestamp">2012-11-08T12:11:31.821Z</date></doc><doc><arr name="NAME_mult_s"><str>Noah</str></arr><str name="id">7</str><arr name="COUNTRY_CODES_mult_s"><str>NI</str></arr><str name="AddAColumn_s">Added</str><date name="timestamp">2012-11-08T12:11:31.821Z</date></doc><doc><arr name="NAME_mult_s"><str>Daniel</str></arr><str name="id">8</str><arr name="COUNTRY_CODES_mult_s"><str>NG</str></arr><str name="AddAColumn_s">Added</str><date name="timestamp">2012-11-08T12:11:31.821Z</date></doc><doc><arr name="NAME_mult_s"><str>Aiden</str></arr><str name="id">9</str><arr name="COUNTRY_CODES_mult_s"><str>NF</str></arr><str name="AddAColumn_s">Added</str><date name="timestamp">2012-11-08T12:11:31.821Z</date></doc><doc><arr name="NAME_mult_s"><str>Anthony</str></arr><str name="id">10</str><arr name="COUNTRY_CODES_mult_s"><str>NE</str></arr><str name="AddAColumn_s">Added</str><date name="timestamp">2012-11-08T12:11:31.821Z</date></doc><doc><arr name="NAME_mult_s"><str>Emma</str></arr><str name="id">11</str><arr name="COUNTRY_CODES_mult_s"><str>NL</str></arr><str name="AddAColumn_s">Added</str><date name="timestamp">2012-11-08T12:11:31.821Z</date></doc><doc><arr name="NAME_mult_s"><str>Grace</str></arr><str name="id">12</str><arr name="COUNTRY_CODES_mult_s"><str>NI</str></arr><str name="AddAColumn_s">Added</str><date name="timestamp">2012-11-08T12:11:31.821Z</date></doc><doc><arr name="NAME_mult_s"><str>Hailey</str></arr><str name="id">13</str><arr name="COUNTRY_CODES_mult_s"><str>NG</str></arr><str name="AddAColumn_s">Added</str><date name="timestamp">2012-11-08T12:11:31.821Z</date></doc><doc><arr name="NAME_mult_s"><str>Isabella</str></arr><str name="id">14</str><arr name="COUNTRY_CODES_mult_s"><str>NF</str></arr><str name="AddAColumn_s">Added</str><date name="timestamp">2012-11-08T12:11:31.821Z</date></doc><doc><arr name="NAME_mult_s"><str>Lily</str></arr><str name="id">15</str><arr name="COUNTRY_CODES_mult_s"><str>NE</str></arr><str name="AddAColumn_s">Added</str><date name="timestamp">2012-11-08T12:11:31.821Z</date></doc><doc><arr name="NAME_mult_s"><str>Madison</str></arr><str name="id">16</str><arr name="COUNTRY_CODES_mult_s"><str>NC</str></arr><str name="AddAColumn_s">Added</str><date name="timestamp">2012-11-08T12:11:31.821Z</date></doc><doc><arr name="NAME_mult_s"><str>Mia</str></arr><str name="id">17</str><arr name="COUNTRY_CODES_mult_s"><str>NA</str></arr><str name="AddAColumn_s">Added</str><date name="timestamp">2012-11-08T12:11:31.821Z</date></doc><doc><arr name="NAME_mult_s"><str>Natalie</str></arr><str name="id">18</str><arr name="COUNTRY_CODES_mult_s"><str>NZ</str></arr><str name="AddAColumn_s">Added</str><date name="timestamp">2012-11-08T12:11:31.821Z</date></doc><doc><arr name="NAME_mult_s"><str>Olivia</str></arr><str name="id">19</str><arr name="COUNTRY_CODES_mult_s"><str>NU</str></arr><str name="AddAColumn_s">Added</str><date name="timestamp">2012-11-08T12:11:31.821Z</date></doc><doc><arr name="NAME_mult_s"><str>Samantha</str></arr><str name="id">20</str><arr name="COUNTRY_CODES_mult_s"><str>NR</str></arr><str name="AddAColumn_s">Added</str><date name="timestamp">2012-11-08T12:11:31.821Z</date></doc></result>
[junit4:junit4]   2> 	</response>
[junit4:junit4]   2> 	
[junit4:junit4]   2> 		request was:version=2.2&qt=standard&q=AddAColumn_s:Added&rows=20&start=0
[junit4:junit4]   2> 		at org.apache.solr.SolrTestCaseJ4.assertQ(SolrTestCaseJ4.java:506)
[junit4:junit4]   2> 		at org.apache.solr.SolrTestCaseJ4.assertQ(SolrTestCaseJ4.java:480)
[junit4:junit4]   2> 		at org.apache.solr.handler.dataimport.AbstractDIHJdbcTestCase.simpleTransform(AbstractDIHJdbcTestCase.java:108)
[junit4:junit4]   2> 		at org.apache.solr.handler.dataimport.TestSqlEntityProcessorDelta.testWithSimpleTransformer(TestSqlEntityProcessorDelta.java:51)
[junit4:junit4]   2> 		at sun.reflect.NativeMethodAccessorImpl.invoke0(Native Method)
[junit4:junit4]   2> 		at sun.reflect.NativeMethodAccessorImpl.invoke(NativeMethodAccessorImpl.java:57)
[junit4:junit4]   2> 		at sun.reflect.DelegatingMethodAccessorImpl.invoke(DelegatingMethodAccessorImpl.java:43)
[junit4:junit4]   2> 		at java.lang.reflect.Method.invoke(Method.java:474)
[junit4:junit4]   2> 		at com.carrotsearch.randomizedtesting.RandomizedRunner.invoke(RandomizedRunner.java:1559)
[junit4:junit4]   2> 		at com.carrotsearch.randomizedtesting.RandomizedRunner.access$600(RandomizedRunner.java:79)
[junit4:junit4]   2> 		at com.carrotsearch.randomizedtesting.RandomizedRunner$6.evaluate(RandomizedRunner.java:737)
[junit4:junit4]   2> 		at com.carrotsearch.randomizedtesting.RandomizedRunner$7.evaluate(RandomizedRunner.java:773)
[junit4:junit4]   2> 		at com.carrotsearch.randomizedtesting.RandomizedRunner$8.evaluate(RandomizedRunner.java:787)
[junit4:junit4]   2> 		at com.carrotsearch.randomizedtesting.rules.SystemPropertiesRestoreRule$1.evaluate(SystemPropertiesRestoreRule.java:53)
[junit4:junit4]   2> 		at org.apache.lucene.util.TestRuleSetupTeardownChained$1.evaluate(TestRuleSetupTeardownChained.java:50)
[junit4:junit4]   2> 		at org.apache.lucene.util.TestRuleFieldCacheSanity$1.evaluate(TestRuleFieldCacheSanity.java:51)
[junit4:junit4]   2> 		at org.apache.lucene.util.AbstractBeforeAfterRule$1.evaluate(AbstractBeforeAfterRule.java:45)
[junit4:junit4]   2> 		at com.carrotsearch.randomizedtesting.rules.SystemPropertiesInvariantRule$1.evaluate(SystemPropertiesInvariantRule.java:55)
[junit4:junit4]   2> 		at org.apache.lucene.util.TestRuleThreadAndTestName$1.evaluate(TestRuleThreadAndTestName.java:48)
[junit4:junit4]   2> 		at org.apache.lucene.util.TestRuleIgnoreAfterMaxFailures$1.evaluate(TestRuleIgnoreAfterMaxFailures.java:70)
[junit4:junit4]   2> 		at org.apache.lucene.util.TestRuleMarkFailure$1.evaluate(TestRuleMarkFailure.java:48)
[junit4:junit4]   2> 		at com.carrotsearch.randomizedtesting.rules.StatementAdapter.evaluate(StatementAdapter.java:36)
[junit4:junit4]   2> 		at com.carrotsearch.randomizedtesting.ThreadLeakControl$StatementRunner.run(ThreadLeakControl.java:358)
[junit4:junit4]   2> 		at com.carrotsearch.randomizedtesting.ThreadLeakControl.forkTimeoutingTask(ThreadLeakControl.java:782)
[junit4:junit4]   2> 		at com.carrotsearch.randomizedtesting.ThreadLeakControl$3.evaluate(ThreadLeakControl.java:442)
[junit4:junit4]   2> 		at com.carrotsearch.randomizedtesting.RandomizedRunner.runSingleTest(RandomizedRunner.java:746)
[junit4:junit4]   2> 		at com.carrotsearch.randomizedtesting.RandomizedRunner$3.evaluate(RandomizedRunner.java:648)
[junit4:junit4]   2> 		at com.carrotsearch.randomizedtesting.RandomizedRunner$4.evaluate(RandomizedRunner.java:682)
[junit4:junit4]   2> 		at com.carrotsearch.randomizedtesting.RandomizedRunner$5.evaluate(RandomizedRunner.java:693)
[junit4:junit4]   2> 		at com.carrotsearch.randomizedtesting.rules.StatementAdapter.evaluate(StatementAdapter.java:36)
[junit4:junit4]   2> 		at com.carrotsearch.randomizedtesting.rules.SystemPropertiesRestoreRule$1.evaluate(SystemPropertiesRestoreRule.java:53)
[junit4:junit4]   2> 		at org.apache.lucene.util.AbstractBeforeAfterRule$1.evaluate(AbstractBeforeAfterRule.java:45)
[junit4:junit4]   2> 		at org.apache.lucene.util.TestRuleStoreClassName$1.evaluate(TestRuleStoreClassName.java:42)
[junit4:junit4]   2> 		at com.carrotsearch.randomizedtesting.rules.SystemPropertiesInvariantRule$1.evaluate(SystemPropertiesInvariantRule.java:55)
[junit4:junit4]   2> 		at com.carrotsearch.randomizedtesting.rules.NoShadowingOrOverridesOnMethodsRule$1.evaluate(NoShadowingOrOverridesOnMethodsRule.java:39)
[junit4:junit4]   2> 		at com.carrotsearch.randomizedtesting.rules.NoShadowingOrOverridesOnMethodsRule$1.evaluate(NoShadowingOrOverridesOnMethodsRule.java:39)
[junit4:junit4]   2> 		at com.carrotsearch.randomizedtesting.rules.StatementAdapter.evaluate(StatementAdapter.java:36)
[junit4:junit4]   2> 		at org.apache.lucene.util.TestRuleAssertionsRequired$1.evaluate(TestRuleAssertionsRequired.java:43)
[junit4:junit4]   2> 		at org.apache.lucene.util.TestRuleMarkFailure$1.evaluate(TestRuleMarkFailure.java:48)
[junit4:junit4]   2> 		at org.apache.lucene.util.TestRuleIgnoreAfterMaxFailures$1.evaluate(TestRuleIgnoreAfterMaxFailures.java:70)
[junit4:junit4]   2> 		at org.apache.lucene.util.TestRuleIgnoreTestSuites$1.evaluate(TestRuleIgnoreTestSuites.java:55)
[junit4:junit4]   2> 		at com.carrotsearch.randomizedtesting.rules.StatementAdapter.evaluate(StatementAdapter.java:36)
[junit4:junit4]   2> 		at com.carrotsearch.randomizedtesting.ThreadLeakControl$StatementRunner.run(ThreadLeakControl.java:358)
[junit4:junit4]   2> 		at java.lang.Thread.run(Thread.java:722)
[junit4:junit4]   2> 	
[junit4:junit4]   2> 1196 T46 oashd.AbstractDataImportHandlerTestCase.tearDown Looking for dataimport.properties at: /mnt/ssd/jenkins/workspace/Lucene-Solr-4.x-Linux/solr/build/contrib/solr-dataimporthandler/test/J1/solr/collection1/conf/dataimport.properties
[junit4:junit4]   2> 1196 T46 oas.SolrTestCaseJ4.tearDown ###Ending testWithSimpleTransformer
[junit4:junit4]   2> NOTE: reproduce with: ant test  -Dtestcase=TestSqlEntityProcessorDelta -Dtests.method=testWithSimpleTransformer -Dtests.seed=103A3F6EAC3C5255 -Dtests.multiplier=3 -Dtests.slow=true -Dtests.locale=th_TH_TH_#u-nu-thai -Dtests.timezone=Asia/Chongqing -Dtests.file.encoding=UTF-8
[junit4:junit4] ERROR   0.13s J1 | TestSqlEntityProcessorDelta.testWithSimpleTransformer <<<
[junit4:junit4]    > Throwable #1: java.lang.RuntimeException: Exception during query
[junit4:junit4]    > 	at __randomizedtesting.SeedInfo.seed([103A3F6EAC3C5255:7F7E178476EA3E58]:0)
[junit4:junit4]    > 	at org.apache.solr.SolrTestCaseJ4.assertQ(SolrTestCaseJ4.java:513)
[junit4:junit4]    > 	at org.apache.solr.SolrTestCaseJ4.assertQ(SolrTestCaseJ4.java:480)
[junit4:junit4]    > 	at org.apache.solr.handler.dataimport.AbstractDIHJdbcTestCase.simpleTransform(AbstractDIHJdbcTestCase.java:108)
[junit4:junit4]    > 	at org.apache.solr.handler.dataimport.TestSqlEntityProcessorDelta.testWithSimpleTransformer(TestSqlEntityProcessorDelta.java:51)
[junit4:junit4]    > 	at sun.reflect.NativeMethodAccessorImpl.invoke0(Native Method)
[junit4:junit4]    > 	at sun.reflect.NativeMethodAccessorImpl.invoke(NativeMethodAccessorImpl.java:57)
[junit4:junit4]    > 	at sun.reflect.DelegatingMethodAccessorImpl.invoke(DelegatingMethodAccessorImpl.java:43)
[junit4:junit4]    > 	at java.lang.reflect.Method.invoke(Method.java:474)
[junit4:junit4]    > 	at com.carrotsearch.randomizedtesting.RandomizedRunner.invoke(RandomizedRunner.java:1559)
[junit4:junit4]    > 	at com.carrotsearch.randomizedtesting.RandomizedRunner.access$600(RandomizedRunner.java:79)
[junit4:junit4]    > 	at com.carrotsearch.randomizedtesting.RandomizedRunner$6.evaluate(RandomizedRunner.java:737)
[junit4:junit4]    > 	at com.carrotsearch.randomizedtesting.RandomizedRunner$7.evaluate(RandomizedRunner.java:773)
[junit4:junit4]    > 	at com.carrotsearch.randomizedtesting.RandomizedRunner$8.evaluate(RandomizedRunner.java:787)
[junit4:junit4]    > 	at com.carrotsearch.randomizedtesting.rules.SystemPropertiesRestoreRule$1.evaluate(SystemPropertiesRestoreRule.java:53)
[junit4:junit4]    > 	at org.apache.lucene.util.TestRuleSetupTeardownChained$1.evaluate(TestRuleSetupTeardownChained.java:50)
[junit4:junit4]    > 	at org.apache.lucene.util.TestRuleFieldCacheSanity$1.evaluate(TestRuleFieldCacheSanity.java:51)
[junit4:junit4]    > 	at org.apache.lucene.util.AbstractBeforeAfterRule$1.evaluate(AbstractBeforeAfterRule.java:45)
[junit4:junit4]    > 	at com.carrotsearch.randomizedtesting.rules.SystemPropertiesInvariantRule$1.evaluate(SystemPropertiesInvariantRule.java:55)
[junit4:junit4]    > 	at org.apache.lucene.util.TestRuleThreadAndTestName$1.evaluate(TestRuleThreadAndTestName.java:48)
[junit4:junit4]    > 	at org.apache.lucene.util.TestRuleIgnoreAfterMaxFailures$1.evaluate(TestRuleIgnoreAfterMaxFailures.java:70)
[junit4:junit4]    > 	at org.apache.lucene.util.TestRuleMarkFailure$1.evaluate(TestRuleMarkFailure.java:48)
[junit4:junit4]    > 	at com.carrotsearch.randomizedtesting.rules.StatementAdapter.evaluate(StatementAdapter.java:36)
[junit4:junit4]    > 	at com.carrotsearch.randomizedtesting.ThreadLeakControl$StatementRunner.run(ThreadLeakControl.java:358)
[junit4:junit4]    > 	at com.carrotsearch.randomizedtesting.ThreadLeakControl.forkTimeoutingTask(ThreadLeakControl.java:782)
[junit4:junit4]    > 	at com.carrotsearch.randomizedtesting.ThreadLeakControl$3.evaluate(ThreadLeakControl.java:442)
[junit4:junit4]    > 	at com.carrotsearch.randomizedtesting.RandomizedRunner.runSingleTest(RandomizedRunner.java:746)
[junit4:junit4]    > 	at com.carrotsearch.randomizedtesting.RandomizedRunner$3.evaluate(RandomizedRunner.java:648)
[junit4:junit4]    > 	at com.carrotsearch.randomizedtesting.RandomizedRunner$4.evaluate(RandomizedRunner.java:682)
[junit4:junit4]    > 	at com.carrotsearch.randomizedtesting.RandomizedRunner$5.evaluate(RandomizedRunner.java:693)
[junit4:junit4]    > 	at com.carrotsearch.randomizedtesting.rules.StatementAdapter.evaluate(StatementAdapter.java:36)
[junit4:junit4]    > 	at com.carrotsearch.randomizedtesting.rules.SystemPropertiesRestoreRule$1.evaluate(SystemPropertiesRestoreRule.java:53)
[junit4:junit4]    > 	at org.apache.lucene.util.AbstractBeforeAfterRule$1.evaluate(AbstractBeforeAfterRule.java:45)
[junit4:junit4]    > 	at org.apache.lucene.util.TestRuleStoreClassName$1.evaluate(TestRuleStoreClassName.java:42)
[junit4:junit4]    > 	at com.carrotsearch.randomizedtesting.rules.SystemPropertiesInvariantRule$1.evaluate(SystemPropertiesInvariantRule.java:55)
[junit4:junit4]    > 	at com.carrotsearch.randomizedtesting.rules.NoShadowingOrOverridesOnMethodsRule$1.evaluate(NoShadowingOrOverridesOnMethodsRule.java:39)
[junit4:junit4]    > 	at com.carrotsearch.randomizedtesting.rules.NoShadowingOrOverridesOnMethodsRule$1.evaluate(NoShadowingOrOverridesOnMethodsRule.java:39)
[junit4:junit4]    > 	at com.carrotsearch.randomizedtesting.rules.StatementAdapter.evaluate(StatementAdapter.java:36)
[junit4:junit4]    > 	at org.apache.lucene.util.TestRuleAssertionsRequired$1.evaluate(TestRuleAssertionsRequired.java:43)
[junit4:junit4]    > 	at org.apache.lucene.util.TestRuleMarkFailure$1.evaluate(TestRuleMarkFailure.java:48)
[junit4:junit4]    > 	at org.apache.lucene.util.TestRuleIgnoreAfterMaxFailures$1.evaluate(TestRuleIgnoreAfterMaxFailures.java:70)
[junit4:junit4]    > 	at org.apache.lucene.util.TestRuleIgnoreTestSuites$1.evaluate(TestRuleIgnoreTestSuites.java:55)
[junit4:junit4]    > 	at com.carrotsearch.randomizedtesting.rules.StatementAdapter.evaluate(StatementAdapter.java:36)
[junit4:junit4]    > 	at com.carrotsearch.randomizedtesting.ThreadLeakControl$StatementRunner.run(ThreadLeakControl.java:358)
[junit4:junit4]    > 	at java.lang.Thread.run(Thread.java:722)
[junit4:junit4]    > Caused by: java.lang.RuntimeException: REQUEST FAILED: xpath=//*[@numFound='16']
[junit4:junit4]    > 	xml response was: <?xml version="1.0" encoding="UTF-8"?>
[junit4:junit4]    > <response>
[junit4:junit4]    > <lst name="responseHeader"><int name="status">0</int><int name="QTime">1</int><lst name="params"><str name="version">2.2</str><str name="qt">standard</str><str name="q">AddAColumn_s:Added</str><str name="rows">20</str><str name="start">0</str></lst></lst><result name="response" numFound="20" start="0"><doc><arr name="NAME_mult_s"><str>Jacob</str></arr><str name="id">1</str><arr name="COUNTRY_CODES_mult_s"><str>NZ</str></arr><str name="AddAColumn_s">Added</str><date name="timestamp">2012-11-08T12:11:31.821Z</date></doc><doc><arr name="NAME_mult_s"><str>Ethan</str></arr><str name="id">2</str><arr name="COUNTRY_CODES_mult_s"><str>NU</str></arr><str name="AddAColumn_s">Added</str><date name="timestamp">2012-11-08T12:11:31.821Z</date></doc><doc><arr name="NAME_mult_s"><str>Michael</str></arr><str name="id">3</str><arr name="COUNTRY_CODES_mult_s"><str>NR</str></arr><str name="AddAColumn_s">Added</str><date name="timestamp">2012-11-08T12:11:31.821Z</date></doc><doc><arr name="NAME_mult_s"><str>Jayden</str></arr><str name="id">4</str><arr name="COUNTRY_CODES_mult_s"><str>NP</str></arr><str name="AddAColumn_s">Added</str><date name="timestamp">2012-11-08T12:11:31.821Z</date></doc><doc><arr name="NAME_mult_s"><str>William</str></arr><str name="id">5</str><arr name="COUNTRY_CODES_mult_s"><str>NO</str></arr><str name="AddAColumn_s">Added</str><date name="timestamp">2012-11-08T12:11:31.821Z</date></doc><doc><arr name="NAME_mult_s"><str>Alexander</str></arr><str name="id">6</str><arr name="COUNTRY_CODES_mult_s"><str>NL</str></arr><str name="AddAColumn_s">Added</str><date name="timestamp">2012-11-08T12:11:31.821Z</date></doc><doc><arr name="NAME_mult_s"><str>Noah</str></arr><str name="id">7</str><arr name="COUNTRY_CODES_mult_s"><str>NI</str></arr><str name="AddAColumn_s">Added</str><date name="timestamp">2012-11-08T12:11:31.821Z</date></doc><doc><arr name="NAME_mult_s"><str>Daniel</str></arr><str name="id">8</str><arr name="COUNTRY_CODES_mult_s"><str>NG</str></arr><str name="AddAColumn_s">Added</str><date name="timestamp">2012-11-08T12:11:31.821Z</date></doc><doc><arr name="NAME_mult_s"><str>Aiden</str></arr><str name="id">9</str><arr name="COUNTRY_CODES_mult_s"><str>NF</str></arr><str name="AddAColumn_s">Added</str><date name="timestamp">2012-11-08T12:11:31.821Z</date></doc><doc><arr name="NAME_mult_s"><str>Anthony</str></arr><str name="id">10</str><arr name="COUNTRY_CODES_mult_s"><str>NE</str></arr><str name="AddAColumn_s">Added</str><date name="timestamp">2012-11-08T12:11:31.821Z</date></doc><doc><arr name="NAME_mult_s"><str>Emma</str></arr><str name="id">11</str><arr name="COUNTRY_CODES_mult_s"><str>NL</str></arr><str name="AddAColumn_s">Added</str><date name="timestamp">2012-11-08T12:11:31.821Z</date></doc><doc><arr name="NAME_mult_s"><str>Grace</str></arr><str name="id">12</str><arr name="COUNTRY_CODES_mult_s"><str>NI</str></arr><str name="AddAColumn_s">Added</str><date name="timestamp">2012-11-08T12:11:31.821Z</date></doc><doc><arr name="NAME_mult_s"><str>Hailey</str></arr><str name="id">13</str><arr name="COUNTRY_CODES_mult_s"><str>NG</str></arr><str name="AddAColumn_s">Added</str><date name="timestamp">2012-11-08T12:11:31.821Z</date></doc><doc><arr name="NAME_mult_s"><str>Isabella</str></arr><str name="id">14</str><arr name="COUNTRY_CODES_mult_s"><str>NF</str></arr><str name="AddAColumn_s">Added</str><date name="timestamp">2012-11-08T12:11:31.821Z</date></doc><doc><arr name="NAME_mult_s"><str>Lily</str></arr><str name="id">15</str><arr name="COUNTRY_CODES_mult_s"><str>NE</str></arr><str name="AddAColumn_s">Added</str><date name="timestamp">2012-11-08T12:11:31.821Z</date></doc><doc><arr name="NAME_mult_s"><str>Madison</str></arr><str name="id">16</str><arr name="COUNTRY_CODES_mult_s"><str>NC</str></arr><str name="AddAColumn_s">Added</str><date name="timestamp">2012-11-08T12:11:31.821Z</date></doc><doc><arr name="NAME_mult_s"><str>Mia</str></arr><str name="id">17</str><arr name="COUNTRY_CODES_mult_s"><str>NA</str></arr><str name="AddAColumn_s">Added</str><date name="timestamp">2012-11-08T12:11:31.821Z</date></doc><doc><arr name="NAME_mult_s"><str>Natalie</str></arr><str name="id">18</str><arr name="COUNTRY_CODES_mult_s"><str>NZ</str></arr><str name="AddAColumn_s">Added</str><date name="timestamp">2012-11-08T12:11:31.821Z</date></doc><doc><arr name="NAME_mult_s"><str>Olivia</str></arr><str name="id">19</str><arr name="COUNTRY_CODES_mult_s"><str>NU</str></arr><str name="AddAColumn_s">Added</str><date name="timestamp">2012-11-08T12:11:31.821Z</date></doc><doc><arr name="NAME_mult_s"><str>Samantha</str></arr><str name="id">20</str><arr name="COUNTRY_CODES_mult_s"><str>NR</str></arr><str name="AddAColumn_s">Added</str><date name="timestamp">2012-11-08T12:11:31.821Z</date></doc></result>
[junit4:junit4]    > </response>
[junit4:junit4]    > 
[junit4:junit4]    > 	request was:version=2.2&qt=standard&q=AddAColumn_s:Added&rows=20&start=0
[junit4:junit4]    > 	at org.apache.solr.SolrTestCaseJ4.assertQ(SolrTestCaseJ4.java:506)
[junit4:junit4]    > 	... 43 more
[junit4:junit4]   2> 1211 T46 oas.SolrTestCaseJ4.deleteCore ###deleteCore
[junit4:junit4]   2> 1211 T46 oasc.CoreContainer.shutdown Shutting down CoreContainer instance=1009800546
[junit4:junit4]   2> 1211 T46 oasc.SolrCore.close [collection1]  CLOSING SolrCore org.apache.solr.core.SolrCore@7745e872
[junit4:junit4]   2> 1212 T46 oasu.DirectUpdateHandler2.close closing DirectUpdateHandler2{commits=8,autocommits=0,soft autocommits=0,optimizes=0,rollbacks=0,expungeDeletes=0,docsPending=0,adds=0,deletesById=0,deletesByQuery=0,errors=0,cumulative_adds=120,cumulative_deletesById=0,cumulative_deletesByQuery=8,cumulative_errors=0}
[junit4:junit4]   2> 1212 T46 oasc.SolrCore.decrefSolrCoreState Closing SolrCoreState
[junit4:junit4]   2> 1212 T46 oasu.DefaultSolrCoreState.closeIndexWriter SolrCoreState ref count has reached 0 - closing IndexWriter
[junit4:junit4]   2> 1213 T46 oasu.DefaultSolrCoreState.closeIndexWriter closing IndexWriter with IndexWriterCloser
[junit4:junit4]   2> 1214 T46 oasc.SolrCore.closeSearcher [collection1] Closing main searcher on request.
[junit4:junit4]   2> NOTE: test params are: codec=Lucene40, sim=DefaultSimilarity, locale=th_TH_TH_#u-nu-thai, timezone=Asia/Chongqing
[junit4:junit4]   2> NOTE: Linux 3.2.0-32-generic amd64/Oracle Corporation 1.8.0-ea (64-bit)/cpus=8,threads=1,free=110016320,total=126484480
[junit4:junit4]   2> NOTE: All tests run in this JVM: [TestFileListEntityProcessor, TestDocBuilder, TestScriptTransformer, TestTemplateTransformer, TestContentStreamDataSource, TestXPathRecordReader, TestSqlEntityProcessorDelta]
[junit4:junit4] Completed on J1 in 1.24s, 4 tests, 4 errors <<< FAILURES!

[...truncated 85 lines...]
BUILD FAILED
/mnt/ssd/jenkins/workspace/Lucene-Solr-4.x-Linux/build.xml:335: The following error occurred while executing this line:
/mnt/ssd/jenkins/workspace/Lucene-Solr-4.x-Linux/build.xml:39: The following error occurred while executing this line:
/mnt/ssd/jenkins/workspace/Lucene-Solr-4.x-Linux/solr/build.xml:192: The following error occurred while executing this line:
/mnt/ssd/jenkins/workspace/Lucene-Solr-4.x-Linux/solr/common-build.xml:410: The following error occurred while executing this line:
/mnt/ssd/jenkins/workspace/Lucene-Solr-4.x-Linux/lucene/module-build.xml:61: The following error occurred while executing this line:
/mnt/ssd/jenkins/workspace/Lucene-Solr-4.x-Linux/lucene/common-build.xml:1163: The following error occurred while executing this line:
/mnt/ssd/jenkins/workspace/Lucene-Solr-4.x-Linux/lucene/common-build.xml:827: There were test failures: 33 suites, 138 tests, 4 errors, 5 ignored

Total time: 25 minutes 52 seconds
Build step 'Invoke Ant' marked build as failure
Archiving artifacts
Recording test results
Description set: Java: 64bit/jdk1.8.0-ea-b58 -XX:+UseSerialGC
Email was triggered for: Failure
Sending email for trigger: Failure



Mime
View raw message