lucene-dev mailing list archives

Site index · List index
Message view « Date » · « Thread »
Top « Date » · « Thread »
From Apache Jenkins Server <jenk...@builds.apache.org>
Subject [JENKINS] Lucene-Solr-Tests-trunk-java7 - Build # 3367 - Still Failing
Date Thu, 08 Nov 2012 23:23:21 GMT
Build: https://builds.apache.org/job/Lucene-Solr-Tests-trunk-java7/3367/

4 tests failed.
FAILED:  junit.framework.TestSuite.org.apache.solr.cloud.BasicDistributedZkTest

Error Message:
8 threads leaked from SUITE scope at org.apache.solr.cloud.BasicDistributedZkTest:     1) Thread[id=91, name=qtp463011245-91 Acceptor1 SelectChannelConnector@0.0.0.0:26278, state=RUNNABLE, group=TGRP-BasicDistributedZkTest]         at sun.nio.ch.ServerSocketChannelImpl.accept0(Native Method)         at sun.nio.ch.ServerSocketChannelImpl.accept(ServerSocketChannelImpl.java:226)         at org.eclipse.jetty.server.nio.SelectChannelConnector.accept(SelectChannelConnector.java:109)         at org.eclipse.jetty.server.AbstractConnector$Acceptor.run(AbstractConnector.java:938)         at org.eclipse.jetty.util.thread.QueuedThreadPool.runJob(QueuedThreadPool.java:608)         at org.eclipse.jetty.util.thread.QueuedThreadPool$3.run(QueuedThreadPool.java:543)         at java.lang.Thread.run(Thread.java:722)    2) Thread[id=109, name=qtp681018185-109 Acceptor1 SelectChannelConnector@0.0.0.0:41576, state=RUNNABLE, group=TGRP-BasicDistributedZkTest]         at sun.nio.ch.ServerSocketChannelImpl.accept0(Native Method)         at sun.nio.ch.ServerSocketChannelImpl.accept(ServerSocketChannelImpl.java:226)         at org.eclipse.jetty.server.nio.SelectChannelConnector.accept(SelectChannelConnector.java:109)         at org.eclipse.jetty.server.AbstractConnector$Acceptor.run(AbstractConnector.java:938)         at org.eclipse.jetty.util.thread.QueuedThreadPool.runJob(QueuedThreadPool.java:608)         at org.eclipse.jetty.util.thread.QueuedThreadPool$3.run(QueuedThreadPool.java:543)         at java.lang.Thread.run(Thread.java:722)    3) Thread[id=92, name=qtp463011245-92 Acceptor2 SelectChannelConnector@0.0.0.0:26278, state=BLOCKED, group=TGRP-BasicDistributedZkTest]         at sun.nio.ch.ServerSocketChannelImpl.accept(ServerSocketChannelImpl.java:210)         at org.eclipse.jetty.server.nio.SelectChannelConnector.accept(SelectChannelConnector.java:109)         at org.eclipse.jetty.server.AbstractConnector$Acceptor.run(AbstractConnector.java:938)         at org.eclipse.jetty.util.thread.QueuedThreadPool.runJob(QueuedThreadPool.java:608)         at org.eclipse.jetty.util.thread.QueuedThreadPool$3.run(QueuedThreadPool.java:543)         at java.lang.Thread.run(Thread.java:722)    4) Thread[id=108, name=qtp681018185-108 Acceptor0 SelectChannelConnector@0.0.0.0:41576, state=BLOCKED, group=TGRP-BasicDistributedZkTest]         at sun.nio.ch.ServerSocketChannelImpl.accept(ServerSocketChannelImpl.java:210)         at org.eclipse.jetty.server.nio.SelectChannelConnector.accept(SelectChannelConnector.java:109)         at org.eclipse.jetty.server.AbstractConnector$Acceptor.run(AbstractConnector.java:938)         at org.eclipse.jetty.util.thread.QueuedThreadPool.runJob(QueuedThreadPool.java:608)         at org.eclipse.jetty.util.thread.QueuedThreadPool$3.run(QueuedThreadPool.java:543)         at java.lang.Thread.run(Thread.java:722)    5) Thread[id=110, name=qtp681018185-110 Acceptor2 SelectChannelConnector@0.0.0.0:41576, state=BLOCKED, group=TGRP-BasicDistributedZkTest]         at sun.nio.ch.ServerSocketChannelImpl.accept(ServerSocketChannelImpl.java:210)         at org.eclipse.jetty.server.nio.SelectChannelConnector.accept(SelectChannelConnector.java:109)         at org.eclipse.jetty.server.AbstractConnector$Acceptor.run(AbstractConnector.java:938)         at org.eclipse.jetty.util.thread.QueuedThreadPool.runJob(QueuedThreadPool.java:608)         at org.eclipse.jetty.util.thread.QueuedThreadPool$3.run(QueuedThreadPool.java:543)         at java.lang.Thread.run(Thread.java:722)    6) Thread[id=111, name=qtp681018185-111 Acceptor3 SelectChannelConnector@0.0.0.0:41576, state=BLOCKED, group=TGRP-BasicDistributedZkTest]         at sun.nio.ch.ServerSocketChannelImpl.accept(ServerSocketChannelImpl.java:210)         at org.eclipse.jetty.server.nio.SelectChannelConnector.accept(SelectChannelConnector.java:109)         at org.eclipse.jetty.server.AbstractConnector$Acceptor.run(AbstractConnector.java:938)         at org.eclipse.jetty.util.thread.QueuedThreadPool.runJob(QueuedThreadPool.java:608)         at org.eclipse.jetty.util.thread.QueuedThreadPool$3.run(QueuedThreadPool.java:543)         at java.lang.Thread.run(Thread.java:722)    7) Thread[id=90, name=qtp463011245-90 Acceptor0 SelectChannelConnector@0.0.0.0:26278, state=BLOCKED, group=TGRP-BasicDistributedZkTest]         at sun.nio.ch.ServerSocketChannelImpl.accept(ServerSocketChannelImpl.java:210)         at org.eclipse.jetty.server.nio.SelectChannelConnector.accept(SelectChannelConnector.java:109)         at org.eclipse.jetty.server.AbstractConnector$Acceptor.run(AbstractConnector.java:938)         at org.eclipse.jetty.util.thread.QueuedThreadPool.runJob(QueuedThreadPool.java:608)         at org.eclipse.jetty.util.thread.QueuedThreadPool$3.run(QueuedThreadPool.java:543)         at java.lang.Thread.run(Thread.java:722)    8) Thread[id=93, name=qtp463011245-93 Acceptor3 SelectChannelConnector@0.0.0.0:26278, state=BLOCKED, group=TGRP-BasicDistributedZkTest]         at sun.nio.ch.ServerSocketChannelImpl.accept(ServerSocketChannelImpl.java:210)         at org.eclipse.jetty.server.nio.SelectChannelConnector.accept(SelectChannelConnector.java:109)         at org.eclipse.jetty.server.AbstractConnector$Acceptor.run(AbstractConnector.java:938)         at org.eclipse.jetty.util.thread.QueuedThreadPool.runJob(QueuedThreadPool.java:608)         at org.eclipse.jetty.util.thread.QueuedThreadPool$3.run(QueuedThreadPool.java:543)         at java.lang.Thread.run(Thread.java:722)

Stack Trace:
com.carrotsearch.randomizedtesting.ThreadLeakError: 8 threads leaked from SUITE scope at org.apache.solr.cloud.BasicDistributedZkTest: 
   1) Thread[id=91, name=qtp463011245-91 Acceptor1 SelectChannelConnector@0.0.0.0:26278, state=RUNNABLE, group=TGRP-BasicDistributedZkTest]
        at sun.nio.ch.ServerSocketChannelImpl.accept0(Native Method)
        at sun.nio.ch.ServerSocketChannelImpl.accept(ServerSocketChannelImpl.java:226)
        at org.eclipse.jetty.server.nio.SelectChannelConnector.accept(SelectChannelConnector.java:109)
        at org.eclipse.jetty.server.AbstractConnector$Acceptor.run(AbstractConnector.java:938)
        at org.eclipse.jetty.util.thread.QueuedThreadPool.runJob(QueuedThreadPool.java:608)
        at org.eclipse.jetty.util.thread.QueuedThreadPool$3.run(QueuedThreadPool.java:543)
        at java.lang.Thread.run(Thread.java:722)
   2) Thread[id=109, name=qtp681018185-109 Acceptor1 SelectChannelConnector@0.0.0.0:41576, state=RUNNABLE, group=TGRP-BasicDistributedZkTest]
        at sun.nio.ch.ServerSocketChannelImpl.accept0(Native Method)
        at sun.nio.ch.ServerSocketChannelImpl.accept(ServerSocketChannelImpl.java:226)
        at org.eclipse.jetty.server.nio.SelectChannelConnector.accept(SelectChannelConnector.java:109)
        at org.eclipse.jetty.server.AbstractConnector$Acceptor.run(AbstractConnector.java:938)
        at org.eclipse.jetty.util.thread.QueuedThreadPool.runJob(QueuedThreadPool.java:608)
        at org.eclipse.jetty.util.thread.QueuedThreadPool$3.run(QueuedThreadPool.java:543)
        at java.lang.Thread.run(Thread.java:722)
   3) Thread[id=92, name=qtp463011245-92 Acceptor2 SelectChannelConnector@0.0.0.0:26278, state=BLOCKED, group=TGRP-BasicDistributedZkTest]
        at sun.nio.ch.ServerSocketChannelImpl.accept(ServerSocketChannelImpl.java:210)
        at org.eclipse.jetty.server.nio.SelectChannelConnector.accept(SelectChannelConnector.java:109)
        at org.eclipse.jetty.server.AbstractConnector$Acceptor.run(AbstractConnector.java:938)
        at org.eclipse.jetty.util.thread.QueuedThreadPool.runJob(QueuedThreadPool.java:608)
        at org.eclipse.jetty.util.thread.QueuedThreadPool$3.run(QueuedThreadPool.java:543)
        at java.lang.Thread.run(Thread.java:722)
   4) Thread[id=108, name=qtp681018185-108 Acceptor0 SelectChannelConnector@0.0.0.0:41576, state=BLOCKED, group=TGRP-BasicDistributedZkTest]
        at sun.nio.ch.ServerSocketChannelImpl.accept(ServerSocketChannelImpl.java:210)
        at org.eclipse.jetty.server.nio.SelectChannelConnector.accept(SelectChannelConnector.java:109)
        at org.eclipse.jetty.server.AbstractConnector$Acceptor.run(AbstractConnector.java:938)
        at org.eclipse.jetty.util.thread.QueuedThreadPool.runJob(QueuedThreadPool.java:608)
        at org.eclipse.jetty.util.thread.QueuedThreadPool$3.run(QueuedThreadPool.java:543)
        at java.lang.Thread.run(Thread.java:722)
   5) Thread[id=110, name=qtp681018185-110 Acceptor2 SelectChannelConnector@0.0.0.0:41576, state=BLOCKED, group=TGRP-BasicDistributedZkTest]
        at sun.nio.ch.ServerSocketChannelImpl.accept(ServerSocketChannelImpl.java:210)
        at org.eclipse.jetty.server.nio.SelectChannelConnector.accept(SelectChannelConnector.java:109)
        at org.eclipse.jetty.server.AbstractConnector$Acceptor.run(AbstractConnector.java:938)
        at org.eclipse.jetty.util.thread.QueuedThreadPool.runJob(QueuedThreadPool.java:608)
        at org.eclipse.jetty.util.thread.QueuedThreadPool$3.run(QueuedThreadPool.java:543)
        at java.lang.Thread.run(Thread.java:722)
   6) Thread[id=111, name=qtp681018185-111 Acceptor3 SelectChannelConnector@0.0.0.0:41576, state=BLOCKED, group=TGRP-BasicDistributedZkTest]
        at sun.nio.ch.ServerSocketChannelImpl.accept(ServerSocketChannelImpl.java:210)
        at org.eclipse.jetty.server.nio.SelectChannelConnector.accept(SelectChannelConnector.java:109)
        at org.eclipse.jetty.server.AbstractConnector$Acceptor.run(AbstractConnector.java:938)
        at org.eclipse.jetty.util.thread.QueuedThreadPool.runJob(QueuedThreadPool.java:608)
        at org.eclipse.jetty.util.thread.QueuedThreadPool$3.run(QueuedThreadPool.java:543)
        at java.lang.Thread.run(Thread.java:722)
   7) Thread[id=90, name=qtp463011245-90 Acceptor0 SelectChannelConnector@0.0.0.0:26278, state=BLOCKED, group=TGRP-BasicDistributedZkTest]
        at sun.nio.ch.ServerSocketChannelImpl.accept(ServerSocketChannelImpl.java:210)
        at org.eclipse.jetty.server.nio.SelectChannelConnector.accept(SelectChannelConnector.java:109)
        at org.eclipse.jetty.server.AbstractConnector$Acceptor.run(AbstractConnector.java:938)
        at org.eclipse.jetty.util.thread.QueuedThreadPool.runJob(QueuedThreadPool.java:608)
        at org.eclipse.jetty.util.thread.QueuedThreadPool$3.run(QueuedThreadPool.java:543)
        at java.lang.Thread.run(Thread.java:722)
   8) Thread[id=93, name=qtp463011245-93 Acceptor3 SelectChannelConnector@0.0.0.0:26278, state=BLOCKED, group=TGRP-BasicDistributedZkTest]
        at sun.nio.ch.ServerSocketChannelImpl.accept(ServerSocketChannelImpl.java:210)
        at org.eclipse.jetty.server.nio.SelectChannelConnector.accept(SelectChannelConnector.java:109)
        at org.eclipse.jetty.server.AbstractConnector$Acceptor.run(AbstractConnector.java:938)
        at org.eclipse.jetty.util.thread.QueuedThreadPool.runJob(QueuedThreadPool.java:608)
        at org.eclipse.jetty.util.thread.QueuedThreadPool$3.run(QueuedThreadPool.java:543)
        at java.lang.Thread.run(Thread.java:722)
	at __randomizedtesting.SeedInfo.seed([CFFDFEE3956D3CD6]:0)


FAILED:  junit.framework.TestSuite.org.apache.solr.cloud.BasicDistributedZkTest

Error Message:
There are still zombie threads that couldn't be terminated:    1) Thread[id=91, name=qtp463011245-91 Acceptor1 SelectChannelConnector@0.0.0.0:26278, state=RUNNABLE, group=TGRP-BasicDistributedZkTest]         at sun.nio.ch.ServerSocketChannelImpl.accept0(Native Method)         at sun.nio.ch.ServerSocketChannelImpl.accept(ServerSocketChannelImpl.java:226)         at org.eclipse.jetty.server.nio.SelectChannelConnector.accept(SelectChannelConnector.java:109)         at org.eclipse.jetty.server.AbstractConnector$Acceptor.run(AbstractConnector.java:938)         at org.eclipse.jetty.util.thread.QueuedThreadPool.runJob(QueuedThreadPool.java:608)         at org.eclipse.jetty.util.thread.QueuedThreadPool$3.run(QueuedThreadPool.java:543)         at java.lang.Thread.run(Thread.java:722)    2) Thread[id=109, name=qtp681018185-109 Acceptor1 SelectChannelConnector@0.0.0.0:41576, state=RUNNABLE, group=TGRP-BasicDistributedZkTest]         at sun.nio.ch.ServerSocketChannelImpl.accept0(Native Method)         at sun.nio.ch.ServerSocketChannelImpl.accept(ServerSocketChannelImpl.java:226)         at org.eclipse.jetty.server.nio.SelectChannelConnector.accept(SelectChannelConnector.java:109)         at org.eclipse.jetty.server.AbstractConnector$Acceptor.run(AbstractConnector.java:938)         at org.eclipse.jetty.util.thread.QueuedThreadPool.runJob(QueuedThreadPool.java:608)         at org.eclipse.jetty.util.thread.QueuedThreadPool$3.run(QueuedThreadPool.java:543)         at java.lang.Thread.run(Thread.java:722)    3) Thread[id=92, name=qtp463011245-92 Acceptor2 SelectChannelConnector@0.0.0.0:26278, state=BLOCKED, group=TGRP-BasicDistributedZkTest]         at sun.nio.ch.ServerSocketChannelImpl.accept(ServerSocketChannelImpl.java:210)         at org.eclipse.jetty.server.nio.SelectChannelConnector.accept(SelectChannelConnector.java:109)         at org.eclipse.jetty.server.AbstractConnector$Acceptor.run(AbstractConnector.java:938)         at org.eclipse.jetty.util.thread.QueuedThreadPool.runJob(QueuedThreadPool.java:608)         at org.eclipse.jetty.util.thread.QueuedThreadPool$3.run(QueuedThreadPool.java:543)         at java.lang.Thread.run(Thread.java:722)    4) Thread[id=108, name=qtp681018185-108 Acceptor0 SelectChannelConnector@0.0.0.0:41576, state=BLOCKED, group=TGRP-BasicDistributedZkTest]         at sun.nio.ch.ServerSocketChannelImpl.accept(ServerSocketChannelImpl.java:210)         at org.eclipse.jetty.server.nio.SelectChannelConnector.accept(SelectChannelConnector.java:109)         at org.eclipse.jetty.server.AbstractConnector$Acceptor.run(AbstractConnector.java:938)         at org.eclipse.jetty.util.thread.QueuedThreadPool.runJob(QueuedThreadPool.java:608)         at org.eclipse.jetty.util.thread.QueuedThreadPool$3.run(QueuedThreadPool.java:543)         at java.lang.Thread.run(Thread.java:722)    5) Thread[id=110, name=qtp681018185-110 Acceptor2 SelectChannelConnector@0.0.0.0:41576, state=BLOCKED, group=TGRP-BasicDistributedZkTest]         at sun.nio.ch.ServerSocketChannelImpl.accept(ServerSocketChannelImpl.java:210)         at org.eclipse.jetty.server.nio.SelectChannelConnector.accept(SelectChannelConnector.java:109)         at org.eclipse.jetty.server.AbstractConnector$Acceptor.run(AbstractConnector.java:938)         at org.eclipse.jetty.util.thread.QueuedThreadPool.runJob(QueuedThreadPool.java:608)         at org.eclipse.jetty.util.thread.QueuedThreadPool$3.run(QueuedThreadPool.java:543)         at java.lang.Thread.run(Thread.java:722)    6) Thread[id=111, name=qtp681018185-111 Acceptor3 SelectChannelConnector@0.0.0.0:41576, state=BLOCKED, group=TGRP-BasicDistributedZkTest]         at sun.nio.ch.ServerSocketChannelImpl.accept(ServerSocketChannelImpl.java:210)         at org.eclipse.jetty.server.nio.SelectChannelConnector.accept(SelectChannelConnector.java:109)         at org.eclipse.jetty.server.AbstractConnector$Acceptor.run(AbstractConnector.java:938)         at org.eclipse.jetty.util.thread.QueuedThreadPool.runJob(QueuedThreadPool.java:608)         at org.eclipse.jetty.util.thread.QueuedThreadPool$3.run(QueuedThreadPool.java:543)         at java.lang.Thread.run(Thread.java:722)    7) Thread[id=90, name=qtp463011245-90 Acceptor0 SelectChannelConnector@0.0.0.0:26278, state=BLOCKED, group=TGRP-BasicDistributedZkTest]         at sun.nio.ch.ServerSocketChannelImpl.accept(ServerSocketChannelImpl.java:210)         at org.eclipse.jetty.server.nio.SelectChannelConnector.accept(SelectChannelConnector.java:109)         at org.eclipse.jetty.server.AbstractConnector$Acceptor.run(AbstractConnector.java:938)         at org.eclipse.jetty.util.thread.QueuedThreadPool.runJob(QueuedThreadPool.java:608)         at org.eclipse.jetty.util.thread.QueuedThreadPool$3.run(QueuedThreadPool.java:543)         at java.lang.Thread.run(Thread.java:722)    8) Thread[id=93, name=qtp463011245-93 Acceptor3 SelectChannelConnector@0.0.0.0:26278, state=BLOCKED, group=TGRP-BasicDistributedZkTest]         at sun.nio.ch.ServerSocketChannelImpl.accept(ServerSocketChannelImpl.java:210)         at org.eclipse.jetty.server.nio.SelectChannelConnector.accept(SelectChannelConnector.java:109)         at org.eclipse.jetty.server.AbstractConnector$Acceptor.run(AbstractConnector.java:938)         at org.eclipse.jetty.util.thread.QueuedThreadPool.runJob(QueuedThreadPool.java:608)         at org.eclipse.jetty.util.thread.QueuedThreadPool$3.run(QueuedThreadPool.java:543)         at java.lang.Thread.run(Thread.java:722)

Stack Trace:
com.carrotsearch.randomizedtesting.ThreadLeakError: There are still zombie threads that couldn't be terminated:
   1) Thread[id=91, name=qtp463011245-91 Acceptor1 SelectChannelConnector@0.0.0.0:26278, state=RUNNABLE, group=TGRP-BasicDistributedZkTest]
        at sun.nio.ch.ServerSocketChannelImpl.accept0(Native Method)
        at sun.nio.ch.ServerSocketChannelImpl.accept(ServerSocketChannelImpl.java:226)
        at org.eclipse.jetty.server.nio.SelectChannelConnector.accept(SelectChannelConnector.java:109)
        at org.eclipse.jetty.server.AbstractConnector$Acceptor.run(AbstractConnector.java:938)
        at org.eclipse.jetty.util.thread.QueuedThreadPool.runJob(QueuedThreadPool.java:608)
        at org.eclipse.jetty.util.thread.QueuedThreadPool$3.run(QueuedThreadPool.java:543)
        at java.lang.Thread.run(Thread.java:722)
   2) Thread[id=109, name=qtp681018185-109 Acceptor1 SelectChannelConnector@0.0.0.0:41576, state=RUNNABLE, group=TGRP-BasicDistributedZkTest]
        at sun.nio.ch.ServerSocketChannelImpl.accept0(Native Method)
        at sun.nio.ch.ServerSocketChannelImpl.accept(ServerSocketChannelImpl.java:226)
        at org.eclipse.jetty.server.nio.SelectChannelConnector.accept(SelectChannelConnector.java:109)
        at org.eclipse.jetty.server.AbstractConnector$Acceptor.run(AbstractConnector.java:938)
        at org.eclipse.jetty.util.thread.QueuedThreadPool.runJob(QueuedThreadPool.java:608)
        at org.eclipse.jetty.util.thread.QueuedThreadPool$3.run(QueuedThreadPool.java:543)
        at java.lang.Thread.run(Thread.java:722)
   3) Thread[id=92, name=qtp463011245-92 Acceptor2 SelectChannelConnector@0.0.0.0:26278, state=BLOCKED, group=TGRP-BasicDistributedZkTest]
        at sun.nio.ch.ServerSocketChannelImpl.accept(ServerSocketChannelImpl.java:210)
        at org.eclipse.jetty.server.nio.SelectChannelConnector.accept(SelectChannelConnector.java:109)
        at org.eclipse.jetty.server.AbstractConnector$Acceptor.run(AbstractConnector.java:938)
        at org.eclipse.jetty.util.thread.QueuedThreadPool.runJob(QueuedThreadPool.java:608)
        at org.eclipse.jetty.util.thread.QueuedThreadPool$3.run(QueuedThreadPool.java:543)
        at java.lang.Thread.run(Thread.java:722)
   4) Thread[id=108, name=qtp681018185-108 Acceptor0 SelectChannelConnector@0.0.0.0:41576, state=BLOCKED, group=TGRP-BasicDistributedZkTest]
        at sun.nio.ch.ServerSocketChannelImpl.accept(ServerSocketChannelImpl.java:210)
        at org.eclipse.jetty.server.nio.SelectChannelConnector.accept(SelectChannelConnector.java:109)
        at org.eclipse.jetty.server.AbstractConnector$Acceptor.run(AbstractConnector.java:938)
        at org.eclipse.jetty.util.thread.QueuedThreadPool.runJob(QueuedThreadPool.java:608)
        at org.eclipse.jetty.util.thread.QueuedThreadPool$3.run(QueuedThreadPool.java:543)
        at java.lang.Thread.run(Thread.java:722)
   5) Thread[id=110, name=qtp681018185-110 Acceptor2 SelectChannelConnector@0.0.0.0:41576, state=BLOCKED, group=TGRP-BasicDistributedZkTest]
        at sun.nio.ch.ServerSocketChannelImpl.accept(ServerSocketChannelImpl.java:210)
        at org.eclipse.jetty.server.nio.SelectChannelConnector.accept(SelectChannelConnector.java:109)
        at org.eclipse.jetty.server.AbstractConnector$Acceptor.run(AbstractConnector.java:938)
        at org.eclipse.jetty.util.thread.QueuedThreadPool.runJob(QueuedThreadPool.java:608)
        at org.eclipse.jetty.util.thread.QueuedThreadPool$3.run(QueuedThreadPool.java:543)
        at java.lang.Thread.run(Thread.java:722)
   6) Thread[id=111, name=qtp681018185-111 Acceptor3 SelectChannelConnector@0.0.0.0:41576, state=BLOCKED, group=TGRP-BasicDistributedZkTest]
        at sun.nio.ch.ServerSocketChannelImpl.accept(ServerSocketChannelImpl.java:210)
        at org.eclipse.jetty.server.nio.SelectChannelConnector.accept(SelectChannelConnector.java:109)
        at org.eclipse.jetty.server.AbstractConnector$Acceptor.run(AbstractConnector.java:938)
        at org.eclipse.jetty.util.thread.QueuedThreadPool.runJob(QueuedThreadPool.java:608)
        at org.eclipse.jetty.util.thread.QueuedThreadPool$3.run(QueuedThreadPool.java:543)
        at java.lang.Thread.run(Thread.java:722)
   7) Thread[id=90, name=qtp463011245-90 Acceptor0 SelectChannelConnector@0.0.0.0:26278, state=BLOCKED, group=TGRP-BasicDistributedZkTest]
        at sun.nio.ch.ServerSocketChannelImpl.accept(ServerSocketChannelImpl.java:210)
        at org.eclipse.jetty.server.nio.SelectChannelConnector.accept(SelectChannelConnector.java:109)
        at org.eclipse.jetty.server.AbstractConnector$Acceptor.run(AbstractConnector.java:938)
        at org.eclipse.jetty.util.thread.QueuedThreadPool.runJob(QueuedThreadPool.java:608)
        at org.eclipse.jetty.util.thread.QueuedThreadPool$3.run(QueuedThreadPool.java:543)
        at java.lang.Thread.run(Thread.java:722)
   8) Thread[id=93, name=qtp463011245-93 Acceptor3 SelectChannelConnector@0.0.0.0:26278, state=BLOCKED, group=TGRP-BasicDistributedZkTest]
        at sun.nio.ch.ServerSocketChannelImpl.accept(ServerSocketChannelImpl.java:210)
        at org.eclipse.jetty.server.nio.SelectChannelConnector.accept(SelectChannelConnector.java:109)
        at org.eclipse.jetty.server.AbstractConnector$Acceptor.run(AbstractConnector.java:938)
        at org.eclipse.jetty.util.thread.QueuedThreadPool.runJob(QueuedThreadPool.java:608)
        at org.eclipse.jetty.util.thread.QueuedThreadPool$3.run(QueuedThreadPool.java:543)
        at java.lang.Thread.run(Thread.java:722)
	at __randomizedtesting.SeedInfo.seed([CFFDFEE3956D3CD6]:0)


FAILED:  junit.framework.TestSuite.org.apache.solr.handler.admin.ShowFileRequestHandlerTest

Error Message:
4 threads leaked from SUITE scope at org.apache.solr.handler.admin.ShowFileRequestHandlerTest:     1) Thread[id=35, name=qtp126107475-35 Acceptor3 SelectChannelConnector@0.0.0.0:12822, state=BLOCKED, group=TGRP-ShowFileRequestHandlerTest]         at sun.nio.ch.ServerSocketChannelImpl.accept(ServerSocketChannelImpl.java:210)         at org.eclipse.jetty.server.nio.SelectChannelConnector.accept(SelectChannelConnector.java:109)         at org.eclipse.jetty.server.AbstractConnector$Acceptor.run(AbstractConnector.java:938)         at org.eclipse.jetty.util.thread.QueuedThreadPool.runJob(QueuedThreadPool.java:608)         at org.eclipse.jetty.util.thread.QueuedThreadPool$3.run(QueuedThreadPool.java:543)         at java.lang.Thread.run(Thread.java:722)    2) Thread[id=32, name=qtp126107475-32 Acceptor0 SelectChannelConnector@0.0.0.0:12822, state=RUNNABLE, group=TGRP-ShowFileRequestHandlerTest]         at sun.nio.ch.ServerSocketChannelImpl.accept0(Native Method)         at sun.nio.ch.ServerSocketChannelImpl.accept(ServerSocketChannelImpl.java:226)         at org.eclipse.jetty.server.nio.SelectChannelConnector.accept(SelectChannelConnector.java:109)         at org.eclipse.jetty.server.AbstractConnector$Acceptor.run(AbstractConnector.java:938)         at org.eclipse.jetty.util.thread.QueuedThreadPool.runJob(QueuedThreadPool.java:608)         at org.eclipse.jetty.util.thread.QueuedThreadPool$3.run(QueuedThreadPool.java:543)         at java.lang.Thread.run(Thread.java:722)    3) Thread[id=34, name=qtp126107475-34 Acceptor2 SelectChannelConnector@0.0.0.0:12822, state=BLOCKED, group=TGRP-ShowFileRequestHandlerTest]         at sun.nio.ch.ServerSocketChannelImpl.accept(ServerSocketChannelImpl.java:210)         at org.eclipse.jetty.server.nio.SelectChannelConnector.accept(SelectChannelConnector.java:109)         at org.eclipse.jetty.server.AbstractConnector$Acceptor.run(AbstractConnector.java:938)         at org.eclipse.jetty.util.thread.QueuedThreadPool.runJob(QueuedThreadPool.java:608)         at org.eclipse.jetty.util.thread.QueuedThreadPool$3.run(QueuedThreadPool.java:543)         at java.lang.Thread.run(Thread.java:722)    4) Thread[id=33, name=qtp126107475-33 Acceptor1 SelectChannelConnector@0.0.0.0:12822, state=BLOCKED, group=TGRP-ShowFileRequestHandlerTest]         at sun.nio.ch.ServerSocketChannelImpl.accept(ServerSocketChannelImpl.java:210)         at org.eclipse.jetty.server.nio.SelectChannelConnector.accept(SelectChannelConnector.java:109)         at org.eclipse.jetty.server.AbstractConnector$Acceptor.run(AbstractConnector.java:938)         at org.eclipse.jetty.util.thread.QueuedThreadPool.runJob(QueuedThreadPool.java:608)         at org.eclipse.jetty.util.thread.QueuedThreadPool$3.run(QueuedThreadPool.java:543)         at java.lang.Thread.run(Thread.java:722)

Stack Trace:
com.carrotsearch.randomizedtesting.ThreadLeakError: 4 threads leaked from SUITE scope at org.apache.solr.handler.admin.ShowFileRequestHandlerTest: 
   1) Thread[id=35, name=qtp126107475-35 Acceptor3 SelectChannelConnector@0.0.0.0:12822, state=BLOCKED, group=TGRP-ShowFileRequestHandlerTest]
        at sun.nio.ch.ServerSocketChannelImpl.accept(ServerSocketChannelImpl.java:210)
        at org.eclipse.jetty.server.nio.SelectChannelConnector.accept(SelectChannelConnector.java:109)
        at org.eclipse.jetty.server.AbstractConnector$Acceptor.run(AbstractConnector.java:938)
        at org.eclipse.jetty.util.thread.QueuedThreadPool.runJob(QueuedThreadPool.java:608)
        at org.eclipse.jetty.util.thread.QueuedThreadPool$3.run(QueuedThreadPool.java:543)
        at java.lang.Thread.run(Thread.java:722)
   2) Thread[id=32, name=qtp126107475-32 Acceptor0 SelectChannelConnector@0.0.0.0:12822, state=RUNNABLE, group=TGRP-ShowFileRequestHandlerTest]
        at sun.nio.ch.ServerSocketChannelImpl.accept0(Native Method)
        at sun.nio.ch.ServerSocketChannelImpl.accept(ServerSocketChannelImpl.java:226)
        at org.eclipse.jetty.server.nio.SelectChannelConnector.accept(SelectChannelConnector.java:109)
        at org.eclipse.jetty.server.AbstractConnector$Acceptor.run(AbstractConnector.java:938)
        at org.eclipse.jetty.util.thread.QueuedThreadPool.runJob(QueuedThreadPool.java:608)
        at org.eclipse.jetty.util.thread.QueuedThreadPool$3.run(QueuedThreadPool.java:543)
        at java.lang.Thread.run(Thread.java:722)
   3) Thread[id=34, name=qtp126107475-34 Acceptor2 SelectChannelConnector@0.0.0.0:12822, state=BLOCKED, group=TGRP-ShowFileRequestHandlerTest]
        at sun.nio.ch.ServerSocketChannelImpl.accept(ServerSocketChannelImpl.java:210)
        at org.eclipse.jetty.server.nio.SelectChannelConnector.accept(SelectChannelConnector.java:109)
        at org.eclipse.jetty.server.AbstractConnector$Acceptor.run(AbstractConnector.java:938)
        at org.eclipse.jetty.util.thread.QueuedThreadPool.runJob(QueuedThreadPool.java:608)
        at org.eclipse.jetty.util.thread.QueuedThreadPool$3.run(QueuedThreadPool.java:543)
        at java.lang.Thread.run(Thread.java:722)
   4) Thread[id=33, name=qtp126107475-33 Acceptor1 SelectChannelConnector@0.0.0.0:12822, state=BLOCKED, group=TGRP-ShowFileRequestHandlerTest]
        at sun.nio.ch.ServerSocketChannelImpl.accept(ServerSocketChannelImpl.java:210)
        at org.eclipse.jetty.server.nio.SelectChannelConnector.accept(SelectChannelConnector.java:109)
        at org.eclipse.jetty.server.AbstractConnector$Acceptor.run(AbstractConnector.java:938)
        at org.eclipse.jetty.util.thread.QueuedThreadPool.runJob(QueuedThreadPool.java:608)
        at org.eclipse.jetty.util.thread.QueuedThreadPool$3.run(QueuedThreadPool.java:543)
        at java.lang.Thread.run(Thread.java:722)
	at __randomizedtesting.SeedInfo.seed([CFFDFEE3956D3CD6]:0)


FAILED:  junit.framework.TestSuite.org.apache.solr.handler.admin.ShowFileRequestHandlerTest

Error Message:
There are still zombie threads that couldn't be terminated:    1) Thread[id=35, name=qtp126107475-35 Acceptor3 SelectChannelConnector@0.0.0.0:12822, state=BLOCKED, group=TGRP-ShowFileRequestHandlerTest]         at sun.nio.ch.ServerSocketChannelImpl.accept(ServerSocketChannelImpl.java:210)         at org.eclipse.jetty.server.nio.SelectChannelConnector.accept(SelectChannelConnector.java:109)         at org.eclipse.jetty.server.AbstractConnector$Acceptor.run(AbstractConnector.java:938)         at org.eclipse.jetty.util.thread.QueuedThreadPool.runJob(QueuedThreadPool.java:608)         at org.eclipse.jetty.util.thread.QueuedThreadPool$3.run(QueuedThreadPool.java:543)         at java.lang.Thread.run(Thread.java:722)    2) Thread[id=32, name=qtp126107475-32 Acceptor0 SelectChannelConnector@0.0.0.0:12822, state=RUNNABLE, group=TGRP-ShowFileRequestHandlerTest]         at sun.nio.ch.ServerSocketChannelImpl.accept0(Native Method)         at sun.nio.ch.ServerSocketChannelImpl.accept(ServerSocketChannelImpl.java:226)         at org.eclipse.jetty.server.nio.SelectChannelConnector.accept(SelectChannelConnector.java:109)         at org.eclipse.jetty.server.AbstractConnector$Acceptor.run(AbstractConnector.java:938)         at org.eclipse.jetty.util.thread.QueuedThreadPool.runJob(QueuedThreadPool.java:608)         at org.eclipse.jetty.util.thread.QueuedThreadPool$3.run(QueuedThreadPool.java:543)         at java.lang.Thread.run(Thread.java:722)    3) Thread[id=34, name=qtp126107475-34 Acceptor2 SelectChannelConnector@0.0.0.0:12822, state=BLOCKED, group=TGRP-ShowFileRequestHandlerTest]         at sun.nio.ch.ServerSocketChannelImpl.accept(ServerSocketChannelImpl.java:210)         at org.eclipse.jetty.server.nio.SelectChannelConnector.accept(SelectChannelConnector.java:109)         at org.eclipse.jetty.server.AbstractConnector$Acceptor.run(AbstractConnector.java:938)         at org.eclipse.jetty.util.thread.QueuedThreadPool.runJob(QueuedThreadPool.java:608)         at org.eclipse.jetty.util.thread.QueuedThreadPool$3.run(QueuedThreadPool.java:543)         at java.lang.Thread.run(Thread.java:722)    4) Thread[id=33, name=qtp126107475-33 Acceptor1 SelectChannelConnector@0.0.0.0:12822, state=BLOCKED, group=TGRP-ShowFileRequestHandlerTest]         at sun.nio.ch.ServerSocketChannelImpl.accept(ServerSocketChannelImpl.java:210)         at org.eclipse.jetty.server.nio.SelectChannelConnector.accept(SelectChannelConnector.java:109)         at org.eclipse.jetty.server.AbstractConnector$Acceptor.run(AbstractConnector.java:938)         at org.eclipse.jetty.util.thread.QueuedThreadPool.runJob(QueuedThreadPool.java:608)         at org.eclipse.jetty.util.thread.QueuedThreadPool$3.run(QueuedThreadPool.java:543)         at java.lang.Thread.run(Thread.java:722)

Stack Trace:
com.carrotsearch.randomizedtesting.ThreadLeakError: There are still zombie threads that couldn't be terminated:
   1) Thread[id=35, name=qtp126107475-35 Acceptor3 SelectChannelConnector@0.0.0.0:12822, state=BLOCKED, group=TGRP-ShowFileRequestHandlerTest]
        at sun.nio.ch.ServerSocketChannelImpl.accept(ServerSocketChannelImpl.java:210)
        at org.eclipse.jetty.server.nio.SelectChannelConnector.accept(SelectChannelConnector.java:109)
        at org.eclipse.jetty.server.AbstractConnector$Acceptor.run(AbstractConnector.java:938)
        at org.eclipse.jetty.util.thread.QueuedThreadPool.runJob(QueuedThreadPool.java:608)
        at org.eclipse.jetty.util.thread.QueuedThreadPool$3.run(QueuedThreadPool.java:543)
        at java.lang.Thread.run(Thread.java:722)
   2) Thread[id=32, name=qtp126107475-32 Acceptor0 SelectChannelConnector@0.0.0.0:12822, state=RUNNABLE, group=TGRP-ShowFileRequestHandlerTest]
        at sun.nio.ch.ServerSocketChannelImpl.accept0(Native Method)
        at sun.nio.ch.ServerSocketChannelImpl.accept(ServerSocketChannelImpl.java:226)
        at org.eclipse.jetty.server.nio.SelectChannelConnector.accept(SelectChannelConnector.java:109)
        at org.eclipse.jetty.server.AbstractConnector$Acceptor.run(AbstractConnector.java:938)
        at org.eclipse.jetty.util.thread.QueuedThreadPool.runJob(QueuedThreadPool.java:608)
        at org.eclipse.jetty.util.thread.QueuedThreadPool$3.run(QueuedThreadPool.java:543)
        at java.lang.Thread.run(Thread.java:722)
   3) Thread[id=34, name=qtp126107475-34 Acceptor2 SelectChannelConnector@0.0.0.0:12822, state=BLOCKED, group=TGRP-ShowFileRequestHandlerTest]
        at sun.nio.ch.ServerSocketChannelImpl.accept(ServerSocketChannelImpl.java:210)
        at org.eclipse.jetty.server.nio.SelectChannelConnector.accept(SelectChannelConnector.java:109)
        at org.eclipse.jetty.server.AbstractConnector$Acceptor.run(AbstractConnector.java:938)
        at org.eclipse.jetty.util.thread.QueuedThreadPool.runJob(QueuedThreadPool.java:608)
        at org.eclipse.jetty.util.thread.QueuedThreadPool$3.run(QueuedThreadPool.java:543)
        at java.lang.Thread.run(Thread.java:722)
   4) Thread[id=33, name=qtp126107475-33 Acceptor1 SelectChannelConnector@0.0.0.0:12822, state=BLOCKED, group=TGRP-ShowFileRequestHandlerTest]
        at sun.nio.ch.ServerSocketChannelImpl.accept(ServerSocketChannelImpl.java:210)
        at org.eclipse.jetty.server.nio.SelectChannelConnector.accept(SelectChannelConnector.java:109)
        at org.eclipse.jetty.server.AbstractConnector$Acceptor.run(AbstractConnector.java:938)
        at org.eclipse.jetty.util.thread.QueuedThreadPool.runJob(QueuedThreadPool.java:608)
        at org.eclipse.jetty.util.thread.QueuedThreadPool$3.run(QueuedThreadPool.java:543)
        at java.lang.Thread.run(Thread.java:722)
	at __randomizedtesting.SeedInfo.seed([CFFDFEE3956D3CD6]:0)




Build Log:
[...truncated 8485 lines...]
[junit4:junit4] Suite: org.apache.solr.handler.admin.ShowFileRequestHandlerTest
[junit4:junit4]   2> 4 T25 oas.SolrTestCaseJ4.initCore ####initCore
[junit4:junit4]   2> Creating dataDir: /usr/home/hudson/hudson-slave/workspace/Lucene-Solr-Tests-trunk-java7/solr/build/solr-core/test/J1/./solrtest-ShowFileRequestHandlerTest-1352416671436
[junit4:junit4]   2> 5 T25 oas.SolrTestCaseJ4.initCore ####initCore end
[junit4:junit4]   2> 571 T25 oejs.Server.doStart jetty-8.1.7.v20120910
[junit4:junit4]   2> 934 T25 oejs.AbstractConnector.doStart Started SelectChannelConnector@0.0.0.0:12822
[junit4:junit4]   2> 997 T25 oasc.SolrResourceLoader.locateSolrHome JNDI not configured for solr (NoInitialContextEx)
[junit4:junit4]   2> 997 T25 oasc.SolrResourceLoader.locateSolrHome using system property solr.solr.home: /usr/home/hudson/hudson-slave/workspace/Lucene-Solr-Tests-trunk-java7/solr/example/solr
[junit4:junit4]   2> 998 T25 oasc.SolrResourceLoader.<init> new SolrResourceLoader for deduced Solr Home: '/usr/home/hudson/hudson-slave/workspace/Lucene-Solr-Tests-trunk-java7/solr/example/solr/'
[junit4:junit4]   2> 1048 T25 oass.SolrDispatchFilter.init SolrDispatchFilter.init()
[junit4:junit4]   2> 1049 T25 oasc.SolrResourceLoader.locateSolrHome JNDI not configured for solr (NoInitialContextEx)
[junit4:junit4]   2> 1050 T25 oasc.SolrResourceLoader.locateSolrHome using system property solr.solr.home: /usr/home/hudson/hudson-slave/workspace/Lucene-Solr-Tests-trunk-java7/solr/example/solr
[junit4:junit4]   2> 1050 T25 oasc.CoreContainer$Initializer.initialize looking for solr.xml: /usr/home/hudson/hudson-slave/workspace/Lucene-Solr-Tests-trunk-java7/solr/example/solr/solr.xml
[junit4:junit4]   2> 1051 T25 oasc.CoreContainer.<init> New CoreContainer 724367630
[junit4:junit4]   2> 1052 T25 oasc.CoreContainer.load Loading CoreContainer using Solr Home: '/usr/home/hudson/hudson-slave/workspace/Lucene-Solr-Tests-trunk-java7/solr/example/solr/'
[junit4:junit4]   2> 1052 T25 oasc.SolrResourceLoader.<init> new SolrResourceLoader for directory: '/usr/home/hudson/hudson-slave/workspace/Lucene-Solr-Tests-trunk-java7/solr/example/solr/'
[junit4:junit4]   2> 1114 T25 oasc.CoreContainer.load Registering Log Listener
[junit4:junit4]   2> 1185 T25 oasc.CoreContainer.create Creating SolrCore 'collection1' using instanceDir: /usr/home/hudson/hudson-slave/workspace/Lucene-Solr-Tests-trunk-java7/solr/example/solr/collection1
[junit4:junit4]   2> 1187 T25 oasc.SolrResourceLoader.<init> new SolrResourceLoader for directory: '/usr/home/hudson/hudson-slave/workspace/Lucene-Solr-Tests-trunk-java7/solr/example/solr/collection1/'
[junit4:junit4]   2> 1251 T25 oasc.SolrConfig.initLibs Adding specified lib dirs to ClassLoader
[junit4:junit4]   2> 1339 T25 oasc.SolrConfig.<init> Using Lucene MatchVersion: LUCENE_50
[junit4:junit4]   2> 1508 T25 oasc.SolrConfig.<init> Loaded SolrConfig: solrconfig.xml
[junit4:junit4]   2> 1510 T25 oass.IndexSchema.readSchema Reading Solr Schema
[junit4:junit4]   2> 1584 T25 oass.IndexSchema.readSchema Schema name=example
[junit4:junit4]   2> 3053 T25 oass.IndexSchema.readSchema unique key field: id
[junit4:junit4]   2> 3105 T25 oass.FileExchangeRateProvider.reload Reloading exchange rates from file currency.xml
[junit4:junit4]   2> 3133 T25 oass.FileExchangeRateProvider.reload Reloading exchange rates from file currency.xml
[junit4:junit4]   2> 3450 T25 oasc.SolrCore.<init> [collection1] Opening new SolrCore at /usr/home/hudson/hudson-slave/workspace/Lucene-Solr-Tests-trunk-java7/solr/example/solr/collection1/, dataDir=/usr/home/hudson/hudson-slave/workspace/Lucene-Solr-Tests-trunk-java7/solr/build/solr-core/test/J1/solrtest-ShowFileRequestHandlerTest-1352416671436/
[junit4:junit4]   2> 3451 T25 oasc.JmxMonitoredMap.<init> JMX monitoring is enabled. Adding Solr mbeans to JMX Server: com.sun.jmx.mbeanserver.JmxMBeanServer@35de01c9
[junit4:junit4]   2> 3489 T25 oasc.SolrCore.initListeners [collection1] Added SolrEventListener for newSearcher: org.apache.solr.core.QuerySenderListener{queries=[]}
[junit4:junit4]   2> 3490 T25 oasc.SolrCore.initListeners [collection1] Added SolrEventListener for firstSearcher: org.apache.solr.core.QuerySenderListener{queries=[{q=static firstSearcher warming in solrconfig.xml}]}
[junit4:junit4]   2> 3491 T25 oasc.SolrCore.initDirectoryFactory org.apache.solr.core.MockDirectoryFactory
[junit4:junit4]   2> 3492 T25 oasc.CachingDirectoryFactory.injectLockFactory WARNING No lockType configured for MockDirWrapper(org.apache.lucene.store.RAMDirectory@63172c12 lockFactory=org.apache.lucene.store.SingleInstanceLockFactory@64e8491) assuming 'simple'
[junit4:junit4]   2> 3493 T25 oasc.CachingDirectoryFactory.get return new directory for /usr/home/hudson/hudson-slave/workspace/Lucene-Solr-Tests-trunk-java7/solr/build/solr-core/test/J1/solrtest-ShowFileRequestHandlerTest-1352416671436 forceNew:false
[junit4:junit4]   2> 3494 T25 oasc.CachingDirectoryFactory.close Releasing directory:/usr/home/hudson/hudson-slave/workspace/Lucene-Solr-Tests-trunk-java7/solr/build/solr-core/test/J1/solrtest-ShowFileRequestHandlerTest-1352416671436
[junit4:junit4]   2> 3494 T25 oasc.SolrCore.getNewIndexDir New index directory detected: old=null new=/usr/home/hudson/hudson-slave/workspace/Lucene-Solr-Tests-trunk-java7/solr/build/solr-core/test/J1/solrtest-ShowFileRequestHandlerTest-1352416671436/index/
[junit4:junit4]   2> 3495 T25 oasc.SolrCore.initIndex WARNING [collection1] Solr index directory '/usr/home/hudson/hudson-slave/workspace/Lucene-Solr-Tests-trunk-java7/solr/build/solr-core/test/J1/solrtest-ShowFileRequestHandlerTest-1352416671436/index' doesn't exist. Creating new index...
[junit4:junit4]   2> 3496 T25 oasc.CachingDirectoryFactory.get return new directory for /usr/home/hudson/hudson-slave/workspace/Lucene-Solr-Tests-trunk-java7/solr/build/solr-core/test/J1/solrtest-ShowFileRequestHandlerTest-1352416671436/index forceNew:false
[junit4:junit4]   2> 3499 T25 oasc.SolrDeletionPolicy.onCommit SolrDeletionPolicy.onCommit: commits:num=1
[junit4:junit4]   2> 		commit{dir=MockDirWrapper(org.apache.lucene.store.RAMDirectory@4e820b7c lockFactory=org.apache.lucene.store.NativeFSLockFactory@43028ebd),segFN=segments_1,generation=1,filenames=[segments_1]
[junit4:junit4]   2> 3500 T25 oasc.SolrDeletionPolicy.updateCommits newest commit = 1[segments_1]
[junit4:junit4]   2> 3501 T25 oasc.CachingDirectoryFactory.close Releasing directory:/usr/home/hudson/hudson-slave/workspace/Lucene-Solr-Tests-trunk-java7/solr/build/solr-core/test/J1/solrtest-ShowFileRequestHandlerTest-1352416671436/index
[junit4:junit4]   2> 3534 T25 oasc.SolrCore.initWriters created json: solr.JSONResponseWriter
[junit4:junit4]   2> 3535 T25 oasc.SolrCore.initWriters adding lazy queryResponseWriter: solr.VelocityResponseWriter
[junit4:junit4]   2> 3540 T25 oasc.SolrCore.initWriters created velocity: solr.VelocityResponseWriter
[junit4:junit4]   2> 3577 T25 oasc.SolrCore.initWriters created xslt: solr.XSLTResponseWriter
[junit4:junit4]   2> 3578 T25 oasr.XSLTResponseWriter.init xsltCacheLifetimeSeconds=5
[junit4:junit4]   2> 3826 T25 oasc.RequestHandlers.initHandlersFromConfig created /select: solr.SearchHandler
[junit4:junit4]   2> 3829 T25 oasc.RequestHandlers.initHandlersFromConfig created /query: solr.SearchHandler
[junit4:junit4]   2> 3832 T25 oasc.RequestHandlers.initHandlersFromConfig created /get: solr.RealTimeGetHandler
[junit4:junit4]   2> 3834 T25 oasc.RequestHandlers.initHandlersFromConfig created /browse: solr.SearchHandler
[junit4:junit4]   2> 3837 T25 oasc.RequestHandlers.initHandlersFromConfig created /update: solr.UpdateRequestHandler
[junit4:junit4]   2> 3858 T25 oasc.RequestHandlers.initHandlersFromConfig created /update/json: solr.JsonUpdateRequestHandler
[junit4:junit4]   2> 3880 T25 oasc.RequestHandlers.initHandlersFromConfig created /update/csv: solr.CSVRequestHandler
[junit4:junit4]   2> 3880 T25 oasc.RequestHandlers.initHandlersFromConfig adding lazy requestHandler: solr.extraction.ExtractingRequestHandler
[junit4:junit4]   2> 3881 T25 oasc.RequestHandlers.initHandlersFromConfig created /update/extract: solr.extraction.ExtractingRequestHandler
[junit4:junit4]   2> 3882 T25 oasc.RequestHandlers.initHandlersFromConfig adding lazy requestHandler: solr.FieldAnalysisRequestHandler
[junit4:junit4]   2> 3883 T25 oasc.RequestHandlers.initHandlersFromConfig created /analysis/field: solr.FieldAnalysisRequestHandler
[junit4:junit4]   2> 3883 T25 oasc.RequestHandlers.initHandlersFromConfig adding lazy requestHandler: solr.DocumentAnalysisRequestHandler
[junit4:junit4]   2> 3884 T25 oasc.RequestHandlers.initHandlersFromConfig created /analysis/document: solr.DocumentAnalysisRequestHandler
[junit4:junit4]   2> 3910 T25 oasc.RequestHandlers.initHandlersFromConfig created /admin/: solr.admin.AdminHandlers
[junit4:junit4]   2> 3935 T25 oasc.RequestHandlers.initHandlersFromConfig created /admin/ping: solr.PingRequestHandler
[junit4:junit4]   2> 3937 T25 oasc.RequestHandlers.initHandlersFromConfig created /debug/dump: solr.DumpRequestHandler
[junit4:junit4]   2> 3981 T25 oasc.RequestHandlers.initHandlersFromConfig created /replication: solr.ReplicationHandler
[junit4:junit4]   2> 3981 T25 oasc.RequestHandlers.initHandlersFromConfig adding lazy requestHandler: solr.SearchHandler
[junit4:junit4]   2> 3982 T25 oasc.RequestHandlers.initHandlersFromConfig created /spell: solr.SearchHandler
[junit4:junit4]   2> 3982 T25 oasc.RequestHandlers.initHandlersFromConfig adding lazy requestHandler: solr.SearchHandler
[junit4:junit4]   2> 3983 T25 oasc.RequestHandlers.initHandlersFromConfig created /tvrh: solr.SearchHandler
[junit4:junit4]   2> 3983 T25 oasc.RequestHandlers.initHandlersFromConfig adding lazy requestHandler: solr.SearchHandler
[junit4:junit4]   2> 3984 T25 oasc.RequestHandlers.initHandlersFromConfig created /terms: solr.SearchHandler
[junit4:junit4]   2> 3984 T25 oasc.RequestHandlers.initHandlersFromConfig adding lazy requestHandler: solr.SearchHandler
[junit4:junit4]   2> 3985 T25 oasc.RequestHandlers.initHandlersFromConfig created /elevate: solr.SearchHandler
[junit4:junit4]   2> 3995 T25 oashl.XMLLoader.init xsltCacheLifetimeSeconds=60
[junit4:junit4]   2> 3997 T25 oashl.XMLLoader.init xsltCacheLifetimeSeconds=60
[junit4:junit4]   2> 3999 T25 oashl.XMLLoader.init xsltCacheLifetimeSeconds=60
[junit4:junit4]   2> 4006 T25 oasc.CachingDirectoryFactory.close Releasing directory:/usr/home/hudson/hudson-slave/workspace/Lucene-Solr-Tests-trunk-java7/solr/build/solr-core/test/J1/solrtest-ShowFileRequestHandlerTest-1352416671436
[junit4:junit4]   2> 4006 T25 oass.SolrIndexSearcher.<init> Opening Searcher@59bdd595 main
[junit4:junit4]   2> 4037 T25 oasu.CommitTracker.<init> Hard AutoCommit: if uncommited for 15000ms; 
[junit4:junit4]   2> 4037 T25 oasu.CommitTracker.<init> Soft AutoCommit: disabled
[junit4:junit4]   2> 4038 T25 oashc.SpellCheckComponent.inform Initializing spell checkers
[junit4:junit4]   2> 4076 T25 oass.DirectSolrSpellChecker.init init: {name=default,field=name,classname=solr.DirectSolrSpellChecker,distanceMeasure=internal,accuracy=0.5,maxEdits=2,minPrefix=1,maxInspections=5,minQueryLength=4,maxQueryFrequency=0.01}
[junit4:junit4]   2> 4077 T25 oashc.SpellCheckComponent.inform No queryConverter defined, using default converter
[junit4:junit4]   2> 4093 T25 oashc.QueryElevationComponent.inform Loading QueryElevation from: /usr/home/hudson/hudson-slave/workspace/Lucene-Solr-Tests-trunk-java7/solr/example/solr/collection1/conf/elevate.xml
[junit4:junit4]   2> 4151 T25 oashc.HttpShardHandlerFactory.getParameter Setting socketTimeout to: 0
[junit4:junit4]   2> 4152 T25 oashc.HttpShardHandlerFactory.getParameter Setting urlScheme to: http://
[junit4:junit4]   2> 4152 T25 oashc.HttpShardHandlerFactory.getParameter Setting connTimeout to: 0
[junit4:junit4]   2> 4153 T25 oashc.HttpShardHandlerFactory.getParameter Setting maxConnectionsPerHost to: 20
[junit4:junit4]   2> 4153 T25 oashc.HttpShardHandlerFactory.getParameter Setting corePoolSize to: 0
[junit4:junit4]   2> 4153 T25 oashc.HttpShardHandlerFactory.getParameter Setting maximumPoolSize to: 2147483647
[junit4:junit4]   2> 4154 T25 oashc.HttpShardHandlerFactory.getParameter Setting maxThreadIdleTime to: 5
[junit4:junit4]   2> 4154 T25 oashc.HttpShardHandlerFactory.getParameter Setting sizeOfQueue to: -1
[junit4:junit4]   2> 4155 T25 oashc.HttpShardHandlerFactory.getParameter Setting fairnessPolicy to: false
[junit4:junit4]   2> 4155 T25 oascsi.HttpClientUtil.createClient Creating new http client, config:maxConnectionsPerHost=20&maxConnections=10000&socketTimeout=0&connTimeout=0&retry=false
[junit4:junit4]   2> 4183 T25 oash.ReplicationHandler.inform Commits will be reserved for  10000
[junit4:junit4]   2> 4183 T40 oasc.QuerySenderListener.newSearcher QuerySenderListener sending requests to Searcher@59bdd595 main{StandardDirectoryReader(segments_1:1)}
[junit4:junit4]   2> 4190 T25 oasc.CachingDirectoryFactory.close Releasing directory:/usr/home/hudson/hudson-slave/workspace/Lucene-Solr-Tests-trunk-java7/solr/build/solr-core/test/J1/solrtest-ShowFileRequestHandlerTest-1352416671436/index
[junit4:junit4]   2> ASYNC  NEW_CORE C2 name=collection1 org.apache.solr.core.SolrCore@3193fea8
[junit4:junit4]   2> 4236 T40 C2 REQ [collection1] webapp=null path=null params={event=firstSearcher&q=static+firstSearcher+warming+in+solrconfig.xml&distrib=false} hits=0 status=0 QTime=43 
[junit4:junit4]   2> 4237 T40 oasc.QuerySenderListener.newSearcher QuerySenderListener done.
[junit4:junit4]   2> 4237 T40 oashc.SpellCheckComponent$SpellCheckerListener.newSearcher Loading spell index for spellchecker: default
[junit4:junit4]   2> 4238 T40 oashc.SpellCheckComponent$SpellCheckerListener.newSearcher Loading spell index for spellchecker: wordbreak
[junit4:junit4]   2> 4241 T40 oasc.SolrCore.registerSearcher [collection1] Registered new searcher Searcher@59bdd595 main{StandardDirectoryReader(segments_1:1)}
[junit4:junit4]   2> 4249 T25 oasc.CoreContainer.registerCore registering core: collection1
[junit4:junit4]   2> 4250 T25 oass.SolrDispatchFilter.init user.dir=/usr/home/hudson/hudson-slave/workspace/Lucene-Solr-Tests-trunk-java7/solr/build/solr-core/test/J1
[junit4:junit4]   2> 4250 T25 oass.SolrDispatchFilter.init SolrDispatchFilter.init() done
[junit4:junit4]   2> 4250 T25 oas.SolrJettyTestBase.createJetty Jetty Assigned Port#12822
[junit4:junit4]   2> 4256 T25 oas.SolrTestCaseJ4.setUp ###Starting testDirList
[junit4:junit4]   2> 4307 T25 oascsi.HttpClientUtil.createClient Creating new http client, config:maxConnections=128&maxConnectionsPerHost=32&followRedirects=false
[junit4:junit4]   2> 5617 T38 C2 REQ [collection1] webapp=/solr path=/admin/file params={wt=javabin&version=2} status=0 QTime=21 
[junit4:junit4]   2> 5796 T25 oas.SolrTestCaseJ4.tearDown ###Ending testDirList
[junit4:junit4]   2> 5803 T25 oas.SolrTestCaseJ4.setUp ###Starting testGetRawFile
[junit4:junit4]   2> 5808 T36 C2 REQ [collection1] webapp=/solr path=/admin/file params={wt=mock&file=schema.xml&version=2.2} status=0 QTime=1 
[junit4:junit4]   2> 6009 T25 oas.SolrTestCaseJ4.tearDown ###Ending testGetRawFile
[junit4:junit4]   2> 6056 T25 oasc.CoreContainer.shutdown Shutting down CoreContainer instance=724367630
[junit4:junit4]   2> 6056 T25 oasc.SolrCore.close [collection1]  CLOSING SolrCore org.apache.solr.core.SolrCore@3193fea8
[junit4:junit4]   2> 6066 T25 oasc.CachingDirectoryFactory.close Releasing directory:/usr/home/hudson/hudson-slave/workspace/Lucene-Solr-Tests-trunk-java7/solr/build/solr-core/test/J1/solrtest-ShowFileRequestHandlerTest-1352416671436/index
[junit4:junit4]   2> 6067 T25 oasc.CachingDirectoryFactory.close Releasing directory:/usr/home/hudson/hudson-slave/workspace/Lucene-Solr-Tests-trunk-java7/solr/build/solr-core/test/J1/solrtest-ShowFileRequestHandlerTest-1352416671436/index
[junit4:junit4]   2> 6074 T25 oasc.CachingDirectoryFactory.close Releasing directory:/usr/home/hudson/hudson-slave/workspace/Lucene-Solr-Tests-trunk-java7/solr/build/solr-core/test/J1/solrtest-ShowFileRequestHandlerTest-1352416671436/index
[junit4:junit4]   2> 6075 T25 oasc.CachingDirectoryFactory.close Releasing directory:/usr/home/hudson/hudson-slave/workspace/Lucene-Solr-Tests-trunk-java7/solr/build/solr-core/test/J1/solrtest-ShowFileRequestHandlerTest-1352416671436/index
[junit4:junit4]   2> 6083 T25 oasu.DirectUpdateHandler2.close closing DirectUpdateHandler2{commits=0,autocommit maxTime=15000ms,autocommits=0,soft autocommits=0,optimizes=0,rollbacks=0,expungeDeletes=0,docsPending=0,adds=0,deletesById=0,deletesByQuery=0,errors=0,cumulative_adds=0,cumulative_deletesById=0,cumulative_deletesByQuery=0,cumulative_errors=0}
[junit4:junit4]   2> 6084 T25 oasc.SolrCore.decrefSolrCoreState Closing SolrCoreState
[junit4:junit4]   2> 6084 T25 oasu.DefaultSolrCoreState.closeIndexWriter SolrCoreState ref count has reached 0 - closing IndexWriter
[junit4:junit4]   2> 6085 T25 oasu.DefaultSolrCoreState.closeIndexWriter closing IndexWriter with IndexWriterCloser
[junit4:junit4]   2> 6085 T25 oasc.SolrCore.closeSearcher [collection1] Closing main searcher on request.
[junit4:junit4]   2> 6086 T25 oasc.CachingDirectoryFactory.close Releasing directory:/usr/home/hudson/hudson-slave/workspace/Lucene-Solr-Tests-trunk-java7/solr/build/solr-core/test/J1/solrtest-ShowFileRequestHandlerTest-1352416671436/index
[junit4:junit4]   2> 6087 T25 oejsh.ContextHandler.doStop stopped o.e.j.s.ServletContextHandler{/solr,null}
[junit4:junit4]   2> 6187 T25 oejut.QueuedThreadPool.doStop WARNING 4 threads could not be stopped
[junit4:junit4]   2> 6187 T25 oas.SolrTestCaseJ4.deleteCore ###deleteCore
[junit4:junit4]   2> 6192 T24 ccr.ThreadLeakControl.checkThreadLeaks WARNING Will linger awaiting termination of 4 leaked thread(s).
[junit4:junit4]   2> 26325 T24 ccr.ThreadLeakControl.checkThreadLeaks SEVERE 4 threads leaked from SUITE scope at org.apache.solr.handler.admin.ShowFileRequestHandlerTest: 
[junit4:junit4]   2> 	   1) Thread[id=35, name=qtp126107475-35 Acceptor3 SelectChannelConnector@0.0.0.0:12822, state=BLOCKED, group=TGRP-ShowFileRequestHandlerTest]
[junit4:junit4]   2> 	        at sun.nio.ch.ServerSocketChannelImpl.accept(ServerSocketChannelImpl.java:210)
[junit4:junit4]   2> 	        at org.eclipse.jetty.server.nio.SelectChannelConnector.accept(SelectChannelConnector.java:109)
[junit4:junit4]   2> 	        at org.eclipse.jetty.server.AbstractConnector$Acceptor.run(AbstractConnector.java:938)
[junit4:junit4]   2> 	        at org.eclipse.jetty.util.thread.QueuedThreadPool.runJob(QueuedThreadPool.java:608)
[junit4:junit4]   2> 	        at org.eclipse.jetty.util.thread.QueuedThreadPool$3.run(QueuedThreadPool.java:543)
[junit4:junit4]   2> 	        at java.lang.Thread.run(Thread.java:722)
[junit4:junit4]   2> 	   2) Thread[id=32, name=qtp126107475-32 Acceptor0 SelectChannelConnector@0.0.0.0:12822, state=RUNNABLE, group=TGRP-ShowFileRequestHandlerTest]
[junit4:junit4]   2> 	        at sun.nio.ch.ServerSocketChannelImpl.accept0(Native Method)
[junit4:junit4]   2> 	        at sun.nio.ch.ServerSocketChannelImpl.accept(ServerSocketChannelImpl.java:226)
[junit4:junit4]   2> 	        at org.eclipse.jetty.server.nio.SelectChannelConnector.accept(SelectChannelConnector.java:109)
[junit4:junit4]   2> 	        at org.eclipse.jetty.server.AbstractConnector$Acceptor.run(AbstractConnector.java:938)
[junit4:junit4]   2> 	        at org.eclipse.jetty.util.thread.QueuedThreadPool.runJob(QueuedThreadPool.java:608)
[junit4:junit4]   2> 	        at org.eclipse.jetty.util.thread.QueuedThreadPool$3.run(QueuedThreadPool.java:543)
[junit4:junit4]   2> 	        at java.lang.Thread.run(Thread.java:722)
[junit4:junit4]   2> 	   3) Thread[id=34, name=qtp126107475-34 Acceptor2 SelectChannelConnector@0.0.0.0:12822, state=BLOCKED, group=TGRP-ShowFileRequestHandlerTest]
[junit4:junit4]   2> 	        at sun.nio.ch.ServerSocketChannelImpl.accept(ServerSocketChannelImpl.java:210)
[junit4:junit4]   2> 	        at org.eclipse.jetty.server.nio.SelectChannelConnector.accept(SelectChannelConnector.java:109)
[junit4:junit4]   2> 	        at org.eclipse.jetty.server.AbstractConnector$Acceptor.run(AbstractConnector.java:938)
[junit4:junit4]   2> 	        at org.eclipse.jetty.util.thread.QueuedThreadPool.runJob(QueuedThreadPool.java:608)
[junit4:junit4]   2> 	        at org.eclipse.jetty.util.thread.QueuedThreadPool$3.run(QueuedThreadPool.java:543)
[junit4:junit4]   2> 	        at java.lang.Thread.run(Thread.java:722)
[junit4:junit4]   2> 	   4) Thread[id=33, name=qtp126107475-33 Acceptor1 SelectChannelConnector@0.0.0.0:12822, state=BLOCKED, group=TGRP-ShowFileRequestHandlerTest]
[junit4:junit4]   2> 	        at sun.nio.ch.ServerSocketChannelImpl.accept(ServerSocketChannelImpl.java:210)
[junit4:junit4]   2> 	        at org.eclipse.jetty.server.nio.SelectChannelConnector.accept(SelectChannelConnector.java:109)
[junit4:junit4]   2> 	        at org.eclipse.jetty.server.AbstractConnector$Acceptor.run(AbstractConnector.java:938)
[junit4:junit4]   2> 	        at org.eclipse.jetty.util.thread.QueuedThreadPool.runJob(QueuedThreadPool.java:608)
[junit4:junit4]   2> 	        at org.eclipse.jetty.util.thread.QueuedThreadPool$3.run(QueuedThreadPool.java:543)
[junit4:junit4]   2> 	        at java.lang.Thread.run(Thread.java:722)
[junit4:junit4]   2> 26326 T24 ccr.ThreadLeakControl.tryToInterruptAll Starting to interrupt leaked threads:
[junit4:junit4]   2> 	   1) Thread[id=35, name=qtp126107475-35 Acceptor3 SelectChannelConnector@0.0.0.0:12822, state=BLOCKED, group=TGRP-ShowFileRequestHandlerTest]
[junit4:junit4]   2> 	   2) Thread[id=32, name=qtp126107475-32 Acceptor0 SelectChannelConnector@0.0.0.0:12822, state=RUNNABLE, group=TGRP-ShowFileRequestHandlerTest]
[junit4:junit4]   2> 	   3) Thread[id=34, name=qtp126107475-34 Acceptor2 SelectChannelConnector@0.0.0.0:12822, state=BLOCKED, group=TGRP-ShowFileRequestHandlerTest]
[junit4:junit4]   2> 	   4) Thread[id=33, name=qtp126107475-33 Acceptor1 SelectChannelConnector@0.0.0.0:12822, state=BLOCKED, group=TGRP-ShowFileRequestHandlerTest]
[junit4:junit4]   2> 29369 T24 ccr.ThreadLeakControl.tryToInterruptAll SEVERE There are still zombie threads that couldn't be terminated:
[junit4:junit4]   2> 	   1) Thread[id=35, name=qtp126107475-35 Acceptor3 SelectChannelConnector@0.0.0.0:12822, state=BLOCKED, group=TGRP-ShowFileRequestHandlerTest]
[junit4:junit4]   2> 	        at sun.nio.ch.ServerSocketChannelImpl.accept(ServerSocketChannelImpl.java:210)
[junit4:junit4]   2> 	        at org.eclipse.jetty.server.nio.SelectChannelConnector.accept(SelectChannelConnector.java:109)
[junit4:junit4]   2> 	        at org.eclipse.jetty.server.AbstractConnector$Acceptor.run(AbstractConnector.java:938)
[junit4:junit4]   2> 	        at org.eclipse.jetty.util.thread.QueuedThreadPool.runJob(QueuedThreadPool.java:608)
[junit4:junit4]   2> 	        at org.eclipse.jetty.util.thread.QueuedThreadPool$3.run(QueuedThreadPool.java:543)
[junit4:junit4]   2> 	        at java.lang.Thread.run(Thread.java:722)
[junit4:junit4]   2> 	   2) Thread[id=32, name=qtp126107475-32 Acceptor0 SelectChannelConnector@0.0.0.0:12822, state=RUNNABLE, group=TGRP-ShowFileRequestHandlerTest]
[junit4:junit4]   2> 	        at sun.nio.ch.ServerSocketChannelImpl.accept0(Native Method)
[junit4:junit4]   2> 	        at sun.nio.ch.ServerSocketChannelImpl.accept(ServerSocketChannelImpl.java:226)
[junit4:junit4]   2> 	        at org.eclipse.jetty.server.nio.SelectChannelConnector.accept(SelectChannelConnector.java:109)
[junit4:junit4]   2> 	        at org.eclipse.jetty.server.AbstractConnector$Acceptor.run(AbstractConnector.java:938)
[junit4:junit4]   2> 	        at org.eclipse.jetty.util.thread.QueuedThreadPool.runJob(QueuedThreadPool.java:608)
[junit4:junit4]   2> 	        at org.eclipse.jetty.util.thread.QueuedThreadPool$3.run(QueuedThreadPool.java:543)
[junit4:junit4]   2> 	        at java.lang.Thread.run(Thread.java:722)
[junit4:junit4]   2> 	   3) Thread[id=34, name=qtp126107475-34 Acceptor2 SelectChannelConnector@0.0.0.0:12822, state=BLOCKED, group=TGRP-ShowFileRequestHandlerTest]
[junit4:junit4]   2> 	        at sun.nio.ch.ServerSocketChannelImpl.accept(ServerSocketChannelImpl.java:210)
[junit4:junit4]   2> 	        at org.eclipse.jetty.server.nio.SelectChannelConnector.accept(SelectChannelConnector.java:109)
[junit4:junit4]   2> 	        at org.eclipse.jetty.server.AbstractConnector$Acceptor.run(AbstractConnector.java:938)
[junit4:junit4]   2> 	        at org.eclipse.jetty.util.thread.QueuedThreadPool.runJob(QueuedThreadPool.java:608)
[junit4:junit4]   2> 	        at org.eclipse.jetty.util.thread.QueuedThreadPool$3.run(QueuedThreadPool.java:543)
[junit4:junit4]   2> 	        at java.lang.Thread.run(Thread.java:722)
[junit4:junit4]   2> 	   4) Thread[id=33, name=qtp126107475-33 Acceptor1 SelectChannelConnector@0.0.0.0:12822, state=BLOCKED, group=TGRP-ShowFileRequestHandlerTest]
[junit4:junit4]   2> 	        at sun.nio.ch.ServerSocketChannelImpl.accept(ServerSocketChannelImpl.java:210)
[junit4:junit4]   2> 	        at org.eclipse.jetty.server.nio.SelectChannelConnector.accept(SelectChannelConnector.java:109)
[junit4:junit4]   2> 	        at org.eclipse.jetty.server.AbstractConnector$Acceptor.run(AbstractConnector.java:938)
[junit4:junit4]   2> 	        at org.eclipse.jetty.util.thread.QueuedThreadPool.runJob(QueuedThreadPool.java:608)
[junit4:junit4]   2> 	        at org.eclipse.jetty.util.thread.QueuedThreadPool$3.run(QueuedThreadPool.java:543)
[junit4:junit4]   2> 	        at java.lang.Thread.run(Thread.java:722)
[junit4:junit4]   2> NOTE: test params are: codec=Asserting, sim=DefaultSimilarity, locale=ca, timezone=Europe/Berlin
[junit4:junit4]   2> NOTE: FreeBSD 9.0-RELEASE amd64/Oracle Corporation 1.7.0_09 (64-bit)/cpus=16,threads=5,free=37088264,total=117440512
[junit4:junit4]   2> NOTE: All tests run in this JVM: [FieldMutatingUpdateProcessorTest, TestFastWriter, TestBM25SimilarityFactory, TestReversedWildcardFilterFactory, ShowFileRequestHandlerTest]
[junit4:junit4]   2> NOTE: reproduce with: ant test  -Dtestcase=ShowFileRequestHandlerTest -Dtests.seed=CFFDFEE3956D3CD6 -Dtests.multiplier=3 -Dtests.slow=true -Dtests.locale=ca -Dtests.timezone=Europe/Berlin -Dtests.file.encoding=UTF-8
[junit4:junit4] ERROR   0.00s J1 | ShowFileRequestHandlerTest (suite) <<<
[junit4:junit4]    > Throwable #1: com.carrotsearch.randomizedtesting.ThreadLeakError: 4 threads leaked from SUITE scope at org.apache.solr.handler.admin.ShowFileRequestHandlerTest: 
[junit4:junit4]    >    1) Thread[id=35, name=qtp126107475-35 Acceptor3 SelectChannelConnector@0.0.0.0:12822, state=BLOCKED, group=TGRP-ShowFileRequestHandlerTest]
[junit4:junit4]    >         at sun.nio.ch.ServerSocketChannelImpl.accept(ServerSocketChannelImpl.java:210)
[junit4:junit4]    >         at org.eclipse.jetty.server.nio.SelectChannelConnector.accept(SelectChannelConnector.java:109)
[junit4:junit4]    >         at org.eclipse.jetty.server.AbstractConnector$Acceptor.run(AbstractConnector.java:938)
[junit4:junit4]    >         at org.eclipse.jetty.util.thread.QueuedThreadPool.runJob(QueuedThreadPool.java:608)
[junit4:junit4]    >         at org.eclipse.jetty.util.thread.QueuedThreadPool$3.run(QueuedThreadPool.java:543)
[junit4:junit4]    >         at java.lang.Thread.run(Thread.java:722)
[junit4:junit4]    >    2) Thread[id=32, name=qtp126107475-32 Acceptor0 SelectChannelConnector@0.0.0.0:12822, state=RUNNABLE, group=TGRP-ShowFileRequestHandlerTest]
[junit4:junit4]    >         at sun.nio.ch.ServerSocketChannelImpl.accept0(Native Method)
[junit4:junit4]    >         at sun.nio.ch.ServerSocketChannelImpl.accept(ServerSocketChannelImpl.java:226)
[junit4:junit4]    >         at org.eclipse.jetty.server.nio.SelectChannelConnector.accept(SelectChannelConnector.java:109)
[junit4:junit4]    >         at org.eclipse.jetty.server.AbstractConnector$Acceptor.run(AbstractConnector.java:938)
[junit4:junit4]    >         at org.eclipse.jetty.util.thread.QueuedThreadPool.runJob(QueuedThreadPool.java:608)
[junit4:junit4]    >         at org.eclipse.jetty.util.thread.QueuedThreadPool$3.run(QueuedThreadPool.java:543)
[junit4:junit4]    >         at java.lang.Thread.run(Thread.java:722)
[junit4:junit4]    >    3) Thread[id=34, name=qtp126107475-34 Acceptor2 SelectChannelConnector@0.0.0.0:12822, state=BLOCKED, group=TGRP-ShowFileRequestHandlerTest]
[junit4:junit4]    >         at sun.nio.ch.ServerSocketChannelImpl.accept(ServerSocketChannelImpl.java:210)
[junit4:junit4]    >         at org.eclipse.jetty.server.nio.SelectChannelConnector.accept(SelectChannelConnector.java:109)
[junit4:junit4]    >         at org.eclipse.jetty.server.AbstractConnector$Acceptor.run(AbstractConnector.java:938)
[junit4:junit4]    >         at org.eclipse.jetty.util.thread.QueuedThreadPool.runJob(QueuedThreadPool.java:608)
[junit4:junit4]    >         at org.eclipse.jetty.util.thread.QueuedThreadPool$3.run(QueuedThreadPool.java:543)
[junit4:junit4]    >         at java.lang.Thread.run(Thread.java:722)
[junit4:junit4]    >    4) Thread[id=33, name=qtp126107475-33 Acceptor1 SelectChannelConnector@0.0.0.0:12822, state=BLOCKED, group=TGRP-ShowFileRequestHandlerTest]
[junit4:junit4]    >         at sun.nio.ch.ServerSocketChannelImpl.accept(ServerSocketChannelImpl.java:210)
[junit4:junit4]    >         at org.eclipse.jetty.server.nio.SelectChannelConnector.accept(SelectChannelConnector.java:109)
[junit4:junit4]    >         at org.eclipse.jetty.server.AbstractConnector$Acceptor.run(AbstractConnector.java:938)
[junit4:junit4]    >         at org.eclipse.jetty.util.thread.QueuedThreadPool.runJob(QueuedThreadPool.java:608)
[junit4:junit4]    >         at org.eclipse.jetty.util.thread.QueuedThreadPool$3.run(QueuedThreadPool.java:543)
[junit4:junit4]    >         at java.lang.Thread.run(Thread.java:722)
[junit4:junit4]    > 	at __randomizedtesting.SeedInfo.seed([CFFDFEE3956D3CD6]:0)
[junit4:junit4]    > Throwable #2: com.carrotsearch.randomizedtesting.ThreadLeakError: There are still zombie threads that couldn't be terminated:
[junit4:junit4]    >    1) Thread[id=35, name=qtp126107475-35 Acceptor3 SelectChannelConnector@0.0.0.0:12822, state=BLOCKED, group=TGRP-ShowFileRequestHandlerTest]
[junit4:junit4]    >         at sun.nio.ch.ServerSocketChannelImpl.accept(ServerSocketChannelImpl.java:210)
[junit4:junit4]    >         at org.eclipse.jetty.server.nio.SelectChannelConnector.accept(SelectChannelConnector.java:109)
[junit4:junit4]    >         at org.eclipse.jetty.server.AbstractConnector$Acceptor.run(AbstractConnector.java:938)
[junit4:junit4]    >         at org.eclipse.jetty.util.thread.QueuedThreadPool.runJob(QueuedThreadPool.java:608)
[junit4:junit4]    >         at org.eclipse.jetty.util.thread.QueuedThreadPool$3.run(QueuedThreadPool.java:543)
[junit4:junit4]    >         at java.lang.Thread.run(Thread.java:722)
[junit4:junit4]    >    2) Thread[id=32, name=qtp126107475-32 Acceptor0 SelectChannelConnector@0.0.0.0:12822, state=RUNNABLE, group=TGRP-ShowFileRequestHandlerTest]
[junit4:junit4]    >         at sun.nio.ch.ServerSocketChannelImpl.accept0(Native Method)
[junit4:junit4]    >         at sun.nio.ch.ServerSocketChannelImpl.accept(ServerSocketChannelImpl.java:226)
[junit4:junit4]    >         at org.eclipse.jetty.server.nio.SelectChannelConnector.accept(SelectChannelConnector.java:109)
[junit4:junit4]    >         at org.eclipse.jetty.server.AbstractConnector$Acceptor.run(AbstractConnector.java:938)
[junit4:junit4]    >         at org.eclipse.jetty.util.thread.QueuedThreadPool.runJob(QueuedThreadPool.java:608)
[junit4:junit4]    >         at org.eclipse.jetty.util.thread.QueuedThreadPool$3.run(QueuedThreadPool.java:543)
[junit4:junit4]    >         at java.lang.Thread.run(Thread.java:722)
[junit4:junit4]    >    3) Thread[id=34, name=qtp126107475-34 Acceptor2 SelectChannelConnector@0.0.0.0:12822, state=BLOCKED, group=TGRP-ShowFileRequestHandlerTest]
[junit4:junit4]    >         at sun.nio.ch.ServerSocketChannelImpl.accept(ServerSocketChannelImpl.java:210)
[junit4:junit4]    >         at org.eclipse.jetty.server.nio.SelectChannelConnector.accept(SelectChannelConnector.java:109)
[junit4:junit4]    >         at org.eclipse.jetty.server.AbstractConnector$Acceptor.run(AbstractConnector.java:938)
[junit4:junit4]    >         at org.eclipse.jetty.util.thread.QueuedThreadPool.runJob(QueuedThreadPool.java:608)
[junit4:junit4]    >         at org.eclipse.jetty.util.thread.QueuedThreadPool$3.run(QueuedThreadPool.java:543)
[junit4:junit4]    >         at java.lang.Thread.run(Thread.java:722)
[junit4:junit4]    >    4) Thread[id=33, name=qtp126107475-33 Acceptor1 SelectChannelConnector@0.0.0.0:12822, state=BLOCKED, group=TGRP-ShowFileRequestHandlerTest]
[junit4:junit4]    >         at sun.nio.ch.ServerSocketChannelImpl.accept(ServerSocketChannelImpl.java:210)
[junit4:junit4]    >         at org.eclipse.jetty.server.nio.SelectChannelConnector.accept(SelectChannelConnector.java:109)
[junit4:junit4]    >         at org.eclipse.jetty.server.AbstractConnector$Acceptor.run(AbstractConnector.java:938)
[junit4:junit4]    >         at org.eclipse.jetty.util.thread.QueuedThreadPool.runJob(QueuedThreadPool.java:608)
[junit4:junit4]    >         at org.eclipse.jetty.util.thread.QueuedThreadPool$3.run(QueuedThreadPool.java:543)
[junit4:junit4]    >         at java.lang.Thread.run(Thread.java:722)
[junit4:junit4]    > 	at __randomizedtesting.SeedInfo.seed([CFFDFEE3956D3CD6]:0)
[junit4:junit4] Completed on J1 in 29.50s, 2 tests, 2 errors <<< FAILURES!

[...truncated 515 lines...]
[junit4:junit4] Suite: org.apache.solr.cloud.BasicDistributedZkTest
[junit4:junit4]   2> 5 T22 oas.SolrTestCaseJ4.setUp ###Starting testDistribSearch
[junit4:junit4]   2> Creating dataDir: /usr/home/hudson/hudson-slave/workspace/Lucene-Solr-Tests-trunk-java7/solr/build/solr-core/test/J0/./solrtest-BasicDistributedZkTest-1352416673571
[junit4:junit4]   2> 12 T22 oasc.ZkTestServer.run STARTING ZK TEST SERVER
[junit4:junit4]   2> 131 T23 oaz.Environment.logEnv Server environment:zookeeper.version=3.3.6-1366786, built on 07/29/2012 06:22 GMT
[junit4:junit4]   2> 132 T23 oaz.Environment.logEnv Server environment:host.name=lucene.zones.apache.org
[junit4:junit4]   2> 132 T23 oaz.Environment.logEnv Server environment:java.version=1.7.0_09
[junit4:junit4]   2> 133 T23 oaz.Environment.logEnv Server environment:java.vendor=Oracle Corporation
[junit4:junit4]   2> 133 T23 oaz.Environment.logEnv Server environment:java.home=/usr/local/openjdk7/jre
[junit4:junit4]   2> 133 T23 oaz.Environment.logEnv Server environment:java.class.path=/usr/home/hudson/hudson-slave/workspace/Lucene-Solr-Tests-trunk-java7/solr/build/solr-core/classes/test:/usr/home/hudson/hudson-slave/workspace/Lucene-Solr-Tests-trunk-java7/solr/build/solr-test-framework/classes/java:/usr/home/hudson/hudson-slave/workspace/Lucene-Solr-Tests-trunk-java7/solr/build/solr-core/test-files:/usr/home/hudson/hudson-slave/workspace/Lucene-Solr-Tests-trunk-java7/lucene/build/test-framework/classes/java:/usr/home/hudson/hudson-slave/workspace/Lucene-Solr-Tests-trunk-java7/lucene/build/codecs/classes/java:/usr/home/hudson/hudson-slave/workspace/Lucene-Solr-Tests-trunk-java7/solr/build/solr-solrj/classes/java:/usr/home/hudson/hudson-slave/workspace/Lucene-Solr-Tests-trunk-java7/solr/build/solr-core/classes/java:/usr/home/hudson/hudson-slave/workspace/Lucene-Solr-Tests-trunk-java7/lucene/build/analysis/common/lucene-analyzers-common-5.0-SNAPSHOT.jar:/usr/home/hudson/hudson-slave/workspace/Lucene-Solr-Tests-trunk-java7/lucene/build/analysis/kuromoji/lucene-analyzers-kuromoji-5.0-SNAPSHOT.jar:/usr/home/hudson/hudson-slave/workspace/Lucene-Solr-Tests-trunk-java7/lucene/build/analysis/phonetic/lucene-analyzers-phonetic-5.0-SNAPSHOT.jar:/usr/home/hudson/hudson-slave/workspace/Lucene-Solr-Tests-trunk-java7/lucene/build/highlighter/lucene-highlighter-5.0-SNAPSHOT.jar:/usr/home/hudson/hudson-slave/workspace/Lucene-Solr-Tests-trunk-java7/lucene/build/memory/lucene-memory-5.0-SNAPSHOT.jar:/usr/home/hudson/hudson-slave/workspace/Lucene-Solr-Tests-trunk-java7/lucene/build/misc/lucene-misc-5.0-SNAPSHOT.jar:/usr/home/hudson/hudson-slave/workspace/Lucene-Solr-Tests-trunk-java7/lucene/build/spatial/lucene-spatial-5.0-SNAPSHOT.jar:/usr/home/hudson/hudson-slave/workspace/Lucene-Solr-Tests-trunk-java7/lucene/build/suggest/lucene-suggest-5.0-SNAPSHOT.jar:/usr/home/hudson/hudson-slave/workspace/Lucene-Solr-Tests-trunk-java7/lucene/build/grouping/lucene-grouping-5.0-SNAPSHOT.jar:/usr/home/hudson/hudson-slave/workspace/Lucene-Solr-Tests-trunk-java7/lucene/build/queries/lucene-queries-5.0-SNAPSHOT.jar:/usr/home/hudson/hudson-slave/workspace/Lucene-Solr-Tests-trunk-java7/lucene/build/queryparser/lucene-queryparser-5.0-SNAPSHOT.jar:/usr/home/hudson/hudson-slave/workspace/Lucene-Solr-Tests-trunk-java7/solr/core/lib/commons-cli-1.2.jar:/usr/home/hudson/hudson-slave/workspace/Lucene-Solr-Tests-trunk-java7/solr/core/lib/commons-codec-1.7.jar:/usr/home/hudson/hudson-slave/workspace/Lucene-Solr-Tests-trunk-java7/solr/core/lib/commons-fileupload-1.2.1.jar:/usr/home/hudson/hudson-slave/workspace/Lucene-Solr-Tests-trunk-java7/solr/core/lib/commons-lang-2.6.jar:/usr/home/hudson/hudson-slave/workspace/Lucene-Solr-Tests-trunk-java7/solr/core/lib/easymock-2.2.jar:/usr/home/hudson/hudson-slave/workspace/Lucene-Solr-Tests-trunk-java7/solr/core/lib/guava-r05.jar:/usr/home/hudson/hudson-slave/workspace/Lucene-Solr-Tests-trunk-java7/solr/core/lib/javax.servlet-api-3.0.1.jar:/usr/home/hudson/hudson-slave/workspace/Lucene-Solr-Tests-trunk-java7/solr/core/lib/metrics-core-2.1.2.jar:/usr/home/hudson/hudson-slave/workspace/Lucene-Solr-Tests-trunk-java7/solr/core/lib/spatial4j-0.3.jar:/usr/home/hudson/hudson-slave/workspace/Lucene-Solr-Tests-trunk-java7/solr/solrj/lib/commons-io-2.1.jar:/usr/home/hudson/hudson-slave/workspace/Lucene-Solr-Tests-trunk-java7/solr/solrj/lib/httpclient-4.1.3.jar:/usr/home/hudson/hudson-slave/workspace/Lucene-Solr-Tests-trunk-java7/solr/solrj/lib/httpcore-4.1.4.jar:/usr/home/hudson/hudson-slave/workspace/Lucene-Solr-Tests-trunk-java7/solr/solrj/lib/httpmime-4.1.3.jar:/usr/home/hudson/hudson-slave/workspace/Lucene-Solr-Tests-trunk-java7/solr/solrj/lib/jcl-over-slf4j-1.6.4.jar:/usr/home/hudson/hudson-slave/workspace/Lucene-Solr-Tests-trunk-java7/solr/solrj/lib/log4j-over-slf4j-1.6.4.jar:/usr/home/hudson/hudson-slave/workspace/Lucene-Solr-Tests-trunk-java7/solr/solrj/lib/slf4j-api-1.6.4.jar:/usr/home/hudson/hudson-slave/workspace/Lucene-Solr-Tests-trunk-java7/solr/solrj/lib/slf4j-jdk14-1.6.4.jar:/usr/home/hudson/hudson-slave/workspace/Lucene-Solr-Tests-trunk-java7/solr/solrj/lib/wstx-asl-3.2.7.jar:/usr/home/hudson/hudson-slave/workspace/Lucene-Solr-Tests-trunk-java7/solr/solrj/lib/zookeeper-3.3.6.jar:/usr/home/hudson/hudson-slave/workspace/Lucene-Solr-Tests-trunk-java7/solr/example/lib/jetty-continuation-8.1.7.v20120910.jar:/usr/home/hudson/hudson-slave/workspace/Lucene-Solr-Tests-trunk-java7/solr/example/lib/jetty-deploy-8.1.7.v20120910.jar:/usr/home/hudson/hudson-slave/workspace/Lucene-Solr-Tests-trunk-java7/solr/example/lib/jetty-http-8.1.7.v20120910.jar:/usr/home/hudson/hudson-slave/workspace/Lucene-Solr-Tests-trunk-java7/solr/example/lib/jetty-io-8.1.7.v20120910.jar:/usr/home/hudson/hudson-slave/workspace/Lucene-Solr-Tests-trunk-java7/solr/example/lib/jetty-jmx-8.1.7.v20120910.jar:/usr/home/hudson/hudson-slave/workspace/Lucene-Solr-Tests-trunk-java7/solr/example/lib/jetty-security-8.1.7.v20120910.jar:/usr/home/hudson/hudson-slave/workspace/Lucene-Solr-Tests-trunk-java7/solr/example/lib/jetty-server-8.1.7.v20120910.jar:/usr/home/hudson/hudson-slave/workspace/Lucene-Solr-Tests-trunk-java7/solr/example/lib/jetty-servlet-8.1.7.v20120910.jar:/usr/home/hudson/hudson-slave/workspace/Lucene-Solr-Tests-trunk-java7/solr/example/lib/jetty-util-8.1.7.v20120910.jar:/usr/home/hudson/hudson-slave/workspace/Lucene-Solr-Tests-trunk-java7/solr/example/lib/jetty-webapp-8.1.7.v20120910.jar:/usr/home/hudson/hudson-slave/workspace/Lucene-Solr-Tests-trunk-java7/solr/example/lib/jetty-xml-8.1.7.v20120910.jar:/usr/home/hudson/hudson-slave/workspace/Lucene-Solr-Tests-trunk-java7/solr/example/lib/servlet-api-3.0.jar:/usr/home/hudson/hudson-slave/workspace/Lucene-Solr-Tests-trunk-java7/solr/example/example-DIH/solr/db/lib/hsqldb-1.8.0.10.jar:/usr/home/hudson/hudson-slave/workspace/Lucene-Solr-Tests-trunk-java7/lucene/build/core/classes/java:/usr/home/hudson/hudson-slave/workspace/Lucene-Solr-Tests-trunk-java7/lucene/test-framework/lib/junit-4.10.jar:/usr/home/hudson/hudson-slave/workspace/Lucene-Solr-Tests-trunk-java7/lucene/test-framework/lib/randomizedtesting-runner-2.0.4.jar:/home/hudson/hudson-slave/tools/Ant/ant-1.8.2/lib/ant-launcher.jar:/home/hudson/.ant/lib/ivy-2.2.0.jar:/home/hudson/hudson-slave/tools/Ant/ant-1.8.2/lib/ant-apache-regexp.jar:/home/hudson/hudson-slave/tools/Ant/ant-1.8.2/lib/ant-junit.jar:/home/hudson/hudson-slave/tools/Ant/ant-1.8.2/lib/ant-apache-bsf.jar:/home/hudson/hudson-slave/tools/Ant/ant-1.8.2/lib/ant-commons-net.jar:/home/hudson/hudson-slave/tools/Ant/ant-1.8.2/lib/ant-antlr.jar:/home/hudson/hudson-slave/tools/Ant/ant-1.8.2/lib/ant-apache-log4j.jar:/home/hudson/hudson-slave/tools/Ant/ant-1.8.2/lib/ant-commons-logging.jar:/home/hudson/hudson-slave/tools/Ant/ant-1.8.2/lib/ant-apache-xalan2.jar:/home/hudson/hudson-slave/tools/Ant/ant-1.8.2/lib/ant-apache-oro.jar:/home/hudson/hudson-slave/tools/Ant/ant-1.8.2/lib/ant-junit4.jar:/home/hudson/hudson-slave/tools/Ant/ant-1.8.2/lib/ant-netrexx.jar:/home/hudson/hudson-slave/tools/Ant/ant-1.8.2/lib/ant-swing.jar:/home/hudson/hudson-slave/tools/Ant/ant-1.8.2/lib/ant-javamail.jar:/home/hudson/hudson-slave/tools/Ant/ant-1.8.2/lib/ant-jsch.jar:/home/hudson/hudson-slave/tools/Ant/ant-1.8.2/lib/ant-jmf.jar:/home/hudson/hudson-slave/tools/Ant/ant-1.8.2/lib/ant.jar:/home/hudson/hudson-slave/tools/Ant/ant-1.8.2/lib/ant-apache-bcel.jar:/home/hudson/hudson-slave/tools/Ant/ant-1.8.2/lib/ant-jai.jar:/home/hudson/hudson-slave/tools/Ant/ant-1.8.2/lib/ant-testutil.jar:/home/hudson/hudson-slave/tools/Ant/ant-1.8.2/lib/ant-apache-resolver.jar:/home/hudson/hudson-slave/tools/Ant/ant-1.8.2/lib/ant-jdepend.jar:/usr/local/openjdk7/lib/tools.jar:/home/hudson/.ivy2/cache/com.carrotsearch.randomizedtesting/junit4-ant/jars/junit4-ant-2.0.4.jar
[junit4:junit4]   2> 134 T23 oaz.Environment.logEnv Server environment:java.library.path=/usr/local/openjdk7/jre/lib/amd64/server:/usr/local/openjdk7/jre/lib/amd64:/usr/local/openjdk7/jre/../lib/amd64:/usr/local/openjdk6/jre/lib/amd64/server:/usr/local/openjdk6/jre/lib/amd64:/usr/local/openjdk6/jre/../lib/amd64:/usr/java/packages/lib/amd64:/lib:/usr/lib:/usr/local/lib
[junit4:junit4]   2> 135 T23 oaz.Environment.logEnv Server environment:java.io.tmpdir=.
[junit4:junit4]   2> 135 T23 oaz.Environment.logEnv Server environment:java.compiler=<NA>
[junit4:junit4]   2> 135 T23 oaz.Environment.logEnv Server environment:os.name=FreeBSD
[junit4:junit4]   2> 135 T23 oaz.Environment.logEnv Server environment:os.arch=amd64
[junit4:junit4]   2> 136 T23 oaz.Environment.logEnv Server environment:os.version=9.0-RELEASE
[junit4:junit4]   2> 136 T23 oaz.Environment.logEnv Server environment:user.name=hudson
[junit4:junit4]   2> 136 T23 oaz.Environment.logEnv Server environment:user.home=/home/hudson
[junit4:junit4]   2> 137 T23 oaz.Environment.logEnv Server environment:user.dir=/usr/home/hudson/hudson-slave/workspace/Lucene-Solr-Tests-trunk-java7/solr/build/solr-core/test/J0
[junit4:junit4]   2> 176 T23 oazs.ZooKeeperServer.setTickTime tickTime set to 1000
[junit4:junit4]   2> 205 T23 oazs.NIOServerCnxn$Factory.<init> binding to port 0.0.0.0/0.0.0.0:0
[junit4:junit4]   2> 218 T22 oasc.ZkTestServer.run start zk server on port:34333
[junit4:junit4]   2> 287 T23 oazsp.FileTxnSnapLog.save Snapshotting: 0
[junit4:junit4]   2> 341 T22 oaz.Environment.logEnv Client environment:zookeeper.version=3.3.6-1366786, built on 07/29/2012 06:22 GMT
[junit4:junit4]   2> 342 T22 oaz.Environment.logEnv Client environment:host.name=lucene.zones.apache.org
[junit4:junit4]   2> 343 T22 oaz.Environment.logEnv Client environment:java.version=1.7.0_09
[junit4:junit4]   2> 343 T22 oaz.Environment.logEnv Client environment:java.vendor=Oracle Corporation
[junit4:junit4]   2> 344 T22 oaz.Environment.logEnv Client environment:java.home=/usr/local/openjdk7/jre
[junit4:junit4]   2> 345 T22 oaz.Environment.logEnv Client environment:java.class.path=/usr/home/hudson/hudson-slave/workspace/Lucene-Solr-Tests-trunk-java7/solr/build/solr-core/classes/test:/usr/home/hudson/hudson-slave/workspace/Lucene-Solr-Tests-trunk-java7/solr/build/solr-test-framework/classes/java:/usr/home/hudson/hudson-slave/workspace/Lucene-Solr-Tests-trunk-java7/solr/build/solr-core/test-files:/usr/home/hudson/hudson-slave/workspace/Lucene-Solr-Tests-trunk-java7/lucene/build/test-framework/classes/java:/usr/home/hudson/hudson-slave/workspace/Lucene-Solr-Tests-trunk-java7/lucene/build/codecs/classes/java:/usr/home/hudson/hudson-slave/workspace/Lucene-Solr-Tests-trunk-java7/solr/build/solr-solrj/classes/java:/usr/home/hudson/hudson-slave/workspace/Lucene-Solr-Tests-trunk-java7/solr/build/solr-core/classes/java:/usr/home/hudson/hudson-slave/workspace/Lucene-Solr-Tests-trunk-java7/lucene/build/analysis/common/lucene-analyzers-common-5.0-SNAPSHOT.jar:/usr/home/hudson/hudson-slave/workspace/Lucene-Solr-Tests-trunk-java7/lucene/build/analysis/kuromoji/lucene-analyzers-kuromoji-5.0-SNAPSHOT.jar:/usr/home/hudson/hudson-slave/workspace/Lucene-Solr-Tests-trunk-java7/lucene/build/analysis/phonetic/lucene-analyzers-phonetic-5.0-SNAPSHOT.jar:/usr/home/hudson/hudson-slave/workspace/Lucene-Solr-Tests-trunk-java7/lucene/build/highlighter/lucene-highlighter-5.0-SNAPSHOT.jar:/usr/home/hudson/hudson-slave/workspace/Lucene-Solr-Tests-trunk-java7/lucene/build/memory/lucene-memory-5.0-SNAPSHOT.jar:/usr/home/hudson/hudson-slave/workspace/Lucene-Solr-Tests-trunk-java7/lucene/build/misc/lucene-misc-5.0-SNAPSHOT.jar:/usr/home/hudson/hudson-slave/workspace/Lucene-Solr-Tests-trunk-java7/lucene/build/spatial/lucene-spatial-5.0-SNAPSHOT.jar:/usr/home/hudson/hudson-slave/workspace/Lucene-Solr-Tests-trunk-java7/lucene/build/suggest/lucene-suggest-5.0-SNAPSHOT.jar:/usr/home/hudson/hudson-slave/workspace/Lucene-Solr-Tests-trunk-java7/lucene/build/grouping/lucene-grouping-5.0-SNAPSHOT.jar:/usr/home/hudson/hudson-slave/workspace/Lucene-Solr-Tests-trunk-java7/lucene/build/queries/lucene-queries-5.0-SNAPSHOT.jar:/usr/home/hudson/hudson-slave/workspace/Lucene-Solr-Tests-trunk-java7/lucene/build/queryparser/lucene-queryparser-5.0-SNAPSHOT.jar:/usr/home/hudson/hudson-slave/workspace/Lucene-Solr-Tests-trunk-java7/solr/core/lib/commons-cli-1.2.jar:/usr/home/hudson/hudson-slave/workspace/Lucene-Solr-Tests-trunk-java7/solr/core/lib/commons-codec-1.7.jar:/usr/home/hudson/hudson-slave/workspace/Lucene-Solr-Tests-trunk-java7/solr/core/lib/commons-fileupload-1.2.1.jar:/usr/home/hudson/hudson-slave/workspace/Lucene-Solr-Tests-trunk-java7/solr/core/lib/commons-lang-2.6.jar:/usr/home/hudson/hudson-slave/workspace/Lucene-Solr-Tests-trunk-java7/solr/core/lib/easymock-2.2.jar:/usr/home/hudson/hudson-slave/workspace/Lucene-Solr-Tests-trunk-java7/solr/core/lib/guava-r05.jar:/usr/home/hudson/hudson-slave/workspace/Lucene-Solr-Tests-trunk-java7/solr/core/lib/javax.servlet-api-3.0.1.jar:/usr/home/hudson/hudson-slave/workspace/Lucene-Solr-Tests-trunk-java7/solr/core/lib/metrics-core-2.1.2.jar:/usr/home/hudson/hudson-slave/workspace/Lucene-Solr-Tests-trunk-java7/solr/core/lib/spatial4j-0.3.jar:/usr/home/hudson/hudson-slave/workspace/Lucene-Solr-Tests-trunk-java7/solr/solrj/lib/commons-io-2.1.jar:/usr/home/hudson/hudson-slave/workspace/Lucene-Solr-Tests-trunk-java7/solr/solrj/lib/httpclient-4.1.3.jar:/usr/home/hudson/hudson-slave/workspace/Lucene-Solr-Tests-trunk-java7/solr/solrj/lib/httpcore-4.1.4.jar:/usr/home/hudson/hudson-slave/workspace/Lucene-Solr-Tests-trunk-java7/solr/solrj/lib/httpmime-4.1.3.jar:/usr/home/hudson/hudson-slave/workspace/Lucene-Solr-Tests-trunk-java7/solr/solrj/lib/jcl-over-slf4j-1.6.4.jar:/usr/home/hudson/hudson-slave/workspace/Lucene-Solr-Tests-trunk-java7/solr/solrj/lib/log4j-over-slf4j-1.6.4.jar:/usr/home/hudson/hudson-slave/workspace/Lucene-Solr-Tests-trunk-java7/solr/solrj/lib/slf4j-api-1.6.4.jar:/usr/home/hudson/hudson-slave/workspace/Lucene-Solr-Tests-trunk-java7/solr/solrj/lib/slf4j-jdk14-1.6.4.jar:/usr/home/hudson/hudson-slave/workspace/Lucene-Solr-Tests-trunk-java7/solr/solrj/lib/wstx-asl-3.2.7.jar:/usr/home/hudson/hudson-slave/workspace/Lucene-Solr-Tests-trunk-java7/solr/solrj/lib/zookeeper-3.3.6.jar:/usr/home/hudson/hudson-slave/workspace/Lucene-Solr-Tests-trunk-java7/solr/example/lib/jetty-continuation-8.1.7.v20120910.jar:/usr/home/hudson/hudson-slave/workspace/Lucene-Solr-Tests-trunk-java7/solr/example/lib/jetty-deploy-8.1.7.v20120910.jar:/usr/home/hudson/hudson-slave/workspace/Lucene-Solr-Tests-trunk-java7/solr/example/lib/jetty-http-8.1.7.v20120910.jar:/usr/home/hudson/hudson-slave/workspace/Lucene-Solr-Tests-trunk-java7/solr/example/lib/jetty-io-8.1.7.v20120910.jar:/usr/home/hudson/hudson-slave/workspace/Lucene-Solr-Tests-trunk-java7/solr/example/lib/jetty-jmx-8.1.7.v20120910.jar:/usr/home/hudson/hudson-slave/workspace/Lucene-Solr-Tests-trunk-java7/solr/example/lib/jetty-security-8.1.7.v20120910.jar:/usr/home/hudson/hudson-slave/workspace/Lucene-Solr-Tests-trunk-java7/solr/example/lib/jetty-server-8.1.7.v20120910.jar:/usr/home/hudson/hudson-slave/workspace/Lucene-Solr-Tests-trunk-java7/solr/example/lib/jetty-servlet-8.1.7.v20120910.jar:/usr/home/hudson/hudson-slave/workspace/Lucene-Solr-Tests-trunk-java7/solr/example/lib/jetty-util-8.1.7.v20120910.jar:/usr/home/hudson/hudson-slave/workspace/Lucene-Solr-Tests-trunk-java7/solr/example/lib/jetty-webapp-8.1.7.v20120910.jar:/usr/home/hudson/hudson-slave/workspace/Lucene-Solr-Tests-trunk-java7/solr/example/lib/jetty-xml-8.1.7.v20120910.jar:/usr/home/hudson/hudson-slave/workspace/Lucene-Solr-Tests-trunk-java7/solr/example/lib/servlet-api-3.0.jar:/usr/home/hudson/hudson-slave/workspace/Lucene-Solr-Tests-trunk-java7/solr/example/example-DIH/solr/db/lib/hsqldb-1.8.0.10.jar:/usr/home/hudson/hudson-slave/workspace/Lucene-Solr-Tests-trunk-java7/lucene/build/core/classes/java:/usr/home/hudson/hudson-slave/workspace/Lucene-Solr-Tests-trunk-java7/lucene/test-framework/lib/junit-4.10.jar:/usr/home/hudson/hudson-slave/workspace/Lucene-Solr-Tests-trunk-java7/lucene/test-framework/lib/randomizedtesting-runner-2.0.4.jar:/home/hudson/hudson-slave/tools/Ant/ant-1.8.2/lib/ant-launcher.jar:/home/hudson/.ant/lib/ivy-2.2.0.jar:/home/hudson/hudson-slave/tools/Ant/ant-1.8.2/lib/ant-apache-regexp.jar:/home/hudson/hudson-slave/tools/Ant/ant-1.8.2/lib/ant-junit.jar:/home/hudson/hudson-slave/tools/Ant/ant-1.8.2/lib/ant-apache-bsf.jar:/home/hudson/hudson-slave/tools/Ant/ant-1.8.2/lib/ant-commons-net.jar:/home/hudson/hudson-slave/tools/Ant/ant-1.8.2/lib/ant-antlr.jar:/home/hudson/hudson-slave/tools/Ant/ant-1.8.2/lib/ant-apache-log4j.jar:/home/hudson/hudson-slave/tools/Ant/ant-1.8.2/lib/ant-commons-logging.jar:/home/hudson/hudson-slave/tools/Ant/ant-1.8.2/lib/ant-apache-xalan2.jar:/home/hudson/hudson-slave/tools/Ant/ant-1.8.2/lib/ant-apache-oro.jar:/home/hudson/hudson-slave/tools/Ant/ant-1.8.2/lib/ant-junit4.jar:/home/hudson/hudson-slave/tools/Ant/ant-1.8.2/lib/ant-netrexx.jar:/home/hudson/hudson-slave/tools/Ant/ant-1.8.2/lib/ant-swing.jar:/home/hudson/hudson-slave/tools/Ant/ant-1.8.2/lib/ant-javamail.jar:/home/hudson/hudson-slave/tools/Ant/ant-1.8.2/lib/ant-jsch.jar:/home/hudson/hudson-slave/tools/Ant/ant-1.8.2/lib/ant-jmf.jar:/home/hudson/hudson-slave/tools/Ant/ant-1.8.2/lib/ant.jar:/home/hudson/hudson-slave/tools/Ant/ant-1.8.2/lib/ant-apache-bcel.jar:/home/hudson/hudson-slave/tools/Ant/ant-1.8.2/lib/ant-jai.jar:/home/hudson/hudson-slave/tools/Ant/ant-1.8.2/lib/ant-testutil.jar:/home/hudson/hudson-slave/tools/Ant/ant-1.8.2/lib/ant-apache-resolver.jar:/home/hudson/hudson-slave/tools/Ant/ant-1.8.2/lib/ant-jdepend.jar:/usr/local/openjdk7/lib/tools.jar:/home/hudson/.ivy2/cache/com.carrotsearch.randomizedtesting/junit4-ant/jars/junit4-ant-2.0.4.jar
[junit4:junit4]   2> 346 T22 oaz.Environment.logEnv Client environment:java.library.path=/usr/local/openjdk7/jre/lib/amd64/server:/usr/local/openjdk7/jre/lib/amd64:/usr/local/openjdk7/jre/../lib/amd64:/usr/local/openjdk6/jre/lib/amd64/server:/usr/local/openjdk6/jre/lib/amd64:/usr/local/openjdk6/jre/../lib/amd64:/usr/java/packages/lib/amd64:/lib:/usr/lib:/usr/local/lib
[junit4:junit4]   2> 347 T22 oaz.Environment.logEnv Client environment:java.io.tmpdir=.
[junit4:junit4]   2> 348 T22 oaz.Environment.logEnv Client environment:java.compiler=<NA>
[junit4:junit4]   2> 349 T22 oaz.Environment.logEnv Client environment:os.name=FreeBSD
[junit4:junit4]   2> 349 T22 oaz.Environment.logEnv Client environment:os.arch=amd64
[junit4:junit4]   2> 350 T22 oaz.Environment.logEnv Client environment:os.version=9.0-RELEASE
[junit4:junit4]   2> 351 T22 oaz.Environment.logEnv Client environment:user.name=hudson
[junit4:junit4]   2> 351 T22 oaz.Environment.logEnv Client environment:user.home=/home/hudson
[junit4:junit4]   2> 352 T22 oaz.Environment.logEnv Client environment:user.dir=/usr/home/hudson/hudson-slave/workspace/Lucene-Solr-Tests-trunk-java7/solr/build/solr-core/test/J0
[junit4:junit4]   2> 358 T22 oaz.ZooKeeper.<init> Initiating client connection, connectString=127.0.0.1:34333 sessionTimeout=10000 watcher=org.apache.solr.common.cloud.ConnectionManager@6f68922c
[junit4:junit4]   2> 423 T27 oaz.ClientCnxn$SendThread.startConnect Opening socket connection to server /127.0.0.1:34333
[junit4:junit4]   2> 423 T22 oascc.ConnectionManager.waitForConnected Waiting for client to connect to ZooKeeper
[junit4:junit4]   2> 426 T27 oaz.ClientCnxn$SendThread.primeConnection Socket connection established to localhost/127.0.0.1:34333, initiating session
[junit4:junit4]   2> 427 T24 oazs.NIOServerCnxn$Factory.run Accepted socket connection from /140.211.11.196:39642
[junit4:junit4]   2> 447 T24 oazs.NIOServerCnxn.doIO WARNING Exception causing close of session 0x0 due to java.io.IOException: ZooKeeperServer not running
[junit4:junit4]   2> 448 T24 oazs.NIOServerCnxn.closeSock Closed socket connection for client /140.211.11.196:39642 (no session established for client)
[junit4:junit4]   2> 449 T27 oaz.ClientCnxn$SendThread.run Unable to read additional data from server sessionid 0x0, likely server has closed socket, closing socket connection and attempting reconnect
[junit4:junit4]   2> 1755 T27 oaz.ClientCnxn$SendThread.startConnect Opening socket connection to server localhost/127.0.0.1:34333
[junit4:junit4]   2> 1756 T27 oaz.ClientCnxn$SendThread.primeConnection Socket connection established to localhost/127.0.0.1:34333, initiating session
[junit4:junit4]   2> 1756 T24 oazs.NIOServerCnxn$Factory.run Accepted socket connection from /140.211.11.196:24516
[junit4:junit4]   2> 1757 T24 oazs.NIOServerCnxn.readConnectRequest Client attempting to establish new session at /140.211.11.196:24516
[junit4:junit4]   2> 1774 T26 oazsp.FileTxnLog.append Creating new log file: log.1
[junit4:junit4]   2> 1807 T26 oazs.NIOServerCnxn.finishSessionInit Established session 0x13ae250c0750000 with negotiated timeout 10000 for client /140.211.11.196:24516
[junit4:junit4]   2> 1807 T27 oaz.ClientCnxn$SendThread.readConnectResult Session establishment complete on server localhost/127.0.0.1:34333, sessionid = 0x13ae250c0750000, negotiated timeout = 10000
[junit4:junit4]   2> 1813 T29 oascc.ConnectionManager.process Watcher org.apache.solr.common.cloud.ConnectionManager@6f68922c name:ZooKeeperConnection Watcher:127.0.0.1:34333 got event WatchedEvent state:SyncConnected type:None path:null path:null type:None
[junit4:junit4]   2> 1814 T22 oascc.ConnectionManager.waitForConnected Client is connected to ZooKeeper
[junit4:junit4]   2> 1817 T22 oascc.SolrZkClient.makePath makePath: /solr
[junit4:junit4]   2> 1877 T28 oazs.PrepRequestProcessor.pRequest Processed session termination for sessionid: 0x13ae250c0750000
[junit4:junit4]   2> 1879 T29 oaz.ClientCnxn$EventThread.run EventThread shut down
[junit4:junit4]   2> 1879 T22 oaz.ZooKeeper.close Session: 0x13ae250c0750000 closed
[junit4:junit4]   2> 1880 T24 oazs.NIOServerCnxn.closeSock Closed socket connection for client /140.211.11.196:24516 which had sessionid 0x13ae250c0750000
[junit4:junit4]   2> 1880 T22 oaz.ZooKeeper.<init> Initiating client connection, connectString=127.0.0.1:34333/solr sessionTimeout=10000 watcher=org.apache.solr.common.cloud.ConnectionManager@6adda258
[junit4:junit4]   2> 1881 T30 oaz.ClientCnxn$SendThread.startConnect Opening socket connection to server /127.0.0.1:34333
[junit4:junit4]   2> 1881 T22 oascc.ConnectionManager.waitForConnected Waiting for client to connect to ZooKeeper
[junit4:junit4]   2> 1883 T30 oaz.ClientCnxn$SendThread.primeConnection Socket connection established to localhost/127.0.0.1:34333, initiating session
[junit4:junit4]   2> 1883 T24 oazs.NIOServerCnxn$Factory.run Accepted socket connection from /140.211.11.196:64219
[junit4:junit4]   2> 1884 T24 oazs.NIOServerCnxn.readConnectRequest Client attempting to establish new session at /140.211.11.196:64219
[junit4:junit4]   2> 1886 T26 oazs.NIOServerCnxn.finishSessionInit Established session 0x13ae250c0750001 with negotiated timeout 10000 for client /140.211.11.196:64219
[junit4:junit4]   2> 1886 T30 oaz.ClientCnxn$SendThread.readConnectResult Session establishment complete on server localhost/127.0.0.1:34333, sessionid = 0x13ae250c0750001, negotiated timeout = 10000
[junit4:junit4]   2> 1887 T31 oascc.ConnectionManager.process Watcher org.apache.solr.common.cloud.ConnectionManager@6adda258 name:ZooKeeperConnection Watcher:127.0.0.1:34333/solr got event WatchedEvent state:SyncConnected type:None path:null path:null type:None
[junit4:junit4]   2> 1887 T22 oascc.ConnectionManager.waitForConnected Client is connected to ZooKeeper
[junit4:junit4]   2> 1922 T22 oascc.SolrZkClient.makePath makePath: /collections/collection1
[junit4:junit4]   2> 1929 T22 oascc.SolrZkClient.makePath makePath: /collections/collection1/shards
[junit4:junit4]   2> 1933 T22 oascc.SolrZkClient.makePath makePath: /collections/control_collection
[junit4:junit4]   2> 1937 T22 oascc.SolrZkClient.makePath makePath: /collections/control_collection/shards
[junit4:junit4]   2> 1943 T22 oasc.AbstractZkTestCase.putConfig put /usr/home/hudson/hudson-slave/workspace/Lucene-Solr-Tests-trunk-java7/solr/build/solr-core/test-files/solr/collection1/conf/solrconfig.xml to /configs/conf1/solrconfig.xml
[junit4:junit4]   2> 1982 T22 oascc.SolrZkClient.makePath makePath: /configs/conf1/solrconfig.xml
[junit4:junit4]   2> 1997 T22 oasc.AbstractZkTestCase.putConfig put /usr/home/hudson/hudson-slave/workspace/Lucene-Solr-Tests-trunk-java7/solr/build/solr-core/test-files/solr/collection1/conf/schema.xml to /configs/conf1/schema.xml
[junit4:junit4]   2> 1999 T22 oascc.SolrZkClient.makePath makePath: /configs/conf1/schema.xml
[junit4:junit4]   2> 2105 T22 oasc.AbstractZkTestCase.putConfig put /usr/home/hudson/hudson-slave/workspace/Lucene-Solr-Tests-trunk-java7/solr/build/solr-core/test-files/solr/collection1/conf/solrconfig.xml to /configs/conf1/solrconfig.xml
[junit4:junit4]   2> 2106 T22 oascc.SolrZkClient.makePath makePath: /configs/conf1/solrconfig.xml
[junit4:junit4]   2> 2124 T22 oasc.AbstractZkTestCase.putConfig put /usr/home/hudson/hudson-slave/workspace/Lucene-Solr-Tests-trunk-java7/solr/build/solr-core/test-files/solr/collection1/conf/stopwords.txt to /configs/conf1/stopwords.txt
[junit4:junit4]   2> 2125 T22 oascc.SolrZkClient.makePath makePath: /configs/conf1/stopwords.txt
[junit4:junit4]   2> 2130 T22 oasc.AbstractZkTestCase.putConfig put /usr/home/hudson/hudson-slave/workspace/Lucene-Solr-Tests-trunk-java7/solr/build/solr-core/test-files/solr/collection1/conf/protwords.txt to /configs/conf1/protwords.txt
[junit4:junit4]   2> 2131 T22 oascc.SolrZkClient.makePath makePath: /configs/conf1/protwords.txt
[junit4:junit4]   2> 2135 T22 oasc.AbstractZkTestCase.putConfig put /usr/home/hudson/hudson-slave/workspace/Lucene-Solr-Tests-trunk-java7/solr/build/solr-core/test-files/solr/collection1/conf/currency.xml to /configs/conf1/currency.xml
[junit4:junit4]   2> 2136 T22 oascc.SolrZkClient.makePath makePath: /configs/conf1/currency.xml
[junit4:junit4]   2> 2141 T22 oasc.AbstractZkTestCase.putConfig put /usr/home/hudson/hudson-slave/workspace/Lucene-Solr-Tests-trunk-java7/solr/build/solr-core/test-files/solr/collection1/conf/open-exchange-rates.json to /configs/conf1/open-exchange-rates.json
[junit4:junit4]   2> 2142 T22 oascc.SolrZkClient.makePath makePath: /configs/conf1/open-exchange-rates.json
[junit4:junit4]   2> 2147 T22 oasc.AbstractZkTestCase.putConfig put /usr/home/hudson/hudson-slave/workspace/Lucene-Solr-Tests-trunk-java7/solr/build/solr-core/test-files/solr/collection1/conf/mapping-ISOLatin1Accent.txt to /configs/conf1/mapping-ISOLatin1Accent.txt
[junit4:junit4]   2> 2148 T22 oascc.SolrZkClient.makePath makePath: /configs/conf1/mapping-ISOLatin1Accent.txt
[junit4:junit4]   2> 2152 T22 oasc.AbstractZkTestCase.putConfig put /usr/home/hudson/hudson-slave/workspace/Lucene-Solr-Tests-trunk-java7/solr/build/solr-core/test-files/solr/collection1/conf/old_synonyms.txt to /configs/conf1/old_synonyms.txt
[junit4:junit4]   2> 2153 T22 oascc.SolrZkClient.makePath makePath: /configs/conf1/old_synonyms.txt
[junit4:junit4]   2> 2158 T22 oasc.AbstractZkTestCase.putConfig put /usr/home/hudson/hudson-slave/workspace/Lucene-Solr-Tests-trunk-java7/solr/build/solr-core/test-files/solr/collection1/conf/synonyms.txt to /configs/conf1/synonyms.txt
[junit4:junit4]   2> 2159 T22 oascc.SolrZkClient.makePath makePath: /configs/conf1/synonyms.txt
[junit4:junit4]   2> 2164 T28 oazs.PrepRequestProcessor.pRequest Processed session termination for sessionid: 0x13ae250c0750001
[junit4:junit4]   2> 2165 T31 oaz.ClientCnxn$EventThread.run EventThread shut down
[junit4:junit4]   2> 2165 T24 oazs.NIOServerCnxn.closeSock Closed socket connection for client /140.211.11.196:64219 which had sessionid 0x13ae250c0750001
[junit4:junit4]   2> 2165 T22 oaz.ZooKeeper.close Session: 0x13ae250c0750001 closed
[junit4:junit4]   2> 3271 T22 oejs.Server.doStart jetty-8.1.7.v20120910
[junit4:junit4]   2> 3675 T22 oejs.AbstractConnector.doStart Started SelectChannelConnector@0.0.0.0:21771
[junit4:junit4]   2> 3711 T22 oasc.SolrResourceLoader.locateSolrHome JNDI not configured for solr (NoInitialContextEx)
[junit4:junit4]   2> 3712 T22 oasc.SolrResourceLoader.locateSolrHome using system property solr.solr.home: /usr/home/hudson/hudson-slave/workspace/Lucene-Solr-Tests-trunk-java7/solr/build/solr-core/test/J0/./org.apache.solr.cloud.BasicDistributedZkTest-controljetty-1352416675731
[junit4:junit4]   2> 3712 T22 oasc.SolrResourceLoader.<init> new SolrResourceLoader for deduced Solr Home: '/usr/home/hudson/hudson-slave/workspace/Lucene-Solr-Tests-trunk-java7/solr/build/solr-core/test/J0/./org.apache.solr.cloud.BasicDistributedZkTest-controljetty-1352416675731/'
[junit4:junit4]   2> 3747 T22 oass.SolrDispatchFilter.init SolrDispatchFilter.init()
[junit4:junit4]   2> 3747 T22 oasc.SolrResourceLoader.locateSolrHome JNDI not configured for solr (NoInitialContextEx)
[junit4:junit4]   2> 3748 T22 oasc.SolrResourceLoader.locateSolrHome using system property solr.solr.home: /usr/home/hudson/hudson-slave/workspace/Lucene-Solr-Tests-trunk-java7/solr/build/solr-core/test/J0/./org.apache.solr.cloud.BasicDistributedZkTest-controljetty-1352416675731
[junit4:junit4]   2> 3748 T22 oasc.CoreContainer$Initializer.initialize looking for solr.xml: /usr/home/hudson/hudson-slave/workspace/Lucene-Solr-Tests-trunk-java7/solr/build/solr-core/test/J0/./org.apache.solr.cloud.BasicDistributedZkTest-controljetty-1352416675731/solr.xml
[junit4:junit4]   2> 3749 T22 oasc.CoreContainer.<init> New CoreContainer 657341792
[junit4:junit4]   2> 3750 T22 oasc.CoreContainer.load Loading CoreContainer using Solr Home: '/usr/home/hudson/hudson-slave/workspace/Lucene-Solr-Tests-trunk-java7/solr/build/solr-core/test/J0/./org.apache.solr.cloud.BasicDistributedZkTest-controljetty-1352416675731/'
[junit4:junit4]   2> 3750 T22 oasc.SolrResourceLoader.<init> new SolrResourceLoader for directory: '/usr/home/hudson/hudson-slave/workspace/Lucene-Solr-Tests-trunk-java7/solr/build/solr-core/test/J0/./org.apache.solr.cloud.BasicDistributedZkTest-controljetty-1352416675731/'
[junit4:junit4]   2> 3789 T22 oasc.CoreContainer.load Registering Log Listener
[junit4:junit4]   2> 3803 T22 oasc.CoreContainer.initZooKeeper Zookeeper client=127.0.0.1:34333/solr
[junit4:junit4]   2> 3825 T22 oaz.ZooKeeper.<init> Initiating client connection, connectString=127.0.0.1:34333/solr sessionTimeout=5000 watcher=org.apache.solr.common.cloud.ConnectionManager@7629a637
[junit4:junit4]   2> 3826 T42 oaz.ClientCnxn$SendThread.startConnect Opening socket connection to server /127.0.0.1:34333
[junit4:junit4]   2> 3826 T22 oascc.ConnectionManager.waitForConnected Waiting for client to connect to ZooKeeper
[junit4:junit4]   2> 3827 T42 oaz.ClientCnxn$SendThread.primeConnection Socket connection established to localhost/127.0.0.1:34333, initiating session
[junit4:junit4]   2> 3828 T24 oazs.NIOServerCnxn$Factory.run Accepted socket connection from /140.211.11.196:18581
[junit4:junit4]   2> 3829 T24 oazs.NIOServerCnxn.readConnectRequest Client attempting to establish new session at /140.211.11.196:18581
[junit4:junit4]   2> 3831 T26 oazs.NIOServerCnxn.finishSessionInit Established session 0x13ae250c0750002 with negotiated timeout 5000 for client /140.211.11.196:18581
[junit4:junit4]   2> 3831 T42 oaz.ClientCnxn$SendThread.readConnectResult Session establishment complete on server localhost/127.0.0.1:34333, sessionid = 0x13ae250c0750002, negotiated timeout = 5000
[junit4:junit4]   2> 3831 T43 oascc.ConnectionManager.process Watcher org.apache.solr.common.cloud.ConnectionManager@7629a637 name:ZooKeeperConnection Watcher:127.0.0.1:34333/solr got event WatchedEvent state:SyncConnected type:None path:null path:null type:None
[junit4:junit4]   2> 3832 T22 oascc.ConnectionManager.waitForConnected Client is connected to ZooKeeper
[junit4:junit4]   2> 3846 T28 oazs.PrepRequestProcessor.pRequest Got user-level KeeperException when processing sessionid:0x13ae250c0750002 type:create cxid:0x2 zxid:0xfffffffffffffffe txntype:unknown reqpath:n/a Error Path:/solr/overseer Error:KeeperErrorCode = NodeExists for /solr/overseer
[junit4:junit4]   2> 3854 T22 oascc.SolrZkClient.makePath makePath: /live_nodes
[junit4:junit4]   2> 3856 T22 oasc.ZkController.createEphemeralLiveNode Register node as live in ZooKeeper:/live_nodes/127.0.0.1:21771_solr
[junit4:junit4]   2> 3861 T28 oazs.PrepRequestProcessor.pRequest Got user-level KeeperException when processing sessionid:0x13ae250c0750002 type:delete cxid:0x7 zxid:0xfffffffffffffffe txntype:unknown reqpath:n/a Error Path:/solr/live_nodes/127.0.0.1:21771_solr Error:KeeperErrorCode = NoNode for /solr/live_nodes/127.0.0.1:21771_solr
[junit4:junit4]   2> 3862 T22 oascc.SolrZkClient.makePath makePath: /live_nodes/127.0.0.1:21771_solr
[junit4:junit4]   2> 3865 T22 oashc.HttpShardHandlerFactory.getParameter Setting socketTimeout to: 0
[junit4:junit4]   2> 3866 T22 oashc.HttpShardHandlerFactory.getParameter Setting urlScheme to: http://
[junit4:junit4]   2> 3866 T22 oashc.HttpShardHandlerFactory.getParameter Setting connTimeout to: 0
[junit4:junit4]   2> 3867 T22 oashc.HttpShardHandlerFactory.getParameter Setting maxConnectionsPerHost to: 20
[junit4:junit4]   2> 3867 T22 oashc.HttpShardHandlerFactory.getParameter Setting corePoolSize to: 0
[junit4:junit4]   2> 3868 T22 oashc.HttpShardHandlerFactory.getParameter Setting maximumPoolSize to: 2147483647
[junit4:junit4]   2> 3868 T22 oashc.HttpShardHandlerFactory.getParameter Setting maxThreadIdleTime to: 5
[junit4:junit4]   2> 3869 T22 oashc.HttpShardHandlerFactory.getParameter Setting sizeOfQueue to: -1
[junit4:junit4]   2> 3869 T22 oashc.HttpShardHandlerFactory.getParameter Setting fairnessPolicy to: false
[junit4:junit4]   2> 3870 T22 oascsi.HttpClientUtil.createClient Creating new http client, config:maxConnectionsPerHost=20&maxConnections=10000&socketTimeout=0&connTimeout=0&retry=false
[junit4:junit4]   2> 3882 T22 oascc.SolrZkClient.makePath makePath: /overseer_elect/election
[junit4:junit4]   2> 3898 T28 oazs.PrepRequestProcessor.pRequest Got user-level KeeperException when processing sessionid:0x13ae250c0750002 type:delete cxid:0x15 zxid:0xfffffffffffffffe txntype:unknown reqpath:n/a Error Path:/solr/overseer_elect/leader Error:KeeperErrorCode = NoNode for /solr/overseer_elect/leader
[junit4:junit4]   2> 3899 T22 oascc.SolrZkClient.makePath makePath: /overseer_elect/leader
[junit4:junit4]   2> 3902 T22 oasc.Overseer.start Overseer (id=88631979141300226-127.0.0.1:21771_solr-n_0000000000) starting
[junit4:junit4]   2> 3903 T28 oazs.PrepRequestProcessor.pRequest Got user-level KeeperException when processing sessionid:0x13ae250c0750002 type:create cxid:0x1a zxid:0xfffffffffffffffe txntype:unknown reqpath:n/a Error Path:/solr/overseer Error:KeeperErrorCode = NodeExists for /solr/overseer
[junit4:junit4]   2> 3918 T28 oazs.PrepRequestProcessor.pRequest Got user-level KeeperException when processing sessionid:0x13ae250c0750002 type:create cxid:0x1b zxid:0xfffffffffffffffe txntype:unknown reqpath:n/a Error Path:/solr/overseer Error:KeeperErrorCode = NodeExists for /solr/overseer
[junit4:junit4]   2> 3920 T28 oazs.PrepRequestProcessor.pRequest Got user-level KeeperException when processing sessionid:0x13ae250c0750002 type:create cxid:0x1c zxid:0xfffffffffffffffe txntype:unknown reqpath:n/a Error Path:/solr/overseer Error:KeeperErrorCode = NodeExists for /solr/overseer
[junit4:junit4]   2> 3929 T28 oazs.PrepRequestProcessor.pRequest Got user-level KeeperException when processing sessionid:0x13ae250c0750002 type:create cxid:0x1d zxid:0xfffffffffffffffe txntype:unknown reqpath:n/a Error Path:/solr/overseer Error:KeeperErrorCode = NodeExists for /solr/overseer
[junit4:junit4]   2> 3930 T45 oasc.OverseerCollectionProcessor.run Process current queue of collection messages
[junit4:junit4]   2> 3931 T22 oascc.SolrZkClient.makePath makePath: /clusterstate.json
[junit4:junit4]   2> 3937 T22 oascc.ZkStateReader.createClusterStateWatchersAndUpdate Updating cluster state from ZooKeeper... 
[junit4:junit4]   2> 3956 T44 oasc.Overseer$ClusterStateUpdater.run Starting to work on the main queue
[junit4:junit4]   2> 4001 T22 oasc.CoreContainer.create Creating SolrCore 'collection1' using instanceDir: /usr/home/hudson/hudson-slave/workspace/Lucene-Solr-Tests-trunk-java7/solr/build/solr-core/test/J0/./org.apache.solr.cloud.BasicDistributedZkTest-controljetty-1352416675731/collection1
[junit4:junit4]   2> 4002 T22 oasc.ZkController.createCollectionZkNode Check for collection zkNode:control_collection
[junit4:junit4]   2> 4003 T22 oasc.ZkController.createCollectionZkNode Collection zkNode exists
[junit4:junit4]   2> 4003 T22 oasc.ZkController.readConfigName Load collection config from:/collections/control_collection
[junit4:junit4]   2> 4005 T22 oasc.SolrResourceLoader.<init> new SolrResourceLoader for directory: '/usr/home/hudson/hudson-slave/workspace/Lucene-Solr-Tests-trunk-java7/solr/build/solr-core/test/J0/./org.apache.solr.cloud.BasicDistributedZkTest-controljetty-1352416675731/collection1/'
[junit4:junit4]   2> 4007 T22 oasc.SolrResourceLoader.replaceClassLoader Adding 'file:/usr/home/hudson/hudson-slave/workspace/Lucene-Solr-Tests-trunk-java7/solr/build/solr-core/test/J0/org.apache.solr.cloud.BasicDistributedZkTest-controljetty-1352416675731/collection1/lib/README' to classloader
[junit4:junit4]   2> 4008 T22 oasc.SolrResourceLoader.replaceClassLoader Adding 'file:/usr/home/hudson/hudson-slave/workspace/Lucene-Solr-Tests-trunk-java7/solr/build/solr-core/test/J0/org.apache.solr.cloud.BasicDistributedZkTest-controljetty-1352416675731/collection1/lib/classes/' to classloader
[junit4:junit4]   2> 4352 T22 oasc.SolrConfig.<init> Using Lucene MatchVersion: LUCENE_50
[junit4:junit4]   2> 4414 T22 oasc.SolrConfig.<init> Loaded SolrConfig: solrconfig.xml
[junit4:junit4]   2> 4459 T22 oass.IndexSchema.readSchema Reading Solr Schema
[junit4:junit4]   2> 4502 T22 oass.IndexSchema.readSchema Schema name=test
[junit4:junit4]   2> 5039 T22 oass.OpenExchangeRatesOrgProvider.init Initialized with rates=open-exchange-rates.json, refreshInterval=1440.
[junit4:junit4]   2> 5053 T22 oass.IndexSchema.readSchema default search field in schema is text
[junit4:junit4]   2> 5056 T22 oass.IndexSchema.readSchema unique key field: id
[junit4:junit4]   2> 5089 T22 oass.FileExchangeRateProvider.reload Reloading exchange rates from file currency.xml
[junit4:junit4]   2> 5095 T22 oass.FileExchangeRateProvider.reload Reloading exchange rates from file currency.xml
[junit4:junit4]   2> 5100 T22 oass.OpenExchangeRatesOrgProvider.reload Reloading exchange rates from open-exchange-rates.json
[junit4:junit4]   2> 5104 T22 oass.OpenExchangeRatesOrgProvider.reload Reloading exchange rates from open-exchange-rates.json
[junit4:junit4]   2> 5108 T22 oasc.SolrCore.<init> [collection1] Opening new SolrCore at /usr/home/hudson/hudson-slave/workspace/Lucene-Solr-Tests-trunk-java7/solr/build/solr-core/test/J0/./org.apache.solr.cloud.BasicDistributedZkTest-controljetty-1352416675731/collection1/, dataDir=./org.apache.solr.cloud.BasicDistributedZkTest-1352416673571/control/data/
[junit4:junit4]   2> 5112 T22 oasc.JmxMonitoredMap.<init> JMX monitoring is enabled. Adding Solr mbeans to JMX Server: com.sun.jmx.mbeanserver.JmxMBeanServer@5434e6e3
[junit4:junit4]   2> 5113 T22 oasc.SolrCore.initDirectoryFactory solr.NRTCachingDirectoryFactory
[junit4:junit4]   2> 5136 T22 oasc.CachingDirectoryFactory.injectLockFactory WARNING No lockType configured for NRTCachingDirectory(org.apache.lucene.store.NIOFSDirectory@/usr/home/hudson/hudson-slave/workspace/Lucene-Solr-Tests-trunk-java7/solr/build/solr-core/test/J0/org.apache.solr.cloud.BasicDistributedZkTest-1352416673571/control/data lockFactory=org.apache.lucene.store.NativeFSLockFactory@ac7ad3b; maxCacheMB=48.0 maxMergeSizeMB=4.0) assuming 'simple'
[junit4:junit4]   2> 5137 T22 oasc.CachingDirectoryFactory.get return new directory for /usr/home/hudson/hudson-slave/workspace/Lucene-Solr-Tests-trunk-java7/solr/build/solr-core/test/J0/./org.apache.solr.cloud.BasicDistributedZkTest-1352416673571/control/data forceNew:false
[junit4:junit4]   2> 5138 T22 oasc.CachingDirectoryFactory.close Releasing directory:/usr/home/hudson/hudson-slave/workspace/Lucene-Solr-Tests-trunk-java7/solr/build/solr-core/test/J0/./org.apache.solr.cloud.BasicDistributedZkTest-1352416673571/control/data
[junit4:junit4]   2> 5138 T22 oasc.SolrCore.getNewIndexDir New index directory detected: old=null new=./org.apache.solr.cloud.BasicDistributedZkTest-1352416673571/control/data/index/
[junit4:junit4]   2> 5139 T22 oasc.SolrCore.initIndex WARNING [collection1] Solr index directory './org.apache.solr.cloud.BasicDistributedZkTest-1352416673571/control/data/index' doesn't exist. Creating new index...
[junit4:junit4]   2> 5140 T22 oasc.CachingDirectoryFactory.get return new directory for /usr/home/hudson/hudson-slave/workspace/Lucene-Solr-Tests-trunk-java7/solr/build/solr-core/test/J0/./org.apache.solr.cloud.BasicDistributedZkTest-1352416673571/control/data/index forceNew:false
[junit4:junit4]   2> 5147 T22 oasc.SolrDeletionPolicy.onCommit SolrDeletionPolicy.onCommit: commits:num=1
[junit4:junit4]   2> 		commit{dir=NRTCachingDirectory(org.apache.lucene.store.NIOFSDirectory@/usr/home/hudson/hudson-slave/workspace/Lucene-Solr-Tests-trunk-java7/solr/build/solr-core/test/J0/org.apache.solr.cloud.BasicDistributedZkTest-1352416673571/control/data/index lockFactory=org.apache.lucene.store.NativeFSLockFactory@104468e2; maxCacheMB=48.0 maxMergeSizeMB=4.0),segFN=segments_1,generation=1,filenames=[segments_1]
[junit4:junit4]   2> 5147 T22 oasc.SolrDeletionPolicy.updateCommits newest commit = 1[segments_1]
[junit4:junit4]   2> 5148 T22 oasc.CachingDirectoryFactory.close Releasing directory:/usr/home/hudson/hudson-slave/workspace/Lucene-Solr-Tests-trunk-java7/solr/build/solr-core/test/J0/./org.apache.solr.cloud.BasicDistributedZkTest-1352416673571/control/data/index
[junit4:junit4]   2> 5149 T22 oasc.SolrCore.initWriters created xml: solr.XMLResponseWriter
[junit4:junit4]   2> 5152 T22 oasup.UpdateRequestProcessorChain.init inserting DistributedUpdateProcessorFactory into updateRequestProcessorChain "dedupe"
[junit4:junit4]   2> 5152 T22 oasup.UpdateRequestProcessorChain.init inserting DistributedUpdateProcessorFactory into updateRequestProcessorChain "dedupe-allfields"
[junit4:junit4]   2> 5153 T22 oasup.UpdateRequestProcessorChain.init inserting DistributedUpdateProcessorFactory into updateRequestProcessorChain "stored_sig"
[junit4:junit4]   2> 5153 T22 oasup.UpdateRequestProcessorChain.init inserting DistributedUpdateProcessorFactory into updateRequestProcessorChain "uniq-fields"
[junit4:junit4]   2> 5154 T22 oasup.UpdateRequestProcessorChain.init inserting DistributedUpdateProcessorFactory into updateRequestProcessorChain "distrib-dup-test-chain-implicit"
[junit4:junit4]   2> 5155 T22 oasc.RequestHandlers.initHandlersFromConfig adding lazy requestHandler: solr.ReplicationHandler
[junit4:junit4]   2> 5155 T22 oasc.RequestHandlers.initHandlersFromConfig created /replication: solr.ReplicationHandler
[junit4:junit4]   2> 5158 T22 oasc.RequestHandlers.initHandlersFromConfig created standard: solr.StandardRequestHandler
[junit4:junit4]   2> 5159 T22 oasc.RequestHandlers.initHandlersFromConfig created /get: solr.RealTimeGetHandler
[junit4:junit4]   2> 5161 T22 oasc.RequestHandlers.initHandlersFromConfig created dismax: solr.SearchHandler
[junit4:junit4]   2> 5163 T22 oasc.RequestHandlers.initHandlersFromConfig created mock: org.apache.solr.core.MockQuerySenderListenerReqHandler
[junit4:junit4]   2> 5164 T22 oasc.RequestHandlers.initHandlersFromConfig created /admin/: org.apache.solr.handler.admin.AdminHandlers
[junit4:junit4]   2> 5165 T22 oasc.RequestHandlers.initHandlersFromConfig created defaults: solr.StandardRequestHandler
[junit4:junit4]   2> 5166 T22 oasc.RequestHandlers.initHandlersFromConfig adding lazy requestHandler: solr.StandardRequestHandler
[junit4:junit4]   2> 5166 T22 oasc.RequestHandlers.initHandlersFromConfig created lazy: solr.StandardRequestHandler
[junit4:junit4]   2> 5168 T22 oasc.RequestHandlers.initHandlersFromConfig created /update: solr.UpdateRequestHandler
[junit4:junit4]   2> 5170 T22 oasc.RequestHandlers.initHandlersFromConfig created /terms: org.apache.solr.handler.component.SearchHandler
[junit4:junit4]   2> 5172 T22 oasc.RequestHandlers.initHandlersFromConfig created spellCheckCompRH: org.apache.solr.handler.component.SearchHandler
[junit4:junit4]   2> 5173 T22 oasc.RequestHandlers.initHandlersFromConfig created spellCheckCompRH_Direct: org.apache.solr.handler.component.SearchHandler
[junit4:junit4]   2> 5175 T22 oasc.RequestHandlers.initHandlersFromConfig created spellCheckWithWordbreak: org.apache.solr.handler.component.SearchHandler
[junit4:junit4]   2> 5177 T22 oasc.RequestHandlers.initHandlersFromConfig created spellCheckWithWordbreak_Direct: org.apache.solr.handler.component.SearchHandler
[junit4:junit4]   2> 5179 T22 oasc.RequestHandlers.initHandlersFromConfig created spellCheckCompRH1: org.apache.solr.handler.component.SearchHandler
[junit4:junit4]   2> 5181 T22 oasc.RequestHandlers.initHandlersFromConfig created tvrh: org.apache.solr.handler.component.SearchHandler
[junit4:junit4]   2> 5182 T22 oasc.RequestHandlers.initHandlersFromConfig created /mlt: solr.MoreLikeThisHandler
[junit4:junit4]   2> 5184 T22 oasc.RequestHandlers.initHandlersFromConfig created /debug/dump: solr.DumpRequestHandler
[junit4:junit4]   2> 5193 T22 oashl.XMLLoader.init xsltCacheLifetimeSeconds=60
[junit4:junit4]   2> 5197 T22 oasc.SolrCore.initDeprecatedSupport WARNING solrconfig.xml uses deprecated <admin/gettableFiles>, Please update your config to use the ShowFileRequestHandler.
[junit4:junit4]   2> 5200 T22 oasc.SolrCore.initDeprecatedSupport WARNING adding ShowFileRequestHandler with hidden files: [SCHEMA.XML, OLD_SYNONYMS.TXT, STOPWORDS.TXT, PROTWORDS.TXT, OPEN-EXCHANGE-RATES.JSON, SYNONYMS.TXT, CURRENCY.XML, MAPPING-ISOLATIN1ACCENT.TXT]
[junit4:junit4]   2> 5203 T22 oasc.CachingDirectoryFactory.close Releasing directory:/usr/home/hudson/hudson-slave/workspace/Lucene-Solr-Tests-trunk-java7/solr/build/solr-core/test/J0/./org.apache.solr.cloud.BasicDistributedZkTest-1352416673571/control/data
[junit4:junit4]   2> 5205 T22 oass.SolrIndexSearcher.<init> Opening Searcher@117b2a5a main
[junit4:junit4]   2> 5222 T22 oasu.CommitTracker.<init> Hard AutoCommit: disabled
[junit4:junit4]   2> 5223 T22 oasu.CommitTracker.<init> Soft AutoCommit: disabled
[junit4:junit4]   2> 5224 T22 oashc.SpellCheckComponent.inform Initializing spell checkers
[junit4:junit4]   2> 5236 T22 oass.DirectSolrSpellChecker.init init: {name=direct,classname=DirectSolrSpellChecker,field=lowerfilt,minQueryLength=3}
[junit4:junit4]   2> 5403 T50 oasc.SolrCore.registerSearcher [collection1] Registered new searcher Searcher@117b2a5a main{StandardDirectoryReader(segments_1:1)}
[junit4:junit4]   2> 5412 T22 oasc.ZkController.publish numShards not found on descriptor - reading it from system property
[junit4:junit4]   2> 5414 T28 oazs.PrepRequestProcessor.pRequest Got user-level KeeperException when processing sessionid:0x13ae250c0750002 type:create cxid:0x56 zxid:0xfffffffffffffffe txntype:unknown reqpath:n/a Error Path:/solr/overseer/queue Error:KeeperErrorCode = NoNode for /solr/overseer/queue
[junit4:junit4]   2> 5425 T22 oasc.CoreContainer.registerCore registering core: collection1
[junit4:junit4]   2> 5426 T22 oasc.ZkController.register Register shard - core:collection1 address:http://127.0.0.1:21771/solr shardId:control_shard
[junit4:junit4]   2> 5435 T22 oascsi.HttpClientUtil.createClient Creating new http client, config:maxConnections=10000&maxConnectionsPerHost=20&connTimeout=30000&socketTimeout=30000&retry=false
[junit4:junit4]   2> 5449 T22 oascc.SolrZkClient.makePath makePath: /collections/control_collection/leader_elect/control_shard/election
[junit4:junit4]   2> 5469 T28 oazs.PrepRequestProcessor.pRequest Got user-level KeeperException when processing sessionid:0x13ae250c0750002 type:delete cxid:0x67 zxid:0xfffffffffffffffe txntype:unknown reqpath:n/a Error Path:/solr/collections/control_collection/leaders Error:KeeperErrorCode = NoNode for /solr/collections/control_collection/leaders
[junit4:junit4]   2> 5470 T22 oasc.ShardLeaderElectionContext.runLeaderProcess Running the leader process.
[junit4:junit4]   2> 5471 T44 oascc.ZkStateReader.updateClusterState Updating cloud state from ZooKeeper... 
[junit4:junit4]   2> 5471 T28 oazs.PrepRequestProcessor.pRequest Got user-level KeeperException when processing sessionid:0x13ae250c0750002 type:create cxid:0x6a zxid:0xfffffffffffffffe txntype:unknown reqpath:n/a Error Path:/solr/overseer Error:KeeperErrorCode = NodeExists for /solr/overseer
[junit4:junit4]   2> 5473 T44 oasc.Overseer$ClusterStateUpdater.updateState Update state numShards=null message={
[junit4:junit4]   2> 	  "operation":"state",
[junit4:junit4]   2> 	  "numShards":null,
[junit4:junit4]   2> 	  "shard":"control_shard",
[junit4:junit4]   2> 	  "roles":null,
[junit4:junit4]   2> 	  "state":"down",
[junit4:junit4]   2> 	  "core":"collection1",
[junit4:junit4]   2> 	  "collection":"control_collection",
[junit4:junit4]   2> 	  "node_name":"127.0.0.1:21771_solr",
[junit4:junit4]   2> 	  "base_url":"http://127.0.0.1:21771/solr"}
[junit4:junit4]   2> 5489 T28 oazs.PrepRequestProcessor.pRequest Got user-level KeeperException when processing sessionid:0x13ae250c0750002 type:create cxid:0x6d zxid:0xfffffffffffffffe txntype:unknown reqpath:n/a Error Path:/solr/overseer/queue-work Error:KeeperErrorCode = NoNode for /solr/overseer/queue-work
[junit4:junit4]   2> 5522 T43 oascc.ZkStateReader$2.process A cluster state change has occurred - updating... (1)
[junit4:junit4]   2> 5976 T22 oasc.ShardLeaderElectionContext.waitForReplicasToComeUp Enough replicas found to continue.
[junit4:junit4]   2> 5977 T22 oasc.ShardLeaderElectionContext.runLeaderProcess I may be the new leader - try and sync
[junit4:junit4]   2> 5977 T22 oasc.SyncStrategy.sync Sync replicas to http://127.0.0.1:21771/solr/collection1/
[junit4:junit4]   2> 5978 T22 oasc.SyncStrategy.syncReplicas Sync Success - now sync replicas to me
[junit4:junit4]   2> 5979 T22 oasc.SyncStrategy.syncToMe http://127.0.0.1:21771/solr/collection1/ has no replicas
[junit4:junit4]   2> 5980 T22 oasc.ShardLeaderElectionContext.runLeaderProcess I am the new leader: http://127.0.0.1:21771/solr/collection1/
[junit4:junit4]   2> 5981 T22 oascc.SolrZkClient.makePath makePath: /collections/control_collection/leaders/control_shard
[junit4:junit4]   2> 6001 T28 oazs.PrepRequestProcessor.pRequest Got user-level KeeperException when processing sessionid:0x13ae250c0750002 type:create cxid:0x8c zxid:0xfffffffffffffffe txntype:unknown reqpath:n/a Error Path:/solr/overseer Error:KeeperErrorCode = NodeExists for /solr/overseer
[junit4:junit4]   2> 6030 T44 oascc.ZkStateReader.updateClusterState Updating cloud state from ZooKeeper... 
[junit4:junit4]   2> 6043 T43 oascc.ZkStateReader$2.process A cluster state change has occurred - updating... (1)
[junit4:junit4]   2> 6061 T22 oasc.ZkController.register We are http://127.0.0.1:21771/solr/collection1/ and leader is http://127.0.0.1:21771/solr/collection1/
[junit4:junit4]   2> 6064 T22 oasc.ZkController.register No LogReplay needed for core=collection1 baseURL=http://127.0.0.1:21771/solr
[junit4:junit4]   2> 6065 T22 oasc.ZkController.checkRecovery I am the leader, no recovery necessary
[junit4:junit4]   2> 6065 T22 oasc.ZkController.publish numShards not found on descriptor - reading it from system property
[junit4:junit4]   2> 6068 T22 oascc.ZkStateReader.updateClusterState Updating cloud state from ZooKeeper... 
[junit4:junit4]   2> 6069 T22 oass.SolrDispatchFilter.init user.dir=/usr/home/hudson/hudson-slave/workspace/Lucene-Solr-Tests-trunk-java7/solr/build/solr-core/test/J0
[junit4:junit4]   2> 6069 T22 oass.SolrDispatchFilter.init SolrDispatchFilter.init() done
[junit4:junit4]   2> 6125 T22 oascsi.HttpClientUtil.createClient Creating new http client, config:maxConnections=128&maxConnectionsPerHost=32&followRedirects=false
[junit4:junit4]   2> 6142 T22 oascsi.HttpClientUtil.createClient Creating new http client, config:
[junit4:junit4]   2> 6155 T22 oaz.ZooKeeper.<init> Initiating client connection, connectString=127.0.0.1:34333/solr sessionTimeout=10000 watcher=org.apache.solr.common.cloud.ConnectionManager@5ffc3042
[junit4:junit4]   2> 6156 T22 oascc.ConnectionManager.waitForConnected Waiting for client to connect to ZooKeeper
[junit4:junit4]   2> 6156 T51 oaz.ClientCnxn$SendThread.startConnect Opening socket connection to server /127.0.0.1:34333
[junit4:junit4]   2> 6158 T51 oaz.ClientCnxn$SendThread.primeConnection Socket connection established to localhost/127.0.0.1:34333, initiating session
[junit4:junit4]   2> 6158 T24 oazs.NIOServerCnxn$Factory.run Accepted socket connection from /140.211.11.196:61985
[junit4:junit4]   2> 6158 T24 oazs.NIOServerCnxn.readConnectRequest Client attempting to establish new session at /140.211.11.196:61985
[junit4:junit4]   2> 6160 T26 oazs.NIOServerCnxn.finishSessionInit Established session 0x13ae250c0750003 with negotiated timeout 10000 for client /140.211.11.196:61985
[junit4:junit4]   2> 6160 T51 oaz.ClientCnxn$SendThread.readConnectResult Session establishment complete on server localhost/127.0.0.1:34333, sessionid = 0x13ae250c0750003, negotiated timeout = 10000
[junit4:junit4]   2> 6161 T52 oascc.ConnectionManager.process Watcher org.apache.solr.common.cloud.ConnectionManager@5ffc3042 name:ZooKeeperConnection Watcher:127.0.0.1:34333/solr got event WatchedEvent state:SyncConnected type:None path:null path:null type:None
[junit4:junit4]   2> 6161 T22 oascc.ConnectionManager.waitForConnected Client is connected to ZooKeeper
[junit4:junit4]   2> 6162 T22 oascc.ZkStateReader.createClusterStateWatchersAndUpdate Updating cluster state from ZooKeeper... 
[junit4:junit4]   2> 6166 T22 oasc.ChaosMonkey.monkeyLog monkey: init - expire sessions:true cause connection loss:true
[junit4:junit4]   2> 6278 T22 oejs.Server.doStart jetty-8.1.7.v20120910
[junit4:junit4]   2> 6280 T22 oejs.AbstractConnector.doStart Started SelectChannelConnector@0.0.0.0:15209
[junit4:junit4]   2> 6281 T22 oasc.SolrResourceLoader.locateSolrHome JNDI not configured for solr (NoInitialContextEx)
[junit4:junit4]   2> 6282 T22 oasc.SolrResourceLoader.locateSolrHome using system property solr.solr.home: /usr/home/hudson/hudson-slave/workspace/Lucene-Solr-Tests-trunk-java7/solr/build/solr-core/test/J0/./org.apache.solr.cloud.BasicDistributedZkTest-jetty1-1352416679731
[junit4:junit4]   2> 6282 T22 oasc.SolrResourceLoader.<init> new SolrResourceLoader for deduced Solr Home: '/usr/home/hudson/hudson-slave/workspace/Lucene-Solr-Tests-trunk-java7/solr/build/solr-core/test/J0/./org.apache.solr.cloud.BasicDistributedZkTest-jetty1-1352416679731/'
[junit4:junit4]   2> 6312 T22 oass.SolrDispatchFilter.init SolrDispatchFilter.init()
[junit4:junit4]   2> 6313 T22 oasc.SolrResourceLoader.locateSolrHome JNDI not configured for solr (NoInitialContextEx)
[junit4:junit4]   2> 6313 T22 oasc.SolrResourceLoader.locateSolrHome using system property solr.solr.home: /usr/home/hudson/hudson-slave/workspace/Lucene-Solr-Tests-trunk-java7/solr/build/solr-core/test/J0/./org.apache.solr.cloud.BasicDistributedZkTest-jetty1-1352416679731
[junit4:junit4]   2> 6314 T22 oasc.CoreContainer$Initializer.initialize looking for solr.xml: /usr/home/hudson/hudson-slave/workspace/Lucene-Solr-Tests-trunk-java7/solr/build/solr-core/test/J0/./org.apache.solr.cloud.BasicDistributedZkTest-jetty1-1352416679731/solr.xml
[junit4:junit4]   2> 6314 T22 oasc.CoreContainer.<init> New CoreContainer 1053809534
[junit4:junit4]   2> 6315 T22 oasc.CoreContainer.load Loading CoreContainer using Solr Home: '/usr/home/hudson/hudson-slave/workspace/Lucene-Solr-Tests-trunk-java7/solr/build/solr-core/test/J0/./org.apache.solr.cloud.BasicDistributedZkTest-jetty1-1352416679731/'
[junit4:junit4]   2> 6316 T22 oasc.SolrResourceLoader.<init> new SolrResourceLoader for directory: '/usr/home/hudson/hudson-slave/workspace/Lucene-Solr-Tests-trunk-java7/solr/build/solr-core/test/J0/./org.apache.solr.cloud.BasicDistributedZkTest-jetty1-1352416679731/'
[junit4:junit4]   2> 6343 T22 oasc.CoreContainer.load Registering Log Listener
[junit4:junit4]   2> 6356 T22 oasc.CoreContainer.initZooKeeper Zookeeper client=127.0.0.1:34333/solr
[junit4:junit4]   2> 6357 T22 oaz.ZooKeeper.<init> Initiating client connection, connectString=127.0.0.1:34333/solr sessionTimeout=5000 watcher=org.apache.solr.common.cloud.ConnectionManager@15e1c3a3
[junit4:junit4]   2> 6358 T62 oaz.ClientCnxn$SendThread.startConnect Opening socket connection to server /127.0.0.1:34333
[junit4:junit4]   2> 6358 T22 oascc.ConnectionManager.waitForConnected Waiting for client to connect to ZooKeeper
[junit4:junit4]   2> 6360 T62 oaz.ClientCnxn$SendThread.primeConnection Socket connection established to localhost/127.0.0.1:34333, initiating session
[junit4:junit4]   2> 6360 T24 oazs.NIOServerCnxn$Factory.run Accepted socket connection from /140.211.11.196:50409
[junit4:junit4]   2> 6361 T24 oazs.NIOServerCnxn.readConnectRequest Client attempting to establish new session at /140.211.11.196:50409
[junit4:junit4]   2> 6363 T26 oazs.NIOServerCnxn.finishSessionInit Established session 0x13ae250c0750004 with negotiated timeout 5000 for client /140.211.11.196:50409
[junit4:junit4]   2> 6363 T62 oaz.ClientCnxn$SendThread.readConnectResult Session establishment complete on server localhost/127.0.0.1:34333, sessionid = 0x13ae250c0750004, negotiated timeout = 5000
[junit4:junit4]   2> 6364 T63 oascc.ConnectionManager.process Watcher org.apache.solr.common.cloud.ConnectionManager@15e1c3a3 name:ZooKeeperConnection Watcher:127.0.0.1:34333/solr got event WatchedEvent state:SyncConnected type:None path:null path:null type:None
[junit4:junit4]   2> 6364 T22 oascc.ConnectionManager.waitForConnected Client is connected to ZooKeeper
[junit4:junit4]   2> 6365 T28 oazs.PrepRequestProcessor.pRequest Got user-level KeeperException when processing sessionid:0x13ae250c0750004 type:create cxid:0x1 zxid:0xfffffffffffffffe txntype:unknown reqpath:n/a Error Path:/solr/overseer Error:KeeperErrorCode = NodeExists for /solr/overseer
[junit4:junit4]   2> 6374 T28 oazs.PrepRequestProcessor.pRequest Got user-level KeeperException when processing sessionid:0x13ae250c0750004 type:create cxid:0x2 zxid:0xfffffffffffffffe txntype:unknown reqpath:n/a Error Path:/solr/overseer Error:KeeperErrorCode = NodeExists for /solr/overseer
[junit4:junit4]   2> 6376 T22 oasc.ZkController.createEphemeralLiveNode Register node as live in ZooKeeper:/live_nodes/127.0.0.1:15209_solr
[junit4:junit4]   2> 6377 T28 oazs.PrepRequestProcessor.pRequest Got user-level KeeperException when processing sessionid:0x13ae250c0750004 type:delete cxid:0x4 zxid:0xfffffffffffffffe txntype:unknown reqpath:n/a Error Path:/solr/live_nodes/127.0.0.1:15209_solr Error:KeeperErrorCode = NoNode for /solr/live_nodes/127.0.0.1:15209_solr
[junit4:junit4]   2> 6379 T22 oascc.SolrZkClient.makePath makePath: /live_nodes/127.0.0.1:15209_solr
[junit4:junit4]   2> 6383 T43 oascc.ZkStateReader$3.process Updating live nodes... (2)
[junit4:junit4]   2> 6383 T52 oascc.ZkStateReader$3.process Updating live nodes... (2)
[junit4:junit4]   2> 6383 T22 oashc.HttpShardHandlerFactory.getParameter Setting socketTimeout to: 0
[junit4:junit4]   2> 6384 T43 oascc.ZkStateReader$2.process A cluster state change has occurred - updating... (2)
[junit4:junit4]   2> 6384 T22 oashc.HttpShardHandlerFactory.getParameter Setting urlScheme to: http://
[junit4:junit4]   2> 6385 T22 oashc.HttpShardHandlerFactory.getParameter Setting connTimeout to: 0
[junit4:junit4]   2> 6385 T22 oashc.HttpShardHandlerFactory.getParameter Setting maxConnectionsPerHost to: 20
[junit4:junit4]   2> 6386 T22 oashc.HttpShardHandlerFactory.getParameter Setting corePoolSize to: 0
[junit4:junit4]   2> 6386 T22 oashc.HttpShardHandlerFactory.getParameter Setting maximumPoolSize to: 2147483647
[junit4:junit4]   2> 6387 T22 oashc.HttpShardHandlerFactory.getParameter Setting maxThreadIdleTime to: 5
[junit4:junit4]   2> 6387 T22 oashc.HttpShardHandlerFactory.getParameter Setting sizeOfQueue to: -1
[junit4:junit4]   2> 6387 T22 oashc.HttpShardHandlerFactory.getParameter Setting fairnessPolicy to: false
[junit4:junit4]   2> 6388 T22 oascsi.HttpClientUtil.createClient Creating new http client, config:maxConnectionsPerHost=20&maxConnections=10000&socketTimeout=0&connTimeout=0&retry=false
[junit4:junit4]   2> 6406 T22 oascc.ZkStateReader.createClusterStateWatchersAndUpdate Updating cluster state from ZooKeeper... 
[junit4:junit4]   2> 6415 T22 oasc.CoreContainer.create Creating SolrCore 'collection1' using instanceDir: /usr/home/hudson/hudson-slave/workspace/Lucene-Solr-Tests-trunk-java7/solr/build/solr-core/test/J0/./org.apache.solr.cloud.BasicDistributedZkTest-jetty1-1352416679731/collection1
[junit4:junit4]   2> 6415 T22 oasc.ZkController.createCollectionZkNode Check for collection zkNode:collection1
[junit4:junit4]   2> 6416 T22 oasc.ZkController.createCollectionZkNode Collection zkNode exists
[junit4:junit4]   2> 6417 T22 oasc.ZkController.readConfigName Load collection config from:/collections/collection1
[junit4:junit4]   2> 6418 T22 oasc.SolrResourceLoader.<init> new SolrResourceLoader for directory: '/usr/home/hudson/hudson-slave/workspace/Lucene-Solr-Tests-trunk-java7/solr/build/solr-core/test/J0/./org.apache.solr.cloud.BasicDistributedZkTest-jetty1-1352416679731/collection1/'
[junit4:junit4]   2> 6420 T22 oasc.SolrResourceLoader.replaceClassLoader Adding 'file:/usr/home/hudson/hudson-slave/workspace/Lucene-Solr-Tests-trunk-java7/solr/build/solr-core/test/J0/org.apache.solr.cloud.BasicDistributedZkTest-jetty1-1352416679731/collection1/lib/README' to classloader
[junit4:junit4]   2> 6421 T22 oasc.SolrResourceLoader.replaceClassLoader Adding 'file:/usr/home/hudson/hudson-slave/workspace/Lucene-Solr-Tests-trunk-java7/solr/build/solr-core/test/J0/org.apache.solr.cloud.BasicDistributedZkTest-jetty1-1352416679731/collection1/lib/classes/' to classloader
[junit4:junit4]   2> 6478 T22 oasc.SolrConfig.<init> Using Lucene MatchVersion: LUCENE_50
[junit4:junit4]   2> 6541 T22 oasc.SolrConfig.<init> Loaded SolrConfig: solrconfig.xml
[junit4:junit4]   2> 6549 T44 oascc.ZkStateReader.updateClusterState Updating cloud state from ZooKeeper... 
[junit4:junit4]   2> 6551 T44 oasc.Overseer$ClusterStateUpdater.updateState Update state numShards=null message={
[junit4:junit4]   2> 	  "operation":"state",
[junit4:junit4]   2> 	  "numShards":null,
[junit4:junit4]   2> 	  "shard":"control_shard",
[junit4:junit4]   2> 	  "roles":null,
[junit4:junit4]   2> 	  "state":"active",
[junit4:junit4]   2> 	  "core":"collection1",
[junit4:junit4]   2> 	  "collection":"control_collection",
[junit4:junit4]   2> 	  "node_name":"127.0.0.1:21771_solr",
[junit4:junit4]   2> 	  "base_url":"http://127.0.0.1:21771/solr"}
[junit4:junit4]   2> 6564 T52 oascc.ZkStateReader$2.process A cluster state change has occurred - updating... (2)
[junit4:junit4]   2> 6564 T43 oascc.ZkStateReader$2.process A cluster state change has occurred - updating... (2)
[junit4:junit4]   2> 6643 T63 oascc.ZkStateReader$2.process A cluster state change has occurred - updating... (2)
[junit4:junit4]   2> 6643 T22 oass.IndexSchema.readSchema Reading Solr Schema
[junit4:junit4]   2> 6800 T22 oass.IndexSchema.readSchema Schema name=test
[junit4:junit4]   2> 7329 T22 oass.OpenExchangeRatesOrgProvider.init Initialized with rates=open-exchange-rates.json, refreshInterval=1440.
[junit4:junit4]   2> 7342 T22 oass.IndexSchema.readSchema default search field in schema is text
[junit4:junit4]   2> 7345 T22 oass.IndexSchema.readSchema unique key field: id
[junit4:junit4]   2> 7370 T22 oass.FileExchangeRateProvider.reload Reloading exchange rates from file currency.xml
[junit4:junit4]   2> 7376 T22 oass.FileExchangeRateProvider.reload Reloading exchange rates from file currency.xml
[junit4:junit4]   2> 7381 T22 oass.OpenExchangeRatesOrgProvider.reload Reloading exchange rates from open-exchange-rates.json
[junit4:junit4]   2> 7385 T22 oass.OpenExchangeRatesOrgProvider.reload Reloading exchange rates from open-exchange-rates.json
[junit4:junit4]   2> 7388 T22 oasc.SolrCore.<init> [collection1] Opening new SolrCore at /usr/home/hudson/hudson-slave/workspace/Lucene-Solr-Tests-trunk-java7/solr/build/solr-core/test/J0/./org.apache.solr.cloud.BasicDistributedZkTest-jetty1-1352416679731/collection1/, dataDir=./org.apache.solr.cloud.BasicDistributedZkTest-1352416673571/jetty1/
[junit4:junit4]   2> 7389 T22 oasc.JmxMonitoredMap.<init> JMX monitoring is enabled. Adding Solr mbeans to JMX Server: com.sun.jmx.mbeanserver.JmxMBeanServer@5434e6e3
[junit4:junit4]   2> 7389 T22 oasc.SolrCore.initDirectoryFactory solr.NRTCachingDirectoryFactory
[junit4:junit4]   2> 7390 T22 oasc.CachingDirectoryFactory.injectLockFactory WARNING No lockType configured for NRTCachingDirectory(org.apache.lucene.store.NIOFSDirectory@/usr/home/hudson/hudson-slave/workspace/Lucene-Solr-Tests-trunk-java7/solr/build/solr-core/test/J0/org.apache.solr.cloud.BasicDistributedZkTest-1352416673571/jetty1 lockFactory=org.apache.lucene.store.NativeFSLockFactory@561d3e05; maxCacheMB=48.0 maxMergeSizeMB=4.0) assuming 'simple'
[junit4:junit4]   2> 7391 T22 oasc.CachingDirectoryFactory.get return new directory for /usr/home/hudson/hudson-slave/workspace/Lucene-Solr-Tests-trunk-java7/solr/build/solr-core/test/J0/./org.apache.solr.cloud.BasicDistributedZkTest-1352416673571/jetty1 forceNew:false
[junit4:junit4]   2> 7392 T22 oasc.CachingDirectoryFactory.close Releasing directory:/usr/home/hudson/hudson-slave/workspace/Lucene-Solr-Tests-trunk-java7/solr/build/solr-core/test/J0/./org.apache.solr.cloud.BasicDistributedZkTest-1352416673571/jetty1
[junit4:junit4]   2> 7392 T22 oasc.SolrCore.getNewIndexDir New index directory detected: old=null new=./org.apache.solr.cloud.BasicDistributedZkTest-1352416673571/jetty1/index/
[junit4:junit4]   2> 7393 T22 oasc.SolrCore.initIndex WARNING [collection1] Solr index directory './org.apache.solr.cloud.BasicDistributedZkTest-1352416673571/jetty1/index' doesn't exist. Creating new index...
[junit4:junit4]   2> 7394 T22 oasc.CachingDirectoryFactory.get return new directory for /usr/home/hudson/hudson-slave/workspace/Lucene-Solr-Tests-trunk-java7/solr/build/solr-core/test/J0/./org.apache.solr.cloud.BasicDistributedZkTest-1352416673571/jetty1/index forceNew:false
[junit4:junit4]   2> 7432 T22 oasc.SolrDeletionPolicy.onCommit SolrDeletionPolicy.onCommit: commits:num=1
[junit4:junit4]   2> 		commit{dir=NRTCachingDirectory(org.apache.lucene.store.NIOFSDirectory@/usr/home/hudson/hudson-slave/workspace/Lucene-Solr-Tests-trunk-java7/solr/build/solr-core/test/J0/org.apache.solr.cloud.BasicDistributedZkTest-1352416673571/jetty1/index lockFactory=org.apache.lucene.store.NativeFSLockFactory@3050d24; maxCacheMB=48.0 maxMergeSizeMB=4.0),segFN=segments_1,generation=1,filenames=[segments_1]
[junit4:junit4]   2> 7432 T22 oasc.SolrDeletionPolicy.updateCommits newest commit = 1[segments_1]
[junit4:junit4]   2> 7433 T22 oasc.CachingDirectoryFactory.close Releasing directory:/usr/home/hudson/hudson-slave/workspace/Lucene-Solr-Tests-trunk-java7/solr/build/solr-core/test/J0/./org.apache.solr.cloud.BasicDistributedZkTest-1352416673571/jetty1/index
[junit4:junit4]   2> 7434 T22 oasc.SolrCore.initWriters created xml: solr.XMLResponseWriter
[junit4:junit4]   2> 7437 T22 oasup.UpdateRequestProcessorChain.init inserting DistributedUpdateProcessorFactory into updateRequestProcessorChain "dedupe"
[junit4:junit4]   2> 7438 T22 oasup.UpdateRequestProcessorChain.init inserting DistributedUpdateProcessorFactory into updateRequestProcessorChain "dedupe-allfields"
[junit4:junit4]   2> 7438 T22 oasup.UpdateRequestProcessorChain.init inserting DistributedUpdateProcessorFactory into updateRequestProcessorChain "stored_sig"
[junit4:junit4]   2> 7439 T22 oasup.UpdateRequestProcessorChain.init inserting DistributedUpdateProcessorFactory into updateRequestProcessorChain "uniq-fields"
[junit4:junit4]   2> 7440 T22 oasup.UpdateRequestProcessorChain.init inserting DistributedUpdateProcessorFactory into updateRequestProcessorChain "distrib-dup-test-chain-implicit"
[junit4:junit4]   2> 7441 T22 oasc.RequestHandlers.initHandlersFromConfig adding lazy requestHandler: solr.ReplicationHandler
[junit4:junit4]   2> 7442 T22 oasc.RequestHandlers.initHandlersFromConfig created /replication: solr.ReplicationHandler
[junit4:junit4]   2> 7444 T22 oasc.RequestHandlers.initHandlersFromConfig created standard: solr.StandardRequestHandler
[junit4:junit4]   2> 7445 T22 oasc.RequestHandlers.initHandlersFromConfig created /get: solr.RealTimeGetHandler
[junit4:junit4]   2> 7447 T22 oasc.RequestHandlers.initHandlersFromConfig created dismax: solr.SearchHandler
[junit4:junit4]   2> 7449 T22 oasc.RequestHandlers.initHandlersFromConfig created mock: org.apache.solr.core.MockQuerySenderListenerReqHandler
[junit4:junit4]   2> 7450 T22 oasc.RequestHandlers.initHandlersFromConfig created /admin/: org.apache.solr.handler.admin.AdminHandlers
[junit4:junit4]   2> 7452 T22 oasc.RequestHandlers.initHandlersFromConfig created defaults: solr.StandardRequestHandler
[junit4:junit4]   2> 7452 T22 oasc.RequestHandlers.initHandlersFromConfig adding lazy requestHandler: solr.StandardRequestHandler
[junit4:junit4]   2> 7453 T22 oasc.RequestHandlers.initHandlersFromConfig created lazy: solr.StandardRequestHandler
[junit4:junit4]   2> 7455 T22 oasc.RequestHandlers.initHandlersFromConfig created /update: solr.UpdateRequestHandler
[junit4:junit4]   2> 7457 T22 oasc.RequestHandlers.initHandlersFromConfig created /terms: org.apache.solr.handler.component.SearchHandler
[junit4:junit4]   2> 7458 T22 oasc.RequestHandlers.initHandlersFromConfig created spellCheckCompRH: org.apache.solr.handler.component.SearchHandler
[junit4:junit4]   2> 7460 T22 oasc.RequestHandlers.initHandlersFromConfig created spellCheckCompRH_Direct: org.apache.solr.handler.component.SearchHandler
[junit4:junit4]   2> 7462 T22 oasc.RequestHandlers.initHandlersFromConfig created spellCheckWithWordbreak: org.apache.solr.handler.component.SearchHandler
[junit4:junit4]   2> 7464 T22 oasc.RequestHandlers.initHandlersFromConfig created spellCheckWithWordbreak_Direct: org.apache.solr.handler.component.SearchHandler
[junit4:junit4]   2> 7466 T22 oasc.RequestHandlers.initHandlersFromConfig created spellCheckCompRH1: org.apache.solr.handler.component.SearchHandler
[junit4:junit4]   2> 7467 T22 oasc.RequestHandlers.initHandlersFromConfig created tvrh: org.apache.solr.handler.component.SearchHandler
[junit4:junit4]   2> 7469 T22 oasc.RequestHandlers.initHandlersFromConfig created /mlt: solr.MoreLikeThisHandler
[junit4:junit4]   2> 7471 T22 oasc.RequestHandlers.initHandlersFromConfig created /debug/dump: solr.DumpRequestHandler
[junit4:junit4]   2> 7480 T22 oashl.XMLLoader.init xsltCacheLifetimeSeconds=60
[junit4:junit4]   2> 7483 T22 oasc.SolrCore.initDeprecatedSupport WARNING solrconfig.xml uses deprecated <admin/gettableFiles>, Please update your config to use the ShowFileRequestHandler.
[junit4:junit4]   2> 7486 T22 oasc.SolrCore.initDeprecatedSupport WARNING adding ShowFileRequestHandler with hidden files: [SCHEMA.XML, OLD_SYNONYMS.TXT, STOPWORDS.TXT, PROTWORDS.TXT, OPEN-EXCHANGE-RATES.JSON, SYNONYMS.TXT, CURRENCY.XML, MAPPING-ISOLATIN1ACCENT.TXT]
[junit4:junit4]   2> 7489 T22 oasc.CachingDirectoryFactory.close Releasing directory:/usr/home/hudson/hudson-slave/workspace/Lucene-Solr-Tests-trunk-java7/solr/build/solr-core/test/J0/./org.apache.solr.cloud.BasicDistributedZkTest-1352416673571/jetty1
[junit4:junit4]   2> 7491 T22 oass.SolrIndexSearcher.<init> Opening Searcher@f507e67 main
[junit4:junit4]   2> 7492 T22 oasu.CommitTracker.<init> Hard AutoCommit: disabled
[junit4:junit4]   2> 7492 T22 oasu.CommitTracker.<init> Soft AutoCommit: disabled
[junit4:junit4]   2> 7493 T22 oashc.SpellCheckComponent.inform Initializing spell checkers
[junit4:junit4]   2> 7500 T22 oass.DirectSolrSpellChecker.init init: {name=direct,classname=DirectSolrSpellChecker,field=lowerfilt,minQueryLength=3}
[junit4:junit4]   2> 7574 T68 oasc.SolrCore.registerSearcher [collection1] Registered new searcher Searcher@f507e67 main{StandardDirectoryReader(segments_1:1)}
[junit4:junit4]   2> 7592 T22 oasc.ZkController.publish numShards not found on descriptor - reading it from system property
[junit4:junit4]   2> 8076 T44 oascc.ZkStateReader.updateClusterState Updating cloud state from ZooKeeper... 
[junit4:junit4]   2> 8077 T44 oasc.Overseer$ClusterStateUpdater.updateState Update state numShards=2 message={
[junit4:junit4]   2> 	  "operation":"state",
[junit4:junit4]   2> 	  "numShards":"2",
[junit4:junit4]   2> 	  "shard":null,
[junit4:junit4]   2> 	  "roles":null,
[junit4:junit4]   2> 	  "state":"down",
[junit4:junit4]   2> 	  "core":"collection1",
[junit4:junit4]   2> 	  "collection":"collection1",
[junit4:junit4]   2> 	  "node_name":"127.0.0.1:15209_solr",
[junit4:junit4]   2> 	  "base_url":"http://127.0.0.1:15209/solr"}
[junit4:junit4]   2> 8078 T44 oasc.Overseer$ClusterStateUpdater.createCollection Create collection collection1 with numShards 2
[junit4:junit4]   2> 8097 T52 oascc.ZkStateReader$2.process A cluster state change has occurred - updating... (2)
[junit4:junit4]   2> 8097 T43 oascc.ZkStateReader$2.process A cluster state change has occurred - updating... (2)
[junit4:junit4]   2> 8097 T63 oascc.ZkStateReader$2.process A cluster state change has occurred - updating... (2)
[junit4:junit4]   2> 8597 T22 oasc.CoreContainer.registerCore registering core: collection1
[junit4:junit4]   2> 8598 T22 oasc.ZkController.register Register shard - core:collection1 address:http://127.0.0.1:15209/solr shardId:shard1
[junit4:junit4]   2> 8599 T22 oascc.SolrZkClient.makePath makePath: /collections/collection1/leader_elect/shard1/election
[junit4:junit4]   2> 8627 T28 oazs.PrepRequestProcessor.pRequest Got user-level KeeperException when processing sessionid:0x13ae250c0750004 type:delete cxid:0x45 zxid:0xfffffffffffffffe txntype:unknown reqpath:n/a Error Path:/solr/collections/collection1/leaders Error:KeeperErrorCode = NoNode for /solr/collections/collection1/leaders
[junit4:junit4]   2> 8628 T22 oasc.ShardLeaderElectionContext.runLeaderProcess Running the leader process.
[junit4:junit4]   2> 8629 T28 oazs.PrepRequestProcessor.pRequest Got user-level KeeperException when processing sessionid:0x13ae250c0750004 type:create cxid:0x46 zxid:0xfffffffffffffffe txntype:unknown reqpath:n/a Error Path:/solr/overseer Error:KeeperErrorCode = NodeExists for /solr/overseer
[junit4:junit4]   2> 8640 T22 oasc.ShardLeaderElectionContext.waitForReplicasToComeUp Enough replicas found to continue.
[junit4:junit4]   2> 8640 T22 oasc.ShardLeaderElectionContext.runLeaderProcess I may be the new leader - try and sync
[junit4:junit4]   2> 8641 T22 oasc.SyncStrategy.sync Sync replicas to http://127.0.0.1:15209/solr/collection1/
[junit4:junit4]   2> 8642 T22 oasc.SyncStrategy.syncReplicas Sync Success - now sync replicas to me
[junit4:junit4]   2> 8642 T22 oasc.SyncStrategy.syncToMe http://127.0.0.1:15209/solr/collection1/ has no replicas
[junit4:junit4]   2> 8643 T22 oasc.ShardLeaderElectionContext.runLeaderProcess I am the new leader: http://127.0.0.1:15209/solr/collection1/
[junit4:junit4]   2> 8644 T22 oascc.SolrZkClient.makePath makePath: /collections/collection1/leaders/shard1
[junit4:junit4]   2> 8650 T28 oazs.PrepRequestProcessor.pRequest Got user-level KeeperException when processing sessionid:0x13ae250c0750004 type:create cxid:0x50 zxid:0xfffffffffffffffe txntype:unknown reqpath:n/a Error Path:/solr/overseer Error:KeeperErrorCode = NodeExists for /solr/overseer
[junit4:junit4]   2> 9113 T44 oascc.ZkStateReader.updateClusterState Updating cloud state from ZooKeeper... 
[junit4:junit4]   2> 9133 T63 oascc.ZkStateReader$2.process A cluster state change has occurred - updating... (2)
[junit4:junit4]   2> 9133 T43 oascc.ZkStateReader$2.process A cluster state change has occurred - updating... (2)
[junit4:junit4]   2> 9133 T52 oascc.ZkStateReader$2.process A cluster state change has occurred - updating... (2)
[junit4:junit4]   2> 9169 T22 oasc.ZkController.register We are http://127.0.0.1:15209/solr/collection1/ and leader is http://127.0.0.1:15209/solr/collection1/
[junit4:junit4]   2> 9169 T22 oasc.ZkController.register No LogReplay needed for core=collection1 baseURL=http://127.0.0.1:15209/solr
[junit4:junit4]   2> 9170 T22 oasc.ZkController.checkRecovery I am the leader, no recovery necessary
[junit4:junit4]   2> 9171 T22 oasc.ZkController.publish numShards not found on descriptor - reading it from system property
[junit4:junit4]   2> 9174 T22 oascc.ZkStateReader.updateClusterState Updating cloud state from ZooKeeper... 
[junit4:junit4]   2> 9176 T22 oass.SolrDispatchFilter.init user.dir=/usr/home/hudson/hudson-slave/workspace/Lucene-Solr-Tests-trunk-java7/solr/build/solr-core/test/J0
[junit4:junit4]   2> 9176 T22 oass.SolrDispatchFilter.init SolrDispatchFilter.init() done
[junit4:junit4]   2> 9177 T22 oascsi.HttpClientUtil.createClient Creating new http client, config:maxConnections=128&maxConnectionsPerHost=32&followRedirects=false
[junit4:junit4]   2> 9359 T22 oejs.Server.doStart jetty-8.1.7.v20120910
[junit4:junit4]   2> 9363 T22 oejs.AbstractConnector.doStart Started SelectChannelConnector@0.0.0.0:57838
[junit4:junit4]   2> 9364 T22 oasc.SolrResourceLoader.locateSolrHome JNDI not configured for solr (NoInitialContextEx)
[junit4:junit4]   2> 9365 T22 oasc.SolrResourceLoader.locateSolrHome using system property solr.solr.home: /usr/home/hudson/hudson-slave/workspace/Lucene-Solr-Tests-trunk-java7/solr/build/solr-core/test/J0/./org.apache.solr.cloud.BasicDistributedZkTest-jetty2-1352416682758
[junit4:junit4]   2> 9365 T22 oasc.SolrResourceLoader.<init> new SolrResourceLoader for deduced Solr Home: '/usr/home/hudson/hudson-slave/workspace/Lucene-Solr-Tests-trunk-java7/solr/build/solr-core/test/J0/./org.apache.solr.cloud.BasicDistributedZkTest-jetty2-1352416682758/'
[junit4:junit4]   2> 9410 T22 oass.SolrDispatchFilter.init SolrDispatchFilter.init()
[junit4:junit4]   2> 9410 T22 oasc.SolrResourceLoader.locateSolrHome JNDI not configured for solr (NoInitialContextEx)
[junit4:junit4]   2> 9411 T22 oasc.SolrResourceLoader.locateSolrHome using system property solr.solr.home: /usr/home/hudson/hudson-slave/workspace/Lucene-Solr-Tests-trunk-java7/solr/build/solr-core/test/J0/./org.apache.solr.cloud.BasicDistributedZkTest-jetty2-1352416682758
[junit4:junit4]   2> 9412 T22 oasc.CoreContainer$Initializer.initialize looking for solr.xml: /usr/home/hudson/hudson-slave/workspace/Lucene-Solr-Tests-trunk-java7/solr/build/solr-core/test/J0/./org.apache.solr.cloud.BasicDistributedZkTest-jetty2-1352416682758/solr.xml
[junit4:junit4]   2> 9412 T22 oasc.CoreContainer.<init> New CoreContainer 30086410
[junit4:junit4]   2> 9414 T22 oasc.CoreContainer.load Loading CoreContainer using Solr Home: '/usr/home/hudson/hudson-slave/workspace/Lucene-Solr-Tests-trunk-java7/solr/build/solr-core/test/J0/./org.apache.solr.cloud.BasicDistributedZkTest-jetty2-1352416682758/'
[junit4:junit4]   2> 9414 T22 oasc.SolrResourceLoader.<init> new SolrResourceLoader for directory: '/usr/home/hudson/hudson-slave/workspace/Lucene-Solr-Tests-trunk-java7/solr/build/solr-core/test/J0/./org.apache.solr.cloud.BasicDistributedZkTest-jetty2-1352416682758/'
[junit4:junit4]   2> 9452 T22 oasc.CoreContainer.load Registering Log Listener
[junit4:junit4]   2> 9471 T22 oasc.CoreContainer.initZooKeeper Zookeeper client=127.0.0.1:34333/solr
[junit4:junit4]   2> 9472 T22 oaz.ZooKeeper.<init> Initiating client connection, connectString=127.0.0.1:34333/solr sessionTimeout=5000 watcher=org.apache.solr.common.cloud.ConnectionManager@18cd28cf
[junit4:junit4]   2> 9473 T78 oaz.ClientCnxn$SendThread.startConnect Opening socket connection to server /127.0.0.1:34333
[junit4:junit4]   2> 9473 T22 oascc.ConnectionManager.waitForConnected Waiting for client to connect to ZooKeeper
[junit4:junit4]   2> 9475 T78 oaz.ClientCnxn$SendThread.primeConnection Socket connection established to localhost/127.0.0.1:34333, initiating session
[junit4:junit4]   2> 9475 T24 oazs.NIOServerCnxn$Factory.run Accepted socket connection from /140.211.11.196:64900
[junit4:junit4]   2> 9476 T24 oazs.NIOServerCnxn.readConnectRequest Client attempting to establish new session at /140.211.11.196:64900
[junit4:junit4]   2> 9478 T26 oazs.NIOServerCnxn.finishSessionInit Established session 0x13ae250c0750005 with negotiated timeout 5000 for client /140.211.11.196:64900
[junit4:junit4]   2> 9478 T78 oaz.ClientCnxn$SendThread.readConnectResult Session establishment complete on server localhost/127.0.0.1:34333, sessionid = 0x13ae250c0750005, negotiated timeout = 5000
[junit4:junit4]   2> 9479 T79 oascc.ConnectionManager.process Watcher org.apache.solr.common.cloud.ConnectionManager@18cd28cf name:ZooKeeperConnection Watcher:127.0.0.1:34333/solr got event WatchedEvent state:SyncConnected type:None path:null path:null type:None
[junit4:junit4]   2> 9479 T22 oascc.ConnectionManager.waitForConnected Client is connected to ZooKeeper
[junit4:junit4]   2> 9481 T28 oazs.PrepRequestProcessor.pRequest Got user-level KeeperException when processing sessionid:0x13ae250c0750005 type:create cxid:0x1 zxid:0xfffffffffffffffe txntype:unknown reqpath:n/a Error Path:/solr/overseer Error:KeeperErrorCode = NodeExists for /solr/overseer
[junit4:junit4]   2> 9493 T28 oazs.PrepRequestProcessor.pRequest Got user-level KeeperException when processing sessionid:0x13ae250c0750005 type:create cxid:0x2 zxid:0xfffffffffffffffe txntype:unknown reqpath:n/a Error Path:/solr/overseer Error:KeeperErrorCode = NodeExists for /solr/overseer
[junit4:junit4]   2> 9495 T22 oasc.ZkController.createEphemeralLiveNode Register node as live in ZooKeeper:/live_nodes/127.0.0.1:57838_solr
[junit4:junit4]   2> 9496 T28 oazs.PrepRequestProcessor.pRequest Got user-level KeeperException when processing sessionid:0x13ae250c0750005 type:delete cxid:0x4 zxid:0xfffffffffffffffe txntype:unknown reqpath:n/a Error Path:/solr/live_nodes/127.0.0.1:57838_solr Error:KeeperErrorCode = NoNode for /solr/live_nodes/127.0.0.1:57838_solr
[junit4:junit4]   2> 9501 T22 oascc.SolrZkClient.makePath makePath: /live_nodes/127.0.0.1:57838_solr
[junit4:junit4]   2> 9504 T63 oascc.ZkStateReader$2.process A cluster state change has occurred - updating... (2)
[junit4:junit4]   2> 9505 T43 oascc.ZkStateReader$3.process Updating live nodes... (3)
[junit4:junit4]   2> 9505 T52 oascc.ZkStateReader$3.process Updating live nodes... (3)
[junit4:junit4]   2> 9505 T43 oascc.ZkStateReader$2.process A cluster state change has occurred - updating... (3)
[junit4:junit4]   2> 9506 T52 oascc.ZkStateReader$2.process A cluster state change has occurred - updating... (3)
[junit4:junit4]   2> 9507 T22 oashc.HttpShardHandlerFactory.getParameter Setting socketTimeout to: 0
[junit4:junit4]   2> 9507 T63 oascc.ZkStateReader$3.process Updating live nodes... (3)
[junit4:junit4]   2> 9507 T22 oashc.HttpShardHandlerFactory.getParameter Setting urlScheme to: http://
[junit4:junit4]   2> 9508 T22 oashc.HttpShardHandlerFactory.getParameter Setting connTimeout to: 0
[junit4:junit4]   2> 9509 T22 oashc.HttpShardHandlerFactory.getParameter Setting maxConnectionsPerHost to: 20
[junit4:junit4]   2> 9509 T22 oashc.HttpShardHandlerFactory.getParameter Setting corePoolSize to: 0
[junit4:junit4]   2> 9509 T22 oashc.HttpShardHandlerFactory.getParameter Setting maximumPoolSize to: 2147483647
[junit4:junit4]   2> 9510 T22 oashc.HttpShardHandlerFactory.getParameter Setting maxThreadIdleTime to: 5
[junit4:junit4]   2> 9510 T22 oashc.HttpShardHandlerFactory.getParameter Setting sizeOfQueue to: -1
[junit4:junit4]   2> 9511 T22 oashc.HttpShardHandlerFactory.getParameter Setting fairnessPolicy to: false
[junit4:junit4]   2> 9511 T22 oascsi.HttpClientUtil.createClient Creating new http client, config:maxConnectionsPerHost=20&maxConnections=10000&socketTimeout=0&connTimeout=0&retry=false
[junit4:junit4]   2> 9526 T22 oascc.ZkStateReader.createClusterStateWatchersAndUpdate Updating cluster state from ZooKeeper... 
[junit4:junit4]   2> 9534 T22 oasc.CoreContainer.create Creating SolrCore 'collection1' using instanceDir: /usr/home/hudson/hudson-slave/workspace/Lucene-Solr-Tests-trunk-java7/solr/build/solr-core/test/J0/./org.apache.solr.cloud.BasicDistributedZkTest-jetty2-1352416682758/collection1
[junit4:junit4]   2> 9534 T22 oasc.ZkController.createCollectionZkNode Check for collection zkNode:collection1
[junit4:junit4]   2> 9535 T22 oasc.ZkController.createCollectionZkNode Collection zkNode exists
[junit4:junit4]   2> 9535 T22 oasc.ZkController.readConfigName Load collection config from:/collections/collection1
[junit4:junit4]   2> 9537 T22 oasc.SolrResourceLoader.<init> new SolrResourceLoader for directory: '/usr/home/hudson/hudson-slave/workspace/Lucene-Solr-Tests-trunk-java7/solr/build/solr-core/test/J0/./org.apache.solr.cloud.BasicDistributedZkTest-jetty2-1352416682758/collection1/'
[junit4:junit4]   2> 9538 T22 oasc.SolrResourceLoader.replaceClassLoader Adding 'file:/usr/home/hudson/hudson-slave/workspace/Lucene-Solr-Tests-trunk-java7/solr/build/solr-core/test/J0/org.apache.solr.cloud.BasicDistributedZkTest-jetty2-1352416682758/collection1/lib/README' to classloader
[junit4:junit4]   2> 9539 T22 oasc.SolrResourceLoader.replaceClassLoader Adding 'file:/usr/home/hudson/hudson-slave/workspace/Lucene-Solr-Tests-trunk-java7/solr/build/solr-core/test/J0/org.apache.solr.cloud.BasicDistributedZkTest-jetty2-1352416682758/collection1/lib/classes/' to classloader
[junit4:junit4]   2> 9592 T22 oasc.SolrConfig.<init> Using Lucene MatchVersion: LUCENE_50
[junit4:junit4]   2> 9646 T44 oascc.ZkStateReader.updateClusterState Updating cloud state from ZooKeeper... 
[junit4:junit4]   2> 9648 T44 oasc.Overseer$ClusterStateUpdater.updateState Update state numShards=2 message={
[junit4:junit4]   2> 	  "operation":"state",
[junit4:junit4]   2> 	  "numShards":"2",
[junit4:junit4]   2> 	  "shard":"shard1",
[junit4:junit4]   2> 	  "roles":null,
[junit4:junit4]   2> 	  "state":"active",
[junit4:junit4]   2> 	  "core":"collection1",
[junit4:junit4]   2> 	  "collection":"collection1",
[junit4:junit4]   2> 	  "node_name":"127.0.0.1:15209_solr",
[junit4:junit4]   2> 	  "base_url":"http://127.0.0.1:15209/solr"}
[junit4:junit4]   2> 9654 T22 oasc.SolrConfig.<init> Loaded SolrConfig: solrconfig.xml
[junit4:junit4]   2> 9660 T79 oascc.ZkStateReader$2.process A cluster state change has occurred - updating... (3)
[junit4:junit4]   2> 9660 T63 oascc.ZkStateReader$2.process A cluster state change has occurred - updating... (3)
[junit4:junit4]   2> 9660 T43 oascc.ZkStateReader$2.process A cluster state change has occurred - updating... (3)
[junit4:junit4]   2> 9660 T52 oascc.ZkStateReader$2.process A cluster state change has occurred - updating... (3)
[junit4:junit4]   2> 9661 T22 oass.IndexSchema.readSchema Reading Solr Schema
[junit4:junit4]   2> 9691 T22 oass.IndexSchema.readSchema Schema name=test
[junit4:junit4]   2> 10231 T22 oass.OpenExchangeRatesOrgProvider.init Initialized with rates=open-exchange-rates.json, refreshInterval=1440.
[junit4:junit4]   2> 10244 T22 oass.IndexSchema.readSchema default search field in schema is text
[junit4:junit4]   2> 10248 T22 oass.IndexSchema.readSchema unique key field: id
[junit4:junit4]   2> 10272 T22 oass.FileExchangeRateProvider.reload Reloading exchange rates from file currency.xml
[junit4:junit4]   2> 10279 T22 oass.FileExchangeRateProvider.reload Reloading exchange rates from file currency.xml
[junit4:junit4]   2> 10284 T22 oass.OpenExchangeRatesOrgProvider.reload Reloading exchange rates from open-exchange-rates.json
[junit4:junit4]   2> 10287 T22 oass.OpenExchangeRatesOrgProvider.reload Reloading exchange rates from open-exchange-rates.json
[junit4:junit4]   2> 10290 T22 oasc.SolrCore.<init> [collection1] Opening new SolrCore at /usr/home/hudson/hudson-slave/workspace/Lucene-Solr-Tests-trunk-java7/solr/build/solr-core/test/J0/./org.apache.solr.cloud.BasicDistributedZkTest-jetty2-1352416682758/collection1/, dataDir=./org.apache.solr.cloud.BasicDistributedZkTest-1352416673571/jetty2/
[junit4:junit4]   2> 10291 T22 oasc.JmxMonitoredMap.<init> JMX monitoring is enabled. Adding Solr mbeans to JMX Server: com.sun.jmx.mbeanserver.JmxMBeanServer@5434e6e3
[junit4:junit4]   2> 10292 T22 oasc.SolrCore.initDirectoryFactory solr.NRTCachingDirectoryFactory
[junit4:junit4]   2> 10293 T22 oasc.CachingDirectoryFactory.injectLockFactory WARNING No lockType configured for NRTCachingDirectory(org.apache.lucene.store.NIOFSDirectory@/usr/home/hudson/hudson-slave/workspace/Lucene-Solr-Tests-trunk-java7/solr/build/solr-core/test/J0/org.apache.solr.cloud.BasicDistributedZkTest-1352416673571/jetty2 lockFactory=org.apache.lucene.store.NativeFSLockFactory@a7d060f; maxCacheMB=48.0 maxMergeSizeMB=4.0) assuming 'simple'
[junit4:junit4]   2> 10293 T22 oasc.CachingDirectoryFactory.get return new directory for /usr/home/hudson/hudson-slave/workspace/Lucene-Solr-Tests-trunk-java7/solr/build/solr-core/test/J0/./org.apache.solr.cloud.BasicDistributedZkTest-1352416673571/jetty2 forceNew:false
[junit4:junit4]   2> 10294 T22 oasc.CachingDirectoryFactory.close Releasing directory:/usr/home/hudson/hudson-slave/workspace/Lucene-Solr-Tests-trunk-java7/solr/build/solr-core/test/J0/./org.apache.solr.cloud.BasicDistributedZkTest-1352416673571/jetty2
[junit4:junit4]   2> 10294 T22 oasc.SolrCore.getNewIndexDir New index directory detected: old=null new=./org.apache.solr.cloud.BasicDistributedZkTest-1352416673571/jetty2/index/
[junit4:junit4]   2> 10295 T22 oasc.SolrCore.initIndex WARNING [collection1] Solr index directory './org.apache.solr.cloud.BasicDistributedZkTest-1352416673571/jetty2/index' doesn't exist. Creating new index...
[junit4:junit4]   2> 10296 T22 oasc.CachingDirectoryFactory.get return new directory for /usr/home/hudson/hudson-slave/workspace/Lucene-Solr-Tests-trunk-java7/solr/build/solr-core/test/J0/./org.apache.solr.cloud.BasicDistributedZkTest-1352416673571/jetty2/index forceNew:false
[junit4:junit4]   2> 10302 T22 oasc.SolrDeletionPolicy.onCommit SolrDeletionPolicy.onCommit: commits:num=1
[junit4:junit4]   2> 		commit{dir=NRTCachingDirectory(org.apache.lucene.store.NIOFSDirectory@/usr/home/hudson/hudson-slave/workspace/Lucene-Solr-Tests-trunk-java7/solr/build/solr-core/test/J0/org.apache.solr.cloud.BasicDistributedZkTest-1352416673571/jetty2/index lockFactory=org.apache.lucene.store.NativeFSLockFactory@5d474abb; maxCacheMB=48.0 maxMergeSizeMB=4.0),segFN=segments_1,generation=1,filenames=[segments_1]
[junit4:junit4]   2> 10302 T22 oasc.SolrDeletionPolicy.updateCommits newest commit = 1[segments_1]
[junit4:junit4]   2> 10303 T22 oasc.CachingDirectoryFactory.close Releasing directory:/usr/home/hudson/hudson-slave/workspace/Lucene-Solr-Tests-trunk-java7/solr/build/solr-core/test/J0/./org.apache.solr.cloud.BasicDistributedZkTest-1352416673571/jetty2/index
[junit4:junit4]   2> 10303 T22 oasc.SolrCore.initWriters created xml: solr.XMLResponseWriter
[junit4:junit4]   2> 10307 T22 oasup.UpdateRequestProcessorChain.init inserting DistributedUpdateProcessorFactory into updateRequestProcessorChain "dedupe"
[junit4:junit4]   2> 10307 T22 oasup.UpdateRequestProcessorChain.init inserting DistributedUpdateProcessorFactory into updateRequestProcessorChain "dedupe-allfields"
[junit4:junit4]   2> 10308 T22 oasup.UpdateRequestProcessorChain.init inserting DistributedUpdateProcessorFactory into updateRequestProcessorChain "stored_sig"
[junit4:junit4]   2> 10308 T22 oasup.UpdateRequestProcessorChain.init inserting DistributedUpdateProcessorFactory into updateRequestProcessorChain "uniq-fields"
[junit4:junit4]   2> 10310 T22 oasup.UpdateRequestProcessorChain.init inserting DistributedUpdateProcessorFactory into updateRequestProcessorChain "distrib-dup-test-chain-implicit"
[junit4:junit4]   2> 10310 T22 oasc.RequestHandlers.initHandlersFromConfig adding lazy requestHandler: solr.ReplicationHandler
[junit4:junit4]   2> 10311 T22 oasc.RequestHandlers.initHandlersFromConfig created /replication: solr.ReplicationHandler
[junit4:junit4]   2> 10313 T22 oasc.RequestHandlers.initHandlersFromConfig created standard: solr.StandardRequestHandler
[junit4:junit4]   2> 10315 T22 oasc.RequestHandlers.initHandlersFromConfig created /get: solr.RealTimeGetHandler
[junit4:junit4]   2> 10317 T22 oasc.RequestHandlers.initHandlersFromConfig created dismax: solr.SearchHandler
[junit4:junit4]   2> 10319 T22 oasc.RequestHandlers.initHandlersFromConfig created mock: org.apache.solr.core.MockQuerySenderListenerReqHandler
[junit4:junit4]   2> 10320 T22 oasc.RequestHandlers.initHandlersFromConfig created /admin/: org.apache.solr.handler.admin.AdminHandlers
[junit4:junit4]   2> 10321 T22 oasc.RequestHandlers.initHandlersFromConfig created defaults: solr.StandardRequestHandler
[junit4:junit4]   2> 10322 T22 oasc.RequestHandlers.initHandlersFromConfig adding lazy requestHandler: solr.StandardRequestHandler
[junit4:junit4]   2> 10323 T22 oasc.RequestHandlers.initHandlersFromConfig created lazy: solr.StandardRequestHandler
[junit4:junit4]   2> 10324 T22 oasc.RequestHandlers.initHandlersFromConfig created /update: solr.UpdateRequestHandler
[junit4:junit4]   2> 10326 T22 oasc.RequestHandlers.initHandlersFromConfig created /terms: org.apache.solr.handler.component.SearchHandler
[junit4:junit4]   2> 10328 T22 oasc.RequestHandlers.initHandlersFromConfig created spellCheckCompRH: org.apache.solr.handler.component.SearchHandler
[junit4:junit4]   2> 10330 T22 oasc.RequestHandlers.initHandlersFromConfig created spellCheckCompRH_Direct: org.apache.solr.handler.component.SearchHandler
[junit4:junit4]   2> 10332 T22 oasc.RequestHandlers.initHandlersFromConfig created spellCheckWithWordbreak: org.apache.solr.handler.component.SearchHandler
[junit4:junit4]   2> 10333 T22 oasc.RequestHandlers.initHandlersFromConfig created spellCheckWithWordbreak_Direct: org.apache.solr.handler.component.SearchHandler
[junit4:junit4]   2> 10335 T22 oasc.RequestHandlers.initHandlersFromConfig created spellCheckCompRH1: org.apache.solr.handler.component.SearchHandler
[junit4:junit4]   2> 10337 T22 oasc.RequestHandlers.initHandlersFromConfig created tvrh: org.apache.solr.handler.component.SearchHandler
[junit4:junit4]   2> 10339 T22 oasc.RequestHandlers.initHandlersFromConfig created /mlt: solr.MoreLikeThisHandler
[junit4:junit4]   2> 10341 T22 oasc.RequestHandlers.initHandlersFromConfig created /debug/dump: solr.DumpRequestHandler
[junit4:junit4]   2> 10349 T22 oashl.XMLLoader.init xsltCacheLifetimeSeconds=60
[junit4:junit4]   2> 10353 T22 oasc.SolrCore.initDeprecatedSupport WARNING solrconfig.xml uses deprecated <admin/gettableFiles>, Please update your config to use the ShowFileRequestHandler.
[junit4:junit4]   2> 10356 T22 oasc.SolrCore.initDeprecatedSupport WARNING adding ShowFileRequestHandler with hidden files: [SCHEMA.XML, OLD_SYNONYMS.TXT, STOPWORDS.TXT, PROTWORDS.TXT, OPEN-EXCHANGE-RATES.JSON, SYNONYMS.TXT, CURRENCY.XML, MAPPING-ISOLATIN1ACCENT.TXT]
[junit4:junit4]   2> 10358 T22 oasc.CachingDirectoryFactory.close Releasing directory:/usr/home/hudson/hudson-slave/workspace/Lucene-Solr-Tests-trunk-java7/solr/build/solr-core/test/J0/./org.apache.solr.cloud.BasicDistributedZkTest-1352416673571/jetty2
[junit4:junit4]   2> 10360 T22 oass.SolrIndexSearcher.<init> Opening Searcher@512d467f main
[junit4:junit4]   2> 10361 T22 oasu.CommitTracker.<init> Hard AutoCommit: disabled
[junit4:junit4]   2> 10362 T22 oasu.CommitTracker.<init> Soft AutoCommit: disabled
[junit4:junit4]   2> 10363 T22 oashc.SpellCheckComponent.inform Initializing spell checkers
[junit4:junit4]   2> 10396 T22 oass.DirectSolrSpellChecker.init init: {name=direct,classname=DirectSolrSpellChecker,field=lowerfilt,minQueryLength=3}
[junit4:junit4]   2> 10488 T84 oasc.SolrCore.registerSearcher [collection1] Registered new searcher Searcher@512d467f main{StandardDirectoryReader(segments_1:1)}
[junit4:junit4]   2> 10496 T22 oasc.ZkController.publish numShards not found on descriptor - reading it from system property
[junit4:junit4]   2> 10678 T44 oascc.ZkStateReader.updateClusterState Updating cloud state from ZooKeeper... 
[junit4:junit4]   2> 10679 T44 oasc.Overseer$ClusterStateUpdater.updateState Update state numShards=2 message={
[junit4:junit4]   2> 	  "operation":"state",
[junit4:junit4]   2> 	  "numShards":"2",
[junit4:junit4]   2> 	  "shard":null,
[junit4:junit4]   2> 	  "roles":null,
[junit4:junit4]   2> 	  "state":"down",
[junit4:junit4]   2> 	  "core":"collection1",
[junit4:junit4]   2> 	  "collection":"collection1",
[junit4:junit4]   2> 	  "node_name":"127.0.0.1:57838_solr",
[junit4:junit4]   2> 	  "base_url":"http://127.0.0.1:57838/solr"}
[junit4:junit4]   2> 10691 T79 oascc.ZkStateReader$2.process A cluster state change has occurred - updating... (3)
[junit4:junit4]   2> 10691 T52 oascc.ZkStateReader$2.process A cluster state change has occurred - updating... (3)
[junit4:junit4]   2> 10691 T63 oascc.ZkStateReader$2.process A cluster state change has occurred - updating... (3)
[junit4:junit4]   2> 10691 T43 oascc.ZkStateReader$2.process A cluster state change has occurred - updating... (3)
[junit4:junit4]   2> 11001 T22 oasc.CoreContainer.registerCore registering core: collection1
[junit4:junit4]   2> 11002 T22 oasc.ZkController.register Register shard - core:collection1 address:http://127.0.0.1:57838/solr shardId:shard2
[junit4:junit4]   2> 11003 T22 oascc.SolrZkClient.makePath makePath: /collections/collection1/leader_elect/shard2/election
[junit4:junit4]   2> 11027 T28 oazs.PrepRequestProcessor.pRequest Got user-level KeeperException when processing sessionid:0x13ae250c0750005 type:delete cxid:0x44 zxid:0xfffffffffffffffe txntype:unknown reqpath:n/a Error Path:/solr/collections/collection1/leaders/shard2 Error:KeeperErrorCode = NoNode for /solr/collections/collection1/leaders/shard2
[junit4:junit4]   2> 11028 T22 oasc.ShardLeaderElectionContext.runLeaderProcess Running the leader process.
[junit4:junit4]   2> 11029 T28 oazs.PrepRequestProcessor.pRequest Got user-level KeeperException when processing sessionid:0x13ae250c0750005 type:create cxid:0x45 zxid:0xfffffffffffffffe txntype:unknown reqpath:n/a Error Path:/solr/overseer Error:KeeperErrorCode = NodeExists for /solr/overseer
[junit4:junit4]   2> 11039 T22 oasc.ShardLeaderElectionContext.waitForReplicasToComeUp Enough replicas found to continue.
[junit4:junit4]   2> 11040 T22 oasc.ShardLeaderElectionContext.runLeaderProcess I may be the new leader - try and sync
[junit4:junit4]   2> 11040 T22 oasc.SyncStrategy.sync Sync replicas to http://127.0.0.1:57838/solr/collection1/
[junit4:junit4]   2> 11041 T22 oasc.SyncStrategy.syncReplicas Sync Success - now sync replicas to me
[junit4:junit4]   2> 11042 T22 oasc.SyncStrategy.syncToMe http://127.0.0.1:57838/solr/collection1/ has no replicas
[junit4:junit4]   2> 11042 T22 oasc.ShardLeaderElectionContext.runLeaderProcess I am the new leader: http://127.0.0.1:57838/solr/collection1/
[junit4:junit4]   2> 11043 T22 oascc.SolrZkClient.makePath makePath: /collections/collection1/leaders/shard2
[junit4:junit4]   2> 11048 T28 oazs.PrepRequestProcessor.pRequest Got user-level KeeperException when processing sessionid:0x13ae250c0750005 type:create cxid:0x4e zxid:0xfffffffffffffffe txntype:unknown reqpath:n/a Error Path:/solr/overseer Error:KeeperErrorCode = NodeExists for /solr/overseer
[junit4:junit4]   2> 11204 T44 oascc.ZkStateReader.updateClusterState Updating cloud state from ZooKeeper... 
[junit4:junit4]   2> 11229 T63 oascc.ZkStateReader$2.process A cluster state change has occurred - updating... (3)
[junit4:junit4]   2> 11229 T43 oascc.ZkStateReader$2.process A cluster state change has occurred - updating... (3)
[junit4:junit4]   2> 11229 T79 oascc.ZkStateReader$2.process A cluster state change has occurred - updating... (3)
[junit4:junit4]   2> 11229 T52 oascc.ZkStateReader$2.process A cluster state change has occurred - updating... (3)
[junit4:junit4]   2> 11262 T22 oasc.ZkController.register We are http://127.0.0.1:57838/solr/collection1/ and leader is http://127.0.0.1:57838/solr/collection1/
[junit4:junit4]   2> 11263 T22 oasc.ZkController.register No LogReplay needed for core=collection1 baseURL=http://127.0.0.1:57838/solr
[junit4:junit4]   2> 11263 T22 oasc.ZkController.checkRecovery I am the leader, no recovery necessary
[junit4:junit4]   2> 11264 T22 oasc.ZkController.publish numShards not found on descriptor - reading it from system property
[junit4:junit4]   2> 11266 T22 oascc.ZkStateReader.updateClusterState Updating cloud state from ZooKeeper... 
[junit4:junit4]   2> 11267 T22 oass.SolrDispatchFilter.init user.dir=/usr/home/hudson/hudson-slave/workspace/Lucene-Solr-Tests-trunk-java7/solr/build/solr-core/test/J0
[junit4:junit4]   2> 11268 T22 oass.SolrDispatchFilter.init SolrDispatchFilter.init() done
[junit4:junit4]   2> 11268 T22 oascsi.HttpClientUtil.createClient Creating new http client, config:maxConnections=128&maxConnectionsPerHost=32&followRedirects=false
[junit4:junit4]   2> 11388 T22 oejs.Server.doStart jetty-8.1.7.v20120910
[junit4:junit4]   2> 11391 T22 oejs.AbstractConnector.doStart Started SelectChannelConnector@0.0.0.0:26278
[junit4:junit4]   2> 11392 T22 oasc.SolrResourceLoader.locateSolrHome JNDI not configured for solr (NoInitialContextEx)
[junit4:junit4]   2> 11393 T22 oasc.SolrResourceLoader.locateSolrHome using system property solr.solr.home: /usr/home/hudson/hudson-slave/workspace/Lucene-Solr-Tests-trunk-java7/solr/build/solr-core/test/J0/./org.apache.solr.cloud.BasicDistributedZkTest-jetty3-1352416684844
[junit4:junit4]   2> 11393 T22 oasc.SolrResourceLoader.<init> new SolrResourceLoader for deduced Solr Home: '/usr/home/hudson/hudson-slave/workspace/Lucene-Solr-Tests-trunk-java7/solr/build/solr-core/test/J0/./org.apache.solr.cloud.BasicDistributedZkTest-jetty3-1352416684844/'
[junit4:junit4]   2> 11423 T22 oass.SolrDispatchFilter.init SolrDispatchFilter.init()
[junit4:junit4]   2> 11423 T22 oasc.SolrResourceLoader.locateSolrHome JNDI not configured for solr (NoInitialContextEx)
[junit4:junit4]   2> 11424 T22 oasc.SolrResourceLoader.locateSolrHome using system property solr.solr.home: /usr/home/hudson/hudson-slave/workspace/Lucene-Solr-Tests-trunk-java7/solr/build/solr-core/test/J0/./org.apache.solr.cloud.BasicDistributedZkTest-jetty3-1352416684844
[junit4:junit4]   2> 11424 T22 oasc.CoreContainer$Initializer.initialize looking for solr.xml: /usr/home/hudson/hudson-slave/workspace/Lucene-Solr-Tests-trunk-java7/solr/build/solr-core/test/J0/./org.apache.solr.cloud.BasicDistributedZkTest-jetty3-1352416684844/solr.xml
[junit4:junit4]   2> 11425 T22 oasc.CoreContainer.<init> New CoreContainer 289421060
[junit4:junit4]   2> 11425 T22 oasc.CoreContainer.load Loading CoreContainer using Solr Home: '/usr/home/hudson/hudson-slave/workspace/Lucene-Solr-Tests-trunk-java7/solr/build/solr-core/test/J0/./org.apache.solr.cloud.BasicDistributedZkTest-jetty3-1352416684844/'
[junit4:junit4]   2> 11426 T22 oasc.SolrResourceLoader.<init> new SolrResourceLoader for directory: '/usr/home/hudson/hudson-slave/workspace/Lucene-Solr-Tests-trunk-java7/solr/build/solr-core/test/J0/./org.apache.solr.cloud.BasicDistributedZkTest-jetty3-1352416684844/'
[junit4:junit4]   2> 11459 T22 oasc.CoreContainer.load Registering Log Listener
[junit4:junit4]   2> 11472 T22 oasc.CoreContainer.initZooKeeper Zookeeper client=127.0.0.1:34333/solr
[junit4:junit4]   2> 11473 T22 oaz.ZooKeeper.<init> Initiating client connection, connectString=127.0.0.1:34333/solr sessionTimeout=5000 watcher=org.apache.solr.common.cloud.ConnectionManager@7041e1ab
[junit4:junit4]   2> 11474 T22 oascc.ConnectionManager.waitForConnected Waiting for client to connect to ZooKeeper
[junit4:junit4]   2> 11474 T94 oaz.ClientCnxn$SendThread.startConnect Opening socket connection to server /127.0.0.1:34333
[junit4:junit4]   2> 11477 T94 oaz.ClientCnxn$SendThread.primeConnection Socket connection established to localhost/127.0.0.1:34333, initiating session
[junit4:junit4]   2> 11477 T24 oazs.NIOServerCnxn$Factory.run Accepted socket connection from /140.211.11.196:56135
[junit4:junit4]   2> 11478 T24 oazs.NIOServerCnxn.readConnectRequest Client attempting to establish new session at /140.211.11.196:56135
[junit4:junit4]   2> 11480 T26 oazs.NIOServerCnxn.finishSessionInit Established session 0x13ae250c0750006 with negotiated timeout 5000 for client /140.211.11.196:56135
[junit4:junit4]   2> 11481 T94 oaz.ClientCnxn$SendThread.readConnectResult Session establishment complete on server localhost/127.0.0.1:34333, sessionid = 0x13ae250c0750006, negotiated timeout = 5000
[junit4:junit4]   2> 11481 T95 oascc.ConnectionManager.process Watcher org.apache.solr.common.cloud.ConnectionManager@7041e1ab name:ZooKeeperConnection Watcher:127.0.0.1:34333/solr got event WatchedEvent state:SyncConnected type:None path:null path:null type:None
[junit4:junit4]   2> 11482 T22 oascc.ConnectionManager.waitForConnected Client is connected to ZooKeeper
[junit4:junit4]   2> 11483 T28 oazs.PrepRequestProcessor.pRequest Got user-level KeeperException when processing sessionid:0x13ae250c0750006 type:create cxid:0x1 zxid:0xfffffffffffffffe txntype:unknown reqpath:n/a Error Path:/solr/overseer Error:KeeperErrorCode = NodeExists for /solr/overseer
[junit4:junit4]   2> 11494 T28 oazs.PrepRequestProcessor.pRequest Got user-level KeeperException when processing sessionid:0x13ae250c0750006 type:create cxid:0x2 zxid:0xfffffffffffffffe txntype:unknown reqpath:n/a Error Path:/solr/overseer Error:KeeperErrorCode = NodeExists for /solr/overseer
[junit4:junit4]   2> 11496 T22 oasc.ZkController.createEphemeralLiveNode Register node as live in ZooKeeper:/live_nodes/127.0.0.1:26278_solr
[junit4:junit4]   2> 11496 T28 oazs.PrepRequestProcessor.pRequest Got user-level KeeperException when processing sessionid:0x13ae250c0750006 type:delete cxid:0x4 zxid:0xfffffffffffffffe txntype:unknown reqpath:n/a Error Path:/solr/live_nodes/127.0.0.1:26278_solr Error:KeeperErrorCode = NoNode for /solr/live_nodes/127.0.0.1:26278_solr
[junit4:junit4]   2> 11498 T22 oascc.SolrZkClient.makePath makePath: /live_nodes/127.0.0.1:26278_solr
[junit4:junit4]   2> 11501 T63 oascc.ZkStateReader$2.process A cluster state change has occurred - updating... (3)
[junit4:junit4]   2> 11501 T79 oascc.ZkStateReader$2.process A cluster state change has occurred - updating... (3)
[junit4:junit4]   2> 11502 T43 oascc.ZkStateReader$3.process Updating live nodes... (4)
[junit4:junit4]   2> 11502 T52 oascc.ZkStateReader$3.process Updating live nodes... (4)
[junit4:junit4]   2> 11502 T43 oascc.ZkStateReader$2.process A cluster state change has occurred - updating... (4)
[junit4:junit4]   2> 11503 T52 oascc.ZkStateReader$2.process A cluster state change has occurred - updating... (4)
[junit4:junit4]   2> 11502 T22 oashc.HttpShardHandlerFactory.getParameter Setting socketTimeout to: 0
[junit4:junit4]   2> 11504 T63 oascc.ZkStateReader$3.process Updating live nodes... (4)
[junit4:junit4]   2> 11503 T79 oascc.ZkStateReader$3.process Updating live nodes... (4)
[junit4:junit4]   2> 11504 T22 oashc.HttpShardHandlerFactory.getParameter Setting urlScheme to: http://
[junit4:junit4]   2> 11505 T22 oashc.HttpShardHandlerFactory.getParameter Setting connTimeout to: 0
[junit4:junit4]   2> 11505 T22 oashc.HttpShardHandlerFactory.getParameter Setting maxConnectionsPerHost to: 20
[junit4:junit4]   2> 11506 T22 oashc.HttpShardHandlerFactory.getParameter Setting corePoolSize to: 0
[junit4:junit4]   2> 11506 T22 oashc.HttpShardHandlerFactory.getParameter Setting maximumPoolSize to: 2147483647
[junit4:junit4]   2> 11506 T22 oashc.HttpShardHandlerFactory.getParameter Setting maxThreadIdleTime to: 5
[junit4:junit4]   2> 11507 T22 oashc.HttpShardHandlerFactory.getParameter Setting sizeOfQueue to: -1
[junit4:junit4]   2> 11507 T22 oashc.HttpShardHandlerFactory.getParameter Setting fairnessPolicy to: false
[junit4:junit4]   2> 11508 T22 oascsi.HttpClientUtil.createClient Creating new http client, config:maxConnectionsPerHost=20&maxConnections=10000&socketTimeout=0&connTimeout=0&retry=false
[junit4:junit4]   2> 11523 T22 oascc.ZkStateReader.createClusterStateWatchersAndUpdate Updating cluster state from ZooKeeper... 
[junit4:junit4]   2> 11530 T22 oasc.CoreContainer.create Creating SolrCore 'collection1' using instanceDir: /usr/home/hudson/hudson-slave/workspace/Lucene-Solr-Tests-trunk-java7/solr/build/solr-core/test/J0/./org.apache.solr.cloud.BasicDistributedZkTest-jetty3-1352416684844/collection1
[junit4:junit4]   2> 11531 T22 oasc.ZkController.createCollectionZkNode Check for collection zkNode:collection1
[junit4:junit4]   2> 11532 T22 oasc.ZkController.createCollectionZkNode Collection zkNode exists
[junit4:junit4]   2> 11532 T22 oasc.ZkController.readConfigName Load collection config from:/collections/collection1
[junit4:junit4]   2> 11534 T22 oasc.SolrResourceLoader.<init> new SolrResourceLoader for directory: '/usr/home/hudson/hudson-slave/workspace/Lucene-Solr-Tests-trunk-java7/solr/build/solr-core/test/J0/./org.apache.solr.cloud.BasicDistributedZkTest-jetty3-1352416684844/collection1/'
[junit4:junit4]   2> 11535 T22 oasc.SolrResourceLoader.replaceClassLoader Adding 'file:/usr/home/hudson/hudson-slave/workspace/Lucene-Solr-Tests-trunk-java7/solr/build/solr-core/test/J0/org.apache.solr.cloud.BasicDistributedZkTest-jetty3-1352416684844/collection1/lib/classes/' to classloader
[junit4:junit4]   2> 11536 T22 oasc.SolrResourceLoader.replaceClassLoader Adding 'file:/usr/home/hudson/hudson-slave/workspace/Lucene-Solr-Tests-trunk-java7/solr/build/solr-core/test/J0/org.apache.solr.cloud.BasicDistributedZkTest-jetty3-1352416684844/collection1/lib/README' to classloader
[junit4:junit4]   2> 11583 T22 oasc.SolrConfig.<init> Using Lucene MatchVersion: LUCENE_50
[junit4:junit4]   2> 11649 T22 oasc.SolrConfig.<init> Loaded SolrConfig: solrconfig.xml
[junit4:junit4]   2> 11743 T44 oascc.ZkStateReader.updateClusterState Updating cloud state from ZooKeeper... 
[junit4:junit4]   2> 11744 T44 oasc.Overseer$ClusterStateUpdater.updateState Update state numShards=2 message={
[junit4:junit4]   2> 	  "operation":"state",
[junit4:junit4]   2> 	  "numShards":"2",
[junit4:junit4]   2> 	  "shard":"shard2",
[junit4:junit4]   2> 	  "roles":null,
[junit4:junit4]   2> 	  "state":"active",
[junit4:junit4]   2> 	  "core":"collection1",
[junit4:junit4]   2> 	  "collection":"collection1",
[junit4:junit4]   2> 	  "node_name":"127.0.0.1:57838_solr",
[junit4:junit4]   2> 	  "base_url":"http://127.0.0.1:57838/solr"}
[junit4:junit4]   2> 11750 T22 oass.IndexSchema.readSchema Reading Solr Schema
[junit4:junit4]   2> 11758 T95 oascc.ZkStateReader$2.process A cluster state change has occurred - updating... (4)
[junit4:junit4]   2> 11758 T79 oascc.ZkStateReader$2.process A cluster state change has occurred - updating... (4)
[junit4:junit4]   2> 11758 T43 oascc.ZkStateReader$2.process A cluster state change has occurred - updating... (4)
[junit4:junit4]   2> 11758 T52 oascc.ZkStateReader$2.process A cluster state change has occurred - updating... (4)
[junit4:junit4]   2> 11758 T63 oascc.ZkStateReader$2.process A cluster state change has occurred - updating... (4)
[junit4:junit4]   2> 11774 T22 oass.IndexSchema.readSchema Schema name=test
[junit4:junit4]   2> 12290 T22 oass.OpenExchangeRatesOrgProvider.init Initialized with rates=open-exchange-rates.json, refreshInterval=1440.
[junit4:junit4]   2> 12303 T22 oass.IndexSchema.readSchema default search field in schema is text
[junit4:junit4]   2> 12306 T22 oass.IndexSchema.readSchema unique key field: id
[junit4:junit4]   2> 12331 T22 oass.FileExchangeRateProvider.reload Reloading exchange rates from file currency.xml
[junit4:junit4]   2> 12336 T22 oass.FileExchangeRateProvider.reload Reloading exchange rates from file currency.xml
[junit4:junit4]   2> 12341 T22 oass.OpenExchangeRatesOrgProvider.reload Reloading exchange rates from open-exchange-rates.json
[junit4:junit4]   2> 12344 T22 oass.OpenExchangeRatesOrgProvider.reload Reloading exchange rates from open-exchange-rates.json
[junit4:junit4]   2> 12346 T22 oasc.SolrCore.<init> [collection1] Opening new SolrCore at /usr/home/hudson/hudson-slave/workspace/Lucene-Solr-Tests-trunk-java7/solr/build/solr-core/test/J0/./org.apache.solr.cloud.BasicDistributedZkTest-jetty3-1352416684844/collection1/, dataDir=./org.apache.solr.cloud.BasicDistributedZkTest-1352416673571/jetty3/
[junit4:junit4]   2> 12347 T22 oasc.JmxMonitoredMap.<init> JMX monitoring is enabled. Adding Solr mbeans to JMX Server: com.sun.jmx.mbeanserver.JmxMBeanServer@5434e6e3
[junit4:junit4]   2> 12348 T22 oasc.SolrCore.initDirectoryFactory solr.NRTCachingDirectoryFactory
[junit4:junit4]   2> 12349 T22 oasc.CachingDirectoryFactory.injectLockFactory WARNING No lockType configured for NRTCachingDirectory(org.apache.lucene.store.NIOFSDirectory@/usr/home/hudson/hudson-slave/workspace/Lucene-Solr-Tests-trunk-java7/solr/build/solr-core/test/J0/org.apache.solr.cloud.BasicDistributedZkTest-1352416673571/jetty3 lockFactory=org.apache.lucene.store.NativeFSLockFactory@760d62e0; maxCacheMB=48.0 maxMergeSizeMB=4.0) assuming 'simple'
[junit4:junit4]   2> 12349 T22 oasc.CachingDirectoryFactory.get return new directory for /usr/home/hudson/hudson-slave/workspace/Lucene-Solr-Tests-trunk-java7/solr/build/solr-core/test/J0/./org.apache.solr.cloud.BasicDistributedZkTest-1352416673571/jetty3 forceNew:false
[junit4:junit4]   2> 12350 T22 oasc.CachingDirectoryFactory.close Releasing directory:/usr/home/hudson/hudson-slave/workspace/Lucene-Solr-Tests-trunk-java7/solr/build/solr-core/test/J0/./org.apache.solr.cloud.BasicDistributedZkTest-1352416673571/jetty3
[junit4:junit4]   2> 12350 T22 oasc.SolrCore.getNewIndexDir New index directory detected: old=null new=./org.apache.solr.cloud.BasicDistributedZkTest-1352416673571/jetty3/index/
[junit4:junit4]   2> 12351 T22 oasc.SolrCore.initIndex WARNING [collection1] Solr index directory './org.apache.solr.cloud.BasicDistributedZkTest-1352416673571/jetty3/index' doesn't exist. Creating new index...
[junit4:junit4]   2> 12352 T22 oasc.CachingDirectoryFactory.get return new directory for /usr/home/hudson/hudson-slave/workspace/Lucene-Solr-Tests-trunk-java7/solr/build/solr-core/test/J0/./org.apache.solr.cloud.BasicDistributedZkTest-1352416673571/jetty3/index forceNew:false
[junit4:junit4]   2> 12384 T22 oasc.SolrDeletionPolicy.onCommit SolrDeletionPolicy.onCommit: commits:num=1
[junit4:junit4]   2> 		commit{dir=NRTCachingDirectory(org.apache.lucene.store.NIOFSDirectory@/usr/home/hudson/hudson-slave/workspace/Lucene-Solr-Tests-trunk-java7/solr/build/solr-core/test/J0/org.apache.solr.cloud.BasicDistributedZkTest-1352416673571/jetty3/index lockFactory=org.apache.lucene.store.NativeFSLockFactory@303f4ca6; maxCacheMB=48.0 maxMergeSizeMB=4.0),segFN=segments_1,generation=1,filenames=[segments_1]
[junit4:junit4]   2> 12384 T22 oasc.SolrDeletionPolicy.updateCommits newest commit = 1[segments_1]
[junit4:junit4]   2> 12385 T22 oasc.CachingDirectoryFactory.close Releasing directory:/usr/home/hudson/hudson-slave/workspace/Lucene-Solr-Tests-trunk-java7/solr/build/solr-core/test/J0/./org.apache.solr.cloud.BasicDistributedZkTest-1352416673571/jetty3/index
[junit4:junit4]   2> 12386 T22 oasc.SolrCore.initWriters created xml: solr.XMLResponseWriter
[junit4:junit4]   2> 12388 T22 oasup.UpdateRequestProcessorChain.init inserting DistributedUpdateProcessorFactory into updateRequestProcessorChain "dedupe"
[junit4:junit4]   2> 12389 T22 oasup.UpdateRequestProcessorChain.init inserting DistributedUpdateProcessorFactory into updateRequestProcessorChain "dedupe-allfields"
[junit4:junit4]   2> 12389 T22 oasup.UpdateRequestProcessorChain.init inserting DistributedUpdateProcessorFactory into updateRequestProcessorChain "stored_sig"
[junit4:junit4]   2> 12390 T22 oasup.UpdateRequestProcessorChain.init inserting DistributedUpdateProcessorFactory into updateRequestProcessorChain "uniq-fields"
[junit4:junit4]   2> 12391 T22 oasup.UpdateRequestProcessorChain.init inserting DistributedUpdateProcessorFactory into updateRequestProcessorChain "distrib-dup-test-chain-implicit"
[junit4:junit4]   2> 12391 T22 oasc.RequestHandlers.initHandlersFromConfig adding lazy requestHandler: solr.ReplicationHandler
[junit4:junit4]   2> 12392 T22 oasc.RequestHandlers.initHandlersFromConfig created /replication: solr.ReplicationHandler
[junit4:junit4]   2> 12394 T22 oasc.RequestHandlers.initHandlersFromConfig created standard: solr.StandardRequestHandler
[junit4:junit4]   2> 12396 T22 oasc.RequestHandlers.initHandlersFromConfig created /get: solr.RealTimeGetHandler
[junit4:junit4]   2> 12397 T22 oasc.RequestHandlers.initHandlersFromConfig created dismax: solr.SearchHandler
[junit4:junit4]   2> 12399 T22 oasc.RequestHandlers.initHandlersFromConfig created mock: org.apache.solr.core.MockQuerySenderListenerReqHandler
[junit4:junit4]   2> 12400 T22 oasc.RequestHandlers.initHandlersFromConfig created /admin/: org.apache.solr.handler.admin.AdminHandlers
[junit4:junit4]   2> 12401 T22 oasc.RequestHandlers.initHandlersFromConfig created defaults: solr.StandardRequestHandler
[junit4:junit4]   2> 12402 T22 oasc.RequestHandlers.initHandlersFromConfig adding lazy requestHandler: solr.StandardRequestHandler
[junit4:junit4]   2> 12402 T22 oasc.RequestHandlers.initHandlersFromConfig created lazy: solr.StandardRequestHandler
[junit4:junit4]   2> 12404 T22 oasc.RequestHandlers.initHandlersFromConfig created /update: solr.UpdateRequestHandler
[junit4:junit4]   2> 12406 T22 oasc.RequestHandlers.initHandlersFromConfig created /terms: org.apache.solr.handler.component.SearchHandler
[junit4:junit4]   2> 12407 T22 oasc.RequestHandlers.initHandlersFromConfig created spellCheckCompRH: org.apache.solr.handler.component.SearchHandler
[junit4:junit4]   2> 12409 T22 oasc.RequestHandlers.initHandlersFromConfig created spellCheckCompRH_Direct: org.apache.solr.handler.component.SearchHandler
[junit4:junit4]   2> 12410 T22 oasc.RequestHandlers.initHandlersFromConfig created spellCheckWithWordbreak: org.apache.solr.handler.component.SearchHandler
[junit4:junit4]   2> 12412 T22 oasc.RequestHandlers.initHandlersFromConfig created spellCheckWithWordbreak_Direct: org.apache.solr.handler.component.SearchHandler
[junit4:junit4]   2> 12414 T22 oasc.RequestHandlers.initHandlersFromConfig created spellCheckCompRH1: org.apache.solr.handler.component.SearchHandler
[junit4:junit4]   2> 12415 T22 oasc.RequestHandlers.initHandlersFromConfig created tvrh: org.apache.solr.handler.component.SearchHandler
[junit4:junit4]   2> 12417 T22 oasc.RequestHandlers.initHandlersFromConfig created /mlt: solr.MoreLikeThisHandler
[junit4:junit4]   2> 12419 T22 oasc.RequestHandlers.initHandlersFromConfig created /debug/dump: solr.DumpRequestHandler
[junit4:junit4]   2> 12428 T22 oashl.XMLLoader.init xsltCacheLifetimeSeconds=60
[junit4:junit4]   2> 12432 T22 oasc.SolrCore.initDeprecatedSupport WARNING solrconfig.xml uses deprecated <admin/gettableFiles>, Please update your config to use the ShowFileRequestHandler.
[junit4:junit4]   2> 12435 T22 oasc.SolrCore.initDeprecatedSupport WARNING adding ShowFileRequestHandler with hidden files: [SCHEMA.XML, OLD_SYNONYMS.TXT, STOPWORDS.TXT, PROTWORDS.TXT, OPEN-EXCHANGE-RATES.JSON, SYNONYMS.TXT, CURRENCY.XML, MAPPING-ISOLATIN1ACCENT.TXT]
[junit4:junit4]   2> 12437 T22 oasc.CachingDirectoryFactory.close Releasing directory:/usr/home/hudson/hudson-slave/workspace/Lucene-Solr-Tests-trunk-java7/solr/build/solr-core/test/J0/./org.apache.solr.cloud.BasicDistributedZkTest-1352416673571/jetty3
[junit4:junit4]   2> 12439 T22 oass.SolrIndexSearcher.<init> Opening Searcher@781183f8 main
[junit4:junit4]   2> 12440 T22 oasu.CommitTracker.<init> Hard AutoCommit: disabled
[junit4:junit4]   2> 12440 T22 oasu.CommitTracker.<init> Soft AutoCommit: disabled
[junit4:junit4]   2> 12441 T22 oashc.SpellCheckComponent.inform Initializing spell checkers
[junit4:junit4]   2> 12448 T22 oass.DirectSolrSpellChecker.init init: {name=direct,classname=DirectSolrSpellChecker,field=lowerfilt,minQueryLength=3}
[junit4:junit4]   2> 12517 T100 oasc.SolrCore.registerSearcher [collection1] Registered new searcher Searcher@781183f8 main{StandardDirectoryReader(segments_1:1)}
[junit4:junit4]   2> 12526 T22 oasc.ZkController.publish numShards not found on descriptor - reading it from system property
[junit4:junit4]   2> 12768 T44 oascc.ZkStateReader.updateClusterState Updating cloud state from ZooKeeper... 
[junit4:junit4]   2> 12769 T44 oasc.Overseer$ClusterStateUpdater.updateState Update state numShards=2 message={
[junit4:junit4]   2> 	  "operation":"state",
[junit4:junit4]   2> 	  "numShards":"2",
[junit4:junit4]   2> 	  "shard":null,
[junit4:junit4]   2> 	  "roles":null,
[junit4:junit4]   2> 	  "state":"down",
[junit4:junit4]   2> 	  "core":"collection1",
[junit4:junit4]   2> 	  "collection":"collection1",
[junit4:junit4]   2> 	  "node_name":"127.0.0.1:26278_solr",
[junit4:junit4]   2> 	  "base_url":"http://127.0.0.1:26278/solr"}
[junit4:junit4]   2> 12778 T63 oascc.ZkStateReader$2.process A cluster state change has occurred - updating... (4)
[junit4:junit4]   

[...truncated too long message...]

thread.QueuedThreadPool.runJob(QueuedThreadPool.java:608)
[junit4:junit4]    >         at org.eclipse.jetty.util.thread.QueuedThreadPool$3.run(QueuedThreadPool.java:543)
[junit4:junit4]    >         at java.lang.Thread.run(Thread.java:722)
[junit4:junit4]    >    7) Thread[id=90, name=qtp463011245-90 Acceptor0 SelectChannelConnector@0.0.0.0:26278, state=BLOCKED, group=TGRP-BasicDistributedZkTest]
[junit4:junit4]    >         at sun.nio.ch.ServerSocketChannelImpl.accept(ServerSocketChannelImpl.java:210)
[junit4:junit4]    >         at org.eclipse.jetty.server.nio.SelectChannelConnector.accept(SelectChannelConnector.java:109)
[junit4:junit4]    >         at org.eclipse.jetty.server.AbstractConnector$Acceptor.run(AbstractConnector.java:938)
[junit4:junit4]    >         at org.eclipse.jetty.util.thread.QueuedThreadPool.runJob(QueuedThreadPool.java:608)
[junit4:junit4]    >         at org.eclipse.jetty.util.thread.QueuedThreadPool$3.run(QueuedThreadPool.java:543)
[junit4:junit4]    >         at java.lang.Thread.run(Thread.java:722)
[junit4:junit4]    >    8) Thread[id=93, name=qtp463011245-93 Acceptor3 SelectChannelConnector@0.0.0.0:26278, state=BLOCKED, group=TGRP-BasicDistributedZkTest]
[junit4:junit4]    >         at sun.nio.ch.ServerSocketChannelImpl.accept(ServerSocketChannelImpl.java:210)
[junit4:junit4]    >         at org.eclipse.jetty.server.nio.SelectChannelConnector.accept(SelectChannelConnector.java:109)
[junit4:junit4]    >         at org.eclipse.jetty.server.AbstractConnector$Acceptor.run(AbstractConnector.java:938)
[junit4:junit4]    >         at org.eclipse.jetty.util.thread.QueuedThreadPool.runJob(QueuedThreadPool.java:608)
[junit4:junit4]    >         at org.eclipse.jetty.util.thread.QueuedThreadPool$3.run(QueuedThreadPool.java:543)
[junit4:junit4]    >         at java.lang.Thread.run(Thread.java:722)
[junit4:junit4]    > 	at __randomizedtesting.SeedInfo.seed([CFFDFEE3956D3CD6]:0)
[junit4:junit4]    > Throwable #2: com.carrotsearch.randomizedtesting.ThreadLeakError: There are still zombie threads that couldn't be terminated:
[junit4:junit4]    >    1) Thread[id=91, name=qtp463011245-91 Acceptor1 SelectChannelConnector@0.0.0.0:26278, state=RUNNABLE, group=TGRP-BasicDistributedZkTest]
[junit4:junit4]    >         at sun.nio.ch.ServerSocketChannelImpl.accept0(Native Method)
[junit4:junit4]    >         at sun.nio.ch.ServerSocketChannelImpl.accept(ServerSocketChannelImpl.java:226)
[junit4:junit4]    >         at org.eclipse.jetty.server.nio.SelectChannelConnector.accept(SelectChannelConnector.java:109)
[junit4:junit4]    >         at org.eclipse.jetty.server.AbstractConnector$Acceptor.run(AbstractConnector.java:938)
[junit4:junit4]    >         at org.eclipse.jetty.util.thread.QueuedThreadPool.runJob(QueuedThreadPool.java:608)
[junit4:junit4]    >         at org.eclipse.jetty.util.thread.QueuedThreadPool$3.run(QueuedThreadPool.java:543)
[junit4:junit4]    >         at java.lang.Thread.run(Thread.java:722)
[junit4:junit4]    >    2) Thread[id=109, name=qtp681018185-109 Acceptor1 SelectChannelConnector@0.0.0.0:41576, state=RUNNABLE, group=TGRP-BasicDistributedZkTest]
[junit4:junit4]    >         at sun.nio.ch.ServerSocketChannelImpl.accept0(Native Method)
[junit4:junit4]    >         at sun.nio.ch.ServerSocketChannelImpl.accept(ServerSocketChannelImpl.java:226)
[junit4:junit4]    >         at org.eclipse.jetty.server.nio.SelectChannelConnector.accept(SelectChannelConnector.java:109)
[junit4:junit4]    >         at org.eclipse.jetty.server.AbstractConnector$Acceptor.run(AbstractConnector.java:938)
[junit4:junit4]    >         at org.eclipse.jetty.util.thread.QueuedThreadPool.runJob(QueuedThreadPool.java:608)
[junit4:junit4]    >         at org.eclipse.jetty.util.thread.QueuedThreadPool$3.run(QueuedThreadPool.java:543)
[junit4:junit4]    >         at java.lang.Thread.run(Thread.java:722)
[junit4:junit4]    >    3) Thread[id=92, name=qtp463011245-92 Acceptor2 SelectChannelConnector@0.0.0.0:26278, state=BLOCKED, group=TGRP-BasicDistributedZkTest]
[junit4:junit4]    >         at sun.nio.ch.ServerSocketChannelImpl.accept(ServerSocketChannelImpl.java:210)
[junit4:junit4]    >         at org.eclipse.jetty.server.nio.SelectChannelConnector.accept(SelectChannelConnector.java:109)
[junit4:junit4]    >         at org.eclipse.jetty.server.AbstractConnector$Acceptor.run(AbstractConnector.java:938)
[junit4:junit4]    >         at org.eclipse.jetty.util.thread.QueuedThreadPool.runJob(QueuedThreadPool.java:608)
[junit4:junit4]    >         at org.eclipse.jetty.util.thread.QueuedThreadPool$3.run(QueuedThreadPool.java:543)
[junit4:junit4]    >         at java.lang.Thread.run(Thread.java:722)
[junit4:junit4]    >    4) Thread[id=108, name=qtp681018185-108 Acceptor0 SelectChannelConnector@0.0.0.0:41576, state=BLOCKED, group=TGRP-BasicDistributedZkTest]
[junit4:junit4]    >         at sun.nio.ch.ServerSocketChannelImpl.accept(ServerSocketChannelImpl.java:210)
[junit4:junit4]    >         at org.eclipse.jetty.server.nio.SelectChannelConnector.accept(SelectChannelConnector.java:109)
[junit4:junit4]    >         at org.eclipse.jetty.server.AbstractConnector$Acceptor.run(AbstractConnector.java:938)
[junit4:junit4]    >         at org.eclipse.jetty.util.thread.QueuedThreadPool.runJob(QueuedThreadPool.java:608)
[junit4:junit4]    >         at org.eclipse.jetty.util.thread.QueuedThreadPool$3.run(QueuedThreadPool.java:543)
[junit4:junit4]    >         at java.lang.Thread.run(Thread.java:722)
[junit4:junit4]    >    5) Thread[id=110, name=qtp681018185-110 Acceptor2 SelectChannelConnector@0.0.0.0:41576, state=BLOCKED, group=TGRP-BasicDistributedZkTest]
[junit4:junit4]    >         at sun.nio.ch.ServerSocketChannelImpl.accept(ServerSocketChannelImpl.java:210)
[junit4:junit4]    >         at org.eclipse.jetty.server.nio.SelectChannelConnector.accept(SelectChannelConnector.java:109)
[junit4:junit4]    >         at org.eclipse.jetty.server.AbstractConnector$Acceptor.run(AbstractConnector.java:938)
[junit4:junit4]    >         at org.eclipse.jetty.util.thread.QueuedThreadPool.runJob(QueuedThreadPool.java:608)
[junit4:junit4]    >         at org.eclipse.jetty.util.thread.QueuedThreadPool$3.run(QueuedThreadPool.java:543)
[junit4:junit4]    >         at java.lang.Thread.run(Thread.java:722)
[junit4:junit4]    >    6) Thread[id=111, name=qtp681018185-111 Acceptor3 SelectChannelConnector@0.0.0.0:41576, state=BLOCKED, group=TGRP-BasicDistributedZkTest]
[junit4:junit4]    >         at sun.nio.ch.ServerSocketChannelImpl.accept(ServerSocketChannelImpl.java:210)
[junit4:junit4]    >         at org.eclipse.jetty.server.nio.SelectChannelConnector.accept(SelectChannelConnector.java:109)
[junit4:junit4]    >         at org.eclipse.jetty.server.AbstractConnector$Acceptor.run(AbstractConnector.java:938)
[junit4:junit4]    >         at org.eclipse.jetty.util.thread.QueuedThreadPool.runJob(QueuedThreadPool.java:608)
[junit4:junit4]    >         at org.eclipse.jetty.util.thread.QueuedThreadPool$3.run(QueuedThreadPool.java:543)
[junit4:junit4]    >         at java.lang.Thread.run(Thread.java:722)
[junit4:junit4]    >    7) Thread[id=90, name=qtp463011245-90 Acceptor0 SelectChannelConnector@0.0.0.0:26278, state=BLOCKED, group=TGRP-BasicDistributedZkTest]
[junit4:junit4]    >         at sun.nio.ch.ServerSocketChannelImpl.accept(ServerSocketChannelImpl.java:210)
[junit4:junit4]    >         at org.eclipse.jetty.server.nio.SelectChannelConnector.accept(SelectChannelConnector.java:109)
[junit4:junit4]    >         at org.eclipse.jetty.server.AbstractConnector$Acceptor.run(AbstractConnector.java:938)
[junit4:junit4]    >         at org.eclipse.jetty.util.thread.QueuedThreadPool.runJob(QueuedThreadPool.java:608)
[junit4:junit4]    >         at org.eclipse.jetty.util.thread.QueuedThreadPool$3.run(QueuedThreadPool.java:543)
[junit4:junit4]    >         at java.lang.Thread.run(Thread.java:722)
[junit4:junit4]    >    8) Thread[id=93, name=qtp463011245-93 Acceptor3 SelectChannelConnector@0.0.0.0:26278, state=BLOCKED, group=TGRP-BasicDistributedZkTest]
[junit4:junit4]    >         at sun.nio.ch.ServerSocketChannelImpl.accept(ServerSocketChannelImpl.java:210)
[junit4:junit4]    >         at org.eclipse.jetty.server.nio.SelectChannelConnector.accept(SelectChannelConnector.java:109)
[junit4:junit4]    >         at org.eclipse.jetty.server.AbstractConnector$Acceptor.run(AbstractConnector.java:938)
[junit4:junit4]    >         at org.eclipse.jetty.util.thread.QueuedThreadPool.runJob(QueuedThreadPool.java:608)
[junit4:junit4]    >         at org.eclipse.jetty.util.thread.QueuedThreadPool$3.run(QueuedThreadPool.java:543)
[junit4:junit4]    >         at java.lang.Thread.run(Thread.java:722)
[junit4:junit4]    > 	at __randomizedtesting.SeedInfo.seed([CFFDFEE3956D3CD6]:0)
[junit4:junit4] Completed on J0 in 316.80s, 1 test, 2 errors <<< FAILURES!

[...truncated 173 lines...]
BUILD FAILED
/usr/home/hudson/hudson-slave/workspace/Lucene-Solr-Tests-trunk-java7/build.xml:335: The following error occurred while executing this line:
/usr/home/hudson/hudson-slave/workspace/Lucene-Solr-Tests-trunk-java7/build.xml:39: The following error occurred while executing this line:
/usr/home/hudson/hudson-slave/workspace/Lucene-Solr-Tests-trunk-java7/solr/build.xml:178: The following error occurred while executing this line:
/usr/home/hudson/hudson-slave/workspace/Lucene-Solr-Tests-trunk-java7/lucene/module-build.xml:61: The following error occurred while executing this line:
/usr/home/hudson/hudson-slave/workspace/Lucene-Solr-Tests-trunk-java7/lucene/common-build.xml:1163: The following error occurred while executing this line:
/usr/home/hudson/hudson-slave/workspace/Lucene-Solr-Tests-trunk-java7/lucene/common-build.xml:827: There were test failures: 233 suites, 970 tests, 4 suite-level errors, 832 ignored

Total time: 23 minutes 54 seconds
Build step 'Invoke Ant' marked build as failure
Archiving artifacts
Recording test results
Email was triggered for: Failure
Sending email for trigger: Failure



Mime
View raw message