lucene-dev mailing list archives

Site index · List index
Message view « Date » · « Thread »
Top « Date » · « Thread »
From Policeman Jenkins Server <jenk...@sd-datasolutions.de>
Subject [JENKINS] Lucene-Solr-4.x-Windows (32bit/jdk1.7.0_09) - Build # 1479 - Failure!
Date Thu, 08 Nov 2012 06:21:17 GMT
Build: http://jenkins.sd-datasolutions.de/job/Lucene-Solr-4.x-Windows/1479/
Java: 32bit/jdk1.7.0_09 -server -XX:+UseG1GC

1 tests failed.
REGRESSION:  org.apache.solr.client.solrj.impl.CloudSolrServerTest.testDistribSearch

Error Message:
There are still nodes recoverying - waited for 30 seconds

Stack Trace:
java.lang.AssertionError: There are still nodes recoverying - waited for 30 seconds
	at __randomizedtesting.SeedInfo.seed([AB42D9643B4C0084:2AA4577C4C1360B8]:0)
	at org.junit.Assert.fail(Assert.java:93)
	at org.apache.solr.cloud.AbstractDistribZkTestBase.waitForRecoveriesToFinish(AbstractDistribZkTestBase.java:165)
	at org.apache.solr.cloud.AbstractFullDistribZkTestBase.waitForRecoveriesToFinish(AbstractFullDistribZkTestBase.java:558)
	at org.apache.solr.cloud.AbstractFullDistribZkTestBase.waitForThingsToLevelOut(AbstractFullDistribZkTestBase.java:1133)
	at org.apache.solr.client.solrj.impl.CloudSolrServerTest.doTest(CloudSolrServerTest.java:95)
	at org.apache.solr.BaseDistributedSearchTestCase.testDistribSearch(BaseDistributedSearchTestCase.java:695)
	at sun.reflect.NativeMethodAccessorImpl.invoke0(Native Method)
	at sun.reflect.NativeMethodAccessorImpl.invoke(NativeMethodAccessorImpl.java:57)
	at sun.reflect.DelegatingMethodAccessorImpl.invoke(DelegatingMethodAccessorImpl.java:43)
	at java.lang.reflect.Method.invoke(Method.java:601)
	at com.carrotsearch.randomizedtesting.RandomizedRunner.invoke(RandomizedRunner.java:1559)
	at com.carrotsearch.randomizedtesting.RandomizedRunner.access$600(RandomizedRunner.java:79)
	at com.carrotsearch.randomizedtesting.RandomizedRunner$6.evaluate(RandomizedRunner.java:737)
	at com.carrotsearch.randomizedtesting.RandomizedRunner$7.evaluate(RandomizedRunner.java:773)
	at com.carrotsearch.randomizedtesting.RandomizedRunner$8.evaluate(RandomizedRunner.java:787)
	at com.carrotsearch.randomizedtesting.rules.SystemPropertiesRestoreRule$1.evaluate(SystemPropertiesRestoreRule.java:53)
	at org.apache.lucene.util.TestRuleSetupTeardownChained$1.evaluate(TestRuleSetupTeardownChained.java:50)
	at org.apache.lucene.util.TestRuleFieldCacheSanity$1.evaluate(TestRuleFieldCacheSanity.java:51)
	at org.apache.lucene.util.AbstractBeforeAfterRule$1.evaluate(AbstractBeforeAfterRule.java:45)
	at com.carrotsearch.randomizedtesting.rules.SystemPropertiesInvariantRule$1.evaluate(SystemPropertiesInvariantRule.java:55)
	at org.apache.lucene.util.TestRuleThreadAndTestName$1.evaluate(TestRuleThreadAndTestName.java:48)
	at org.apache.lucene.util.TestRuleIgnoreAfterMaxFailures$1.evaluate(TestRuleIgnoreAfterMaxFailures.java:70)
	at org.apache.lucene.util.TestRuleMarkFailure$1.evaluate(TestRuleMarkFailure.java:48)
	at com.carrotsearch.randomizedtesting.rules.StatementAdapter.evaluate(StatementAdapter.java:36)
	at com.carrotsearch.randomizedtesting.ThreadLeakControl$StatementRunner.run(ThreadLeakControl.java:358)
	at com.carrotsearch.randomizedtesting.ThreadLeakControl.forkTimeoutingTask(ThreadLeakControl.java:782)
	at com.carrotsearch.randomizedtesting.ThreadLeakControl$3.evaluate(ThreadLeakControl.java:442)
	at com.carrotsearch.randomizedtesting.RandomizedRunner.runSingleTest(RandomizedRunner.java:746)
	at com.carrotsearch.randomizedtesting.RandomizedRunner$3.evaluate(RandomizedRunner.java:648)
	at com.carrotsearch.randomizedtesting.RandomizedRunner$4.evaluate(RandomizedRunner.java:682)
	at com.carrotsearch.randomizedtesting.RandomizedRunner$5.evaluate(RandomizedRunner.java:693)
	at com.carrotsearch.randomizedtesting.rules.StatementAdapter.evaluate(StatementAdapter.java:36)
	at com.carrotsearch.randomizedtesting.rules.SystemPropertiesRestoreRule$1.evaluate(SystemPropertiesRestoreRule.java:53)
	at org.apache.lucene.util.AbstractBeforeAfterRule$1.evaluate(AbstractBeforeAfterRule.java:45)
	at org.apache.lucene.util.TestRuleStoreClassName$1.evaluate(TestRuleStoreClassName.java:42)
	at com.carrotsearch.randomizedtesting.rules.SystemPropertiesInvariantRule$1.evaluate(SystemPropertiesInvariantRule.java:55)
	at com.carrotsearch.randomizedtesting.rules.NoShadowingOrOverridesOnMethodsRule$1.evaluate(NoShadowingOrOverridesOnMethodsRule.java:39)
	at com.carrotsearch.randomizedtesting.rules.NoShadowingOrOverridesOnMethodsRule$1.evaluate(NoShadowingOrOverridesOnMethodsRule.java:39)
	at com.carrotsearch.randomizedtesting.rules.StatementAdapter.evaluate(StatementAdapter.java:36)
	at org.apache.lucene.util.TestRuleAssertionsRequired$1.evaluate(TestRuleAssertionsRequired.java:43)
	at org.apache.lucene.util.TestRuleMarkFailure$1.evaluate(TestRuleMarkFailure.java:48)
	at org.apache.lucene.util.TestRuleIgnoreAfterMaxFailures$1.evaluate(TestRuleIgnoreAfterMaxFailures.java:70)
	at org.apache.lucene.util.TestRuleIgnoreTestSuites$1.evaluate(TestRuleIgnoreTestSuites.java:55)
	at com.carrotsearch.randomizedtesting.rules.StatementAdapter.evaluate(StatementAdapter.java:36)
	at com.carrotsearch.randomizedtesting.ThreadLeakControl$StatementRunner.run(ThreadLeakControl.java:358)
	at java.lang.Thread.run(Thread.java:722)




Build Log:
[...truncated 9453 lines...]
[junit4:junit4] Suite: org.apache.solr.client.solrj.impl.CloudSolrServerTest
[junit4:junit4]   2> 6 T453 oasc.AbstractZkTestCase.<clinit> WARNING TEST_HOME() does not exist - solrj test?
[junit4:junit4]   2> 10 T453 oas.SolrTestCaseJ4.setUp ###Starting testDistribSearch
[junit4:junit4]   2> Creating dataDir: C:\Users\JenkinsSlave\workspace\Lucene-Solr-4.x-Windows\solr\build\solr-solrj\test\J0\.\solrtest-CloudSolrServerTest-1352355541904
[junit4:junit4]   2> 14 T453 oasc.ZkTestServer.run STARTING ZK TEST SERVER
[junit4:junit4]   2> 61 T454 oaz.Environment.logEnv Server environment:zookeeper.version=3.3.6-1366786, built on 07/29/2012 06:22 GMT
[junit4:junit4]   2> 61 T454 oaz.Environment.logEnv Server environment:host.name=JenkinsSlave-PC
[junit4:junit4]   2> 61 T454 oaz.Environment.logEnv Server environment:java.version=1.7.0_09
[junit4:junit4]   2> 61 T454 oaz.Environment.logEnv Server environment:java.vendor=Oracle Corporation
[junit4:junit4]   2> 61 T454 oaz.Environment.logEnv Server environment:java.home=C:\Users\JenkinsSlave\tools\java\32bit\jdk1.7.0_09\jre
[junit4:junit4]   2> 62 T454 oaz.Environment.logEnv Server environment:java.class.path=C:\Users\JenkinsSlave\workspace\Lucene-Solr-4.x-Windows\solr\build\solr-solrj\classes\test;C:\Users\JenkinsSlave\workspace\Lucene-Solr-4.x-Windows\solr\build\solr-test-framework\classes\java;C:\Users\JenkinsSlave\workspace\Lucene-Solr-4.x-Windows\solr\solrj\src\test-files;C:\Users\JenkinsSlave\workspace\Lucene-Solr-4.x-Windows\lucene\build\test-framework\classes\java;C:\Users\JenkinsSlave\workspace\Lucene-Solr-4.x-Windows\lucene\build\codecs\classes\java;C:\Users\JenkinsSlave\workspace\Lucene-Solr-4.x-Windows\solr\solrj\lib\commons-io-2.1.jar;C:\Users\JenkinsSlave\workspace\Lucene-Solr-4.x-Windows\solr\solrj\lib\httpclient-4.1.3.jar;C:\Users\JenkinsSlave\workspace\Lucene-Solr-4.x-Windows\solr\solrj\lib\httpcore-4.1.4.jar;C:\Users\JenkinsSlave\workspace\Lucene-Solr-4.x-Windows\solr\solrj\lib\httpmime-4.1.3.jar;C:\Users\JenkinsSlave\workspace\Lucene-Solr-4.x-Windows\solr\solrj\lib\jcl-over-slf4j-1.6.4.jar;C:\Users\JenkinsSlave\workspace\Lucene-Solr-4.x-Windows\solr\solrj\lib\log4j-over-slf4j-1.6.4.jar;C:\Users\JenkinsSlave\workspace\Lucene-Solr-4.x-Windows\solr\solrj\lib\slf4j-api-1.6.4.jar;C:\Users\JenkinsSlave\workspace\Lucene-Solr-4.x-Windows\solr\solrj\lib\slf4j-jdk14-1.6.4.jar;C:\Users\JenkinsSlave\workspace\Lucene-Solr-4.x-Windows\solr\solrj\lib\wstx-asl-3.2.7.jar;C:\Users\JenkinsSlave\workspace\Lucene-Solr-4.x-Windows\solr\solrj\lib\zookeeper-3.3.6.jar;C:\Users\JenkinsSlave\workspace\Lucene-Solr-4.x-Windows\lucene\test-framework\lib\junit-4.10.jar;C:\Users\JenkinsSlave\workspace\Lucene-Solr-4.x-Windows\lucene\test-framework\lib\randomizedtesting-runner-2.0.4.jar;C:\Users\JenkinsSlave\workspace\Lucene-Solr-4.x-Windows\solr\build\solr-solrj\classes\java;C:\Users\JenkinsSlave\workspace\Lucene-Solr-4.x-Windows\solr\build\solr-core\classes\java;C:\Users\JenkinsSlave\workspace\Lucene-Solr-4.x-Windows\lucene\build\analysis\common\lucene-analyzers-common-4.1-SNAPSHOT.jar;C:\Users\JenkinsSlave\workspace\Lucene-Solr-4.x-Windows\lucene\build\analysis\kuromoji\lucene-analyzers-kuromoji-4.1-SNAPSHOT.jar;C:\Users\JenkinsSlave\workspace\Lucene-Solr-4.x-Windows\lucene\build\analysis\phonetic\lucene-analyzers-phonetic-4.1-SNAPSHOT.jar;C:\Users\JenkinsSlave\workspace\Lucene-Solr-4.x-Windows\lucene\build\highlighter\lucene-highlighter-4.1-SNAPSHOT.jar;C:\Users\JenkinsSlave\workspace\Lucene-Solr-4.x-Windows\lucene\build\memory\lucene-memory-4.1-SNAPSHOT.jar;C:\Users\JenkinsSlave\workspace\Lucene-Solr-4.x-Windows\lucene\build\misc\lucene-misc-4.1-SNAPSHOT.jar;C:\Users\JenkinsSlave\workspace\Lucene-Solr-4.x-Windows\lucene\build\spatial\lucene-spatial-4.1-SNAPSHOT.jar;C:\Users\JenkinsSlave\workspace\Lucene-Solr-4.x-Windows\lucene\build\suggest\lucene-suggest-4.1-SNAPSHOT.jar;C:\Users\JenkinsSlave\workspace\Lucene-Solr-4.x-Windows\lucene\build\grouping\lucene-grouping-4.1-SNAPSHOT.jar;C:\Users\JenkinsSlave\workspace\Lucene-Solr-4.x-Windows\lucene\build\queries\lucene-queries-4.1-SNAPSHOT.jar;C:\Users\JenkinsSlave\workspace\Lucene-Solr-4.x-Windows\lucene\build\queryparser\lucene-queryparser-4.1-SNAPSHOT.jar;C:\Users\JenkinsSlave\workspace\Lucene-Solr-4.x-Windows\solr\core\lib\commons-cli-1.2.jar;C:\Users\JenkinsSlave\workspace\Lucene-Solr-4.x-Windows\solr\core\lib\commons-codec-1.7.jar;C:\Users\JenkinsSlave\workspace\Lucene-Solr-4.x-Windows\solr\core\lib\commons-fileupload-1.2.1.jar;C:\Users\JenkinsSlave\workspace\Lucene-Solr-4.x-Windows\solr\core\lib\commons-lang-2.6.jar;C:\Users\JenkinsSlave\workspace\Lucene-Solr-4.x-Windows\solr\core\lib\easymock-2.2.jar;C:\Users\JenkinsSlave\workspace\Lucene-Solr-4.x-Windows\solr\core\lib\guava-r05.jar;C:\Users\JenkinsSlave\workspace\Lucene-Solr-4.x-Windows\solr\core\lib\javax.servlet-api-3.0.1.jar;C:\Users\JenkinsSlave\workspace\Lucene-Solr-4.x-Windows\solr\core\lib\spatial4j-0.3.jar;C:\Users\JenkinsSlave\workspace\Lucene-Solr-4.x-Windows\solr\example\lib\jetty-continuation-8.1.7.v20120910.jar;C:\Users\JenkinsSlave\workspace\Lucene-Solr-4.x-Windows\solr\example\lib\jetty-deploy-8.1.7.v20120910.jar;C:\Users\JenkinsSlave\workspace\Lucene-Solr-4.x-Windows\solr\example\lib\jetty-http-8.1.7.v20120910.jar;C:\Users\JenkinsSlave\workspace\Lucene-Solr-4.x-Windows\solr\example\lib\jetty-io-8.1.7.v20120910.jar;C:\Users\JenkinsSlave\workspace\Lucene-Solr-4.x-Windows\solr\example\lib\jetty-jmx-8.1.7.v20120910.jar;C:\Users\JenkinsSlave\workspace\Lucene-Solr-4.x-Windows\solr\example\lib\jetty-security-8.1.7.v20120910.jar;C:\Users\JenkinsSlave\workspace\Lucene-Solr-4.x-Windows\solr\example\lib\jetty-server-8.1.7.v20120910.jar;C:\Users\JenkinsSlave\workspace\Lucene-Solr-4.x-Windows\solr\example\lib\jetty-servlet-8.1.7.v20120910.jar;C:\Users\JenkinsSlave\workspace\Lucene-Solr-4.x-Windows\solr\example\lib\jetty-util-8.1.7.v20120910.jar;C:\Users\JenkinsSlave\workspace\Lucene-Solr-4.x-Windows\solr\example\lib\jetty-webapp-8.1.7.v20120910.jar;C:\Users\JenkinsSlave\workspace\Lucene-Solr-4.x-Windows\solr\example\lib\jetty-xml-8.1.7.v20120910.jar;C:\Users\JenkinsSlave\workspace\Lucene-Solr-4.x-Windows\solr\example\lib\servlet-api-3.0.jar;C:\Users\JenkinsSlave\workspace\Lucene-Solr-4.x-Windows\solr\example\example-DIH\solr\db\lib\hsqldb-1.8.0.10.jar;C:\Users\JenkinsSlave\workspace\Lucene-Solr-4.x-Windows\lucene\build\core\classes\java;C:\Users\JenkinsSlave\tools\Ant\ANT_1.8.2\lib\ant-launcher.jar;C:\Users\JenkinsSlave\.ant\lib\ivy-2.2.0.jar;C:\Users\JenkinsSlave\tools\Ant\ANT_1.8.2\lib\ant-antlr.jar;C:\Users\JenkinsSlave\tools\Ant\ANT_1.8.2\lib\ant-apache-bcel.jar;C:\Users\JenkinsSlave\tools\Ant\ANT_1.8.2\lib\ant-apache-bsf.jar;C:\Users\JenkinsSlave\tools\Ant\ANT_1.8.2\lib\ant-apache-log4j.jar;C:\Users\JenkinsSlave\tools\Ant\ANT_1.8.2\lib\ant-apache-oro.jar;C:\Users\JenkinsSlave\tools\Ant\ANT_1.8.2\lib\ant-apache-regexp.jar;C:\Users\JenkinsSlave\tools\Ant\ANT_1.8.2\lib\ant-apache-resolver.jar;C:\Users\JenkinsSlave\tools\Ant\ANT_1.8.2\lib\ant-apache-xalan2.jar;C:\Users\JenkinsSlave\tools\Ant\ANT_1.8.2\lib\ant-commons-logging.jar;C:\Users\JenkinsSlave\tools\Ant\ANT_1.8.2\lib\ant-commons-net.jar;C:\Users\JenkinsSlave\tools\Ant\ANT_1.8.2\lib\ant-jai.jar;C:\Users\JenkinsSlave\tools\Ant\ANT_1.8.2\lib\ant-javamail.jar;C:\Users\JenkinsSlave\tools\Ant\ANT_1.8.2\lib\ant-jdepend.jar;C:\Users\JenkinsSlave\tools\Ant\ANT_1.8.2\lib\ant-jmf.jar;C:\Users\JenkinsSlave\tools\Ant\ANT_1.8.2\lib\ant-jsch.jar;C:\Users\JenkinsSlave\tools\Ant\ANT_1.8.2\lib\ant-junit.jar;C:\Users\JenkinsSlave\tools\Ant\ANT_1.8.2\lib\ant-junit4.jar;C:\Users\JenkinsSlave\tools\Ant\ANT_1.8.2\lib\ant-netrexx.jar;C:\Users\JenkinsSlave\tools\Ant\ANT_1.8.2\lib\ant-swing.jar;C:\Users\JenkinsSlave\tools\Ant\ANT_1.8.2\lib\ant-testutil.jar;C:\Users\JenkinsSlave\tools\Ant\ANT_1.8.2\lib\ant.jar;C:\Users\JenkinsSlave\tools\java\32bit\jdk1.7.0_09\lib\tools.jar;C:\Users\JenkinsSlave\.ivy2\cache\com.carrotsearch.randomizedtesting\junit4-ant\jars\junit4-ant-2.0.4.jar
[junit4:junit4]   2> 62 T454 oaz.Environment.logEnv Server environment:java.library.path=C:\Users\JenkinsSlave\tools\java\32bit\jdk1.7.0_09\jre\bin;C:\Windows\Sun\Java\bin;C:\Windows\system32;C:\Windows;C:\Users\JenkinsSlave\tools\java\32bit\jdk1.7.0_09\bin;C:\Windows\system32;C:\Windows;C:\Windows\System32\Wbem;C:\Windows\System32\WindowsPowerShell\v1.0\;C:\Program Files (x86)\Subversion\bin;.
[junit4:junit4]   2> 63 T454 oaz.Environment.logEnv Server environment:java.io.tmpdir=.
[junit4:junit4]   2> 63 T454 oaz.Environment.logEnv Server environment:java.compiler=<NA>
[junit4:junit4]   2> 63 T454 oaz.Environment.logEnv Server environment:os.name=Windows 7
[junit4:junit4]   2> 63 T454 oaz.Environment.logEnv Server environment:os.arch=x86
[junit4:junit4]   2> 63 T454 oaz.Environment.logEnv Server environment:os.version=6.1
[junit4:junit4]   2> 63 T454 oaz.Environment.logEnv Server environment:user.name=JenkinsSlave
[junit4:junit4]   2> 63 T454 oaz.Environment.logEnv Server environment:user.home=C:\Users\JenkinsSlave
[junit4:junit4]   2> 63 T454 oaz.Environment.logEnv Server environment:user.dir=C:\Users\JenkinsSlave\workspace\Lucene-Solr-4.x-Windows\solr\build\solr-solrj\test\J0
[junit4:junit4]   2> 82 T454 oazs.ZooKeeperServer.setTickTime tickTime set to 1000
[junit4:junit4]   2> 95 T454 oazs.NIOServerCnxn$Factory.<init> binding to port 0.0.0.0/0.0.0.0:0
[junit4:junit4]   2> 104 T453 oasc.ZkTestServer.run start zk server on port:51574
[junit4:junit4]   2> 133 T454 oazsp.FileTxnSnapLog.save Snapshotting: 0
[junit4:junit4]   2> 144 T453 oaz.Environment.logEnv Client environment:zookeeper.version=3.3.6-1366786, built on 07/29/2012 06:22 GMT
[junit4:junit4]   2> 150 T453 oaz.Environment.logEnv Client environment:host.name=JenkinsSlave-PC
[junit4:junit4]   2> 150 T453 oaz.Environment.logEnv Client environment:java.version=1.7.0_09
[junit4:junit4]   2> 151 T453 oaz.Environment.logEnv Client environment:java.vendor=Oracle Corporation
[junit4:junit4]   2> 151 T453 oaz.Environment.logEnv Client environment:java.home=C:\Users\JenkinsSlave\tools\java\32bit\jdk1.7.0_09\jre
[junit4:junit4]   2> 151 T453 oaz.Environment.logEnv Client environment:java.class.path=C:\Users\JenkinsSlave\workspace\Lucene-Solr-4.x-Windows\solr\build\solr-solrj\classes\test;C:\Users\JenkinsSlave\workspace\Lucene-Solr-4.x-Windows\solr\build\solr-test-framework\classes\java;C:\Users\JenkinsSlave\workspace\Lucene-Solr-4.x-Windows\solr\solrj\src\test-files;C:\Users\JenkinsSlave\workspace\Lucene-Solr-4.x-Windows\lucene\build\test-framework\classes\java;C:\Users\JenkinsSlave\workspace\Lucene-Solr-4.x-Windows\lucene\build\codecs\classes\java;C:\Users\JenkinsSlave\workspace\Lucene-Solr-4.x-Windows\solr\solrj\lib\commons-io-2.1.jar;C:\Users\JenkinsSlave\workspace\Lucene-Solr-4.x-Windows\solr\solrj\lib\httpclient-4.1.3.jar;C:\Users\JenkinsSlave\workspace\Lucene-Solr-4.x-Windows\solr\solrj\lib\httpcore-4.1.4.jar;C:\Users\JenkinsSlave\workspace\Lucene-Solr-4.x-Windows\solr\solrj\lib\httpmime-4.1.3.jar;C:\Users\JenkinsSlave\workspace\Lucene-Solr-4.x-Windows\solr\solrj\lib\jcl-over-slf4j-1.6.4.jar;C:\Users\JenkinsSlave\workspace\Lucene-Solr-4.x-Windows\solr\solrj\lib\log4j-over-slf4j-1.6.4.jar;C:\Users\JenkinsSlave\workspace\Lucene-Solr-4.x-Windows\solr\solrj\lib\slf4j-api-1.6.4.jar;C:\Users\JenkinsSlave\workspace\Lucene-Solr-4.x-Windows\solr\solrj\lib\slf4j-jdk14-1.6.4.jar;C:\Users\JenkinsSlave\workspace\Lucene-Solr-4.x-Windows\solr\solrj\lib\wstx-asl-3.2.7.jar;C:\Users\JenkinsSlave\workspace\Lucene-Solr-4.x-Windows\solr\solrj\lib\zookeeper-3.3.6.jar;C:\Users\JenkinsSlave\workspace\Lucene-Solr-4.x-Windows\lucene\test-framework\lib\junit-4.10.jar;C:\Users\JenkinsSlave\workspace\Lucene-Solr-4.x-Windows\lucene\test-framework\lib\randomizedtesting-runner-2.0.4.jar;C:\Users\JenkinsSlave\workspace\Lucene-Solr-4.x-Windows\solr\build\solr-solrj\classes\java;C:\Users\JenkinsSlave\workspace\Lucene-Solr-4.x-Windows\solr\build\solr-core\classes\java;C:\Users\JenkinsSlave\workspace\Lucene-Solr-4.x-Windows\lucene\build\analysis\common\lucene-analyzers-common-4.1-SNAPSHOT.jar;C:\Users\JenkinsSlave\workspace\Lucene-Solr-4.x-Windows\lucene\build\analysis\kuromoji\lucene-analyzers-kuromoji-4.1-SNAPSHOT.jar;C:\Users\JenkinsSlave\workspace\Lucene-Solr-4.x-Windows\lucene\build\analysis\phonetic\lucene-analyzers-phonetic-4.1-SNAPSHOT.jar;C:\Users\JenkinsSlave\workspace\Lucene-Solr-4.x-Windows\lucene\build\highlighter\lucene-highlighter-4.1-SNAPSHOT.jar;C:\Users\JenkinsSlave\workspace\Lucene-Solr-4.x-Windows\lucene\build\memory\lucene-memory-4.1-SNAPSHOT.jar;C:\Users\JenkinsSlave\workspace\Lucene-Solr-4.x-Windows\lucene\build\misc\lucene-misc-4.1-SNAPSHOT.jar;C:\Users\JenkinsSlave\workspace\Lucene-Solr-4.x-Windows\lucene\build\spatial\lucene-spatial-4.1-SNAPSHOT.jar;C:\Users\JenkinsSlave\workspace\Lucene-Solr-4.x-Windows\lucene\build\suggest\lucene-suggest-4.1-SNAPSHOT.jar;C:\Users\JenkinsSlave\workspace\Lucene-Solr-4.x-Windows\lucene\build\grouping\lucene-grouping-4.1-SNAPSHOT.jar;C:\Users\JenkinsSlave\workspace\Lucene-Solr-4.x-Windows\lucene\build\queries\lucene-queries-4.1-SNAPSHOT.jar;C:\Users\JenkinsSlave\workspace\Lucene-Solr-4.x-Windows\lucene\build\queryparser\lucene-queryparser-4.1-SNAPSHOT.jar;C:\Users\JenkinsSlave\workspace\Lucene-Solr-4.x-Windows\solr\core\lib\commons-cli-1.2.jar;C:\Users\JenkinsSlave\workspace\Lucene-Solr-4.x-Windows\solr\core\lib\commons-codec-1.7.jar;C:\Users\JenkinsSlave\workspace\Lucene-Solr-4.x-Windows\solr\core\lib\commons-fileupload-1.2.1.jar;C:\Users\JenkinsSlave\workspace\Lucene-Solr-4.x-Windows\solr\core\lib\commons-lang-2.6.jar;C:\Users\JenkinsSlave\workspace\Lucene-Solr-4.x-Windows\solr\core\lib\easymock-2.2.jar;C:\Users\JenkinsSlave\workspace\Lucene-Solr-4.x-Windows\solr\core\lib\guava-r05.jar;C:\Users\JenkinsSlave\workspace\Lucene-Solr-4.x-Windows\solr\core\lib\javax.servlet-api-3.0.1.jar;C:\Users\JenkinsSlave\workspace\Lucene-Solr-4.x-Windows\solr\core\lib\spatial4j-0.3.jar;C:\Users\JenkinsSlave\workspace\Lucene-Solr-4.x-Windows\solr\example\lib\jetty-continuation-8.1.7.v20120910.jar;C:\Users\JenkinsSlave\workspace\Lucene-Solr-4.x-Windows\solr\example\lib\jetty-deploy-8.1.7.v20120910.jar;C:\Users\JenkinsSlave\workspace\Lucene-Solr-4.x-Windows\solr\example\lib\jetty-http-8.1.7.v20120910.jar;C:\Users\JenkinsSlave\workspace\Lucene-Solr-4.x-Windows\solr\example\lib\jetty-io-8.1.7.v20120910.jar;C:\Users\JenkinsSlave\workspace\Lucene-Solr-4.x-Windows\solr\example\lib\jetty-jmx-8.1.7.v20120910.jar;C:\Users\JenkinsSlave\workspace\Lucene-Solr-4.x-Windows\solr\example\lib\jetty-security-8.1.7.v20120910.jar;C:\Users\JenkinsSlave\workspace\Lucene-Solr-4.x-Windows\solr\example\lib\jetty-server-8.1.7.v20120910.jar;C:\Users\JenkinsSlave\workspace\Lucene-Solr-4.x-Windows\solr\example\lib\jetty-servlet-8.1.7.v20120910.jar;C:\Users\JenkinsSlave\workspace\Lucene-Solr-4.x-Windows\solr\example\lib\jetty-util-8.1.7.v20120910.jar;C:\Users\JenkinsSlave\workspace\Lucene-Solr-4.x-Windows\solr\example\lib\jetty-webapp-8.1.7.v20120910.jar;C:\Users\JenkinsSlave\workspace\Lucene-Solr-4.x-Windows\solr\example\lib\jetty-xml-8.1.7.v20120910.jar;C:\Users\JenkinsSlave\workspace\Lucene-Solr-4.x-Windows\solr\example\lib\servlet-api-3.0.jar;C:\Users\JenkinsSlave\workspace\Lucene-Solr-4.x-Windows\solr\example\example-DIH\solr\db\lib\hsqldb-1.8.0.10.jar;C:\Users\JenkinsSlave\workspace\Lucene-Solr-4.x-Windows\lucene\build\core\classes\java;C:\Users\JenkinsSlave\tools\Ant\ANT_1.8.2\lib\ant-launcher.jar;C:\Users\JenkinsSlave\.ant\lib\ivy-2.2.0.jar;C:\Users\JenkinsSlave\tools\Ant\ANT_1.8.2\lib\ant-antlr.jar;C:\Users\JenkinsSlave\tools\Ant\ANT_1.8.2\lib\ant-apache-bcel.jar;C:\Users\JenkinsSlave\tools\Ant\ANT_1.8.2\lib\ant-apache-bsf.jar;C:\Users\JenkinsSlave\tools\Ant\ANT_1.8.2\lib\ant-apache-log4j.jar;C:\Users\JenkinsSlave\tools\Ant\ANT_1.8.2\lib\ant-apache-oro.jar;C:\Users\JenkinsSlave\tools\Ant\ANT_1.8.2\lib\ant-apache-regexp.jar;C:\Users\JenkinsSlave\tools\Ant\ANT_1.8.2\lib\ant-apache-resolver.jar;C:\Users\JenkinsSlave\tools\Ant\ANT_1.8.2\lib\ant-apache-xalan2.jar;C:\Users\JenkinsSlave\tools\Ant\ANT_1.8.2\lib\ant-commons-logging.jar;C:\Users\JenkinsSlave\tools\Ant\ANT_1.8.2\lib\ant-commons-net.jar;C:\Users\JenkinsSlave\tools\Ant\ANT_1.8.2\lib\ant-jai.jar;C:\Users\JenkinsSlave\tools\Ant\ANT_1.8.2\lib\ant-javamail.jar;C:\Users\JenkinsSlave\tools\Ant\ANT_1.8.2\lib\ant-jdepend.jar;C:\Users\JenkinsSlave\tools\Ant\ANT_1.8.2\lib\ant-jmf.jar;C:\Users\JenkinsSlave\tools\Ant\ANT_1.8.2\lib\ant-jsch.jar;C:\Users\JenkinsSlave\tools\Ant\ANT_1.8.2\lib\ant-junit.jar;C:\Users\JenkinsSlave\tools\Ant\ANT_1.8.2\lib\ant-junit4.jar;C:\Users\JenkinsSlave\tools\Ant\ANT_1.8.2\lib\ant-netrexx.jar;C:\Users\JenkinsSlave\tools\Ant\ANT_1.8.2\lib\ant-swing.jar;C:\Users\JenkinsSlave\tools\Ant\ANT_1.8.2\lib\ant-testutil.jar;C:\Users\JenkinsSlave\tools\Ant\ANT_1.8.2\lib\ant.jar;C:\Users\JenkinsSlave\tools\java\32bit\jdk1.7.0_09\lib\tools.jar;C:\Users\JenkinsSlave\.ivy2\cache\com.carrotsearch.randomizedtesting\junit4-ant\jars\junit4-ant-2.0.4.jar
[junit4:junit4]   2> 152 T453 oaz.Environment.logEnv Client environment:java.library.path=C:\Users\JenkinsSlave\tools\java\32bit\jdk1.7.0_09\jre\bin;C:\Windows\Sun\Java\bin;C:\Windows\system32;C:\Windows;C:\Users\JenkinsSlave\tools\java\32bit\jdk1.7.0_09\bin;C:\Windows\system32;C:\Windows;C:\Windows\System32\Wbem;C:\Windows\System32\WindowsPowerShell\v1.0\;C:\Program Files (x86)\Subversion\bin;.
[junit4:junit4]   2> 152 T453 oaz.Environment.logEnv Client environment:java.io.tmpdir=.
[junit4:junit4]   2> 152 T453 oaz.Environment.logEnv Client environment:java.compiler=<NA>
[junit4:junit4]   2> 152 T453 oaz.Environment.logEnv Client environment:os.name=Windows 7
[junit4:junit4]   2> 152 T453 oaz.Environment.logEnv Client environment:os.arch=x86
[junit4:junit4]   2> 152 T453 oaz.Environment.logEnv Client environment:os.version=6.1
[junit4:junit4]   2> 153 T453 oaz.Environment.logEnv Client environment:user.name=JenkinsSlave
[junit4:junit4]   2> 153 T453 oaz.Environment.logEnv Client environment:user.home=C:\Users\JenkinsSlave
[junit4:junit4]   2> 153 T453 oaz.Environment.logEnv Client environment:user.dir=C:\Users\JenkinsSlave\workspace\Lucene-Solr-4.x-Windows\solr\build\solr-solrj\test\J0
[junit4:junit4]   2> 157 T453 oaz.ZooKeeper.<init> Initiating client connection, connectString=127.0.0.1:51574 sessionTimeout=10000 watcher=org.apache.solr.common.cloud.ConnectionManager@1d0dadb
[junit4:junit4]   2> 193 T453 oascc.ConnectionManager.waitForConnected Waiting for client to connect to ZooKeeper
[junit4:junit4]   2> 195 T458 oaz.ClientCnxn$SendThread.startConnect Opening socket connection to server /127.0.0.1:51574
[junit4:junit4]   2> 196 T455 oazs.NIOServerCnxn$Factory.run Accepted socket connection from /127.0.0.1:51577
[junit4:junit4]   2> 199 T458 oaz.ClientCnxn$SendThread.primeConnection Socket connection established to 127.0.0.1/127.0.0.1:51574, initiating session
[junit4:junit4]   2> 205 T455 oazs.NIOServerCnxn.doIO WARNING Exception causing close of session 0x0 due to java.io.IOException: ZooKeeperServer not running
[junit4:junit4]   2> 205 T455 oazs.NIOServerCnxn.closeSock Closed socket connection for client /127.0.0.1:51577 (no session established for client)
[junit4:junit4]   2> 206 T458 oaz.ClientCnxn$SendThread.run Unable to read additional data from server sessionid 0x0, likely server has closed socket, closing socket connection and attempting reconnect
[junit4:junit4]   2> 1563 T458 oaz.ClientCnxn$SendThread.startConnect Opening socket connection to server 127.0.0.1/127.0.0.1:51574
[junit4:junit4]   2> 1564 T458 oaz.ClientCnxn$SendThread.primeConnection Socket connection established to 127.0.0.1/127.0.0.1:51574, initiating session
[junit4:junit4]   2> 1564 T455 oazs.NIOServerCnxn$Factory.run Accepted socket connection from /127.0.0.1:51578
[junit4:junit4]   2> 1566 T455 oazs.NIOServerCnxn.readConnectRequest Client attempting to establish new session at /127.0.0.1:51578
[junit4:junit4]   2> 1575 T457 oazsp.FileTxnLog.append Creating new log file: log.1
[junit4:junit4]   2> 1606 T457 oazs.NIOServerCnxn.finishSessionInit Established session 0x13adeabf41e0000 with negotiated timeout 10000 for client /127.0.0.1:51578
[junit4:junit4]   2> 1606 T458 oaz.ClientCnxn$SendThread.readConnectResult Session establishment complete on server 127.0.0.1/127.0.0.1:51574, sessionid = 0x13adeabf41e0000, negotiated timeout = 10000
[junit4:junit4]   2> 1610 T460 oascc.ConnectionManager.process Watcher org.apache.solr.common.cloud.ConnectionManager@1d0dadb name:ZooKeeperConnection Watcher:127.0.0.1:51574 got event WatchedEvent state:SyncConnected type:None path:null path:null type:None
[junit4:junit4]   2> 1610 T453 oascc.ConnectionManager.waitForConnected Client is connected to ZooKeeper
[junit4:junit4]   2> 1614 T453 oascc.SolrZkClient.makePath makePath: /solr
[junit4:junit4]   2> 1681 T459 oazs.PrepRequestProcessor.pRequest Processed session termination for sessionid: 0x13adeabf41e0000
[junit4:junit4]   2> 1703 T453 oaz.ZooKeeper.close Session: 0x13adeabf41e0000 closed
[junit4:junit4]   2> 1704 T453 oaz.ZooKeeper.<init> Initiating client connection, connectString=127.0.0.1:51574/solr sessionTimeout=10000 watcher=org.apache.solr.common.cloud.ConnectionManager@b0e6d6
[junit4:junit4]   2> 1704 T460 oaz.ClientCnxn$EventThread.run EventThread shut down
[junit4:junit4]   2> 1705 T455 oazs.NIOServerCnxn.closeSock Closed socket connection for client /127.0.0.1:51578 which had sessionid 0x13adeabf41e0000
[junit4:junit4]   2> 1706 T461 oaz.ClientCnxn$SendThread.startConnect Opening socket connection to server /127.0.0.1:51574
[junit4:junit4]   2> 1706 T453 oascc.ConnectionManager.waitForConnected Waiting for client to connect to ZooKeeper
[junit4:junit4]   2> 1706 T461 oaz.ClientCnxn$SendThread.primeConnection Socket connection established to 127.0.0.1/127.0.0.1:51574, initiating session
[junit4:junit4]   2> 1706 T455 oazs.NIOServerCnxn$Factory.run Accepted socket connection from /127.0.0.1:51581
[junit4:junit4]   2> 1706 T455 oazs.NIOServerCnxn.readConnectRequest Client attempting to establish new session at /127.0.0.1:51581
[junit4:junit4]   2> 1728 T457 oazs.NIOServerCnxn.finishSessionInit Established session 0x13adeabf41e0001 with negotiated timeout 10000 for client /127.0.0.1:51581
[junit4:junit4]   2> 1729 T461 oaz.ClientCnxn$SendThread.readConnectResult Session establishment complete on server 127.0.0.1/127.0.0.1:51574, sessionid = 0x13adeabf41e0001, negotiated timeout = 10000
[junit4:junit4]   2> 1729 T462 oascc.ConnectionManager.process Watcher org.apache.solr.common.cloud.ConnectionManager@b0e6d6 name:ZooKeeperConnection Watcher:127.0.0.1:51574/solr got event WatchedEvent state:SyncConnected type:None path:null path:null type:None
[junit4:junit4]   2> 1729 T453 oascc.ConnectionManager.waitForConnected Client is connected to ZooKeeper
[junit4:junit4]   2> 1737 T453 oascc.SolrZkClient.makePath makePath: /collections/collection1
[junit4:junit4]   2> 1779 T453 oascc.SolrZkClient.makePath makePath: /collections/collection1/shards
[junit4:junit4]   2> 1796 T453 oascc.SolrZkClient.makePath makePath: /collections/control_collection
[junit4:junit4]   2> 1813 T453 oascc.SolrZkClient.makePath makePath: /collections/control_collection/shards
[junit4:junit4]   2> 1839 T453 oasc.AbstractZkTestCase.putConfig put C:\Users\JenkinsSlave\workspace\Lucene-Solr-4.x-Windows\solr\solrj\src\test-files\solrj\solr\collection1\conf\solrconfig.xml to /configs/conf1/solrconfig.xml
[junit4:junit4]   2> 1840 T453 oascc.SolrZkClient.makePath makePath: /configs/conf1/solrconfig.xml
[junit4:junit4]   2> 1898 T453 oasc.AbstractZkTestCase.putConfig put C:\Users\JenkinsSlave\workspace\Lucene-Solr-4.x-Windows\solr\solrj\src\test-files\solrj\solr\collection1\conf\schema.xml to /configs/conf1/schema.xml
[junit4:junit4]   2> 1901 T453 oascc.SolrZkClient.makePath makePath: /configs/conf1/schema.xml
[junit4:junit4]   2> 1907 T453 oasc.AbstractZkTestCase.putConfig put C:\Users\JenkinsSlave\workspace\Lucene-Solr-4.x-Windows\solr\solrj\src\test-files\solrj\solr\collection1\conf\solrconfig.xml to /configs/conf1/solrconfig.xml
[junit4:junit4]   2> 1908 T453 oascc.SolrZkClient.makePath makePath: /configs/conf1/solrconfig.xml
[junit4:junit4]   2> 1932 T453 oasc.AbstractZkTestCase.putConfig skipping C:\Users\JenkinsSlave\workspace\Lucene-Solr-4.x-Windows\solr\solrj\src\test-files\solrj\solr\collection1\conf\stopwords.txt because it doesn't exist
[junit4:junit4]   2> 1932 T453 oasc.AbstractZkTestCase.putConfig skipping C:\Users\JenkinsSlave\workspace\Lucene-Solr-4.x-Windows\solr\solrj\src\test-files\solrj\solr\collection1\conf\protwords.txt because it doesn't exist
[junit4:junit4]   2> 1932 T453 oasc.AbstractZkTestCase.putConfig skipping C:\Users\JenkinsSlave\workspace\Lucene-Solr-4.x-Windows\solr\solrj\src\test-files\solrj\solr\collection1\conf\currency.xml because it doesn't exist
[junit4:junit4]   2> 1932 T453 oasc.AbstractZkTestCase.putConfig skipping C:\Users\JenkinsSlave\workspace\Lucene-Solr-4.x-Windows\solr\solrj\src\test-files\solrj\solr\collection1\conf\open-exchange-rates.json because it doesn't exist
[junit4:junit4]   2> 1933 T453 oasc.AbstractZkTestCase.putConfig skipping C:\Users\JenkinsSlave\workspace\Lucene-Solr-4.x-Windows\solr\solrj\src\test-files\solrj\solr\collection1\conf\mapping-ISOLatin1Accent.txt because it doesn't exist
[junit4:junit4]   2> 1933 T453 oasc.AbstractZkTestCase.putConfig skipping C:\Users\JenkinsSlave\workspace\Lucene-Solr-4.x-Windows\solr\solrj\src\test-files\solrj\solr\collection1\conf\old_synonyms.txt because it doesn't exist
[junit4:junit4]   2> 1933 T453 oasc.AbstractZkTestCase.putConfig skipping C:\Users\JenkinsSlave\workspace\Lucene-Solr-4.x-Windows\solr\solrj\src\test-files\solrj\solr\collection1\conf\synonyms.txt because it doesn't exist
[junit4:junit4]   2> 1934 T459 oazs.PrepRequestProcessor.pRequest Processed session termination for sessionid: 0x13adeabf41e0001
[junit4:junit4]   2> 1947 T453 oaz.ZooKeeper.close Session: 0x13adeabf41e0001 closed
[junit4:junit4]   2> 1947 T455 oazs.NIOServerCnxn.doIO WARNING EndOfStreamException: Unable to read additional data from client sessionid 0x13adeabf41e0001, likely client has closed socket
[junit4:junit4]   2> 1948 T455 oazs.NIOServerCnxn.closeSock Closed socket connection for client /127.0.0.1:51581 which had sessionid 0x13adeabf41e0001
[junit4:junit4]   2> 1948 T453 oejs.Server.doStart jetty-8.1.7.v20120910
[junit4:junit4]   2> 1948 T462 oaz.ClientCnxn$EventThread.run EventThread shut down
[junit4:junit4]   2> 1952 T453 oejs.AbstractConnector.doStart Started SelectChannelConnector@0.0.0.0:51582
[junit4:junit4]   2> 1952 T453 oasc.SolrResourceLoader.locateSolrHome JNDI not configured for solr (NoInitialContextEx)
[junit4:junit4]   2> 1953 T453 oasc.SolrResourceLoader.locateSolrHome using system property solr.solr.home: C:\Users\JenkinsSlave\workspace\Lucene-Solr-4.x-Windows\solr\solrj\src\test-files\solrj\solr
[junit4:junit4]   2> 1953 T453 oasc.SolrResourceLoader.<init> new SolrResourceLoader for deduced Solr Home: 'C:\Users\JenkinsSlave\workspace\Lucene-Solr-4.x-Windows\solr\solrj\src\test-files\solrj\solr\'
[junit4:junit4]   2> 1980 T453 oass.SolrDispatchFilter.init SolrDispatchFilter.init()
[junit4:junit4]   2> 1981 T453 oasc.SolrResourceLoader.locateSolrHome JNDI not configured for solr (NoInitialContextEx)
[junit4:junit4]   2> 1981 T453 oasc.SolrResourceLoader.locateSolrHome using system property solr.solr.home: C:\Users\JenkinsSlave\workspace\Lucene-Solr-4.x-Windows\solr\solrj\src\test-files\solrj\solr
[junit4:junit4]   2> 1982 T453 oasc.CoreContainer$Initializer.initialize looking for solr.xml: C:\Users\JenkinsSlave\workspace\Lucene-Solr-4.x-Windows\solr\solrj\src\test-files\solrj\solr\solr.xml
[junit4:junit4]   2> 1982 T453 oasc.CoreContainer.<init> New CoreContainer 27685878
[junit4:junit4]   2> 1983 T453 oasc.CoreContainer.load Loading CoreContainer using Solr Home: 'C:\Users\JenkinsSlave\workspace\Lucene-Solr-4.x-Windows\solr\solrj\src\test-files\solrj\solr\'
[junit4:junit4]   2> 1983 T453 oasc.SolrResourceLoader.<init> new SolrResourceLoader for directory: 'C:\Users\JenkinsSlave\workspace\Lucene-Solr-4.x-Windows\solr\solrj\src\test-files\solrj\solr\'
[junit4:junit4]   2> 2006 T453 oasc.CoreContainer.load Registering Log Listener
[junit4:junit4]   2> 2021 T453 oasc.CoreContainer.initZooKeeper Zookeeper client=127.0.0.1:51574/solr
[junit4:junit4]   2> 2037 T453 oaz.ZooKeeper.<init> Initiating client connection, connectString=127.0.0.1:51574/solr sessionTimeout=8000 watcher=org.apache.solr.common.cloud.ConnectionManager@65194a
[junit4:junit4]   2> 2038 T472 oaz.ClientCnxn$SendThread.startConnect Opening socket connection to server /127.0.0.1:51574
[junit4:junit4]   2> 2038 T453 oascc.ConnectionManager.waitForConnected Waiting for client to connect to ZooKeeper
[junit4:junit4]   2> 2040 T472 oaz.ClientCnxn$SendThread.primeConnection Socket connection established to 127.0.0.1/127.0.0.1:51574, initiating session
[junit4:junit4]   2> 2040 T455 oazs.NIOServerCnxn$Factory.run Accepted socket connection from /127.0.0.1:51587
[junit4:junit4]   2> 2040 T455 oazs.NIOServerCnxn.readConnectRequest Client attempting to establish new session at /127.0.0.1:51587
[junit4:junit4]   2> 2047 T457 oazs.NIOServerCnxn.finishSessionInit Established session 0x13adeabf41e0002 with negotiated timeout 8000 for client /127.0.0.1:51587
[junit4:junit4]   2> 2047 T472 oaz.ClientCnxn$SendThread.readConnectResult Session establishment complete on server 127.0.0.1/127.0.0.1:51574, sessionid = 0x13adeabf41e0002, negotiated timeout = 8000
[junit4:junit4]   2> 2047 T473 oascc.ConnectionManager.process Watcher org.apache.solr.common.cloud.ConnectionManager@65194a name:ZooKeeperConnection Watcher:127.0.0.1:51574/solr got event WatchedEvent state:SyncConnected type:None path:null path:null type:None
[junit4:junit4]   2> 2048 T453 oascc.ConnectionManager.waitForConnected Client is connected to ZooKeeper
[junit4:junit4]   2> 2079 T459 oazs.PrepRequestProcessor.pRequest Got user-level KeeperException when processing sessionid:0x13adeabf41e0002 type:create cxid:0x2 zxid:0xfffffffffffffffe txntype:unknown reqpath:n/a Error Path:/solr/overseer Error:KeeperErrorCode = NodeExists for /solr/overseer
[junit4:junit4]   2> 2103 T453 oascc.SolrZkClient.makePath makePath: /live_nodes
[junit4:junit4]   2> 2130 T453 oasc.ZkController.createEphemeralLiveNode Register node as live in ZooKeeper:/live_nodes/127.0.0.1:51582_solr
[junit4:junit4]   2> 2133 T459 oazs.PrepRequestProcessor.pRequest Got user-level KeeperException when processing sessionid:0x13adeabf41e0002 type:delete cxid:0x7 zxid:0xfffffffffffffffe txntype:unknown reqpath:n/a Error Path:/solr/live_nodes/127.0.0.1:51582_solr Error:KeeperErrorCode = NoNode for /solr/live_nodes/127.0.0.1:51582_solr
[junit4:junit4]   2> 2146 T453 oascc.SolrZkClient.makePath makePath: /live_nodes/127.0.0.1:51582_solr
[junit4:junit4]   2> 2173 T453 oashc.HttpShardHandlerFactory.getParameter Setting socketTimeout to: 0
[junit4:junit4]   2> 2173 T453 oashc.HttpShardHandlerFactory.getParameter Setting urlScheme to: http://
[junit4:junit4]   2> 2174 T453 oashc.HttpShardHandlerFactory.getParameter Setting connTimeout to: 0
[junit4:junit4]   2> 2174 T453 oashc.HttpShardHandlerFactory.getParameter Setting maxConnectionsPerHost to: 20
[junit4:junit4]   2> 2174 T453 oashc.HttpShardHandlerFactory.getParameter Setting corePoolSize to: 0
[junit4:junit4]   2> 2175 T453 oashc.HttpShardHandlerFactory.getParameter Setting maximumPoolSize to: 2147483647
[junit4:junit4]   2> 2175 T453 oashc.HttpShardHandlerFactory.getParameter Setting maxThreadIdleTime to: 5
[junit4:junit4]   2> 2175 T453 oashc.HttpShardHandlerFactory.getParameter Setting sizeOfQueue to: -1
[junit4:junit4]   2> 2176 T453 oashc.HttpShardHandlerFactory.getParameter Setting fairnessPolicy to: false
[junit4:junit4]   2> 2176 T453 oascsi.HttpClientUtil.createClient Creating new http client, config:maxConnectionsPerHost=20&maxConnections=10000&socketTimeout=0&connTimeout=0&retry=false
[junit4:junit4]   2> 2183 T453 oascc.SolrZkClient.makePath makePath: /overseer_elect/election
[junit4:junit4]   2> 2240 T459 oazs.PrepRequestProcessor.pRequest Got user-level KeeperException when processing sessionid:0x13adeabf41e0002 type:delete cxid:0x15 zxid:0xfffffffffffffffe txntype:unknown reqpath:n/a Error Path:/solr/overseer_elect/leader Error:KeeperErrorCode = NoNode for /solr/overseer_elect/leader
[junit4:junit4]   2> 2257 T453 oascc.SolrZkClient.makePath makePath: /overseer_elect/leader
[junit4:junit4]   2> 2274 T453 oasc.Overseer.start Overseer (id=88627972803526658-127.0.0.1:51582_solr-n_0000000000) starting
[junit4:junit4]   2> 2275 T459 oazs.PrepRequestProcessor.pRequest Got user-level KeeperException when processing sessionid:0x13adeabf41e0002 type:create cxid:0x1a zxid:0xfffffffffffffffe txntype:unknown reqpath:n/a Error Path:/solr/overseer Error:KeeperErrorCode = NodeExists for /solr/overseer
[junit4:junit4]   2> 2288 T459 oazs.PrepRequestProcessor.pRequest Got user-level KeeperException when processing sessionid:0x13adeabf41e0002 type:create cxid:0x1b zxid:0xfffffffffffffffe txntype:unknown reqpath:n/a Error Path:/solr/overseer Error:KeeperErrorCode = NodeExists for /solr/overseer
[junit4:junit4]   2> 2300 T459 oazs.PrepRequestProcessor.pRequest Got user-level KeeperException when processing sessionid:0x13adeabf41e0002 type:create cxid:0x1c zxid:0xfffffffffffffffe txntype:unknown reqpath:n/a Error Path:/solr/overseer Error:KeeperErrorCode = NodeExists for /solr/overseer
[junit4:junit4]   2> 2319 T459 oazs.PrepRequestProcessor.pRequest Got user-level KeeperException when processing sessionid:0x13adeabf41e0002 type:create cxid:0x1d zxid:0xfffffffffffffffe txntype:unknown reqpath:n/a Error Path:/solr/overseer Error:KeeperErrorCode = NodeExists for /solr/overseer
[junit4:junit4]   2> 2334 T475 oasc.OverseerCollectionProcessor.run Process current queue of collection messages
[junit4:junit4]   2> 2335 T453 oascc.SolrZkClient.makePath makePath: /clusterstate.json
[junit4:junit4]   2> 2350 T453 oascc.ZkStateReader.createClusterStateWatchersAndUpdate Updating cluster state from ZooKeeper... 
[junit4:junit4]   2> 2369 T474 oasc.Overseer$ClusterStateUpdater.run Starting to work on the main queue
[junit4:junit4]   2> 2374 T453 oasc.CoreContainer.create Creating SolrCore 'collection1' using instanceDir: C:\Users\JenkinsSlave\workspace\Lucene-Solr-4.x-Windows\solr\solrj\src\test-files\solrj\solr\collection1
[junit4:junit4]   2> 2374 T453 oasc.ZkController.createCollectionZkNode Check for collection zkNode:control_collection
[junit4:junit4]   2> 2375 T453 oasc.ZkController.createCollectionZkNode Collection zkNode exists
[junit4:junit4]   2> 2376 T453 oasc.ZkController.readConfigName Load collection config from:/collections/control_collection
[junit4:junit4]   2> 2378 T453 oasc.SolrResourceLoader.<init> new SolrResourceLoader for directory: 'C:\Users\JenkinsSlave\workspace\Lucene-Solr-4.x-Windows\solr\solrj\src\test-files\solrj\solr\collection1\'
[junit4:junit4]   2> 2436 T453 oasc.SolrConfig.<init> Using Lucene MatchVersion: LUCENE_41
[junit4:junit4]   2> 2473 T453 oasc.SolrConfig.<init> Loaded SolrConfig: solrconfig.xml
[junit4:junit4]   2> 2474 T453 oass.IndexSchema.readSchema Reading Solr Schema
[junit4:junit4]   2> 2481 T453 oass.IndexSchema.readSchema Schema name=test
[junit4:junit4]   2> 3094 T453 oass.IndexSchema.readSchema default search field in schema is text
[junit4:junit4]   2> 3097 T453 oass.IndexSchema.readSchema unique key field: id
[junit4:junit4]   2> 3098 T453 oass.IndexSchema.readSchema WARNING Field text is not multivalued and destination for multiple copyFields (2)
[junit4:junit4]   2> 3099 T453 oass.IndexSchema.readSchema WARNING Field lowerfilt1and2 is not multivalued and destination for multiple copyFields (2)
[junit4:junit4]   2> 3104 T453 oasc.SolrCore.<init> [collection1] Opening new SolrCore at C:\Users\JenkinsSlave\workspace\Lucene-Solr-4.x-Windows\solr\solrj\src\test-files\solrj\solr\collection1\, dataDir=.\org.apache.solr.client.solrj.impl.CloudSolrServerTest-1352355541903/control/data\
[junit4:junit4]   2> 3104 T453 oasc.SolrCore.<init> JMX monitoring not detected for core: collection1
[junit4:junit4]   2> 3122 T453 oasc.SolrCore.getNewIndexDir New index directory detected: old=null new=.\org.apache.solr.client.solrj.impl.CloudSolrServerTest-1352355541903/control/data\index/
[junit4:junit4]   2> 3122 T453 oasc.SolrCore.initIndex WARNING [collection1] Solr index directory '.\org.apache.solr.client.solrj.impl.CloudSolrServerTest-1352355541903\control\data\index' doesn't exist. Creating new index...
[junit4:junit4]   2> 3123 T453 oasc.CachingDirectoryFactory.get return new directory for C:\Users\JenkinsSlave\workspace\Lucene-Solr-4.x-Windows\solr\build\solr-solrj\test\J0\.\org.apache.solr.client.solrj.impl.CloudSolrServerTest-1352355541903\control\data\index forceNew:false
[junit4:junit4]   2> 3146 T453 oasc.SolrDeletionPolicy.onCommit SolrDeletionPolicy.onCommit: commits:num=1
[junit4:junit4]   2> 		commit{dir=NRTCachingDirectory(org.apache.lucene.store.SimpleFSDirectory@C:\Users\JenkinsSlave\workspace\Lucene-Solr-4.x-Windows\solr\build\solr-solrj\test\J0\org.apache.solr.client.solrj.impl.CloudSolrServerTest-1352355541903\control\data\index lockFactory=org.apache.lucene.store.NativeFSLockFactory@e569da; maxCacheMB=48.0 maxMergeSizeMB=4.0),segFN=segments_1,generation=1,filenames=[segments_1]
[junit4:junit4]   2> 3147 T453 oasc.SolrDeletionPolicy.updateCommits newest commit = 1
[junit4:junit4]   2> 3149 T453 oasc.RequestHandlers.initHandlersFromConfig created /get: solr.RealTimeGetHandler
[junit4:junit4]   2> 3149 T453 oasc.RequestHandlers.initHandlersFromConfig adding lazy requestHandler: solr.ReplicationHandler
[junit4:junit4]   2> 3149 T453 oasc.RequestHandlers.initHandlersFromConfig created /replication: solr.ReplicationHandler
[junit4:junit4]   2> 3150 T453 oasc.RequestHandlers.initHandlersFromConfig created standard: solr.StandardRequestHandler
[junit4:junit4]   2> 3150 T453 oasc.RequestHandlers.initHandlersFromConfig created /update: solr.UpdateRequestHandler
[junit4:junit4]   2> 3150 T453 oasc.RequestHandlers.initHandlersFromConfig created /admin/: org.apache.solr.handler.admin.AdminHandlers
[junit4:junit4]   2> 3157 T453 oashl.XMLLoader.init xsltCacheLifetimeSeconds=60
[junit4:junit4]   2> 3164 T453 oass.SolrIndexSearcher.<init> Opening Searcher@5c66ae main
[junit4:junit4]   2> 3165 T453 oasu.CommitTracker.<init> Hard AutoCommit: disabled
[junit4:junit4]   2> 3165 T453 oasu.CommitTracker.<init> Soft AutoCommit: disabled
[junit4:junit4]   2> 3166 T476 oasc.SolrCore.registerSearcher [collection1] Registered new searcher Searcher@5c66ae main{StandardDirectoryReader(segments_1:1)}
[junit4:junit4]   2> 3166 T453 oasc.ZkController.publish numShards not found on descriptor - reading it from system property
[junit4:junit4]   2> 3168 T459 oazs.PrepRequestProcessor.pRequest Got user-level KeeperException when processing sessionid:0x13adeabf41e0002 type:create cxid:0x36 zxid:0xfffffffffffffffe txntype:unknown reqpath:n/a Error Path:/solr/overseer/queue Error:KeeperErrorCode = NoNode for /solr/overseer/queue
[junit4:junit4]   2> 3182 T453 oasc.CoreContainer.register registering core: collection1
[junit4:junit4]   2> 3183 T453 oasc.ZkController.register Register shard - core:collection1 address:http://127.0.0.1:51582/solr shardId:control_shard
[junit4:junit4]   2> 3190 T453 oascsi.HttpClientUtil.createClient Creating new http client, config:maxConnections=10000&maxConnectionsPerHost=20&connTimeout=30000&socketTimeout=30000&retry=false
[junit4:junit4]   2> 3200 T453 oascc.SolrZkClient.makePath makePath: /collections/control_collection/leader_elect/control_shard/election
[junit4:junit4]   2> 3232 T459 oazs.PrepRequestProcessor.pRequest Got user-level KeeperException when processing sessionid:0x13adeabf41e0002 type:delete cxid:0x45 zxid:0xfffffffffffffffe txntype:unknown reqpath:n/a Error Path:/solr/collections/control_collection/leaders Error:KeeperErrorCode = NoNode for /solr/collections/control_collection/leaders
[junit4:junit4]   2> 3235 T453 oasc.ShardLeaderElectionContext.runLeaderProcess Running the leader process.
[junit4:junit4]   2> 3236 T459 oazs.PrepRequestProcessor.pRequest Got user-level KeeperException when processing sessionid:0x13adeabf41e0002 type:create cxid:0x46 zxid:0xfffffffffffffffe txntype:unknown reqpath:n/a Error Path:/solr/overseer Error:KeeperErrorCode = NodeExists for /solr/overseer
[junit4:junit4]   2> 3333 T474 oascc.ZkStateReader.updateClusterState Updating cloud state from ZooKeeper... 
[junit4:junit4]   2> 3333 T474 oasc.Overseer$ClusterStateUpdater.updateState Update state numShards=null message={
[junit4:junit4]   2> 	  "operation":"state",
[junit4:junit4]   2> 	  "numShards":null,
[junit4:junit4]   2> 	  "shard":"control_shard",
[junit4:junit4]   2> 	  "roles":null,
[junit4:junit4]   2> 	  "state":"down",
[junit4:junit4]   2> 	  "core":"collection1",
[junit4:junit4]   2> 	  "collection":"control_collection",
[junit4:junit4]   2> 	  "node_name":"127.0.0.1:51582_solr",
[junit4:junit4]   2> 	  "base_url":"http://127.0.0.1:51582/solr"}
[junit4:junit4]   2> 3347 T459 oazs.PrepRequestProcessor.pRequest Got user-level KeeperException when processing sessionid:0x13adeabf41e0002 type:create cxid:0x4d zxid:0xfffffffffffffffe txntype:unknown reqpath:n/a Error Path:/solr/overseer/queue-work Error:KeeperErrorCode = NoNode for /solr/overseer/queue-work
[junit4:junit4]   2> 3386 T473 oascc.ZkStateReader$2.process A cluster state change has occurred - updating... (1)
[junit4:junit4]   2> 3669 T453 oasc.ShardLeaderElectionContext.waitForReplicasToComeUp Enough replicas found to continue.
[junit4:junit4]   2> 3669 T453 oasc.ShardLeaderElectionContext.runLeaderProcess I may be the new leader - try and sync
[junit4:junit4]   2> 3670 T453 oasc.SyncStrategy.sync Sync replicas to http://127.0.0.1:51582/solr/collection1/
[junit4:junit4]   2> 3670 T453 oasc.SyncStrategy.syncReplicas Sync Success - now sync replicas to me
[junit4:junit4]   2> 3670 T453 oasc.SyncStrategy.syncToMe http://127.0.0.1:51582/solr/collection1/ has no replicas
[junit4:junit4]   2> 3670 T453 oasc.ShardLeaderElectionContext.runLeaderProcess I am the new leader: http://127.0.0.1:51582/solr/collection1/
[junit4:junit4]   2> 3670 T453 oascc.SolrZkClient.makePath makePath: /collections/control_collection/leaders/control_shard
[junit4:junit4]   2> 3709 T459 oazs.PrepRequestProcessor.pRequest Got user-level KeeperException when processing sessionid:0x13adeabf41e0002 type:create cxid:0x6b zxid:0xfffffffffffffffe txntype:unknown reqpath:n/a Error Path:/solr/overseer Error:KeeperErrorCode = NodeExists for /solr/overseer
[junit4:junit4]   2> 3820 T474 oascc.ZkStateReader.updateClusterState Updating cloud state from ZooKeeper... 
[junit4:junit4]   2> 3830 T473 oascc.ZkStateReader$2.process A cluster state change has occurred - updating... (1)
[junit4:junit4]   2> 3846 T453 oasc.ZkController.register We are http://127.0.0.1:51582/solr/collection1/ and leader is http://127.0.0.1:51582/solr/collection1/
[junit4:junit4]   2> 3846 T453 oasc.ZkController.register No LogReplay needed for core=collection1 baseURL=http://127.0.0.1:51582/solr
[junit4:junit4]   2> 3846 T453 oasc.ZkController.checkRecovery I am the leader, no recovery necessary
[junit4:junit4]   2> 3846 T453 oasc.ZkController.publish numShards not found on descriptor - reading it from system property
[junit4:junit4]   2> 3850 T453 oascc.ZkStateReader.updateClusterState Updating cloud state from ZooKeeper... 
[junit4:junit4]   2> 3851 T453 oass.SolrDispatchFilter.init user.dir=C:\Users\JenkinsSlave\workspace\Lucene-Solr-4.x-Windows\solr\build\solr-solrj\test\J0
[junit4:junit4]   2> 3851 T453 oass.SolrDispatchFilter.init SolrDispatchFilter.init() done
[junit4:junit4]   2> 3852 T453 oascsi.HttpClientUtil.createClient Creating new http client, config:maxConnections=128&maxConnectionsPerHost=32&followRedirects=false
[junit4:junit4]   2> 4042 T453 oejs.Server.doStart jetty-8.1.7.v20120910
[junit4:junit4]   2> 4045 T453 oejs.AbstractConnector.doStart Started SelectChannelConnector@0.0.0.0:51588
[junit4:junit4]   2> 4046 T453 oasc.SolrResourceLoader.locateSolrHome JNDI not configured for solr (NoInitialContextEx)
[junit4:junit4]   2> 4046 T453 oasc.SolrResourceLoader.locateSolrHome using system property solr.solr.home: C:\Users\JenkinsSlave\workspace\Lucene-Solr-4.x-Windows\solr\build\solr-solrj\test\J0\.\solrtest-jetty1-1352355545749
[junit4:junit4]   2> 4047 T453 oasc.SolrResourceLoader.<init> new SolrResourceLoader for deduced Solr Home: 'C:\Users\JenkinsSlave\workspace\Lucene-Solr-4.x-Windows\solr\build\solr-solrj\test\J0\.\solrtest-jetty1-1352355545749\'
[junit4:junit4]   2> 4076 T453 oass.SolrDispatchFilter.init SolrDispatchFilter.init()
[junit4:junit4]   2> 4076 T453 oasc.SolrResourceLoader.locateSolrHome JNDI not configured for solr (NoInitialContextEx)
[junit4:junit4]   2> 4077 T453 oasc.SolrResourceLoader.locateSolrHome using system property solr.solr.home: C:\Users\JenkinsSlave\workspace\Lucene-Solr-4.x-Windows\solr\build\solr-solrj\test\J0\.\solrtest-jetty1-1352355545749
[junit4:junit4]   2> 4077 T453 oasc.CoreContainer$Initializer.initialize looking for solr.xml: C:\Users\JenkinsSlave\workspace\Lucene-Solr-4.x-Windows\solr\build\solr-solrj\test\J0\.\solrtest-jetty1-1352355545749\solr.xml
[junit4:junit4]   2> 4077 T453 oasc.CoreContainer.<init> New CoreContainer 26631583
[junit4:junit4]   2> 4078 T453 oasc.CoreContainer.load Loading CoreContainer using Solr Home: 'C:\Users\JenkinsSlave\workspace\Lucene-Solr-4.x-Windows\solr\build\solr-solrj\test\J0\.\solrtest-jetty1-1352355545749\'
[junit4:junit4]   2> 4078 T453 oasc.SolrResourceLoader.<init> new SolrResourceLoader for directory: 'C:\Users\JenkinsSlave\workspace\Lucene-Solr-4.x-Windows\solr\build\solr-solrj\test\J0\.\solrtest-jetty1-1352355545749\'
[junit4:junit4]   2> 4107 T453 oasc.CoreContainer.load Registering Log Listener
[junit4:junit4]   2> 4121 T453 oasc.CoreContainer.initZooKeeper Zookeeper client=127.0.0.1:51574/solr
[junit4:junit4]   2> 4122 T453 oaz.ZooKeeper.<init> Initiating client connection, connectString=127.0.0.1:51574/solr sessionTimeout=8000 watcher=org.apache.solr.common.cloud.ConnectionManager@13ab6bf
[junit4:junit4]   2> 4123 T486 oaz.ClientCnxn$SendThread.startConnect Opening socket connection to server /127.0.0.1:51574
[junit4:junit4]   2> 4123 T453 oascc.ConnectionManager.waitForConnected Waiting for client to connect to ZooKeeper
[junit4:junit4]   2> 4124 T486 oaz.ClientCnxn$SendThread.primeConnection Socket connection established to 127.0.0.1/127.0.0.1:51574, initiating session
[junit4:junit4]   2> 4124 T455 oazs.NIOServerCnxn$Factory.run Accepted socket connection from /127.0.0.1:51593
[junit4:junit4]   2> 4125 T455 oazs.NIOServerCnxn.readConnectRequest Client attempting to establish new session at /127.0.0.1:51593
[junit4:junit4]   2> 4130 T457 oazs.NIOServerCnxn.finishSessionInit Established session 0x13adeabf41e0003 with negotiated timeout 8000 for client /127.0.0.1:51593
[junit4:junit4]   2> 4131 T486 oaz.ClientCnxn$SendThread.readConnectResult Session establishment complete on server 127.0.0.1/127.0.0.1:51574, sessionid = 0x13adeabf41e0003, negotiated timeout = 8000
[junit4:junit4]   2> 4132 T487 oascc.ConnectionManager.process Watcher org.apache.solr.common.cloud.ConnectionManager@13ab6bf name:ZooKeeperConnection Watcher:127.0.0.1:51574/solr got event WatchedEvent state:SyncConnected type:None path:null path:null type:None
[junit4:junit4]   2> 4132 T453 oascc.ConnectionManager.waitForConnected Client is connected to ZooKeeper
[junit4:junit4]   2> 4134 T459 oazs.PrepRequestProcessor.pRequest Got user-level KeeperException when processing sessionid:0x13adeabf41e0003 type:create cxid:0x1 zxid:0xfffffffffffffffe txntype:unknown reqpath:n/a Error Path:/solr/overseer Error:KeeperErrorCode = NodeExists for /solr/overseer
[junit4:junit4]   2> 4146 T459 oazs.PrepRequestProcessor.pRequest Got user-level KeeperException when processing sessionid:0x13adeabf41e0003 type:create cxid:0x2 zxid:0xfffffffffffffffe txntype:unknown reqpath:n/a Error Path:/solr/overseer Error:KeeperErrorCode = NodeExists for /solr/overseer
[junit4:junit4]   2> 4172 T453 oasc.ZkController.createEphemeralLiveNode Register node as live in ZooKeeper:/live_nodes/127.0.0.1:51588_solr
[junit4:junit4]   2> 4173 T459 oazs.PrepRequestProcessor.pRequest Got user-level KeeperException when processing sessionid:0x13adeabf41e0003 type:delete cxid:0x4 zxid:0xfffffffffffffffe txntype:unknown reqpath:n/a Error Path:/solr/live_nodes/127.0.0.1:51588_solr Error:KeeperErrorCode = NoNode for /solr/live_nodes/127.0.0.1:51588_solr
[junit4:junit4]   2> 4188 T453 oascc.SolrZkClient.makePath makePath: /live_nodes/127.0.0.1:51588_solr
[junit4:junit4]   2> 4215 T473 oascc.ZkStateReader$3.process Updating live nodes... (2)
[junit4:junit4]   2> 4216 T453 oashc.HttpShardHandlerFactory.getParameter Setting socketTimeout to: 0
[junit4:junit4]   2> 4217 T453 oashc.HttpShardHandlerFactory.getParameter Setting urlScheme to: http://
[junit4:junit4]   2> 4218 T453 oashc.HttpShardHandlerFactory.getParameter Setting connTimeout to: 0
[junit4:junit4]   2> 4218 T453 oashc.HttpShardHandlerFactory.getParameter Setting maxConnectionsPerHost to: 20
[junit4:junit4]   2> 4219 T453 oashc.HttpShardHandlerFactory.getParameter Setting corePoolSize to: 0
[junit4:junit4]   2> 4219 T453 oashc.HttpShardHandlerFactory.getParameter Setting maximumPoolSize to: 2147483647
[junit4:junit4]   2> 4219 T453 oashc.HttpShardHandlerFactory.getParameter Setting maxThreadIdleTime to: 5
[junit4:junit4]   2> 4220 T453 oashc.HttpShardHandlerFactory.getParameter Setting sizeOfQueue to: -1
[junit4:junit4]   2> 4221 T453 oashc.HttpShardHandlerFactory.getParameter Setting fairnessPolicy to: false
[junit4:junit4]   2> 4221 T453 oascsi.HttpClientUtil.createClient Creating new http client, config:maxConnectionsPerHost=20&maxConnections=10000&socketTimeout=0&connTimeout=0&retry=false
[junit4:junit4]   2> 4266 T474 oascc.ZkStateReader.updateClusterState Updating cloud state from ZooKeeper... 
[junit4:junit4]   2> 4268 T474 oasc.Overseer$ClusterStateUpdater.updateState Update state numShards=null message={
[junit4:junit4]   2> 	  "operation":"state",
[junit4:junit4]   2> 	  "numShards":null,
[junit4:junit4]   2> 	  "shard":"control_shard",
[junit4:junit4]   2> 	  "roles":null,
[junit4:junit4]   2> 	  "state":"active",
[junit4:junit4]   2> 	  "core":"collection1",
[junit4:junit4]   2> 	  "collection":"control_collection",
[junit4:junit4]   2> 	  "node_name":"127.0.0.1:51582_solr",
[junit4:junit4]   2> 	  "base_url":"http://127.0.0.1:51582/solr"}
[junit4:junit4]   2> 4296 T453 oascc.ZkStateReader.createClusterStateWatchersAndUpdate Updating cluster state from ZooKeeper... 
[junit4:junit4]   2> 4341 T487 oascc.ZkStateReader$2.process A cluster state change has occurred - updating... (2)
[junit4:junit4]   2> 4341 T473 oascc.ZkStateReader$2.process A cluster state change has occurred - updating... (2)
[junit4:junit4]   2> 4353 T453 oasc.CoreContainer.create Creating SolrCore 'collection1' using instanceDir: C:\Users\JenkinsSlave\workspace\Lucene-Solr-4.x-Windows\solr\build\solr-solrj\test\J0\.\solrtest-jetty1-1352355545749\collection1
[junit4:junit4]   2> 4355 T453 oasc.ZkController.createCollectionZkNode Check for collection zkNode:collection1
[junit4:junit4]   2> 4377 T453 oasc.ZkController.createCollectionZkNode Collection zkNode exists
[junit4:junit4]   2> 4378 T453 oasc.ZkController.readConfigName Load collection config from:/collections/collection1
[junit4:junit4]   2> 4384 T453 oasc.SolrResourceLoader.<init> new SolrResourceLoader for directory: 'C:\Users\JenkinsSlave\workspace\Lucene-Solr-4.x-Windows\solr\build\solr-solrj\test\J0\.\solrtest-jetty1-1352355545749\collection1\'
[junit4:junit4]   2> 4435 T453 oasc.SolrConfig.<init> Using Lucene MatchVersion: LUCENE_41
[junit4:junit4]   2> 4491 T453 oasc.SolrConfig.<init> Loaded SolrConfig: solrconfig.xml
[junit4:junit4]   2> 4493 T453 oass.IndexSchema.readSchema Reading Solr Schema
[junit4:junit4]   2> 4499 T453 oass.IndexSchema.readSchema Schema name=test
[junit4:junit4]   2> 5054 T453 oass.IndexSchema.readSchema default search field in schema is text
[junit4:junit4]   2> 5058 T453 oass.IndexSchema.readSchema unique key field: id
[junit4:junit4]   2> 5060 T453 oass.IndexSchema.readSchema WARNING Field text is not multivalued and destination for multiple copyFields (2)
[junit4:junit4]   2> 5061 T453 oass.IndexSchema.readSchema WARNING Field lowerfilt1and2 is not multivalued and destination for multiple copyFields (2)
[junit4:junit4]   2> 5061 T453 oasc.SolrCore.<init> [collection1] Opening new SolrCore at C:\Users\JenkinsSlave\workspace\Lucene-Solr-4.x-Windows\solr\build\solr-solrj\test\J0\.\solrtest-jetty1-1352355545749\collection1\, dataDir=.\org.apache.solr.client.solrj.impl.CloudSolrServerTest-1352355541903/jetty1\
[junit4:junit4]   2> 5062 T453 oasc.SolrCore.<init> JMX monitoring not detected for core: collection1
[junit4:junit4]   2> 5062 T453 oasc.SolrCore.getNewIndexDir New index directory detected: old=null new=.\org.apache.solr.client.solrj.impl.CloudSolrServerTest-1352355541903/jetty1\index/
[junit4:junit4]   2> 5064 T453 oasc.SolrCore.initIndex WARNING [collection1] Solr index directory '.\org.apache.solr.client.solrj.impl.CloudSolrServerTest-1352355541903\jetty1\index' doesn't exist. Creating new index...
[junit4:junit4]   2> 5065 T453 oasc.CachingDirectoryFactory.get return new directory for C:\Users\JenkinsSlave\workspace\Lucene-Solr-4.x-Windows\solr\build\solr-solrj\test\J0\.\org.apache.solr.client.solrj.impl.CloudSolrServerTest-1352355541903\jetty1\index forceNew:false
[junit4:junit4]   2> 5078 T453 oasc.SolrDeletionPolicy.onCommit SolrDeletionPolicy.onCommit: commits:num=1
[junit4:junit4]   2> 		commit{dir=NRTCachingDirectory(org.apache.lucene.store.SimpleFSDirectory@C:\Users\JenkinsSlave\workspace\Lucene-Solr-4.x-Windows\solr\build\solr-solrj\test\J0\org.apache.solr.client.solrj.impl.CloudSolrServerTest-1352355541903\jetty1\index lockFactory=org.apache.lucene.store.NativeFSLockFactory@1b4562e; maxCacheMB=48.0 maxMergeSizeMB=4.0),segFN=segments_1,generation=1,filenames=[segments_1]
[junit4:junit4]   2> 5079 T453 oasc.SolrDeletionPolicy.updateCommits newest commit = 1
[junit4:junit4]   2> 5081 T453 oasc.RequestHandlers.initHandlersFromConfig created /get: solr.RealTimeGetHandler
[junit4:junit4]   2> 5081 T453 oasc.RequestHandlers.initHandlersFromConfig adding lazy requestHandler: solr.ReplicationHandler
[junit4:junit4]   2> 5081 T453 oasc.RequestHandlers.initHandlersFromConfig created /replication: solr.ReplicationHandler
[junit4:junit4]   2> 5082 T453 oasc.RequestHandlers.initHandlersFromConfig created standard: solr.StandardRequestHandler
[junit4:junit4]   2> 5082 T453 oasc.RequestHandlers.initHandlersFromConfig created /update: solr.UpdateRequestHandler
[junit4:junit4]   2> 5082 T453 oasc.RequestHandlers.initHandlersFromConfig created /admin/: org.apache.solr.handler.admin.AdminHandlers
[junit4:junit4]   2> 5091 T453 oashl.XMLLoader.init xsltCacheLifetimeSeconds=60
[junit4:junit4]   2> 5100 T453 oass.SolrIndexSearcher.<init> Opening Searcher@118bdf4 main
[junit4:junit4]   2> 5101 T453 oasu.CommitTracker.<init> Hard AutoCommit: disabled
[junit4:junit4]   2> 5102 T453 oasu.CommitTracker.<init> Soft AutoCommit: disabled
[junit4:junit4]   2> 5104 T453 oasc.ZkController.publish numShards not found on descriptor - reading it from system property
[junit4:junit4]   2> 5105 T488 oasc.SolrCore.registerSearcher [collection1] Registered new searcher Searcher@118bdf4 main{StandardDirectoryReader(segments_1:1)}
[junit4:junit4]   2> 5544 T474 oascc.ZkStateReader.updateClusterState Updating cloud state from ZooKeeper... 
[junit4:junit4]   2> 5545 T474 oasc.Overseer$ClusterStateUpdater.updateState Update state numShards=2 message={
[junit4:junit4]   2> 	  "operation":"state",
[junit4:junit4]   2> 	  "numShards":"2",
[junit4:junit4]   2> 	  "shard":null,
[junit4:junit4]   2> 	  "roles":null,
[junit4:junit4]   2> 	  "state":"down",
[junit4:junit4]   2> 	  "core":"collection1",
[junit4:junit4]   2> 	  "collection":"collection1",
[junit4:junit4]   2> 	  "node_name":"127.0.0.1:51588_solr",
[junit4:junit4]   2> 	  "base_url":"http://127.0.0.1:51588/solr"}
[junit4:junit4]   2> 5545 T474 oasc.Overseer$ClusterStateUpdater.createCollection Create collection collection1 with numShards 2
[junit4:junit4]   2> 5584 T487 oascc.ZkStateReader$2.process A cluster state change has occurred - updating... (2)
[junit4:junit4]   2> 5584 T473 oascc.ZkStateReader$2.process A cluster state change has occurred - updating... (2)
[junit4:junit4]   2> 6039 T453 oasc.CoreContainer.register registering core: collection1
[junit4:junit4]   2> 6039 T453 oasc.ZkController.register Register shard - core:collection1 address:http://127.0.0.1:51588/solr shardId:shard1
[junit4:junit4]   2> 6043 T453 oascc.SolrZkClient.makePath makePath: /collections/collection1/leader_elect/shard1/election
[junit4:junit4]   2> 6135 T459 oazs.PrepRequestProcessor.pRequest Got user-level KeeperException when processing sessionid:0x13adeabf41e0003 type:delete cxid:0x26 zxid:0xfffffffffffffffe txntype:unknown reqpath:n/a Error Path:/solr/collections/collection1/leaders Error:KeeperErrorCode = NoNode for /solr/collections/collection1/leaders
[junit4:junit4]   2> 6162 T453 oasc.ShardLeaderElectionContext.runLeaderProcess Running the leader process.
[junit4:junit4]   2> 6163 T459 oazs.PrepRequestProcessor.pRequest Got user-level KeeperException when processing sessionid:0x13adeabf41e0003 type:create cxid:0x27 zxid:0xfffffffffffffffe txntype:unknown reqpath:n/a Error Path:/solr/overseer Error:KeeperErrorCode = NodeExists for /solr/overseer
[junit4:junit4]   2> 6209 T453 oasc.ShardLeaderElectionContext.waitForReplicasToComeUp Enough replicas found to continue.
[junit4:junit4]   2> 6210 T453 oasc.ShardLeaderElectionContext.runLeaderProcess I may be the new leader - try and sync
[junit4:junit4]   2> 6211 T453 oasc.SyncStrategy.sync Sync replicas to http://127.0.0.1:51588/solr/collection1/
[junit4:junit4]   2> 6211 T453 oasc.SyncStrategy.syncReplicas Sync Success - now sync replicas to me
[junit4:junit4]   2> 6212 T453 oasc.SyncStrategy.syncToMe http://127.0.0.1:51588/solr/collection1/ has no replicas
[junit4:junit4]   2> 6213 T453 oasc.ShardLeaderElectionContext.runLeaderProcess I am the new leader: http://127.0.0.1:51588/solr/collection1/
[junit4:junit4]   2> 6214 T453 oascc.SolrZkClient.makePath makePath: /collections/collection1/leaders/shard1
[junit4:junit4]   2> 6267 T459 oazs.PrepRequestProcessor.pRequest Got user-level KeeperException when processing sessionid:0x13adeabf41e0003 type:create cxid:0x31 zxid:0xfffffffffffffffe txntype:unknown reqpath:n/a Error Path:/solr/overseer Error:KeeperErrorCode = NodeExists for /solr/overseer
[junit4:junit4]   2> 6551 T474 oascc.ZkStateReader.updateClusterState Updating cloud state from ZooKeeper... 
[junit4:junit4]   2> 6650 T487 oascc.ZkStateReader$2.process A cluster state change has occurred - updating... (2)
[junit4:junit4]   2> 6650 T473 oascc.ZkStateReader$2.process A cluster state change has occurred - updating... (2)
[junit4:junit4]   2> 6698 T453 oasc.ZkController.register We are http://127.0.0.1:51588/solr/collection1/ and leader is http://127.0.0.1:51588/solr/collection1/
[junit4:junit4]   2> 6698 T453 oasc.ZkController.register No LogReplay needed for core=collection1 baseURL=http://127.0.0.1:51588/solr
[junit4:junit4]   2> 6700 T453 oasc.ZkController.checkRecovery I am the leader, no recovery necessary
[junit4:junit4]   2> 6700 T453 oasc.ZkController.publish numShards not found on descriptor - reading it from system property
[junit4:junit4]   2> 6716 T453 oascc.ZkStateReader.updateClusterState Updating cloud state from ZooKeeper... 
[junit4:junit4]   2> 6719 T453 oass.SolrDispatchFilter.init user.dir=C:\Users\JenkinsSlave\workspace\Lucene-Solr-4.x-Windows\solr\build\solr-solrj\test\J0
[junit4:junit4]   2> 6719 T453 oass.SolrDispatchFilter.init SolrDispatchFilter.init() done
[junit4:junit4]   2> 6720 T453 oascsi.HttpClientUtil.createClient Creating new http client, config:maxConnections=128&maxConnectionsPerHost=32&followRedirects=false
[junit4:junit4]   2> 6921 T453 oejs.Server.doStart jetty-8.1.7.v20120910
[junit4:junit4]   2> 6924 T453 oejs.AbstractConnector.doStart Started SelectChannelConnector@0.0.0.0:51594
[junit4:junit4]   2> 6925 T453 oasc.SolrResourceLoader.locateSolrHome JNDI not configured for solr (NoInitialContextEx)
[junit4:junit4]   2> 6926 T453 oasc.SolrResourceLoader.locateSolrHome using system property solr.solr.home: C:\Users\JenkinsSlave\workspace\Lucene-Solr-4.x-Windows\solr\build\solr-solrj\test\J0\.\solrtest-jetty2-1352355548632
[junit4:junit4]   2> 6926 T453 oasc.SolrResourceLoader.<init> new SolrResourceLoader for deduced Solr Home: 'C:\Users\JenkinsSlave\workspace\Lucene-Solr-4.x-Windows\solr\build\solr-solrj\test\J0\.\solrtest-jetty2-1352355548632\'
[junit4:junit4]   2> 6953 T453 oass.SolrDispatchFilter.init SolrDispatchFilter.init()
[junit4:junit4]   2> 6953 T453 oasc.SolrResourceLoader.locateSolrHome JNDI not configured for solr (NoInitialContextEx)
[junit4:junit4]   2> 6954 T453 oasc.SolrResourceLoader.locateSolrHome using system property solr.solr.home: C:\Users\JenkinsSlave\workspace\Lucene-Solr-4.x-Windows\solr\build\solr-solrj\test\J0\.\solrtest-jetty2-1352355548632
[junit4:junit4]   2> 6956 T453 oasc.CoreContainer$Initializer.initialize looking for solr.xml: C:\Users\JenkinsSlave\workspace\Lucene-Solr-4.x-Windows\solr\build\solr-solrj\test\J0\.\solrtest-jetty2-1352355548632\solr.xml
[junit4:junit4]   2> 6956 T453 oasc.CoreContainer.<init> New CoreContainer 29947548
[junit4:junit4]   2> 6956 T453 oasc.CoreContainer.load Loading CoreContainer using Solr Home: 'C:\Users\JenkinsSlave\workspace\Lucene-Solr-4.x-Windows\solr\build\solr-solrj\test\J0\.\solrtest-jetty2-1352355548632\'
[junit4:junit4]   2> 6957 T453 oasc.SolrResourceLoader.<init> new SolrResourceLoader for directory: 'C:\Users\JenkinsSlave\workspace\Lucene-Solr-4.x-Windows\solr\build\solr-solrj\test\J0\.\solrtest-jetty2-1352355548632\'
[junit4:junit4]   2> 6988 T453 oasc.CoreContainer.load Registering Log Listener
[junit4:junit4]   2> 7015 T453 oasc.CoreContainer.initZooKeeper Zookeeper client=127.0.0.1:51574/solr
[junit4:junit4]   2> 7016 T453 oaz.ZooKeeper.<init> Initiating client connection, connectString=127.0.0.1:51574/solr sessionTimeout=8000 watcher=org.apache.solr.common.cloud.ConnectionManager@308a4c
[junit4:junit4]   2> 7017 T498 oaz.ClientCnxn$SendThread.startConnect Opening socket connection to server /127.0.0.1:51574
[junit4:junit4]   2> 7017 T453 oascc.ConnectionManager.waitForConnected Waiting for client to connect to ZooKeeper
[junit4:junit4]   2> 7019 T498 oaz.ClientCnxn$SendThread.primeConnection Socket connection established to 127.0.0.1/127.0.0.1:51574, initiating session
[junit4:junit4]   2> 7019 T455 oazs.NIOServerCnxn$Factory.run Accepted socket connection from /127.0.0.1:51599
[junit4:junit4]   2> 7019 T455 oazs.NIOServerCnxn.readConnectRequest Client attempting to establish new session at /127.0.0.1:51599
[junit4:junit4]   2> 7026 T457 oazs.NIOServerCnxn.finishSessionInit Established session 0x13adeabf41e0004 with negotiated timeout 8000 for client /127.0.0.1:51599
[junit4:junit4]   2> 7027 T498 oaz.ClientCnxn$SendThread.readConnectResult Session establishment complete on server 127.0.0.1/127.0.0.1:51574, sessionid = 0x13adeabf41e0004, negotiated timeout = 8000
[junit4:junit4]   2> 7027 T499 oascc.ConnectionManager.process Watcher org.apache.solr.common.cloud.ConnectionManager@308a4c name:ZooKeeperConnection Watcher:127.0.0.1:51574/solr got event WatchedEvent state:SyncConnected type:None path:null path:null type:None
[junit4:junit4]   2> 7027 T453 oascc.ConnectionManager.waitForConnected Client is connected to ZooKeeper
[junit4:junit4]   2> 7027 T459 oazs.PrepRequestProcessor.pRequest Got user-level KeeperException when processing sessionid:0x13adeabf41e0004 type:create cxid:0x1 zxid:0xfffffffffffffffe txntype:unknown reqpath:n/a Error Path:/solr/overseer Error:KeeperErrorCode = NodeExists for /solr/overseer
[junit4:junit4]   2> 7038 T459 oazs.PrepRequestProcessor.pRequest Got user-level KeeperException when processing sessionid:0x13adeabf41e0004 type:create cxid:0x2 zxid:0xfffffffffffffffe txntype:unknown reqpath:n/a Error Path:/solr/overseer Error:KeeperErrorCode = NodeExists for /solr/overseer
[junit4:junit4]   2> 7040 T453 oasc.ZkController.createEphemeralLiveNode Register node as live in ZooKeeper:/live_nodes/127.0.0.1:51594_solr
[junit4:junit4]   2> 7041 T459 oazs.PrepRequestProcessor.pRequest Got user-level KeeperException when processing sessionid:0x13adeabf41e0004 type:delete cxid:0x4 zxid:0xfffffffffffffffe txntype:unknown reqpath:n/a Error Path:/solr/live_nodes/127.0.0.1:51594_solr Error:KeeperErrorCode = NoNode for /solr/live_nodes/127.0.0.1:51594_solr
[junit4:junit4]   2> 7043 T453 oascc.SolrZkClient.makePath makePath: /live_nodes/127.0.0.1:51594_solr
[junit4:junit4]   2> 7048 T487 oascc.ZkStateReader$3.process Updating live nodes... (3)
[junit4:junit4]   2> 7048 T473 oascc.ZkStateReader$3.process Updating live nodes... (3)
[junit4:junit4]   2> 7049 T453 oashc.HttpShardHandlerFactory.getParameter Setting socketTimeout to: 0
[junit4:junit4]   2> 7049 T453 oashc.HttpShardHandlerFactory.getParameter Setting urlScheme to: http://
[junit4:junit4]   2> 7049 T453 oashc.HttpShardHandlerFactory.getParameter Setting connTimeout to: 0
[junit4:junit4]   2> 7050 T453 oashc.HttpShardHandlerFactory.getParameter Setting maxConnectionsPerHost to: 20
[junit4:junit4]   2> 7050 T453 oashc.HttpShardHandlerFactory.getParameter Setting corePoolSize to: 0
[junit4:junit4]   2> 7050 T453 oashc.HttpShardHandlerFactory.getParameter Setting maximumPoolSize to: 2147483647
[junit4:junit4]   2> 7050 T453 oashc.HttpShardHandlerFactory.getParameter Setting maxThreadIdleTime to: 5
[junit4:junit4]   2> 7050 T453 oashc.HttpShardHandlerFactory.getParameter Setting sizeOfQueue to: -1
[junit4:junit4]   2> 7050 T453 oashc.HttpShardHandlerFactory.getParameter Setting fairnessPolicy to: false
[junit4:junit4]   2> 7050 T453 oascsi.HttpClientUtil.createClient Creating new http client, config:maxConnectionsPerHost=20&maxConnections=10000&socketTimeout=0&connTimeout=0&retry=false
[junit4:junit4]   2> 7078 T453 oascc.ZkStateReader.createClusterStateWatchersAndUpdate Updating cluster state from ZooKeeper... 
[junit4:junit4]   2> 7088 T453 oasc.CoreContainer.create Creating SolrCore 'collection1' using instanceDir: C:\Users\JenkinsSlave\workspace\Lucene-Solr-4.x-Windows\solr\build\solr-solrj\test\J0\.\solrtest-jetty2-1352355548632\collection1
[junit4:junit4]   2> 7088 T453 oasc.ZkController.createCollectionZkNode Check for collection zkNode:collection1
[junit4:junit4]   2> 7090 T453 oasc.ZkController.createCollectionZkNode Collection zkNode exists
[junit4:junit4]   2> 7090 T453 oasc.ZkController.readConfigName Load collection config from:/collections/collection1
[junit4:junit4]   2> 7094 T453 oasc.SolrResourceLoader.<init> new SolrResourceLoader for directory: 'C:\Users\JenkinsSlave\workspace\Lucene-Solr-4.x-Windows\solr\build\solr-solrj\test\J0\.\solrtest-jetty2-1352355548632\collection1\'
[junit4:junit4]   2> 7139 T453 oasc.SolrConfig.<init> Using Lucene MatchVersion: LUCENE_41
[junit4:junit4]   2> 7156 T474 oascc.ZkStateReader.updateClusterState Updating cloud state from ZooKeeper... 
[junit4:junit4]   2> 7157 T474 oasc.Overseer$ClusterStateUpdater.updateState Update state numShards=2 message={
[junit4:junit4]   2> 	  "operation":"state",
[junit4:junit4]   2> 	  "numShards":"2",
[junit4:junit4]   2> 	  "shard":"shard1",
[junit4:junit4]   2> 	  "roles":null,
[junit4:junit4]   2> 	  "state":"active",
[junit4:junit4]   2> 	  "core":"collection1",
[junit4:junit4]   2> 	  "collection":"collection1",
[junit4:junit4]   2> 	  "node_name":"127.0.0.1:51588_solr",
[junit4:junit4]   2> 	  "base_url":"http://127.0.0.1:51588/solr"}
[junit4:junit4]   2> 7197 T487 oascc.ZkStateReader$2.process A cluster state change has occurred - updating... (3)
[junit4:junit4]   2> 7198 T499 oascc.ZkStateReader$2.process A cluster state change has occurred - updating... (3)
[junit4:junit4]   2> 7198 T473 oascc.ZkStateReader$2.process A cluster state change has occurred - updating... (3)
[junit4:junit4]   2> 7205 T453 oasc.SolrConfig.<init> Loaded SolrConfig: solrconfig.xml
[junit4:junit4]   2> 7207 T453 oass.IndexSchema.readSchema Reading Solr Schema
[junit4:junit4]   2> 7214 T453 oass.IndexSchema.readSchema Schema name=test
[junit4:junit4]   2> 7781 T453 oass.IndexSchema.readSchema default search field in schema is text
[junit4:junit4]   2> 7785 T453 oass.IndexSchema.readSchema unique key field: id
[junit4:junit4]   2> 7787 T453 oass.IndexSchema.readSchema WARNING Field text is not multivalued and destination for multiple copyFields (2)
[junit4:junit4]   2> 7788 T453 oass.IndexSchema.readSchema WARNING Field lowerfilt1and2 is not multivalued and destination for multiple copyFields (2)
[junit4:junit4]   2> 7788 T453 oasc.SolrCore.<init> [collection1] Opening new SolrCore at C:\Users\JenkinsSlave\workspace\Lucene-Solr-4.x-Windows\solr\build\solr-solrj\test\J0\.\solrtest-jetty2-1352355548632\collection1\, dataDir=.\org.apache.solr.client.solrj.impl.CloudSolrServerTest-1352355541903/jetty2\
[junit4:junit4]   2> 7789 T453 oasc.SolrCore.<init> JMX monitoring not detected for core: collection1
[junit4:junit4]   2> 7790 T453 oasc.SolrCore.getNewIndexDir New index directory detected: old=null new=.\org.apache.solr.client.solrj.impl.CloudSolrServerTest-1352355541903/jetty2\index/
[junit4:junit4]   2> 7790 T453 oasc.SolrCore.initIndex WARNING [collection1] Solr index directory '.\org.apache.solr.client.solrj.impl.CloudSolrServerTest-1352355541903\jetty2\index' doesn't exist. Creating new index...
[junit4:junit4]   2> 7791 T453 oasc.CachingDirectoryFactory.get return new directory for C:\Users\JenkinsSlave\workspace\Lucene-Solr-4.x-Windows\solr\build\solr-solrj\test\J0\.\org.apache.solr.client.solrj.impl.CloudSolrServerTest-1352355541903\jetty2\index forceNew:false
[junit4:junit4]   2> 7831 T453 oasc.SolrDeletionPolicy.onCommit SolrDeletionPolicy.onCommit: commits:num=1
[junit4:junit4]   2> 		commit{dir=NRTCachingDirectory(org.apache.lucene.store.SimpleFSDirectory@C:\Users\JenkinsSlave\workspace\Lucene-Solr-4.x-Windows\solr\build\solr-solrj\test\J0\org.apache.solr.client.solrj.impl.CloudSolrServerTest-1352355541903\jetty2\index lockFactory=org.apache.lucene.store.NativeFSLockFactory@5e9713; maxCacheMB=48.0 maxMergeSizeMB=4.0),segFN=segments_1,generation=1,filenames=[segments_1]
[junit4:junit4]   2> 7832 T453 oasc.SolrDeletionPolicy.updateCommits newest commit = 1
[junit4:junit4]   2> 7836 T453 oasc.RequestHandlers.initHandlersFromConfig created /get: solr.RealTimeGetHandler
[junit4:junit4]   2> 7837 T453 oasc.RequestHandlers.initHandlersFromConfig adding lazy requestHandler: solr.ReplicationHandler
[junit4:junit4]   2> 7837 T453 oasc.RequestHandlers.initHandlersFromConfig created /replication: solr.ReplicationHandler
[junit4:junit4]   2> 7837 T453 oasc.RequestHandlers.initHandlersFromConfig created standard: solr.StandardRequestHandler
[junit4:junit4]   2> 7838 T453 oasc.RequestHandlers.initHandlersFromConfig created /update: solr.UpdateRequestHandler
[junit4:junit4]   2> 7838 T453 oasc.RequestHandlers.initHandlersFromConfig created /admin/: org.apache.solr.handler.admin.AdminHandlers
[junit4:junit4]   2> 7848 T453 oashl.XMLLoader.init xsltCacheLifetimeSeconds=60
[junit4:junit4]   2> 7855 T453 oass.SolrIndexSearcher.<init> Opening Searcher@ad0a53 main
[junit4:junit4]   2> 7855 T453 oasu.CommitTracker.<init> Hard AutoCommit: disabled
[junit4:junit4]   2> 7856 T453 oasu.CommitTracker.<init> Soft AutoCommit: disabled
[junit4:junit4]   2> 7857 T500 oasc.SolrCore.registerSearcher [collection1] Registered new searcher Searcher@ad0a53 main{StandardDirectoryReader(segments_1:1)}
[junit4:junit4]   2> 7857 T453 oasc.ZkController.publish numShards not found on descriptor - reading it from system property
[junit4:junit4]   2> 8145 T474 oascc.ZkStateReader.updateClusterState Updating cloud state from ZooKeeper... 
[junit4:junit4]   2> 8147 T474 oasc.Overseer$ClusterStateUpdater.updateState Update state numShards=2 message={
[junit4:junit4]   2> 	  "operation":"state",
[junit4:junit4]   2> 	  "numShards":"2",
[junit4:junit4]   2> 	  "shard":null,
[junit4:junit4]   2> 	  "roles":null,
[junit4:junit4]   2> 	  "state":"down",
[junit4:junit4]   2> 	  "core":"collection1",
[junit4:junit4]   2> 	  "collection":"collection1",
[junit4:junit4]   2> 	  "node_name":"127.0.0.1:51594_solr",
[junit4:junit4]   2> 	  "base_url":"http://127.0.0.1:51594/solr"}
[junit4:junit4]   2> 8207 T487 oascc.ZkStateReader$2.process A cluster state change has occurred - updating... (3)
[junit4:junit4]   2> 8208 T473 oascc.ZkStateReader$2.process A cluster state change has occurred - updating... (3)
[junit4:junit4]   2> 8208 T499 oascc.ZkStateReader$2.process A cluster state change has occurred - updating... (3)
[junit4:junit4]   2> 8329 T453 oasc.CoreContainer.register registering core: collection1
[junit4:junit4]   2> 8329 T453 oasc.ZkController.register Register shard - core:collection1 address:http://127.0.0.1:51594/solr shardId:shard2
[junit4:junit4]   2> 8331 T453 oascc.SolrZkClient.makePath makePath: /collections/collection1/leader_elect/shard2/election
[junit4:junit4]   2> 8386 T459 oazs.PrepRequestProcessor.pRequest Got user-level KeeperException when processing sessionid:0x13adeabf41e0004 type:delete cxid:0x25 zxid:0xfffffffffffffffe txntype:unknown reqpath:n/a Error Path:/solr/collections/collection1/leaders/shard2 Error:KeeperErrorCode = NoNode for /solr/collections/collection1/leaders/shard2
[junit4:junit4]   2> 8394 T453 oasc.ShardLeaderElectionContext.runLeaderProcess Running the leader process.
[junit4:junit4]   2> 8396 T459 oazs.PrepRequestProcessor.pRequest Got user-level KeeperException when processing sessionid:0x13adeabf41e0004 type:create cxid:0x26 zxid:0xfffffffffffffffe txntype:unknown reqpath:n/a Error Path:/solr/overseer Error:KeeperErrorCode = NodeExists for /solr/overseer
[junit4:junit4]   2> 8432 T453 oasc.ShardLeaderElectionContext.waitForReplicasToComeUp Enough replicas found to continue.
[junit4:junit4]   2> 8432 T453 oasc.ShardLeaderElectionContext.runLeaderProcess I may be the new leader - try and sync
[junit4:junit4]   2> 8432 T453 oasc.SyncStrategy.sync Sync replicas to http://127.0.0.1:51594/solr/collection1/
[junit4:junit4]   2> 8433 T453 oasc.SyncStrategy.syncReplicas Sync Success - now sync replicas to me
[junit4:junit4]   2> 8433 T453 oasc.SyncStrategy.syncToMe http://127.0.0.1:51594/solr/collection1/ has no replicas
[junit4:junit4]   2> 8433 T453 oasc.ShardLeaderElectionContext.runLeaderProcess I am the new leader: http://127.0.0.1:51594/solr/collection1/
[junit4:junit4]   2> 8433 T453 oascc.SolrZkClient.makePath makePath: /collections/collection1/leaders/shard2
[junit4:junit4]   2> 8450 T459 oazs.PrepRequestProcessor.pRequest Got user-level KeeperException when processing sessionid:0x13adeabf41e0004 type:create cxid:0x2f zxid:0xfffffffffffffffe txntype:unknown reqpath:n/a Error Path:/solr/overseer Error:KeeperErrorCode = NodeExists for /solr/overseer
[junit4:junit4]   2> 8708 T474 oascc.ZkStateReader.updateClusterState Updating cloud state from ZooKeeper... 
[junit4:junit4]   2> 8795 T487 oascc.ZkStateReader$2.process A cluster state change has occurred - updating... (3)
[junit4:junit4]   2> 8795 T473 oascc.ZkStateReader$2.process A cluster state change has occurred - updating... (3)
[junit4:junit4]   2> 8795 T499 oascc.ZkStateReader$2.process A cluster state change has occurred - updating... (3)
[junit4:junit4]   2> 8810 T453 oasc.ZkController.register We are http://127.0.0.1:51594/solr/collection1/ and leader is http://127.0.0.1:51594/solr/collection1/
[junit4:junit4]   2> 8810 T453 oasc.ZkController.register No LogReplay needed for core=collection1 baseURL=http://127.0.0.1:51594/solr
[junit4:junit4]   2> 8811 T453 oasc.ZkController.checkRecovery I am the leader, no recovery necessary
[junit4:junit4]   2> 8811 T453 oasc.ZkController.publish numShards not found on descriptor - reading it from system property
[junit4:junit4]   2> 8813 T453 oascc.ZkStateReader.updateClusterState Updating cloud state from ZooKeeper... 
[junit4:junit4]   2> 8814 T453 oass.SolrDispatchFilter.init user.dir=C:\Users\JenkinsSlave\workspace\Lucene-Solr-4.x-Windows\solr\build\solr-solrj\test\J0
[junit4:junit4]   2> 8815 T453 oass.SolrDispatchFilter.init SolrDispatchFilter.init() done
[junit4:junit4]   2> 8815 T453 oascsi.HttpClientUtil.createClient Creating new http client, config:maxConnections=128&maxConnectionsPerHost=32&followRedirects=false
[junit4:junit4]   2> 8995 T453 oejs.Server.doStart jetty-8.1.7.v20120910
[junit4:junit4]   2> 8998 T453 oejs.AbstractConnector.doStart Started SelectChannelConnector@0.0.0.0:51600
[junit4:junit4]   2> 9000 T453 oasc.SolrResourceLoader.locateSolrHome JNDI not configured for solr (NoInitialContextEx)
[junit4:junit4]   2> 9000 T453 oasc.SolrResourceLoader.locateSolrHome using system property solr.solr.home: C:\Users\JenkinsSlave\workspace\Lucene-Solr-4.x-Windows\solr\build\solr-solrj\test\J0\.\solrtest-jetty3-1352355550715
[junit4:junit4]   2> 9001 T453 oasc.SolrResourceLoader.<init> new SolrResourceLoader for deduced Solr Home: 'C:\Users\JenkinsSlave\workspace\Lucene-Solr-4.x-Windows\solr\build\solr-solrj\test\J0\.\solrtest-jetty3-1352355550715\'
[junit4:junit4]   2> 9039 T453 oass.SolrDispatchFilter.init SolrDispatchFilter.init()
[junit4:junit4]   2> 9039 T453 oasc.SolrResourceLoader.locateSolrHome JNDI not configured for solr (NoInitialContextEx)
[junit4:junit4]   2> 9040 T453 oasc.SolrResourceLoader.locateSolrHome using system property solr.solr.home: C:\Users\JenkinsSlave\workspace\Lucene-Solr-4.x-Windows\solr\build\solr-solrj\test\J0\.\solrtest-jetty3-1352355550715
[junit4:junit4]   2> 9040 T453 oasc.CoreContainer$Initializer.initialize looking for solr.xml: C:\Users\JenkinsSlave\workspace\Lucene-Solr-4.x-Windows\solr\build\solr-solrj\test\J0\.\solrtest-jetty3-1352355550715\solr.xml
[junit4:junit4]   2> 9040 T453 oasc.CoreContainer.<init> New CoreContainer 13742686
[junit4:junit4]   2> 9041 T453 oasc.CoreContainer.load Loading CoreContainer using Solr Home: 'C:\Users\JenkinsSlave\workspace\Lucene-Solr-4.x-Windows\solr\build\solr-solrj\test\J0\.\solrtest-jetty3-1352355550715\'
[junit4:junit4]   2> 9041 T453 oasc.SolrResourceLoader.<init> new SolrResourceLoader for directory: 'C:\Users\JenkinsSlave\workspace\Lucene-Solr-4.x-Windows\solr\build\solr-solrj\test\J0\.\solrtest-jetty3-1352355550715\'
[junit4:junit4]   2> 9066 T453 oasc.CoreContainer.load Registering Log Listener
[junit4:junit4]   2> 9083 T453 oasc.CoreContainer.initZooKeeper Zookeeper client=127.0.0.1:51574/solr
[junit4:junit4]   2> 9083 T453 oaz.ZooKeeper.<init> Initiating client connection, connectString=127.0.0.1:51574/solr sessionTimeout=8000 watcher=org.apache.solr.common.cloud.ConnectionManager@134c2ff
[junit4:junit4]   2> 9085 T510 oaz.ClientCnxn$SendThread.startConnect Opening socket connection to server /127.0.0.1:51574
[junit4:junit4]   2> 9085 T453 oascc.ConnectionManager.waitForConnected Waiting for client to connect to ZooKeeper
[junit4:junit4]   2> 9086 T455 oazs.NIOServerCnxn$Factory.run Accepted socket connection from /127.0.0.1:51605
[junit4:junit4]   2> 9086 T510 oaz.ClientCnxn$SendThread.primeConnection Socket connection established to 127.0.0.1/127.0.0.1:51574, initiating session
[junit4:junit4]   2> 9087 T455 oazs.NIOServerCnxn.readConnectRequest Client attempting to establish new session at /127.0.0.1:51605
[junit4:junit4]   2> 9117 T457 oazs.NIOServerCnxn.finishSessionInit Established session 0x13adeabf41e0005 with negotiated timeout 8000 for client /127.0.0.1:51605
[junit4:junit4]   2> 9117 T510 oaz.ClientCnxn$SendThread.readConnectResult Session establishment complete on server 127.0.0.1/127.0.0.1:51574, sessionid = 0x13adeabf41e0005, negotiated timeout = 8000
[junit4:junit4]   2> 9118 T511 oascc.ConnectionManager.process Watcher org.apache.solr.common.cloud.ConnectionManager@134c2ff name:ZooKeeperConnection Watcher:127.0.0.1:51574/solr got event WatchedEvent state:SyncConnected type:None path:null path:null type:None
[junit4:junit4]   2> 9119 T453 oascc.ConnectionManager.waitForConnected Client is connected to ZooKeeper
[junit4:junit4]   2> 9121 T459 oazs.PrepRequestProcessor.pRequest Got user-level KeeperException when processing sessionid:0x13adeabf41e0005 type:create cxid:0x1 zxid:0xfffffffffffffffe txntype:unknown reqpath:n/a Error Path:/solr/overseer Error:KeeperErrorCode = NodeExists for /solr/overseer
[junit4:junit4]   2> 9146 T459 oazs.PrepRequestProcessor.pRequest Got user-level KeeperException when processing sessionid:0x13adeabf41e0005 type:create cxid:0x2 zxid:0xfffffffffffffffe txntype:unknown reqpath:n/a Error Path:/solr/overseer Error:KeeperErrorCode = NodeExists for /solr/overseer
[junit4:junit4]   2> 9174 T453 oasc.ZkController.createEphemeralLiveNode Register node as live in ZooKeeper:/live_nodes/127.0.0.1:51600_solr
[junit4:junit4]   2> 9176 T459 oazs.PrepRequestProcessor.pRequest Got user-level KeeperException when processing sessionid:0x13adeabf41e0005 type:delete cxid:0x4 zxid:0xfffffffffffffffe txntype:unknown reqpath:n/a Error Path:/solr/live_nodes/127.0.0.1:51600_solr Error:KeeperErrorCode = NoNode for /solr/live_nodes/127.0.0.1:51600_solr
[junit4:junit4]   2> 9192 T453 oascc.SolrZkClient.makePath makePath: /live_nodes/127.0.0.1:51600_solr
[junit4:junit4]   2> 9212 T487 oascc.ZkStateReader$3.process Updating live nodes... (4)
[junit4:junit4]   2> 9212 T499 oascc.ZkStateReader$3.process Updating live nodes... (4)
[junit4:junit4]   2> 9213 T473 oascc.ZkStateReader$3.process Updating live nodes... (4)
[junit4:junit4]   2> 9215 T453 oashc.HttpShardHandlerFactory.getParameter Setting socketTimeout to: 0
[junit4:junit4]   2> 9215 T453 oashc.HttpShardHandlerFactory.getParameter Setting urlScheme to: http://
[junit4:junit4]   2> 9217 T453 oashc.HttpShardHandlerFactory.getParameter Setting connTimeout to: 0
[junit4:junit4]   2> 9217 T453 oashc.HttpShardHandlerFactory.getParameter Setting maxConnectionsPerHost to: 20
[junit4:junit4]   2> 9217 T453 oashc.HttpShardHandlerFactory.getParameter Setting corePoolSize to: 0
[junit4:junit4]   2> 9217 T453 oashc.HttpShardHandlerFactory.getParameter Setting maximumPoolSize to: 2147483647
[junit4:junit4]   2> 9218 T453 oashc.HttpShardHandlerFactory.getParameter Setting maxThreadIdleTime to: 5
[junit4:junit4]   2> 9218 T453 oashc.HttpShardHandlerFactory.getParameter Setting sizeOfQueue to: -1
[junit4:junit4]   2> 9219 T453 oashc.HttpShardHandlerFactory.getParameter Setting fairnessPolicy to: false
[junit4:junit4]   2> 9221 T453 oascsi.HttpClientUtil.createClient Creating new http client, config:maxConnectionsPerHost=20&maxConnections=10000&socketTimeout=0&connTimeout=0&retry=false
[junit4:junit4]   2> 9257 T453 oascc.ZkStateReader.createClusterStateWatchersAndUpdate Updating cluster state from ZooKeeper... 
[junit4:junit4]   2> 9265 T453 oasc.CoreContainer.create Creating SolrCore 'collection1' using instanceDir: C:\Users\JenkinsSlave\workspace\Lucene-Solr-4.x-Windows\solr\build\solr-solrj\test\J0\.\solrtest-jetty3-1352355550715\collection1
[junit4:junit4]   2> 9265 T453 oasc.ZkController.createCollectionZkNode Check for collection zkNode:collection1
[junit4:junit4]   2> 9266 T453 oasc.ZkController.createCollectionZkNode Collection zkNode exists
[junit4:junit4]   2> 9267 T453 oasc.ZkController.readConfigName Load collection config from:/collections/collection1
[junit4:junit4]   2> 9269 T453 oasc.SolrResourceLoader.<init> new SolrResourceLoader for directory: 'C:\Users\JenkinsSlave\workspace\Lucene-Solr-4.x-Windows\solr\build\solr-solrj\test\J0\.\solrtest-jetty3-1352355550715\collection1\'
[junit4:junit4]   2> 9270 T474 oascc.ZkStateReader.updateClusterState Updating cloud state from ZooKeeper... 
[junit4:junit4]   2> 9272 T474 oasc.Overseer$ClusterStateUpdater.updateState Update state numShards=2 message={
[junit4:junit4]   2> 	  "operation":"state",
[junit4:junit4]   2> 	  "numShards":"2",
[junit4:junit4]   2> 	  "shard":"shard2",
[junit4:junit4]   2> 	  "roles":null,
[junit4:junit4]   2> 	  "state":"active",
[junit4:junit4]   2> 	  "core":"collection1",
[junit4:junit4]   2> 	  "collection":"collection1",
[junit4:junit4]   2> 	  "node_name":"127.0.0.1:51594_solr",
[junit4:junit4]   2> 	  "base_url":"http://127.0.0.1:51594/solr"}
[junit4:junit4]   2> 9338 T453 oasc.SolrConfig.<init> Using Lucene MatchVersion: LUCENE_41
[junit4:junit4]   2> 9364 T499 oascc.ZkStateReader$2.process A cluster state change has occurred - updating... (4)
[junit4:junit4]   2> 9365 T487 oascc.ZkStateReader$2.process A cluster state change has occurred - updating... (4)
[junit4:junit4]   2> 9365 T511 oascc.ZkStateReader$2.process A cluster state change has occurred - updating... (4)
[junit4:junit4]   2> 9366 T473 oascc.ZkStateReader$2.process A cluster state change has occurred - updating... (4)
[junit4:junit4]   2> 9387 T453 oasc.SolrConfig.<init> Loaded SolrConfig: solrconfig.xml
[junit4:junit4]   2> 9389 T453 oass.IndexSchema.readSchema Reading Solr Schema
[junit4:junit4]   2> 9395 T453 oass.IndexSchema.readSchema Schema name=test
[junit4:junit4]   2> 9842 T453 oass.IndexSchema.readSchema default search field in schema is text
[junit4:junit4]   2> 9846 T453 oass.IndexSchema.readSchema unique key field: id
[junit4:junit4]   2> 9848 T453 oass.IndexSchema.readSchema WARNING Field text is not multivalued and destination for multiple copyFields (2)
[junit4:junit4]   2> 9849 T453 oass.IndexSchema.readSchema WARNING Field lowerfilt1and2 is not multivalued and destination for multiple copyFields (2)
[junit4:junit4]   2> 9849 T453 oasc.SolrCore.<init> [collection1] Opening new SolrCore at C:\Users\JenkinsSlave\workspace\Lucene-Solr-4.x-Windows\solr\build\solr-solrj\test\J0\.\solrtest-jetty3-1352355550715\collection1\, dataDir=.\org.apache.solr.client.solrj.impl.CloudSolrServerTest-1352355541903/jetty3\
[junit4:junit4]   2> 9850 T453 oasc.SolrCore.<init> JMX monitoring not detected for core: collection1
[junit4:junit4]   2> 9852 T453 oasc.SolrCore.getNewIndexDir New index directory detected: old=null new=.\org.apache.solr.client.solrj.impl.CloudSolrServerTest-1352355541903/jetty3\index/
[junit4:junit4]   2> 9853 T453 oasc.SolrCore.initIndex WARNING [collection1] Solr index directory '.\org.apache.solr.client.solrj.impl.CloudSolrServerTest-1352355541903\jetty3\index' doesn't exist. Creating new index...
[junit4:junit4]   2> 9854 T453 oasc.CachingDirectoryFactory.get return new directory for C:\Users\JenkinsSlave\workspace\Lucene-Solr-4.x-Windows\solr\build\solr-solrj\test\J0\.\org.apache.solr.client.solrj.impl.CloudSolrServerTest-1352355541903\jetty3\index forceNew:false
[junit4:junit4]   2> 9879 T453 oasc.SolrDeletionPolicy.onCommit SolrDeletionPolicy.onCommit: commits:num=1
[junit4:junit4]   2> 		commit{dir=NRTCachingDirectory(org.apache.lucene.store.SimpleFSDirectory@C:\Users\JenkinsSlave\workspace\Lucene-Solr-4.x-Windows\solr\build\solr-solrj\test\J0\org.apache.solr.client.solrj.impl.CloudSolrServerTest-1352355541903\jetty3\index lockFactory=org.apache.lucene.store.NativeFSLockFactory@180bc1a; maxCacheMB=48.0 maxMergeSizeMB=4.0),segFN=segments_1,generation=1,filenames=[segments_1]
[junit4:junit4]   2> 9879 T453 oasc.SolrDeletionPolicy.updateCommits newest commit = 1
[junit4:junit4]   2> 9883 T453 oasc.RequestHandlers.initHandlersFromConfig created /get: solr.RealTimeGetHandler
[junit4:junit4]   2> 9883 T453 oasc.RequestHandlers.initHandlersFromConfig adding lazy requestHandler: solr.ReplicationHandler
[junit4:junit4]   2> 9883 T453 oasc.RequestHandlers.initHandlersFromConfig created /replication: solr.ReplicationHandler
[junit4:junit4]   2> 9884 T453 oasc.RequestHandlers.initHandlersFromConfig created standard: solr.StandardRequestHandler
[junit4:junit4]   2> 9884 T453 oasc.RequestHandlers.initHandlersFromConfig created /update: solr.UpdateRequestHandler
[junit4:junit4]   2> 9885 T453 oasc.RequestHandlers.initHandlersFromConfig created /admin/: org.apache.solr.handler.admin.AdminHandlers
[junit4:junit4]   2> 9894 T453 oashl.XMLLoader.init xsltCacheLifetimeSeconds=60
[junit4:junit4]   2> 9902 T453 oass.SolrIndexSearcher.<init> Opening Searcher@111904b main
[junit4:junit4]   2> 9904 T453 oasu.CommitTracker.<init> Hard AutoCommit: disabled
[junit4:junit4]   2> 9904 T453 oasu.CommitTracker.<init> Soft AutoCommit: disabled
[junit4:junit4]   2> 9906 T512 oasc.SolrCore.registerSearcher [collection1] Registered new searcher Searcher@111904b main{StandardDirectoryReader(segments_1:1)}
[junit4:junit4]   2> 9906 T453 oasc.ZkController.publish numShards not found on descriptor - reading it from system property
[junit4:junit4]   2> 10314 T474 oascc.ZkStateReader.updateClusterState Updating cloud state from ZooKeeper... 
[junit4:junit4]   2> 10317 T474 oasc.Overseer$ClusterStateUpdater.updateState Update state numShards=2 message={
[junit4:junit4]   2> 	  "operation":"state",
[junit4:junit4]   2> 	  "numShards":"2",
[junit4:junit4]   2> 	  "shard":null,
[junit4:junit4]   2> 	  "roles":null,
[junit4:junit4]   2> 	  "state":"down",
[junit4:junit4]   2> 	  "core":"collection1",
[junit4:junit4]   2> 	  "collection":"collection1",
[junit4:junit4]   2> 	  "node_name":"127.0.0.1:51600_solr",
[junit4:junit4]   2> 	  "base_url":"http://127.0.0.1:51600/solr"}
[junit4:junit4]   2> 10349 T499 oascc.ZkStateReader$2.process A cluster state change has occurred - updating... (4)
[junit4:junit4]   2> 10349 T487 oascc.ZkStateReader$2.process A cluster state change has occurred - updating... (4)
[junit4:junit4]   2> 10349 T473 oascc.ZkStateReader$2.process A cluster state change has occurred - updating... (4)
[junit4:junit4]   2> 10350 T511 oascc.ZkStateReader$2.process A cluster state change has occurred - updating... (4)
[junit4:junit4]   2> 10374 T453 oasc.CoreContainer.register registering core: collection1
[junit4:junit4]   2> 10374 T453 oasc.ZkController.register Register shard - core:collection1 address:http://127.0.0.1:51600/solr shardId:shard1
[junit4:junit4]   2> 10388 T453 oasc.ZkController.register We are http://127.0.0.1:51600/solr/collection1/ and leader is http://127.0.0.1:51588/solr/collection1/
[junit4:junit4]   2> 10388 T453 oasc.ZkController.register No LogReplay needed for core=collection1 baseURL=http://127.0.0.1:51600/solr
[junit4:junit4]   2> 10388 T453 oasc.ZkController.checkRecovery Core needs to recover:collection1
[junit4:junit4]   2> 10389 T453 oasu.DefaultSolrCoreState.doRecovery Running recovery - first canceling any ongoing recovery
[junit4:junit4]   2> ASYNC  NEW_CORE C42 name=collection1 org.apache.solr.core.SolrCore@1ae86c url=http://127.0.0.1:51600/solr/collection1 node=127.0.0.1:51600_solr
[junit4:junit4]   2> 10391 T513 C42 P51600 oasc.RecoveryStrategy.run Starting recovery process.  core=collection1 recoveringAfterStartup=true
[junit4:junit4]   2> 10392 T513 C42 P51600 oasc.RecoveryStrategy.doRecovery ###### startupVersions=[]
[junit4:junit4]   2> 10392 T513 C42 P51600 oasc.ZkController.publish numShards not found on descriptor - reading it from system property
[junit4:junit4]   2> 10392 T453 oascc.ZkStateReader.updateClusterState Updating cloud state from ZooKeeper... 
[junit4:junit4]   2> 10395 T513 C42 P51600 oasc.RecoveryStrategy.doRecovery Attempting to PeerSync from http://127.0.0.1:51588/solr/collection1/ core=collection1 - recoveringAfterStartup=true
[junit4:junit4]   2> 10396 T453 oass.SolrDispatchFilter.init user.dir=C:\Users\JenkinsSlave\workspace\Lucene-Solr-4.x-Windows\solr\build\solr-solrj\test\J0
[junit4:junit4]   2> 10396 T453 oass.SolrDispatchFilter.init SolrDispatchFilter.init() done
[junit4:junit4]   2> 10398 T453 oascsi.HttpClientUtil.createClient Creating new http client, config:maxConnections=128&maxConnectionsPerHost=32&followRedirects=false
[junit4:junit4]   2> 10411 T513 C42 P51600 oascsi.HttpClientUtil.createClient Creating new http client, config:maxConnectionsPerHost=20&maxConnections=10000&connTimeout=30000&socketTimeout=30000&retry=false
[junit4:junit4]   2> 10424 T513 C42 P51600 oasu.PeerSync.sync PeerSync: core=collection1 url=http://127.0.0.1:51600/solr START replicas=[http://127.0.0.1:51588/solr/collection1/] nUpdates=100
[junit4:junit4]   2> 10424 T513 C42 P51600 oasu.PeerSync.sync WARNING no frame of reference to tell of we've missed updates
[junit4:junit4]   2> 10427 T513 C42 P51600 oasc.RecoveryStrategy.doRecovery PeerSync Recovery was not successful - trying replication. core=collection1
[junit4:junit4]   2> 10427 T513 C42 P51600 oasc.RecoveryStrategy.doRecovery Starting Replication Recovery. core=collection1
[junit4:junit4]   2> 10427 T513 C42 P51600 oascsi.HttpClientUtil.createClient Creating new http client, config:maxConnections=128&maxConnectionsPerHost=32&followRedirects=false
[junit4:junit4]   2> ASYNC  NEW_CORE C43 name=collection1 org.apache.solr.core.SolrCore@1998b39 url=http://127.0.0.1:51588/solr/collection1 node=127.0.0.1:51588_solr
[junit4:junit4]   2> 10439 T483 C43 P51588 REQ /get {distrib=false&qt=/get&wt=javabin&version=2&getVersions=100} status=0 QTime=0 
[junit4:junit4]   2> 10581 T453 oejs.Server.doStart jetty-8.1.7.v20120910
[junit4:junit4]   2> 10590 T453 oejs.AbstractConnector.doStart Started SelectChannelConnector@0.0.0.0:51608
[junit4:junit4]   2> 10591 T453 oasc.SolrResourceLoader.locateSolrHome JNDI not configured for solr (NoInitialContextEx)
[junit4:junit4]   2> 10591 T453 oasc.SolrResourceLoader.locateSolrHome using system property solr.solr.home: C:\Users\JenkinsSlave\workspace\Lucene-Solr-4.x-Windows\solr\build\solr-solrj\test\J0\.\solrtest-jetty4-1352355552304
[junit4:junit4]   2> 10592 T453 oasc.SolrResourceLoader.<init> new SolrResourceLoader for deduced Solr Home: 'C:\Users\JenkinsSlave\workspace\Lucene-Solr-4.x-Windows\solr\build\solr-solrj\test\J0\.\solrtest-jetty4-1352355552304\'
[junit4:junit4]   2> 10624 T453 oass.SolrDispatchFilter.init SolrDispatchFilter.init()
[junit4:junit4]   2> 10624 T453 oasc.SolrResourceLoader.locateSolrHome JNDI not configured for solr (NoInitialContextEx)
[junit4:junit4]   2> 10624 T453 oasc.SolrResourceLoader.locateSolrHome using system property solr.solr.home: C:\Users\JenkinsSlave\workspace\Lucene-Solr-4.x-Windows\solr\build\solr-solrj\test\J0\.\solrtest-jetty4-1352355552304
[junit4:junit4]   2> 10625 T453 oasc.CoreContainer$Initializer.initialize looking for solr.xml: C:\Users\JenkinsSlave\workspace\Lucene-Solr-4.x-Windows\solr\build\solr-solrj\test\J0\.\solrtest-jetty4-1352355552304\solr.xml
[junit4:junit4]   2> 10626 T453 oasc.CoreContainer.<init> New CoreContainer 29253647
[junit4:junit4]   2> 10626 T453 oasc.CoreContainer.load Loading CoreContainer using Solr Home: 'C:\Users\JenkinsSlave\workspace\Lucene-Solr-4.x-Windows\solr\build\solr-solrj\test\J0\.\solrtest-jetty4-1352355552304\'
[junit4:junit4]   2> 10626 T453 oasc.SolrResourceLoader.<init> new SolrResourceLoader for directory: 'C:\Users\JenkinsSlave\workspace\Lucene-Solr-4.x-Windows\solr\build\solr-solrj\test\J0\.\solrtest-jetty4-1352355552304\'
[junit4:junit4]   2> 10665 T453 oasc.CoreContainer.load Registering Log Listener
[junit4:junit4]   2> 10680 T453 oasc.CoreContainer.initZooKeeper Zookeeper client=127.0.0.1:51574/solr
[junit4:junit4]   2> 10681 T453 oaz.ZooKeeper.<init> Initiating client connection, connectString=127.0.0.1:51574/solr sessionTimeout=8000 watcher=org.apache.solr.common.cloud.ConnectionManager@ba8c46
[junit4:junit4]   2> 10682 T453 oascc.ConnectionManager.waitForConnected Waiting for client to connect to ZooKeeper
[junit4:junit4]   2> 10689 T524 oaz.ClientCnxn$SendThread.startConnect Opening socket connection to server /127.0.0.1:51574
[junit4:junit4]   2> 10691 T524 oaz.ClientCnxn$SendThread.primeConnection Socket connection established to 127.0.0.1/127.0.0.1:51574, initiating session
[junit4:junit4]   2> 10692 T455 oazs.NIOServerCnxn$Factory.run Accepted socket connection from /127.0.0.1:51613
[junit4:junit4]   2> 10692 T455 oazs.NIOServerCnxn.readConnectRequest Client attempting to establish new session at /127.0.0.1:51613
[junit4:junit4]   2> 10707 T524 oaz.ClientCnxn$SendThread.readConnectResult Session establishment complete on server 127.0.0.1/127.0.0.1:51574, sessionid = 0x13adeabf41e0006, negotiated timeout = 8000
[junit4:junit4]   2> 10707 T457 oazs.NIOServerCnxn.finishSessionInit Established session 0x13adeabf41e0006 with negotiated timeout 8000 for client /127.0.0.1:51613
[junit4:junit4]   2> 10707 T525 oascc.ConnectionManager.process Watcher org.apache.solr.common.cloud.ConnectionManager@ba8c46 name:ZooKeeperConnection Watcher:127.0.0.1:51574/solr got event WatchedEvent state:SyncConnected type:None path:null path:null type:None
[junit4:junit4]   2> 10707 T453 oascc.ConnectionManager.waitForConnected Client is connected to ZooKeeper
[junit4:junit4]   2> 10708 T459 oazs.PrepRequestProcessor.pRequest Got user-level KeeperException when processing sessionid:0x13adeabf41e0006 type:create cxid:0x1 zxid:0xfffffffffffffffe txntype:unknown reqpath:n/a Error Path:/solr/overseer Error:KeeperErrorCode = NodeExists for /solr/overseer
[junit4:junit4]   2> 10724 T459 oazs.PrepRequestProcessor.pRequest Got user-level KeeperException when processing sessionid:0x13adeabf41e0006 type:create cxid:0x2 zxid:0xfffffffffffffffe txntype:unknown reqpath:n/a Error Path:/solr/overseer Error:KeeperErrorCode = NodeExists for /solr/overseer
[junit4:junit4]   2> 10751 T453 oasc.ZkController.createEphemeralLiveNode Register node as live in ZooKeeper:/live_nodes/127.0.0.1:51608_solr
[junit4:junit4]   2> 10752 T459 oazs.PrepRequestProcessor.pRequest Got user-level KeeperException when processing sessionid:0x13adeabf41e0006 type:delete cxid:0x4 zxid:0xfffffffffffffffe txntype:unknown reqpath:n/a Error Path:/solr/live_nodes/127.0.0.1:51608_solr Error:KeeperErrorCode = NoNode for /solr/live_nodes/127.0.0.1:51608_solr
[junit4:junit4]   2> 10778 T453 oascc.SolrZkClient.makePath makePath: /live_nodes/127.0.0.1:51608_solr
[junit4:junit4]   2> 10808 T499 oascc.ZkStateReader$3.process Updating live nodes... (5)
[junit4:junit4]   2> 10808 T487 oascc.ZkStateReader$3.process Updating live nodes... (5)
[junit4:junit4]   2> 10809 T511 oascc.ZkStateReader$3.process Updating live nodes... (5)
[junit4:junit4]   2> 10809 T473 oascc.ZkStateReader$3.process Updating live nodes... (5)
[junit4:junit4]   2> 10811 T453 oashc.HttpShardHandlerFactory.getParameter Setting socketTimeout to: 0
[junit4:junit4]   2> 10812 T453 oashc.HttpShardHandlerFactory.getParameter Setting urlScheme to: http://
[junit4:junit4]   2> 10812 T453 oashc.HttpShardHandlerFactory.getParameter Setting connTimeout to: 0
[junit4:junit4]   2> 10812 T453 oashc.HttpShardHandlerFactory.getParameter Setting maxConnectionsPerHost to: 20
[junit4:junit4]   2> 10813 T453 oashc.HttpShardHandlerFactory.getParameter Setting corePoolSize to: 0
[junit4:junit4]   2> 10814 T453 oashc.HttpShardHandlerFactory.getParameter Setting maximumPoolSize to: 2147483647
[junit4:junit4]   2> 10814 T453 oashc.HttpShardHandlerFactory.getParameter Setting maxThreadIdleTime to: 5
[junit4:junit4]   2> 10815 T453 oashc.HttpShardHandlerFactory.getParameter Setting sizeOfQueue to: -1
[junit4:junit4]   2> 10816 T453 oashc.HttpShardHandlerFactory.getParameter Setting fairnessPolicy to: false
[junit4:junit4]   2> 10816 T453 oascsi.HttpClientUtil.createClient Creating new http client, config:maxConnectionsPerHost=20&maxConnections=10000&socketTimeout=0&connTimeout=0&retry=false
[junit4:junit4]   2> 10827 T474 oascc.ZkStateReader.updateClusterState Updating cloud state from ZooKeeper... 
[junit4:junit4]   2> 10828 T474 oasc.Overseer$ClusterStateUpdater.updateState Update state numShards=2 message={
[junit4:junit4]   2> 	  "operation":"state",
[junit4:junit4]   2> 	  "numShards":"2",
[junit4:junit4]   2> 	  "shard":"shard1",
[junit4:junit4]   2> 	  "roles":null,
[junit4:junit4]   2> 	  "state":"recovering",
[junit4:junit4]   2> 	  "core":"collection1",
[junit4:junit4]   2> 	  "collection":"collection1",
[junit4:junit4]   2> 	  "node_name":"127.0.0.1:51600_solr",
[junit4:junit4]   2> 	  "base_url":"http://127.0.0.1:51600/solr"}
[junit4:junit4]   2> 10895 T453 oascc.ZkStateReader.createClusterStateWatchersAndUpdate Updating cluster state from ZooKeeper... 
[junit4:junit4]   2> 10915 T525 oaz.ClientCnxn$EventThread.processEvent SEVERE Error while calling watcher  java.lang.NullPointerException
[junit4:junit4]   2> 	at org.apache.solr.common.cloud.ZkStateReader$2.process(ZkStateReader.java:189)
[junit4:junit4]   2> 	at org.apache.zookeeper.ClientCnxn$EventThread.processEvent(ClientCnxn.java:526)
[junit4:junit4]   2> 	at org.apache.zookeeper.ClientCnxn$EventThread.run(ClientCnxn.java:502)
[junit4:junit4]   2> 
[junit4:junit4]   2> 10915 T499 oascc.ZkStateReader$2.process A cluster state change has occurred - updating... (5)
[junit4:junit4]   2> 10916 T487 oascc.ZkStateReader$2.process A cluster state change has occurred - updating... (5)
[junit4:junit4]   2> 10916 T473 oascc.ZkStateReader$2.process A cluster state change has occurred - updating... (5)
[junit4:junit4]   2> 10917 T511 oascc.ZkStateReader$2.process A cluster state change has occurred - updating... (5)
[junit4:junit4]   2> 10924 T453 oasc.CoreContainer.create Creating SolrCore 'collection1' using instanceDir: C:\Users\JenkinsSlave\workspace\Lucene-Solr-4.x-Windows\solr\build\solr-solrj\test\J0\.\solrtest-jetty4-1352355552304\collection1
[junit4:junit4]   2> 10924 T453 oasc.ZkController.createCollectionZkNode Check for collection zkNode:collection1
[junit4:junit4]   2> 10941 T453 oasc.ZkController.createCollectionZkNode Collection zkNode exists
[junit4:junit4]   2> 10941 T453 oasc.ZkController.readConfigName Load collection config from:/collections/collection1
[junit4:junit4]   2> 10947 T453 oasc.SolrResourceLoader.<init> new SolrResourceLoader for directory: 'C:\Users\JenkinsSlave\workspace\Lucene-Solr-4.x-Windows\solr\build\solr-solrj\test\J0\.\solrtest-jetty4-1352355552304\collection1\'
[junit4:junit4]   2> 11001 T453 oasc.SolrConfig.<init> Using Lucene MatchVersion: LUCENE_41
[junit4:junit4]   2> 11051 T453 oasc.SolrConfig.<init> Loaded SolrConfig: solrconfig.xml
[junit4:junit4]   2> 11052 T453 oass.IndexSchema.readSchema Reading Solr Schema
[junit4:junit4]   2> 11058 T453 oass.IndexSchema.readSchema Schema name=test
[junit4:junit4]   2> 11562 T453 oass.IndexSchema.readSchema default search field in schema is text
[junit4:junit4]   2> 11565 T453 oass.IndexSchema.readSchema unique key field: id
[junit4:junit4]   2> 11568 T453 oass.IndexSchema.readSchema WARNING Field text is not multivalued and destination for multiple copyFields (2)
[junit4:junit4]   2> 11572 T453 oass.IndexSchema.readSchema WARNING Field lowerfilt1and2 is not multivalued and destination for multiple copyFields (2)
[junit4:junit4]   2> 11573 T453 oasc.SolrCore.<init> [collection1] Opening new SolrCore at C:\Users\JenkinsSlave\workspace\Lucene-Solr-4.x-Windows\solr\build\solr-solrj\test\J0\.\solrtest-jetty4-1352355552304\collection1\, dataDir=.\org.apache.solr.client.solrj.impl.CloudSolrServerTest-1352355541903/jetty4\
[junit4:junit4]   2> 11573 T453 oasc.SolrCore.<init> JMX monitoring not detected for core: collection1
[junit4:junit4]   2> 11575 T453 oasc.SolrCore.getNewIndexDir New index directory detected: old=null new=.\org.apache.solr.client.solrj.impl.CloudSolrServerTest-1352355541903/jetty4\index/
[junit4:junit4]   2> 11577 T453 oasc.SolrCore.initIndex WARNING [collection1] Solr index directory '.\org.apache.solr.client.solrj.impl.CloudSolrServerTest-1352355541903\jetty4\index' doesn't exist. Creating new index...
[junit4:junit4]   2> 11577 T453 oasc.CachingDirectoryFactory.get return new directory for C:\Users\JenkinsSlave\workspace\Lucene-Solr-4.x-Windows\solr\build\solr-solrj\test\J0\.\org.apache.solr.client.solrj.impl.CloudSolrServerTest-1352355541903\jetty4\index forceNew:false
[junit4:junit4]   2> 11595 T453 oasc.SolrDeletionPolicy.onCommit SolrDeletionPolicy.onCommit: commits:num=1
[junit4:junit4]   2> 		commit{dir=NRTCachingDirectory(org.apache.lucene.store.SimpleFSDirectory@C:\Users\JenkinsSlave\workspace\Lucene-Solr-4.x-Windows\solr\build\solr-solrj\test\J0\org.apache.solr.client.solrj.impl.CloudSolrServerTest-1352355541903\jetty4\index lockFactory=org.apache.lucene.store.NativeFSLockFactory@5aa6b3; maxCacheMB=48.0 maxMergeSizeMB=4.0),segFN=segments_1,generation=1,filenames=[segments_1]
[junit4:junit4]   2> 11595 T453 oasc.SolrDeletionPolicy.updateCommits newest commit = 1
[junit4:junit4]   2> 11599 T453 oasc.RequestHandlers.initHandlersFromConfig created /get: solr.RealTimeGetHandler
[junit4:junit4]   2> 11599 T453 oasc.RequestHandlers.initHandlersFromConfig adding lazy requestHandler: solr.ReplicationHandler
[junit4:junit4]   2> 11600 T453 oasc.RequestHandlers.initHandlersFromConfig created /replication: solr.ReplicationHandler
[junit4:junit4]   2> 11600 T453 oasc.RequestHandlers.initHandlersFromConfig created standard: solr.StandardRequestHandler
[junit4:junit4]   2> 11600 T453 oasc.RequestHandlers.initHandlersFromConfig created /update: solr.UpdateRequestHandler
[junit4:junit4]   2> 11601 T453 oasc.RequestHandlers.initHandlersFromConfig created /admin/: org.apache.solr.handler.admin.AdminHandlers
[junit4:junit4]   2> 11615 T453 oashl.XMLLoader.init xsltCacheLifetimeSeconds=60
[junit4:junit4]   2> 11624 T453 oass.SolrIndexSearcher.<init> Opening Searcher@80facf main
[junit4:junit4]   2> 11627 T453 oasu.CommitTracker.<init> Hard AutoCommit: disabled
[junit4:junit4]   2> 11628 T453 oasu.CommitTracker.<init> Soft AutoCommit: disabled
[junit4:junit4]   2> 11629 T453 oasc.ZkController.publish numShards not found on descriptor - reading it from system property
[junit4:junit4]   2> 11630 T526 oasc.SolrCore.registerSearcher [collection1] Registered new searcher Searcher@80facf main{StandardDirectoryReader(segments_1:1)}
[junit4:junit4]   2> 12056 T474 oascc.ZkStateReader.updateClusterState Updating cloud state from ZooKeeper... 
[junit4:junit4]   2> 12058 T474 oasc.Overseer$ClusterStateUpdater.updateState Update state numShards=2 message={
[junit4:junit4]   2> 	  "operation":"state",
[junit4:junit4]   2> 	  "numShards":"2",
[junit4:junit4]   2> 	  "shard":null,
[junit4:junit4]   2> 	  "roles":null,
[junit4:junit4]   2> 	  "state":"down",
[junit4:junit4]   2> 	  "core":"collection1",
[junit4:junit4]   2> 	  "collection":"collection1",
[junit4:junit4]   2> 	  "node_name":"127.0.0.1:51608_solr",
[junit4:junit4]   2> 	  "base_url":"http://127.0.0.1:51608/solr"}
[junit4:junit4]   2> 12126 T499 oascc.ZkStateReader$2.process A cluster state change has occurred - updating... (5)
[junit4:junit4]   2> 12126 T487 oascc.ZkStateReader$2.process A cluster state change has occurred - updating... (5)
[junit4:junit4]   2> 12127 T473 oascc.ZkStateReader$2.process A cluster state change has occurred - updating... (5)
[junit4:junit4]   2> 12127 T511 oascc.ZkStateReader$2.process A cluster state change has occurred - updating... (5)
[junit4:junit4]   2>  C42_STATE=coll:collection1 core:collection1 props:{shard=shard1, roles=null, state=recovering, core=collection1, collection=collection1, node_name=127.0.0.1:51600_solr, base_url=http://127.0.0.1:51600/solr}
[junit4:junit4]   2> 13236 T513 C42 P51600 oasc.RecoveryStrategy.doRecovery Begin buffering updates. core=collection1
[junit4:junit4]   2> 13236 T513 C42 P51600 oasu.UpdateLog.bufferUpdates Starting to buffer updates. FSUpdateLog{state=ACTIVE, tlog=null}
[junit4:junit4]   2> 13236 T513 C42 P51600 oasc.RecoveryStrategy.replicate Attempting to replicate from http://127.0.0.1:51588/solr/collection1/. core=collection1
[junit4:junit4]   2> 13236 T513 C42 P51600 oascsi.HttpClientUtil.createClient Creating new http client, config:maxConnections=128&maxConnectionsPerHost=32&followRedirects=false
[junit4:junit4]   2> 13260 T483 C43 P51588 oascsi.HttpClientUtil.createClient Creating new http client, config:maxConnections=500&maxConnectionsPerHost=16
[junit4:junit4]   2> 13266 T483 C43 P51588 oasu.DirectUpdateHandler2.commit start commit{flags=0,_version_=0,optimize=false,openSearcher=false,waitSearcher=true,expungeDeletes=false,softCommit=false}
[junit4:junit4]   2> 13271 T483 C43 P51588 oasc.SolrDeletionPolicy.onInit SolrDeletionPolicy.onInit: commits:num=1
[junit4:junit4]   2> 		commit{dir=NRTCachingDirectory(org.apache.lucene.store.SimpleFSDirectory@C:\Users\JenkinsSlave\workspace\Lucene-Solr-4.x-Windows\solr\build\solr-solrj\test\J0\org.apache.solr.client.solrj.impl.CloudSolrServerTest-1352355541903\jetty1\index lockFactory=org.apache.lucene.store.NativeFSLockFactory@1b4562e; maxCacheMB=48.0 maxMergeSizeMB=4.0),segFN=segments_1,generation=1,filenames=[segments_1]
[junit4:junit4]   2> 13271 T483 C43 P51588 oasc.SolrDeletionPolicy.updateCommits newest commit = 1
[junit4:junit4]   2> 13271 T483 C43 P51588 oass.SolrIndexSearcher.<init> Opening Searcher@1753d57 realtime
[junit4:junit4]   2> 13271 T483 C43 P51588 oasu.DirectUpdateHandler2.commit end_commit_flush
[junit4:junit4]   2> 13272 T483 C43 P51588 /update {waitSearcher=true&openSearcher=false&commit=true&commit_end_point=true&wt=javabin&softCommit=false&version=2} {commit=} 0 24
[junit4:junit4]   2> 13274 T513 C42 P51600 oash.ReplicationHandler.inform Commits will be reserved for  10000
[junit4:junit4]   2> 13274 T513 C42 P51600 oascsi.HttpClientUtil.createClient Creating new http client, config:connTimeout=5000&socketTimeout=20000&allowCompression=false&maxConnections=10000&maxConnectionsPerHost=10000
[junit4:junit4]   2> 13281 T513 C42 P51600 oash.SnapPuller.<init>  No value set for 'pollInterval'. Timer Task not started.
[junit4:junit4]   2> 13283 T484 C43 P51588 oash.ReplicationHandler.inform Commits will be reserved for  10000
[junit4:junit4]   2> 13283 T484 C43 P51588 REQ /replication {command=indexversion&wt=javabin&qt=/replication&version=2} status=0 QTime=1 
[junit4:junit4]   2> 13290 T513 C42 P51600 oasc.SolrDeletionPolicy.onInit SolrDeletionPolicy.onInit: commits:num=1
[junit4:junit4]   2> 		commit{dir=NRTCachingDirectory(org.apache.lucene.store.SimpleFSDirectory@C:\Users\JenkinsSlave\workspace\Lucene-Solr-4.x-Windows\solr\build\solr-solrj\test\J0\org.apache.solr.client.solrj.impl.CloudSolrServerTest-1352355541903\jetty3\index lockFactory=org.apache.lucene.store.NativeFSLockFactory@180bc1a; maxCacheMB=48.0 maxMergeSizeMB=4.0),segFN=segments_1,generation=1,filenames=[segments_1]
[junit4:junit4]   2> 13290 T513 C42 P51600 oasc.SolrDeletionPolicy.updateCommits newest commit = 1
[junit4:junit4]   2> 13291 T513 C42 P51600 oasu.DirectUpdateHandler2.commit start commit{flags=0,_version_=0,optimize=false,openSearcher=true,waitSearcher=true,expungeDeletes=false,softCommit=false}
[junit4:junit4]   2> 13297 T513 C42 P51600 oasc.SolrDeletionPolicy.onCommit SolrDeletionPolicy.onCommit: commits:num=2
[junit4:junit4]   2> 		commit{dir=NRTCachingDirectory(org.apache.lucene.store.SimpleFSDirectory@C:\Users\JenkinsSlave\workspace\Lucene-Solr-4.x-Windows\solr\build\solr-solrj\test\J0\org.apache.solr.client.solrj.impl.CloudSolrServerTest-1352355541903\jetty3\index lockFactory=org.apache.lucene.store.NativeFSLockFactory@180bc1a; maxCacheMB=48.0 maxMergeSizeMB=4.0),segFN=segments_1,generation=1,filenames=[segments_1]
[junit4:junit4]   2> 		commit{dir=NRTCachingDirectory(org.apache.lucene.store.SimpleFSDirectory@C:\Users\JenkinsSlave\workspace\Lucene-Solr-4.x-Windows\solr\build\solr-solrj\test\J0\org.apache.solr.client.solrj.impl.CloudSolrServerTest-1352355541903\jetty3\index lockFactory=org.apache.lucene.store.NativeFSLockFactory@180bc1a; maxCacheMB=48.0 maxMergeSizeMB=4.0),segFN=segments_2,generation=2,filenames=[segments_2]
[junit4:junit4]   2> 13297 T513 C42 P51600 oasc.SolrDeletionPolicy.updateCommits newest commit = 2
[junit4:junit4]   2> 13301 T513 C42 P51600 oass.SolrIndexSearcher.<init> Opening Searcher@13890cc main
[junit4:junit4]   2> 13301 T513 C42 P51600 oasu.DirectUpdateHandler2.commit end_commit_flush
[junit4:junit4]   2> 13301 T512 oasc.SolrCore.registerSearcher [collection1] Registered new searcher Searcher@13890cc main{StandardDirectoryReader(segments_2:2)}
[junit4:junit4]   2> 13301 T513 C42 P51600 oasc.RecoveryStrategy.replay No replay needed. core=collection1
[junit4:junit4]   2> 13301 T513 C42 P51600 oasc.RecoveryStrategy.doRecovery Replication Recovery was successful - registering as Active. core=collection1
[junit4:junit4]   2> 13301 T513 C42 P51600 oasc.ZkController.publish numShards not found on descriptor - reading it from system property
[junit4:junit4]   2> 13306 T513 C42 P51600 oasc.RecoveryStrategy.doRecovery Finished recovery process. core=collection1
[junit4:junit4]   2> 13544 T474 oascc.ZkStateReader.updateClusterState Updating cloud state from ZooKeeper... 
[junit4:junit4]   2> 13545 T474 oasc.Overseer$ClusterStateUpdater.updateState Update state numShards=2 message={
[junit4:junit4]   2> 	  "operation":"state",
[junit4:junit4]   2> 	  "numShards":"2",
[junit4:junit4]   2> 	  "shard":"shard1",
[junit4:junit4]   2> 	  "roles":null,
[junit4:junit4]   2> 	  "state":"active",
[junit4:junit4]   2> 	  "core":"collection1",
[junit4:junit4]   2> 	  "collection":"collection1",
[junit4:junit4]   2> 	  "node_name":"127.0.0.1:51600_solr",
[junit4:junit4]   2> 	  "base_url":"http://127.0.0.1:51600/solr"}
[junit4:junit4]   2> 13596 T499 oascc.ZkStateReader$2.process A cluster state change has occurred - updating... (5)
[junit4:junit4]   2> 13596 T487 oascc.ZkStateReader$2.process A cluster state change has occurred - updating... (5)
[junit4:junit4]   2> 13596 T473 oascc.ZkStateReader$2.process A cluster state change has occurred - updating... (5)
[junit4:junit4]   2> 13596 T511 oascc.ZkStateReader$2.process A cluster state change has occurred - updating... (5)
[junit4:junit4]   2> 75895 T453 oasc.SolrException.log SEVERE null:org.apache.solr.common.SolrException: Could not get shard_id for core: collection1
[junit4:junit4]   2> 		at org.apache.solr.cloud.ZkController.doGetShardIdProcess(ZkController.java:996)
[junit4:junit4]   2> 		at org.apache.solr.cloud.ZkController.preRegister(ZkController.java:1054)
[junit4:junit4]   2> 		at org.apache.solr.core.CoreContainer.register(CoreContainer.java:661)
[junit4:junit4]   2> 		at org.apache.solr.core.CoreContainer.load(CoreContainer.java:531)
[junit4:junit4]   2> 		at org.apache.solr.core.CoreContainer.load(CoreContainer.java:351)
[junit4:junit4]   2> 		at org.apache.solr.core.CoreContainer$Initializer.initialize(CoreContainer.java:303)
[junit4:junit4]   2> 		at org.apache.solr.servlet.SolrDispatchFilter.init(SolrDispatchFilter.java:107)
[junit4:junit4]   2> 		at org.eclipse.jetty.servlet.FilterHolder.doStart(FilterHolder.java:119)
[junit4:junit4]   2> 		at org.eclipse.jetty.util.component.AbstractLifeCycle.start(AbstractLifeCycle.java:64)
[junit4:junit4]   2> 		at org.eclipse.jetty.servlet.ServletHandler.initialize(ServletHandler.java:724)
[junit4:junit4]   2> 		at org.eclipse.jetty.servlet.ServletHandler.updateMappings(ServletHandler.java:1197)
[junit4:junit4]   2> 		at org.eclipse.jetty.servlet.ServletHandler.setFilterMappings(ServletHandler.java:1233)
[junit4:junit4]   2> 		at org.eclipse.jetty.servlet.ServletHandler.addFilterWithMapping(ServletHandler.java:935)
[junit4:junit4]   2> 		at org.eclipse.jetty.servlet.ServletHandler.addFilterWithMapping(ServletHandler.java:893)
[junit4:junit4]   2> 		at org.eclipse.jetty.servlet.ServletContextHandler.addFilter(ServletContextHandler.java:338)
[junit4:junit4]   2> 		at org.apache.solr.client.solrj.embedded.JettySolrRunner$1.lifeCycleStarted(JettySolrRunner.java:173)
[junit4:junit4]   2> 		at org.eclipse.jetty.util.component.AbstractLifeCycle.setStarted(AbstractLifeCycle.java:174)
[junit4:junit4]   2> 		at org.eclipse.jetty.util.component.AbstractLifeCycle.start(AbstractLifeCycle.java:65)
[junit4:junit4]   2> 		at org.apache.solr.client.solrj.embedded.JettySolrRunner.start(JettySolrRunner.java:225)
[junit4:junit4]   2> 		at org.apache.solr.client.solrj.embedded.JettySolrRunner.start(JettySolrRunner.java:205)
[junit4:junit4]   2> 		at org.apache.solr.BaseDistributedSearchTestCase.createJetty(BaseDistributedSearchTestCase.java:262)
[junit4:junit4]   2> 		at org.apache.solr.cloud.AbstractFullDistribZkTestBase.createJettys(AbstractFullDistribZkTestBase.java:294)
[junit4:junit4]   2> 		at org.apache.solr.cloud.AbstractFullDistribZkTestBase.createServers(AbstractFullDistribZkTestBase.java:268)
[junit4:junit4]   2> 		at org.apache.solr.BaseDistributedSearchTestCase.testDistribSearch(BaseDistributedSearchTestCase.java:693)
[junit4:junit4]   2> 		at sun.reflect.NativeMethodAccessorImpl.invoke0(Native Method)
[junit4:junit4]   2> 		at sun.reflect.NativeMethodAccessorImpl.invoke(NativeMethodAccessorImpl.java:57)
[junit4:junit4]   2> 		at sun.reflect.DelegatingMethodAccessorImpl.invoke(DelegatingMethodAccessorImpl.java:43)
[junit4:junit4]   2> 		at java.lang.reflect.Method.invoke(Method.java:601)
[junit4:junit4]   2> 		at com.carrotsearch.randomizedtesting.RandomizedRunner.invoke(RandomizedRunner.java:1559)
[junit4:junit4]   2> 		at com.carrotsearch.randomizedtesting.RandomizedRunner.access$600(RandomizedRunner.java:79)
[junit4:junit4]   2> 		at com.carrotsearch.randomizedtesting.RandomizedRunner$6.evaluate(RandomizedRunner.java:737)
[junit4:junit4]   2> 		at com.carrotsearch.randomizedtesting.RandomizedRunner$7.evaluate(RandomizedRunner.java:773)
[junit4:junit4]   2> 		at com.carrotsearch.randomizedtesting.RandomizedRunner$8.evaluate(RandomizedRunner.java:787)
[junit4:junit4]   2> 		at com.carrotsearch.randomizedtesting.rules.SystemPropertiesRestoreRule$1.evaluate(SystemPropertiesRestoreRule.java:53)
[junit4:junit4]   2> 		at org.apache.lucene.util.TestRuleSetupTeardownChained$1.evaluate(TestRuleSetupTeardownChained.java:50)
[junit4:junit4]   2> 		at org.apache.lucene.util.TestRuleFieldCacheSanity$1.evaluate(TestRuleFieldCacheSanity.java:51)
[junit4:junit4]   2> 		at org.apache.lucene.util.AbstractBeforeAfterRule$1.evaluate(AbstractBeforeAfterRule.java:45)
[junit4:junit4]   2> 		at com.carrotsearch.randomizedtesting.rules.SystemPropertiesInvariantRule$1.evaluate(SystemPropertiesInvariantRule.java:55)
[junit4:junit4]   2> 		at org.apache.lucene.util.TestRuleThreadAndTestName$1.evaluate(TestRuleThreadAndTestName.java:48)
[junit4:junit4]   2> 		at org.apache.lucene.util.TestRuleIgnoreAfterMaxFailures$1.evaluate(TestRuleIgnoreAfterMaxFailures.java:70)
[junit4:junit4]   2> 		at org.apache.lucene.util.TestRuleMarkFailure$1.evaluate(TestRuleMarkFailure.java:48)
[junit4:junit4]   2> 		at com.carrotsearch.randomizedtesting.rules.StatementAdapter.evaluate(StatementAdapter.java:36)
[junit4:junit4]   2> 		at com.carrotsearch.randomizedtesting.ThreadLeakControl$StatementRunner.run(ThreadLeakControl.java:358)
[junit4:junit4]   2> 		at com.carrotsearch.randomizedtesting.ThreadLeakControl.forkTimeoutingTask(ThreadLeakControl.java:782)
[junit4:junit4]   2> 		at com.carrotsearch.randomizedtesting.ThreadLeakControl$3.evaluate(ThreadLeakControl.java:442)
[junit4:junit4]   2> 		at com.carrotsearch.randomizedtesting.RandomizedRunner.runSingleTest(RandomizedRunner.java:746)
[junit4:junit4]   2> 		at com.carrotsearch.randomizedtesting.RandomizedRunner$3.evaluate(RandomizedRunner.java:648)
[junit4:junit4]   2> 		at com.carrotsearch.randomizedtesting.RandomizedRunner$4.evaluate(RandomizedRunner.java:682)
[junit4:junit4]   2> 		at com.carrotsearch.randomizedtesting.RandomizedRunner$5.evaluate(RandomizedRunner.java:693)
[junit4:junit4]   2> 		at com.carrotsearch.randomizedtesting.rules.StatementAdapter.evaluate(StatementAdapter.java:36)
[junit4:junit4]   2> 		at com.carrotsearch.randomizedtesting.rules.SystemPropertiesRestoreRule$1.evaluate(SystemPropertiesRestoreRule.java:53)
[junit4:junit4]   2> 		at org.apache.lucene.util.AbstractBeforeAfterRule$1.evaluate(AbstractBeforeAfterRule.java:45)
[junit4:junit4]   2> 		at org.apache.lucene.util.TestRuleStoreClassName$1.evaluate(TestRuleStoreClassName.java:42)
[junit4:junit4]   2> 		at com.carrotsearch.randomizedtesting.rules.SystemPropertiesInvariantRule$1.evaluate(SystemPropertiesInvariantRule.java:55)
[junit4:junit4]   2> 		at com.carrotsearch.randomizedtesting.rules.NoShadowingOrOverridesOnMethodsRule$1.evaluate(NoShadowingOrOverridesOnMethodsRule.java:39)
[junit4:junit4]   2> 		at com.carrotsearch.randomizedtesting.rules.NoShadowingOrOverridesOnMethodsRule$1.evaluate(NoShadowingOrOverridesOnMethodsRule.java:39)
[junit4:junit4]   2> 		at com.carrotsearch.randomizedtesting.rules.StatementAdapter.evaluate(StatementAdapter.java:36)
[junit4:junit4]   2> 		at org.apache.lucene.util.TestRuleAssertionsRequired$1.evaluate(TestRuleAssertionsRequired.java:43)
[junit4:junit4]   2> 		at org.apache.lucene.util.TestRuleMarkFailure$1.evaluate(TestRuleMarkFailure.java:48)
[junit4:junit4]   2> 		at org.apache.lucene.util.TestRuleIgnoreAfterMaxFailures$1.evaluate(TestRuleIgnoreAfterMaxFailures.java:70)
[junit4:junit4]   2> 		at org.apache.lucene.util.TestRuleIgnoreTestSuites$1.evaluate(TestRuleIgnoreTestSuites.java:55)
[junit4:junit4]   2> 		at com.carrotsearch.randomizedtesting.rules.StatementAdapter.evaluate(StatementAdapter.java:36)
[junit4:junit4]   2> 		at com.carrotsearch.randomizedtesting.ThreadLeakControl$StatementRunner.run(ThreadLeakControl.java:358)
[junit4:junit4]   2> 		at java.lang.Thread.run(Thread.java:722)
[junit4:junit4]   2> 	
[junit4:junit4]   2> 75896 T453 oasc.SolrCore.close [collection1]  CLOSING SolrCore org.apache.solr.core.SolrCore@17a40df
[junit4:junit4]   2> 75896 T453 oasu.DirectUpdateHandler2.close closing DirectUpdateHandler2{commits=0,autocommits=0,soft autocommits=0,optimizes=0,rollbacks=0,expungeDeletes=0,docsPending=0,adds=0,deletesById=0,deletesByQuery=0,errors=0,cumulative_adds=0,cumulative_deletesById=0,cumulative_deletesByQuery=0,cumulative_errors=0}
[junit4:junit4]   2> 75896 T453 oasc.SolrCore.decrefSolrCoreState Closing SolrCoreState
[junit4:junit4]   2> 75896 T453 oasu.DefaultSolrCoreState.closeIndexWriter SolrCoreState ref count has reached 0 - closing IndexWriter
[junit4:junit4]   2> 75896 T453 oasu.DefaultSolrCoreState.closeIndexWriter closing IndexWriter with IndexWriterCloser
[junit4:junit4]   2> 75897 T453 oasc.SolrCore.closeSearcher [collection1] Closing main searcher on request.
[junit4:junit4]   2> 75897 T453 oass.SolrDispatchFilter.init user.dir=C:\Users\JenkinsSlave\workspace\Lucene-Solr-4.x-Windows\solr\build\solr-solrj\test\J0
[junit4:junit4]   2> 75897 T453 oass.SolrDispatchFilter.init SolrDispatchFilter.init() done
[junit4:junit4]   2> 75898 T453 oascsi.HttpClientUtil.createClient Creating new http client, config:maxConnections=128&maxConnectionsPerHost=32&followRedirects=false
[junit4:junit4]   2> 76072 T453 oejs.Server.doStart jetty-8.1.7.v20120910
[junit4:junit4]   2> 76077 T453 oejs.AbstractConnector.doStart Started SelectChannelConnector@0.0.0.0:51616
[junit4:junit4]   2> 76078 T453 oasc.SolrResourceLoader.locateSolrHome JNDI not configured for solr (NoInitialContextEx)
[junit4:junit4]   2> 76078 T453 oasc.SolrResourceLoader.locateSolrHome using system property solr.solr.home: C:\Users\JenkinsSlave\workspace\Lucene-Solr-4.x-Windows\solr\build\solr-solrj\test\J0\.\solrtest-jetty5-1352355617798
[junit4:junit4]   2> 76079 T453 oasc.SolrResourceLoader.<init> new SolrResourceLoader for deduced Solr Home: 'C:\Users\JenkinsSlave\workspace\Lucene-Solr-4.x-Windows\solr\build\solr-solrj\test\J0\.\solrtest-jetty5-1352355617798\'
[junit4:junit4]   2> 76128 T453 oass.SolrDispatchFilter.init SolrDispatchFilter.init()
[junit4:junit4]   2> 76129 T453 oasc.SolrResourceLoader.locateSolrHome JNDI not configured for solr (NoInitialContextEx)
[junit4:junit4]   2> 76129 T453 oasc.SolrResourceLoader.locateSolrHome using system property solr.solr.home: C:\Users\JenkinsSlave\workspace\Lucene-Solr-4.x-Windows\solr\build\solr-solrj\test\J0\.\solrtest-jetty5-1352355617798
[junit4:junit4]   2> 76130 T453 oasc.CoreContainer$Initializer.initialize looking for solr.xml: C:\Users\JenkinsSlave\workspace\Lucene-Solr-4.x-Windows\solr\build\solr-solrj\test\J0\.\solrtest-jetty5-1352355617798\solr.xml
[junit4:junit4]   2> 76130 T453 oasc.CoreContainer.<init> New CoreContainer 12567033
[junit4:junit4]   2> 76130 T453 oasc.CoreContainer.load Loading CoreContainer using Solr Home: 'C:\Users\JenkinsSlave\workspace\Lucene-Solr-4.x-Windows\solr\build\solr-solrj\test\J0\.\solrtest-jetty5-1352355617798\'
[junit4:junit4]   2> 76130 T453 oasc.SolrResourceLoader.<init> new SolrResourceLoader for directory: 'C:\Users\JenkinsSlave\workspace\Lucene-Solr-4.x-Windows\solr\build\solr-solrj\test\J0\.\solrtest-jetty5-1352355617798\'
[junit4:junit4]   2> 76172 T453 oasc.CoreContainer.load Registering Log Listener
[junit4:junit4]   2> 76196 T453 oasc.CoreContainer.initZooKeeper Zookeeper client=127.0.0.1:51574/solr
[junit4:junit4]   2> 76197 T453 oaz.ZooKeeper.<init> Initiating client connection, connectString=127.0.0.1:51574/solr sessionTimeout=8000 watcher=org.apache.solr.common.cloud.ConnectionManager@1a860b5
[junit4:junit4]   2> 76199 T536 oaz.ClientCnxn$SendThread.startConnect Opening socket connection to server /127.0.0.1:51574
[junit4:junit4]   2> 76199 T453 oascc.ConnectionManager.waitForConnected Waiting for client to connect to ZooKeeper
[junit4:junit4]   2> 76201 T536 oaz.ClientCnxn$SendThread.primeConnection Socket connection established to 127.0.0.1/127.0.0.1:51574, initiating session
[junit4:junit4]   2> 76201 T455 oazs.NIOServerCnxn$Factory.run Accepted socket connection from /127.0.0.1:51621
[junit4:junit4]   2> 76201 T455 oazs.NIOServerCnxn.readConnectRequest Client attempting to establish new session at /127.0.0.1:51621
[junit4:junit4]   2> 76214 T536 oaz.ClientCnxn$SendThread.readConnectResult Session establishment complete on server 127.0.0.1/127.0.0.1:51574, sessionid = 0x13adeabf41e0007, negotiated timeout = 8000
[junit4:junit4]   2> 76214 T537 oascc.ConnectionManager.process Watcher org.apache.solr.common.cloud.ConnectionManager@1a860b5 name:ZooKeeperConnection Watcher:127.0.0.1:51574/solr got event WatchedEvent state:SyncConnected type:None path:null path:null type:None
[junit4:junit4]   2> 76214 T453 oascc.ConnectionManager.waitForConnected Client is connected to ZooKeeper
[junit4:junit4]   2> 76214 T457 oazs.NIOServerCnxn.finishSessionInit Established session 0x13adeabf41e0007 with negotiated timeout 8000 for client /127.0.0.1:51621
[junit4:junit4]   2> 76216 T459 oazs.PrepRequestProcessor.pRequest Got user-level KeeperException when processing sessionid:0x13adeabf41e0007 type:create cxid:0x1 zxid:0xfffffffffffffffe txntype:unknown reqpath:n/a Error Path:/solr/overseer Error:KeeperErrorCode = NodeExists for /solr/overseer
[junit4:junit4]   2> 76220 T459 oazs.PrepRequestProcessor.pRequest Got user-level KeeperException when processing sessionid:0x13adeabf41e0007 type:create cxid:0x2 zxid:0xfffffffffffffffe txntype:unknown reqpath:n/a Error Path:/solr/overseer Error:KeeperErrorCode = NodeExists for /solr/overseer
[junit4:junit4]   2> 76222 T453 oasc.ZkController.createEphemeralLiveNode Register node as live in ZooKeeper:/live_nodes/127.0.0.1:51616_solr
[junit4:junit4]   2> 76224 T459 oazs.PrepRequestProcessor.pRequest Got user-level KeeperException when processing sessionid:0x13adeabf41e0007 type:delete cxid:0x4 zxid:0xfffffffffffffffe txntype:unknown reqpath:n/a Error Path:/solr/live_nodes/127.0.0.1:51616_solr Error:KeeperErrorCode = NoNode for /solr/live_nodes/127.0.0.1:51616_solr
[junit4:junit4]   2> 76226 T453 oascc.SolrZkClient.makePath makePath: /live_nodes/127.0.0.1:51616_solr
[junit4:junit4]   2> 76234 T499 oascc.ZkStateReader$3.process Updating live nodes... (6)
[junit4:junit4]   2> 76236 T473 oascc.ZkStateReader$3.process Updating live nodes... (6)
[junit4:junit4]   2> 76236 T487 oascc.ZkStateReader$3.process Updating live nodes... (6)
[junit4:junit4]   2> 76237 T525 oascc.ZkStateReader$3.process Updating live nodes... (6)
[junit4:junit4]   2> 76237 T511 oascc.ZkStateReader$3.process Updating live nodes... (6)
[junit4:junit4]   2> 76237 T453 oashc.HttpShardHandlerFactory.getParameter Setting socketTimeout to: 0
[junit4:junit4]   2> 76239 T453 oashc.HttpShardHandlerFactory.getParameter Setting urlScheme to: http://
[junit4:junit4]   2> 76239 T453 oashc.HttpShardHandlerFactory.getParameter Setting connTimeout to: 0
[junit4:junit4]   2> 76240 T453 oashc.HttpShardHandlerFactory.getParameter Setting maxConnectionsPerHost to: 20
[junit4:junit4]   2> 76240 T453 oashc.HttpShardHandlerFactory.getParameter Setting corePoolSize to: 0
[junit4:junit4]   2> 76240 T453 oashc.HttpShardHandlerFactory.getParameter Setting maximumPoolSize to: 2147483647
[junit4:junit4]   2> 76241 T453 oashc.HttpShardHandlerFactory.getParameter Setting maxThreadIdleTime to: 5
[junit4:junit4]   2> 76241 T453 oashc.HttpShardHandlerFactory.getParameter Setting sizeOfQueue to: -1
[junit4:junit4]   2> 76243 T453 oashc.HttpShardHandlerFactory.getParameter Setting fairnessPolicy to: false
[junit4:junit4]   2> 76243 T453 oascsi.HttpClientUtil.createClient Creating new http client, config:maxConnectionsPerHost=20&maxConnections=10000&socketTimeout=0&connTimeout=0&retry=false
[junit4:junit4]   2> 76304 T453 oascc.ZkStateReader.createClusterStateWatchersAndUpdate Updating cluster state from ZooKeeper... 
[junit4:junit4]   2> 76314 T453 oasc.CoreContainer.create Creating SolrCore 'collection1' using instanceDir: C:\Users\JenkinsSlave\workspace\Lucene-Solr-4.x-Windows\solr\build\solr-solrj\test\J0\.\solrtest-jetty5-1352355617798\collection1
[junit4:junit4]   2> 76314 T453 oasc.ZkController.createCollectionZkNode Check for collection zkNode:collection1
[junit4:junit4]   2> 76315 T453 oasc.ZkController.createCollectionZkNode Collection zkNode exists
[junit4:junit4]   2> 76316 T453 oasc.ZkController.readConfigName Load collection config from:/collections/collection1
[junit4:junit4]   2> 76319 T453 oasc.SolrResourceLoader.<init> new SolrResourceLoader for directory: 'C:\Users\JenkinsSlave\workspace\Lucene-Solr-4.x-Windows\solr\build\solr-solrj\test\J0\.\solrtest-jetty5-1352355617798\collection1\'
[junit4:junit4]   2> 76373 T453 oasc.SolrConfig.<init> Using Lucene MatchVersion: LUCENE_41
[junit4:junit4]   2> 76444 T453 oasc.SolrConfig.<init> Loaded SolrConfig: solrconfig.xml
[junit4:junit4]   2> 76447 T453 oass.IndexSchema.readSchema Reading Solr Schema
[junit4:junit4]   2> 76454 T453 oass.IndexSchema.readSchema Schema name=test
[junit4:junit4]   2> 77072 T453 oass.IndexSchema.readSchema default search field in schema is text
[junit4:junit4]   2> 77076 T453 oass.IndexSchema.readSchema unique key field: id
[junit4:junit4]   2> 77077 T453 oass.IndexSchema.readSchema WARNING Field text is not multivalued and destination for multiple copyFields (2)
[junit4:junit4]   2> 77077 T453 oass.IndexSchema.readSchema WARNING Field lowerfilt1and2 is not multivalued and destination for multiple copyFields (2)
[junit4:junit4]   2> 77079 T453 oasc.SolrCore.<init> [collection1] Opening new SolrCore at C:\Users\JenkinsSlave\workspace\Lucene-Solr-4.x-Windows\solr\build\solr-solrj\test\J0\.\solrtest-jetty5-1352355617798\collection1\, dataDir=.\org.apache.solr.client.solrj.impl.CloudSolrServerTest-1352355541903/jetty5\
[junit4:junit4]   2> 77079 T453 oasc.SolrCore.<init> JMX monitoring not detected for core: collection1
[junit4:junit4]   2> 77080 T453 oasc.SolrCore.getNewIndexDir New index directory detected: old=null new=.\org.apache.solr.client.solrj.impl.CloudSolrServerTest-1352355541903/jetty5\index/
[junit4:junit4]   2> 77082 T453 oasc.SolrCore.initIndex WARNING [collection1] Solr index directory '.\org.apache.solr.client.solrj.impl.CloudSolrServerTest-1352355541903\jetty5\index' doesn't exist. Creating new index...
[junit4:junit4]   2> 77082 T453 oasc.CachingDirectoryFactory.get return new directory for C:\Users\JenkinsSlave\workspace\Lucene-Solr-4.x-Windows\solr\build\solr-solrj\test\J0\.\org.apache.solr.client.solrj.impl.CloudSolrServerTest-1352355541903\jetty5\index forceNew:false
[junit4:junit4]   2> 77093 T453 oasc.SolrDeletionPolicy.onCommit SolrDeletionPolicy.onCommit: commits:num=1
[junit4:junit4]   2> 		commit{dir=NRTCachingDirectory(org.apache.lucene.store.SimpleFSDirectory@C:\Users\JenkinsSlave\workspace\Lucene-Solr-4.x-Windows\solr\build\solr-solrj\test\J0\org.apache.solr.client.solrj.impl.CloudSolrServerTest-1352355541903\jetty5\index lockFactory=org.apache.lucene.store.NativeFSLockFactory@180703; maxCacheMB=48.0 maxMergeSizeMB=4.0),segFN=segments_1,generation=1,filenames=[segments_1]
[junit4:junit4]   2> 77093 T453 oasc.SolrDeletionPolicy.updateCommits newest commit = 1
[junit4:junit4]   2> 77095 T453 oasc.RequestHandlers.initHandlersFromConfig created /get: solr.RealTimeGetHandler
[junit4:junit4]   2> 77096 T453 oasc.RequestHandlers.initHandlersFromConfig adding lazy requestHandler: solr.ReplicationHandler
[junit4:junit4]   2> 77096 T453 oasc.RequestHandlers.initHandlersFromConfig created /replication: solr.ReplicationHandler
[junit4:junit4]   2> 77096 T453 oasc.RequestHandlers.initHandlersFromConfig created standard: solr.StandardRequestHandler
[junit4:junit4]   2> 77096 T453 oasc.RequestHandlers.initHandlersFromConfig created /update: solr.UpdateRequestHandler
[junit4:junit4]   2> 77097 T453 oasc.RequestHandlers.initHandlersFromConfig created /admin/: org.apache.solr.handler.admin.AdminHandlers
[junit4:junit4]   2> 77106 T453 oashl.XMLLoader.init xsltCacheLifetimeSeconds=60
[junit4:junit4]   2> 77114 T453 oass.SolrIndexSearcher.<init> Opening Searcher@5628aa main
[junit4:junit4]   2> 77115 T453 oasu.CommitTracker.<init> Hard AutoCommit: disabled
[junit4:junit4]   2> 77115 T453 oasu.CommitTracker.<init> Soft AutoCommit: disabled
[junit4:junit4]   2> 77118 T538 oasc.SolrCore.registerSearcher [collection1] Registered new searcher Searcher@5628aa main{StandardDirectoryReader(segments_1:1)}
[junit4:junit4]   2> 77118 T453 oasc.ZkController.publish numShards not found on descriptor - reading it from system property
[junit4:junit4]   2> 77130 T474 oascc.ZkStateReader.updateClusterState Updating cloud state from ZooKeeper... 
[junit4:junit4]   2> 77132 T474 oasc.Overseer$ClusterStateUpdater.updateState Update state numShards=2 message={
[junit4:junit4]   2> 	  "operation":"state",
[junit4:junit4]   2> 	  "numShards":"2",
[junit4:junit4]   2> 	  "shard":null,
[junit4:junit4]   2> 	  "roles":null,
[junit4:junit4]   2> 	  "state":"down",
[junit4:junit4]   2> 	  "core":"collection1",
[junit4:junit4]   2> 	  "collection":"collection1",
[junit4:junit4]   2> 	  "node_name":"127.0.0.1:51616_solr",
[junit4:junit4]   2> 	  "base_url":"http://127.0.0.1:51616/solr"}
[junit4:junit4]   2> 77138 T499 oascc.ZkStateReader$2.process A cluster state change has occurred - updating... (6)
[junit4:junit4]   2> 77138 T537 oascc.ZkStateReader$2.process A cluster state change has occurred - updating... (6)
[junit4:junit4]   2> 77140 T511 oascc.ZkStateReader$2.process A cluster state change has occurred - updating... (6)
[junit4:junit4]   2> 77140 T487 oascc.ZkStateReader$2.process A cluster state change has occurred - updating... (6)
[junit4:junit4]   2> 77140 T473 oascc.ZkStateReader$2.process A cluster state change has occurred - updating... (6)
[junit4:junit4]   2> 77573 T453 oasc.CoreContainer.register registering core: collection1
[junit4:junit4]   2> 77573 T453 oasc.ZkController.register Register shard - core:collection1 address:http://127.0.0.1:51616/solr shardId:shard1
[junit4:junit4]   2> 77579 T453 oasc.ZkController.register We are http://127.0.0.1:51616/solr/collection1/ and leader is http://127.0.0.1:51588/solr/collection1/
[junit4:junit4]   2> 77579 T453 oasc.ZkController.register No LogReplay needed for core=collection1 baseURL=http://127.0.0.1:51616/solr
[junit4:junit4]   2> 77579 T453 oasc.ZkController.checkRecovery Core needs to recover:collection1
[junit4:junit4]   2> 77579 T453 oasu.DefaultSolrCoreState.doRecovery Running recovery - first canceling any ongoing recovery
[junit4:junit4]   2> ASYNC  NEW_CORE C44 name=collection1 org.apache.solr.core.SolrCore@1176258 url=http://127.0.0.1:51616/solr/collection1 node=127.0.0.1:51616_solr
[junit4:junit4]   2> 77581 T539 C44 P51616 oasc.RecoveryStrategy.run Starting recovery process.  core=collection1 recoveringAfterStartup=true
[junit4:junit4]   2> 77582 T539 C44 P51616 oasc.RecoveryStrategy.doRecovery ###### startupVersions=[]
[junit4:junit4]   2> 77582 T539 C44 P51616 oasc.ZkController.publish numShards not found on descriptor - reading it from system property
[junit4:junit4]   2> 77582 T453 oascc.ZkStateReader.updateClusterState Updating cloud state from ZooKeeper... 
[junit4:junit4]   2> 77582 T453 oass.SolrDispatchFilter.init user.dir=C:\Users\JenkinsSlave\workspace\Lucene-Solr-4.x-Windows\solr\build\solr-solrj\test\J0
[junit4:junit4]   2> 77582 T453 oass.SolrDispatchFilter.init SolrDispatchFilter.init() done
[junit4:junit4]   2> 77583 T453 oascsi.HttpClientUtil.createClient Creating new http client, config:maxConnections=128&maxConnectionsPerHost=32&followRedirects=false
[junit4:junit4]   2> 77583 T539 C44 P51616 oasc.RecoveryStrategy.doRecovery Attempting to PeerSync from http://127.0.0.1:51588/solr/collection1/ core=collection1 - recoveringAfterStartup=true
[junit4:junit4]   2> 77583 T539 C44 P51616 oasu.PeerSync.sync PeerSync: core=collection1 url=http://127.0.0.1:51616/solr START replicas=[http://127.0.0.1:51588/solr/collection1/] nUpdates=100
[junit4:junit4]   2> 77583 T539 C44 P51616 oasu.PeerSync.sync WARNING no frame of reference to tell of we've missed updates
[junit4:junit4]   2> 77584 T539 C44 P51616 oasc.RecoveryStrategy.doRecovery PeerSync Recovery was not successful - trying replication. core=collection1
[junit4:junit4]   2> 77584 T539 C44 P51616 oasc.RecoveryStrategy.doRecovery Starting Replication Recovery. core=collection1
[junit4:junit4]   2> 77584 T539 C44 P51616 oascsi.HttpClientUtil.createClient Creating new http client, config:maxConnections=128&maxConnectionsPerHost=32&followRedirects=false
[junit4:junit4]   2> 77589 T484 C43 P51588 REQ /get {distrib=false&qt=/get&wt=javabin&version=2&getVersions=100} status=0 QTime=2 
[junit4:junit4]   2> 77601 T474 oascc.ZkStateReader.updateClusterState Updating cloud state from ZooKeeper... 
[junit4:junit4]   2> 77604 T474 oasc.Overseer$ClusterStateUpdater.updateState Update state numShards=2 message={
[junit4:junit4]   2> 	  "operation":"state",
[junit4:junit4]   2> 	  "numShards":"2",
[junit4:junit4]   2> 	  "shard":"shard1",
[junit4:junit4]   2> 	  "roles":null,
[junit4:junit4]   2> 	  "state":"recovering",
[junit4:junit4]   2> 	  "core":"collection1",
[junit4:junit4]   2> 	  "collection":"collection1",
[junit4:junit4]   2> 	  "node_name":"127.0.0.1:51616_solr",
[junit4:junit4]   2> 	  "base_url":"http://127.0.0.1:51616/solr"}
[junit4:junit4]   2> 77616 T499 oascc.ZkStateReader$2.process A cluster state change has occurred - updating... (6)
[junit4:junit4]   2> 77617 T537 oascc.ZkStateReader$2.process A cluster state change has occurred - updating... (6)
[junit4:junit4]   2> 77617 T487 oascc.ZkStateReader$2.process A cluster state change has occurred - updating... (6)
[junit4:junit4]   2> 77618 T473 oascc.ZkStateReader$2.process A cluster state change has occurred - updating... (6)
[junit4:junit4]   2> 77618 T511 oascc.ZkStateReader$2.process A cluster state change has occurred - updating... (6)
[junit4:junit4]   2> 77755 T453 oejs.Server.doStart jetty-8.1.7.v20120910
[junit4:junit4]   2> 77759 T453 oejs.AbstractConnector.doStart Started SelectChannelConnector@0.0.0.0:51623
[junit4:junit4]   2> 77760 T453 oasc.SolrResourceLoader.locateSolrHome JNDI not configured for solr (NoInitialContextEx)
[junit4:junit4]   2> 77760 T453 oasc.SolrResourceLoader.locateSolrHome using system property solr.solr.home: C:\Users\JenkinsSlave\workspace\Lucene-Solr-4.x-Windows\solr\build\solr-solrj\test\J0\.\solrtest-jetty6-1352355619484
[junit4:junit4]   2> 77761 T453 oasc.SolrResourceLoader.<init> new SolrResourceLoader for deduced Solr Home: 'C:\Users\JenkinsSlave\workspace\Lucene-Solr-4.x-Windows\solr\build\solr-solrj\test\J0\.\solrtest-jetty6-1352355619484\'
[junit4:junit4]   2> 77798 T453 oass.SolrDispatchFilter.init SolrDispatchFilter.init()
[junit4:junit4]   2> 77798 T453 oasc.SolrResourceLoader.locateSolrHome JNDI not configured for solr (NoInitialContextEx)
[junit4:junit4]   2> 77798 T453 oasc.SolrResourceLoader.locateSolrHome using system property solr.solr.home: C:\Users\JenkinsSlave\workspace\Lucene-Solr-4.x-Windows\solr\build\solr-solrj\test\J0\.\solrtest-jetty6-1352355619484
[junit4:junit4]   2> 77799 T453 oasc.CoreContainer$Initializer.initialize looking for solr.xml: C:\Users\JenkinsSlave\workspace\Lucene-Solr-4.x-Windows\solr\build\solr-solrj\test\J0\.\solrtest-jetty6-1352355619484\solr.xml
[junit4:junit4]   2> 77799 T453 oasc.CoreContainer.<init> New CoreContainer 1083868
[junit4:junit4]   2> 77799 T453 oasc.CoreContainer.load Loading CoreContainer using Solr Home: 'C:\Users\JenkinsSlave\workspace\Lucene-Solr-4.x-Windows\solr\build\solr-solrj\test\J0\.\solrtest-jetty6-1352355619484\'
[junit4:junit4]   2> 77799 T453 oasc.SolrResourceLoader.<init> new SolrResourceLoader for directory: 'C:\Users\JenkinsSlave\workspace\Lucene-Solr-4.x-Windows\solr\build\solr-solrj\test\J0\.\solrtest-jetty6-1352355619484\'
[junit4:junit4]   2> 77828 T453 oasc.CoreContainer.load Registering Log Listener
[junit4:junit4]   2> 77843 T453 oasc.CoreContainer.initZooKeeper Zookeeper client=127.0.0.1:51574/solr
[junit4:junit4]   2> 77843 T453 oaz.ZooKeeper.<init> Initiating client connection, connectString=127.0.0.1:51574/solr sessionTimeout=8000 watcher=org.apache.solr.common.cloud.ConnectionManager@96e148
[junit4:junit4]   2> 77845 T550 oaz.ClientCnxn$SendThread.startConnect Opening socket connection to server /127.0.0.1:51574
[junit4:junit4]   2> 77845 T453 oascc.ConnectionManager.waitForConnected Waiting for client to connect to ZooKeeper
[junit4:junit4]   2> 77847 T550 oaz.ClientCnxn$SendThread.primeConnection Socket connection established to 127.0.0.1/127.0.0.1:51574, initiating session
[junit4:junit4]   2> 77847 T455 oazs.NIOServerCnxn$Factory.run Accepted socket connection from /127.0.0.1:51628
[junit4:junit4]   2> 77847 T455 oazs.NIOServerCnxn.readConnectRequest Client attempting to establish new session at /127.0.0.1:51628
[junit4:junit4]   2> 77854 T457 oazs.NIOServerCnxn.finishSessionInit Established session 0x13adeabf41e0008 with negotiated timeout 8000 for client /127.0.0.1:51628
[junit4:junit4]   2> 77854 T550 oaz.ClientCnxn$SendThread.readConnectResult Session establishment complete on server 127.0.0.1/127.0.0.1:51574, sessionid = 0x13adeabf41e0008, negotiated timeout = 8000
[junit4:junit4]   2> 77854 T551 oascc.ConnectionManager.process Watcher org.apache.solr.common.cloud.ConnectionManager@96e148 name:ZooKeeperConnection Watcher:127.0.0.1:51574/solr got event WatchedEvent state:SyncConnected type:None path:null path:null type:None
[junit4:junit4]   2> 77854 T453 oascc.ConnectionManager.waitForConnected Client is connected to ZooKeeper
[junit4:junit4]   2> 77855 T459 oazs.PrepRequestProcessor.pRequest Got user-level KeeperException when processing sessionid:0x13adeabf41e0008 type:create cxid:0x1 zxid:0xfffffffffffffffe txntype:unknown reqpath:n/a Error Path:/solr/overseer Error:KeeperErrorCode = NodeExists for /solr/overseer
[junit4:junit4]   2> 77858 T459 oazs.PrepRequestProcessor.pRequest Got user-level KeeperException when processing sessionid:0x13adeabf41e0008 type:create cxid:0x2 zxid:0xfffffffffffffffe txntype:unknown reqpath:n/a Error Path:/solr/overseer Error:KeeperErrorCode = NodeExists for /solr/overseer
[junit4:junit4]   2> 77860 T453 oasc.ZkController.createEphemeralLiveNode Register node as live in ZooKeeper:/live_nodes/127.0.0.1:51623_solr
[junit4:junit4]   2> 77861 T459 oazs.PrepRequestProcessor.pRequest Got user-level KeeperException when processing sessionid:0x13adeabf41e0008 type:delete cxid:0x4 zxid:0xfffffffffffffffe txntype:unknown reqpath:n/a Error Path:/solr/live_nodes/127.0.0.1:51623_solr Error:KeeperErrorCode = NoNode for /solr/live_nodes/127.0.0.1:51623_solr
[junit4:junit4]   2> 77863 T453 oascc.SolrZkClient.makePath makePath: /live_nodes/127.0.0.1:51623_solr
[junit4:junit4]   2> 77869 T525 oascc.ZkStateReader$3.process Updating live nodes... (7)
[junit4:junit4]   2> 77869 T537 oascc.ZkStateReader$3.process Updating live nodes... (7)
[junit4:junit4]   2> 77869 T499 oascc.ZkStateReader$3.process Updating live nodes... (7)
[junit4:junit4]   2> 77869 T487 oascc.ZkStateReader$3.process Updating live nodes... (7)
[junit4:junit4]   2> 77870 T511 oascc.ZkStateReader$3.process Updating live nodes... (7)
[junit4:junit4]   2> 77870 T473 oascc.ZkStateReader$3.process Updating live nodes... (7)
[junit4:junit4]   2> 77871 T453 oashc.HttpShardHandlerFactory.getParameter Setting socketTimeout to: 0
[junit4:junit4]   2> 77872 T453 oashc.HttpShardHandlerFactory.getParameter Setting urlScheme to: http://
[junit4:junit4]   2> 77873 T453 oashc.HttpShardHandlerFactory.getParameter Setting connTimeout to: 0
[junit4:junit4]   2> 77873 T453 oashc.HttpShardHandlerFactory.getParameter Setting maxConnectionsPerHost to: 20
[junit4:junit4]   2> 77873 T453 oashc.HttpShardHandlerFactory.getParameter Setting corePoolSize to: 0
[junit4:junit4]   2> 77873 T453 oashc.HttpShardHandlerFactory.getParameter Setting maximumPoolSize to: 2147483647
[junit4:junit4]   2> 77874 T453 oashc.HttpShardHandlerFactory.getParameter Setting maxThreadIdleTime to: 5
[junit4:junit4]   2> 77875 T453 oashc.HttpShardHandlerFactory.getParameter Setting sizeOfQueue to: -1
[junit4:junit4]   2> 77875 T453 oashc.HttpShardHandlerFactory.getParameter Setting fairnessPolicy to: false
[junit4:junit4]   2> 77876 T453 oascsi.HttpClientUtil.createClient Creating new http client, config:maxConnectionsPerHost=20&maxConnections=10000&socketTimeout=0&connTimeout=0&retry=false
[junit4:junit4]   2> 77892 T453 oascc.ZkStateReader.createClusterStateWatchersAndUpdate Updating cluster state from ZooKeeper... 
[junit4:junit4]   2> 77903 T453 oasc.CoreContainer.create Creating SolrCore 'collection1' using instanceDir: C:\Users\JenkinsSlave\workspace\Lucene-Solr-4.x-Windows\solr\build\solr-solrj\test\J0\.\solrtest-jetty6-1352355619484\collection1
[junit4:junit4]   2> 77904 T453 oasc.ZkController.createCollectionZkNode Check for collection zkNode:collection1
[junit4:junit4]   2> 77904 T453 oasc.ZkController.createCollectionZkNode Collection zkNode exists
[junit4:junit4]   2> 77905 T453 oasc.ZkController.readConfigName Load collection config from:/collections/collection1
[junit4:junit4]   2> 77909 T453 oasc.SolrResourceLoader.<init> new SolrResourceLoader for directory: 'C:\Users\JenkinsSlave\workspace\Lucene-Solr-4.x-Windows\solr\build\solr-solrj\test\J0\.\solrtest-jetty6-1352355619484\collection1\'
[junit4:junit4]   2> 77954 T453 oasc.SolrConfig.<init> Using Lucene MatchVersion: LUCENE_41
[junit4:junit4]   2> 78016 T453 oasc.SolrConfig.<init> Loaded SolrConfig: solrconfig.xml
[junit4:junit4]   2> 78018 T453 oass.IndexSchema.readSchema Reading Solr Schema
[junit4:junit4]   2> 78025 T453 oass.IndexSchema.readSchema Schema name=test
[junit4:junit4]   2> 78564 T453 oass.IndexSchema.readSchema default search field in schema is text
[junit4:junit4]   2> 78567 T453 oass.IndexSchema.readSchema unique key field: id
[junit4:junit4]   2> 78569 T453 oass.IndexSchema.readSchema WARNING Field text is not multivalued and destination for multiple copyFields (2)
[junit4:junit4]   2> 78569 T453 oass.IndexSchema.readSchema WARNING Field lowerfilt1and2 is not multivalued and destination for multiple copyFields (2)
[junit4:junit4]   2> 78569 T453 oasc.SolrCore.<init> [collection1] Opening new SolrCore at C:\Users\JenkinsSlave\workspace\Lucene-Solr-4.x-Windows\solr\build\solr-solrj\test\J0\.\solrtest-jetty6-1352355619484\collection1\, dataDir=.\org.apache.solr.client.solrj.impl.CloudSolrServerTest-1352355541903/jetty6\
[junit4:junit4]   2> 78570 T453 oasc.SolrCore.<init> JMX monitoring not detected for core: collection1
[junit4:junit4]   2> 78571 T453 oasc.SolrCore.getNewIndexDir New index directory detected: old=null new=.\org.apache.solr.client.solrj.impl.CloudSolrServerTest-1352355541903/jetty6\index/
[junit4:junit4]   2> 78571 T453 oasc.SolrCore.initIndex WARNING [collection1] Solr index directory '.\org.apache.solr.client.solrj.impl.CloudSolrServerTest-1352355541903\jetty6\index' doesn't exist. Creating new index...
[junit4:junit4]   2> 78571 T453 oasc.CachingDirectoryFactory.get return new directory for C:\Users\JenkinsSlave\workspace\Lucene-Solr-4.x-Windows\solr\build\solr-solrj\test\J0\.\org.apache.solr.client.solrj.impl.CloudSolrServerTest-1352355541903\jetty6\index forceNew:false
[junit4:junit4]   2> 78579 T453 oasc.SolrDeletionPolicy.onCommit SolrDeletionPolicy.onCommit: commits:num=1
[junit4:junit4]   2> 		commit{dir=NRTCachingDirectory(org.apache.lucene.store.SimpleFSDirectory@C:\Users\JenkinsSlave\workspace\Lucene-Solr-4.x-Windows\solr\build\solr-solrj\test\J0\org.apache.solr.client.solrj.impl.CloudSolrServerTest-1352355541903\jetty6\index lockFactory=org.apache.lucene.store.NativeFSLockFactory@baafcf; maxCacheMB=48.0 maxMergeSizeMB=4.0),segFN=segments_1,generation=1,filenames=[segments_1]
[junit4:junit4]   2> 78579 T453 oasc.SolrDeletionPolicy.updateCommits newest commit = 1
[junit4:junit4]   2> 78581 T453 oasc.RequestHandlers.initHandlersFromConfig created /get: solr.RealTimeGetHandler
[junit4:junit4]   2> 78582 T453 oasc.RequestHandlers.initHandlersFromConfig adding lazy requestHandler: solr.ReplicationHandler
[junit4:junit4]   2> 78582 T453 oasc.RequestHandlers.initHandlersFromConfig created /replication: solr.ReplicationHandler
[junit4:junit4]   2> 78582 T453 oasc.RequestHandlers.initHandlersFromConfig created standard: solr.StandardRequestHandler
[junit4:junit4]   2> 78582 T453 oasc.RequestHandlers.initHandlersFromConfig created /update: solr.UpdateRequestHandler
[junit4:junit4]   2> 78582 T453 oasc.RequestHandlers.initHandlersFromConfig created /admin/: org.apache.solr.handler.admin.AdminHandlers
[junit4:junit4]   2> 78589 T453 oashl.XMLLoader.init xsltCacheLifetimeSeconds=60
[junit4:junit4]   2> 78595 T453 oass.SolrIndexSearcher.<init> Opening Searcher@1ba8142 main
[junit4:junit4]   2> 78597 T453 oasu.CommitTracker.<init> Hard AutoCommit: disabled
[junit4:junit4]   2> 78597 T453 oasu.CommitTracker.<init> Soft AutoCommit: disabled
[junit4:junit4]   2> 78598 T552 oasc.SolrCore.registerSearcher [collection1] Registered new searcher Searcher@1ba8142 main{StandardDirectoryReader(segments_1:1)}
[junit4:junit4]   2> 78598 T453 oasc.ZkController.publish numShards not found on descriptor - reading it from system property
[junit4:junit4]   2> 78872 T474 oascc.ZkStateReader.updateClusterState Updating cloud state from ZooKeeper... 
[junit4:junit4]   2> 78873 T474 oasc.Overseer$ClusterStateUpdater.updateState Update state numShards=2 message={
[junit4:junit4]   2> 	  "operation":"state",
[junit4:junit4]   2> 	  "numShards":"2",
[junit4:junit4]   2> 	  "shard":null,
[junit4:junit4]   2> 	  "roles":null,
[junit4:junit4]   2> 	  "state":"down",
[junit4:junit4]   2> 	  "core":"collection1",
[junit4:junit4]   2> 	  "collection":"collection1",
[junit4:junit4]   2> 	  "node_name":"127.0.0.1:51623_solr",
[junit4:junit4]   2> 	  "base_url":"http://127.0.0.1:51623/solr"}
[junit4:junit4]   2> 78879 T551 oascc.ZkStateReader$2.process A cluster state change has occurred - updating... (7)
[junit4:junit4]   2> 78879 T499 oascc.ZkStateReader$2.process A cluster state change has occurred - updating... (7)
[junit4:junit4]   2> 78880 T511 oascc.ZkStateReader$2.process A cluster state change has occurred - updating... (7)
[junit4:junit4]   2> 78881 T537 oascc.ZkStateReader$2.process A cluster state change has occurred - updating... (7)
[junit4:junit4]   2> 78881 T487 oascc.ZkStateReader$2.process A cluster state change has occurred - updating... (7)
[junit4:junit4]   2> 78881 T473 oascc.ZkStateReader$2.process A cluster state change has occurred - updating... (7)
[junit4:junit4]   2> 79007 T453 oasc.CoreContainer.register registering core: collection1
[junit4:junit4]   2> 79007 T453 oasc.ZkController.register Register shard - core:collection1 address:http://127.0.0.1:51623/solr shardId:shard2
[junit4:junit4]   2> 79014 T453 oasc.ZkController.register We are http://127.0.0.1:51623/solr/collection1/ and leader is http://127.0.0.1:51594/solr/collection1/
[junit4:junit4]   2> 79014 T453 oasc.ZkController.register No LogReplay needed for core=collection1 baseURL=http://127.0.0.1:51623/solr
[junit4:junit4]   2> 79014 T453 oasc.ZkController.checkRecovery Core needs to recover:collection1
[junit4:junit4]   2> 79014 T453 oasu.DefaultSolrCoreState.doRecovery Running recovery - first canceling any ongoing recovery
[junit4:junit4]   2> ASYNC  NEW_CORE C45 name=collection1 org.apache.solr.core.SolrCore@fa37d0 url=http://127.0.0.1:51623/solr/collection1 node=127.0.0.1:51623_solr
[junit4:junit4]   2> 79016 T553 C45 P51623 oasc.RecoveryStrategy.run Starting recovery process.  core=collection1 recoveringAfterStartup=true
[junit4:junit4]   2> 79016 T553 C45 P51623 oasc.RecoveryStrategy.doRecovery ###### startupVersions=[]
[junit4:junit4]   2> 79016 T553 C45 P51623 oasc.ZkController.publish numShards not found on descriptor - reading it from system property
[junit4:junit4]   2> 79016 T453 oascc.ZkStateReader.updateClusterState Updating cloud state from ZooKeeper... 
[junit4:junit4]   2> 79018 T553 C45 P51623 oasc.RecoveryStrategy.doRecovery Attempting to PeerSync from http://127.0.0.1:51594/solr/collection1/ core=collection1 - recoveringAfterStartup=true
[junit4:junit4]   2> 79019 T553 C45 P51623 oasu.PeerSync.sync PeerSync: core=collection1 url=http://127.0.0.1:51623/solr START replicas=[http://127.0.0.1:51594/solr/collection1/] nUpdates=100
[junit4:junit4]   2> 79019 T453 oass.SolrDispatchFilter.init user.dir=C:\Users\JenkinsSlave\workspace\Lucene-Solr-4.x-Windows\solr\build\solr-solrj\test\J0
[junit4:junit4]   2> 79020 T453 oass.SolrDispatchFilter.init SolrDispatchFilter.init() done
[junit4:junit4]   2> 79020 T453 oascsi.HttpClientUtil.createClient Creating new http client, config:maxConnections=128&maxConnectionsPerHost=32&followRedirects=false
[junit4:junit4]   2> 79020 T553 C45 P51623 oasu.PeerSync.sync WARNING no frame of reference to tell of we've missed updates
[junit4:junit4]   2> 79022 T553 C45 P51623 oasc.RecoveryStrategy.doRecovery PeerSync Recovery was not successful - trying replication. core=collection1
[junit4:junit4]   2> 79023 T553 C45 P51623 oasc.RecoveryStrategy.doRecovery Starting Replication Recovery. core=collection1
[junit4:junit4]   2> 79023 T553 C45 P51623 oascsi.HttpClientUtil.createClient Creating new http client, config:maxConnections=128&maxConnectionsPerHost=32&followRedirects=false
[junit4:junit4]   2> ASYNC  NEW_CORE C46 name=collection1 org.apache.solr.core.SolrCore@48fd92 url=http://127.0.0.1:51594/solr/collection1 node=127.0.0.1:51594_solr
[junit4:junit4]   2> 79036 T495 C46 P51594 REQ /get {distrib=false&qt=/get&wt=javabin&version=2&getVersions=100} status=0 QTime=0 
[junit4:junit4]   2> 79040 T453 oaz.ZooKeeper.<init> Initiating client connection, connectString=127.0.0.1:51574/solr sessionTimeout=10000 watcher=org.apache.solr.common.cloud.ConnectionManager@ccee87
[junit4:junit4]   2> 79042 T555 oaz.ClientCnxn$SendThread.startConnect Opening socket connection to server /127.0.0.1:51574
[junit4:junit4]   2> 79042 T453 oascc.ConnectionManager.waitForConnected Waiting for client to connect to ZooKeeper
[junit4:junit4]   2> 79044 T555 oaz.ClientCnxn$SendThread.primeConnection Socket connection established to 127.0.0.1/127.0.0.1:51574, initiating session
[junit4:junit4]   2> 79044 T455 oazs.NIOServerCnxn$Factory.run Accepted socket connection from /127.0.0.1:51633
[junit4:junit4]   2> 79044 T455 oazs.NIOServerCnxn.readConnectRequest Client attempting to establish new session at /127.0.0.1:51633
[junit4:junit4]   2> 79047 T457 oazs.NIOServerCnxn.finishSessionInit Established session 0x13adeabf41e0009 with negotiated timeout 10000 for client /127.0.0.1:51633
[junit4:junit4]   2> 79047 T555 oaz.ClientCnxn$SendThread.readConnectResult Session establishment complete on server 127.0.0.1/127.0.0.1:51574, sessionid = 0x13adeabf41e0009, negotiated timeout = 10000
[junit4:junit4]   2> 79047 T556 oascc.ConnectionManager.process Watcher org.apache.solr.common.cloud.ConnectionManager@ccee87 name:ZooKeeperConnection Watcher:127.0.0.1:51574/solr got event WatchedEvent state:SyncConnected type:None path:null path:null type:None
[junit4:junit4]   2> 79047 T453 oascc.ConnectionManager.waitForConnected Client is connected to ZooKeeper
[junit4:junit4]   2> 79050 T453 oascc.ZkStateReader.createClusterStateWatchersAndUpdate Updating cluster state from ZooKeeper... 
[junit4:junit4]   2> 79055 T453 oasc.ChaosMonkey.monkeyLog monkey: init - expire sessions:true cause connection loss:true
[junit4:junit4]   2> 79056 T453 oascsi.HttpClientUtil.createClient Creating new http client, config:
[junit4:junit4]   2> 79065 T453 oascc.ZkStateReader.updateClusterState Updating cloud state from ZooKeeper... 
[junit4:junit4]   2> 79067 T453 oasc.AbstractFullDistribZkTestBase.waitForThingsToLevelOut Wait for recoveries to finish - wait 30 for each attempt
[junit4:junit4]   2> 79067 T453 oasc.AbstractDistribZkTestBase.waitForRecoveriesToFinish Wait for recoveries to finish - collection: collection1 failOnTimeout:true timeout (sec):30
[junit4:junit4]   2> 79069 T453 oascc.ZkStateReader.updateClusterState Updating cloud state from ZooKeeper... 
[junit4:junit4]   2> 79294 T474 oascc.ZkStateReader.updateClusterState Updating cloud state from ZooKeeper... 
[junit4:junit4]   2> 79295 T474 oasc.Overseer$ClusterStateUpdater.updateState Update state numShards=2 message={
[junit4:junit4]   2> 	  "operation":"state",
[junit4:junit4]   2> 	  "numShards":"2",
[junit4:junit4]   2> 	  "shard":"shard2",
[junit4:junit4]   2> 	  "roles":null,
[junit4:junit4]   2> 	  "state":"recovering",
[junit4:junit4]   2> 	  "core":"collection1",
[junit4:junit4]   2> 	  "collection":"collection1",
[junit4:junit4]   2> 	  "node_name":"127.0.0.1:51623_solr",
[junit4:junit4]   2> 	  "base_url":"http://127.0.0.1:51623/solr"}
[junit4:junit4]   2> 79306 T537 oascc.ZkStateReader$2.process A cluster state change has occurred - updating... (7)
[junit4:junit4]   2> 79306 T556 oascc.ZkStateReader$2.process A cluster state change has occurred - updating... (7)
[junit4:junit4]   2> 79306 T487 oascc.ZkStateReader$2.process A cluster state change has occurred - updating... (7)
[junit4:junit4]   2> 79306 T511 oascc.ZkStateReader$2.process A cluster state change has occurred - updating... (7)
[junit4:junit4]   2> 79307 T551 oascc.ZkStateReader$2.process A cluster state change has occurred - updating... (7)
[junit4:junit4]   2> 79307 T499 oascc.ZkStateReader$2.process A cluster state change has occurred - updating... (7)
[junit4:junit4]   2> 79307 T473 oascc.ZkStateReader$2.process A cluster state change has occurred - updating... (7)
[junit4:junit4]   2> 79885 T453 oascc.ZkStateReader.updateClusterState Updating cloud state from ZooKeeper... 
[junit4:junit4]   2>  C44_STATE=coll:collection1 core:collection1 props:{shard=shard1, roles=null, state=recovering, core=collection1, collection=collection1, node_name=127.0.0.1:51616_solr, base_url=http://127.0.0.1:51616/solr}
[junit4:junit4]   2> 80061 T539 C44 P51616 oasc.RecoveryStrategy.doRecovery Begin buffering updates. core=collection1
[junit4:junit4]   2> 80061 T539 C44 P51616 oasu.UpdateLog.bufferUpdates Starting to buffer updates. FSUpdateLog{state=ACTIVE, tlog=null}
[junit4:junit4]   2> 80061 T539 C44 P51616 oasc.RecoveryStrategy.replicate Attempting to replicate from http://127.0.0.1:51588/solr/collection1/. core=collection1
[junit4:junit4]   2> 80061 T539 C44 P51616 oascsi.HttpClientUtil.createClient Creating new http client, config:maxConnections=128&maxConnectionsPerHost=32&followRedirects=false
[junit4:junit4]   2> 80067 T482 C43 P51588 oasu.DirectUpdateHandler2.commit start commit{flags=0,_version_=0,optimize=false,openSearcher=false,waitSearcher=true,expungeDeletes=false,softCommit=false}
[junit4:junit4]   2> 80069 T482 C43 P51588 oasu.DirectUpdateHandler2.commit end_commit_flush
[junit4:junit4]   2> 80069 T482 C43 P51588 /update {waitSearcher=true&openSearcher=false&commit=true&commit_end_point=true&wt=javabin&softCommit=false&version=2} {commit=} 0 2
[junit4:junit4]   2> 80070 T539 C44 P51616 oash.ReplicationHandler.inform Commits will be reserved for  10000
[junit4:junit4]   2> 80070 T539 C44 P51616 oash.SnapPuller.<init>  No value set for 'pollInterval'. Timer Task not started.
[junit4:junit4]   2> 80072 T481 C43 P51588 REQ /replication {command=indexversion&wt=javabin&qt=/replication&version=2} status=0 QTime=0 
[junit4:junit4]   2> 80078 T539 C44 P51616 oasc.SolrDeletionPolicy.onInit SolrDeletionPolicy.onInit: commits:num=1
[junit4:junit4]   2> 		commit{dir=NRTCachingDirectory(org.apache.lucene.store.SimpleFSDirectory@C:\Users\JenkinsSlave\workspace\Lucene-Solr-4.x-Windows\solr\build\solr-solrj\test\J0\org.apache.solr.client.solrj.impl.CloudSolrServerTest-1352355541903\jetty5\index lockFactory=org.apache.lucene.store.NativeFSLockFactory@180703; maxCacheMB=48.0 maxMergeSizeMB=4.0),segFN=segments_1,generation=1,filenames=[segments_1]
[junit4:junit4]   2> 80078 T539 C44 P51616 oasc.SolrDeletionPolicy.updateCommits newest commit = 1
[junit4:junit4]   2> 80078 T539 C44 P51616 oasu.DirectUpdateHandler2.commit start commit{flags=0,_version_=0,optimize=false,openSearcher=true,waitSearcher=true,expungeDeletes=false,softCommit=false}
[junit4:junit4]   2> 80089 T539 C44 P51616 oasc.SolrDeletionPolicy.onCommit SolrDeletionPolicy.onCommit: commits:num=2
[junit4:junit4]   2> 		commit{dir=NRTCachingDirectory(org.apache.lucene.store.SimpleFSDirectory@C:\Users\JenkinsSlave\workspace\Lucene-Solr-4.x-Windows\solr\build\solr-solrj\test\J0\org.apache.solr.client.solrj.impl.CloudSolrServerTest-1352355541903\jetty5\index lockFactory=org.apache.lucene.store.NativeFSLockFactory@180703; maxCacheMB=48.0 maxMergeSizeMB=4.0),segFN=segments_1,generation=1,filenames=[segments_1]
[junit4:junit4]   2> 		commit{dir=NRTCachingDirectory(org.apache.lucene.store.SimpleFSDirectory@C:\Users\JenkinsSlave\workspace\Lucene-Solr-4.x-Windows\solr\build\solr-solrj\test\J0\org.apache.solr.client.solrj.impl.CloudSolrServerTest-1352355541903\jetty5\index lockFactory=org.apache.lucene.store.NativeFSLockFactory@180703; maxCacheMB=48.0 maxMergeSizeMB=4.0),segFN=segments_2,generation=2,filenames=[segments_2]
[junit4:junit4]   2> 80089 T539 C44 P51616 oasc.SolrDeletionPolicy.updateCommits newest commit = 2
[junit4:junit4]   2> 80094 T539 C44 P51616 oass.SolrIndexSearcher.<init> Opening Searcher@30c08a main
[junit4:junit4]   2> 80095 T539 C44 P51616 oasu.DirectUpdateHandler2.commit end_commit_flush
[junit4:junit4]   2> 80095 T538 oasc.SolrCore.registerSearcher [collection1] Registered new searcher Searcher@30c08a main{StandardDirectoryReader(segments_2:2)}
[junit4:junit4]   2> 80096 T539 C44 P51616 oasc.RecoveryStrategy.replay No replay needed. core=collection1
[junit4:junit4]   2> 80096 T539 C44 P51616 oasc.RecoveryStrategy.doRecovery Replication Recovery was successful - registering as Active. core=collection1
[junit4:junit4]   2> 80097 T539 C44 P51616 oasc.ZkController.publish numShards not found on descriptor - reading it from system property
[junit4:junit4]   2> 80099 T539 C44 P51616 oasc.RecoveryStrategy.doRecovery Finished recovery process. core=collection1
[junit4:junit4]   2> 80136 T474 oascc.ZkStateReader.updateClusterState Updating cloud state from ZooKeeper... 
[junit4:junit4]   2> 80137 T474 oasc.Overseer$ClusterStateUpdater.updateState Update state numShards=2 message={
[junit4:junit4]   2> 	  "operation":"state",
[junit4:junit4]   2> 	  "numShards":"2",
[junit4:junit4]   2> 	  "shard":"shard1",
[junit4:junit4]   2> 	  "roles":null,
[junit4:junit4]   2> 	  "state":"active",
[junit4:junit4]   2> 	  "core":"collection1",
[junit4:junit4]   2> 	  "collection":"collection1",
[junit4:junit4]   2> 	  "node_name":"127.0.0.1:51616_solr",
[junit4:junit4]   2> 	  "base_url":"http://127.0.0.1:51616/solr"}
[junit4:junit4]   2> 80143 T487 oascc.ZkStateReader$2.process A cluster state change has occurred - updating... (7)
[junit4:junit4]   2> 80143 T537 oascc.ZkStateReader$2.process A cluster state change has occurred - updating... (7)
[junit4:junit4]   2> 80143 T473 oascc.ZkStateReader$2.process A cluster state change has occurred - updating... (7)
[junit4:junit4]   2> 80143 T556 oascc.ZkStateReader$2.process A cluster state change has occurred - updating... (7)
[junit4:junit4]   2> 80144 T511 oascc.ZkStateReader$2.process A cluster state change has occurred - updating... (7)
[junit4:junit4]   2> 80144 T551 oascc.ZkStateReader$2.process A cluster state change has occurred - updating... (7)
[junit4:junit4]   2> 80144 T499 oascc.ZkStateReader$2.process A cluster state change has occurred - updating... (7)
[junit4:junit4]   2> 80700 T453 oascc.ZkStateReader.updateClusterState Updating cloud state from ZooKeeper... 
[junit4:junit4]   2>  C45_STATE=coll:collection1 core:collection1 props:{shard=shard2, roles=null, state=recovering, core=collection1, collection=collection1, node_name=127.0.0.1:51623_solr, base_url=http://127.0.0.1:51623/solr}
[junit4:junit4]   2> 81483 T553 C45 P51623 oasc.RecoveryStrategy.doRecovery Begin buffering updates. core=collection1
[junit4:junit4]   2> 81483 T553 C45 P51623 oasu.UpdateLog.bufferUpdates Starting to buffer updates. FSUpdateLog{state=ACTIVE, tlog=null}
[junit4:junit4]   2> 81483 T553 C45 P51623 oasc.RecoveryStrategy.replicate Attempting to replicate from http://127.0.0.1:51594/solr/collection1/. core=collection1
[junit4:junit4]   2> 81483 T553 C45 P51623 oascsi.HttpClientUtil.createClient Creating new http client, config:maxConnections=128&maxConnectionsPerHost=32&followRedirects=false
[junit4:junit4]   2> 81496 T497 C46 P51594 oasu.DirectUpdateHandler2.commit start commit{flags=0,_version_=0,optimize=false,openSearcher=false,waitSearcher=true,expungeDeletes=false,softCommit=false}
[junit4:junit4]   2> 81504 T497 C46 P51594 oasc.SolrDeletionPolicy.onInit SolrDeletionPolicy.onInit: commits:num=1
[junit4:junit4]   2> 		commit{dir=NRTCachingDirectory(org.apache.lucene.store.SimpleFSDirectory@C:\Users\JenkinsSlave\workspace\Lucene-Solr-4.x-Windows\solr\build\solr-solrj\test\J0\org.apache.solr.client.solrj.impl.CloudSolrServerTest-1352355541903\jetty2\index lockFactory=org.apache.lucene.store.NativeFSLockFactory@5e9713; maxCacheMB=48.0 maxMergeSizeMB=4.0),segFN=segments_1,generation=1,filenames=[segments_1]
[junit4:junit4]   2> 81505 T497 C46 P51594 oasc.SolrDeletionPolicy.updateCommits newest commit = 1
[junit4:junit4]   2> 81505 T497 C46 P51594 oass.SolrIndexSearcher.<init> Opening Searcher@445dc9 realtime
[junit4:junit4]   2> 81505 T497 C46 P51594 oasu.DirectUpdateHandler2.commit end_commit_flush
[junit4:junit4]   2> 81505 T497 C46 P51594 /update {waitSearcher=true&openSearcher=false&commit=true&commit_end_point=true&wt=javabin&softCommit=false&version=2} {commit=} 0 9
[junit4:junit4]   2> 81506 T553 C45 P51623 oash.ReplicationHandler.inform Commits will be reserved for  10000
[junit4:junit4]   2> 81506 T553 C45 P51623 oash.SnapPuller.<init>  No value set for 'pollInterval'. Timer Task not started.
[junit4:junit4]   2> 81508 T493 C46 P51594 oash.ReplicationHandler.inform Commits will be reserved for  10000
[junit4:junit4]   2> 81508 T493 C46 P51594 REQ /replication {command=indexversion&wt=javabin&qt=/replication&version=2} status=0 QTime=0 
[junit4:junit4]   2> 81515 T553 C45 P51623 oasc.SolrDeletionPolicy.onInit SolrDeletionPolicy.onInit: commits:num=1
[junit4:junit4]   2> 		commit{dir=NRTCachingDirectory(org.apache.lucene.store.SimpleFSDirectory@C:\Users\JenkinsSlave\workspace\Lucene-Solr-4.x-Windows\solr\build\solr-solrj\test\J0\org.apache.solr.client.solrj.impl.CloudSolrServerTest-1352355541903\jetty6\index lockFactory=org.apache.lucene.store.NativeFSLockFactory@baafcf; maxCacheMB=48.0 maxMergeSizeMB=4.0),segFN=segments_1,generation=1,filenames=[segments_1]
[junit4:junit4]   2> 81516 T553 C45 P51623 oasc.SolrDeletionPolicy.updateCommits newest commit = 1
[junit4:junit4]   2> 81516 T453 oascc.ZkStateReader.updateClusterState Updating cloud state from ZooKeeper... 
[junit4:junit4]   2> 81516 T553 C45 P51623 oasu.DirectUpdateHandler2.commit start commit{flags=0,_version_=0,optimize=false,openSearcher=true,waitSearcher=true,expungeDeletes=false,softCommit=false}
[junit4:junit4]   2> 81522 T553 C45 P51623 oasc.SolrDeletionPolicy.onCommit SolrDeletionPolicy.onCommit: commits:num=2
[junit4:junit4]   2> 		commit{dir=NRTCachingDirectory(org.apache.lucene.store.SimpleFSDirectory@C:\Users\JenkinsSlave\workspace\Lucene-Solr-4.x-Windows\solr\build\solr-solrj\test\J0\org.apache.solr.client.solrj.impl.CloudSolrServerTest-1352355541903\jetty6\index lockFactory=org.apache.lucene.store.NativeFSLockFactory@baafcf; maxCacheMB=48.0 maxMergeSizeMB=4.0),segFN=segments_1,generation=1,filenames=[segments_1]
[junit4:junit4]   2> 		commit{dir=NRTCachingDirectory(org.apache.lucene.store.SimpleFSDirectory@C:\Users\JenkinsSlave\workspace\Lucene-Solr-4.x-Windows\solr\build\solr-solrj\test\J0\org.apache.solr.client.solrj.impl.CloudSolrServerTest-1352355541903\jetty6\index lockFactory=org.apache.lucene.store.NativeFSLockFactory@baafcf; maxCacheMB=48.0 maxMergeSizeMB=4.0),segFN=segments_2,generation=2,filenames=[segments_2]
[junit4:junit4]   2> 81522 T553 C45 P51623 oasc.SolrDeletionPolicy.updateCommits newest commit = 2
[junit4:junit4]   2> 81524 T553 C45 P51623 oass.SolrIndexSearcher.<init> Opening Searcher@1feae17 main
[junit4:junit4]   2> 81524 T553 C45 P51623 oasu.DirectUpdateHandler2.commit end_commit_flush
[junit4:junit4]   2> 81524 T552 oasc.SolrCore.registerSearcher [collection1] Registered new searcher Searcher@1feae17 main{StandardDirectoryReader(segments_2:2)}
[junit4:junit4]   2> 81524 T553 C45 P51623 oasc.RecoveryStrategy.replay No replay needed. core=collection1
[junit4:junit4]   2> 81524 T553 C45 P51623 oasc.RecoveryStrategy.doRecovery Replication Recovery was successful - registering as Active. core=collection1
[junit4:junit4]   2> 81524 T553 C45 P51623 oasc.ZkController.publish numShards not found on descriptor - reading it from system property
[junit4:junit4]   2> 81527 T553 C45 P51623 oasc.RecoveryStrategy.doRecovery Finished recovery process. core=collection1
[junit4:junit4]   2> 81784 T474 oascc.ZkStateReader.updateClusterState Updating cloud state from ZooKeeper... 
[junit4:junit4]   2> 81784 T474 oasc.Overseer$ClusterStateUpdater.updateState Update state numShards=2 message={
[junit4:junit4]   2> 	  "operation":"state",
[junit4:junit4]   2> 	  "numShards":"2",
[junit4:junit4]   2> 	  "shard":"shard2",
[junit4:junit4]   2> 	  "roles":null,
[junit4:junit4]   2> 	  "state":"active",
[junit4:junit4]   2> 	  "core":"collection1",
[junit4:junit4]   2> 	  "collection":"collection1",
[junit4:junit4]   2> 	  "node_name":"127.0.0.1:51623_solr",
[junit4:junit4]   2> 	  "base_url":"http://127.0.0.1:51623/solr"}
[junit4:junit4]   2> 81794 T487 oascc.ZkStateReader$2.process A cluster state change has occurred - updating... (7)
[junit4:junit4]   2> 81794 T473 oascc.ZkStateReader$2.process A cluster state change has occurred - updating... (7)
[junit4:junit4]   2> 81795 T556 oascc.ZkStateReader$2.process A cluster state change has occurred - updating... (7)
[junit4:junit4]   2> 81796 T537 oascc.ZkStateReader$2.process A cluster state change has occurred - updating... (7)
[junit4:junit4]   2> 81796 T511 oascc.ZkStateReader$2.process A cluster state change has occurred - updating... (7)
[junit4:junit4]   2> 81797 T551 oascc.ZkStateReader$2.process A cluster state change has occurred - updating... (7)
[junit4:junit4]   2> 81797 T499 oascc.ZkStateReader$2.process A cluster state change has occurred - updating... (7)
[junit4:junit4]   2> 82331 T453 oascc.ZkStateReader.updateClusterState Updating cloud state from ZooKeeper... 
[junit4:junit4]   2> 83148 T453 oascc.ZkStateReader.updateClusterState Updating cloud state from ZooKeeper... 
[junit4:junit4]   2> 83962 T453 oascc.ZkStateReader.updateClusterState Updating cloud state from ZooKeeper... 
[junit4:junit4]   2> 84779 T453 oascc.ZkStateReader.updateClusterState Updating cloud state from ZooKeeper... 
[junit4:junit4]   2> 85595 T453 oascc.ZkStateReader.updateClusterState Updating cloud state from ZooKeeper... 
[junit4:junit4]   2> 86458 T453 oascc.ZkStateReader.updateClusterState Updating cloud state from ZooKeeper... 
[junit4:junit4]   2> 87355 T453 oascc.ZkStateReader.updateClusterState Updating cloud state from ZooKeeper... 
[junit4:junit4]   2> 88252 T453 oascc.ZkStateReader.updateClusterState Updating cloud state from ZooKeeper... 
[junit4:junit4]   2> 89149 T453 oascc.ZkStateReader.updateClusterState Updating cloud state from ZooKeeper... 
[junit4:junit4]   2> 90046 T453 oascc.ZkStateReader.updateClusterState Updating cloud state from ZooKeeper... 
[junit4:junit4]   2> 90942 T453 oascc.ZkStateReader.updateClusterState Updating cloud state from ZooKeeper... 
[junit4:junit4]   2> 91840 T453 oascc.ZkStateReader.updateClusterState Updating cloud state from ZooKeeper... 
[junit4:junit4]   2> 92737 T453 oascc.ZkStateReader.updateClusterState Updating cloud state from ZooKeeper... 
[junit4:junit4]   2> 93634 T453 oascc.ZkStateReader.updateClusterState Updating cloud state from ZooKeeper... 
[junit4:junit4]   2> 94533 T453 oascc.ZkStateReader.updateClusterState Updating cloud state from ZooKeeper... 
[junit4:junit4]   2> 95484 T453 oascc.ZkStateReader.updateClusterState Updating cloud state from ZooKeeper... 
[junit4:junit4]   2> 96471 T453 oascc.ZkStateReader.updateClusterState Updating cloud state from ZooKeeper... 
[junit4:junit4]   2> 97458 T453 oascc.ZkStateReader.updateClusterState Updating cloud state from ZooKeeper... 
[junit4:junit4]   2> 98445 T453 oascc.ZkStateReader.updateClusterState Updating cloud state from ZooKeeper... 
[junit4:junit4]   2> 99431 T453 oascc.ZkStateReader.updateClusterState Updating cloud state from ZooKeeper... 
[junit4:junit4]   2> 100419 T453 oascc.ZkStateReader.updateClusterState Updating cloud state from ZooKeeper... 
[junit4:junit4]   2> 101406 T453 oascc.ZkStateReader.updateClusterState Updating cloud state from ZooKeeper... 
[junit4:junit4]   2> 102393 T453 oascc.ZkStateReader.updateClusterState Updating cloud state from ZooKeeper... 
[junit4:junit4]   2> 103379 T453 oascc.ZkStateReader.updateClusterState Updating cloud state from ZooKeeper... 
[junit4:junit4]   2> 104366 T453 oascc.ZkStateReader.updateClusterState Updating cloud state from ZooKeeper... 
[junit4:junit4]   2> 105415 T453 oascc.ZkStateReader.updateClusterState Updating cloud state from ZooKeeper... 
[junit4:junit4]   2> 106500 T453 oascc.ZkStateReader.updateClusterState Updating cloud state from ZooKeeper... 
[junit4:junit4]   1> 
[junit4:junit4]   1> Thread[qtp29145349-490 Selector0,5,TGRP-CloudSolrServerTest]
[junit4:junit4]   1> sun.nio.ch.WindowsSelectorImpl$SubSelector.poll0(Native Method)
[junit4:junit4]   1> sun.nio.ch.WindowsSelectorImpl$SubSelector.poll(WindowsSelectorImpl.java:295)
[junit4:junit4]   1> sun.nio.ch.WindowsSelectorImpl$SubSelector.access$400(WindowsSelectorImpl.java:277)
[junit4:junit4]   1> sun.nio.ch.WindowsSelectorImpl.doSelect(WindowsSelectorImpl.java:158)
[junit4:junit4]   1> sun.nio.ch.SelectorImpl.lockAndDoSelect(SelectorImpl.java:87)
[junit4:junit4]   1> sun.nio.ch.SelectorImpl.select(SelectorImpl.java:98)
[junit4:junit4]   1> org.eclipse.jetty.io.nio.SelectorManager$SelectSet.doSelect(SelectorManager.java:569)
[junit4:junit4]   1> org.eclipse.jetty.io.nio.SelectorManager$1.run(SelectorManager.java:290)
[junit4:junit4]   1> org.eclipse.jetty.util.thread.QueuedThreadPool.runJob(QueuedThreadPool.java:608)
[junit4:junit4]   1> org.eclipse.jetty.util.thread.QueuedThreadPool$3.run(QueuedThreadPool.java:543)
[junit4:junit4]   1> java.lang.Thread.run(Thread.java:722)
[junit4:junit4]   1> 
[junit4:junit4]   1> Thread[qtp30586873-522,5,TGRP-CloudSolrServerTest]
[junit4:junit4]   1> sun.misc.Unsafe.park(Native Method)
[junit4:junit4]   1> java.util.concurrent.locks.LockSupport.parkNanos(LockSupport.java:226)
[junit4:junit4]   1> java.util.concurrent.locks.AbstractQueuedSynchronizer$ConditionObject.awaitNanos(AbstractQueuedSynchronizer.java:2082)
[junit4:junit4]   1> org.eclipse.jetty.util.BlockingArrayQueue.poll(BlockingArrayQueue.java:342)
[junit4:junit4]   1> org.eclipse.jetty.util.thread.QueuedThreadPool.idleJobPoll(QueuedThreadPool.java:526)
[junit4:junit4]   1> org.eclipse.jetty.util.thread.QueuedThreadPool.access$600(QueuedThreadPool.java:44)
[junit4:junit4]   1> org.eclipse.jetty.util.thread.QueuedThreadPool$3.run(QueuedThreadPool.java:572)
[junit4:junit4]   1> java.lang.Thread.run(Thread.java:722)
[junit4:junit4]   1> 
[junit4:junit4]   1> Thread[SUITE-CloudSolrServerTest-seed#[AB42D9643B4C0084],5,TGRP-CloudSolrServerTest]
[junit4:junit4]   1> java.lang.Object.wait(Native Method)
[junit4:junit4]   1> java.lang.Thread.join(Thread.java:1266)
[junit4:junit4]   1> com.carrotsearch.randomizedtesting.ThreadLeakControl.forkTimeoutingTask(ThreadLeakControl.java:787)
[junit4:junit4]   1> com.carrotsearch.randomizedtesting.ThreadLeakControl$2.evaluate(ThreadLeakControl.java:385)
[junit4:junit4]   1> com.carrotsearch.randomizedtesting.RandomizedRunner.runSuite(RandomizedRunner.java:556)
[junit4:junit4]   1> com.carrotsearch.randomizedtesting.RandomizedRunner.access$200(RandomizedRunner.java:79)
[junit4:junit4]   1> com.carrotsearch.randomizedtesting.RandomizedRunner$1.run(RandomizedRunner.java:492)
[junit4:junit4]   1> 
[junit4:junit4]   1> Thread[qtp14226076-503 Acceptor0 SelectChannelConnector@0.0.0.0:51600,5,TGRP-CloudSolrServerTest]
[junit4:junit4]   1> sun.nio.ch.ServerSocketChannelImpl.accept0(Native Method)
[junit4:junit4]   1> sun.nio.ch.ServerSocketChannelImpl.accept(ServerSocketChannelImpl.java:226)
[junit4:junit4]   1> org.eclipse.jetty.server.nio.SelectChannelConnector.accept(SelectChannelConnector.java:109)
[junit4:junit4]   1> org.eclipse.jetty.server.AbstractConnector$Acceptor.run(AbstractConnector.java:938)
[junit4:junit4]   1> org.eclipse.jetty.util.thread.QueuedThreadPool.runJob(QueuedThreadPool.java:608)
[junit4:junit4]   1> org.eclipse.jetty.util.thread.QueuedThreadPool$3.run(QueuedThreadPool.java:543)
[junit4:junit4]   1> java.lang.Thread.run(Thread.java:722)
[junit4:junit4]   1> 
[junit4:junit4]   1> Thread[qtp24705088-478 Selector0,5,TGRP-CloudSolrServerTest]
[junit4:junit4]   1> sun.nio.ch.WindowsSelectorImpl$SubSelector.poll0(Native Method)
[junit4:junit4]   1> sun.nio.ch.WindowsSelectorImpl$SubSelector.poll(WindowsSelectorImpl.java:295)
[junit4:junit4]   1> sun.nio.ch.WindowsSelectorImpl$SubSelector.access$400(WindowsSelectorImpl.java:277)
[junit4:junit4]   1> sun.nio.ch.WindowsSelectorImpl.doSelect(WindowsSelectorImpl.java:158)
[junit4:junit4]   1> sun.nio.ch.SelectorImpl.lockAndDoSelect(SelectorImpl.java:87)
[junit4:junit4]   1> sun.nio.ch.SelectorImpl.select(SelectorImpl.java:98)
[junit4:junit4]   1> org.eclipse.jetty.io.nio.SelectorManager$SelectSet.doSelect(SelectorManager.java:569)
[junit4:junit4]   1> org.eclipse.jetty.io.nio.SelectorManager$1.run(SelectorManager.java:290)
[junit4:junit4]   1> org.eclipse.jetty.util.thread.QueuedThreadPool.runJob(QueuedThreadPool.java:608)
[junit4:junit4]   1> org.eclipse.jetty.util.thread.QueuedThreadPool$3.run(QueuedThreadPool.java:543)
[junit4:junit4]   1> java.lang.Thread.run(Thread.java:722)
[junit4:junit4]   1> 
[junit4:junit4]   1> Thread[Overseer-88627972803526658-127.0.0.1:51582_solr-n_0000000000,5,Overseer collection creation process.]
[junit4:junit4]   1> sun.misc.Unsafe.park(Native Method)
[junit4:junit4]   1> java.util.concurrent.locks.LockSupport.park(LockSupport.java:186)
[junit4:junit4]   1> java.util.concurrent.locks.AbstractQueuedSynchronizer.parkAndCheckInterrupt(AbstractQueuedSynchronizer.java:834)
[junit4:junit4]   1> java.util.concurrent.locks.AbstractQueuedSynchronizer.doAcquireSharedInterruptibly(AbstractQueuedSynchronizer.java:994)
[junit4:junit4]   1> java.util.concurrent.locks.AbstractQueuedSynchronizer.acquireSharedInterruptibly(AbstractQueuedSynchronizer.java:1303)
[junit4:junit4]   1> java.util.concurrent.CountDownLatch.await(CountDownLatch.java:236)
[junit4:junit4]   1> org.apache.solr.cloud.DistributedQueue$LatchChildWatcher.await(DistributedQueue.java:179)
[junit4:junit4]   1> org.apache.solr.cloud.DistributedQueue.peek(DistributedQueue.java:277)
[junit4:junit4]   1> org.apache.solr.cloud.OverseerCollectionProcessor.run(OverseerCollectionProcessor.java:86)
[junit4:junit4]   1> java.lang.Thread.run(Thread.java:722)
[junit4:junit4]   1> 
[junit4:junit4]   1> Thread[qtp20313524-543 Acceptor0 SelectChannelConnector@0.0.0.0:51623,5,TGRP-CloudSolrServerTest]
[junit4:junit4]   1> sun.nio.ch.ServerSocketChannelImpl.accept0(Native Method)
[junit4:junit4]   1> sun.nio.ch.ServerSocketChannelImpl.accept(ServerSocketChannelImpl.java:226)
[junit4:junit4]   1> org.eclipse.jetty.server.nio.SelectChannelConnector.accept(SelectChannelConnector.java:109)
[junit4:junit4]   1> org.eclipse.jetty.server.AbstractConnector$Acceptor.run(AbstractConnector.java:938)
[junit4:junit4]   1> org.eclipse.jetty.util.thread.QueuedThreadPool.runJob(QueuedThreadPool.java:608)
[junit4:junit4]   1> org.eclipse.jetty.util.thread.QueuedThreadPool$3.run(QueuedThreadPool.java:543)
[junit4:junit4]   1> java.lang.Thread.run(Thread.java:722)
[junit4:junit4]   1> 
[junit4:junit4]   1> Thread[TEST-CloudSolrServerTest.testDistribSearch-seed#[AB42D9643B4C0084]-SendThread(127.0.0.1:51574),5,TGRP-CloudSolrServerTest]
[junit4:junit4]   1> sun.nio.ch.WindowsSelectorImpl$SubSelector.poll0(Native Method)
[junit4:junit4]   1> sun.nio.ch.WindowsSelectorImpl$SubSelector.poll(WindowsSelectorImpl.java:295)
[junit4:junit4]   1> sun.nio.ch.WindowsSelectorImpl$SubSelector.access$400(WindowsSelectorImpl.java:277)
[junit4:junit4]   1> sun.nio.ch.WindowsSelectorImpl.doSelect(WindowsSelectorImpl.java:158)
[junit4:junit4]   1> sun.nio.ch.SelectorImpl.lockAndDoSelect(SelectorImpl.java:87)
[junit4:junit4]   1> sun.nio.ch.SelectorImpl.select(SelectorImpl.java:98)
[junit4:junit4]   1> org.apache.zookeeper.ClientCnxn$SendThread.run(ClientCnxn.java:1131)
[junit4:junit4]   1> 
[junit4:junit4]   1> Thread[HashSessionScavenger-24,5,TGRP-CloudSolrServerTest]
[junit4:junit4]   1> java.lang.Object.wait(Native Method)
[junit4:junit4]   1> java.util.TimerThread.mainLoop(Timer.java:552)
[junit4:junit4]   1> java.util.TimerThread.run(Timer.java:505)
[junit4:junit4]   1> 
[junit4:junit4]   1> Thread[Thread-268,5,Overseer state updater.]
[junit4:junit4]   1> java.lang.Thread.sleep(Native Method)
[junit4:junit4]   1> org.apache.solr.cloud.Overseer$ClusterStateUpdater.run(Overseer.java:156)
[junit4:junit4]   1> java.lang.Thread.run(Thread.java:722)
[junit4:junit4]   1> 
[junit4:junit4]   1> Thread[qtp30

[...truncated too long message...]

tion":"collection1",
[junit4:junit4]   1>                 "node_name":"127.0.0.1:51608_solr",
[junit4:junit4]   1>                 "base_url":"http://127.0.0.1:51608/solr"},
[junit4:junit4]   1>               "127.0.0.1:51623_solr_collection1":{
[junit4:junit4]   1>                 "shard":"shard2",
[junit4:junit4]   1>                 "roles":null,
[junit4:junit4]   1>                 "state":"active",
[junit4:junit4]   1>                 "core":"collection1",
[junit4:junit4]   1>                 "collection":"collection1",
[junit4:junit4]   1>                 "node_name":"127.0.0.1:51623_solr",
[junit4:junit4]   1>                 "base_url":"http://127.0.0.1:51623/solr"}}}},
[junit4:junit4]   1>         "control_collection":{"control_shard":{"replicas":{"127.0.0.1:51582_solr_collection1":{
[junit4:junit4]   1>                 "shard":"control_shard",
[junit4:junit4]   1>                 "roles":null,
[junit4:junit4]   1>                 "state":"active",
[junit4:junit4]   1>                 "core":"collection1",
[junit4:junit4]   1>                 "collection":"control_collection",
[junit4:junit4]   1>                 "node_name":"127.0.0.1:51582_solr",
[junit4:junit4]   1>                 "base_url":"http://127.0.0.1:51582/solr",
[junit4:junit4]   1>                 "leader":"true"}}}}}
[junit4:junit4]   1>  /zookeeper (1)
[junit4:junit4]   1>  DATA:
[junit4:junit4]   1>      
[junit4:junit4]   1> 
[junit4:junit4]   2> NOTE: reproduce with: ant test  -Dtestcase=CloudSolrServerTest -Dtests.method=testDistribSearch -Dtests.seed=AB42D9643B4C0084 -Dtests.slow=true -Dtests.locale=ms -Dtests.timezone=Chile/Continental -Dtests.file.encoding=US-ASCII
[junit4:junit4] FAILURE  120s | CloudSolrServerTest.testDistribSearch <<<
[junit4:junit4]    > Throwable #1: java.lang.AssertionError: There are still nodes recoverying - waited for 30 seconds
[junit4:junit4]    > 	at __randomizedtesting.SeedInfo.seed([AB42D9643B4C0084:2AA4577C4C1360B8]:0)
[junit4:junit4]    > 	at org.junit.Assert.fail(Assert.java:93)
[junit4:junit4]    > 	at org.apache.solr.cloud.AbstractDistribZkTestBase.waitForRecoveriesToFinish(AbstractDistribZkTestBase.java:165)
[junit4:junit4]    > 	at org.apache.solr.cloud.AbstractFullDistribZkTestBase.waitForRecoveriesToFinish(AbstractFullDistribZkTestBase.java:558)
[junit4:junit4]    > 	at org.apache.solr.cloud.AbstractFullDistribZkTestBase.waitForThingsToLevelOut(AbstractFullDistribZkTestBase.java:1133)
[junit4:junit4]    > 	at org.apache.solr.client.solrj.impl.CloudSolrServerTest.doTest(CloudSolrServerTest.java:95)
[junit4:junit4]    > 	at org.apache.solr.BaseDistributedSearchTestCase.testDistribSearch(BaseDistributedSearchTestCase.java:695)
[junit4:junit4]    > 	at sun.reflect.NativeMethodAccessorImpl.invoke0(Native Method)
[junit4:junit4]    > 	at sun.reflect.NativeMethodAccessorImpl.invoke(NativeMethodAccessorImpl.java:57)
[junit4:junit4]    > 	at sun.reflect.DelegatingMethodAccessorImpl.invoke(DelegatingMethodAccessorImpl.java:43)
[junit4:junit4]    > 	at java.lang.reflect.Method.invoke(Method.java:601)
[junit4:junit4]    > 	at com.carrotsearch.randomizedtesting.RandomizedRunner.invoke(RandomizedRunner.java:1559)
[junit4:junit4]    > 	at com.carrotsearch.randomizedtesting.RandomizedRunner.access$600(RandomizedRunner.java:79)
[junit4:junit4]    > 	at com.carrotsearch.randomizedtesting.RandomizedRunner$6.evaluate(RandomizedRunner.java:737)
[junit4:junit4]    > 	at com.carrotsearch.randomizedtesting.RandomizedRunner$7.evaluate(RandomizedRunner.java:773)
[junit4:junit4]    > 	at com.carrotsearch.randomizedtesting.RandomizedRunner$8.evaluate(RandomizedRunner.java:787)
[junit4:junit4]    > 	at com.carrotsearch.randomizedtesting.rules.SystemPropertiesRestoreRule$1.evaluate(SystemPropertiesRestoreRule.java:53)
[junit4:junit4]    > 	at org.apache.lucene.util.TestRuleSetupTeardownChained$1.evaluate(TestRuleSetupTeardownChained.java:50)
[junit4:junit4]    > 	at org.apache.lucene.util.TestRuleFieldCacheSanity$1.evaluate(TestRuleFieldCacheSanity.java:51)
[junit4:junit4]    > 	at org.apache.lucene.util.AbstractBeforeAfterRule$1.evaluate(AbstractBeforeAfterRule.java:45)
[junit4:junit4]    > 	at com.carrotsearch.randomizedtesting.rules.SystemPropertiesInvariantRule$1.evaluate(SystemPropertiesInvariantRule.java:55)
[junit4:junit4]    > 	at org.apache.lucene.util.TestRuleThreadAndTestName$1.evaluate(TestRuleThreadAndTestName.java:48)
[junit4:junit4]    > 	at org.apache.lucene.util.TestRuleIgnoreAfterMaxFailures$1.evaluate(TestRuleIgnoreAfterMaxFailures.java:70)
[junit4:junit4]    > 	at org.apache.lucene.util.TestRuleMarkFailure$1.evaluate(TestRuleMarkFailure.java:48)
[junit4:junit4]    > 	at com.carrotsearch.randomizedtesting.rules.StatementAdapter.evaluate(StatementAdapter.java:36)
[junit4:junit4]    > 	at com.carrotsearch.randomizedtesting.ThreadLeakControl$StatementRunner.run(ThreadLeakControl.java:358)
[junit4:junit4]    > 	at com.carrotsearch.randomizedtesting.ThreadLeakControl.forkTimeoutingTask(ThreadLeakControl.java:782)
[junit4:junit4]    > 	at com.carrotsearch.randomizedtesting.ThreadLeakControl$3.evaluate(ThreadLeakControl.java:442)
[junit4:junit4]    > 	at com.carrotsearch.randomizedtesting.RandomizedRunner.runSingleTest(RandomizedRunner.java:746)
[junit4:junit4]    > 	at com.carrotsearch.randomizedtesting.RandomizedRunner$3.evaluate(RandomizedRunner.java:648)
[junit4:junit4]    > 	at com.carrotsearch.randomizedtesting.RandomizedRunner$4.evaluate(RandomizedRunner.java:682)
[junit4:junit4]    > 	at com.carrotsearch.randomizedtesting.RandomizedRunner$5.evaluate(RandomizedRunner.java:693)
[junit4:junit4]    > 	at com.carrotsearch.randomizedtesting.rules.StatementAdapter.evaluate(StatementAdapter.java:36)
[junit4:junit4]    > 	at com.carrotsearch.randomizedtesting.rules.SystemPropertiesRestoreRule$1.evaluate(SystemPropertiesRestoreRule.java:53)
[junit4:junit4]    > 	at org.apache.lucene.util.AbstractBeforeAfterRule$1.evaluate(AbstractBeforeAfterRule.java:45)
[junit4:junit4]    > 	at org.apache.lucene.util.TestRuleStoreClassName$1.evaluate(TestRuleStoreClassName.java:42)
[junit4:junit4]    > 	at com.carrotsearch.randomizedtesting.rules.SystemPropertiesInvariantRule$1.evaluate(SystemPropertiesInvariantRule.java:55)
[junit4:junit4]    > 	at com.carrotsearch.randomizedtesting.rules.NoShadowingOrOverridesOnMethodsRule$1.evaluate(NoShadowingOrOverridesOnMethodsRule.java:39)
[junit4:junit4]    > 	at com.carrotsearch.randomizedtesting.rules.NoShadowingOrOverridesOnMethodsRule$1.evaluate(NoShadowingOrOverridesOnMethodsRule.java:39)
[junit4:junit4]    > 	at com.carrotsearch.randomizedtesting.rules.StatementAdapter.evaluate(StatementAdapter.java:36)
[junit4:junit4]    > 	at org.apache.lucene.util.TestRuleAssertionsRequired$1.evaluate(TestRuleAssertionsRequired.java:43)
[junit4:junit4]    > 	at org.apache.lucene.util.TestRuleMarkFailure$1.evaluate(TestRuleMarkFailure.java:48)
[junit4:junit4]    > 	at org.apache.lucene.util.TestRuleIgnoreAfterMaxFailures$1.evaluate(TestRuleIgnoreAfterMaxFailures.java:70)
[junit4:junit4]    > 	at org.apache.lucene.util.TestRuleIgnoreTestSuites$1.evaluate(TestRuleIgnoreTestSuites.java:55)
[junit4:junit4]    > 	at com.carrotsearch.randomizedtesting.rules.StatementAdapter.evaluate(StatementAdapter.java:36)
[junit4:junit4]    > 	at com.carrotsearch.randomizedtesting.ThreadLeakControl$StatementRunner.run(ThreadLeakControl.java:358)
[junit4:junit4]    > 	at java.lang.Thread.run(Thread.java:722)
[junit4:junit4]   2> 119672 T453 oas.SolrTestCaseJ4.deleteCore ###deleteCore
[junit4:junit4]   2> NOTE: test params are: codec=Lucene40, sim=DefaultSimilarity, locale=ms, timezone=Chile/Continental
[junit4:junit4]   2> NOTE: Windows 7 6.1 x86/Oracle Corporation 1.7.0_09 (32-bit)/cpus=2,threads=1,free=130492416,total=306184192
[junit4:junit4]   2> NOTE: All tests run in this JVM: [SolrExampleStreamingBinaryTest, TestFastInputStream, TestNamedListCodec, IteratorChainTest, ModifiableSolrParamsTest, MultiCoreExampleJettyTest, LargeVolumeBinaryJettyTest, ClientUtilsTest, SolrDocumentTest, MultiCoreEmbeddedTest, FacetFieldTest, TestDocumentObjectBinder, TestEmbeddedSolrServer, SolrExampleXMLTest, TestUpdateRequestCodec, TermsResponseTest, LargeVolumeEmbeddedTest, NamedListTest, TestLBHttpSolrServer, ContentStreamTest, DocumentAnalysisResponseTest, SolrExampleJettyTest, SolrExampleStreamingTest, SolrExampleBinaryTest, SolrExampleEmbeddedTest, MergeIndexesEmbeddedTest, BasicHttpSolrServerTest, TestBatchUpdate, LargeVolumeJettyTest, JettyWebappTest, TestSolrProperties, TestSpellCheckResponse, TestJavaBinCodec, TestHash, SolrQueryTest, QueryResponseTest, SolrParamTest, FieldAnalysisResponseTest, AnlysisResponseBaseTest, TestXMLEscaping, SolrExceptionTest, CloudSolrServerTest]
[junit4:junit4] Completed in 119.70s, 1 test, 1 failure <<< FAILURES!

[...truncated 9 lines...]
BUILD FAILED
C:\Users\JenkinsSlave\workspace\Lucene-Solr-4.x-Windows\build.xml:335: The following error occurred while executing this line:
C:\Users\JenkinsSlave\workspace\Lucene-Solr-4.x-Windows\build.xml:39: The following error occurred while executing this line:
C:\Users\JenkinsSlave\workspace\Lucene-Solr-4.x-Windows\solr\build.xml:185: The following error occurred while executing this line:
C:\Users\JenkinsSlave\workspace\Lucene-Solr-4.x-Windows\lucene\module-build.xml:61: The following error occurred while executing this line:
C:\Users\JenkinsSlave\workspace\Lucene-Solr-4.x-Windows\lucene\common-build.xml:1163: The following error occurred while executing this line:
C:\Users\JenkinsSlave\workspace\Lucene-Solr-4.x-Windows\lucene\common-build.xml:827: There were test failures: 43 suites, 239 tests, 1 failure

Total time: 48 minutes 33 seconds
Build step 'Invoke Ant' marked build as failure
Archiving artifacts
Recording test results
Description set: Java: 32bit/jdk1.7.0_09 -server -XX:+UseG1GC
Email was triggered for: Failure
Sending email for trigger: Failure



Mime
View raw message