lucene-dev mailing list archives

Site index · List index
Message view « Date » · « Thread »
Top « Date » · « Thread »
From Policeman Jenkins Server <jenk...@sd-datasolutions.de>
Subject [JENKINS] Lucene-Solr-4.x-Linux (32bit/jdk1.8.0-ea-b58) - Build # 2738 - Failure!
Date Fri, 23 Nov 2012 08:57:50 GMT
Build: http://jenkins.sd-datasolutions.de/job/Lucene-Solr-4.x-Linux/2738/
Java: 32bit/jdk1.8.0-ea-b58 -server -XX:+UseG1GC

1 tests failed.
REGRESSION:  org.apache.lucene.analysis.miscellaneous.PatternAnalyzerTest.testRandomStrings

Error Message:
431

Stack Trace:
java.lang.ArrayIndexOutOfBoundsException: 431
	at __randomizedtesting.SeedInfo.seed([FA3EA92218CE0F9B:72B7A99CBBCA58AE]:0)
	at sun.util.locale.provider.RuleBasedBreakIterator.lookupBackwardState(RuleBasedBreakIterator.java:1058)
	at sun.util.locale.provider.RuleBasedBreakIterator.handlePrevious(RuleBasedBreakIterator.java:1009)
	at sun.util.locale.provider.RuleBasedBreakIterator.following(RuleBasedBreakIterator.java:793)
	at sun.util.locale.provider.RuleBasedBreakIterator.isBoundary(RuleBasedBreakIterator.java:843)
	at java.lang.ConditionalSpecialCasing.isFinalCased(ConditionalSpecialCasing.java:210)
	at java.lang.ConditionalSpecialCasing.isConditionMet(ConditionalSpecialCasing.java:175)
	at java.lang.ConditionalSpecialCasing.lookUpTable(ConditionalSpecialCasing.java:163)
	at java.lang.ConditionalSpecialCasing.toLowerCaseEx(ConditionalSpecialCasing.java:111)
	at java.lang.String.toLowerCase(String.java:2469)
	at org.apache.lucene.analysis.miscellaneous.PatternAnalyzer$PatternTokenizer.incrementToken(PatternAnalyzer.java:356)
	at org.apache.lucene.analysis.util.FilteringTokenFilter.incrementToken(FilteringTokenFilter.java:50)
	at org.apache.lucene.analysis.BaseTokenStreamTestCase.checkAnalysisConsistency(BaseTokenStreamTestCase.java:632)
	at org.apache.lucene.analysis.BaseTokenStreamTestCase.checkRandomData(BaseTokenStreamTestCase.java:542)
	at org.apache.lucene.analysis.BaseTokenStreamTestCase.checkRandomData(BaseTokenStreamTestCase.java:443)
	at org.apache.lucene.analysis.BaseTokenStreamTestCase.checkRandomData(BaseTokenStreamTestCase.java:366)
	at org.apache.lucene.analysis.miscellaneous.PatternAnalyzerTest.testRandomStrings(PatternAnalyzerTest.java:155)
	at sun.reflect.NativeMethodAccessorImpl.invoke0(Native Method)
	at sun.reflect.NativeMethodAccessorImpl.invoke(NativeMethodAccessorImpl.java:57)
	at sun.reflect.DelegatingMethodAccessorImpl.invoke(DelegatingMethodAccessorImpl.java:43)
	at java.lang.reflect.Method.invoke(Method.java:474)
	at com.carrotsearch.randomizedtesting.RandomizedRunner.invoke(RandomizedRunner.java:1559)
	at com.carrotsearch.randomizedtesting.RandomizedRunner.access$600(RandomizedRunner.java:79)
	at com.carrotsearch.randomizedtesting.RandomizedRunner$6.evaluate(RandomizedRunner.java:737)
	at com.carrotsearch.randomizedtesting.RandomizedRunner$7.evaluate(RandomizedRunner.java:773)
	at com.carrotsearch.randomizedtesting.RandomizedRunner$8.evaluate(RandomizedRunner.java:787)
	at org.apache.lucene.util.TestRuleSetupTeardownChained$1.evaluate(TestRuleSetupTeardownChained.java:50)
	at org.apache.lucene.util.TestRuleFieldCacheSanity$1.evaluate(TestRuleFieldCacheSanity.java:51)
	at org.apache.lucene.util.AbstractBeforeAfterRule$1.evaluate(AbstractBeforeAfterRule.java:45)
	at com.carrotsearch.randomizedtesting.rules.SystemPropertiesInvariantRule$1.evaluate(SystemPropertiesInvariantRule.java:55)
	at org.apache.lucene.util.TestRuleThreadAndTestName$1.evaluate(TestRuleThreadAndTestName.java:48)
	at org.apache.lucene.util.TestRuleIgnoreAfterMaxFailures$1.evaluate(TestRuleIgnoreAfterMaxFailures.java:70)
	at org.apache.lucene.util.TestRuleMarkFailure$1.evaluate(TestRuleMarkFailure.java:48)
	at com.carrotsearch.randomizedtesting.rules.StatementAdapter.evaluate(StatementAdapter.java:36)
	at com.carrotsearch.randomizedtesting.ThreadLeakControl$StatementRunner.run(ThreadLeakControl.java:358)
	at com.carrotsearch.randomizedtesting.ThreadLeakControl.forkTimeoutingTask(ThreadLeakControl.java:782)
	at com.carrotsearch.randomizedtesting.ThreadLeakControl$3.evaluate(ThreadLeakControl.java:442)
	at com.carrotsearch.randomizedtesting.RandomizedRunner.runSingleTest(RandomizedRunner.java:746)
	at com.carrotsearch.randomizedtesting.RandomizedRunner$3.evaluate(RandomizedRunner.java:648)
	at com.carrotsearch.randomizedtesting.RandomizedRunner$4.evaluate(RandomizedRunner.java:682)
	at com.carrotsearch.randomizedtesting.RandomizedRunner$5.evaluate(RandomizedRunner.java:693)
	at org.apache.lucene.util.AbstractBeforeAfterRule$1.evaluate(AbstractBeforeAfterRule.java:45)
	at org.apache.lucene.util.TestRuleStoreClassName$1.evaluate(TestRuleStoreClassName.java:42)
	at com.carrotsearch.randomizedtesting.rules.SystemPropertiesInvariantRule$1.evaluate(SystemPropertiesInvariantRule.java:55)
	at com.carrotsearch.randomizedtesting.rules.NoShadowingOrOverridesOnMethodsRule$1.evaluate(NoShadowingOrOverridesOnMethodsRule.java:39)
	at com.carrotsearch.randomizedtesting.rules.NoShadowingOrOverridesOnMethodsRule$1.evaluate(NoShadowingOrOverridesOnMethodsRule.java:39)
	at com.carrotsearch.randomizedtesting.rules.StatementAdapter.evaluate(StatementAdapter.java:36)
	at org.apache.lucene.util.TestRuleAssertionsRequired$1.evaluate(TestRuleAssertionsRequired.java:43)
	at org.apache.lucene.util.TestRuleMarkFailure$1.evaluate(TestRuleMarkFailure.java:48)
	at org.apache.lucene.util.TestRuleIgnoreAfterMaxFailures$1.evaluate(TestRuleIgnoreAfterMaxFailures.java:70)
	at org.apache.lucene.util.TestRuleIgnoreTestSuites$1.evaluate(TestRuleIgnoreTestSuites.java:55)
	at com.carrotsearch.randomizedtesting.rules.StatementAdapter.evaluate(StatementAdapter.java:36)
	at com.carrotsearch.randomizedtesting.ThreadLeakControl$StatementRunner.run(ThreadLeakControl.java:358)
	at java.lang.Thread.run(Thread.java:722)




Build Log:
[...truncated 4723 lines...]
[junit4:junit4] Suite: org.apache.lucene.analysis.miscellaneous.PatternAnalyzerTest
[junit4:junit4]   2> TEST FAIL: useCharFilter=true text='x s \ue003e\ue0050\ue0042 \u03a3\uca7d\u0161\uecdb'
[junit4:junit4]   2> NOTE: reproduce with: ant test  -Dtestcase=PatternAnalyzerTest -Dtests.method=testRandomStrings
-Dtests.seed=FA3EA92218CE0F9B -Dtests.multiplier=3 -Dtests.slow=true -Dtests.locale=fr_FR
-Dtests.timezone=America/Porto_Velho -Dtests.file.encoding=UTF-8
[junit4:junit4] ERROR   0.18s J1 | PatternAnalyzerTest.testRandomStrings <<<
[junit4:junit4]    > Throwable #1: java.lang.ArrayIndexOutOfBoundsException: 431
[junit4:junit4]    > 	at __randomizedtesting.SeedInfo.seed([FA3EA92218CE0F9B:72B7A99CBBCA58AE]:0)
[junit4:junit4]    > 	at sun.util.locale.provider.RuleBasedBreakIterator.lookupBackwardState(RuleBasedBreakIterator.java:1058)
[junit4:junit4]    > 	at sun.util.locale.provider.RuleBasedBreakIterator.handlePrevious(RuleBasedBreakIterator.java:1009)
[junit4:junit4]    > 	at sun.util.locale.provider.RuleBasedBreakIterator.following(RuleBasedBreakIterator.java:793)
[junit4:junit4]    > 	at sun.util.locale.provider.RuleBasedBreakIterator.isBoundary(RuleBasedBreakIterator.java:843)
[junit4:junit4]    > 	at java.lang.ConditionalSpecialCasing.isFinalCased(ConditionalSpecialCasing.java:210)
[junit4:junit4]    > 	at java.lang.ConditionalSpecialCasing.isConditionMet(ConditionalSpecialCasing.java:175)
[junit4:junit4]    > 	at java.lang.ConditionalSpecialCasing.lookUpTable(ConditionalSpecialCasing.java:163)
[junit4:junit4]    > 	at java.lang.ConditionalSpecialCasing.toLowerCaseEx(ConditionalSpecialCasing.java:111)
[junit4:junit4]    > 	at java.lang.String.toLowerCase(String.java:2469)
[junit4:junit4]    > 	at org.apache.lucene.analysis.miscellaneous.PatternAnalyzer$PatternTokenizer.incrementToken(PatternAnalyzer.java:356)
[junit4:junit4]    > 	at org.apache.lucene.analysis.util.FilteringTokenFilter.incrementToken(FilteringTokenFilter.java:50)
[junit4:junit4]    > 	at org.apache.lucene.analysis.BaseTokenStreamTestCase.checkAnalysisConsistency(BaseTokenStreamTestCase.java:632)
[junit4:junit4]    > 	at org.apache.lucene.analysis.BaseTokenStreamTestCase.checkRandomData(BaseTokenStreamTestCase.java:542)
[junit4:junit4]    > 	at org.apache.lucene.analysis.BaseTokenStreamTestCase.checkRandomData(BaseTokenStreamTestCase.java:443)
[junit4:junit4]    > 	at org.apache.lucene.analysis.BaseTokenStreamTestCase.checkRandomData(BaseTokenStreamTestCase.java:366)
[junit4:junit4]    > 	at org.apache.lucene.analysis.miscellaneous.PatternAnalyzerTest.testRandomStrings(PatternAnalyzerTest.java:155)
[junit4:junit4]    > 	at sun.reflect.NativeMethodAccessorImpl.invoke0(Native Method)
[junit4:junit4]    > 	at sun.reflect.NativeMethodAccessorImpl.invoke(NativeMethodAccessorImpl.java:57)
[junit4:junit4]    > 	at sun.reflect.DelegatingMethodAccessorImpl.invoke(DelegatingMethodAccessorImpl.java:43)
[junit4:junit4]    > 	at java.lang.reflect.Method.invoke(Method.java:474)
[junit4:junit4]    > 	at com.carrotsearch.randomizedtesting.RandomizedRunner.invoke(RandomizedRunner.java:1559)
[junit4:junit4]    > 	at com.carrotsearch.randomizedtesting.RandomizedRunner.access$600(RandomizedRunner.java:79)
[junit4:junit4]    > 	at com.carrotsearch.randomizedtesting.RandomizedRunner$6.evaluate(RandomizedRunner.java:737)
[junit4:junit4]    > 	at com.carrotsearch.randomizedtesting.RandomizedRunner$7.evaluate(RandomizedRunner.java:773)
[junit4:junit4]    > 	at com.carrotsearch.randomizedtesting.RandomizedRunner$8.evaluate(RandomizedRunner.java:787)
[junit4:junit4]    > 	at org.apache.lucene.util.TestRuleSetupTeardownChained$1.evaluate(TestRuleSetupTeardownChained.java:50)
[junit4:junit4]    > 	at org.apache.lucene.util.TestRuleFieldCacheSanity$1.evaluate(TestRuleFieldCacheSanity.java:51)
[junit4:junit4]    > 	at org.apache.lucene.util.AbstractBeforeAfterRule$1.evaluate(AbstractBeforeAfterRule.java:45)
[junit4:junit4]    > 	at com.carrotsearch.randomizedtesting.rules.SystemPropertiesInvariantRule$1.evaluate(SystemPropertiesInvariantRule.java:55)
[junit4:junit4]    > 	at org.apache.lucene.util.TestRuleThreadAndTestName$1.evaluate(TestRuleThreadAndTestName.java:48)
[junit4:junit4]    > 	at org.apache.lucene.util.TestRuleIgnoreAfterMaxFailures$1.evaluate(TestRuleIgnoreAfterMaxFailures.java:70)
[junit4:junit4]    > 	at org.apache.lucene.util.TestRuleMarkFailure$1.evaluate(TestRuleMarkFailure.java:48)
[junit4:junit4]    > 	at com.carrotsearch.randomizedtesting.rules.StatementAdapter.evaluate(StatementAdapter.java:36)
[junit4:junit4]    > 	at com.carrotsearch.randomizedtesting.ThreadLeakControl$StatementRunner.run(ThreadLeakControl.java:358)
[junit4:junit4]    > 	at com.carrotsearch.randomizedtesting.ThreadLeakControl.forkTimeoutingTask(ThreadLeakControl.java:782)
[junit4:junit4]    > 	at com.carrotsearch.randomizedtesting.ThreadLeakControl$3.evaluate(ThreadLeakControl.java:442)
[junit4:junit4]    > 	at com.carrotsearch.randomizedtesting.RandomizedRunner.runSingleTest(RandomizedRunner.java:746)
[junit4:junit4]    > 	at com.carrotsearch.randomizedtesting.RandomizedRunner$3.evaluate(RandomizedRunner.java:648)
[junit4:junit4]    > 	at com.carrotsearch.randomizedtesting.RandomizedRunner$4.evaluate(RandomizedRunner.java:682)
[junit4:junit4]    > 	at com.carrotsearch.randomizedtesting.RandomizedRunner$5.evaluate(RandomizedRunner.java:693)
[junit4:junit4]    > 	at org.apache.lucene.util.AbstractBeforeAfterRule$1.evaluate(AbstractBeforeAfterRule.java:45)
[junit4:junit4]    > 	at org.apache.lucene.util.TestRuleStoreClassName$1.evaluate(TestRuleStoreClassName.java:42)
[junit4:junit4]    > 	at com.carrotsearch.randomizedtesting.rules.SystemPropertiesInvariantRule$1.evaluate(SystemPropertiesInvariantRule.java:55)
[junit4:junit4]    > 	at com.carrotsearch.randomizedtesting.rules.NoShadowingOrOverridesOnMethodsRule$1.evaluate(NoShadowingOrOverridesOnMethodsRule.java:39)
[junit4:junit4]    > 	at com.carrotsearch.randomizedtesting.rules.NoShadowingOrOverridesOnMethodsRule$1.evaluate(NoShadowingOrOverridesOnMethodsRule.java:39)
[junit4:junit4]    > 	at com.carrotsearch.randomizedtesting.rules.StatementAdapter.evaluate(StatementAdapter.java:36)
[junit4:junit4]    > 	at org.apache.lucene.util.TestRuleAssertionsRequired$1.evaluate(TestRuleAssertionsRequired.java:43)
[junit4:junit4]    > 	at org.apache.lucene.util.TestRuleMarkFailure$1.evaluate(TestRuleMarkFailure.java:48)
[junit4:junit4]    > 	at org.apache.lucene.util.TestRuleIgnoreAfterMaxFailures$1.evaluate(TestRuleIgnoreAfterMaxFailures.java:70)
[junit4:junit4]    > 	at org.apache.lucene.util.TestRuleIgnoreTestSuites$1.evaluate(TestRuleIgnoreTestSuites.java:55)
[junit4:junit4]    > 	at com.carrotsearch.randomizedtesting.rules.StatementAdapter.evaluate(StatementAdapter.java:36)
[junit4:junit4]    > 	at com.carrotsearch.randomizedtesting.ThreadLeakControl$StatementRunner.run(ThreadLeakControl.java:358)
[junit4:junit4]    > 	at java.lang.Thread.run(Thread.java:722)
[junit4:junit4]   2> NOTE: test params are: codec=Lucene3x, sim=DefaultSimilarity, locale=fr_FR,
timezone=America/Porto_Velho
[junit4:junit4]   2> NOTE: Linux 3.2.0-33-generic i386/Oracle Corporation 1.8.0-ea (32-bit)/cpus=8,threads=1,free=55850736,total=243269632
[junit4:junit4]   2> NOTE: All tests run in this JVM: [TestLengthFilterFactory, CommonGramsFilterTest,
TestShingleFilterFactory, TestRussianLetterTokenizer, TestCommonGramsQueryFilterFactory, TestThaiAnalyzer,
TestRemoveDuplicatesTokenFilter, TestDutchStemmer, TokenOffsetPayloadTokenFilterTest, TestWordlistLoader,
TestGermanNormalizationFilter, TestItalianAnalyzer, TestArabicFilters, TestHungarianAnalyzer,
TestCzechStemFilterFactory, TestMultiWordSynonyms, TestGermanStemFilterFactory, TestReverseStringFilter,
TestRomanianAnalyzer, TestSynonymMapFilter, ShingleFilterTest, TestFrenchMinimalStemFilter,
TestRollingCharBuffer, TestPersianNormalizationFilter, TestFrenchMinimalStemFilterFactory,
TestSynonymMap, TestKeepWordFilter, TestPortugueseStemFilter, TestHindiFilters, TestHTMLStripCharFilterFactory,
TestLatvianAnalyzer, TestLengthFilter, TestThaiWordFilterFactory, NumericPayloadTokenFilterTest,
TestCJKAnalyzer, HTMLStripCharFilterTest, TestPrefixAwareTokenFilter, TestSlowSynonymFilter,
TestGermanMinimalStemFilter, TestPathHierarchyTokenizer, TestCJKWidthFilterFactory, TestHungarianLightStemFilterFactory,
TestCharArraySet, TestTypeTokenFilter, TestHunspellStemFilterFactory, TestSnowball, TestPortugueseMinimalStemFilter,
TestLimitTokenCountFilterFactory, NGramTokenizerTest, TestGermanAnalyzer, TestSpanishAnalyzer,
TypeAsPayloadTokenFilterTest, TestSynonymFilterFactory, TestKeywordMarkerFilterFactory, TestNorwegianLightStemFilter,
TestFactories, TestGermanLightStemFilter, TestArabicAnalyzer, TestRussianAnalyzer, TestDanishAnalyzer,
TestKeywordAnalyzer, TestCapitalizationFilter, TestEnglishMinimalStemFilter, TestHyphenatedWordsFilter,
TestLimitTokenCountAnalyzer, QueryAutoStopWordAnalyzerTest, TestCharArrayMap, TestArabicStemFilter,
TestLatvianStemmer, HunspellDictionaryTest, TestStopFilter, DelimitedPayloadTokenFilterTest,
PositionFilterTest, TestHindiStemmer, TestPrefixAndSuffixAwareTokenFilter, DateRecognizerSinkTokenizerTest,
TestTurkishLowerCaseFilter, TokenTypeSinkTokenizerTest, TestMappingCharFilterFactory, TestCJKBigramFilterFactory,
TestCJKTokenizer, TestCJKTokenizerFactory, TestChineseFilterFactory, TestChineseTokenizer,
TestTypeTokenFilterFactory, TestGermanMinimalStemFilterFactory, TestGreekLowerCaseFilterFactory,
TestKStemFilterFactory, TestSpanishLightStemFilterFactory, TestFinnishLightStemFilterFactory,
TestIrishLowerCaseFilterFactory, TestItalianLightStemFilterFactory, PatternAnalyzerTest]
[junit4:junit4] Completed on J1 in 0.22s, 5 tests, 1 error <<< FAILURES!

[...truncated 61 lines...]
BUILD FAILED
/mnt/ssd/jenkins/workspace/Lucene-Solr-4.x-Linux/build.xml:337: The following error occurred
while executing this line:
/mnt/ssd/jenkins/workspace/Lucene-Solr-4.x-Linux/build.xml:39: The following error occurred
while executing this line:
/mnt/ssd/jenkins/workspace/Lucene-Solr-4.x-Linux/lucene/build.xml:519: The following error
occurred while executing this line:
/mnt/ssd/jenkins/workspace/Lucene-Solr-4.x-Linux/lucene/common-build.xml:1691: The following
error occurred while executing this line:
/mnt/ssd/jenkins/workspace/Lucene-Solr-4.x-Linux/lucene/analysis/build.xml:105: The following
error occurred while executing this line:
/mnt/ssd/jenkins/workspace/Lucene-Solr-4.x-Linux/lucene/analysis/build.xml:38: The following
error occurred while executing this line:
/mnt/ssd/jenkins/workspace/Lucene-Solr-4.x-Linux/lucene/module-build.xml:61: The following
error occurred while executing this line:
/mnt/ssd/jenkins/workspace/Lucene-Solr-4.x-Linux/lucene/common-build.xml:1163: The following
error occurred while executing this line:
/mnt/ssd/jenkins/workspace/Lucene-Solr-4.x-Linux/lucene/common-build.xml:827: There were test
failures: 226 suites, 1166 tests, 1 error, 1 ignored

Total time: 10 minutes 1 second
Build step 'Invoke Ant' marked build as failure
Archiving artifacts
Recording test results
Description set: Java: 32bit/jdk1.8.0-ea-b58 -server -XX:+UseG1GC
Email was triggered for: Failure
Sending email for trigger: Failure



Mime
View raw message