lucene-dev mailing list archives

Site index · List index
Message view « Date » · « Thread »
Top « Date » · « Thread »
From Policeman Jenkins Server <jenk...@sd-datasolutions.de>
Subject [JENKINS] Lucene-Solr-trunk-Windows (32bit/jdk1.6.0_37) - Build # 1569 - Failure!
Date Mon, 12 Nov 2012 09:43:57 GMT
Build: http://jenkins.sd-datasolutions.de/job/Lucene-Solr-trunk-Windows/1569/
Java: 32bit/jdk1.6.0_37 -server -XX:+UseSerialGC

1 tests failed.
REGRESSION:  org.apache.lucene.index.TestConcurrentMergeScheduler.testMaxMergeCount

Error Message:
count should be <= maxMergeCount (= 3)

Stack Trace:
java.lang.IllegalArgumentException: count should be <= maxMergeCount (= 3)
	at __randomizedtesting.SeedInfo.seed([96D3305330A0FA9D:41B4A1E08C61651B]:0)
	at org.apache.lucene.index.ConcurrentMergeScheduler.setMaxThreadCount(ConcurrentMergeScheduler.java:90)
	at org.apache.lucene.index.TestConcurrentMergeScheduler.testMaxMergeCount(TestConcurrentMergeScheduler.java:303)
	at sun.reflect.NativeMethodAccessorImpl.invoke0(Native Method)
	at sun.reflect.NativeMethodAccessorImpl.invoke(NativeMethodAccessorImpl.java:39)
	at sun.reflect.DelegatingMethodAccessorImpl.invoke(DelegatingMethodAccessorImpl.java:25)
	at java.lang.reflect.Method.invoke(Method.java:597)
	at com.carrotsearch.randomizedtesting.RandomizedRunner.invoke(RandomizedRunner.java:1559)
	at com.carrotsearch.randomizedtesting.RandomizedRunner.access$600(RandomizedRunner.java:79)
	at com.carrotsearch.randomizedtesting.RandomizedRunner$6.evaluate(RandomizedRunner.java:737)
	at com.carrotsearch.randomizedtesting.RandomizedRunner$7.evaluate(RandomizedRunner.java:773)
	at com.carrotsearch.randomizedtesting.RandomizedRunner$8.evaluate(RandomizedRunner.java:787)
	at org.apache.lucene.util.TestRuleSetupTeardownChained$1.evaluate(TestRuleSetupTeardownChained.java:50)
	at org.apache.lucene.util.TestRuleFieldCacheSanity$1.evaluate(TestRuleFieldCacheSanity.java:51)
	at org.apache.lucene.util.AbstractBeforeAfterRule$1.evaluate(AbstractBeforeAfterRule.java:45)
	at com.carrotsearch.randomizedtesting.rules.SystemPropertiesInvariantRule$1.evaluate(SystemPropertiesInvariantRule.java:55)
	at org.apache.lucene.util.TestRuleThreadAndTestName$1.evaluate(TestRuleThreadAndTestName.java:48)
	at org.apache.lucene.util.TestRuleIgnoreAfterMaxFailures$1.evaluate(TestRuleIgnoreAfterMaxFailures.java:70)
	at org.apache.lucene.util.TestRuleMarkFailure$1.evaluate(TestRuleMarkFailure.java:48)
	at com.carrotsearch.randomizedtesting.rules.StatementAdapter.evaluate(StatementAdapter.java:36)
	at com.carrotsearch.randomizedtesting.ThreadLeakControl$StatementRunner.run(ThreadLeakControl.java:358)
	at com.carrotsearch.randomizedtesting.ThreadLeakControl.forkTimeoutingTask(ThreadLeakControl.java:782)
	at com.carrotsearch.randomizedtesting.ThreadLeakControl$3.evaluate(ThreadLeakControl.java:442)
	at com.carrotsearch.randomizedtesting.RandomizedRunner.runSingleTest(RandomizedRunner.java:746)
	at com.carrotsearch.randomizedtesting.RandomizedRunner$3.evaluate(RandomizedRunner.java:648)
	at com.carrotsearch.randomizedtesting.RandomizedRunner$4.evaluate(RandomizedRunner.java:682)
	at com.carrotsearch.randomizedtesting.RandomizedRunner$5.evaluate(RandomizedRunner.java:693)
	at org.apache.lucene.util.AbstractBeforeAfterRule$1.evaluate(AbstractBeforeAfterRule.java:45)
	at org.apache.lucene.util.TestRuleStoreClassName$1.evaluate(TestRuleStoreClassName.java:42)
	at com.carrotsearch.randomizedtesting.rules.SystemPropertiesInvariantRule$1.evaluate(SystemPropertiesInvariantRule.java:55)
	at com.carrotsearch.randomizedtesting.rules.NoShadowingOrOverridesOnMethodsRule$1.evaluate(NoShadowingOrOverridesOnMethodsRule.java:39)
	at com.carrotsearch.randomizedtesting.rules.NoShadowingOrOverridesOnMethodsRule$1.evaluate(NoShadowingOrOverridesOnMethodsRule.java:39)
	at com.carrotsearch.randomizedtesting.rules.StatementAdapter.evaluate(StatementAdapter.java:36)
	at org.apache.lucene.util.TestRuleAssertionsRequired$1.evaluate(TestRuleAssertionsRequired.java:43)
	at org.apache.lucene.util.TestRuleMarkFailure$1.evaluate(TestRuleMarkFailure.java:48)
	at org.apache.lucene.util.TestRuleIgnoreAfterMaxFailures$1.evaluate(TestRuleIgnoreAfterMaxFailures.java:70)
	at org.apache.lucene.util.TestRuleIgnoreTestSuites$1.evaluate(TestRuleIgnoreTestSuites.java:55)
	at com.carrotsearch.randomizedtesting.rules.StatementAdapter.evaluate(StatementAdapter.java:36)
	at com.carrotsearch.randomizedtesting.ThreadLeakControl$StatementRunner.run(ThreadLeakControl.java:358)
	at java.lang.Thread.run(Thread.java:662)




Build Log:
[...truncated 815 lines...]
[junit4:junit4] Suite: org.apache.lucene.index.TestConcurrentMergeScheduler
[junit4:junit4]   2> NOTE: reproduce with: ant test  -Dtestcase=TestConcurrentMergeScheduler
-Dtests.method=testMaxMergeCount -Dtests.seed=96D3305330A0FA9D -Dtests.slow=true -Dtests.locale=fr_LU
-Dtests.timezone=Iceland -Dtests.file.encoding=Cp1252
[junit4:junit4] ERROR   0.01s | TestConcurrentMergeScheduler.testMaxMergeCount <<<
[junit4:junit4]    > Throwable #1: java.lang.IllegalArgumentException: count should be
<= maxMergeCount (= 3)
[junit4:junit4]    > 	at __randomizedtesting.SeedInfo.seed([96D3305330A0FA9D:41B4A1E08C61651B]:0)
[junit4:junit4]    > 	at org.apache.lucene.index.ConcurrentMergeScheduler.setMaxThreadCount(ConcurrentMergeScheduler.java:90)
[junit4:junit4]    > 	at org.apache.lucene.index.TestConcurrentMergeScheduler.testMaxMergeCount(TestConcurrentMergeScheduler.java:303)
[junit4:junit4]    > 	at sun.reflect.NativeMethodAccessorImpl.invoke0(Native Method)
[junit4:junit4]    > 	at sun.reflect.NativeMethodAccessorImpl.invoke(NativeMethodAccessorImpl.java:39)
[junit4:junit4]    > 	at sun.reflect.DelegatingMethodAccessorImpl.invoke(DelegatingMethodAccessorImpl.java:25)
[junit4:junit4]    > 	at java.lang.reflect.Method.invoke(Method.java:597)
[junit4:junit4]    > 	at com.carrotsearch.randomizedtesting.RandomizedRunner.invoke(RandomizedRunner.java:1559)
[junit4:junit4]    > 	at com.carrotsearch.randomizedtesting.RandomizedRunner.access$600(RandomizedRunner.java:79)
[junit4:junit4]    > 	at com.carrotsearch.randomizedtesting.RandomizedRunner$6.evaluate(RandomizedRunner.java:737)
[junit4:junit4]    > 	at com.carrotsearch.randomizedtesting.RandomizedRunner$7.evaluate(RandomizedRunner.java:773)
[junit4:junit4]    > 	at com.carrotsearch.randomizedtesting.RandomizedRunner$8.evaluate(RandomizedRunner.java:787)
[junit4:junit4]    > 	at org.apache.lucene.util.TestRuleSetupTeardownChained$1.evaluate(TestRuleSetupTeardownChained.java:50)
[junit4:junit4]    > 	at org.apache.lucene.util.TestRuleFieldCacheSanity$1.evaluate(TestRuleFieldCacheSanity.java:51)
[junit4:junit4]    > 	at org.apache.lucene.util.AbstractBeforeAfterRule$1.evaluate(AbstractBeforeAfterRule.java:45)
[junit4:junit4]    > 	at com.carrotsearch.randomizedtesting.rules.SystemPropertiesInvariantRule$1.evaluate(SystemPropertiesInvariantRule.java:55)
[junit4:junit4]    > 	at org.apache.lucene.util.TestRuleThreadAndTestName$1.evaluate(TestRuleThreadAndTestName.java:48)
[junit4:junit4]    > 	at org.apache.lucene.util.TestRuleIgnoreAfterMaxFailures$1.evaluate(TestRuleIgnoreAfterMaxFailures.java:70)
[junit4:junit4]    > 	at org.apache.lucene.util.TestRuleMarkFailure$1.evaluate(TestRuleMarkFailure.java:48)
[junit4:junit4]    > 	at com.carrotsearch.randomizedtesting.rules.StatementAdapter.evaluate(StatementAdapter.java:36)
[junit4:junit4]    > 	at com.carrotsearch.randomizedtesting.ThreadLeakControl$StatementRunner.run(ThreadLeakControl.java:358)
[junit4:junit4]    > 	at com.carrotsearch.randomizedtesting.ThreadLeakControl.forkTimeoutingTask(ThreadLeakControl.java:782)
[junit4:junit4]    > 	at com.carrotsearch.randomizedtesting.ThreadLeakControl$3.evaluate(ThreadLeakControl.java:442)
[junit4:junit4]    > 	at com.carrotsearch.randomizedtesting.RandomizedRunner.runSingleTest(RandomizedRunner.java:746)
[junit4:junit4]    > 	at com.carrotsearch.randomizedtesting.RandomizedRunner$3.evaluate(RandomizedRunner.java:648)
[junit4:junit4]    > 	at com.carrotsearch.randomizedtesting.RandomizedRunner$4.evaluate(RandomizedRunner.java:682)
[junit4:junit4]    > 	at com.carrotsearch.randomizedtesting.RandomizedRunner$5.evaluate(RandomizedRunner.java:693)
[junit4:junit4]    > 	at org.apache.lucene.util.AbstractBeforeAfterRule$1.evaluate(AbstractBeforeAfterRule.java:45)
[junit4:junit4]    > 	at org.apache.lucene.util.TestRuleStoreClassName$1.evaluate(TestRuleStoreClassName.java:42)
[junit4:junit4]    > 	at com.carrotsearch.randomizedtesting.rules.SystemPropertiesInvariantRule$1.evaluate(SystemPropertiesInvariantRule.java:55)
[junit4:junit4]    > 	at com.carrotsearch.randomizedtesting.rules.NoShadowingOrOverridesOnMethodsRule$1.evaluate(NoShadowingOrOverridesOnMethodsRule.java:39)
[junit4:junit4]    > 	at com.carrotsearch.randomizedtesting.rules.NoShadowingOrOverridesOnMethodsRule$1.evaluate(NoShadowingOrOverridesOnMethodsRule.java:39)
[junit4:junit4]    > 	at com.carrotsearch.randomizedtesting.rules.StatementAdapter.evaluate(StatementAdapter.java:36)
[junit4:junit4]    > 	at org.apache.lucene.util.TestRuleAssertionsRequired$1.evaluate(TestRuleAssertionsRequired.java:43)
[junit4:junit4]    > 	at org.apache.lucene.util.TestRuleMarkFailure$1.evaluate(TestRuleMarkFailure.java:48)
[junit4:junit4]    > 	at org.apache.lucene.util.TestRuleIgnoreAfterMaxFailures$1.evaluate(TestRuleIgnoreAfterMaxFailures.java:70)
[junit4:junit4]    > 	at org.apache.lucene.util.TestRuleIgnoreTestSuites$1.evaluate(TestRuleIgnoreTestSuites.java:55)
[junit4:junit4]    > 	at com.carrotsearch.randomizedtesting.rules.StatementAdapter.evaluate(StatementAdapter.java:36)
[junit4:junit4]    > 	at com.carrotsearch.randomizedtesting.ThreadLeakControl$StatementRunner.run(ThreadLeakControl.java:358)
[junit4:junit4]    > 	at java.lang.Thread.run(Thread.java:662)
[junit4:junit4]   2> NOTE: test params are: codec=Lucene41: {content=MockFixedIntBlock(blockSize=1234),
id=PostingsFormat(name=Asserting)}, sim=DefaultSimilarity, locale=fr_LU, timezone=Iceland
[junit4:junit4]   2> NOTE: Windows 7 6.1 x86/Sun Microsystems Inc. 1.6.0_37 (32-bit)/cpus=2,threads=1,free=65412728,total=253243392
[junit4:junit4]   2> NOTE: All tests run in this JVM: [TestOpenBitSet, TestPrefixCodedTerms,
TestSpanExplanationsOfNonMatches, Nested, TestSimpleAttributeImpl, TestFieldCache, TestTermsEnum,
TestTermVectorsReader, TestDocValues, TestVersion, TestNamedSPILoader, TestDuelingCodecs,
InBeforeClass, InAfterClass, InTestMethod, NonStringProperties, TestSimilarityProvider, TestNorms,
TestBitUtil, TestExplanations, TestIndexWriterCommit, TestPayloadTermQuery, TestTermVectors,
TestVersionComparator, TestPayloadsOnVectors, TestUniqueTermCount, TestPackedInts, TestShardSearching,
TestFieldsReader, TestFieldValueFilter, TestBooleanOr, TestBagOfPositions, TestOmitPositions,
Test2BDocs, TestParallelReaderEmptyIndex, NestedSetupChain, NestedTeardownChain, TestBooleanQueryVisitSubscorers,
TestRollback, TestMultiTermConstantScore, TestSimpleExplanations, TestMockAnalyzer, TestCharsRef,
TestRAMDirectory, TestPrefixRandom, TestTieredMergePolicy, TestComplexExplanations, TestReaderClosed,
TestNeverDelete, TestCustomNorms, TestTopDocsMerge, TestMultiTermQueryRewrites, TestSentinelIntSet,
TestIndexableField, TestComplexExplanationsOfNonMatches, TestTopScoreDocCollector, TestPositiveScoresOnlyCollector,
TestByteBlockPool, TestDocValuesTypeCompatibility, TestSpans, TestBlockPostingsFormat3, TestAssertions,
TestParallelTermEnum, TestDeterminizeLexicon, TestBagOfPostings, TestFieldMaskingSpanQuery,
TestDocValuesIndexing, TestGraphTokenizers, TestCachingWrapperFilter, TestMultiPhraseQuery,
Test4GBStoredFields, TestMultiThreadTermVectors, TestThreadedForceMerge, TestDocCount, TestMergeSchedulerExternal,
TestHugeRamFile, MultiCollectorTest, TestIndexWriterMerging, TestWildcardRandom, TestTerm,
TestSimilarity, TestCrashCausesCorruptIndex, TestIndexWriterForceMerge, TestSimpleSearchEquivalence,
TestPrefixQuery, TestDocsAndPositions, TestFilteredQuery, TestPerSegmentDeletes, TestTransactions,
TestFieldInfos, TestSearchWithThreads, TestCodecs, TestCachingCollector, TestCollectionUtil,
Test2BPositions, TestFuzzyQuery, TestDeterminism, TestBoolean2, TestMaxTermFrequency, TestLucene40PostingsReader,
TestForTooMuchCloning, Nested, Nested, Nested, Nested, Nested, Nested, Nested, Nested, Nested,
Nested, Nested, Nested, Nested, Nested, Nested, Nested, Nested, Nested, Nested, Nested, Nested,
TestBooleanScorer, TestPerFieldPostingsFormat2, TestDocument, TestBinaryTerms, TestConsistentFieldNumbers,
TestIndexWriterConfig, TestBufferedIndexInput, TestDoubleBarrelLRUCache, TestRegexpRandom2,
TestOmitTf, TestPersistentSnapshotDeletionPolicy, TestWeakIdentityMap, TestIdentityHashSet,
TestParallelCompositeReader, TestIndexWriterMergePolicy, TestNoMergeScheduler, TestDocumentsWriterStallControl,
TestMultiFields, TestBasics, TestIndexFileDeleter, TestSmallFloat, TestRollingBuffer, Nested,
Nested, TestField, TestNearSpansOrdered, TestTransactionRollback, Nested1, TestDirectoryReaderReopen,
TestSimilarityBase, TestPostingsFormat, TestByteSlices, TestIndexWriterDelete, TestPerFieldPostingsFormat,
TestFixedBitSet, TestLucene40PostingsFormat, TestTermScorer, TestBlockPostingsFormat2, Nested1,
TestWildcard, TestPrefixFilter, TestSpanFirstQuery, TestTopDocsCollector, TestDemo, TestCharTermAttributeImpl,
TestBytesRefHash, TestOmitNorms, TestPayloadSpans, TestPagedBytes, TestIndexCommit, TestIndexInput,
TestNumericUtils, TestSegmentMerger, TestSpecialOperations, TestPrefixInBooleanQuery, TestDocumentsWriterDeleteQueue,
TestConstantScoreQuery, TestDateSort, TestPhraseQuery, TestByteArrayDataInput, TestIOUtils,
TestRegexpQuery, TestDocValuesScoring, TestIndexWriterWithThreads, TestFSTs, TestIndexWriterReader,
TestLookaheadTokenFilter, TestIndexWriterExceptions, TestNumericRangeQuery64, TestSearcherManager,
TestNumericRangeQuery32, TestNRTThreads, TestDeletionPolicy, TestAddIndexes, TestAtomicUpdate,
TestIndexWriter, TestMultiMMap, TestTimeLimitingCollector, TestFlushByRamOrCountsPolicy, TestSearchAfter,
TestMinimize, TestSloppyPhraseQuery, TestBackwardsCompatibility, TestNRTManager, TestSort,
TestIndexWriterUnicode, TestArrayUtil, TestNRTCachingDirectory, TestLongPostings, TestDirectoryReader,
TestToken, TestTypePromotion, TestCompoundFile, TestStressIndexing, TestSnapshotDeletionPolicy,
TestIndexWriterNRTIsCurrent, TestNRTReaderWithThreads, TestConcurrentMergeScheduler]
[junit4:junit4] Completed in 0.97s, 5 tests, 1 error <<< FAILURES!

[...truncated 391 lines...]
BUILD FAILED
C:\Users\JenkinsSlave\workspace\Lucene-Solr-trunk-Windows\build.xml:337: The following error
occurred while executing this line:
C:\Users\JenkinsSlave\workspace\Lucene-Solr-trunk-Windows\build.xml:39: The following error
occurred while executing this line:
C:\Users\JenkinsSlave\workspace\Lucene-Solr-trunk-Windows\lucene\build.xml:50: The following
error occurred while executing this line:
C:\Users\JenkinsSlave\workspace\Lucene-Solr-trunk-Windows\lucene\common-build.xml:1163: The
following error occurred while executing this line:
C:\Users\JenkinsSlave\workspace\Lucene-Solr-trunk-Windows\lucene\common-build.xml:827: There
were test failures: 319 suites, 1829 tests, 1 error, 19 ignored (8 assumptions)

Total time: 7 minutes 31 seconds
Build step 'Invoke Ant' marked build as failure
Archiving artifacts
Recording test results
Description set: Java: 32bit/jdk1.6.0_37 -server -XX:+UseSerialGC
Email was triggered for: Failure
Sending email for trigger: Failure



Mime
View raw message