lucene-dev mailing list archives

Site index · List index
Message view « Date » · « Thread »
Top « Date » · « Thread »
From Apache Jenkins Server <jenk...@builds.apache.org>
Subject [JENKINS] Lucene-Solr-Tests-4.x-java7 - Build # 613 - Still Failing
Date Tue, 06 Nov 2012 16:26:49 GMT
Build: https://builds.apache.org/job/Lucene-Solr-Tests-4.x-java7/613/

4 tests failed.
FAILED:  junit.framework.TestSuite.org.apache.solr.cloud.BasicDistributedZkTest

Error Message:
12 threads leaked from SUITE scope at org.apache.solr.cloud.BasicDistributedZkTest:     1) Thread[id=185, name=qtp507512929-185 Acceptor2 SelectChannelConnector@0.0.0.0:24328, state=BLOCKED, group=TGRP-BasicDistributedZkTest]         at sun.nio.ch.ServerSocketChannelImpl.accept(ServerSocketChannelImpl.java:210)         at org.eclipse.jetty.server.nio.SelectChannelConnector.accept(SelectChannelConnector.java:104)         at org.eclipse.jetty.server.AbstractConnector$Acceptor.run(AbstractConnector.java:933)         at org.eclipse.jetty.util.thread.QueuedThreadPool.runJob(QueuedThreadPool.java:599)         at org.eclipse.jetty.util.thread.QueuedThreadPool$3.run(QueuedThreadPool.java:534)         at java.lang.Thread.run(Thread.java:722)    2) Thread[id=183, name=qtp507512929-183 Acceptor0 SelectChannelConnector@0.0.0.0:24328, state=RUNNABLE, group=TGRP-BasicDistributedZkTest]         at sun.nio.ch.ServerSocketChannelImpl.accept0(Native Method)         at sun.nio.ch.ServerSocketChannelImpl.accept(ServerSocketChannelImpl.java:226)         at org.eclipse.jetty.server.nio.SelectChannelConnector.accept(SelectChannelConnector.java:104)         at org.eclipse.jetty.server.AbstractConnector$Acceptor.run(AbstractConnector.java:933)         at org.eclipse.jetty.util.thread.QueuedThreadPool.runJob(QueuedThreadPool.java:599)         at org.eclipse.jetty.util.thread.QueuedThreadPool$3.run(QueuedThreadPool.java:534)         at java.lang.Thread.run(Thread.java:722)    3) Thread[id=165, name=qtp15205627-165 Acceptor1 SelectChannelConnector@0.0.0.0:18910, state=RUNNABLE, group=TGRP-BasicDistributedZkTest]         at sun.nio.ch.ServerSocketChannelImpl.accept0(Native Method)         at sun.nio.ch.ServerSocketChannelImpl.accept(ServerSocketChannelImpl.java:226)         at org.eclipse.jetty.server.nio.SelectChannelConnector.accept(SelectChannelConnector.java:104)         at org.eclipse.jetty.server.AbstractConnector$Acceptor.run(AbstractConnector.java:933)         at org.eclipse.jetty.util.thread.QueuedThreadPool.runJob(QueuedThreadPool.java:599)         at org.eclipse.jetty.util.thread.QueuedThreadPool$3.run(QueuedThreadPool.java:534)         at java.lang.Thread.run(Thread.java:722)    4) Thread[id=115, name=qtp1065037894-115 Acceptor0 SelectChannelConnector@0.0.0.0:38672, state=BLOCKED, group=TGRP-BasicDistributedZkTest]         at sun.nio.ch.ServerSocketChannelImpl.accept(ServerSocketChannelImpl.java:210)         at org.eclipse.jetty.server.nio.SelectChannelConnector.accept(SelectChannelConnector.java:104)         at org.eclipse.jetty.server.AbstractConnector$Acceptor.run(AbstractConnector.java:933)         at org.eclipse.jetty.util.thread.QueuedThreadPool.runJob(QueuedThreadPool.java:599)         at org.eclipse.jetty.util.thread.QueuedThreadPool$3.run(QueuedThreadPool.java:534)         at java.lang.Thread.run(Thread.java:722)    5) Thread[id=184, name=qtp507512929-184 Acceptor1 SelectChannelConnector@0.0.0.0:24328, state=BLOCKED, group=TGRP-BasicDistributedZkTest]         at sun.nio.ch.ServerSocketChannelImpl.accept(ServerSocketChannelImpl.java:210)         at org.eclipse.jetty.server.nio.SelectChannelConnector.accept(SelectChannelConnector.java:104)         at org.eclipse.jetty.server.AbstractConnector$Acceptor.run(AbstractConnector.java:933)         at org.eclipse.jetty.util.thread.QueuedThreadPool.runJob(QueuedThreadPool.java:599)         at org.eclipse.jetty.util.thread.QueuedThreadPool$3.run(QueuedThreadPool.java:534)         at java.lang.Thread.run(Thread.java:722)    6) Thread[id=118, name=qtp1065037894-118 Acceptor3 SelectChannelConnector@0.0.0.0:38672, state=RUNNABLE, group=TGRP-BasicDistributedZkTest]         at sun.nio.ch.ServerSocketChannelImpl.accept0(Native Method)         at sun.nio.ch.ServerSocketChannelImpl.accept(ServerSocketChannelImpl.java:226)         at org.eclipse.jetty.server.nio.SelectChannelConnector.accept(SelectChannelConnector.java:104)         at org.eclipse.jetty.server.AbstractConnector$Acceptor.run(AbstractConnector.java:933)         at org.eclipse.jetty.util.thread.QueuedThreadPool.runJob(QueuedThreadPool.java:599)         at org.eclipse.jetty.util.thread.QueuedThreadPool$3.run(QueuedThreadPool.java:534)         at java.lang.Thread.run(Thread.java:722)    7) Thread[id=166, name=qtp15205627-166 Acceptor2 SelectChannelConnector@0.0.0.0:18910, state=BLOCKED, group=TGRP-BasicDistributedZkTest]         at sun.nio.ch.ServerSocketChannelImpl.accept(ServerSocketChannelImpl.java:210)         at org.eclipse.jetty.server.nio.SelectChannelConnector.accept(SelectChannelConnector.java:104)         at org.eclipse.jetty.server.AbstractConnector$Acceptor.run(AbstractConnector.java:933)         at org.eclipse.jetty.util.thread.QueuedThreadPool.runJob(QueuedThreadPool.java:599)         at org.eclipse.jetty.util.thread.QueuedThreadPool$3.run(QueuedThreadPool.java:534)         at java.lang.Thread.run(Thread.java:722)    8) Thread[id=117, name=qtp1065037894-117 Acceptor2 SelectChannelConnector@0.0.0.0:38672, state=BLOCKED, group=TGRP-BasicDistributedZkTest]         at sun.nio.ch.ServerSocketChannelImpl.accept(ServerSocketChannelImpl.java:210)         at org.eclipse.jetty.server.nio.SelectChannelConnector.accept(SelectChannelConnector.java:104)         at org.eclipse.jetty.server.AbstractConnector$Acceptor.run(AbstractConnector.java:933)         at org.eclipse.jetty.util.thread.QueuedThreadPool.runJob(QueuedThreadPool.java:599)         at org.eclipse.jetty.util.thread.QueuedThreadPool$3.run(QueuedThreadPool.java:534)         at java.lang.Thread.run(Thread.java:722)    9) Thread[id=186, name=qtp507512929-186 Acceptor3 SelectChannelConnector@0.0.0.0:24328, state=BLOCKED, group=TGRP-BasicDistributedZkTest]         at sun.nio.ch.ServerSocketChannelImpl.accept(ServerSocketChannelImpl.java:210)         at org.eclipse.jetty.server.nio.SelectChannelConnector.accept(SelectChannelConnector.java:104)         at org.eclipse.jetty.server.AbstractConnector$Acceptor.run(AbstractConnector.java:933)         at org.eclipse.jetty.util.thread.QueuedThreadPool.runJob(QueuedThreadPool.java:599)         at org.eclipse.jetty.util.thread.QueuedThreadPool$3.run(QueuedThreadPool.java:534)         at java.lang.Thread.run(Thread.java:722)   10) Thread[id=167, name=qtp15205627-167 Acceptor3 SelectChannelConnector@0.0.0.0:18910, state=BLOCKED, group=TGRP-BasicDistributedZkTest]         at sun.nio.ch.ServerSocketChannelImpl.accept(ServerSocketChannelImpl.java:210)         at org.eclipse.jetty.server.nio.SelectChannelConnector.accept(SelectChannelConnector.java:104)         at org.eclipse.jetty.server.AbstractConnector$Acceptor.run(AbstractConnector.java:933)         at org.eclipse.jetty.util.thread.QueuedThreadPool.runJob(QueuedThreadPool.java:599)         at org.eclipse.jetty.util.thread.QueuedThreadPool$3.run(QueuedThreadPool.java:534)         at java.lang.Thread.run(Thread.java:722)   11) Thread[id=116, name=qtp1065037894-116 Acceptor1 SelectChannelConnector@0.0.0.0:38672, state=BLOCKED, group=TGRP-BasicDistributedZkTest]         at sun.nio.ch.ServerSocketChannelImpl.accept(ServerSocketChannelImpl.java:210)         at org.eclipse.jetty.server.nio.SelectChannelConnector.accept(SelectChannelConnector.java:104)         at org.eclipse.jetty.server.AbstractConnector$Acceptor.run(AbstractConnector.java:933)         at org.eclipse.jetty.util.thread.QueuedThreadPool.runJob(QueuedThreadPool.java:599)         at org.eclipse.jetty.util.thread.QueuedThreadPool$3.run(QueuedThreadPool.java:534)         at java.lang.Thread.run(Thread.java:722)   12) Thread[id=164, name=qtp15205627-164 Acceptor0 SelectChannelConnector@0.0.0.0:18910, state=BLOCKED, group=TGRP-BasicDistributedZkTest]         at sun.nio.ch.ServerSocketChannelImpl.accept(ServerSocketChannelImpl.java:210)         at org.eclipse.jetty.server.nio.SelectChannelConnector.accept(SelectChannelConnector.java:104)         at org.eclipse.jetty.server.AbstractConnector$Acceptor.run(AbstractConnector.java:933)         at org.eclipse.jetty.util.thread.QueuedThreadPool.runJob(QueuedThreadPool.java:599)         at org.eclipse.jetty.util.thread.QueuedThreadPool$3.run(QueuedThreadPool.java:534)         at java.lang.Thread.run(Thread.java:722)

Stack Trace:
com.carrotsearch.randomizedtesting.ThreadLeakError: 12 threads leaked from SUITE scope at org.apache.solr.cloud.BasicDistributedZkTest: 
   1) Thread[id=185, name=qtp507512929-185 Acceptor2 SelectChannelConnector@0.0.0.0:24328, state=BLOCKED, group=TGRP-BasicDistributedZkTest]
        at sun.nio.ch.ServerSocketChannelImpl.accept(ServerSocketChannelImpl.java:210)
        at org.eclipse.jetty.server.nio.SelectChannelConnector.accept(SelectChannelConnector.java:104)
        at org.eclipse.jetty.server.AbstractConnector$Acceptor.run(AbstractConnector.java:933)
        at org.eclipse.jetty.util.thread.QueuedThreadPool.runJob(QueuedThreadPool.java:599)
        at org.eclipse.jetty.util.thread.QueuedThreadPool$3.run(QueuedThreadPool.java:534)
        at java.lang.Thread.run(Thread.java:722)
   2) Thread[id=183, name=qtp507512929-183 Acceptor0 SelectChannelConnector@0.0.0.0:24328, state=RUNNABLE, group=TGRP-BasicDistributedZkTest]
        at sun.nio.ch.ServerSocketChannelImpl.accept0(Native Method)
        at sun.nio.ch.ServerSocketChannelImpl.accept(ServerSocketChannelImpl.java:226)
        at org.eclipse.jetty.server.nio.SelectChannelConnector.accept(SelectChannelConnector.java:104)
        at org.eclipse.jetty.server.AbstractConnector$Acceptor.run(AbstractConnector.java:933)
        at org.eclipse.jetty.util.thread.QueuedThreadPool.runJob(QueuedThreadPool.java:599)
        at org.eclipse.jetty.util.thread.QueuedThreadPool$3.run(QueuedThreadPool.java:534)
        at java.lang.Thread.run(Thread.java:722)
   3) Thread[id=165, name=qtp15205627-165 Acceptor1 SelectChannelConnector@0.0.0.0:18910, state=RUNNABLE, group=TGRP-BasicDistributedZkTest]
        at sun.nio.ch.ServerSocketChannelImpl.accept0(Native Method)
        at sun.nio.ch.ServerSocketChannelImpl.accept(ServerSocketChannelImpl.java:226)
        at org.eclipse.jetty.server.nio.SelectChannelConnector.accept(SelectChannelConnector.java:104)
        at org.eclipse.jetty.server.AbstractConnector$Acceptor.run(AbstractConnector.java:933)
        at org.eclipse.jetty.util.thread.QueuedThreadPool.runJob(QueuedThreadPool.java:599)
        at org.eclipse.jetty.util.thread.QueuedThreadPool$3.run(QueuedThreadPool.java:534)
        at java.lang.Thread.run(Thread.java:722)
   4) Thread[id=115, name=qtp1065037894-115 Acceptor0 SelectChannelConnector@0.0.0.0:38672, state=BLOCKED, group=TGRP-BasicDistributedZkTest]
        at sun.nio.ch.ServerSocketChannelImpl.accept(ServerSocketChannelImpl.java:210)
        at org.eclipse.jetty.server.nio.SelectChannelConnector.accept(SelectChannelConnector.java:104)
        at org.eclipse.jetty.server.AbstractConnector$Acceptor.run(AbstractConnector.java:933)
        at org.eclipse.jetty.util.thread.QueuedThreadPool.runJob(QueuedThreadPool.java:599)
        at org.eclipse.jetty.util.thread.QueuedThreadPool$3.run(QueuedThreadPool.java:534)
        at java.lang.Thread.run(Thread.java:722)
   5) Thread[id=184, name=qtp507512929-184 Acceptor1 SelectChannelConnector@0.0.0.0:24328, state=BLOCKED, group=TGRP-BasicDistributedZkTest]
        at sun.nio.ch.ServerSocketChannelImpl.accept(ServerSocketChannelImpl.java:210)
        at org.eclipse.jetty.server.nio.SelectChannelConnector.accept(SelectChannelConnector.java:104)
        at org.eclipse.jetty.server.AbstractConnector$Acceptor.run(AbstractConnector.java:933)
        at org.eclipse.jetty.util.thread.QueuedThreadPool.runJob(QueuedThreadPool.java:599)
        at org.eclipse.jetty.util.thread.QueuedThreadPool$3.run(QueuedThreadPool.java:534)
        at java.lang.Thread.run(Thread.java:722)
   6) Thread[id=118, name=qtp1065037894-118 Acceptor3 SelectChannelConnector@0.0.0.0:38672, state=RUNNABLE, group=TGRP-BasicDistributedZkTest]
        at sun.nio.ch.ServerSocketChannelImpl.accept0(Native Method)
        at sun.nio.ch.ServerSocketChannelImpl.accept(ServerSocketChannelImpl.java:226)
        at org.eclipse.jetty.server.nio.SelectChannelConnector.accept(SelectChannelConnector.java:104)
        at org.eclipse.jetty.server.AbstractConnector$Acceptor.run(AbstractConnector.java:933)
        at org.eclipse.jetty.util.thread.QueuedThreadPool.runJob(QueuedThreadPool.java:599)
        at org.eclipse.jetty.util.thread.QueuedThreadPool$3.run(QueuedThreadPool.java:534)
        at java.lang.Thread.run(Thread.java:722)
   7) Thread[id=166, name=qtp15205627-166 Acceptor2 SelectChannelConnector@0.0.0.0:18910, state=BLOCKED, group=TGRP-BasicDistributedZkTest]
        at sun.nio.ch.ServerSocketChannelImpl.accept(ServerSocketChannelImpl.java:210)
        at org.eclipse.jetty.server.nio.SelectChannelConnector.accept(SelectChannelConnector.java:104)
        at org.eclipse.jetty.server.AbstractConnector$Acceptor.run(AbstractConnector.java:933)
        at org.eclipse.jetty.util.thread.QueuedThreadPool.runJob(QueuedThreadPool.java:599)
        at org.eclipse.jetty.util.thread.QueuedThreadPool$3.run(QueuedThreadPool.java:534)
        at java.lang.Thread.run(Thread.java:722)
   8) Thread[id=117, name=qtp1065037894-117 Acceptor2 SelectChannelConnector@0.0.0.0:38672, state=BLOCKED, group=TGRP-BasicDistributedZkTest]
        at sun.nio.ch.ServerSocketChannelImpl.accept(ServerSocketChannelImpl.java:210)
        at org.eclipse.jetty.server.nio.SelectChannelConnector.accept(SelectChannelConnector.java:104)
        at org.eclipse.jetty.server.AbstractConnector$Acceptor.run(AbstractConnector.java:933)
        at org.eclipse.jetty.util.thread.QueuedThreadPool.runJob(QueuedThreadPool.java:599)
        at org.eclipse.jetty.util.thread.QueuedThreadPool$3.run(QueuedThreadPool.java:534)
        at java.lang.Thread.run(Thread.java:722)
   9) Thread[id=186, name=qtp507512929-186 Acceptor3 SelectChannelConnector@0.0.0.0:24328, state=BLOCKED, group=TGRP-BasicDistributedZkTest]
        at sun.nio.ch.ServerSocketChannelImpl.accept(ServerSocketChannelImpl.java:210)
        at org.eclipse.jetty.server.nio.SelectChannelConnector.accept(SelectChannelConnector.java:104)
        at org.eclipse.jetty.server.AbstractConnector$Acceptor.run(AbstractConnector.java:933)
        at org.eclipse.jetty.util.thread.QueuedThreadPool.runJob(QueuedThreadPool.java:599)
        at org.eclipse.jetty.util.thread.QueuedThreadPool$3.run(QueuedThreadPool.java:534)
        at java.lang.Thread.run(Thread.java:722)
  10) Thread[id=167, name=qtp15205627-167 Acceptor3 SelectChannelConnector@0.0.0.0:18910, state=BLOCKED, group=TGRP-BasicDistributedZkTest]
        at sun.nio.ch.ServerSocketChannelImpl.accept(ServerSocketChannelImpl.java:210)
        at org.eclipse.jetty.server.nio.SelectChannelConnector.accept(SelectChannelConnector.java:104)
        at org.eclipse.jetty.server.AbstractConnector$Acceptor.run(AbstractConnector.java:933)
        at org.eclipse.jetty.util.thread.QueuedThreadPool.runJob(QueuedThreadPool.java:599)
        at org.eclipse.jetty.util.thread.QueuedThreadPool$3.run(QueuedThreadPool.java:534)
        at java.lang.Thread.run(Thread.java:722)
  11) Thread[id=116, name=qtp1065037894-116 Acceptor1 SelectChannelConnector@0.0.0.0:38672, state=BLOCKED, group=TGRP-BasicDistributedZkTest]
        at sun.nio.ch.ServerSocketChannelImpl.accept(ServerSocketChannelImpl.java:210)
        at org.eclipse.jetty.server.nio.SelectChannelConnector.accept(SelectChannelConnector.java:104)
        at org.eclipse.jetty.server.AbstractConnector$Acceptor.run(AbstractConnector.java:933)
        at org.eclipse.jetty.util.thread.QueuedThreadPool.runJob(QueuedThreadPool.java:599)
        at org.eclipse.jetty.util.thread.QueuedThreadPool$3.run(QueuedThreadPool.java:534)
        at java.lang.Thread.run(Thread.java:722)
  12) Thread[id=164, name=qtp15205627-164 Acceptor0 SelectChannelConnector@0.0.0.0:18910, state=BLOCKED, group=TGRP-BasicDistributedZkTest]
        at sun.nio.ch.ServerSocketChannelImpl.accept(ServerSocketChannelImpl.java:210)
        at org.eclipse.jetty.server.nio.SelectChannelConnector.accept(SelectChannelConnector.java:104)
        at org.eclipse.jetty.server.AbstractConnector$Acceptor.run(AbstractConnector.java:933)
        at org.eclipse.jetty.util.thread.QueuedThreadPool.runJob(QueuedThreadPool.java:599)
        at org.eclipse.jetty.util.thread.QueuedThreadPool$3.run(QueuedThreadPool.java:534)
        at java.lang.Thread.run(Thread.java:722)
	at __randomizedtesting.SeedInfo.seed([C6F54FC7A3B9989F]:0)


FAILED:  junit.framework.TestSuite.org.apache.solr.cloud.BasicDistributedZkTest

Error Message:
There are still zombie threads that couldn't be terminated:    1) Thread[id=185, name=qtp507512929-185 Acceptor2 SelectChannelConnector@0.0.0.0:24328, state=BLOCKED, group=TGRP-BasicDistributedZkTest]         at sun.nio.ch.ServerSocketChannelImpl.accept(ServerSocketChannelImpl.java:210)         at org.eclipse.jetty.server.nio.SelectChannelConnector.accept(SelectChannelConnector.java:104)         at org.eclipse.jetty.server.AbstractConnector$Acceptor.run(AbstractConnector.java:933)         at org.eclipse.jetty.util.thread.QueuedThreadPool.runJob(QueuedThreadPool.java:599)         at org.eclipse.jetty.util.thread.QueuedThreadPool$3.run(QueuedThreadPool.java:534)         at java.lang.Thread.run(Thread.java:722)    2) Thread[id=183, name=qtp507512929-183 Acceptor0 SelectChannelConnector@0.0.0.0:24328, state=RUNNABLE, group=TGRP-BasicDistributedZkTest]         at sun.nio.ch.ServerSocketChannelImpl.accept0(Native Method)         at sun.nio.ch.ServerSocketChannelImpl.accept(ServerSocketChannelImpl.java:226)         at org.eclipse.jetty.server.nio.SelectChannelConnector.accept(SelectChannelConnector.java:104)         at org.eclipse.jetty.server.AbstractConnector$Acceptor.run(AbstractConnector.java:933)         at org.eclipse.jetty.util.thread.QueuedThreadPool.runJob(QueuedThreadPool.java:599)         at org.eclipse.jetty.util.thread.QueuedThreadPool$3.run(QueuedThreadPool.java:534)         at java.lang.Thread.run(Thread.java:722)    3) Thread[id=117, name=qtp1065037894-117 Acceptor2 SelectChannelConnector@0.0.0.0:38672, state=BLOCKED, group=TGRP-BasicDistributedZkTest]         at sun.nio.ch.ServerSocketChannelImpl.accept(ServerSocketChannelImpl.java:210)         at org.eclipse.jetty.server.nio.SelectChannelConnector.accept(SelectChannelConnector.java:104)         at org.eclipse.jetty.server.AbstractConnector$Acceptor.run(AbstractConnector.java:933)         at org.eclipse.jetty.util.thread.QueuedThreadPool.runJob(QueuedThreadPool.java:599)         at org.eclipse.jetty.util.thread.QueuedThreadPool$3.run(QueuedThreadPool.java:534)         at java.lang.Thread.run(Thread.java:722)    4) Thread[id=165, name=qtp15205627-165 Acceptor1 SelectChannelConnector@0.0.0.0:18910, state=RUNNABLE, group=TGRP-BasicDistributedZkTest]         at sun.nio.ch.ServerSocketChannelImpl.accept0(Native Method)         at sun.nio.ch.ServerSocketChannelImpl.accept(ServerSocketChannelImpl.java:226)         at org.eclipse.jetty.server.nio.SelectChannelConnector.accept(SelectChannelConnector.java:104)         at org.eclipse.jetty.server.AbstractConnector$Acceptor.run(AbstractConnector.java:933)         at org.eclipse.jetty.util.thread.QueuedThreadPool.runJob(QueuedThreadPool.java:599)         at org.eclipse.jetty.util.thread.QueuedThreadPool$3.run(QueuedThreadPool.java:534)         at java.lang.Thread.run(Thread.java:722)    5) Thread[id=186, name=qtp507512929-186 Acceptor3 SelectChannelConnector@0.0.0.0:24328, state=BLOCKED, group=TGRP-BasicDistributedZkTest]         at sun.nio.ch.ServerSocketChannelImpl.accept(ServerSocketChannelImpl.java:210)         at org.eclipse.jetty.server.nio.SelectChannelConnector.accept(SelectChannelConnector.java:104)         at org.eclipse.jetty.server.AbstractConnector$Acceptor.run(AbstractConnector.java:933)         at org.eclipse.jetty.util.thread.QueuedThreadPool.runJob(QueuedThreadPool.java:599)         at org.eclipse.jetty.util.thread.QueuedThreadPool$3.run(QueuedThreadPool.java:534)         at java.lang.Thread.run(Thread.java:722)    6) Thread[id=167, name=qtp15205627-167 Acceptor3 SelectChannelConnector@0.0.0.0:18910, state=BLOCKED, group=TGRP-BasicDistributedZkTest]         at sun.nio.ch.ServerSocketChannelImpl.accept(ServerSocketChannelImpl.java:210)         at org.eclipse.jetty.server.nio.SelectChannelConnector.accept(SelectChannelConnector.java:104)         at org.eclipse.jetty.server.AbstractConnector$Acceptor.run(AbstractConnector.java:933)         at org.eclipse.jetty.util.thread.QueuedThreadPool.runJob(QueuedThreadPool.java:599)         at org.eclipse.jetty.util.thread.QueuedThreadPool$3.run(QueuedThreadPool.java:534)         at java.lang.Thread.run(Thread.java:722)    7) Thread[id=115, name=qtp1065037894-115 Acceptor0 SelectChannelConnector@0.0.0.0:38672, state=BLOCKED, group=TGRP-BasicDistributedZkTest]         at sun.nio.ch.ServerSocketChannelImpl.accept(ServerSocketChannelImpl.java:210)         at org.eclipse.jetty.server.nio.SelectChannelConnector.accept(SelectChannelConnector.java:104)         at org.eclipse.jetty.server.AbstractConnector$Acceptor.run(AbstractConnector.java:933)         at org.eclipse.jetty.util.thread.QueuedThreadPool.runJob(QueuedThreadPool.java:599)         at org.eclipse.jetty.util.thread.QueuedThreadPool$3.run(QueuedThreadPool.java:534)         at java.lang.Thread.run(Thread.java:722)    8) Thread[id=184, name=qtp507512929-184 Acceptor1 SelectChannelConnector@0.0.0.0:24328, state=BLOCKED, group=TGRP-BasicDistributedZkTest]         at sun.nio.ch.ServerSocketChannelImpl.accept(ServerSocketChannelImpl.java:210)         at org.eclipse.jetty.server.nio.SelectChannelConnector.accept(SelectChannelConnector.java:104)         at org.eclipse.jetty.server.AbstractConnector$Acceptor.run(AbstractConnector.java:933)         at org.eclipse.jetty.util.thread.QueuedThreadPool.runJob(QueuedThreadPool.java:599)         at org.eclipse.jetty.util.thread.QueuedThreadPool$3.run(QueuedThreadPool.java:534)         at java.lang.Thread.run(Thread.java:722)    9) Thread[id=116, name=qtp1065037894-116 Acceptor1 SelectChannelConnector@0.0.0.0:38672, state=BLOCKED, group=TGRP-BasicDistributedZkTest]         at sun.nio.ch.ServerSocketChannelImpl.accept(ServerSocketChannelImpl.java:210)         at org.eclipse.jetty.server.nio.SelectChannelConnector.accept(SelectChannelConnector.java:104)         at org.eclipse.jetty.server.AbstractConnector$Acceptor.run(AbstractConnector.java:933)         at org.eclipse.jetty.util.thread.QueuedThreadPool.runJob(QueuedThreadPool.java:599)         at org.eclipse.jetty.util.thread.QueuedThreadPool$3.run(QueuedThreadPool.java:534)         at java.lang.Thread.run(Thread.java:722)   10) Thread[id=164, name=qtp15205627-164 Acceptor0 SelectChannelConnector@0.0.0.0:18910, state=BLOCKED, group=TGRP-BasicDistributedZkTest]         at sun.nio.ch.ServerSocketChannelImpl.accept(ServerSocketChannelImpl.java:210)         at org.eclipse.jetty.server.nio.SelectChannelConnector.accept(SelectChannelConnector.java:104)         at org.eclipse.jetty.server.AbstractConnector$Acceptor.run(AbstractConnector.java:933)         at org.eclipse.jetty.util.thread.QueuedThreadPool.runJob(QueuedThreadPool.java:599)         at org.eclipse.jetty.util.thread.QueuedThreadPool$3.run(QueuedThreadPool.java:534)         at java.lang.Thread.run(Thread.java:722)   11) Thread[id=118, name=qtp1065037894-118 Acceptor3 SelectChannelConnector@0.0.0.0:38672, state=RUNNABLE, group=TGRP-BasicDistributedZkTest]         at sun.nio.ch.ServerSocketChannelImpl.accept0(Native Method)         at sun.nio.ch.ServerSocketChannelImpl.accept(ServerSocketChannelImpl.java:226)         at org.eclipse.jetty.server.nio.SelectChannelConnector.accept(SelectChannelConnector.java:104)         at org.eclipse.jetty.server.AbstractConnector$Acceptor.run(AbstractConnector.java:933)         at org.eclipse.jetty.util.thread.QueuedThreadPool.runJob(QueuedThreadPool.java:599)         at org.eclipse.jetty.util.thread.QueuedThreadPool$3.run(QueuedThreadPool.java:534)         at java.lang.Thread.run(Thread.java:722)   12) Thread[id=166, name=qtp15205627-166 Acceptor2 SelectChannelConnector@0.0.0.0:18910, state=BLOCKED, group=TGRP-BasicDistributedZkTest]         at sun.nio.ch.ServerSocketChannelImpl.accept(ServerSocketChannelImpl.java:210)         at org.eclipse.jetty.server.nio.SelectChannelConnector.accept(SelectChannelConnector.java:104)         at org.eclipse.jetty.server.AbstractConnector$Acceptor.run(AbstractConnector.java:933)         at org.eclipse.jetty.util.thread.QueuedThreadPool.runJob(QueuedThreadPool.java:599)         at org.eclipse.jetty.util.thread.QueuedThreadPool$3.run(QueuedThreadPool.java:534)         at java.lang.Thread.run(Thread.java:722)

Stack Trace:
com.carrotsearch.randomizedtesting.ThreadLeakError: There are still zombie threads that couldn't be terminated:
   1) Thread[id=185, name=qtp507512929-185 Acceptor2 SelectChannelConnector@0.0.0.0:24328, state=BLOCKED, group=TGRP-BasicDistributedZkTest]
        at sun.nio.ch.ServerSocketChannelImpl.accept(ServerSocketChannelImpl.java:210)
        at org.eclipse.jetty.server.nio.SelectChannelConnector.accept(SelectChannelConnector.java:104)
        at org.eclipse.jetty.server.AbstractConnector$Acceptor.run(AbstractConnector.java:933)
        at org.eclipse.jetty.util.thread.QueuedThreadPool.runJob(QueuedThreadPool.java:599)
        at org.eclipse.jetty.util.thread.QueuedThreadPool$3.run(QueuedThreadPool.java:534)
        at java.lang.Thread.run(Thread.java:722)
   2) Thread[id=183, name=qtp507512929-183 Acceptor0 SelectChannelConnector@0.0.0.0:24328, state=RUNNABLE, group=TGRP-BasicDistributedZkTest]
        at sun.nio.ch.ServerSocketChannelImpl.accept0(Native Method)
        at sun.nio.ch.ServerSocketChannelImpl.accept(ServerSocketChannelImpl.java:226)
        at org.eclipse.jetty.server.nio.SelectChannelConnector.accept(SelectChannelConnector.java:104)
        at org.eclipse.jetty.server.AbstractConnector$Acceptor.run(AbstractConnector.java:933)
        at org.eclipse.jetty.util.thread.QueuedThreadPool.runJob(QueuedThreadPool.java:599)
        at org.eclipse.jetty.util.thread.QueuedThreadPool$3.run(QueuedThreadPool.java:534)
        at java.lang.Thread.run(Thread.java:722)
   3) Thread[id=117, name=qtp1065037894-117 Acceptor2 SelectChannelConnector@0.0.0.0:38672, state=BLOCKED, group=TGRP-BasicDistributedZkTest]
        at sun.nio.ch.ServerSocketChannelImpl.accept(ServerSocketChannelImpl.java:210)
        at org.eclipse.jetty.server.nio.SelectChannelConnector.accept(SelectChannelConnector.java:104)
        at org.eclipse.jetty.server.AbstractConnector$Acceptor.run(AbstractConnector.java:933)
        at org.eclipse.jetty.util.thread.QueuedThreadPool.runJob(QueuedThreadPool.java:599)
        at org.eclipse.jetty.util.thread.QueuedThreadPool$3.run(QueuedThreadPool.java:534)
        at java.lang.Thread.run(Thread.java:722)
   4) Thread[id=165, name=qtp15205627-165 Acceptor1 SelectChannelConnector@0.0.0.0:18910, state=RUNNABLE, group=TGRP-BasicDistributedZkTest]
        at sun.nio.ch.ServerSocketChannelImpl.accept0(Native Method)
        at sun.nio.ch.ServerSocketChannelImpl.accept(ServerSocketChannelImpl.java:226)
        at org.eclipse.jetty.server.nio.SelectChannelConnector.accept(SelectChannelConnector.java:104)
        at org.eclipse.jetty.server.AbstractConnector$Acceptor.run(AbstractConnector.java:933)
        at org.eclipse.jetty.util.thread.QueuedThreadPool.runJob(QueuedThreadPool.java:599)
        at org.eclipse.jetty.util.thread.QueuedThreadPool$3.run(QueuedThreadPool.java:534)
        at java.lang.Thread.run(Thread.java:722)
   5) Thread[id=186, name=qtp507512929-186 Acceptor3 SelectChannelConnector@0.0.0.0:24328, state=BLOCKED, group=TGRP-BasicDistributedZkTest]
        at sun.nio.ch.ServerSocketChannelImpl.accept(ServerSocketChannelImpl.java:210)
        at org.eclipse.jetty.server.nio.SelectChannelConnector.accept(SelectChannelConnector.java:104)
        at org.eclipse.jetty.server.AbstractConnector$Acceptor.run(AbstractConnector.java:933)
        at org.eclipse.jetty.util.thread.QueuedThreadPool.runJob(QueuedThreadPool.java:599)
        at org.eclipse.jetty.util.thread.QueuedThreadPool$3.run(QueuedThreadPool.java:534)
        at java.lang.Thread.run(Thread.java:722)
   6) Thread[id=167, name=qtp15205627-167 Acceptor3 SelectChannelConnector@0.0.0.0:18910, state=BLOCKED, group=TGRP-BasicDistributedZkTest]
        at sun.nio.ch.ServerSocketChannelImpl.accept(ServerSocketChannelImpl.java:210)
        at org.eclipse.jetty.server.nio.SelectChannelConnector.accept(SelectChannelConnector.java:104)
        at org.eclipse.jetty.server.AbstractConnector$Acceptor.run(AbstractConnector.java:933)
        at org.eclipse.jetty.util.thread.QueuedThreadPool.runJob(QueuedThreadPool.java:599)
        at org.eclipse.jetty.util.thread.QueuedThreadPool$3.run(QueuedThreadPool.java:534)
        at java.lang.Thread.run(Thread.java:722)
   7) Thread[id=115, name=qtp1065037894-115 Acceptor0 SelectChannelConnector@0.0.0.0:38672, state=BLOCKED, group=TGRP-BasicDistributedZkTest]
        at sun.nio.ch.ServerSocketChannelImpl.accept(ServerSocketChannelImpl.java:210)
        at org.eclipse.jetty.server.nio.SelectChannelConnector.accept(SelectChannelConnector.java:104)
        at org.eclipse.jetty.server.AbstractConnector$Acceptor.run(AbstractConnector.java:933)
        at org.eclipse.jetty.util.thread.QueuedThreadPool.runJob(QueuedThreadPool.java:599)
        at org.eclipse.jetty.util.thread.QueuedThreadPool$3.run(QueuedThreadPool.java:534)
        at java.lang.Thread.run(Thread.java:722)
   8) Thread[id=184, name=qtp507512929-184 Acceptor1 SelectChannelConnector@0.0.0.0:24328, state=BLOCKED, group=TGRP-BasicDistributedZkTest]
        at sun.nio.ch.ServerSocketChannelImpl.accept(ServerSocketChannelImpl.java:210)
        at org.eclipse.jetty.server.nio.SelectChannelConnector.accept(SelectChannelConnector.java:104)
        at org.eclipse.jetty.server.AbstractConnector$Acceptor.run(AbstractConnector.java:933)
        at org.eclipse.jetty.util.thread.QueuedThreadPool.runJob(QueuedThreadPool.java:599)
        at org.eclipse.jetty.util.thread.QueuedThreadPool$3.run(QueuedThreadPool.java:534)
        at java.lang.Thread.run(Thread.java:722)
   9) Thread[id=116, name=qtp1065037894-116 Acceptor1 SelectChannelConnector@0.0.0.0:38672, state=BLOCKED, group=TGRP-BasicDistributedZkTest]
        at sun.nio.ch.ServerSocketChannelImpl.accept(ServerSocketChannelImpl.java:210)
        at org.eclipse.jetty.server.nio.SelectChannelConnector.accept(SelectChannelConnector.java:104)
        at org.eclipse.jetty.server.AbstractConnector$Acceptor.run(AbstractConnector.java:933)
        at org.eclipse.jetty.util.thread.QueuedThreadPool.runJob(QueuedThreadPool.java:599)
        at org.eclipse.jetty.util.thread.QueuedThreadPool$3.run(QueuedThreadPool.java:534)
        at java.lang.Thread.run(Thread.java:722)
  10) Thread[id=164, name=qtp15205627-164 Acceptor0 SelectChannelConnector@0.0.0.0:18910, state=BLOCKED, group=TGRP-BasicDistributedZkTest]
        at sun.nio.ch.ServerSocketChannelImpl.accept(ServerSocketChannelImpl.java:210)
        at org.eclipse.jetty.server.nio.SelectChannelConnector.accept(SelectChannelConnector.java:104)
        at org.eclipse.jetty.server.AbstractConnector$Acceptor.run(AbstractConnector.java:933)
        at org.eclipse.jetty.util.thread.QueuedThreadPool.runJob(QueuedThreadPool.java:599)
        at org.eclipse.jetty.util.thread.QueuedThreadPool$3.run(QueuedThreadPool.java:534)
        at java.lang.Thread.run(Thread.java:722)
  11) Thread[id=118, name=qtp1065037894-118 Acceptor3 SelectChannelConnector@0.0.0.0:38672, state=RUNNABLE, group=TGRP-BasicDistributedZkTest]
        at sun.nio.ch.ServerSocketChannelImpl.accept0(Native Method)
        at sun.nio.ch.ServerSocketChannelImpl.accept(ServerSocketChannelImpl.java:226)
        at org.eclipse.jetty.server.nio.SelectChannelConnector.accept(SelectChannelConnector.java:104)
        at org.eclipse.jetty.server.AbstractConnector$Acceptor.run(AbstractConnector.java:933)
        at org.eclipse.jetty.util.thread.QueuedThreadPool.runJob(QueuedThreadPool.java:599)
        at org.eclipse.jetty.util.thread.QueuedThreadPool$3.run(QueuedThreadPool.java:534)
        at java.lang.Thread.run(Thread.java:722)
  12) Thread[id=166, name=qtp15205627-166 Acceptor2 SelectChannelConnector@0.0.0.0:18910, state=BLOCKED, group=TGRP-BasicDistributedZkTest]
        at sun.nio.ch.ServerSocketChannelImpl.accept(ServerSocketChannelImpl.java:210)
        at org.eclipse.jetty.server.nio.SelectChannelConnector.accept(SelectChannelConnector.java:104)
        at org.eclipse.jetty.server.AbstractConnector$Acceptor.run(AbstractConnector.java:933)
        at org.eclipse.jetty.util.thread.QueuedThreadPool.runJob(QueuedThreadPool.java:599)
        at org.eclipse.jetty.util.thread.QueuedThreadPool$3.run(QueuedThreadPool.java:534)
        at java.lang.Thread.run(Thread.java:722)
	at __randomizedtesting.SeedInfo.seed([C6F54FC7A3B9989F]:0)


FAILED:  junit.framework.TestSuite.org.apache.solr.request.TestRemoteStreaming

Error Message:
4 threads leaked from SUITE scope at org.apache.solr.request.TestRemoteStreaming:     1) Thread[id=329, name=qtp651274847-329 Acceptor1 SelectChannelConnector@0.0.0.0:६३०६६, state=BLOCKED, group=TGRP-TestRemoteStreaming]         at sun.nio.ch.ServerSocketChannelImpl.accept(ServerSocketChannelImpl.java:210)         at org.eclipse.jetty.server.nio.SelectChannelConnector.accept(SelectChannelConnector.java:104)         at org.eclipse.jetty.server.AbstractConnector$Acceptor.run(AbstractConnector.java:933)         at org.eclipse.jetty.util.thread.QueuedThreadPool.runJob(QueuedThreadPool.java:599)         at org.eclipse.jetty.util.thread.QueuedThreadPool$3.run(QueuedThreadPool.java:534)         at java.lang.Thread.run(Thread.java:722)    2) Thread[id=331, name=qtp651274847-331 Acceptor3 SelectChannelConnector@0.0.0.0:६३०६६, state=RUNNABLE, group=TGRP-TestRemoteStreaming]         at sun.nio.ch.ServerSocketChannelImpl.accept0(Native Method)         at sun.nio.ch.ServerSocketChannelImpl.accept(ServerSocketChannelImpl.java:226)         at org.eclipse.jetty.server.nio.SelectChannelConnector.accept(SelectChannelConnector.java:104)         at org.eclipse.jetty.server.AbstractConnector$Acceptor.run(AbstractConnector.java:933)         at org.eclipse.jetty.util.thread.QueuedThreadPool.runJob(QueuedThreadPool.java:599)         at org.eclipse.jetty.util.thread.QueuedThreadPool$3.run(QueuedThreadPool.java:534)         at java.lang.Thread.run(Thread.java:722)    3) Thread[id=330, name=qtp651274847-330 Acceptor2 SelectChannelConnector@0.0.0.0:६३०६६, state=BLOCKED, group=TGRP-TestRemoteStreaming]         at sun.nio.ch.ServerSocketChannelImpl.accept(ServerSocketChannelImpl.java:210)         at org.eclipse.jetty.server.nio.SelectChannelConnector.accept(SelectChannelConnector.java:104)         at org.eclipse.jetty.server.AbstractConnector$Acceptor.run(AbstractConnector.java:933)         at org.eclipse.jetty.util.thread.QueuedThreadPool.runJob(QueuedThreadPool.java:599)         at org.eclipse.jetty.util.thread.QueuedThreadPool$3.run(QueuedThreadPool.java:534)         at java.lang.Thread.run(Thread.java:722)    4) Thread[id=328, name=qtp651274847-328 Acceptor0 SelectChannelConnector@0.0.0.0:६३०६६, state=BLOCKED, group=TGRP-TestRemoteStreaming]         at sun.nio.ch.ServerSocketChannelImpl.accept(ServerSocketChannelImpl.java:210)         at org.eclipse.jetty.server.nio.SelectChannelConnector.accept(SelectChannelConnector.java:104)         at org.eclipse.jetty.server.AbstractConnector$Acceptor.run(AbstractConnector.java:933)         at org.eclipse.jetty.util.thread.QueuedThreadPool.runJob(QueuedThreadPool.java:599)         at org.eclipse.jetty.util.thread.QueuedThreadPool$3.run(QueuedThreadPool.java:534)         at java.lang.Thread.run(Thread.java:722)

Stack Trace:
com.carrotsearch.randomizedtesting.ThreadLeakError: 4 threads leaked from SUITE scope at org.apache.solr.request.TestRemoteStreaming: 
   1) Thread[id=329, name=qtp651274847-329 Acceptor1 SelectChannelConnector@0.0.0.0:६३०६६, state=BLOCKED, group=TGRP-TestRemoteStreaming]
        at sun.nio.ch.ServerSocketChannelImpl.accept(ServerSocketChannelImpl.java:210)
        at org.eclipse.jetty.server.nio.SelectChannelConnector.accept(SelectChannelConnector.java:104)
        at org.eclipse.jetty.server.AbstractConnector$Acceptor.run(AbstractConnector.java:933)
        at org.eclipse.jetty.util.thread.QueuedThreadPool.runJob(QueuedThreadPool.java:599)
        at org.eclipse.jetty.util.thread.QueuedThreadPool$3.run(QueuedThreadPool.java:534)
        at java.lang.Thread.run(Thread.java:722)
   2) Thread[id=331, name=qtp651274847-331 Acceptor3 SelectChannelConnector@0.0.0.0:६३०६६, state=RUNNABLE, group=TGRP-TestRemoteStreaming]
        at sun.nio.ch.ServerSocketChannelImpl.accept0(Native Method)
        at sun.nio.ch.ServerSocketChannelImpl.accept(ServerSocketChannelImpl.java:226)
        at org.eclipse.jetty.server.nio.SelectChannelConnector.accept(SelectChannelConnector.java:104)
        at org.eclipse.jetty.server.AbstractConnector$Acceptor.run(AbstractConnector.java:933)
        at org.eclipse.jetty.util.thread.QueuedThreadPool.runJob(QueuedThreadPool.java:599)
        at org.eclipse.jetty.util.thread.QueuedThreadPool$3.run(QueuedThreadPool.java:534)
        at java.lang.Thread.run(Thread.java:722)
   3) Thread[id=330, name=qtp651274847-330 Acceptor2 SelectChannelConnector@0.0.0.0:६३०६६, state=BLOCKED, group=TGRP-TestRemoteStreaming]
        at sun.nio.ch.ServerSocketChannelImpl.accept(ServerSocketChannelImpl.java:210)
        at org.eclipse.jetty.server.nio.SelectChannelConnector.accept(SelectChannelConnector.java:104)
        at org.eclipse.jetty.server.AbstractConnector$Acceptor.run(AbstractConnector.java:933)
        at org.eclipse.jetty.util.thread.QueuedThreadPool.runJob(QueuedThreadPool.java:599)
        at org.eclipse.jetty.util.thread.QueuedThreadPool$3.run(QueuedThreadPool.java:534)
        at java.lang.Thread.run(Thread.java:722)
   4) Thread[id=328, name=qtp651274847-328 Acceptor0 SelectChannelConnector@0.0.0.0:६३०६६, state=BLOCKED, group=TGRP-TestRemoteStreaming]
        at sun.nio.ch.ServerSocketChannelImpl.accept(ServerSocketChannelImpl.java:210)
        at org.eclipse.jetty.server.nio.SelectChannelConnector.accept(SelectChannelConnector.java:104)
        at org.eclipse.jetty.server.AbstractConnector$Acceptor.run(AbstractConnector.java:933)
        at org.eclipse.jetty.util.thread.QueuedThreadPool.runJob(QueuedThreadPool.java:599)
        at org.eclipse.jetty.util.thread.QueuedThreadPool$3.run(QueuedThreadPool.java:534)
        at java.lang.Thread.run(Thread.java:722)
	at __randomizedtesting.SeedInfo.seed([C6F54FC7A3B9989F]:0)


FAILED:  junit.framework.TestSuite.org.apache.solr.request.TestRemoteStreaming

Error Message:
There are still zombie threads that couldn't be terminated:    1) Thread[id=329, name=qtp651274847-329 Acceptor1 SelectChannelConnector@0.0.0.0:६३०६६, state=BLOCKED, group=TGRP-TestRemoteStreaming]         at sun.nio.ch.ServerSocketChannelImpl.accept(ServerSocketChannelImpl.java:210)         at org.eclipse.jetty.server.nio.SelectChannelConnector.accept(SelectChannelConnector.java:104)         at org.eclipse.jetty.server.AbstractConnector$Acceptor.run(AbstractConnector.java:933)         at org.eclipse.jetty.util.thread.QueuedThreadPool.runJob(QueuedThreadPool.java:599)         at org.eclipse.jetty.util.thread.QueuedThreadPool$3.run(QueuedThreadPool.java:534)         at java.lang.Thread.run(Thread.java:722)    2) Thread[id=331, name=qtp651274847-331 Acceptor3 SelectChannelConnector@0.0.0.0:६३०६६, state=RUNNABLE, group=TGRP-TestRemoteStreaming]         at sun.nio.ch.ServerSocketChannelImpl.accept0(Native Method)         at sun.nio.ch.ServerSocketChannelImpl.accept(ServerSocketChannelImpl.java:226)         at org.eclipse.jetty.server.nio.SelectChannelConnector.accept(SelectChannelConnector.java:104)         at org.eclipse.jetty.server.AbstractConnector$Acceptor.run(AbstractConnector.java:933)         at org.eclipse.jetty.util.thread.QueuedThreadPool.runJob(QueuedThreadPool.java:599)         at org.eclipse.jetty.util.thread.QueuedThreadPool$3.run(QueuedThreadPool.java:534)         at java.lang.Thread.run(Thread.java:722)    3) Thread[id=330, name=qtp651274847-330 Acceptor2 SelectChannelConnector@0.0.0.0:६३०६६, state=BLOCKED, group=TGRP-TestRemoteStreaming]         at sun.nio.ch.ServerSocketChannelImpl.accept(ServerSocketChannelImpl.java:210)         at org.eclipse.jetty.server.nio.SelectChannelConnector.accept(SelectChannelConnector.java:104)         at org.eclipse.jetty.server.AbstractConnector$Acceptor.run(AbstractConnector.java:933)         at org.eclipse.jetty.util.thread.QueuedThreadPool.runJob(QueuedThreadPool.java:599)         at org.eclipse.jetty.util.thread.QueuedThreadPool$3.run(QueuedThreadPool.java:534)         at java.lang.Thread.run(Thread.java:722)    4) Thread[id=328, name=qtp651274847-328 Acceptor0 SelectChannelConnector@0.0.0.0:६३०६६, state=BLOCKED, group=TGRP-TestRemoteStreaming]         at sun.nio.ch.ServerSocketChannelImpl.accept(ServerSocketChannelImpl.java:210)         at org.eclipse.jetty.server.nio.SelectChannelConnector.accept(SelectChannelConnector.java:104)         at org.eclipse.jetty.server.AbstractConnector$Acceptor.run(AbstractConnector.java:933)         at org.eclipse.jetty.util.thread.QueuedThreadPool.runJob(QueuedThreadPool.java:599)         at org.eclipse.jetty.util.thread.QueuedThreadPool$3.run(QueuedThreadPool.java:534)         at java.lang.Thread.run(Thread.java:722)

Stack Trace:
com.carrotsearch.randomizedtesting.ThreadLeakError: There are still zombie threads that couldn't be terminated:
   1) Thread[id=329, name=qtp651274847-329 Acceptor1 SelectChannelConnector@0.0.0.0:६३०६६, state=BLOCKED, group=TGRP-TestRemoteStreaming]
        at sun.nio.ch.ServerSocketChannelImpl.accept(ServerSocketChannelImpl.java:210)
        at org.eclipse.jetty.server.nio.SelectChannelConnector.accept(SelectChannelConnector.java:104)
        at org.eclipse.jetty.server.AbstractConnector$Acceptor.run(AbstractConnector.java:933)
        at org.eclipse.jetty.util.thread.QueuedThreadPool.runJob(QueuedThreadPool.java:599)
        at org.eclipse.jetty.util.thread.QueuedThreadPool$3.run(QueuedThreadPool.java:534)
        at java.lang.Thread.run(Thread.java:722)
   2) Thread[id=331, name=qtp651274847-331 Acceptor3 SelectChannelConnector@0.0.0.0:६३०६६, state=RUNNABLE, group=TGRP-TestRemoteStreaming]
        at sun.nio.ch.ServerSocketChannelImpl.accept0(Native Method)
        at sun.nio.ch.ServerSocketChannelImpl.accept(ServerSocketChannelImpl.java:226)
        at org.eclipse.jetty.server.nio.SelectChannelConnector.accept(SelectChannelConnector.java:104)
        at org.eclipse.jetty.server.AbstractConnector$Acceptor.run(AbstractConnector.java:933)
        at org.eclipse.jetty.util.thread.QueuedThreadPool.runJob(QueuedThreadPool.java:599)
        at org.eclipse.jetty.util.thread.QueuedThreadPool$3.run(QueuedThreadPool.java:534)
        at java.lang.Thread.run(Thread.java:722)
   3) Thread[id=330, name=qtp651274847-330 Acceptor2 SelectChannelConnector@0.0.0.0:६३०६६, state=BLOCKED, group=TGRP-TestRemoteStreaming]
        at sun.nio.ch.ServerSocketChannelImpl.accept(ServerSocketChannelImpl.java:210)
        at org.eclipse.jetty.server.nio.SelectChannelConnector.accept(SelectChannelConnector.java:104)
        at org.eclipse.jetty.server.AbstractConnector$Acceptor.run(AbstractConnector.java:933)
        at org.eclipse.jetty.util.thread.QueuedThreadPool.runJob(QueuedThreadPool.java:599)
        at org.eclipse.jetty.util.thread.QueuedThreadPool$3.run(QueuedThreadPool.java:534)
        at java.lang.Thread.run(Thread.java:722)
   4) Thread[id=328, name=qtp651274847-328 Acceptor0 SelectChannelConnector@0.0.0.0:६३०६६, state=BLOCKED, group=TGRP-TestRemoteStreaming]
        at sun.nio.ch.ServerSocketChannelImpl.accept(ServerSocketChannelImpl.java:210)
        at org.eclipse.jetty.server.nio.SelectChannelConnector.accept(SelectChannelConnector.java:104)
        at org.eclipse.jetty.server.AbstractConnector$Acceptor.run(AbstractConnector.java:933)
        at org.eclipse.jetty.util.thread.QueuedThreadPool.runJob(QueuedThreadPool.java:599)
        at org.eclipse.jetty.util.thread.QueuedThreadPool$3.run(QueuedThreadPool.java:534)
        at java.lang.Thread.run(Thread.java:722)
	at __randomizedtesting.SeedInfo.seed([C6F54FC7A3B9989F]:0)




Build Log:
[...truncated 8416 lines...]
[junit4:junit4] Suite: org.apache.solr.request.TestRemoteStreaming
[junit4:junit4]   2> 0 T321 oas.SolrTestCaseJ4.initCore ####initCore
[junit4:junit4]   2> Creating dataDir: /usr/home/hudson/hudson-slave/workspace/Lucene-Solr-Tests-4.x-java7/solr/build/solr-core/test/J1/./solrtest-TestRemoteStreaming-1352218923210
[junit4:junit4]   2> 1 T321 oas.SolrTestCaseJ4.initCore ####initCore end
[junit4:junit4]   2> 571 T321 oejs.Server.doStart jetty-8.1.2.v20120308
[junit4:junit4]   2> 951 T321 oejs.AbstractConnector.doStart Started SelectChannelConnector@0.0.0.0:?????
[junit4:junit4]   2> 997 T321 oasc.SolrResourceLoader.locateSolrHome JNDI not configured for solr (NoInitialContextEx)
[junit4:junit4]   2> 997 T321 oasc.SolrResourceLoader.locateSolrHome using system property solr.solr.home: solr/
[junit4:junit4]   2> 998 T321 oasc.SolrResourceLoader.<init> new SolrResourceLoader for deduced Solr Home: 'solr/'
[junit4:junit4]   2> 1045 T321 oass.SolrDispatchFilter.init SolrDispatchFilter.init()
[junit4:junit4]   2> 1045 T321 oasc.SolrResourceLoader.locateSolrHome JNDI not configured for solr (NoInitialContextEx)
[junit4:junit4]   2> 1046 T321 oasc.SolrResourceLoader.locateSolrHome using system property solr.solr.home: solr/
[junit4:junit4]   2> 1046 T321 oasc.CoreContainer$Initializer.initialize looking for solr.xml: /usr/home/hudson/hudson-slave/workspace/Lucene-Solr-Tests-4.x-java7/solr/build/solr-core/test/J1/solr/solr.xml
[junit4:junit4]   2> 1046 T321 oasc.CoreContainer.<init> New CoreContainer 601419896
[junit4:junit4]   2> 1047 T321 oasc.CoreContainer$Initializer.initialize no solr.xml file found - using default
[junit4:junit4]   2> 1047 T321 oasc.CoreContainer.load Loading CoreContainer using Solr Home: 'solr/'
[junit4:junit4]   2> 1048 T321 oasc.SolrResourceLoader.<init> new SolrResourceLoader for directory: 'solr/'
[junit4:junit4]   2> 1096 T321 oasc.CoreContainer.load Registering Log Listener
[junit4:junit4]   2> 1123 T321 oasc.CoreContainer.create Creating SolrCore 'collection1' using instanceDir: solr/collection1
[junit4:junit4]   2> 1125 T321 oasc.SolrResourceLoader.<init> new SolrResourceLoader for directory: 'solr/collection1/'
[junit4:junit4]   2> 1211 T321 oasc.SolrConfig.<init> Using Lucene MatchVersion: LUCENE_41
[junit4:junit4]   2> 1285 T321 oasc.SolrConfig.<init> Loaded SolrConfig: solrconfig.xml
[junit4:junit4]   2> 1291 T321 oass.IndexSchema.readSchema Reading Solr Schema
[junit4:junit4]   2> 1302 T321 oass.IndexSchema.readSchema Schema name=test
[junit4:junit4]   2> 1930 T321 oass.OpenExchangeRatesOrgProvider.init Initialized with rates=open-exchange-rates.json, refreshInterval=1440.
[junit4:junit4]   2> 1942 T321 oass.IndexSchema.readSchema default search field in schema is text
[junit4:junit4]   2> 1947 T321 oass.IndexSchema.readSchema unique key field: id
[junit4:junit4]   2> 1978 T321 oass.FileExchangeRateProvider.reload Reloading exchange rates from file currency.xml
[junit4:junit4]   2> 1987 T321 oass.FileExchangeRateProvider.reload Reloading exchange rates from file currency.xml
[junit4:junit4]   2> 1992 T321 oass.OpenExchangeRatesOrgProvider.reload Reloading exchange rates from open-exchange-rates.json
[junit4:junit4]   2> 1997 T321 oass.OpenExchangeRatesOrgProvider.reload Reloading exchange rates from open-exchange-rates.json
[junit4:junit4]   2> 1999 T321 oasc.SolrCore.<init> [collection1] Opening new SolrCore at solr/collection1/, dataDir=/usr/home/hudson/hudson-slave/workspace/Lucene-Solr-Tests-4.x-java7/solr/build/solr-core/test/J1/solrtest-TestRemoteStreaming-1352218923210/
[junit4:junit4]   2> 1999 T321 oasc.JmxMonitoredMap.<init> JMX monitoring is enabled. Adding Solr mbeans to JMX Server: com.sun.jmx.mbeanserver.JmxMBeanServer@732d14e0
[junit4:junit4]   2> 2001 T321 oasc.SolrCore.getNewIndexDir New index directory detected: old=null new=/usr/home/hudson/hudson-slave/workspace/Lucene-Solr-Tests-4.x-java7/solr/build/solr-core/test/J1/solrtest-TestRemoteStreaming-1352218923210/index/
[junit4:junit4]   2> 2001 T321 oasc.SolrCore.initIndex WARNING [collection1] Solr index directory '/usr/home/hudson/hudson-slave/workspace/Lucene-Solr-Tests-4.x-java7/solr/build/solr-core/test/J1/solrtest-TestRemoteStreaming-1352218923210/index' doesn't exist. Creating new index...
[junit4:junit4]   2> 2003 T321 oasc.CachingDirectoryFactory.get return new directory for /usr/home/hudson/hudson-slave/workspace/Lucene-Solr-Tests-4.x-java7/solr/build/solr-core/test/J1/solrtest-TestRemoteStreaming-1352218923210/index forceNew:false
[junit4:junit4]   2> 2005 T321 oasc.SolrDeletionPolicy.onCommit SolrDeletionPolicy.onCommit: commits:num=1
[junit4:junit4]   2> 		commit{dir=MockDirWrapper(org.apache.lucene.store.RAMDirectory@257938cb lockFactory=org.apache.lucene.store.NativeFSLockFactory@6c9c5420),segFN=segments_1,generation=1,filenames=[segments_1]
[junit4:junit4]   2> 2005 T321 oasc.SolrDeletionPolicy.updateCommits newest commit = 1
[junit4:junit4]   2> 2006 T321 oasc.SolrCore.initWriters created xml: solr.XMLResponseWriter
[junit4:junit4]   2> 2009 T321 oasup.UpdateRequestProcessorChain.init inserting DistributedUpdateProcessorFactory into updateRequestProcessorChain "dedupe"
[junit4:junit4]   2> 2009 T321 oasup.UpdateRequestProcessorChain.init inserting DistributedUpdateProcessorFactory into updateRequestProcessorChain "dedupe-allfields"
[junit4:junit4]   2> 2010 T321 oasup.UpdateRequestProcessorChain.init inserting DistributedUpdateProcessorFactory into updateRequestProcessorChain "stored_sig"
[junit4:junit4]   2> 2010 T321 oasup.UpdateRequestProcessorChain.init inserting DistributedUpdateProcessorFactory into updateRequestProcessorChain "uniq-fields"
[junit4:junit4]   2> 2011 T321 oasup.UpdateRequestProcessorChain.init inserting DistributedUpdateProcessorFactory into updateRequestProcessorChain "distrib-dup-test-chain-implicit"
[junit4:junit4]   2> 2011 T321 oasc.RequestHandlers.initHandlersFromConfig adding lazy requestHandler: solr.ReplicationHandler
[junit4:junit4]   2> 2012 T321 oasc.RequestHandlers.initHandlersFromConfig created /replication: solr.ReplicationHandler
[junit4:junit4]   2> 2012 T321 oasc.RequestHandlers.initHandlersFromConfig created standard: solr.StandardRequestHandler
[junit4:junit4]   2> 2013 T321 oasc.RequestHandlers.initHandlersFromConfig created /get: solr.RealTimeGetHandler
[junit4:junit4]   2> 2014 T321 oasc.RequestHandlers.initHandlersFromConfig created dismax: solr.SearchHandler
[junit4:junit4]   2> 2014 T321 oasc.RequestHandlers.initHandlersFromConfig created mock: org.apache.solr.core.MockQuerySenderListenerReqHandler
[junit4:junit4]   2> 2015 T321 oasc.RequestHandlers.initHandlersFromConfig created /admin/: org.apache.solr.handler.admin.AdminHandlers
[junit4:junit4]   2> 2015 T321 oasc.RequestHandlers.initHandlersFromConfig created defaults: solr.StandardRequestHandler
[junit4:junit4]   2> 2016 T321 oasc.RequestHandlers.initHandlersFromConfig adding lazy requestHandler: solr.StandardRequestHandler
[junit4:junit4]   2> 2016 T321 oasc.RequestHandlers.initHandlersFromConfig created lazy: solr.StandardRequestHandler
[junit4:junit4]   2> 2017 T321 oasc.RequestHandlers.initHandlersFromConfig created /update: solr.UpdateRequestHandler
[junit4:junit4]   2> 2017 T321 oasc.RequestHandlers.initHandlersFromConfig created /terms: org.apache.solr.handler.component.SearchHandler
[junit4:junit4]   2> 2018 T321 oasc.RequestHandlers.initHandlersFromConfig created spellCheckCompRH: org.apache.solr.handler.component.SearchHandler
[junit4:junit4]   2> 2018 T321 oasc.RequestHandlers.initHandlersFromConfig created spellCheckCompRH_Direct: org.apache.solr.handler.component.SearchHandler
[junit4:junit4]   2> 2019 T321 oasc.RequestHandlers.initHandlersFromConfig created spellCheckWithWordbreak: org.apache.solr.handler.component.SearchHandler
[junit4:junit4]   2> 2020 T321 oasc.RequestHandlers.initHandlersFromConfig created spellCheckWithWordbreak_Direct: org.apache.solr.handler.component.SearchHandler
[junit4:junit4]   2> 2020 T321 oasc.RequestHandlers.initHandlersFromConfig created spellCheckCompRH1: org.apache.solr.handler.component.SearchHandler
[junit4:junit4]   2> 2021 T321 oasc.RequestHandlers.initHandlersFromConfig created tvrh: org.apache.solr.handler.component.SearchHandler
[junit4:junit4]   2> 2021 T321 oasc.RequestHandlers.initHandlersFromConfig created /mlt: solr.MoreLikeThisHandler
[junit4:junit4]   2> 2022 T321 oasc.RequestHandlers.initHandlersFromConfig created /debug/dump: solr.DumpRequestHandler
[junit4:junit4]   2> 2034 T321 oashl.XMLLoader.init xsltCacheLifetimeSeconds=60
[junit4:junit4]   2> 2039 T321 oasc.SolrCore.initDeprecatedSupport WARNING solrconfig.xml uses deprecated <admin/gettableFiles>, Please update your config to use the ShowFileRequestHandler.
[junit4:junit4]   2> 2041 T321 oasc.SolrCore.initDeprecatedSupport WARNING adding ShowFileRequestHandler with hidden files: []
[junit4:junit4]   2> 2044 T321 oass.SolrIndexSearcher.<init> Opening Searcher@11c9a329 main
[junit4:junit4]   2> 2044 T321 oass.SolrIndexSearcher.getIndexDir WARNING WARNING: Directory impl does not support setting indexDir: org.apache.lucene.store.MockDirectoryWrapper
[junit4:junit4]   2> 2045 T321 oasu.CommitTracker.<init> Hard AutoCommit: disabled
[junit4:junit4]   2> 2045 T321 oasu.CommitTracker.<init> Soft AutoCommit: disabled
[junit4:junit4]   2> 2046 T321 oashc.SpellCheckComponent.inform Initializing spell checkers
[junit4:junit4]   2> 2079 T321 oass.DirectSolrSpellChecker.init init: {name=direct,classname=DirectSolrSpellChecker,field=lowerfilt,minQueryLength=3}
[junit4:junit4]   2> 2123 T321 oashc.HttpShardHandlerFactory.getParameter Setting socketTimeout to: 0
[junit4:junit4]   2> 2124 T321 oashc.HttpShardHandlerFactory.getParameter Setting urlScheme to: http://
[junit4:junit4]   2> 2124 T321 oashc.HttpShardHandlerFactory.getParameter Setting connTimeout to: 0
[junit4:junit4]   2> 2124 T321 oashc.HttpShardHandlerFactory.getParameter Setting maxConnectionsPerHost to: 20
[junit4:junit4]   2> 2124 T321 oashc.HttpShardHandlerFactory.getParameter Setting corePoolSize to: 0
[junit4:junit4]   2> 2125 T321 oashc.HttpShardHandlerFactory.getParameter Setting maximumPoolSize to: 2147483647
[junit4:junit4]   2> 2125 T321 oashc.HttpShardHandlerFactory.getParameter Setting maxThreadIdleTime to: 5
[junit4:junit4]   2> 2125 T321 oashc.HttpShardHandlerFactory.getParameter Setting sizeOfQueue to: -1
[junit4:junit4]   2> 2125 T321 oashc.HttpShardHandlerFactory.getParameter Setting fairnessPolicy to: false
[junit4:junit4]   2> 2126 T321 oascsi.HttpClientUtil.createClient Creating new http client, config:maxConnectionsPerHost=20&maxConnections=10000&socketTimeout=0&connTimeout=0&retry=false
[junit4:junit4]   2> 2141 T336 oasc.SolrCore.registerSearcher [collection1] Registered new searcher Searcher@11c9a329 main{StandardDirectoryReader(segments_1:1)}
[junit4:junit4]   2> 2144 T321 oasc.CoreContainer.register registering core: collection1
[junit4:junit4]   2> 2145 T321 oass.SolrDispatchFilter.init user.dir=/usr/home/hudson/hudson-slave/workspace/Lucene-Solr-Tests-4.x-java7/solr/build/solr-core/test/J1
[junit4:junit4]   2> 2145 T321 oass.SolrDispatchFilter.init SolrDispatchFilter.init() done
[junit4:junit4]   2> 2145 T321 oas.SolrJettyTestBase.createJetty Jetty Assigned Port#63066
[junit4:junit4]   2> 2151 T321 oas.SolrTestCaseJ4.setUp ###Starting testQtUpdateFails
[junit4:junit4]   2> 2209 T321 oascsi.HttpClientUtil.createClient Creating new http client, config:maxConnections=128&maxConnectionsPerHost=32&followRedirects=false
[junit4:junit4]   2> ASYNC  NEW_CORE C29 name=collection1 org.apache.solr.core.SolrCore@3e5d2347
[junit4:junit4]   2> 3090 T334 C29 oasc.SolrDeletionPolicy.onInit SolrDeletionPolicy.onInit: commits:num=1
[junit4:junit4]   2> 		commit{dir=MockDirWrapper(org.apache.lucene.store.RAMDirectory@257938cb lockFactory=org.apache.lucene.store.NativeFSLockFactory@6c9c5420),segFN=segments_1,generation=1,filenames=[segments_1]
[junit4:junit4]   2> 3091 T334 C29 oasc.SolrDeletionPolicy.updateCommits newest commit = 1
[junit4:junit4]   2> 3098 T334 C29 UPDATE [collection1] webapp=/solr path=/update params={wt=javabin&version=2} {add=[1234]} 0 17
[junit4:junit4]   2> 3228 T335 C29 oasu.DirectUpdateHandler2.commit start commit{flags=0,_version_=0,optimize=false,openSearcher=true,waitSearcher=true,expungeDeletes=false,softCommit=false}
[junit4:junit4]   2> 3232 T335 C29 oasc.SolrDeletionPolicy.onCommit SolrDeletionPolicy.onCommit: commits:num=2
[junit4:junit4]   2> 		commit{dir=MockDirWrapper(org.apache.lucene.store.RAMDirectory@257938cb lockFactory=org.apache.lucene.store.NativeFSLockFactory@6c9c5420),segFN=segments_1,generation=1,filenames=[segments_1]
[junit4:junit4]   2> 		commit{dir=MockDirWrapper(org.apache.lucene.store.RAMDirectory@257938cb lockFactory=org.apache.lucene.store.NativeFSLockFactory@6c9c5420),segFN=segments_2,generation=2,filenames=[_0_4.len, _0_1.len, _0_3.len, _0_5.len, segments_2, _0.inf, _0.si, _0.pst, _0.fld]
[junit4:junit4]   2> 3232 T335 C29 oasc.SolrDeletionPolicy.updateCommits newest commit = 2
[junit4:junit4]   2> 3237 T335 C29 oass.SolrIndexSearcher.<init> Opening Searcher@704c8f74 main
[junit4:junit4]   2> 3238 T335 C29 oass.SolrIndexSearcher.getIndexDir WARNING WARNING: Directory impl does not support setting indexDir: org.apache.lucene.store.MockDirectoryWrapper
[junit4:junit4]   2> 3238 T335 C29 oasu.DirectUpdateHandler2.commit end_commit_flush
[junit4:junit4]   2> 3240 T336 oasc.SolrCore.registerSearcher [collection1] Registered new searcher Searcher@704c8f74 main{StandardDirectoryReader(segments_2:3 _0(4.1):C1)}
[junit4:junit4]   2> 3240 T335 C29 UPDATE [collection1] webapp=/solr path=/update params={waitSearcher=true&wt=javabin&commit=true&softCommit=false&version=2} {commit=} 0 12
[junit4:junit4]   2> 3300 T333 C29 REQ [collection1] webapp=/solr path=/select params={wt=javabin&q=id:1234&version=2} hits=1 status=0 QTime=36 
[junit4:junit4]   2> 3308 T321 oas.SolrTestCaseJ4.tearDown ###Ending testQtUpdateFails
[junit4:junit4]   2> 3314 T321 oas.SolrTestCaseJ4.setUp ###Starting testMakeDeleteAllUrl
[junit4:junit4]   2> 3319 T335 C29 UPDATE [collection1] webapp=/solr path=/update params={wt=javabin&version=2} {add=[1234]} 0 2
[junit4:junit4]   2> 3322 T333 C29 oasu.DirectUpdateHandler2.commit start commit{flags=0,_version_=0,optimize=false,openSearcher=true,waitSearcher=true,expungeDeletes=false,softCommit=false}
[junit4:junit4]   2> 3331 T333 C29 oasc.SolrDeletionPolicy.onCommit SolrDeletionPolicy.onCommit: commits:num=2
[junit4:junit4]   2> 		commit{dir=MockDirWrapper(org.apache.lucene.store.RAMDirectory@257938cb lockFactory=org.apache.lucene.store.NativeFSLockFactory@6c9c5420),segFN=segments_2,generation=2,filenames=[_0_4.len, _0_1.len, _0_3.len, _0_5.len, segments_2, _0.inf, _0.si, _0.pst, _0.fld]
[junit4:junit4]   2> 		commit{dir=MockDirWrapper(org.apache.lucene.store.RAMDirectory@257938cb lockFactory=org.apache.lucene.store.NativeFSLockFactory@6c9c5420),segFN=segments_3,generation=3,filenames=[_1_1.len, _1.pst, _1.fld, _1_3.len, _1.si, _1.inf, _1_4.len, _1_5.len, segments_3]
[junit4:junit4]   2> 3331 T333 C29 oasc.SolrDeletionPolicy.updateCommits newest commit = 3
[junit4:junit4]   2> 3333 T333 C29 oass.SolrIndexSearcher.<init> Opening Searcher@39a24033 main
[junit4:junit4]   2> 3333 T333 C29 oass.SolrIndexSearcher.getIndexDir WARNING WARNING: Directory impl does not support setting indexDir: org.apache.lucene.store.MockDirectoryWrapper
[junit4:junit4]   2> 3333 T333 C29 oasu.DirectUpdateHandler2.commit end_commit_flush
[junit4:junit4]   2> 3335 T336 oasc.SolrCore.registerSearcher [collection1] Registered new searcher Searcher@39a24033 main{StandardDirectoryReader(segments_3:7 _1(4.1):C1)}
[junit4:junit4]   2> 3335 T333 C29 UPDATE [collection1] webapp=/solr path=/update params={waitSearcher=true&wt=javabin&commit=true&softCommit=false&version=2} {commit=} 0 14
[junit4:junit4]   2> 3339 T334 C29 REQ [collection1] webapp=/solr path=/select params={wt=javabin&q=id:1234&version=2} hits=1 status=0 QTime=1 
[junit4:junit4]   2> 3347 T333 C29 oasu.DirectUpdateHandler2.deleteAll [collection1] REMOVING ALL DOCUMENTS FROM INDEX
[junit4:junit4]   2> 3348 T333 C29 oasu.DirectUpdateHandler2.commit start commit{flags=0,_version_=0,optimize=false,openSearcher=true,waitSearcher=true,expungeDeletes=false,softCommit=false}
[junit4:junit4]   2> 3348 T333 C29 oasc.SolrDeletionPolicy.onCommit SolrDeletionPolicy.onCommit: commits:num=2
[junit4:junit4]   2> 		commit{dir=MockDirWrapper(org.apache.lucene.store.RAMDirectory@257938cb lockFactory=org.apache.lucene.store.NativeFSLockFactory@6c9c5420),segFN=segments_3,generation=3,filenames=[_1_1.len, _1.pst, _1.fld, _1_3.len, _1.si, _1.inf, _1_4.len, _1_5.len, segments_3]
[junit4:junit4]   2> 		commit{dir=MockDirWrapper(org.apache.lucene.store.RAMDirectory@257938cb lockFactory=org.apache.lucene.store.NativeFSLockFactory@6c9c5420),segFN=segments_4,generation=4,filenames=[segments_4]
[junit4:junit4]   2> 3348 T333 C29 oasc.SolrDeletionPolicy.updateCommits newest commit = 4
[junit4:junit4]   2> 3349 T333 C29 oass.SolrIndexSearcher.<init> Opening Searcher@541eae08 main
[junit4:junit4]   2> 3349 T333 C29 oass.SolrIndexSearcher.getIndexDir WARNING WARNING: Directory impl does not support setting indexDir: org.apache.lucene.store.MockDirectoryWrapper
[junit4:junit4]   2> 3350 T333 C29 oasu.DirectUpdateHandler2.commit end_commit_flush
[junit4:junit4]   2> 3351 T336 oasc.SolrCore.registerSearcher [collection1] Registered new searcher Searcher@541eae08 main{StandardDirectoryReader(segments_4:8)}
[junit4:junit4]   2> 3351 T333 C29 UPDATE [collection1] webapp=/solr path=/update params={commit=true&stream.body=<delete><query>*:*</query></delete>} {deleteByQuery=*:*,commit=} 0 4
[junit4:junit4]   2> 3365 T334 C29 REQ [collection1] webapp=/solr path=/select params={wt=javabin&q=id:1234&version=2} hits=0 status=0 QTime=1 
[junit4:junit4]   2> 3366 T321 oas.SolrTestCaseJ4.tearDown ###Ending testMakeDeleteAllUrl
[junit4:junit4]   2> 3372 T321 oas.SolrTestCaseJ4.setUp ###Starting testNoUrlAccess
[junit4:junit4]   2> 3377 T333 C29 UPDATE [collection1] webapp=/solr path=/update params={wt=javabin&version=2} {add=[1234]} 0 1
[junit4:junit4]   2> 3381 T335 C29 oasu.DirectUpdateHandler2.commit start commit{flags=0,_version_=0,optimize=false,openSearcher=true,waitSearcher=true,expungeDeletes=false,softCommit=false}
[junit4:junit4]   2> 3383 T335 C29 oasc.SolrDeletionPolicy.onCommit SolrDeletionPolicy.onCommit: commits:num=2
[junit4:junit4]   2> 		commit{dir=MockDirWrapper(org.apache.lucene.store.RAMDirectory@257938cb lockFactory=org.apache.lucene.store.NativeFSLockFactory@6c9c5420),segFN=segments_4,generation=4,filenames=[segments_4]
[junit4:junit4]   2> 		commit{dir=MockDirWrapper(org.apache.lucene.store.RAMDirectory@257938cb lockFactory=org.apache.lucene.store.NativeFSLockFactory@6c9c5420),segFN=segments_5,generation=5,filenames=[_2.si, _2.pst, _2.fld, _2_5.len, _2.inf, _2_3.len, segments_5, _2_1.len, _2_4.len]
[junit4:junit4]   2> 3384 T335 C29 oasc.SolrDeletionPolicy.updateCommits newest commit = 5
[junit4:junit4]   2> 3436 T335 C29 oass.SolrIndexSearcher.<init> Opening Searcher@e71d24c main
[junit4:junit4]   2> 3436 T335 C29 oass.SolrIndexSearcher.getIndexDir WARNING WARNING: Directory impl does not support setting indexDir: org.apache.lucene.store.MockDirectoryWrapper
[junit4:junit4]   2> 3437 T335 C29 oasu.DirectUpdateHandler2.commit end_commit_flush
[junit4:junit4]   2> 3439 T336 oasc.SolrCore.registerSearcher [collection1] Registered new searcher Searcher@e71d24c main{StandardDirectoryReader(segments_5:10 _2(4.1):C1)}
[junit4:junit4]   2> 3439 T335 C29 UPDATE [collection1] webapp=/solr path=/update params={waitSearcher=true&wt=javabin&commit=true&softCommit=false&version=2} {commit=} 0 58
[junit4:junit4]   2> 3443 T333 C29 REQ [collection1] webapp=/solr path=/select params={wt=javabin&q=id:1234&version=2} hits=1 status=0 QTime=1 
[junit4:junit4]   2> 3448 T335 C29 REQ [collection1] webapp=/solr path=/select params={wt=javabin&stream.url=http://127.0.0.1:63066/solr/update?commit%3Dtrue%26stream.body%3D%253Cdelete%253E%253Cquery%253E*%253A*%253C%252Fquery%253E%253C%252Fdelete%253E&q=*:*&version=2} hits=1 status=0 QTime=0 
[junit4:junit4]   2> 3451 T334 C29 REQ [collection1] webapp=/solr path=/select params={wt=javabin&q=id:1234&version=2} hits=1 status=0 QTime=0 
[junit4:junit4]   2> 3452 T321 oas.SolrTestCaseJ4.tearDown ###Ending testNoUrlAccess
[junit4:junit4]   2> 3458 T321 oas.SolrTestCaseJ4.setUp ###Starting testStreamUrl
[junit4:junit4]   2> 3461 T333 C29 UPDATE [collection1] webapp=/solr path=/update params={wt=javabin&version=2} {add=[1234]} 0 1
[junit4:junit4]   2> 3465 T335 C29 oasu.DirectUpdateHandler2.commit start commit{flags=0,_version_=0,optimize=false,openSearcher=true,waitSearcher=true,expungeDeletes=false,softCommit=false}
[junit4:junit4]   2> 3519 T335 C29 oasc.SolrDeletionPolicy.onCommit SolrDeletionPolicy.onCommit: commits:num=2
[junit4:junit4]   2> 		commit{dir=MockDirWrapper(org.apache.lucene.store.RAMDirectory@257938cb lockFactory=org.apache.lucene.store.NativeFSLockFactory@6c9c5420),segFN=segments_5,generation=5,filenames=[_2.si, _2.pst, _2.fld, _2_5.len, _2.inf, _2_3.len, segments_5, _2_1.len, _2_4.len]
[junit4:junit4]   2> 		commit{dir=MockDirWrapper(org.apache.lucene.store.RAMDirectory@257938cb lockFactory=org.apache.lucene.store.NativeFSLockFactory@6c9c5420),segFN=segments_6,generation=6,filenames=[_3.fld, _3.inf, _3_5.len, _3_4.len, _3.si, _3_3.len, segments_6, _3.pst, _3_1.len]
[junit4:junit4]   2> 3519 T335 C29 oasc.SolrDeletionPolicy.updateCommits newest commit = 6
[junit4:junit4]   2> 3521 T335 C29 oass.SolrIndexSearcher.<init> Opening Searcher@3f28ad90 main
[junit4:junit4]   2> 3521 T335 C29 oass.SolrIndexSearcher.getIndexDir WARNING WARNING: Directory impl does not support setting indexDir: org.apache.lucene.store.MockDirectoryWrapper
[junit4:junit4]   2> 3521 T335 C29 oasu.DirectUpdateHandler2.commit end_commit_flush
[junit4:junit4]   2> 3523 T336 oasc.SolrCore.registerSearcher [collection1] Registered new searcher Searcher@3f28ad90 main{StandardDirectoryReader(segments_6:14 _3(4.1):C1)}
[junit4:junit4]   2> 3524 T335 C29 UPDATE [collection1] webapp=/solr path=/update params={waitSearcher=true&wt=javabin&commit=true&softCommit=false&version=2} {commit=} 0 59
[junit4:junit4]   2> 3527 T334 C29 REQ [collection1] webapp=/solr path=/select params={wt=javabin&q=id:1234&version=2} hits=1 status=0 QTime=1 
[junit4:junit4]   2> 3532 T335 C29 REQ [collection1] webapp=/solr path=/select params={wt=csv&q=*:*&fl=id} hits=1 status=0 QTime=1 
[junit4:junit4]   2> 3553 T333 C29 REQ [collection1] webapp=/solr path=/debug/dump params={wt=xml&stream.url=http://127.0.0.1:63066/solr/select?q%3D*:*%26fl%3Did%26wt%3Dcsv} status=0 QTime=24 
[junit4:junit4]   2> 3554 T321 oas.SolrTestCaseJ4.tearDown ###Ending testStreamUrl
[junit4:junit4]   2> 3601 T321 oasc.CoreContainer.shutdown Shutting down CoreContainer instance=601419896
[junit4:junit4]   2> 3601 T321 oasc.SolrCore.close [collection1]  CLOSING SolrCore org.apache.solr.core.SolrCore@3e5d2347
[junit4:junit4]   2> 3611 T321 oasu.DirectUpdateHandler2.close closing DirectUpdateHandler2{commits=5,autocommits=0,soft autocommits=0,optimizes=0,rollbacks=0,expungeDeletes=0,docsPending=0,adds=0,deletesById=0,deletesByQuery=0,errors=0,cumulative_adds=4,cumulative_deletesById=0,cumulative_deletesByQuery=1,cumulative_errors=0}
[junit4:junit4]   2> 3611 T321 oasc.SolrCore.decrefSolrCoreState Closing SolrCoreState
[junit4:junit4]   2> 3612 T321 oasu.DefaultSolrCoreState.closeIndexWriter SolrCoreState ref count has reached 0 - closing IndexWriter
[junit4:junit4]   2> 3612 T321 oasu.DefaultSolrCoreState.closeIndexWriter closing IndexWriter with IndexWriterCloser
[junit4:junit4]   2> 3613 T321 oasc.SolrCore.closeSearcher [collection1] Closing main searcher on request.
[junit4:junit4]   2> 3634 T321 oejsh.ContextHandler.doStop stopped o.e.j.s.ServletContextHandler{/solr,null}
[junit4:junit4]   2> 3736 T321 oejut.QueuedThreadPool.doStop WARNING 4 threads could not be stopped
[junit4:junit4]   2> 3736 T321 oas.SolrTestCaseJ4.deleteCore ###deleteCore
[junit4:junit4]   2> 3772 T320 ccr.ThreadLeakControl.checkThreadLeaks WARNING Will linger awaiting termination of 4 leaked thread(s).
[junit4:junit4]   2> 23927 T320 ccr.ThreadLeakControl.checkThreadLeaks SEVERE 4 threads leaked from SUITE scope at org.apache.solr.request.TestRemoteStreaming: 
[junit4:junit4]   2> 	   1) Thread[id=329, name=qtp651274847-329 Acceptor1 SelectChannelConnector@0.0.0.0:?????, state=BLOCKED, group=TGRP-TestRemoteStreaming]
[junit4:junit4]   2> 	        at sun.nio.ch.ServerSocketChannelImpl.accept(ServerSocketChannelImpl.java:210)
[junit4:junit4]   2> 	        at org.eclipse.jetty.server.nio.SelectChannelConnector.accept(SelectChannelConnector.java:104)
[junit4:junit4]   2> 	        at org.eclipse.jetty.server.AbstractConnector$Acceptor.run(AbstractConnector.java:933)
[junit4:junit4]   2> 	        at org.eclipse.jetty.util.thread.QueuedThreadPool.runJob(QueuedThreadPool.java:599)
[junit4:junit4]   2> 	        at org.eclipse.jetty.util.thread.QueuedThreadPool$3.run(QueuedThreadPool.java:534)
[junit4:junit4]   2> 	        at java.lang.Thread.run(Thread.java:722)
[junit4:junit4]   2> 	   2) Thread[id=331, name=qtp651274847-331 Acceptor3 SelectChannelConnector@0.0.0.0:?????, state=RUNNABLE, group=TGRP-TestRemoteStreaming]
[junit4:junit4]   2> 	        at sun.nio.ch.ServerSocketChannelImpl.accept0(Native Method)
[junit4:junit4]   2> 	        at sun.nio.ch.ServerSocketChannelImpl.accept(ServerSocketChannelImpl.java:226)
[junit4:junit4]   2> 	        at org.eclipse.jetty.server.nio.SelectChannelConnector.accept(SelectChannelConnector.java:104)
[junit4:junit4]   2> 	        at org.eclipse.jetty.server.AbstractConnector$Acceptor.run(AbstractConnector.java:933)
[junit4:junit4]   2> 	        at org.eclipse.jetty.util.thread.QueuedThreadPool.runJob(QueuedThreadPool.java:599)
[junit4:junit4]   2> 	        at org.eclipse.jetty.util.thread.QueuedThreadPool$3.run(QueuedThreadPool.java:534)
[junit4:junit4]   2> 	        at java.lang.Thread.run(Thread.java:722)
[junit4:junit4]   2> 	   3) Thread[id=330, name=qtp651274847-330 Acceptor2 SelectChannelConnector@0.0.0.0:?????, state=BLOCKED, group=TGRP-TestRemoteStreaming]
[junit4:junit4]   2> 	        at sun.nio.ch.ServerSocketChannelImpl.accept(ServerSocketChannelImpl.java:210)
[junit4:junit4]   2> 	        at org.eclipse.jetty.server.nio.SelectChannelConnector.accept(SelectChannelConnector.java:104)
[junit4:junit4]   2> 	        at org.eclipse.jetty.server.AbstractConnector$Acceptor.run(AbstractConnector.java:933)
[junit4:junit4]   2> 	        at org.eclipse.jetty.util.thread.QueuedThreadPool.runJob(QueuedThreadPool.java:599)
[junit4:junit4]   2> 	        at org.eclipse.jetty.util.thread.QueuedThreadPool$3.run(QueuedThreadPool.java:534)
[junit4:junit4]   2> 	        at java.lang.Thread.run(Thread.java:722)
[junit4:junit4]   2> 	   4) Thread[id=328, name=qtp651274847-328 Acceptor0 SelectChannelConnector@0.0.0.0:?????, state=BLOCKED, group=TGRP-TestRemoteStreaming]
[junit4:junit4]   2> 	        at sun.nio.ch.ServerSocketChannelImpl.accept(ServerSocketChannelImpl.java:210)
[junit4:junit4]   2> 	        at org.eclipse.jetty.server.nio.SelectChannelConnector.accept(SelectChannelConnector.java:104)
[junit4:junit4]   2> 	        at org.eclipse.jetty.server.AbstractConnector$Acceptor.run(AbstractConnector.java:933)
[junit4:junit4]   2> 	        at org.eclipse.jetty.util.thread.QueuedThreadPool.runJob(QueuedThreadPool.java:599)
[junit4:junit4]   2> 	        at org.eclipse.jetty.util.thread.QueuedThreadPool$3.run(QueuedThreadPool.java:534)
[junit4:junit4]   2> 	        at java.lang.Thread.run(Thread.java:722)
[junit4:junit4]   2> 23928 T320 ccr.ThreadLeakControl.tryToInterruptAll Starting to interrupt leaked threads:
[junit4:junit4]   2> 	   1) Thread[id=329, name=qtp651274847-329 Acceptor1 SelectChannelConnector@0.0.0.0:?????, state=BLOCKED, group=TGRP-TestRemoteStreaming]
[junit4:junit4]   2> 	   2) Thread[id=331, name=qtp651274847-331 Acceptor3 SelectChannelConnector@0.0.0.0:?????, state=RUNNABLE, group=TGRP-TestRemoteStreaming]
[junit4:junit4]   2> 	   3) Thread[id=330, name=qtp651274847-330 Acceptor2 SelectChannelConnector@0.0.0.0:?????, state=BLOCKED, group=TGRP-TestRemoteStreaming]
[junit4:junit4]   2> 	   4) Thread[id=328, name=qtp651274847-328 Acceptor0 SelectChannelConnector@0.0.0.0:?????, state=BLOCKED, group=TGRP-TestRemoteStreaming]
[junit4:junit4]   2> 26971 T320 ccr.ThreadLeakControl.tryToInterruptAll SEVERE There are still zombie threads that couldn't be terminated:
[junit4:junit4]   2> 	   1) Thread[id=329, name=qtp651274847-329 Acceptor1 SelectChannelConnector@0.0.0.0:?????, state=BLOCKED, group=TGRP-TestRemoteStreaming]
[junit4:junit4]   2> 	        at sun.nio.ch.ServerSocketChannelImpl.accept(ServerSocketChannelImpl.java:210)
[junit4:junit4]   2> 	        at org.eclipse.jetty.server.nio.SelectChannelConnector.accept(SelectChannelConnector.java:104)
[junit4:junit4]   2> 	        at org.eclipse.jetty.server.AbstractConnector$Acceptor.run(AbstractConnector.java:933)
[junit4:junit4]   2> 	        at org.eclipse.jetty.util.thread.QueuedThreadPool.runJob(QueuedThreadPool.java:599)
[junit4:junit4]   2> 	        at org.eclipse.jetty.util.thread.QueuedThreadPool$3.run(QueuedThreadPool.java:534)
[junit4:junit4]   2> 	        at java.lang.Thread.run(Thread.java:722)
[junit4:junit4]   2> 	   2) Thread[id=331, name=qtp651274847-331 Acceptor3 SelectChannelConnector@0.0.0.0:?????, state=RUNNABLE, group=TGRP-TestRemoteStreaming]
[junit4:junit4]   2> 	        at sun.nio.ch.ServerSocketChannelImpl.accept0(Native Method)
[junit4:junit4]   2> 	        at sun.nio.ch.ServerSocketChannelImpl.accept(ServerSocketChannelImpl.java:226)
[junit4:junit4]   2> 	        at org.eclipse.jetty.server.nio.SelectChannelConnector.accept(SelectChannelConnector.java:104)
[junit4:junit4]   2> 	        at org.eclipse.jetty.server.AbstractConnector$Acceptor.run(AbstractConnector.java:933)
[junit4:junit4]   2> 	        at org.eclipse.jetty.util.thread.QueuedThreadPool.runJob(QueuedThreadPool.java:599)
[junit4:junit4]   2> 	        at org.eclipse.jetty.util.thread.QueuedThreadPool$3.run(QueuedThreadPool.java:534)
[junit4:junit4]   2> 	        at java.lang.Thread.run(Thread.java:722)
[junit4:junit4]   2> 	   3) Thread[id=330, name=qtp651274847-330 Acceptor2 SelectChannelConnector@0.0.0.0:?????, state=BLOCKED, group=TGRP-TestRemoteStreaming]
[junit4:junit4]   2> 	        at sun.nio.ch.ServerSocketChannelImpl.accept(ServerSocketChannelImpl.java:210)
[junit4:junit4]   2> 	        at org.eclipse.jetty.server.nio.SelectChannelConnector.accept(SelectChannelConnector.java:104)
[junit4:junit4]   2> 	        at org.eclipse.jetty.server.AbstractConnector$Acceptor.run(AbstractConnector.java:933)
[junit4:junit4]   2> 	        at org.eclipse.jetty.util.thread.QueuedThreadPool.runJob(QueuedThreadPool.java:599)
[junit4:junit4]   2> 	        at org.eclipse.jetty.util.thread.QueuedThreadPool$3.run(QueuedThreadPool.java:534)
[junit4:junit4]   2> 	        at java.lang.Thread.run(Thread.java:722)
[junit4:junit4]   2> 	   4) Thread[id=328, name=qtp651274847-328 Acceptor0 SelectChannelConnector@0.0.0.0:?????, state=BLOCKED, group=TGRP-TestRemoteStreaming]
[junit4:junit4]   2> 	        at sun.nio.ch.ServerSocketChannelImpl.accept(ServerSocketChannelImpl.java:210)
[junit4:junit4]   2> 	        at org.eclipse.jetty.server.nio.SelectChannelConnector.accept(SelectChannelConnector.java:104)
[junit4:junit4]   2> 	        at org.eclipse.jetty.server.AbstractConnector$Acceptor.run(AbstractConnector.java:933)
[junit4:junit4]   2> 	        at org.eclipse.jetty.util.thread.QueuedThreadPool.runJob(QueuedThreadPool.java:599)
[junit4:junit4]   2> 	        at org.eclipse.jetty.util.thread.QueuedThreadPool$3.run(QueuedThreadPool.java:534)
[junit4:junit4]   2> 	        at java.lang.Thread.run(Thread.java:722)
[junit4:junit4]   2> NOTE: test params are: codec=SimpleText, sim=DefaultSimilarity, locale=hi_IN, timezone=Canada/Yukon
[junit4:junit4]   2> NOTE: FreeBSD 9.0-RELEASE amd64/Oracle Corporation 1.7.0_09 (64-bit)/cpus=16,threads=5,free=204122560,total=394264576
[junit4:junit4]   2> NOTE: All tests run in this JVM: [SolrInfoMBeanTest, StandardRequestHandlerTest, TestUtils, TestCharFilters, TestBM25SimilarityFactory, TestSurroundQueryParser, TestStressVersions, DocumentAnalysisRequestHandlerTest, DebugComponentTest, TestRealTimeGet, TestFastOutputStream, PrimitiveFieldTypeTest, TestCodecSupport, TestUpdate, TestPropInject, TestRecovery, TestJmxIntegration, XmlUpdateRequestHandlerTest, TestFunctionQuery, ZkCLITest, TermVectorComponentTest, MultiTermTest, EchoParamsTest, SolrCoreTest, TestRemoteStreaming]
[junit4:junit4]   2> NOTE: reproduce with: ant test  -Dtestcase=TestRemoteStreaming -Dtests.seed=C6F54FC7A3B9989F -Dtests.multiplier=3 -Dtests.slow=true -Dtests.locale=hi_IN -Dtests.timezone=Canada/Yukon -Dtests.file.encoding=US-ASCII
[junit4:junit4] ERROR   0.00s J1 | TestRemoteStreaming (suite) <<<
[junit4:junit4]    > Throwable #1: com.carrotsearch.randomizedtesting.ThreadLeakError: 4 threads leaked from SUITE scope at org.apache.solr.request.TestRemoteStreaming: 
[junit4:junit4]    >    1) Thread[id=329, name=qtp651274847-329 Acceptor1 SelectChannelConnector@0.0.0.0:?????, state=BLOCKED, group=TGRP-TestRemoteStreaming]
[junit4:junit4]    >         at sun.nio.ch.ServerSocketChannelImpl.accept(ServerSocketChannelImpl.java:210)
[junit4:junit4]    >         at org.eclipse.jetty.server.nio.SelectChannelConnector.accept(SelectChannelConnector.java:104)
[junit4:junit4]    >         at org.eclipse.jetty.server.AbstractConnector$Acceptor.run(AbstractConnector.java:933)
[junit4:junit4]    >         at org.eclipse.jetty.util.thread.QueuedThreadPool.runJob(QueuedThreadPool.java:599)
[junit4:junit4]    >         at org.eclipse.jetty.util.thread.QueuedThreadPool$3.run(QueuedThreadPool.java:534)
[junit4:junit4]    >         at java.lang.Thread.run(Thread.java:722)
[junit4:junit4]    >    2) Thread[id=331, name=qtp651274847-331 Acceptor3 SelectChannelConnector@0.0.0.0:?????, state=RUNNABLE, group=TGRP-TestRemoteStreaming]
[junit4:junit4]    >         at sun.nio.ch.ServerSocketChannelImpl.accept0(Native Method)
[junit4:junit4]    >         at sun.nio.ch.ServerSocketChannelImpl.accept(ServerSocketChannelImpl.java:226)
[junit4:junit4]    >         at org.eclipse.jetty.server.nio.SelectChannelConnector.accept(SelectChannelConnector.java:104)
[junit4:junit4]    >         at org.eclipse.jetty.server.AbstractConnector$Acceptor.run(AbstractConnector.java:933)
[junit4:junit4]    >         at org.eclipse.jetty.util.thread.QueuedThreadPool.runJob(QueuedThreadPool.java:599)
[junit4:junit4]    >         at org.eclipse.jetty.util.thread.QueuedThreadPool$3.run(QueuedThreadPool.java:534)
[junit4:junit4]    >         at java.lang.Thread.run(Thread.java:722)
[junit4:junit4]    >    3) Thread[id=330, name=qtp651274847-330 Acceptor2 SelectChannelConnector@0.0.0.0:?????, state=BLOCKED, group=TGRP-TestRemoteStreaming]
[junit4:junit4]    >         at sun.nio.ch.ServerSocketChannelImpl.accept(ServerSocketChannelImpl.java:210)
[junit4:junit4]    >         at org.eclipse.jetty.server.nio.SelectChannelConnector.accept(SelectChannelConnector.java:104)
[junit4:junit4]    >         at org.eclipse.jetty.server.AbstractConnector$Acceptor.run(AbstractConnector.java:933)
[junit4:junit4]    >         at org.eclipse.jetty.util.thread.QueuedThreadPool.runJob(QueuedThreadPool.java:599)
[junit4:junit4]    >         at org.eclipse.jetty.util.thread.QueuedThreadPool$3.run(QueuedThreadPool.java:534)
[junit4:junit4]    >         at java.lang.Thread.run(Thread.java:722)
[junit4:junit4]    >    4) Thread[id=328, name=qtp651274847-328 Acceptor0 SelectChannelConnector@0.0.0.0:?????, state=BLOCKED, group=TGRP-TestRemoteStreaming]
[junit4:junit4]    >         at sun.nio.ch.ServerSocketChannelImpl.accept(ServerSocketChannelImpl.java:210)
[junit4:junit4]    >         at org.eclipse.jetty.server.nio.SelectChannelConnector.accept(SelectChannelConnector.java:104)
[junit4:junit4]    >         at org.eclipse.jetty.server.AbstractConnector$Acceptor.run(AbstractConnector.java:933)
[junit4:junit4]    >         at org.eclipse.jetty.util.thread.QueuedThreadPool.runJob(QueuedThreadPool.java:599)
[junit4:junit4]    >         at org.eclipse.jetty.util.thread.QueuedThreadPool$3.run(QueuedThreadPool.java:534)
[junit4:junit4]    >         at java.lang.Thread.run(Thread.java:722)
[junit4:junit4]    > 	at __randomizedtesting.SeedInfo.seed([C6F54FC7A3B9989F]:0)
[junit4:junit4]    > Throwable #2: com.carrotsearch.randomizedtesting.ThreadLeakError: There are still zombie threads that couldn't be terminated:
[junit4:junit4]    >    1) Thread[id=329, name=qtp651274847-329 Acceptor1 SelectChannelConnector@0.0.0.0:?????, state=BLOCKED, group=TGRP-TestRemoteStreaming]
[junit4:junit4]    >         at sun.nio.ch.ServerSocketChannelImpl.accept(ServerSocketChannelImpl.java:210)
[junit4:junit4]    >         at org.eclipse.jetty.server.nio.SelectChannelConnector.accept(SelectChannelConnector.java:104)
[junit4:junit4]    >         at org.eclipse.jetty.server.AbstractConnector$Acceptor.run(AbstractConnector.java:933)
[junit4:junit4]    >         at org.eclipse.jetty.util.thread.QueuedThreadPool.runJob(QueuedThreadPool.java:599)
[junit4:junit4]    >         at org.eclipse.jetty.util.thread.QueuedThreadPool$3.run(QueuedThreadPool.java:534)
[junit4:junit4]    >         at java.lang.Thread.run(Thread.java:722)
[junit4:junit4]    >    2) Thread[id=331, name=qtp651274847-331 Acceptor3 SelectChannelConnector@0.0.0.0:?????, state=RUNNABLE, group=TGRP-TestRemoteStreaming]
[junit4:junit4]    >         at sun.nio.ch.ServerSocketChannelImpl.accept0(Native Method)
[junit4:junit4]    >         at sun.nio.ch.ServerSocketChannelImpl.accept(ServerSocketChannelImpl.java:226)
[junit4:junit4]    >         at org.eclipse.jetty.server.nio.SelectChannelConnector.accept(SelectChannelConnector.java:104)
[junit4:junit4]    >         at org.eclipse.jetty.server.AbstractConnector$Acceptor.run(AbstractConnector.java:933)
[junit4:junit4]    >         at org.eclipse.jetty.util.thread.QueuedThreadPool.runJob(QueuedThreadPool.java:599)
[junit4:junit4]    >         at org.eclipse.jetty.util.thread.QueuedThreadPool$3.run(QueuedThreadPool.java:534)
[junit4:junit4]    >         at java.lang.Thread.run(Thread.java:722)
[junit4:junit4]    >    3) Thread[id=330, name=qtp651274847-330 Acceptor2 SelectChannelConnector@0.0.0.0:?????, state=BLOCKED, group=TGRP-TestRemoteStreaming]
[junit4:junit4]    >         at sun.nio.ch.ServerSocketChannelImpl.accept(ServerSocketChannelImpl.java:210)
[junit4:junit4]    >         at org.eclipse.jetty.server.nio.SelectChannelConnector.accept(SelectChannelConnector.java:104)
[junit4:junit4]    >         at org.eclipse.jetty.server.AbstractConnector$Acceptor.run(AbstractConnector.java:933)
[junit4:junit4]    >         at org.eclipse.jetty.util.thread.QueuedThreadPool.runJob(QueuedThreadPool.java:599)
[junit4:junit4]    >         at org.eclipse.jetty.util.thread.QueuedThreadPool$3.run(QueuedThreadPool.java:534)
[junit4:junit4]    >         at java.lang.Thread.run(Thread.java:722)
[junit4:junit4]    >    4) Thread[id=328, name=qtp651274847-328 Acceptor0 SelectChannelConnector@0.0.0.0:?????, state=BLOCKED, group=TGRP-TestRemoteStreaming]
[junit4:junit4]    >         at sun.nio.ch.ServerSocketChannelImpl.accept(ServerSocketChannelImpl.java:210)
[junit4:junit4]    >         at org.eclipse.jetty.server.nio.SelectChannelConnector.accept(SelectChannelConnector.java:104)
[junit4:junit4]    >         at org.eclipse.jetty.server.AbstractConnector$Acceptor.run(AbstractConnector.java:933)
[junit4:junit4]    >         at org.eclipse.jetty.util.thread.QueuedThreadPool.runJob(QueuedThreadPool.java:599)
[junit4:junit4]    >         at org.eclipse.jetty.util.thread.QueuedThreadPool$3.run(QueuedThreadPool.java:534)
[junit4:junit4]    >         at java.lang.Thread.run(Thread.java:722)
[junit4:junit4]    > 	at __randomizedtesting.SeedInfo.seed([C6F54FC7A3B9989F]:0)
[junit4:junit4] Completed on J1 in 27.19s, 4 tests, 2 errors <<< FAILURES!

[...truncated 452 lines...]
[junit4:junit4] Suite: org.apache.solr.cloud.BasicDistributedZkTest
[junit4:junit4]   2> 4 T99 oas.SolrTestCaseJ4.setUp ###Starting testDistribSearch
[junit4:junit4]   2> Creating dataDir: /usr/home/hudson/hudson-slave/workspace/Lucene-Solr-Tests-4.x-java7/solr/build/solr-core/test/J0/./solrtest-BasicDistributedZkTest-1352218906704
[junit4:junit4]   2> 10 T99 oasc.ZkTestServer.run STARTING ZK TEST SERVER
[junit4:junit4]   2> 103 T100 oaz.Environment.logEnv Server environment:zookeeper.version=3.3.6-1366786, built on 07/29/2012 06:22 GMT
[junit4:junit4]   2> 104 T100 oaz.Environment.logEnv Server environment:host.name=lucene.zones.apache.org
[junit4:junit4]   2> 104 T100 oaz.Environment.logEnv Server environment:java.version=1.7.0_09
[junit4:junit4]   2> 104 T100 oaz.Environment.logEnv Server environment:java.vendor=Oracle Corporation
[junit4:junit4]   2> 104 T100 oaz.Environment.logEnv Server environment:java.home=/usr/local/openjdk7/jre
[junit4:junit4]   2> 104 T100 oaz.Environment.logEnv Server environment:java.class.path=/usr/home/hudson/hudson-slave/workspace/Lucene-Solr-Tests-4.x-java7/solr/build/solr-core/classes/test:/usr/home/hudson/hudson-slave/workspace/Lucene-Solr-Tests-4.x-java7/solr/build/solr-test-framework/classes/java:/usr/home/hudson/hudson-slave/workspace/Lucene-Solr-Tests-4.x-java7/solr/build/solr-core/test-files:/usr/home/hudson/hudson-slave/workspace/Lucene-Solr-Tests-4.x-java7/lucene/build/test-framework/classes/java:/usr/home/hudson/hudson-slave/workspace/Lucene-Solr-Tests-4.x-java7/lucene/build/codecs/classes/java:/usr/home/hudson/hudson-slave/workspace/Lucene-Solr-Tests-4.x-java7/solr/build/solr-solrj/classes/java:/usr/home/hudson/hudson-slave/workspace/Lucene-Solr-Tests-4.x-java7/solr/build/solr-core/classes/java:/usr/home/hudson/hudson-slave/workspace/Lucene-Solr-Tests-4.x-java7/lucene/build/analysis/common/lucene-analyzers-common-4.1-SNAPSHOT.jar:/usr/home/hudson/hudson-slave/workspace/Lucene-Solr-Tests-4.x-java7/lucene/build/analysis/kuromoji/lucene-analyzers-kuromoji-4.1-SNAPSHOT.jar:/usr/home/hudson/hudson-slave/workspace/Lucene-Solr-Tests-4.x-java7/lucene/build/analysis/phonetic/lucene-analyzers-phonetic-4.1-SNAPSHOT.jar:/usr/home/hudson/hudson-slave/workspace/Lucene-Solr-Tests-4.x-java7/lucene/build/highlighter/lucene-highlighter-4.1-SNAPSHOT.jar:/usr/home/hudson/hudson-slave/workspace/Lucene-Solr-Tests-4.x-java7/lucene/build/memory/lucene-memory-4.1-SNAPSHOT.jar:/usr/home/hudson/hudson-slave/workspace/Lucene-Solr-Tests-4.x-java7/lucene/build/misc/lucene-misc-4.1-SNAPSHOT.jar:/usr/home/hudson/hudson-slave/workspace/Lucene-Solr-Tests-4.x-java7/lucene/build/spatial/lucene-spatial-4.1-SNAPSHOT.jar:/usr/home/hudson/hudson-slave/workspace/Lucene-Solr-Tests-4.x-java7/lucene/build/suggest/lucene-suggest-4.1-SNAPSHOT.jar:/usr/home/hudson/hudson-slave/workspace/Lucene-Solr-Tests-4.x-java7/lucene/build/grouping/lucene-grouping-4.1-SNAPSHOT.jar:/usr/home/hudson/hudson-slave/workspace/Lucene-Solr-Tests-4.x-java7/lucene/build/queries/lucene-queries-4.1-SNAPSHOT.jar:/usr/home/hudson/hudson-slave/workspace/Lucene-Solr-Tests-4.x-java7/lucene/build/queryparser/lucene-queryparser-4.1-SNAPSHOT.jar:/usr/home/hudson/hudson-slave/workspace/Lucene-Solr-Tests-4.x-java7/solr/core/lib/commons-cli-1.2.jar:/usr/home/hudson/hudson-slave/workspace/Lucene-Solr-Tests-4.x-java7/solr/core/lib/commons-codec-1.7.jar:/usr/home/hudson/hudson-slave/workspace/Lucene-Solr-Tests-4.x-java7/solr/core/lib/commons-fileupload-1.2.1.jar:/usr/home/hudson/hudson-slave/workspace/Lucene-Solr-Tests-4.x-java7/solr/core/lib/commons-lang-2.6.jar:/usr/home/hudson/hudson-slave/workspace/Lucene-Solr-Tests-4.x-java7/solr/core/lib/easymock-2.2.jar:/usr/home/hudson/hudson-slave/workspace/Lucene-Solr-Tests-4.x-java7/solr/core/lib/guava-r05.jar:/usr/home/hudson/hudson-slave/workspace/Lucene-Solr-Tests-4.x-java7/solr/core/lib/javax.servlet-api-3.0.1.jar:/usr/home/hudson/hudson-slave/workspace/Lucene-Solr-Tests-4.x-java7/solr/core/lib/spatial4j-0.3.jar:/usr/home/hudson/hudson-slave/workspace/Lucene-Solr-Tests-4.x-java7/solr/solrj/lib/commons-io-2.1.jar:/usr/home/hudson/hudson-slave/workspace/Lucene-Solr-Tests-4.x-java7/solr/solrj/lib/httpclient-4.1.3.jar:/usr/home/hudson/hudson-slave/workspace/Lucene-Solr-Tests-4.x-java7/solr/solrj/lib/httpcore-4.1.4.jar:/usr/home/hudson/hudson-slave/workspace/Lucene-Solr-Tests-4.x-java7/solr/solrj/lib/httpmime-4.1.3.jar:/usr/home/hudson/hudson-slave/workspace/Lucene-Solr-Tests-4.x-java7/solr/solrj/lib/jcl-over-slf4j-1.6.4.jar:/usr/home/hudson/hudson-slave/workspace/Lucene-Solr-Tests-4.x-java7/solr/solrj/lib/log4j-over-slf4j-1.6.4.jar:/usr/home/hudson/hudson-slave/workspace/Lucene-Solr-Tests-4.x-java7/solr/solrj/lib/slf4j-api-1.6.4.jar:/usr/home/hudson/hudson-slave/workspace/Lucene-Solr-Tests-4.x-java7/solr/solrj/lib/slf4j-jdk14-1.6.4.jar:/usr/home/hudson/hudson-slave/workspace/Lucene-Solr-Tests-4.x-java7/solr/solrj/lib/wstx-asl-3.2.7.jar:/usr/home/hudson/hudson-slave/workspace/Lucene-Solr-Tests-4.x-java7/solr/solrj/lib/zookeeper-3.3.6.jar:/usr/home/hudson/hudson-slave/workspace/Lucene-Solr-Tests-4.x-java7/solr/example/lib/jetty-continuation-8.1.2.v20120308.jar:/usr/home/hudson/hudson-slave/workspace/Lucene-Solr-Tests-4.x-java7/solr/example/lib/jetty-deploy-8.1.2.v20120308.jar:/usr/home/hudson/hudson-slave/workspace/Lucene-Solr-Tests-4.x-java7/solr/example/lib/jetty-http-8.1.2.v20120308.jar:/usr/home/hudson/hudson-slave/workspace/Lucene-Solr-Tests-4.x-java7/solr/example/lib/jetty-io-8.1.2.v20120308.jar:/usr/home/hudson/hudson-slave/workspace/Lucene-Solr-Tests-4.x-java7/solr/example/lib/jetty-jmx-8.1.2.v20120308.jar:/usr/home/hudson/hudson-slave/workspace/Lucene-Solr-Tests-4.x-java7/solr/example/lib/jetty-security-8.1.2.v20120308.jar:/usr/home/hudson/hudson-slave/workspace/Lucene-Solr-Tests-4.x-java7/solr/example/lib/jetty-server-8.1.2.v20120308.jar:/usr/home/hudson/hudson-slave/workspace/Lucene-Solr-Tests-4.x-java7/solr/example/lib/jetty-servlet-8.1.2.v20120308.jar:/usr/home/hudson/hudson-slave/workspace/Lucene-Solr-Tests-4.x-java7/solr/example/lib/jetty-util-8.1.2.v20120308.jar:/usr/home/hudson/hudson-slave/workspace/Lucene-Solr-Tests-4.x-java7/solr/example/lib/jetty-webapp-8.1.2.v20120308.jar:/usr/home/hudson/hudson-slave/workspace/Lucene-Solr-Tests-4.x-java7/solr/example/lib/jetty-xml-8.1.2.v20120308.jar:/usr/home/hudson/hudson-slave/workspace/Lucene-Solr-Tests-4.x-java7/solr/example/lib/servlet-api-3.0.jar:/usr/home/hudson/hudson-slave/workspace/Lucene-Solr-Tests-4.x-java7/solr/example/example-DIH/solr/db/lib/hsqldb-1.8.0.10.jar:/usr/home/hudson/hudson-slave/workspace/Lucene-Solr-Tests-4.x-java7/lucene/build/core/classes/java:/usr/home/hudson/hudson-slave/workspace/Lucene-Solr-Tests-4.x-java7/lucene/test-framework/lib/junit-4.10.jar:/usr/home/hudson/hudson-slave/workspace/Lucene-Solr-Tests-4.x-java7/lucene/test-framework/lib/randomizedtesting-runner-2.0.4.jar:/home/hudson/hudson-slave/tools/Ant/ant-1.8.2/lib/ant-launcher.jar:/home/hudson/.ant/lib/ivy-2.2.0.jar:/home/hudson/hudson-slave/tools/Ant/ant-1.8.2/lib/ant-apache-regexp.jar:/home/hudson/hudson-slave/tools/Ant/ant-1.8.2/lib/ant-junit.jar:/home/hudson/hudson-slave/tools/Ant/ant-1.8.2/lib/ant-apache-bsf.jar:/home/hudson/hudson-slave/tools/Ant/ant-1.8.2/lib/ant-commons-net.jar:/home/hudson/hudson-slave/tools/Ant/ant-1.8.2/lib/ant-antlr.jar:/home/hudson/hudson-slave/tools/Ant/ant-1.8.2/lib/ant-apache-log4j.jar:/home/hudson/hudson-slave/tools/Ant/ant-1.8.2/lib/ant-commons-logging.jar:/home/hudson/hudson-slave/tools/Ant/ant-1.8.2/lib/ant-apache-xalan2.jar:/home/hudson/hudson-slave/tools/Ant/ant-1.8.2/lib/ant-apache-oro.jar:/home/hudson/hudson-slave/tools/Ant/ant-1.8.2/lib/ant-junit4.jar:/home/hudson/hudson-slave/tools/Ant/ant-1.8.2/lib/ant-netrexx.jar:/home/hudson/hudson-slave/tools/Ant/ant-1.8.2/lib/ant-swing.jar:/home/hudson/hudson-slave/tools/Ant/ant-1.8.2/lib/ant-javamail.jar:/home/hudson/hudson-slave/tools/Ant/ant-1.8.2/lib/ant-jsch.jar:/home/hudson/hudson-slave/tools/Ant/ant-1.8.2/lib/ant-jmf.jar:/home/hudson/hudson-slave/tools/Ant/ant-1.8.2/lib/ant.jar:/home/hudson/hudson-slave/tools/Ant/ant-1.8.2/lib/ant-apache-bcel.jar:/home/hudson/hudson-slave/tools/Ant/ant-1.8.2/lib/ant-jai.jar:/home/hudson/hudson-slave/tools/Ant/ant-1.8.2/lib/ant-testutil.jar:/home/hudson/hudson-slave/tools/Ant/ant-1.8.2/lib/ant-apache-resolver.jar:/home/hudson/hudson-slave/tools/Ant/ant-1.8.2/lib/ant-jdepend.jar:/usr/local/openjdk7/lib/tools.jar:/home/hudson/.ivy2/cache/com.carrotsearch.randomizedtesting/junit4-ant/jars/junit4-ant-2.0.4.jar
[junit4:junit4]   2> 105 T100 oaz.Environment.logEnv Server environment:java.library.path=/usr/local/openjdk7/jre/lib/amd64/server:/usr/local/openjdk7/jre/lib/amd64:/usr/local/openjdk7/jre/../lib/amd64:/usr/local/openjdk6/jre/lib/amd64/server:/usr/local/openjdk6/jre/lib/amd64:/usr/local/openjdk6/jre/../lib/amd64:/usr/java/packages/lib/amd64:/lib:/usr/lib:/usr/local/lib
[junit4:junit4]   2> 105 T100 oaz.Environment.logEnv Server environment:java.io.tmpdir=.
[junit4:junit4]   2> 106 T100 oaz.Environment.logEnv Server environment:java.compiler=<NA>
[junit4:junit4]   2> 106 T100 oaz.Environment.logEnv Server environment:os.name=FreeBSD
[junit4:junit4]   2> 106 T100 oaz.Environment.logEnv Server environment:os.arch=amd64
[junit4:junit4]   2> 106 T100 oaz.Environment.logEnv Server environment:os.version=9.0-RELEASE
[junit4:junit4]   2> 106 T100 oaz.Environment.logEnv Server environment:user.name=hudson
[junit4:junit4]   2> 106 T100 oaz.Environment.logEnv Server environment:user.home=/home/hudson
[junit4:junit4]   2> 107 T100 oaz.Environment.logEnv Server environment:user.dir=/usr/home/hudson/hudson-slave/workspace/Lucene-Solr-Tests-4.x-java7/solr/build/solr-core/test/J0
[junit4:junit4]   2> 143 T100 oazs.ZooKeeperServer.setTickTime tickTime set to 1000
[junit4:junit4]   2> 173 T100 oazs.NIOServerCnxn$Factory.<init> binding to port 0.0.0.0/0.0.0.0:0
[junit4:junit4]   2> 218 T99 oasc.ZkTestServer.run start zk server on port:64775
[junit4:junit4]   2> 236 T100 oazsp.FileTxnSnapLog.save Snapshotting: 0
[junit4:junit4]   2> 308 T99 oaz.Environment.logEnv Client environment:zookeeper.version=3.3.6-1366786, built on 07/29/2012 06:22 GMT
[junit4:junit4]   2> 308 T99 oaz.Environment.logEnv Client environment:host.name=lucene.zones.apache.org
[junit4:junit4]   2> 309 T99 oaz.Environment.logEnv Client environment:java.version=1.7.0_09
[junit4:junit4]   2> 309 T99 oaz.Environment.logEnv Client environment:java.vendor=Oracle Corporation
[junit4:junit4]   2> 309 T99 oaz.Environment.logEnv Client environment:java.home=/usr/local/openjdk7/jre
[junit4:junit4]   2> 310 T99 oaz.Environment.logEnv Client environment:java.class.path=/usr/home/hudson/hudson-slave/workspace/Lucene-Solr-Tests-4.x-java7/solr/build/solr-core/classes/test:/usr/home/hudson/hudson-slave/workspace/Lucene-Solr-Tests-4.x-java7/solr/build/solr-test-framework/classes/java:/usr/home/hudson/hudson-slave/workspace/Lucene-Solr-Tests-4.x-java7/solr/build/solr-core/test-files:/usr/home/hudson/hudson-slave/workspace/Lucene-Solr-Tests-4.x-java7/lucene/build/test-framework/classes/java:/usr/home/hudson/hudson-slave/workspace/Lucene-Solr-Tests-4.x-java7/lucene/build/codecs/classes/java:/usr/home/hudson/hudson-slave/workspace/Lucene-Solr-Tests-4.x-java7/solr/build/solr-solrj/classes/java:/usr/home/hudson/hudson-slave/workspace/Lucene-Solr-Tests-4.x-java7/solr/build/solr-core/classes/java:/usr/home/hudson/hudson-slave/workspace/Lucene-Solr-Tests-4.x-java7/lucene/build/analysis/common/lucene-analyzers-common-4.1-SNAPSHOT.jar:/usr/home/hudson/hudson-slave/workspace/Lucene-Solr-Tests-4.x-java7/lucene/build/analysis/kuromoji/lucene-analyzers-kuromoji-4.1-SNAPSHOT.jar:/usr/home/hudson/hudson-slave/workspace/Lucene-Solr-Tests-4.x-java7/lucene/build/analysis/phonetic/lucene-analyzers-phonetic-4.1-SNAPSHOT.jar:/usr/home/hudson/hudson-slave/workspace/Lucene-Solr-Tests-4.x-java7/lucene/build/highlighter/lucene-highlighter-4.1-SNAPSHOT.jar:/usr/home/hudson/hudson-slave/workspace/Lucene-Solr-Tests-4.x-java7/lucene/build/memory/lucene-memory-4.1-SNAPSHOT.jar:/usr/home/hudson/hudson-slave/workspace/Lucene-Solr-Tests-4.x-java7/lucene/build/misc/lucene-misc-4.1-SNAPSHOT.jar:/usr/home/hudson/hudson-slave/workspace/Lucene-Solr-Tests-4.x-java7/lucene/build/spatial/lucene-spatial-4.1-SNAPSHOT.jar:/usr/home/hudson/hudson-slave/workspace/Lucene-Solr-Tests-4.x-java7/lucene/build/suggest/lucene-suggest-4.1-SNAPSHOT.jar:/usr/home/hudson/hudson-slave/workspace/Lucene-Solr-Tests-4.x-java7/lucene/build/grouping/lucene-grouping-4.1-SNAPSHOT.jar:/usr/home/hudson/hudson-slave/workspace/Lucene-Solr-Tests-4.x-java7/lucene/build/queries/lucene-queries-4.1-SNAPSHOT.jar:/usr/home/hudson/hudson-slave/workspace/Lucene-Solr-Tests-4.x-java7/lucene/build/queryparser/lucene-queryparser-4.1-SNAPSHOT.jar:/usr/home/hudson/hudson-slave/workspace/Lucene-Solr-Tests-4.x-java7/solr/core/lib/commons-cli-1.2.jar:/usr/home/hudson/hudson-slave/workspace/Lucene-Solr-Tests-4.x-java7/solr/core/lib/commons-codec-1.7.jar:/usr/home/hudson/hudson-slave/workspace/Lucene-Solr-Tests-4.x-java7/solr/core/lib/commons-fileupload-1.2.1.jar:/usr/home/hudson/hudson-slave/workspace/Lucene-Solr-Tests-4.x-java7/solr/core/lib/commons-lang-2.6.jar:/usr/home/hudson/hudson-slave/workspace/Lucene-Solr-Tests-4.x-java7/solr/core/lib/easymock-2.2.jar:/usr/home/hudson/hudson-slave/workspace/Lucene-Solr-Tests-4.x-java7/solr/core/lib/guava-r05.jar:/usr/home/hudson/hudson-slave/workspace/Lucene-Solr-Tests-4.x-java7/solr/core/lib/javax.servlet-api-3.0.1.jar:/usr/home/hudson/hudson-slave/workspace/Lucene-Solr-Tests-4.x-java7/solr/core/lib/spatial4j-0.3.jar:/usr/home/hudson/hudson-slave/workspace/Lucene-Solr-Tests-4.x-java7/solr/solrj/lib/commons-io-2.1.jar:/usr/home/hudson/hudson-slave/workspace/Lucene-Solr-Tests-4.x-java7/solr/solrj/lib/httpclient-4.1.3.jar:/usr/home/hudson/hudson-slave/workspace/Lucene-Solr-Tests-4.x-java7/solr/solrj/lib/httpcore-4.1.4.jar:/usr/home/hudson/hudson-slave/workspace/Lucene-Solr-Tests-4.x-java7/solr/solrj/lib/httpmime-4.1.3.jar:/usr/home/hudson/hudson-slave/workspace/Lucene-Solr-Tests-4.x-java7/solr/solrj/lib/jcl-over-slf4j-1.6.4.jar:/usr/home/hudson/hudson-slave/workspace/Lucene-Solr-Tests-4.x-java7/solr/solrj/lib/log4j-over-slf4j-1.6.4.jar:/usr/home/hudson/hudson-slave/workspace/Lucene-Solr-Tests-4.x-java7/solr/solrj/lib/slf4j-api-1.6.4.jar:/usr/home/hudson/hudson-slave/workspace/Lucene-Solr-Tests-4.x-java7/solr/solrj/lib/slf4j-jdk14-1.6.4.jar:/usr/home/hudson/hudson-slave/workspace/Lucene-Solr-Tests-4.x-java7/solr/solrj/lib/wstx-asl-3.2.7.jar:/usr/home/hudson/hudson-slave/workspace/Lucene-Solr-Tests-4.x-java7/solr/solrj/lib/zookeeper-3.3.6.jar:/usr/home/hudson/hudson-slave/workspace/Lucene-Solr-Tests-4.x-java7/solr/example/lib/jetty-continuation-8.1.2.v20120308.jar:/usr/home/hudson/hudson-slave/workspace/Lucene-Solr-Tests-4.x-java7/solr/example/lib/jetty-deploy-8.1.2.v20120308.jar:/usr/home/hudson/hudson-slave/workspace/Lucene-Solr-Tests-4.x-java7/solr/example/lib/jetty-http-8.1.2.v20120308.jar:/usr/home/hudson/hudson-slave/workspace/Lucene-Solr-Tests-4.x-java7/solr/example/lib/jetty-io-8.1.2.v20120308.jar:/usr/home/hudson/hudson-slave/workspace/Lucene-Solr-Tests-4.x-java7/solr/example/lib/jetty-jmx-8.1.2.v20120308.jar:/usr/home/hudson/hudson-slave/workspace/Lucene-Solr-Tests-4.x-java7/solr/example/lib/jetty-security-8.1.2.v20120308.jar:/usr/home/hudson/hudson-slave/workspace/Lucene-Solr-Tests-4.x-java7/solr/example/lib/jetty-server-8.1.2.v20120308.jar:/usr/home/hudson/hudson-slave/workspace/Lucene-Solr-Tests-4.x-java7/solr/example/lib/jetty-servlet-8.1.2.v20120308.jar:/usr/home/hudson/hudson-slave/workspace/Lucene-Solr-Tests-4.x-java7/solr/example/lib/jetty-util-8.1.2.v20120308.jar:/usr/home/hudson/hudson-slave/workspace/Lucene-Solr-Tests-4.x-java7/solr/example/lib/jetty-webapp-8.1.2.v20120308.jar:/usr/home/hudson/hudson-slave/workspace/Lucene-Solr-Tests-4.x-java7/solr/example/lib/jetty-xml-8.1.2.v20120308.jar:/usr/home/hudson/hudson-slave/workspace/Lucene-Solr-Tests-4.x-java7/solr/example/lib/servlet-api-3.0.jar:/usr/home/hudson/hudson-slave/workspace/Lucene-Solr-Tests-4.x-java7/solr/example/example-DIH/solr/db/lib/hsqldb-1.8.0.10.jar:/usr/home/hudson/hudson-slave/workspace/Lucene-Solr-Tests-4.x-java7/lucene/build/core/classes/java:/usr/home/hudson/hudson-slave/workspace/Lucene-Solr-Tests-4.x-java7/lucene/test-framework/lib/junit-4.10.jar:/usr/home/hudson/hudson-slave/workspace/Lucene-Solr-Tests-4.x-java7/lucene/test-framework/lib/randomizedtesting-runner-2.0.4.jar:/home/hudson/hudson-slave/tools/Ant/ant-1.8.2/lib/ant-launcher.jar:/home/hudson/.ant/lib/ivy-2.2.0.jar:/home/hudson/hudson-slave/tools/Ant/ant-1.8.2/lib/ant-apache-regexp.jar:/home/hudson/hudson-slave/tools/Ant/ant-1.8.2/lib/ant-junit.jar:/home/hudson/hudson-slave/tools/Ant/ant-1.8.2/lib/ant-apache-bsf.jar:/home/hudson/hudson-slave/tools/Ant/ant-1.8.2/lib/ant-commons-net.jar:/home/hudson/hudson-slave/tools/Ant/ant-1.8.2/lib/ant-antlr.jar:/home/hudson/hudson-slave/tools/Ant/ant-1.8.2/lib/ant-apache-log4j.jar:/home/hudson/hudson-slave/tools/Ant/ant-1.8.2/lib/ant-commons-logging.jar:/home/hudson/hudson-slave/tools/Ant/ant-1.8.2/lib/ant-apache-xalan2.jar:/home/hudson/hudson-slave/tools/Ant/ant-1.8.2/lib/ant-apache-oro.jar:/home/hudson/hudson-slave/tools/Ant/ant-1.8.2/lib/ant-junit4.jar:/home/hudson/hudson-slave/tools/Ant/ant-1.8.2/lib/ant-netrexx.jar:/home/hudson/hudson-slave/tools/Ant/ant-1.8.2/lib/ant-swing.jar:/home/hudson/hudson-slave/tools/Ant/ant-1.8.2/lib/ant-javamail.jar:/home/hudson/hudson-slave/tools/Ant/ant-1.8.2/lib/ant-jsch.jar:/home/hudson/hudson-slave/tools/Ant/ant-1.8.2/lib/ant-jmf.jar:/home/hudson/hudson-slave/tools/Ant/ant-1.8.2/lib/ant.jar:/home/hudson/hudson-slave/tools/Ant/ant-1.8.2/lib/ant-apache-bcel.jar:/home/hudson/hudson-slave/tools/Ant/ant-1.8.2/lib/ant-jai.jar:/home/hudson/hudson-slave/tools/Ant/ant-1.8.2/lib/ant-testutil.jar:/home/hudson/hudson-slave/tools/Ant/ant-1.8.2/lib/ant-apache-resolver.jar:/home/hudson/hudson-slave/tools/Ant/ant-1.8.2/lib/ant-jdepend.jar:/usr/local/openjdk7/lib/tools.jar:/home/hudson/.ivy2/cache/com.carrotsearch.randomizedtesting/junit4-ant/jars/junit4-ant-2.0.4.jar
[junit4:junit4]   2> 311 T99 oaz.Environment.logEnv Client environment:java.library.path=/usr/local/openjdk7/jre/lib/amd64/server:/usr/local/openjdk7/jre/lib/amd64:/usr/local/openjdk7/jre/../lib/amd64:/usr/local/openjdk6/jre/lib/amd64/server:/usr/local/openjdk6/jre/lib/amd64:/usr/local/openjdk6/jre/../lib/amd64:/usr/java/packages/lib/amd64:/lib:/usr/lib:/usr/local/lib
[junit4:junit4]   2> 311 T99 oaz.Environment.logEnv Client environment:java.io.tmpdir=.
[junit4:junit4]   2> 311 T99 oaz.Environment.logEnv Client environment:java.compiler=<NA>
[junit4:junit4]   2> 312 T99 oaz.Environment.logEnv Client environment:os.name=FreeBSD
[junit4:junit4]   2> 312 T99 oaz.Environment.logEnv Client environment:os.arch=amd64
[junit4:junit4]   2> 312 T99 oaz.Environment.logEnv Client environment:os.version=9.0-RELEASE
[junit4:junit4]   2> 313 T99 oaz.Environment.logEnv Client environment:user.name=hudson
[junit4:junit4]   2> 313 T99 oaz.Environment.logEnv Client environment:user.home=/home/hudson
[junit4:junit4]   2> 313 T99 oaz.Environment.logEnv Client environment:user.dir=/usr/home/hudson/hudson-slave/workspace/Lucene-Solr-Tests-4.x-java7/solr/build/solr-core/test/J0
[junit4:junit4]   2> 319 T99 oaz.ZooKeeper.<init> Initiating client connection, connectString=127.0.0.1:64775 sessionTimeout=10000 watcher=org.apache.solr.common.cloud.ConnectionManager@5d1ae1c3
[junit4:junit4]   2> 374 T104 oaz.ClientCnxn$SendThread.startConnect Opening socket connection to server /127.0.0.1:64775
[junit4:junit4]   2> 375 T99 oascc.ConnectionManager.waitForConnected Waiting for client to connect to ZooKeeper
[junit4:junit4]   2> 378 T104 oaz.ClientCnxn$SendThread.primeConnection Socket connection established to localhost/127.0.0.1:64775, initiating session
[junit4:junit4]   2> 378 T101 oazs.NIOServerCnxn$Factory.run Accepted socket connection from /140.211.11.196:51518
[junit4:junit4]   2> 394 T101 oazs.NIOServerCnxn.doIO WARNING Exception causing close of session 0x0 due to java.io.IOException: ZooKeeperServer not running
[junit4:junit4]   2> 394 T101 oazs.NIOServerCnxn.closeSock Closed socket connection for client /140.211.11.196:51518 (no session established for client)
[junit4:junit4]   2> 395 T104 oaz.ClientCnxn$SendThread.run Unable to read additional data from server sessionid 0x0, likely server has closed socket, closing socket connection and attempting reconnect
[junit4:junit4]   2> 2127 T104 oaz.ClientCnxn$SendThread.startConnect Opening socket connection to server localhost/127.0.0.1:64775
[junit4:junit4]   2> 2128 T104 oaz.ClientCnxn$SendThread.primeConnection Socket connection established to localhost/127.0.0.1:64775, initiating session
[junit4:junit4]   2> 2128 T101 oazs.NIOServerCnxn$Factory.run Accepted socket connection from /140.211.11.196:21267
[junit4:junit4]   2> 2129 T101 oazs.NIOServerCnxn.readConnectRequest Client attempting to establish new session at /140.211.11.196:21267
[junit4:junit4]   2> 2144 T103 oazsp.FileTxnLog.append Creating new log file: log.1
[junit4:junit4]   2> 2176 T103 oazs.NIOServerCnxn.finishSessionInit Established session 0x13ad687116a0000 with negotiated timeout 10000 for client /140.211.11.196:21267
[junit4:junit4]   2> 2176 T104 oaz.ClientCnxn$SendThread.readConnectResult Session establishment complete on server localhost/127.0.0.1:64775, sessionid = 0x13ad687116a0000, negotiated timeout = 10000
[junit4:junit4]   2> 2180 T106 oascc.ConnectionManager.process Watcher org.apache.solr.common.cloud.ConnectionManager@5d1ae1c3 name:ZooKeeperConnection Watcher:127.0.0.1:64775 got event WatchedEvent state:SyncConnected type:None path:null path:null type:None
[junit4:junit4]   2> 2180 T99 oascc.ConnectionManager.waitForConnected Client is connected to ZooKeeper
[junit4:junit4]   2> 2185 T99 oascc.SolrZkClient.makePath makePath: /solr
[junit4:junit4]   2> 2252 T105 oazs.PrepRequestProcessor.pRequest Processed session termination for sessionid: 0x13ad687116a0000
[junit4:junit4]   2> 2253 T106 oaz.ClientCnxn$EventThread.run EventThread shut down
[junit4:junit4]   2> 2253 T99 oaz.ZooKeeper.close Session: 0x13ad687116a0000 closed
[junit4:junit4]   2> 2254 T99 oaz.ZooKeeper.<init> Initiating client connection, connectString=127.0.0.1:64775/solr sessionTimeout=10000 watcher=org.apache.solr.common.cloud.ConnectionManager@13c77dd0
[junit4:junit4]   2> 2254 T101 oazs.NIOServerCnxn.closeSock Closed socket connection for client /140.211.11.196:21267 which had sessionid 0x13ad687116a0000
[junit4:junit4]   2> 2255 T107 oaz.ClientCnxn$SendThread.startConnect Opening socket connection to server /127.0.0.1:64775
[junit4:junit4]   2> 2255 T99 oascc.ConnectionManager.waitForConnected Waiting for client to connect to ZooKeeper
[junit4:junit4]   2> 2256 T107 oaz.ClientCnxn$SendThread.primeConnection Socket connection established to localhost/127.0.0.1:64775, initiating session
[junit4:junit4]   2> 2256 T101 oazs.NIOServerCnxn$Factory.run Accepted socket connection from /140.211.11.196:35059
[junit4:junit4]   2> 2256 T101 oazs.NIOServerCnxn.readConnectRequest Client attempting to establish new session at /140.211.11.196:35059
[junit4:junit4]   2> 2258 T103 oazs.NIOServerCnxn.finishSessionInit Established session 0x13ad687116a0001 with negotiated timeout 10000 for client /140.211.11.196:35059
[junit4:junit4]   2> 2258 T107 oaz.ClientCnxn$SendThread.readConnectResult Session establishment complete on server localhost/127.0.0.1:64775, sessionid = 0x13ad687116a0001, negotiated timeout = 10000
[junit4:junit4]   2> 2258 T108 oascc.ConnectionManager.process Watcher org.apache.solr.common.cloud.ConnectionManager@13c77dd0 name:ZooKeeperConnection Watcher:127.0.0.1:64775/solr got event WatchedEvent state:SyncConnected type:None path:null path:null type:None
[junit4:junit4]   2> 2259 T99 oascc.ConnectionManager.waitForConnected Client is connected to ZooKeeper
[junit4:junit4]   2> 2268 T99 oascc.SolrZkClient.makePath makePath: /collections/collection1
[junit4:junit4]   2> 2273 T99 oascc.SolrZkClient.makePath makePath: /collections/collection1/shards
[junit4:junit4]   2> 2283 T99 oascc.SolrZkClient.makePath makePath: /collections/control_collection
[junit4:junit4]   2> 2286 T99 oascc.SolrZkClient.makePath makePath: /collections/control_collection/shards
[junit4:junit4]   2> 2289 T99 oasc.AbstractZkTestCase.putConfig put /usr/home/hudson/hudson-slave/workspace/Lucene-Solr-Tests-4.x-java7/solr/build/solr-core/test-files/solr/collection1/conf/solrconfig.xml to /configs/conf1/solrconfig.xml
[junit4:junit4]   2> 2318 T99 oascc.SolrZkClient.makePath makePath: /configs/conf1/solrconfig.xml
[junit4:junit4]   2> 2336 T99 oasc.AbstractZkTestCase.putConfig put /usr/home/hudson/hudson-slave/workspace/Lucene-Solr-Tests-4.x-java7/solr/build/solr-core/test-files/solr/collection1/conf/schema.xml to /configs/conf1/schema.xml
[junit4:junit4]   2> 2337 T99 oascc.SolrZkClient.makePath makePath: /configs/conf1/schema.xml
[junit4:junit4]   2> 2442 T99 oasc.AbstractZkTestCase.putConfig put /usr/home/hudson/hudson-slave/workspace/Lucene-Solr-Tests-4.x-java7/solr/build/solr-core/test-files/solr/collection1/conf/solrconfig.xml to /configs/conf1/solrconfig.xml
[junit4:junit4]   2> 2443 T99 oascc.SolrZkClient.makePath makePath: /configs/conf1/solrconfig.xml
[junit4:junit4]   2> 2481 T99 oasc.AbstractZkTestCase.putConfig put /usr/home/hudson/hudson-slave/workspace/Lucene-Solr-Tests-4.x-java7/solr/build/solr-core/test-files/solr/collection1/conf/stopwords.txt to /configs/conf1/stopwords.txt
[junit4:junit4]   2> 2481 T99 oascc.SolrZkClient.makePath makePath: /configs/conf1/stopwords.txt
[junit4:junit4]   2> 2486 T99 oasc.AbstractZkTestCase.putConfig put /usr/home/hudson/hudson-slave/workspace/Lucene-Solr-Tests-4.x-java7/solr/build/solr-core/test-files/solr/collection1/conf/protwords.txt to /configs/conf1/protwords.txt
[junit4:junit4]   2> 2486 T99 oascc.SolrZkClient.makePath makePath: /configs/conf1/protwords.txt
[junit4:junit4]   2> 2489 T99 oasc.AbstractZkTestCase.putConfig put /usr/home/hudson/hudson-slave/workspace/Lucene-Solr-Tests-4.x-java7/solr/build/solr-core/test-files/solr/collection1/conf/currency.xml to /configs/conf1/currency.xml
[junit4:junit4]   2> 2490 T99 oascc.SolrZkClient.makePath makePath: /configs/conf1/currency.xml
[junit4:junit4]   2> 2494 T99 oasc.AbstractZkTestCase.putConfig put /usr/home/hudson/hudson-slave/workspace/Lucene-Solr-Tests-4.x-java7/solr/build/solr-core/test-files/solr/collection1/conf/open-exchange-rates.json to /configs/conf1/open-exchange-rates.json
[junit4:junit4]   2> 2494 T99 oascc.SolrZkClient.makePath makePath: /configs/conf1/open-exchange-rates.json
[junit4:junit4]   2> 2497 T99 oasc.AbstractZkTestCase.putConfig put /usr/home/hudson/hudson-slave/workspace/Lucene-Solr-Tests-4.x-java7/solr/build/solr-core/test-files/solr/collection1/conf/mapping-ISOLatin1Accent.txt to /configs/conf1/mapping-ISOLatin1Accent.txt
[junit4:junit4]   2> 2499 T99 oascc.SolrZkClient.makePath makePath: /configs/conf1/mapping-ISOLatin1Accent.txt
[junit4:junit4]   2> 2502 T99 oasc.AbstractZkTestCase.putConfig put /usr/home/hudson/hudson-slave/workspace/Lucene-Solr-Tests-4.x-java7/solr/build/solr-core/test-files/solr/collection1/conf/old_synonyms.txt to /configs/conf1/old_synonyms.txt
[junit4:junit4]   2> 2502 T99 oascc.SolrZkClient.makePath makePath: /configs/conf1/old_synonyms.txt
[junit4:junit4]   2> 2505 T99 oasc.AbstractZkTestCase.putConfig put /usr/home/hudson/hudson-slave/workspace/Lucene-Solr-Tests-4.x-java7/solr/build/solr-core/test-files/solr/collection1/conf/synonyms.txt to /configs/conf1/synonyms.txt
[junit4:junit4]   2> 2506 T99 oascc.SolrZkClient.makePath makePath: /configs/conf1/synonyms.txt
[junit4:junit4]   2> 2509 T105 oazs.PrepRequestProcessor.pRequest Processed session termination for sessionid: 0x13ad687116a0001
[junit4:junit4]   2> 2517 T108 oaz.ClientCnxn$EventThread.run EventThread shut down
[junit4:junit4]   2> 2517 T101 oazs.NIOServerCnxn.closeSock Closed socket connection for client /140.211.11.196:35059 which had sessionid 0x13ad687116a0001
[junit4:junit4]   2> 2517 T99 oaz.ZooKeeper.close Session: 0x13ad687116a0001 closed
[junit4:junit4]   2> 2980 T99 oejs.Server.doStart jetty-8.1.2.v20120308
[junit4:junit4]   2> 3245 T99 oejs.AbstractConnector.doStart Started SelectChannelConnector@0.0.0.0:38672
[junit4:junit4]   2> 3277 T99 oasc.SolrResourceLoader.locateSolrHome JNDI not configured for solr (NoInitialContextEx)
[junit4:junit4]   2> 3278 T99 oasc.SolrResourceLoader.locateSolrHome using system property solr.solr.home: /usr/home/hudson/hudson-slave/workspace/Lucene-Solr-Tests-4.x-java7/solr/build/solr-core/test-files/solr
[junit4:junit4]   2> 3278 T99 oasc.SolrResourceLoader.<init> new SolrResourceLoader for deduced Solr Home: '/usr/home/hudson/hudson-slave/workspace/Lucene-Solr-Tests-4.x-java7/solr/build/solr-core/test-files/solr/'
[junit4:junit4]   2> 3315 T99 oass.SolrDispatchFilter.init SolrDispatchFilter.init()
[junit4:junit4]   2> 3316 T99 oasc.SolrResourceLoader.locateSolrHome JNDI not configured for solr (NoInitialContextEx)
[junit4:junit4]   2> 3316 T99 oasc.SolrResourceLoader.locateSolrHome using system property solr.solr.home: /usr/home/hudson/hudson-slave/workspace/Lucene-Solr-Tests-4.x-java7/solr/build/solr-core/test-files/solr
[junit4:junit4]   2> 3316 T99 oasc.CoreContainer$Initializer.initialize looking for solr.xml: /usr/home/hudson/hudson-slave/workspace/Lucene-Solr-Tests-4.x-java7/solr/build/solr-core/test-files/solr/solr.xml
[junit4:junit4]   2> 3317 T99 oasc.CoreContainer.<init> New CoreContainer 1200082580
[junit4:junit4]   2> 3317 T99 oasc.CoreContainer.load Loading CoreContainer using Solr Home: '/usr/home/hudson/hudson-slave/workspace/Lucene-Solr-Tests-4.x-java7/solr/build/solr-core/test-files/solr/'
[junit4:junit4]   2> 3318 T99 oasc.SolrResourceLoader.<init> new SolrResourceLoader for directory: '/usr/home/hudson/hudson-slave/workspace/Lucene-Solr-Tests-4.x-java7/solr/build/solr-core/test-files/solr/'
[junit4:junit4]   2> 3363 T99 oasc.CoreContainer.load Registering Log Listener
[junit4:junit4]   2> 3384 T99 oasc.CoreContainer.initZooKeeper Zookeeper client=127.0.0.1:64775/solr
[junit4:junit4]   2> 3420 T99 oaz.ZooKeeper.<init> Initiating client connection, connectString=127.0.0.1:64775/solr sessionTimeout=5000 watcher=org.apache.solr.common.cloud.ConnectionManager@198cc898
[junit4:junit4]   2> 3421 T119 oaz.ClientCnxn$SendThread.startConnect Opening socket connection to server /127.0.0.1:64775
[junit4:junit4]   2> 3421 T99 oascc.ConnectionManager.waitForConnected Waiting for client to connect to ZooKeeper
[junit4:junit4]   2> 3422 T119 oaz.ClientCnxn$SendThread.primeConnection Socket connection established to localhost/127.0.0.1:64775, initiating session
[junit4:junit4]   2> 3422 T101 oazs.NIOServerCnxn$Factory.run Accepted socket connection from /140.211.11.196:17343
[junit4:junit4]   2> 3423 T101 oazs.NIOServerCnxn.readConnectRequest Client attempting to establish new session at /140.211.11.196:17343
[junit4:junit4]   2> 3424 T103 oazs.NIOServerCnxn.finishSessionInit Established session 0x13ad687116a0002 with negotiated timeout 5000 for client /140.211.11.196:17343
[junit4:junit4]   2> 3424 T119 oaz.ClientCnxn$SendThread.readConnectResult Session establishment complete on server localhost/127.0.0.1:64775, sessionid = 0x13ad687116a0002, negotiated timeout = 5000
[junit4:junit4]   2> 3425 T120 oascc.ConnectionManager.process Watcher org.apache.solr.common.cloud.ConnectionManager@198cc898 name:ZooKeeperConnection Watcher:127.0.0.1:64775/solr got event WatchedEvent state:SyncConnected type:None path:null path:null type:None
[junit4:junit4]   2> 3425 T99 oascc.ConnectionManager.waitForConnected Client is connected to ZooKeeper
[junit4:junit4]   2> 3445 T105 oazs.PrepRequestProcessor.pRequest Got user-level KeeperException when processing sessionid:0x13ad687116a0002 type:create cxid:0x2 zxid:0xfffffffffffffffe txntype:unknown reqpath:n/a Error Path:/solr/overseer Error:KeeperErrorCode = NodeExists for /solr/overseer
[junit4:junit4]   2> 3456 T99 oascc.SolrZkClient.makePath makePath: /live_nodes
[junit4:junit4]   2> 3459 T99 oasc.ZkController.createEphemeralLiveNode Register node as live in ZooKeeper:/live_nodes/127.0.0.1:38672_solr
[junit4:junit4]   2> 3465 T105 oazs.PrepRequestProcessor.pRequest Got user-level KeeperException when processing sessionid:0x13ad687116a0002 type:delete cxid:0x7 zxid:0xfffffffffffffffe txntype:unknown reqpath:n/a Error Path:/solr/live_nodes/127.0.0.1:38672_solr Error:KeeperErrorCode = NoNode for /solr/live_nodes/127.0.0.1:38672_solr
[junit4:junit4]   2> 3466 T99 oascc.SolrZkClient.makePath makePath: /live_nodes/127.0.0.1:38672_solr
[junit4:junit4]   2> 3469 T99 oashc.HttpShardHandlerFactory.getParameter Setting socketTimeout to: 0
[junit4:junit4]   2> 3470 T99 oashc.HttpShardHandlerFactory.getParameter Setting urlScheme to: http://
[junit4:junit4]   2> 3470 T99 oashc.HttpShardHandlerFactory.getParameter Setting connTimeout to: 0
[junit4:junit4]   2> 3470 T99 oashc.HttpShardHandlerFactory.getParameter Setting maxConnectionsPerHost to: 20
[junit4:junit4]   2> 3471 T99 oashc.HttpShardHandlerFactory.getParameter Setting corePoolSize to: 0
[junit4:junit4]   2> 3471 T99 oashc.HttpShardHandlerFactory.getParameter Setting maximumPoolSize to: 2147483647
[junit4:junit4]   2> 3471 T99 oashc.HttpShardHandlerFactory.getParameter Setting maxThreadIdleTime to: 5
[junit4:junit4]   2> 3472 T99 oashc.HttpShardHandlerFactory.getParameter Setting sizeOfQueue to: -1
[junit4:junit4]   2> 3472 T99 oashc.HttpShardHandlerFactory.getParameter Setting fairnessPolicy to: false
[junit4:junit4]   2> 3473 T99 oascsi.HttpClientUtil.createClient Creating new http client, config:maxConnectionsPerHost=20&maxConnections=10000&socketTimeout=0&connTimeout=0&retry=false
[junit4:junit4]   2> 3487 T99 oascc.SolrZkClient.makePath makePath: /overseer_elect/election
[junit4:junit4]   2> 3506 T105 oazs.PrepRequestProcessor.pRequest Got user-level KeeperException when processing sessionid:0x13ad687116a0002 type:delete cxid:0x15 zxid:0xfffffffffffffffe txntype:unknown reqpath:n/a Error Path:/solr/overseer_elect/leader Error:KeeperErrorCode = NoNode for /solr/overseer_elect/leader
[junit4:junit4]   2> 3507 T99 oascc.SolrZkClient.makePath makePath: /overseer_elect/leader
[junit4:junit4]   2> 3510 T99 oasc.Overseer.start Overseer (id=88619018288234498-127.0.0.1:38672_solr-n_0000000000) starting
[junit4:junit4]   2> 3510 T105 oazs.PrepRequestProcessor.pRequest Got user-level KeeperException when processing sessionid:0x13ad687116a0002 type:create cxid:0x1a zxid:0xfffffffffffffffe txntype:unknown reqpath:n/a Error Path:/solr/overseer Error:KeeperErrorCode = NodeExists for /solr/overseer
[junit4:junit4]   2> 3526 T105 oazs.PrepRequestProcessor.pRequest Got user-level KeeperException when processing sessionid:0x13ad687116a0002 type:create cxid:0x1b zxid:0xfffffffffffffffe txntype:unknown reqpath:n/a Error Path:/solr/overseer Error:KeeperErrorCode = NodeExists for /solr/overseer
[junit4:junit4]   2> 3527 T105 oazs.PrepRequestProcessor.pRequest Got user-level KeeperException when processing sessionid:0x13ad687116a0002 type:create cxid:0x1c zxid:0xfffffffffffffffe txntype:unknown reqpath:n/a Error Path:/solr/overseer Error:KeeperErrorCode = NodeExists for /solr/overseer
[junit4:junit4]   2> 3533 T105 oazs.PrepRequestProcessor.pRequest Got user-level KeeperException when processing sessionid:0x13ad687116a0002 type:create cxid:0x1d zxid:0xfffffffffffffffe txntype:unknown reqpath:n/a Error Path:/solr/overseer Error:KeeperErrorCode = NodeExists for /solr/overseer
[junit4:junit4]   2> 3534 T122 oasc.OverseerCollectionProcessor.run Process current queue of collection messages
[junit4:junit4]   2> 3535 T99 oascc.SolrZkClient.makePath makePath: /clusterstate.json
[junit4:junit4]   2> 3542 T99 oascc.ZkStateReader.createClusterStateWatchersAndUpdate Updating cluster state from ZooKeeper... 
[junit4:junit4]   2> 3562 T121 oasc.Overseer$ClusterStateUpdater.run Starting to work on the main queue
[junit4:junit4]   2> 3606 T99 oasc.CoreContainer.create Creating SolrCore 'collection1' using instanceDir: /usr/home/hudson/hudson-slave/workspace/Lucene-Solr-Tests-4.x-java7/solr/build/solr-core/test-files/solr/collection1
[junit4:junit4]   2> 3606 T99 oasc.ZkController.createCollectionZkNode Check for collection zkNode:control_collection
[junit4:junit4]   2> 3607 T99 oasc.ZkController.createCollectionZkNode Collection zkNode exists
[junit4:junit4]   2> 3608 T99 oasc.ZkController.readConfigName Load collection config from:/collections/control_collection
[junit4:junit4]   2> 3610 T99 oasc.SolrResourceLoader.<init> new SolrResourceLoader for directory: '/usr/home/hudson/hudson-slave/workspace/Lucene-Solr-Tests-4.x-java7/solr/build/solr-core/test-files/solr/collection1/'
[junit4:junit4]   2> 3611 T99 oasc.SolrResourceLoader.replaceClassLoader Adding 'file:/usr/home/hudson/hudson-slave/workspace/Lucene-Solr-Tests-4.x-java7/solr/build/solr-core/test-files/solr/collection1/lib/README' to classloader
[junit4:junit4]   2> 3611 T99 oasc.SolrResourceLoader.replaceClassLoader Adding 'file:/usr/home/hudson/hudson-slave/workspace/Lucene-Solr-Tests-4.x-java7/solr/build/solr-core/test-files/solr/collection1/lib/classes/' to classloader
[junit4:junit4]   2> 3693 T99 oasc.SolrConfig.<init> Using Lucene MatchVersion: LUCENE_41
[junit4:junit4]   2> 3743 T99 oasc.SolrConfig.<init> Loaded SolrConfig: solrconfig.xml
[junit4:junit4]   2> 3844 T99 oass.IndexSchema.readSchema Reading Solr Schema
[junit4:junit4]   2> 3852 T99 oass.IndexSchema.readSchema Schema name=test
[junit4:junit4]   2> 4296 T99 oass.OpenExchangeRatesOrgProvider.init Initialized with rates=open-exchange-rates.json, refreshInterval=1440.
[junit4:junit4]   2> 4306 T99 oass.IndexSchema.readSchema default search field in schema is text
[junit4:junit4]   2> 4309 T99 oass.IndexSchema.readSchema unique key field: id
[junit4:junit4]   2> 4329 T99 oass.FileExchangeRateProvider.reload Reloading exchange rates from file currency.xml
[junit4:junit4]   2> 4334 T99 oass.FileExchangeRateProvider.reload Reloading exchange rates from file currency.xml
[junit4:junit4]   2> 4339 T99 oass.OpenExchangeRatesOrgProvider.reload Reloading exchange rates from open-exchange-rates.json
[junit4:junit4]   2> 4342 T99 oass.OpenExchangeRatesOrgProvider.reload Reloading exchange rates from open-exchange-rates.json
[junit4:junit4]   2> 4345 T99 oasc.SolrCore.<init> [collection1] Opening new SolrCore at /usr/home/hudson/hudson-slave/workspace/Lucene-Solr-Tests-4.x-java7/solr/build/solr-core/test-files/solr/collection1/, dataDir=./org.apache.solr.cloud.BasicDistributedZkTest-1352218906703/control/data/
[junit4:junit4]   2> 4345 T99 oasc.JmxMonitoredMap.<init> JMX monitoring is enabled. Adding Solr mbeans to JMX Server: com.sun.jmx.mbeanserver.JmxMBeanServer@2691cde4
[junit4:junit4]   2> 4370 T99 oasc.SolrCore.getNewIndexDir New index directory detected: old=null new=./org.apache.solr.cloud.BasicDistributedZkTest-1352218906703/control/data/index/
[junit4:junit4]   2> 4371 T99 oasc.SolrCore.initIndex WARNING [collection1] Solr index directory './org.apache.solr.cloud.BasicDistributedZkTest-1352218906703/control/data/index' doesn't exist. Creating new index...
[junit4:junit4]   2> 4372 T99 oasc.CachingDirectoryFactory.get return new directory for /usr/home/hudson/hudson-slave/workspace/Lucene-Solr-Tests-4.x-java7/solr/build/solr-core/test/J0/./org.apache.solr.cloud.BasicDistributedZkTest-1352218906703/control/data/index forceNew:false
[junit4:junit4]   2> 4382 T99 oasc.SolrDeletionPolicy.onCommit SolrDeletionPolicy.onCommit: commits:num=1
[junit4:junit4]   2> 		commit{dir=/usr/home/hudson/hudson-slave/workspace/Lucene-Solr-Tests-4.x-java7/solr/build/solr-core/test/J0/org.apache.solr.cloud.BasicDistributedZkTest-1352218906703/control/data/index,segFN=segments_1,generation=1,filenames=[segments_1]
[junit4:junit4]   2> 4382 T99 oasc.SolrDeletionPolicy.updateCommits newest commit = 1
[junit4:junit4]   2> 4383 T99 oasc.SolrCore.initWriters created xml: solr.XMLResponseWriter
[junit4:junit4]   2> 4385 T99 oasup.UpdateRequestProcessorChain.init inserting DistributedUpdateProcessorFactory into updateRequestProcessorChain "dedupe"
[junit4:junit4]   2> 4386 T99 oasup.UpdateRequestProcessorChain.init inserting DistributedUpdateProcessorFactory into updateRequestProcessorChain "dedupe-allfields"
[junit4:junit4]   2> 4386 T99 oasup.UpdateRequestProcessorChain.init inserting DistributedUpdateProcessorFactory into updateRequestProcessorChain "stored_sig"
[junit4:junit4]   2> 4387 T99 oasup.UpdateRequestProcessorChain.init inserting DistributedUpdateProcessorFactory into updateRequestProcessorChain "uniq-fields"
[junit4:junit4]   2> 4387 T99 oasup.UpdateRequestProcessorChain.init inserting DistributedUpdateProcessorFactory into updateRequestProcessorChain "distrib-dup-test-chain-implicit"
[junit4:junit4]   2> 4388 T99 oasc.RequestHandlers.initHandlersFromConfig adding lazy requestHandler: solr.ReplicationHandler
[junit4:junit4]   2> 4388 T99 oasc.RequestHandlers.initHandlersFromConfig created /replication: solr.ReplicationHandler
[junit4:junit4]   2> 4389 T99 oasc.RequestHandlers.initHandlersFromConfig created standard: solr.StandardRequestHandler
[junit4:junit4]   2> 4390 T99 oasc.RequestHandlers.initHandlersFromConfig created /get: solr.RealTimeGetHandler
[junit4:junit4]   2> 4390 T99 oasc.RequestHandlers.initHandlersFromConfig created dismax: solr.SearchHandler
[junit4:junit4]   2> 4391 T99 oasc.RequestHandlers.initHandlersFromConfig created mock: org.apache.solr.core.MockQuerySenderListenerReqHandler
[junit4:junit4]   2> 4392 T99 oasc.RequestHandlers.initHandlersFromConfig created /admin/: org.apache.solr.handler.admin.AdminHandlers
[junit4:junit4]   2> 4392 T99 oasc.RequestHandlers.initHandlersFromConfig created defaults: solr.StandardRequestHandler
[junit4:junit4]   2> 4393 T99 oasc.RequestHandlers.initHandlersFromConfig adding lazy requestHandler: solr.StandardRequestHandler
[junit4:junit4]   2> 4393 T99 oasc.RequestHandlers.initHandlersFromConfig created lazy: solr.StandardRequestHandler
[junit4:junit4]   2> 4394 T99 oasc.RequestHandlers.initHandlersFromConfig created /update: solr.UpdateRequestHandler
[junit4:junit4]   2> 4394 T99 oasc.RequestHandlers.initHandlersFromConfig created /terms: org.apache.solr.handler.component.SearchHandler
[junit4:junit4]   2> 4395 T99 oasc.RequestHandlers.initHandlersFromConfig created spellCheckCompRH: org.apache.solr.handler.component.SearchHandler
[junit4:junit4]   2> 4396 T99 oasc.RequestHandlers.initHandlersFromConfig created spellCheckCompRH_Direct: org.apache.solr.handler.component.SearchHandler
[junit4:junit4]   2> 4396 T99 oasc.RequestHandlers.initHandlersFromConfig created spellCheckWithWordbreak: org.apache.solr.handler.component.SearchHandler
[junit4:junit4]   2> 4397 T99 oasc.RequestHandlers.initHandlersFromConfig created spellCheckWithWordbreak_Direct: org.apache.solr.handler.component.SearchHandler
[junit4:junit4]   2> 4397 T99 oasc.RequestHandlers.initHandlersFromConfig created spellCheckCompRH1: org.apache.solr.handler.component.SearchHandler
[junit4:junit4]   2> 4398 T99 oasc.RequestHandlers.initHandlersFromConfig created tvrh: org.apache.solr.handler.component.SearchHandler
[junit4:junit4]   2> 4399 T99 oasc.RequestHandlers.initHandlersFromConfig created /mlt: solr.MoreLikeThisHandler
[junit4:junit4]   2> 4399 T99 oasc.RequestHandlers.initHandlersFromConfig created /debug/dump: solr.DumpRequestHandler
[junit4:junit4]   2> 4408 T99 oashl.XMLLoader.init xsltCacheLifetimeSeconds=60
[junit4:junit4]   2> 4412 T99 oasc.SolrCore.initDeprecatedSupport WARNING solrconfig.xml uses deprecated <admin/gettableFiles>, Please update your config to use the ShowFileRequestHandler.
[junit4:junit4]   2> 4413 T99 oasc.SolrCore.initDeprecatedSupport WARNING adding ShowFileRequestHandler with hidden files: [SCHEMA.XML, OLD_SYNONYMS.TXT, STOPWORDS.TXT, PROTWORDS.TXT, OPEN-EXCHANGE-RATES.JSON, SYNONYMS.TXT, CURRENCY.XML, MAPPING-ISOLATIN1ACCENT.TXT]
[junit4:junit4]   2> 4417 T99 oass.SolrIndexSearcher.<init> Opening Searcher@603678ef main
[junit4:junit4]   2> 4418 T99 oasu.CommitTracker.<init> Hard AutoCommit: disabled
[junit4:junit4]   2> 4418 T99 oasu.CommitTracker.<init> Soft AutoCommit: disabled
[junit4:junit4]   2> 4419 T99 oashc.SpellCheckComponent.inform Initializing spell checkers
[junit4:junit4]   2> 4433 T99 oass.DirectSolrSpellChecker.init init: {name=direct,classname=DirectSolrSpellChecker,field=lowerfilt,minQueryLength=3}
[junit4:junit4]   2> 4503 T126 oasc.SolrCore.registerSearcher [collection1] Registered new searcher Searcher@603678ef main{StandardDirectoryReader(segments_1:1)}
[junit4:junit4]   2> 4508 T99 oasc.ZkController.publish numShards not found on descriptor - reading it from system property
[junit4:junit4]   2> 4509 T105 oazs.PrepRequestProcessor.pRequest Got user-level KeeperException when processing sessionid:0x13ad687116a0002 type:create cxid:0x53 zxid:0xfffffffffffffffe txntype:unknown reqpath:n/a Error Path:/solr/overseer/queue Error:KeeperErrorCode = NoNode for /solr/overseer/queue
[junit4:junit4]   2> 4522 T99 oasc.CoreContainer.register registering core: collection1
[junit4:junit4]   2> 4523 T99 oasc.ZkController.register Register shard - core:collection1 address:http://127.0.0.1:38672/solr shardId:control_shard
[junit4:junit4]   2> 4532 T99 oascsi.HttpClientUtil.createClient Creating new http client, config:maxConnections=10000&maxConnectionsPerHost=20&connTimeout=30000&socketTimeout=30000&retry=false
[junit4:junit4]   2> 4546 T99 oascc.SolrZkClient.makePath makePath: /collections/control_collection/leader_elect/control_shard/election
[junit4:junit4]   2> 4573 T105 oazs.PrepRequestProcessor.pRequest Got user-level KeeperException when processing sessionid:0x13ad687116a0002 type:delete cxid:0x64 zxid:0xfffffffffffffffe txntype:unknown reqpath:n/a Error Path:/solr/collections/control_collection/leaders Error:KeeperErrorCode = NoNode for /solr/collections/control_collection/leaders
[junit4:junit4]   2> 4575 T99 oasc.ShardLeaderElectionContext.runLeaderProcess Running the leader process.
[junit4:junit4]   2> 4575 T121 oascc.ZkStateReader.updateClusterState Updating cloud state from ZooKeeper... 
[junit4:junit4]   2> 4576 T105 oazs.PrepRequestProcessor.pRequest Got user-level KeeperException when processing sessionid:0x13ad687116a0002 type:create cxid:0x67 zxid:0xfffffffffffffffe txntype:unknown reqpath:n/a Error Path:/solr/overseer Error:KeeperErrorCode = NodeExists for /solr/overseer
[junit4:junit4]   2> 4588 T121 oasc.Overseer$ClusterStateUpdater.updateState Update state numShards=null message={
[junit4:junit4]   2> 	  "operation":"state",
[junit4:junit4]   2> 	  "numShards":null,
[junit4:junit4]   2> 	  "shard":"control_shard",
[junit4:junit4]   2> 	  "roles":null,
[junit4:junit4]   2> 	  "state":"down",
[junit4:junit4]   2> 	  "core":"collection1",
[junit4:junit4]   2> 	  "collection":"control_collection",
[junit4:junit4]   2> 	  "node_name":"127.0.0.1:38672_solr",
[junit4:junit4]   2> 	  "base_url":"http://127.0.0.1:38672/solr"}
[junit4:junit4]   2> 4600 T105 oazs.PrepRequestProcessor.pRequest Got user-level KeeperException when processing sessionid:0x13ad687116a0002 type:create cxid:0x6a zxid:0xfffffffffffffffe txntype:unknown reqpath:n/a Error Path:/solr/overseer/queue-work Error:KeeperErrorCode = NoNode for /solr/overseer/queue-work
[junit4:junit4]   2> 4644 T120 oascc.ZkStateReader$2.process A cluster state change has occurred - updating... (1)
[junit4:junit4]   2> 5097 T99 oasc.ShardLeaderElectionContext.waitForReplicasToComeUp Enough replicas found to continue.
[junit4:junit4]   2> 5097 T99 oasc.ShardLeaderElectionContext.runLeaderProcess I may be the new leader - try and sync
[junit4:junit4]   2> 5098 T99 oasc.SyncStrategy.sync Sync replicas to http://127.0.0.1:38672/solr/collection1/
[junit4:junit4]   2> 5099 T99 oasc.SyncStrategy.syncReplicas Sync Success - now sync replicas to me
[junit4:junit4]   2> 5099 T99 oasc.SyncStrategy.syncToMe http://127.0.0.1:38672/solr/collection1/ has no replicas
[junit4:junit4]   2> 5100 T99 oasc.ShardLeaderElectionContext.runLeaderProcess I am the new leader: http://127.0.0.1:38672/solr/collection1/
[junit4:junit4]   2> 5101 T99 oascc.SolrZkClient.makePath makePath: /collections/control_collection/leaders/control_shard
[junit4:junit4]   2> 5112 T105 oazs.PrepRequestProcessor.pRequest Got user-level KeeperException when processing sessionid:0x13ad687116a0002 type:create cxid:0x88 zxid:0xfffffffffffffffe txntype:unknown reqpath:n/a Error Path:/solr/overseer Error:KeeperErrorCode = NodeExists for /solr/overseer
[junit4:junit4]   2> 5157 T121 oascc.ZkStateReader.updateClusterState Updating cloud state from ZooKeeper... 
[junit4:junit4]   2> 5170 T120 oascc.ZkStateReader$2.process A cluster state change has occurred - updating... (1)
[junit4:junit4]   2> 5229 T99 oasc.ZkController.register We are http://127.0.0.1:38672/solr/collection1/ and leader is http://127.0.0.1:38672/solr/collection1/
[junit4:junit4]   2> 5229 T99 oasc.ZkController.register No LogReplay needed for core=collection1 baseURL=http://127.0.0.1:38672/solr
[junit4:junit4]   2> 5230 T99 oasc.ZkController.checkRecovery I am the leader, no recovery necessary
[junit4:junit4]   2> 5230 T99 oasc.ZkController.publish numShards not found on descriptor - reading it from system property
[junit4:junit4]   2> 5233 T99 oascc.ZkStateReader.updateClusterState Updating cloud state from ZooKeeper... 
[junit4:junit4]   2> 5234 T99 oass.SolrDispatchFilter.init user.dir=/usr/home/hudson/hudson-slave/workspace/Lucene-Solr-Tests-4.x-java7/solr/build/solr-core/test/J0
[junit4:junit4]   2> 5235 T99 oass.SolrDispatchFilter.init SolrDispatchFilter.init() done
[junit4:junit4]   2> 5292 T99 oascsi.HttpClientUtil.createClient Creating new http client, config:maxConnections=128&maxConnectionsPerHost=32&followRedirects=false
[junit4:junit4]   2> 5440 T99 oejs.Server.doStart jetty-8.1.2.v20120308
[junit4:junit4]   2> 5443 T99 oejs.AbstractConnector.doStart Started SelectChannelConnector@0.0.0.0:19972
[junit4:junit4]   2> 5443 T99 oasc.SolrResourceLoader.locateSolrHome JNDI not configured for solr (NoInitialContextEx)
[junit4:junit4]   2> 5444 T99 oasc.SolrResourceLoader.locateSolrHome using system property solr.solr.home: /usr/home/hudson/hudson-slave/workspace/Lucene-Solr-Tests-4.x-java7/solr/build/solr-core/test/J0/./solrtest-jetty1-1352218912010
[junit4:junit4]   2> 5444 T99 oasc.SolrResourceLoader.<init> new SolrResourceLoader for deduced Solr Home: '/usr/home/hudson/hudson-slave/workspace/Lucene-Solr-Tests-4.x-java7/solr/build/solr-core/test/J0/./solrtest-jetty1-1352218912010/'
[junit4:junit4]   2> 5482 T99 oass.SolrDispatchFilter.init SolrDispatchFilter.init()
[junit4:junit4]   2> 5482 T99 oasc.SolrResourceLoader.locateSolrHome JNDI not configured for solr (NoInitialContextEx)
[junit4:junit4]   2> 5483 T99 oasc.SolrResourceLoader.locateSolrHome using system property solr.solr.home: /usr/home/hudson/hudson-slave/workspace/Lucene-Solr-Tests-4.x-java7/solr/build/solr-core/test/J0/./solrtest-jetty1-1352218912010
[junit4:junit4]   2> 5483 T99 oasc.CoreContainer$Initializer.initialize looking for solr.xml: /usr/home/hudson/hudson-slave/workspace/Lucene-Solr-Tests-4.x-java7/solr/build/solr-core/test/J0/./solrtest-jetty1-1352218912010/solr.xml
[junit4:junit4]   2> 5483 T99 oasc.CoreContainer.<init> New CoreContainer 1719203423
[junit4:junit4]   2> 5484 T99 oasc.CoreContainer.load Loading CoreContainer using Solr Home: '/usr/home/hudson/hudson-slave/workspace/Lucene-Solr-Tests-4.x-java7/solr/build/solr-core/test/J0/./solrtest-jetty1-1352218912010/'
[junit4:junit4]   2> 5484 T99 oasc.SolrResourceLoader.<init> new SolrResourceLoader for directory: '/usr/home/hudson/hudson-slave/workspace/Lucene-Solr-Tests-4.x-java7/solr/build/solr-core/test/J0/./solrtest-jetty1-1352218912010/'
[junit4:junit4]   2> 5508 T99 oasc.CoreContainer.load Registering Log Listener
[junit4:junit4]   2> 5519 T99 oasc.CoreContainer.initZooKeeper Zookeeper client=127.0.0.1:64775/solr
[junit4:junit4]   2> 5520 T99 oaz.ZooKeeper.<init> Initiating client connection, connectString=127.0.0.1:64775/solr sessionTimeout=5000 watcher=org.apache.solr.common.cloud.ConnectionManager@45d5584a
[junit4:junit4]   2> 5521 T136 oaz.ClientCnxn$SendThread.startConnect Opening socket connection to server /127.0.0.1:64775
[junit4:junit4]   2> 5521 T99 oascc.ConnectionManager.waitForConnected Waiting for client to connect to ZooKeeper
[junit4:junit4]   2> 5522 T136 oaz.ClientCnxn$SendThread.primeConnection Socket connection established to localhost/127.0.0.1:64775, initiating session
[junit4:junit4]   2> 5522 T101 oazs.NIOServerCnxn$Factory.run Accepted socket connection from /140.211.11.196:24932
[junit4:junit4]   2> 5523 T101 oazs.NIOServerCnxn.readConnectRequest Client attempting to establish new session at /140.211.11.196:24932
[junit4:junit4]   2> 5533 T103 oazs.NIOServerCnxn.finishSessionInit Established session 0x13ad687116a0003 with negotiated timeout 5000 for client /140.211.11.196:24932
[junit4:junit4]   2> 5533 T136 oaz.ClientCnxn$SendThread.readConnectResult Session establishment complete on server localhost/127.0.0.1:64775, sessionid = 0x13ad687116a0003, negotiated timeout = 5000
[junit4:junit4]   2> 5534 T137 oascc.ConnectionManager.process Watcher org.apache.solr.common.cloud.ConnectionManager@45d5584a name:ZooKeeperConnection Watcher:127.0.0.1:64775/solr got event WatchedEvent state:SyncConnected type:None path:null path:null type:None
[junit4:junit4]   2> 5534 T99 oascc.ConnectionManager.waitForConnected Client is connected to ZooKeeper
[junit4:junit4]   2> 5535 T105 oazs.PrepRequestProcessor.pRequest Got user-level KeeperException when processing sessionid:0x13ad687116a0003 type:create cxid:0x1 zxid:0xfffffffffffffffe txntype:unknown reqpath:n/a Error Path:/solr/overseer Error:KeeperErrorCode = NodeExists for /solr/overseer
[junit4:junit4]   2> 5537 T105 oazs.PrepRequestProcessor.pRequest Got user-level KeeperException when processing sessionid:0x13ad687116a0003 type:create cxid:0x2 zxid:0xfffffffffffffffe txntype:unknown reqpath:n/a Error Path:/solr/overseer Error:KeeperErrorCode = NodeExists for /solr/overseer
[junit4:junit4]   2> 5546 T99 oasc.ZkController.createEphemeralLiveNode Register node as live in ZooKeeper:/live_nodes/127.0.0.1:19972_solr
[junit4:junit4]   2> 5547 T105 oazs.PrepRequestProcessor.pRequest Got user-level KeeperException when processing sessionid:0x13ad687116a0003 type:delete cxid:0x4 zxid:0xfffffffffffffffe txntype:unknown reqpath:n/a Error Path:/solr/live_nodes/127.0.0.1:19972_solr Error:KeeperErrorCode = NoNode for /solr/live_nodes/127.0.0.1:19972_solr
[junit4:junit4]   2> 5548 T99 oascc.SolrZkClient.makePath makePath: /live_nodes/127.0.0.1:19972_solr
[junit4:junit4]   2> 5558 T120 oascc.ZkStateReader$3.process Updating live nodes... (2)
[junit4:junit4]   2> 5559 T99 oashc.HttpShardHandlerFactory.getParameter Setting socketTimeout to: 0
[junit4:junit4]   2> 5559 T99 oashc.HttpShardHandlerFactory.getParameter Setting urlScheme to: http://
[junit4:junit4]   2> 5559 T99 oashc.HttpShardHandlerFactory.getParameter Setting connTimeout to: 0
[junit4:junit4]   2> 5560 T99 oashc.HttpShardHandlerFactory.getParameter Setting maxConnectionsPerHost to: 20
[junit4:junit4]   2> 5560 T99 oashc.HttpShardHandlerFactory.getParameter Setting corePoolSize to: 0
[junit4:junit4]   2> 5561 T99 oashc.HttpShardHandlerFactory.getParameter Setting maximumPoolSize to: 2147483647
[junit4:junit4]   2> 5561 T99 oashc.HttpShardHandlerFactory.getParameter Setting maxThreadIdleTime to: 5
[junit4:junit4]   2> 5561 T99 oashc.HttpShardHandlerFactory.getParameter Setting sizeOfQueue to: -1
[junit4:junit4]   2> 5562 T99 oashc.HttpShardHandlerFactory.getParameter Setting fairnessPolicy to: false
[junit4:junit4]   2> 5562 T99 oascsi.HttpClientUtil.createClient Creating new http client, config:maxConnectionsPerHost=20&maxConnections=10000&socketTimeout=0&connTimeout=0&retry=false
[junit4:junit4]   2> 5583 T99 oascc.ZkStateReader.createClusterStateWatchersAndUpdate Updating cluster state from ZooKeeper... 
[junit4:junit4]   2> 5589 T99 oasc.CoreContainer.create Creating SolrCore 'collection1' using instanceDir: /usr/home/hudson/hudson-slave/workspace/Lucene-Solr-Tests-4.x-java7/solr/build/solr-core/test/J0/./solrtest-jetty1-1352218912010/collection1
[junit4:junit4]   2> 5589 T99 oasc.ZkController.createCollectionZkNode Check for collection zkNode:collection1
[junit4:junit4]   2> 5590 T99 oasc.ZkController.createCollectionZkNode Collection zkNode exists
[junit4:junit4]   2> 5591 T99 oasc.ZkController.readConfigName Load collection config from:/collections/collection1
[junit4:junit4]   2> 5592 T99 oasc.SolrResourceLoader.<init> new SolrResourceLoader for directory: '/usr/home/hudson/hudson-slave/workspace/Lucene-Solr-Tests-4.x-java7/solr/build/solr-core/test/J0/./solrtest-jetty1-1352218912010/collection1/'
[junit4:junit4]   2> 5593 T99 oasc.SolrResourceLoader.replaceClassLoader Adding 'file:/usr/home/hudson/hudson-slave/workspace/Lucene-Solr-Tests-4.x-java7/solr/build/solr-core/test/J0/solrtest-jetty1-1352218912010/collection1/lib/classes/' to classloader
[junit4:junit4]   2> 5594 T99 oasc.SolrResourceLoader.replaceClassLoader Adding 'file:/usr/home/hudson/hudson-slave/workspace/Lucene-Solr-Tests-4.x-java7/solr/build/solr-core/test/J0/solrtest-jetty1-1352218912010/collection1/lib/README' to classloader
[junit4:junit4]   2> 5637 T99 oasc.SolrConfig.<init> Using Lucene MatchVersion: LUCENE_41
[junit4:junit4]   2> 5681 T121 oascc.ZkStateReader.updateClusterState Updating cloud state from ZooKeeper... 
[junit4:junit4]   2> 5683 T121 oasc.Overseer$ClusterStateUpdater.updateState Update state numShards=null message={
[junit4:junit4]   2> 	  "operation":"state",
[junit4:junit4]   2> 	  "numShards":null,
[junit4:junit4]   2> 	  "shard":"control_shard",
[junit4:junit4]   2> 	  "roles":null,
[junit4:junit4]   2> 	  "state":"active",
[junit4:junit4]   2> 	  "core":"collection1",
[junit4:junit4]   2> 	  "collection":"control_collection",
[junit4:junit4]   2> 	  "node_name":"127.0.0.1:38672_solr",
[junit4:junit4]   2> 	  "base_url":"http://127.0.0.1:38672/solr"}
[junit4:junit4]   2> 5688 T99 oasc.SolrConfig.<init> Loaded SolrConfig: solrconfig.xml
[junit4:junit4]   2> 5790 T120 oascc.ZkStateReader$2.process A cluster state change has occurred - updating... (2)
[junit4:junit4]   2> 5815 T137 oascc.ZkStateReader$2.process A cluster state change has occurred - updating... (2)
[junit4:junit4]   2> 5815 T99 oass.IndexSchema.readSchema Reading Solr Schema
[junit4:junit4]   2> 5823 T99 oass.IndexSchema.readSchema Schema name=test
[junit4:junit4]   2> 6261 T99 oass.OpenExchangeRatesOrgProvider.init Initialized with rates=open-exchange-rates.json, refreshInterval=1440.
[junit4:junit4]   2> 6270 T99 oass.IndexSchema.readSchema default search field in schema is text
[junit4:junit4]   2> 6273 T99 oass.IndexSchema.readSchema unique key field: id
[junit4:junit4]   2> 6289 T99 oass.FileExchangeRateProvider.reload Reloading exchange rates from file currency.xml
[junit4:junit4]   2> 6302 T99 oass.FileExchangeRateProvider.reload Reloading exchange rates from file currency.xml
[junit4:junit4]   2> 6307 T99 oass.OpenExchangeRatesOrgProvider.reload Reloading exchange rates from open-exchange-rates.json
[junit4:junit4]   2> 6309 T99 oass.OpenExchangeRatesOrgProvider.reload Reloading exchange rates from open-exchange-rates.json
[junit4:junit4]   2> 6313 T99 oasc.SolrCore.<init> [collection1] Opening new SolrCore at /usr/home/hudson/hudson-slave/workspace/Lucene-Solr-Tests-4.x-java7/solr/build/solr-core/test/J0/./solrtest-jetty1-1352218912010/collection1/, dataDir=./org.apache.solr.cloud.BasicDistributedZkTest-1352218906703/jetty1/
[junit4:junit4]   2> 6313 T99 oasc.JmxMonitoredMap.<init> JMX monitoring is enabled. Adding Solr mbeans to JMX Server: com.sun.jmx.mbeanserver.JmxMBeanServer@2691cde4
[junit4:junit4]   2> 6314 T99 oasc.SolrCore.getNewIndexDir New index directory detected: old=null new=./org.apache.solr.cloud.BasicDistributedZkTest-1352218906703/jetty1/index/
[junit4:junit4]   2> 6315 T99 oasc.SolrCore.initIndex WARNING [collection1] Solr index directory './org.apache.solr.cloud.BasicDistributedZkTest-1352218906703/jetty1/index' doesn't exist. Creating new index...
[junit4:junit4]   2> 6316 T99 oasc.CachingDirectoryFactory.get return new directory for /usr/home/hudson/hudson-slave/workspace/Lucene-Solr-Tests-4.x-java7/solr/build/solr-core/test/J0/./org.apache.solr.cloud.BasicDistributedZkTest-1352218906703/jetty1/index forceNew:false
[junit4:junit4]   2> 6329 T99 oasc.SolrDeletionPolicy.onCommit SolrDeletionPolicy.onCommit: commits:num=1
[junit4:junit4]   2> 		commit{dir=/usr/home/hudson/hudson-slave/workspace/Lucene-Solr-Tests-4.x-java7/solr/build/solr-core/test/J0/org.apache.solr.cloud.BasicDistributedZkTest-1352218906703/jetty1/index,segFN=segments_1,generation=1,filenames=[segments_1]
[junit4:junit4]   2> 6330 T99 oasc.SolrDeletionPolicy.updateCommits newest commit = 1
[junit4:junit4]   2> 6331 T99 oasc.SolrCore.initWriters created xml: solr.XMLResponseWriter
[junit4:junit4]   2> 6333 T99 oasup.UpdateRequestProcessorChain.init inserting DistributedUpdateProcessorFactory into updateRequestProcessorChain "dedupe"
[junit4:junit4]   2> 6333 T99 oasup.UpdateRequestProcessorChain.init inserting DistributedUpdateProcessorFactory into updateRequestProcessorChain "dedupe-allfields"
[junit4:junit4]   2> 6334 T99 oasup.UpdateRequestProcessorChain.init inserting DistributedUpdateProcessorFactory into updateRequestProcessorChain "stored_sig"
[junit4:junit4]   2> 6334 T99 oasup.UpdateRequestProcessorChain.init inserting DistributedUpdateProcessorFactory into updateRequestProcessorChain "uniq-fields"
[junit4:junit4]   2> 6335 T99 oasup.UpdateRequestProcessorChain.init inserting DistributedUpdateProcessorFactory into updateRequestProcessorChain "distrib-dup-test-chain-implicit"
[junit4:junit4]   2> 6335 T99 oasc.RequestHandlers.initHandlersFromConfig adding lazy requestHandler: solr.ReplicationHandler
[junit4:junit4]   2> 6336 T99 oasc.RequestHandlers.initHandlersFromConfig created /replication: solr.ReplicationHandler
[junit4:junit4]   2> 6337 T99 oasc.RequestHandlers.initHandlersFromConfig created standard: solr.StandardRequestHandler
[junit4:junit4]   2> 6337 T99 oasc.RequestHandlers.initHandlersFromConfig created /get: solr.RealTimeGetHandler
[junit4:junit4]   2> 6338 T99 oasc.RequestHandlers.initHandlersFromConfig created dismax: solr.SearchHandler
[junit4:junit4]   2> 6339 T99 oasc.RequestHandlers.initHandlersFromConfig created mock: org.apache.solr.core.MockQuerySenderListenerReqHandler
[junit4:junit4]   2> 6339 T99 oasc.RequestHandlers.initHandlersFromConfig created /admin/: org.apache.solr.handler.admin.AdminHandlers
[junit4:junit4]   2> 6340 T99 oasc.RequestHandlers.initHandlersFromConfig created defaults: solr.StandardRequestHandler
[junit4:junit4]   2> 6340 T99 oasc.RequestHandlers.initHandlersFromConfig adding lazy requestHandler: solr.StandardRequestHandler
[junit4:junit4]   2> 6341 T99 oasc.RequestHandlers.initHandlersFromConfig created lazy: solr.StandardRequestHandler
[junit4:junit4]   2> 6341 T99 oasc.RequestHandlers.initHandlersFromConfig created /update: solr.UpdateRequestHandler
[junit4:junit4]   2> 6342 T99 oasc.RequestHandlers.initHandlersFromConfig created /terms: org.apache.solr.handler.component.SearchHandler
[junit4:junit4]   2> 6343 T99 oasc.RequestHandlers.initHandlersFromConfig created spellCheckCompRH: org.apache.solr.handler.component.SearchHandler
[junit4:junit4]   2> 6343 T99 oasc.RequestHandlers.initHandlersFromConfig created spellCheckCompRH_Direct: org.apache.solr.handler.component.SearchHandler
[junit4:junit4]   2> 6344 T99 oasc.RequestHandlers.initHandlersFromConfig created spellCheckWithWordbreak: org.apache.solr.handler.component.SearchHandler
[junit4:junit4]   2> 6345 T99 oasc.RequestHandlers.initHandlersFromConfig created spellCheckWithWordbreak_Direct: org.apache.solr.handler.component.SearchHandler
[junit4:junit4]   2> 6345 T99 oasc.RequestHandlers.initHandlersFromConfig created spellCheckCompRH1: org.apache.solr.handler.component.SearchHandler
[junit4:junit4]   2> 6346 T99 oasc.RequestHandlers.initHandlersFromConfig created tvrh: org.apache.solr.handler.component.SearchHandler
[junit4:junit4]   2> 6347 T99 oasc.RequestHandlers.initHandlersFromConfig created /mlt: solr.MoreLikeThisHandler
[junit4:junit4]   2> 6347 T99 oasc.RequestHandlers.initHandlersFromConfig created /debug/dump: solr.DumpRequestHandler
[junit4:junit4]   2> 6356 T99 oashl.XMLLoader.init xsltCacheLifetimeSeconds=60
[junit4:junit4]   2> 6360 T99 oasc.SolrCore.initDeprecatedSupport WARNING solrconfig.xml uses deprecated <admin/gettableFiles>, Please update your config to use the ShowFileRequestHandler.
[junit4:junit4]   2> 6361 T99 oasc.SolrCore.initDeprecatedSupport WARNING adding ShowFileRequestHandler with hidden files: [SCHEMA.XML, OLD_SYNONYMS.TXT, STOPWORDS.TXT, PROTWORDS.TXT, OPEN-EXCHANGE-RATES.JSON, SYNONYMS.TXT, CURRENCY.XML, MAPPING-ISOLATIN1ACCENT.TXT]
[junit4:junit4]   2> 6364 T99 oass.SolrIndexSearcher.<init> Opening Searcher@7b0e6f6e main
[junit4:junit4]   2> 6365 T99 oasu.CommitTracker.<init> Hard AutoCommit: disabled
[junit4:junit4]   2> 6365 T99 oasu.CommitTracker.<init> Soft AutoCommit: disabled
[junit4:junit4]   2> 6366 T99 oashc.SpellCheckComponent.inform Initializing spell checkers
[junit4:junit4]   2> 6381 T99 oass.DirectSolrSpellChecker.init init: {name=direct,classname=DirectSolrSpellChecker,field=lowerfilt,minQueryLength=3}
[junit4:junit4]   2> 6434 T142 oasc.SolrCore.registerSearcher [collection1] Registered new searcher Searcher@7b0e6f6e main{StandardDirectoryReader(segments_1:1)}
[junit4:junit4]   2> 6439 T99 oasc.ZkController.publish numShards not found on descriptor - reading it from system property
[junit4:junit4]   2> 6861 T121 oascc.ZkStateReader.updateClusterState Updating cloud state from ZooKeeper... 
[junit4:junit4]   2> 6862 T121 oasc.Overseer$ClusterStateUpdater.updateState Update state numShards=2 message={
[junit4:junit4]   2> 	  "operation":"state",
[junit4:junit4]   2> 	  "numShards":"2",
[junit4:junit4]   2> 	  "shard":null,
[junit4:junit4]   2> 	  "roles":null,
[junit4:junit4]   2> 	  "state":"down",
[junit4:junit4]   2> 	  "core":"collection1",
[junit4:junit4]   2> 	  "collection":"collection1",
[junit4:junit4]   2> 	  "node_name":"127.0.0.1:19972_solr",
[junit4:junit4]   2> 	  "base_url":"http://127.0.0.1:19972/solr"}
[junit4:junit4]   2> 6862 T121 oasc.Overseer$ClusterStateUpdater.createCollection Create collection collection1 with numShards 2
[junit4:junit4]   2> 6885 T120 oascc.ZkStateReader$2.process A cluster state change has occurred - updating... (2)
[junit4:junit4]   2> 6885 T137 oascc.ZkStateReader$2.process A cluster state change has occurred - updating... (2)
[junit4:junit4]   2> 6942 T99 oasc.CoreContainer.register registering core: collection1
[junit4:junit4]   2> 6942 T99 oasc.ZkController.register Register shard - core:collection1 address:http://127.0.0.1:19972/solr shardId:shard1
[junit4:junit4]   2> 6944 T99 oascc.SolrZkClient.makePath makePath: /collections/collection1/leader_elect/shard1/election
[junit4:junit4]   2> 6964 T105 oazs.PrepRequestProcessor.pRequest Got user-level KeeperException when processing sessionid:0x13ad687116a0003 type:delete cxid:0x43 zxid:0xfffffffffffffffe txntype:unknown reqpath:n/a Error Path:/solr/collections/collection1/leaders Error:KeeperErrorCode = NoNode for /solr/collections/collection1/leaders
[junit4:junit4]   2> 6965 T99 oasc.ShardLeaderElectionContext.runLeaderProcess Running the leader process.
[junit4:junit4]   2> 6966 T105 oazs.PrepRequestProcessor.pRequest Got user-level KeeperException when processing sessionid:0x13ad687116a0003 type:create cxid:0x44 zxid:0xfffffffffffffffe txntype:unknown reqpath:n/a Error Path:/solr/overseer Error:KeeperErrorCode = NodeExists for /solr/overseer
[junit4:junit4]   2> 6977 T99 oasc.ShardLeaderElectionContext.waitForReplicasToComeUp Enough replicas found to continue.
[junit4:junit4]   2> 6977 T99 oasc.ShardLeaderElectionContext.runLeaderProcess I may be the new leader - try and sync
[junit4:junit4]   2> 6978 T99 oasc.SyncStrategy.sync Sync replicas to http://127.0.0.1:19972/solr/collection1/
[junit4:junit4]   2> 6978 T99 oasc.SyncStrategy.syncReplicas Sync Success - now sync replicas to me
[junit4:junit4]   2> 6979 T99 oasc.SyncStrategy.syncToMe http://127.0.0.1:19972/solr/collection1/ has no replicas
[junit4:junit4]   2> 6980 T99 oasc.ShardLeaderElectionContext.runLeaderProcess I am the new leader: http://127.0.0.1:19972/solr/collection1/
[junit4:junit4]   2> 6980 T99 oascc.SolrZkClient.makePath makePath: /collections/collection1/leaders/shard1
[junit4:junit4]   2> 6986 T105 oazs.PrepRequestProcessor.pRequest Got user-level KeeperException when processing sessionid:0x13ad687116a0003 type:create cxid:0x4e zxid:0xfffffffffffffffe txntype:unknown reqpath:n/a Error Path:/solr/overseer Error:KeeperErrorCode = NodeExists for /solr/overseer
[junit4:junit4]   2> 7391 T121 oascc.ZkStateReader.updateClusterState Updating cloud state from ZooKeeper... 
[junit4:junit4]   2> 7432 T120 oascc.ZkStateReader$2.process A cluster state change has occurred - updating... (2)
[junit4:junit4]   2> 7432 T137 oascc.ZkStateReader$2.process A cluster state change has occurred - updating... (2)
[junit4:junit4]   2> 7454 T99 oasc.ZkController.register We are http://127.0.0.1:19972/solr/collection1/ and leader is http://127.0.0.1:19972/solr/collection1/
[junit4:junit4]   2> 7454 T99 oasc.ZkController.register No LogReplay needed for core=collection1 baseURL=http://127.0.0.1:19972/solr
[junit4:junit4]   2> 7455 T99 oasc.ZkController.checkRecovery I am the leader, no recovery necessary
[junit4:junit4]   2> 7455 T99 oasc.ZkController.publish numShards not found on descriptor - reading it from system property
[junit4:junit4]   2> 7462 T99 oascc.ZkStateReader.updateClusterState Updating cloud state from ZooKeeper... 
[junit4:junit4]   2> 7463 T99 oass.SolrDispatchFilter.init user.dir=/usr/home/hudson/hudson-slave/workspace/Lucene-Solr-Tests-4.x-java7/solr/build/solr-core/test/J0
[junit4:junit4]   2> 7464 T99 oass.SolrDispatchFilter.init SolrDispatchFilter.init() done
[junit4:junit4]   2> 7464 T99 oascsi.HttpClientUtil.createClient Creating new http client, config:maxConnections=128&maxConnectionsPerHost=32&followRedirects=false
[junit4:junit4]   2> 7590 T99 oejs.Server.doStart jetty-8.1.2.v20120308
[junit4:junit4]   2> 7593 T99 oejs.AbstractConnector.doStart Started SelectChannelConnector@0.0.0.0:64816
[junit4:junit4]   2> 7594 T99 oasc.SolrResourceLoader.locateSolrHome JNDI not configured for solr (NoInitialContextEx)
[junit4:junit4]   2> 7594 T99 oasc.SolrResourceLoader.locateSolrHome using system property solr.solr.home: /usr/home/hudson/hudson-slave/workspace/Lucene-Solr-Tests-4.x-java7/solr/build/solr-core/test/J0/./solrtest-jetty2-1352218914175
[junit4:junit4]   2> 7594 T99 oasc.SolrResourceLoader.<init> new SolrResourceLoader for deduced Solr Home: '/usr/home/hudson/hudson-slave/workspace/Lucene-Solr-Tests-4.x-java7/solr/build/solr-core/test/J0/./solrtest-jetty2-1352218914175/'
[junit4:junit4]   2> 7624 T99 oass.SolrDispatchFilter.init SolrDispatchFilter.init()
[junit4:junit4]   2> 7625 T99 oasc.SolrResourceLoader.locateSolrHome JNDI not configured for solr (NoInitialContextEx)
[junit4:junit4]   2> 7625 T99 oasc.SolrResourceLoader.locateSolrHome using system property solr.solr.home: /usr/home/hudson/hudson-slave/workspace/Lucene-Solr-Tests-4.x-java7/solr/build/solr-core/test/J0/./solrtest-jetty2-1352218914175
[junit4:junit4]   2> 7625 T99 oasc.CoreContainer$Initializer.initialize looking for solr.xml: /usr/home/hudson/hudson-slave/workspace/Lucene-Solr-Tests-4.x-java7/solr/build/solr-core/test/J0/./solrtest-jetty2-1352218914175/solr.xml
[junit4:junit4]   2> 7626 T99 oasc.CoreContainer.<init> New CoreContainer 764890953
[junit4:junit4]   2> 7626 T99 oasc.CoreContainer.load Loading CoreContainer using Solr Home: '/usr/home/hudson/hudson-slave/workspace/Lucene-Solr-Tests-4.x-java7/solr/build/solr-core/test/J0/./solrtest-jetty2-1352218914175/'
[junit4:junit4]   2> 7627 T99 oasc.SolrResourceLoader.<init> new SolrResourceLoader for directory: '/usr/home/hudson/hudson-slave/workspace/Lucene-Solr-Tests-4.x-java7/solr/build/solr-core/test/J0/./solrtest-jetty2-1352218914175/'
[junit4:junit4]   2> 7651 T99 oasc.CoreContainer.load Registering Log Listener
[junit4:junit4]   2> 7662 T99 oasc.CoreContainer.initZooKeeper Zookeeper client=127.0.0.1:64775/solr
[junit4:junit4]   2> 7663 T99 oaz.ZooKeeper.<init> Initiating client connection, connectString=127.0.0.1:64775/solr sessionTimeout=5000 watcher=org.apache.solr.common.cloud.ConnectionManager@579af7c4
[junit4:junit4]   2> 7664 T152 oaz.ClientCnxn$SendThread.startConnect Opening socket connection to server /127.0.0.1:64775
[junit4:junit4]   2> 7664 T99 oascc.ConnectionManager.waitForConnected Waiting for client to connect to ZooKeeper
[junit4:junit4]   2> 7665 T152 oaz.ClientCnxn$SendThread.primeConnection Socket connection established to localhost/127.0.0.1:64775, initiating session
[junit4:junit4]   2> 7666 T101 oazs.NIOServerCnxn$Factory.run Accepted socket connection from /140.211.11.196:36848
[junit4:junit4]   2> 7666 T101 oazs.NIOServerCnxn.readConnectRequest Client attempting to establish new session at /140.211.11.196:36848
[junit4:junit4]   2> 7668 T103 oazs.NIOServerCnxn.finishSessionInit Established session 0x13ad687116a0004 with negotiated timeout 5000 for client /140.211.11.196:36848
[junit4:junit4]   2> 7668 T152 oaz.ClientCnxn$SendThread.readConnectResult Session establishment complete on server localhost/127.0.0.1:64775, sessionid = 0x13ad687116a0004, negotiated timeout = 5000
[junit4:junit4]   2> 7668 T153 oascc.ConnectionManager.process Watcher org.apache.solr.common.cloud.ConnectionManager@579af7c4 name:ZooKeeperConnection Watcher:127.0.0.1:64775/solr got event WatchedEvent state:SyncConnected type:None path:null path:null type:None
[junit4:junit4]   2> 7669 T99 oascc.ConnectionManager.waitForConnected Client is connected to ZooKeeper
[junit4:junit4]   2> 7670 T105 oazs.PrepRequestProcessor.pRequest Got user-level KeeperException when processing sessionid:0x13ad687116a0004 type:create cxid:0x1 zxid:0xfffffffffffffffe txntype:unknown reqpath:n/a Error Path:/solr/overseer Error:KeeperErrorCode = NodeExists for /solr/overseer
[junit4:junit4]   2> 7679 T105 oazs.PrepRequestProcessor.pRequest Got user-level KeeperException when processing sessionid:0x13ad687116a0004 type:create cxid:0x2 zxid:0xfffffffffffffffe txntype:unknown reqpath:n/a Error Path:/solr/overseer Error:KeeperErrorCode = NodeExists for /solr/overseer
[junit4:junit4]   2> 7687 T99 oasc.ZkController.createEphemeralLiveNode Register node as live in ZooKeeper:/live_nodes/127.0.0.1:64816_solr
[junit4:junit4]   2> 7688 T105 oazs.PrepRequestProcessor.pRequest Got user-level KeeperException when processing sessionid:0x13ad687116a0004 type:delete cxid:0x4 zxid:0xfffffffffffffffe txntype:unknown reqpath:n/a Error Path:/solr/live_nodes/127.0.0.1:64816_solr Error:KeeperErrorCode = NoNode for /solr/live_nodes/127.0.0.1:64816_solr
[junit4:junit4]   2> 7689 T99 oascc.SolrZkClient.makePath makePath: /live_nodes/127.0.0.1:64816_solr
[junit4:junit4]   2> 7693 T137 oascc.ZkStateReader$3.process Updating live nodes... (3)
[junit4:junit4]   2> 7693 T120 oascc.ZkStateReader$3.process Updating live nodes... (3)
[junit4:junit4]   2> 7693 T99 oashc.HttpShardHandlerFactory.getParameter Setting socketTimeout to: 0
[junit4:junit4]   2> 7694 T99 oashc.HttpShardHandlerFactory.getParameter Setting urlScheme to: http://
[junit4:junit4]   2> 7694 T99 oashc.HttpShardHandlerFactory.getParameter Setting connTimeout to: 0
[junit4:junit4]   2> 7695 T99 oashc.HttpShardHandlerFactory.getParameter Setting maxConnectionsPerHost to: 20
[junit4:junit4]   2> 7695 T99 oashc.HttpShardHandlerFactory.getParameter Setting corePoolSize to: 0
[junit4:junit4]   2> 7695 T99 oashc.HttpShardHandlerFactory.getParameter Setting maximumPoolSize to: 2147483647
[junit4:junit4]   2> 7696 T99 oashc.HttpShardHandlerFactory.getParameter Setting maxThreadIdleTime to: 5
[junit4:junit4]   2> 7696 T99 oashc.HttpShardHandlerFactory.getParameter Setting sizeOfQueue to: -1
[junit4:junit4]   2> 7696 T99 oashc.HttpShardHandlerFactory.getParameter Setting fairnessPolicy to: false
[junit4:junit4]   2> 7697 T99 oascsi.HttpClientUtil.createClient Creating new http client, config:maxConnectionsPerHost=20&maxConnections=10000&socketTimeout=0&connTimeout=0&retry=false
[junit4:junit4]   2> 7714 T99 oascc.ZkStateReader.createClusterStateWatchersAndUpdate Updating cluster state from ZooKeeper... 
[junit4:junit4]   2> 7720 T99 oasc.CoreContainer.create Creating SolrCore 'collection1' using instanceDir: /usr/home/hudson/hudson-slave/workspace/Lucene-Solr-Tests-4.x-java7/solr/build/solr-core/test/J0/./solrtest-jetty2-1352218914175/collection1
[junit4:junit4]   2> 7720 T99 oasc.ZkController.createCollectionZkNode Check for collection zkNode:collection1
[junit4:junit4]   2> 7721 T99 oasc.ZkController.createCollectionZkNode Collection zkNode exists
[junit4:junit4]   2> 7721 T99 oasc.ZkController.readConfigName Load collection config from:/collections/collection1
[junit4:junit4]   2> 7723 T99 oasc.SolrResourceLoader.<init> new SolrResourceLoader for directory: '/usr/home/hudson/hudson-slave/workspace/Lucene-Solr-Tests-4.x-java7/solr/build/solr-core/test/J0/./solrtest-jetty2-1352218914175/collection1/'
[junit4:junit4]   2> 7724 T99 oasc.SolrResourceLoader.replaceClassLoader Adding 'file:/usr/home/hudson/hudson-slave/workspace/Lucene-Solr-Tests-4.x-java7/solr/build/solr-core/test/J0/solrtest-jetty2-1352218914175/collection1/lib/classes/' to classloader
[junit4:junit4]   2> 7724 T99 oasc.SolrResourceLoader.replaceClassLoader Adding 'file:/usr/home/hudson/hudson-slave/workspace/Lucene-Solr-Tests-4.x-java7/solr/build/solr-core/test/J0/solrtest-jetty2-1352218914175/collection1/lib/README' to classloader
[junit4:junit4]   2> 7763 T99 oasc.SolrConfig.<init> Using Lucene MatchVersion: LUCENE_41
[junit4:junit4]   2> 7831 T99 oasc.SolrConfig.<init> Loaded SolrConfig: solrconfig.xml
[junit4:junit4]   2> 7932 T99 oass.IndexSchema.readSchema Reading Solr Schema
[junit4:junit4]   2> 7939 T99 oass.IndexSchema.readSchema Schema name=test
[junit4:junit4]   2> 7946 T121 oascc.ZkStateReader.updateClusterState Updating cloud state from ZooKeeper... 
[junit4:junit4]   2> 7947 T121 oasc.Overseer$ClusterStateUpdater.updateState Update state numShards=2 message={
[junit4:junit4]   2> 	  "operation":"state",
[junit4:junit4]   2> 	  "numShards":"2",
[junit4:junit4]   2> 	  "shard":"shard1",
[junit4:junit4]   2> 	  "roles":null,
[junit4:junit4]   2> 	  "state":"active",
[junit4:junit4]   2> 	  "core":"collection1",
[junit4:junit4]   2> 	  "collection":"collection1",
[junit4:junit4]   2> 	  "node_name":"127.0.0.1:19972_solr",
[junit4:junit4]   2> 	  "base_url":"http://127.0.0.1:19972/solr"}
[junit4:junit4]   2> 7961 T137 oascc.ZkStateReader$2.process A cluster state change has occurred - updating... (3)
[junit4:junit4]   2> 7961 T120 oascc.ZkStateReader$2.process A cluster state change has occurred - updating... (3)
[junit4:junit4]   2> 7961 T153 oascc.ZkStateReader$2.process A cluster state change has occurred - updating... (3)
[junit4:junit4]   2> 8386 T99 oass.OpenExchangeRatesOrgProvider.init Initialized with rates=open-exchange-rates.json, refreshInterval=1440.
[junit4:junit4]   2> 8395 T99 oass.IndexSchema.readSchema default search field in schema is text
[junit4:junit4]   2> 8398 T99 oass.IndexSchema.readSchema unique key field: id
[junit4:junit4]   2> 8414 T99 oass.FileExchangeRateProvider.reload Reloading exchange rates from file currency.xml
[junit4:junit4]   2> 8419 T99 oass.FileExchangeRateProvider.reload Reloading exchange rates from file currency.xml
[junit4:junit4]   2> 8423 T99 oass.OpenExchangeRatesOrgProvider.reload Reloading exchange rates from open-exchange-rates.json
[junit4:junit4]   2> 8425 T99 oass.OpenExchangeRatesOrgProvider.reload Reloading exchange rates from open-exchange-rates.json
[junit4:junit4]   2> 8427 T99 oasc.SolrCore.<init> [collection1] Opening new SolrCore at /usr/home/hudson/hudson-slave/workspace/Lucene-Solr-Tests-4.x-java7/solr/build/solr-core/test/J0/./solrtest-jetty2-1352218914175/collection1/, dataDir=./org.apache.solr.cloud.BasicDistributedZkTest-1352218906703/jetty2/
[junit4:junit4]   2> 8427 T99 oasc.JmxMonitoredMap.<init> JMX monitoring is enabled. Adding Solr mbeans to JMX Server: com.sun.jmx.mbeanserver.JmxMBeanServer@2691cde4
[junit4:junit4]   2> 8428 T99 oasc.SolrCore.getNewIndexDir New index directory detected: old=null new=./org.apache.solr.cloud.BasicDistributedZkTest-1352218906703/jetty2/index/
[junit4:junit4]   2> 8429 T99 oasc.SolrCore.initIndex WARNING [collection1] Solr index directory './org.apache.solr.cloud.BasicDistributedZkTest-1352218906703/jetty2/index' doesn't exist. Creating new index...
[junit4:junit4]   2> 8430 T99 oasc.CachingDirectoryFactory.get return new directory for /usr/home/hudson/hudson-slave/workspace/Lucene-Solr-Tests-4.x-java7/solr/build/solr-core/test/J0/./org.apache.solr.cloud.BasicDistributedZkTest-1352218906703/jetty2/index forceNew:false
[junit4:junit4]   2> 8436 T99 oasc.SolrDeletionPolicy.onCommit SolrDeletionPolicy.onCommit: commits:num=1
[junit4:junit4]   2> 		commit{dir=/usr/home/hudson/hudson-slave/workspace/Lucene-Solr-Tests-4.x-java7/solr/build/solr-core/test/J0/org.apache.solr.cloud.BasicDistributedZkTest-1352218906703/jetty2/index,segFN=segments_1,generation=1,filenames=[segments_1]
[junit4:junit4]   2> 8436 T99 oasc.SolrDeletionPolicy.updateCommits newest commit = 1
[junit4:junit4]   2> 8437 T99 oasc.SolrCore.initWriters created xml: solr.XMLResponseWriter
[junit4:junit4]   2> 8440 T99 oasup.UpdateRequestProcessorChain.init inserting DistributedUpdateProcessorFactory into updateRequestProcessorChain "dedupe"
[junit4:junit4]   2> 8441 T99 oasup.UpdateRequestProcessorChain.init inserting DistributedUpdateProcessorFactory into updateRequestProcessorChain "dedupe-allfields"
[junit4:junit4]   2> 8442 T99 oasup.UpdateRequestProcessorChain.init inserting DistributedUpdateProcessorFactory into updateRequestProcessorChain "stored_sig"
[junit4:junit4]   2> 8442 T99 oasup.UpdateRequestProcessorChain.init inserting DistributedUpdateProcessorFactory into updateRequestProcessorChain "uniq-fields"
[junit4:junit4]   2> 8443 T99 oasup.UpdateRequestProcessorChain.init inserting DistributedUpdateProcessorFactory into updateRequestProcessorChain "distrib-dup-test-chain-implicit"
[junit4:junit4]   2> 8444 T99 oasc.RequestHandlers.initHandlersFromConfig adding lazy requestHandler: solr.ReplicationHandler
[junit4:junit4]   2> 8445 T99 oasc.RequestHandlers.initHandlersFromConfig created /replication: solr.ReplicationHandler
[junit4:junit4]   2> 8446 T99 oasc.RequestHandlers.initHandlersFromConfig created standard: solr.StandardRequestHandler
[junit4:junit4]   2> 8447 T99 oasc.RequestHandlers.initHandlersFromConfig created /get: solr.RealTimeGetHandler
[junit4:junit4]   2> 8448 T99 oasc.RequestHandlers.initHandlersFromConfig created dismax: solr.SearchHandler
[junit4:junit4]   2> 8449 T99 oasc.RequestHandlers.initHandlersFromConfig created mock: org.apache.solr.core.MockQuerySenderListenerReqHandler
[junit4:junit4]   2> 8450 T99 oasc.RequestHandlers.initHandlersFromConfig created /admin/: org.apache.solr.handler.admin.AdminHandlers
[junit4:junit4]   2> 8451 T99 oasc.RequestHandlers.initHandlersFromConfig created defaults: solr.StandardRequestHandler
[junit4:junit4]   2> 8451 T99 oasc.RequestHandlers.initHandlersFromConfig adding lazy requestHandler: solr.StandardRequestHandler
[junit4:junit4]   2> 8452 T99 oasc.RequestHandlers.initHandlersFromConfig created lazy: solr.StandardRequestHandler
[junit4:junit4]   2> 8453 T99 oasc.RequestHandlers.initHandlersFromConfig created /update: solr.UpdateRequestHandler
[junit4:junit4]   2> 8454 T99 oasc.RequestHandlers.initHandlersFromConfig created /terms: org.apache.solr.handler.component.SearchHandler
[junit4:junit4]   2> 8455 T99 oasc.RequestHandlers.initHandlersFromConfig created spellCheckCompRH: org.apache.solr.handler.component.SearchHandler
[junit4:junit4]   2> 8456 T99 oasc.RequestHandlers.initHandlersFromConfig created spellCheckCompRH_Direct: org.apache.solr.handler.component.SearchHandler
[junit4:junit4]   2> 8457 T99 oasc.RequestHandlers.initHandlersFromConfig created spellCheckWithWordbreak: org.apache.solr.handler.component.SearchHandler
[junit4:junit4]   2> 8458 T99 oasc.RequestHandlers.initHandlersFromConfig created spellCheckWithWordbreak_Direct: org.apache.solr.handler.component.SearchHandler
[junit4:junit4]   2> 8458 T99 oasc.RequestHandlers.initHandlersFromConfig created spellCheckCompRH1: org.apache.solr.handler.component.SearchHandler
[junit4:junit4]   2> 8459 T99 oasc.RequestHandlers.initHandlersFromConfig created tvrh: org.apache.solr.handler.component.SearchHandler
[junit4:junit4]   2> 8460 T99 oasc.RequestHandlers.initHandlersFromConfig created /mlt: solr.MoreLikeThisHandler
[junit4:junit4]   2> 8460 T99 oasc.RequestHandlers.initHandlersFromConfig created /debug/dump: solr.DumpRequestHandler
[junit4:junit4]   2> 8471 T99 oashl.XMLLoader.init xsltCacheLifetimeSeconds=60
[junit4:junit4]   2> 8475 T99 oasc.SolrCore.initDeprecatedSupport WARNING solrconfig.xml uses deprecated <admin/gettableFiles>, Please update your config to use the ShowFileRequestHandler.
[junit4:junit4]   2> 8477 T99 oasc.SolrCore.initDeprecatedSupport WARNING adding ShowFileRequestHandler with hidden files: [SCHEMA.XML, OLD_SYNONYMS.TXT, STOPWORDS.TXT, PROTWORDS.TXT, OPEN-EXCHANGE-RATES.JSON, SYNONYMS.TXT, CURRENCY.XML, MAPPING-ISOLATIN1ACCENT.TXT]
[junit4:junit4]   2> 8480 T99 oass.SolrIndexSearcher.<init> Opening Searcher@604f05f8 main
[junit4:junit4]   2> 8482 T99 oasu.CommitTracker.<init> Hard AutoCommit: disabled
[junit4:junit4]   2> 8482 T99 oasu.CommitTracker.<init> Soft AutoCommit: disabled
[junit4:junit4]   2> 8483 T99 oashc.SpellCheckComponent.inform Initializing spell checkers
[junit4:junit4]   2> 8505 T99 oass.DirectSolrSpellChecker.init init: {name=direct,classname=DirectSolrSpellChecker,field=lowerfilt,minQueryLength=3}
[junit4:junit4]   2> 8559 T158 oasc.SolrCore.registerSearcher [collection1] Registered new searcher Searcher@604f05f8 main{StandardDirectoryReader(segments_1:1)}
[junit4:junit4]   2> 8567 T99 oasc.ZkController.publish numShards not found on descriptor - reading it from system property
[junit4:junit4]   2> 8969 T121 oascc.ZkStateReader.updateClusterState Updating cloud state from ZooKeeper... 
[junit4:junit4]   2> 8971 T121 oasc.Overseer$ClusterStateUpdater.updateState Update state numShards=2 message={
[junit4:junit4]   2> 	  "operation":"state",
[junit4:junit4]   2> 	  "numShards":"2",
[junit4:junit4]   2> 	  "shard":null,
[junit4:junit4]   2> 	  "roles":null,
[junit4:junit4]   2> 	  "state":"down",
[junit4:junit4]   2> 	  "core":"collection1",
[junit4:junit4]   2> 	  "collection":"collection1",
[junit4:junit4]   2> 	  "node_name":"127.0.0.1:64816_solr",
[junit4:junit4]   2> 	  "base_url":"http://127.0.0.1:64816/solr"}
[junit4:junit4]   2> 8985 T120 oascc.ZkStateReader$2.process A cluster state change has occurred - updating... (3)
[junit4:junit4]   2> 8985 T153 oascc.ZkStateReader$2.process A cluster state change has occurred - updating... (3)
[junit4:junit4]   2> 8985 T137 oascc.ZkStateReader$2.process A cluster state change has occurred - updating... (3)
[junit4:junit4]   2> 9071 T99 oasc.CoreContainer.register registering core: collection1
[junit4:junit4]   2> 9071 T99 oasc.ZkController.register Register shard - core:collection1 address:http://127.0.0.1:64816/solr shardId:shard2
[junit4:junit4]   2> 9073 T99 oascc.SolrZkClient.makePath makePath: /collections/collection1/leader_elect/shard2/election
[junit4:junit4]   2> 9099 T105 oazs.PrepRequestProcessor.pRequest Got user-level KeeperException when processing sessionid:0x13ad687116a0004 type:delete cxid:0x42 zxid:0xfffffffffffffffe txntype:unknown reqpath:n/a Error Path:/solr/collections/collection1/leaders/shard2 Error:KeeperErrorCode = NoNode for /solr/collections/collection1/leaders/shard2
[junit4:junit4]   2> 9100 T99 oasc.ShardLeaderElectionContext.runLeaderProcess Running the leader process.
[junit4:junit4]   2> 9101 T105 oazs.PrepRequestProcessor.pRequest Got user-level KeeperException when processing sessionid:0x13ad687116a0004 type:create cxid:0x43 zxid:0xfffffffffffffffe txntype:unknown reqpath:n/a Error Path:/solr/overseer Error:KeeperErrorCode = NodeExists for /solr/overseer
[junit4:junit4]   2> 9111 T99 oasc.ShardLeaderElectionContext.waitForReplicasToComeUp Enough replicas found to continue.
[junit4:junit4]   2> 9112 T99 oasc.ShardLeaderElectionContext.runLeaderProcess I may be the new leader - try and sync
[junit4:junit4]   2> 9112 T99 oasc.SyncStrategy.sync Sync replicas to http://127.0.0.1:64816/solr/collection1/
[junit4:junit4]   2> 9113 T99 oasc.SyncStrategy.syncReplicas Sync Success - now sync replicas to me
[junit4:junit4]   2> 9113 T99 oasc.SyncStrategy.syncToMe http://127.0.0.1:64816/solr/collection1/ has no replicas
[junit4:junit4]   2> 9114 T99 oasc.ShardLeaderElectionContext.runLeaderProcess I am the new leader: http://127.0.0.1:64816/solr/collection1/
[junit4:junit4]   2> 9114 T99 oascc.SolrZkClient.makePath makePath: /collections/collection1/leaders/shard2
[junit4:junit4]   2> 9118 T105 oazs.PrepRequestProcessor.pRequest Got user-level KeeperException when processing sessionid:0x13ad687116a0004 type:create cxid:0x4c zxid:0xfffffffffffffffe txntype:unknown reqpath:n/a Error Path:/solr/overseer Error:KeeperErrorCode = NodeExists for /solr/overseer
[junit4:junit4]   2> 9491 T121 oascc.ZkStateReader.updateClusterState Updating cloud state from ZooKeeper... 
[junit4:junit4]   2> 9519 T120 oascc.ZkStateReader$2.process A cluster state change has occurred - updating... (3)
[junit4:junit4]   2> 9519 T153 oascc.ZkStateReader$2.process A cluster state change has occurred - updating... (3)
[junit4:junit4]   2> 9519 T137 oascc.ZkStateReader$2.process A cluster state change has occurred - updating... (3)
[junit4:junit4]   2> 9537 T99 oasc.ZkController.register We are http://127.0.0.1:64816/solr/collection1/ and leader is http://127.0.0.1:64816/solr/collection1/
[junit4:junit4]   2> 9537 T99 oasc.ZkController.register No LogReplay needed for core=collection1 baseURL=http://127.0.0.1:64816/solr
[junit4:junit4]   2> 9538 T99 oasc.ZkController.checkRecovery I am the leader, no recovery necessary
[junit4:junit4]   2> 9538 T99 oasc.ZkController.publish numShards not found on descriptor - reading it from system property
[junit4:junit4]   2> 9540 T99 oascc.ZkStateReader.updateClusterState Updating cloud state from ZooKeeper... 
[junit4:junit4]   2> 9541 T99 oass.SolrDispatchFilter.init user.dir=/usr/home/hudson/hudson-slave/workspace/Lucene-Solr-Tests-4.x-java7/solr/build/solr-core/test/J0
[junit4:junit4]   2> 9541 T99 oass.SolrDispatchFilter.init SolrDispatchFilter.init() done
[junit4:junit4]   2> 9542 T99 oascsi.HttpClientUtil.createClient Creating new http client, config:maxConnections=128&maxConnectionsPerHost=32&followRedirects=false
[junit4:junit4]   2> 9673 T99 oejs.Server.doStart jetty-8.1.2.v20120308
[junit4:junit4]   2> 9676 T99 oejs.AbstractConnector.doStart Started SelectChannelConnector@0.0.0.0:18910
[junit4:junit4]   2> 9677 T99 oasc.SolrResourceLoader.locateSolrHome JNDI not configured for solr (NoInitialContextEx)
[junit4:junit4]   2> 9677 T99 oasc.SolrResourceLoader.locateSolrHome using system property solr.solr.home: /usr/home/hudson/hudson-slave/workspace/Lucene-Solr-Tests-4.x-java7/solr/build/solr-core/test/J0/./solrtest-jetty3-1352218916255
[junit4:junit4]   2> 9678 T99 oasc.SolrResourceLoader.<init> new SolrResourceLoader for deduced Solr Home: '/usr/home/hudson/hudson-slave/workspace/Lucene-Solr-Tests-4.x-java7/solr/build/solr-core/test/J0/./solrtest-jetty3-1352218916255/'
[junit4:junit4]   2> 9719 T99 oass.SolrDispatchFilter.init SolrDispatchFilter.init()
[junit4:junit4]   2> 9719 T99 oasc.SolrResourceLoader.locateSolrHome JNDI not configured for solr (NoInitialContextEx)
[junit4:junit4]   2> 9720 T99 oasc.SolrResourceLoader.locateSolrHome using system property solr.solr.home: /usr/home/hudson/hudson-slave/workspace/Lucene-Solr-Tests-4.x-java7/solr/build/solr-core/test/J0/./solrtest-jetty3-1352218916255
[junit4:junit4]   2> 9720 T99 oasc.CoreContainer$Initializer.initialize looking for solr.xml: /usr/home/hudson/hudson-slave/workspace/Lucene-Solr-Tests-4.x-java7/solr/build/solr-core/test/J0/./solrtest-jetty3-1352218916255/solr.xml
[junit4:junit4]   2> 9720 T99 oasc.CoreContainer.<init> New CoreContainer 1780142497
[junit4:junit4]   2> 9721 T99 oasc.CoreContainer.load Loading CoreContainer using Solr Home: '/usr/home/hudson/hudson-slave/workspace/Lucene-Solr-Tests-4.x-java7/solr/build/solr-core/test/J0/./solrtest-jetty3-1352218916255/'
[junit4:junit4]   2> 9721 T99 oasc.SolrResourceLoader.<init> new SolrResourceLoader for directory: '/usr/home/hudson/hudson-slave/workspace/Lucene-Solr-Tests-4.x-java7/solr/build/solr-core/test/J0/./solrtest-jetty3-1352218916255/'
[junit4:junit4]   2> 9749 T99 oasc.CoreContainer.load Registering Log Listener
[junit4:junit4]   2> 9762 T99 oasc.CoreContainer.initZooKeeper Zookeeper client=127.0.0.1:64775/solr
[junit4:junit4]   2> 9763 T99 oaz.ZooKeeper.<init> Initiating client connection, connectString=127.0.0.1:64775/solr sessionTimeout=5000 watcher=org.apache.solr.common.cloud.ConnectionManager@699ae127
[junit4:junit4]   2> 9764 T168 oaz.ClientCnxn$SendThread.startConnect Opening socket connection to server /127.0.0.1:64775
[junit4:junit4]   2> 9763 T99 oascc.ConnectionManager.waitForConnected Waiting for client to connect to ZooKeeper
[junit4:junit4]   2> 9765 T168 oaz.ClientCnxn$SendThread.primeConnection Socket connection established to localhost/127.0.0.1:64775, initiating session
[junit4:junit4]   2> 9765 T101 oazs.NIOServerCnxn$Factory.run Accepted socket connection from /140.211.11.196:18369
[junit4:junit4]   2> 9765 T101 oazs.NIOServerCnxn.readConnectRequest Client attempting to establish new session at /140.211.11.196:18369
[junit4:junit4]   2> 9769 T103 oazs.NIOServerCnxn.finishSessionInit Established session 0x13ad687116a0005 with negotiated timeout 5000 for client /140.211.11.196:18369
[junit4:junit4]   2> 9769 T168 oaz.ClientCnxn$SendThread.readConnectResult Session establishment complete on server localhost/127.0.0.1:64775, sessionid = 0x13ad687116a0005, negotiated timeout = 5000
[junit4:junit4]   2> 9770 T169 oascc.ConnectionManager.process Watcher org.apache.solr.common.cloud.ConnectionManager@699ae127 name:ZooKeeperConnection Watcher:127.0.0.1:64775/solr got event WatchedEvent state:SyncConnected type:None path:null path:null type:None
[junit4:junit4]   2> 9770 T99 oascc.ConnectionManager.waitForConnected Client is connected to ZooKeeper
[junit4:junit4]   2> 9771 T105 oazs.PrepRequestProcessor.pRequest Got user-level KeeperException when processing sessionid:0x13ad687116a0005 type:create cxid:0x1 zxid:0xfffffffffffffffe txntype:unknown reqpath:n/a Error Path:/solr/overseer Error:KeeperErrorCode = NodeExists for /solr/overseer
[junit4:junit4]   2> 9772 T105 oazs.PrepRequestProcessor.pRequest Got user-level KeeperException when processing sessionid:0x13ad687116a0005 type:create cxid:0x2 zxid:0xfffffffffffffffe txntype:unknown reqpath:n/a Error Path:/solr/overseer Error:KeeperErrorCode = NodeExists for /solr/overseer
[junit4:junit4]   2> 9774 T99 oasc.ZkController.createEphemeralLiveNode Register node as live in ZooKeeper:/live_nodes/127.0.0.1:18910_solr
[junit4:junit4]   2> 9774 T105 oazs.PrepRequestProcessor.pRequest Got user-level KeeperException when processing sessionid:0x13ad687116a0005 type:delete cxid:0x4 zxid:0xfffffffffffffffe txntype:unknown reqpath:n/a Error Path:/solr/live_nodes/127.0.0.1:18910_solr Error:KeeperErrorCode = NoNode for /solr/live_nodes/127.0.0.1:18910_solr
[junit4:junit4]   2> 9783 T99 oascc.SolrZkClient.makePath makePath: /live_nodes/127.0.0.1:18910_solr
[junit4:junit4]   2> 9786 T137 oascc.ZkStateReader$3.process Updating live nodes... (4)
[junit4:junit4]   2> 9786 T120 oascc.ZkStateReader$3.process Updating live nodes... (4)
[junit4:junit4]   2> 9786 T153 oascc.ZkStateReader$3.process Updating live nodes... (4)
[junit4:junit4]   2> 9787 T99 oashc.HttpShardHandlerFactory.getParameter Setting socketTimeout to: 0
[junit4:junit4]   2> 9787 T99 oashc.HttpShardHandlerFactory.getParameter Setting urlScheme to: http://
[junit4:junit4]   2> 9787 T99 oashc.HttpShardHandlerFactory.getParameter Setting connTimeout to: 0
[junit4:junit4]   2> 9788 T99 oashc.HttpShardHandlerFactory.getParameter Setting maxConnectionsPerHost to: 20
[junit4:junit4]   2> 9788 T99 oashc.HttpShardHandlerFactory.getParameter Setting corePoolSize to: 0
[junit4:junit4]   2> 9788 T99 oashc.HttpShardHandlerFactory.getParameter Setting maximumPoolSize to: 2147483647
[junit4:junit4]   2> 9789 T99 oashc.HttpShardHandlerFactory.getParameter Setting maxThreadIdleTime to: 5
[junit4:junit4]   2> 9789 T99 oashc.HttpShardHandlerFactory.getParameter Setting sizeOfQueue to: -1
[junit4:junit4]   2> 9789 T99 oashc.HttpShardHandlerFactory.getParameter Setting fairnessPolicy to: false
[junit4:junit4]   2> 9790 T99 oascsi.HttpClientUtil.createClient Creating new http client, config:maxConnectionsPerHost=20&maxConnections=10000&socketTimeout=0&connTimeout=0&retry=false
[junit4:junit4]   2> 9806 T99 oascc.ZkStateReader.createClusterStateWatchersAndUpdate Updating cluster state from ZooKeeper... 
[junit4:junit4]   2> 9812 T99 oasc.CoreContainer.create Creating SolrCore 'collection1' using instanceDir: /usr/home/hudson/hudson-slave/workspace/Lucene-Solr-Tests-4.x-java7/solr/build/solr-core/test/J0/./solrtest-jetty3-1352218916255/collection1
[junit4:junit4]   2> 9813 T99 oasc.ZkController.createCollectionZkNode Check for collection zkNode:collection1
[junit4:junit4]   2> 9813 T99 oasc.ZkController.createCollectionZkNode Collection zkNode exists
[junit4:junit4]   2> 9814 T99 oasc.ZkController.readConfigName Load collection config from:/collections/collection1
[junit4:junit4]   2> 9815 T99 oasc.SolrResourceLoader.<init> new SolrResourceLoader for directory: '/usr/home/hudson/hudson-slave/workspace/Lucene-Solr-Tests-4.x-java7/solr/build/solr-core/test/J0/./solrtest-jetty3-1352218916255/collection1/'
[junit4:junit4]   2> 9816 T99 oasc.SolrResourceLoader.replaceClassLoader Adding 'file:/usr/home/hudson/hudson-slave/workspace/Lucene-Solr-Tests-4.x-java7/solr/build/solr-core/test/J0/solrtest-jetty3-1352218916255/collection1/lib/README' to classloader
[junit4:junit4]   2> 9817 T99 oasc.SolrResourceLoader.replaceClassLoader Adding 'file:/usr/home/hudson/hudson-slave/workspace/Lucene-Solr-Tests-4.x-java7/solr/build/solr-core/test/J0/solrtest-jetty3-1352218916255/collection1/lib/classes/' to classloader
[junit4:junit4]   2> 9862 T99 oasc.SolrConfig.<init> Using Lucene MatchVersion: LUCENE_41
[junit4:junit4]   2> 9917 T99 oasc.SolrConfig.<init> Loaded SolrConfig: solrconfig.xml
[junit4:junit4]   2> 10018 T99 oass.IndexSchema.readSchema Reading Solr Schema
[junit4:junit4]   2> 10026 T121 oascc.ZkStateReader.updateClusterState Updating cloud state from ZooKeeper... 
[junit4:junit4]   2> 10027 T121 oasc.Overseer$ClusterStateUpdater.updateState Update state numShards=2 message={
[junit4:junit4]   2> 	  "operation":"state",
[junit4:junit4]   2> 	  "numShards":"2",
[junit4:junit4]   2> 	  "shard":"shard2",
[junit4:junit4]   2> 	  "roles":null,
[junit4:junit4]   2> 	  "state":"active",
[junit4:junit4]   2> 	  "core":"collection1",
[junit4:junit4]   2> 	  "collection":"collection1",
[junit4:junit4]   2> 	  "node_name":"127.0.0.1:64816_solr",
[junit4:junit4]   2> 	  "base_url":"http://127.0.0.1:64816/solr"}
[junit4:junit4]   2> 10029 T99 oass.IndexSchema.readSchema Schema name=test
[junit4:junit4]   2> 10086 T137 oascc.ZkStateReader$2.process A cluster state change has occurred - updating... (4)
[junit4:junit4]   2> 10086 T120 oascc.ZkStateReader$2.process A cluster state change has occurred - updating... (4)
[junit4:junit4]   2> 10086 T169 oascc.ZkStateReader$2.process A cluster state change has occurred - updating... (4)
[junit4:junit4]   2> 10086 T153 oascc.ZkStateReader$2.process A cluster state change has occurred - updating... (4)
[junit4:junit4]   2> 10573 T99 oass.OpenExchangeRatesOrgProvider.init Initialized with rates=open-exchange-rates.json, refreshInterval=1440.
[junit4:junit4]   2> 10583 T99 oass.IndexSchema.readSchema default search field in schema is text
[junit4:junit4]   2> 10586 T99 oass.IndexSchema.readSchema unique key field: id
[junit4:junit4]   2> 10610 T99 oass.FileExchangeRateProvider.reload Reloading exchange rates from file currency.xml
[junit4:junit4]   2> 10618 T99 oass.FileExchangeRateProvider.reload Reloading exchange rates from file currency.xml
[junit4:junit4]   2> 10624 T99 oass.OpenExchangeRatesOrgProvider.reload Reloading exchange rates from open-exchange-rates.json
[junit4:junit4]   2> 10626 T99 oass.OpenExchangeRatesOrgProvider.reload Reloading exchange rates from open-exchange-rates.json
[junit4:junit4]   2> 10629 T99 oasc.SolrCore.<init> [collection1] Opening new SolrCore at /usr/home/hudson/hudson-slave/workspace/Lucene-Solr-Tests-4.x-java7/solr/build/solr-core/test/J0/./solrtest-jetty3-1352218916255/collection1/, dataDir=./org.apache.solr.cloud.BasicDistributedZkTest-1352218906703/jetty3/
[junit4:junit4]   2> 10629 T99 oasc.JmxMonitoredMap.<init> JMX monitoring is enabled. Adding Solr mbeans to JMX Server: com.sun.jmx.mbeanserver.JmxMBeanServer@2691cde4
[junit4:junit4]   2> 10631 T99 oasc.SolrCore.getNewIndexDir New index directory detected: old=null new=./org.apache.solr.cloud.BasicDistributedZkTest-1352218906703/jetty3/index/
[junit4:junit4]   2> 10632 T99 oasc.SolrCore.initIndex WARNING [collection1] Solr index directory './org.apache.solr.cloud.BasicDistributedZkTest-1352218906703/jetty3/index' doesn't exist. Creating new index...
[junit4:junit4]   2> 10634 T99 oasc.CachingDirectoryFactory.get return new directory for /usr/home/hudson/hudson-slave/workspace/Lucene-Solr-Tests-4.x-java7/solr/build/solr-core/test/J0/./org.apache.solr.cloud.BasicDistributedZkTest-1352218906703/jetty3/index forceNew:false
[junit4:junit4]   2> 10641 T99 oasc.SolrDeletionPolicy.onCommit SolrDeletionPolicy.onCommit: commits:num=1
[junit4:junit4]   2> 		commit{dir=/usr/home/hudson/hudson-slave/workspace/Lucene-Solr-Tests-4.x-java7/solr/build/solr-core/test/J0/org.apache.solr.cloud.BasicDistributedZkTest-1352218906703/jetty3/index,segFN=segments_1,generation=1,filenames=[segments_1]
[junit4:junit4]   2> 10642 T99 oasc.SolrDeletionPolicy.updateCommits newest commit = 1
[junit4:junit4]   2> 10643 T99 oasc.SolrCore.initWriters created xml: solr.XMLResponseWriter
[junit4:junit4]   2> 10646 T99 oasup.UpdateRequestProcessorChain.init inserting DistributedUpdateProcessorFactory into updateRequestProcessorChain "dedupe"
[junit4:junit4]   2> 10647 T99 oasup.UpdateRequestProcessorChain.init inserting DistributedUpdateProcessorFactory into updateRequestProcessorChain "dedupe-allfields"
[junit4:junit4]   2> 10647 T99 oasup.UpdateRequestProcessorChain.init inserting DistributedUpdateProcessorFactory into updateRequestProcessorChain "stored_sig"
[junit4:junit4]   2> 10648 T99 oasup.UpdateRequestProcessorChain.init inserting DistributedUpdateProcessorFactory into updateRequestProcessorChain "uniq-fields"
[junit4:junit4]   2> 10649 T99 oasup.UpdateRequestProcessorChain.init inserting DistributedUpdateProcessorFactory into updateRequestProcessorChain "distrib-dup-test-chain-implicit"
[junit4:junit4]   2> 10650 T99 oasc.RequestHandlers.initHandlersFromConfig adding lazy requestHandler: solr.ReplicationHandler
[junit4:junit4]   2> 10651 T99 oasc.RequestHandlers.initHandlersFromConfig created /replication: solr.ReplicationHandler
[junit4:junit4]   2> 10652 T99 oasc.RequestHandlers.initHandlersFromConfig created standard: solr.StandardRequestHandler
[junit4:junit4]   2> 10653 T99 oasc.RequestHandlers.initHandlersFromConfig created /get: solr.RealTimeGetHandler
[junit4:junit4]   2> 10654 T99 oasc.RequestHandlers.initHandlersFromConfig created dismax: solr.SearchHandler
[junit4:junit4]   2> 10655 T99 oasc.RequestHandlers.initHandlersFromConfig created mock: org.apache.solr

[...truncated too long message...]

r.accept(SelectChannelConnector.java:104)
[junit4:junit4]    >         at org.eclipse.jetty.server.AbstractConnector$Acceptor.run(AbstractConnector.java:933)
[junit4:junit4]    >         at org.eclipse.jetty.util.thread.QueuedThreadPool.runJob(QueuedThreadPool.java:599)
[junit4:junit4]    >         at org.eclipse.jetty.util.thread.QueuedThreadPool$3.run(QueuedThreadPool.java:534)
[junit4:junit4]    >         at java.lang.Thread.run(Thread.java:722)
[junit4:junit4]    >    3) Thread[id=117, name=qtp1065037894-117 Acceptor2 SelectChannelConnector@0.0.0.0:38672, state=BLOCKED, group=TGRP-BasicDistributedZkTest]
[junit4:junit4]    >         at sun.nio.ch.ServerSocketChannelImpl.accept(ServerSocketChannelImpl.java:210)
[junit4:junit4]    >         at org.eclipse.jetty.server.nio.SelectChannelConnector.accept(SelectChannelConnector.java:104)
[junit4:junit4]    >         at org.eclipse.jetty.server.AbstractConnector$Acceptor.run(AbstractConnector.java:933)
[junit4:junit4]    >         at org.eclipse.jetty.util.thread.QueuedThreadPool.runJob(QueuedThreadPool.java:599)
[junit4:junit4]    >         at org.eclipse.jetty.util.thread.QueuedThreadPool$3.run(QueuedThreadPool.java:534)
[junit4:junit4]    >         at java.lang.Thread.run(Thread.java:722)
[junit4:junit4]    >    4) Thread[id=165, name=qtp15205627-165 Acceptor1 SelectChannelConnector@0.0.0.0:18910, state=RUNNABLE, group=TGRP-BasicDistributedZkTest]
[junit4:junit4]    >         at sun.nio.ch.ServerSocketChannelImpl.accept0(Native Method)
[junit4:junit4]    >         at sun.nio.ch.ServerSocketChannelImpl.accept(ServerSocketChannelImpl.java:226)
[junit4:junit4]    >         at org.eclipse.jetty.server.nio.SelectChannelConnector.accept(SelectChannelConnector.java:104)
[junit4:junit4]    >         at org.eclipse.jetty.server.AbstractConnector$Acceptor.run(AbstractConnector.java:933)
[junit4:junit4]    >         at org.eclipse.jetty.util.thread.QueuedThreadPool.runJob(QueuedThreadPool.java:599)
[junit4:junit4]    >         at org.eclipse.jetty.util.thread.QueuedThreadPool$3.run(QueuedThreadPool.java:534)
[junit4:junit4]    >         at java.lang.Thread.run(Thread.java:722)
[junit4:junit4]    >    5) Thread[id=186, name=qtp507512929-186 Acceptor3 SelectChannelConnector@0.0.0.0:24328, state=BLOCKED, group=TGRP-BasicDistributedZkTest]
[junit4:junit4]    >         at sun.nio.ch.ServerSocketChannelImpl.accept(ServerSocketChannelImpl.java:210)
[junit4:junit4]    >         at org.eclipse.jetty.server.nio.SelectChannelConnector.accept(SelectChannelConnector.java:104)
[junit4:junit4]    >         at org.eclipse.jetty.server.AbstractConnector$Acceptor.run(AbstractConnector.java:933)
[junit4:junit4]    >         at org.eclipse.jetty.util.thread.QueuedThreadPool.runJob(QueuedThreadPool.java:599)
[junit4:junit4]    >         at org.eclipse.jetty.util.thread.QueuedThreadPool$3.run(QueuedThreadPool.java:534)
[junit4:junit4]    >         at java.lang.Thread.run(Thread.java:722)
[junit4:junit4]    >    6) Thread[id=167, name=qtp15205627-167 Acceptor3 SelectChannelConnector@0.0.0.0:18910, state=BLOCKED, group=TGRP-BasicDistributedZkTest]
[junit4:junit4]    >         at sun.nio.ch.ServerSocketChannelImpl.accept(ServerSocketChannelImpl.java:210)
[junit4:junit4]    >         at org.eclipse.jetty.server.nio.SelectChannelConnector.accept(SelectChannelConnector.java:104)
[junit4:junit4]    >         at org.eclipse.jetty.server.AbstractConnector$Acceptor.run(AbstractConnector.java:933)
[junit4:junit4]    >         at org.eclipse.jetty.util.thread.QueuedThreadPool.runJob(QueuedThreadPool.java:599)
[junit4:junit4]    >         at org.eclipse.jetty.util.thread.QueuedThreadPool$3.run(QueuedThreadPool.java:534)
[junit4:junit4]    >         at java.lang.Thread.run(Thread.java:722)
[junit4:junit4]    >    7) Thread[id=115, name=qtp1065037894-115 Acceptor0 SelectChannelConnector@0.0.0.0:38672, state=BLOCKED, group=TGRP-BasicDistributedZkTest]
[junit4:junit4]    >         at sun.nio.ch.ServerSocketChannelImpl.accept(ServerSocketChannelImpl.java:210)
[junit4:junit4]    >         at org.eclipse.jetty.server.nio.SelectChannelConnector.accept(SelectChannelConnector.java:104)
[junit4:junit4]    >         at org.eclipse.jetty.server.AbstractConnector$Acceptor.run(AbstractConnector.java:933)
[junit4:junit4]    >         at org.eclipse.jetty.util.thread.QueuedThreadPool.runJob(QueuedThreadPool.java:599)
[junit4:junit4]    >         at org.eclipse.jetty.util.thread.QueuedThreadPool$3.run(QueuedThreadPool.java:534)
[junit4:junit4]    >         at java.lang.Thread.run(Thread.java:722)
[junit4:junit4]    >    8) Thread[id=184, name=qtp507512929-184 Acceptor1 SelectChannelConnector@0.0.0.0:24328, state=BLOCKED, group=TGRP-BasicDistributedZkTest]
[junit4:junit4]    >         at sun.nio.ch.ServerSocketChannelImpl.accept(ServerSocketChannelImpl.java:210)
[junit4:junit4]    >         at org.eclipse.jetty.server.nio.SelectChannelConnector.accept(SelectChannelConnector.java:104)
[junit4:junit4]    >         at org.eclipse.jetty.server.AbstractConnector$Acceptor.run(AbstractConnector.java:933)
[junit4:junit4]    >         at org.eclipse.jetty.util.thread.QueuedThreadPool.runJob(QueuedThreadPool.java:599)
[junit4:junit4]    >         at org.eclipse.jetty.util.thread.QueuedThreadPool$3.run(QueuedThreadPool.java:534)
[junit4:junit4]    >         at java.lang.Thread.run(Thread.java:722)
[junit4:junit4]    >    9) Thread[id=116, name=qtp1065037894-116 Acceptor1 SelectChannelConnector@0.0.0.0:38672, state=BLOCKED, group=TGRP-BasicDistributedZkTest]
[junit4:junit4]    >         at sun.nio.ch.ServerSocketChannelImpl.accept(ServerSocketChannelImpl.java:210)
[junit4:junit4]    >         at org.eclipse.jetty.server.nio.SelectChannelConnector.accept(SelectChannelConnector.java:104)
[junit4:junit4]    >         at org.eclipse.jetty.server.AbstractConnector$Acceptor.run(AbstractConnector.java:933)
[junit4:junit4]    >         at org.eclipse.jetty.util.thread.QueuedThreadPool.runJob(QueuedThreadPool.java:599)
[junit4:junit4]    >         at org.eclipse.jetty.util.thread.QueuedThreadPool$3.run(QueuedThreadPool.java:534)
[junit4:junit4]    >         at java.lang.Thread.run(Thread.java:722)
[junit4:junit4]    >   10) Thread[id=164, name=qtp15205627-164 Acceptor0 SelectChannelConnector@0.0.0.0:18910, state=BLOCKED, group=TGRP-BasicDistributedZkTest]
[junit4:junit4]    >         at sun.nio.ch.ServerSocketChannelImpl.accept(ServerSocketChannelImpl.java:210)
[junit4:junit4]    >         at org.eclipse.jetty.server.nio.SelectChannelConnector.accept(SelectChannelConnector.java:104)
[junit4:junit4]    >         at org.eclipse.jetty.server.AbstractConnector$Acceptor.run(AbstractConnector.java:933)
[junit4:junit4]    >         at org.eclipse.jetty.util.thread.QueuedThreadPool.runJob(QueuedThreadPool.java:599)
[junit4:junit4]    >         at org.eclipse.jetty.util.thread.QueuedThreadPool$3.run(QueuedThreadPool.java:534)
[junit4:junit4]    >         at java.lang.Thread.run(Thread.java:722)
[junit4:junit4]    >   11) Thread[id=118, name=qtp1065037894-118 Acceptor3 SelectChannelConnector@0.0.0.0:38672, state=RUNNABLE, group=TGRP-BasicDistributedZkTest]
[junit4:junit4]    >         at sun.nio.ch.ServerSocketChannelImpl.accept0(Native Method)
[junit4:junit4]    >         at sun.nio.ch.ServerSocketChannelImpl.accept(ServerSocketChannelImpl.java:226)
[junit4:junit4]    >         at org.eclipse.jetty.server.nio.SelectChannelConnector.accept(SelectChannelConnector.java:104)
[junit4:junit4]    >         at org.eclipse.jetty.server.AbstractConnector$Acceptor.run(AbstractConnector.java:933)
[junit4:junit4]    >         at org.eclipse.jetty.util.thread.QueuedThreadPool.runJob(QueuedThreadPool.java:599)
[junit4:junit4]    >         at org.eclipse.jetty.util.thread.QueuedThreadPool$3.run(QueuedThreadPool.java:534)
[junit4:junit4]    >         at java.lang.Thread.run(Thread.java:722)
[junit4:junit4]    >   12) Thread[id=166, name=qtp15205627-166 Acceptor2 SelectChannelConnector@0.0.0.0:18910, state=BLOCKED, group=TGRP-BasicDistributedZkTest]
[junit4:junit4]    >         at sun.nio.ch.ServerSocketChannelImpl.accept(ServerSocketChannelImpl.java:210)
[junit4:junit4]    >         at org.eclipse.jetty.server.nio.SelectChannelConnector.accept(SelectChannelConnector.java:104)
[junit4:junit4]    >         at org.eclipse.jetty.server.AbstractConnector$Acceptor.run(AbstractConnector.java:933)
[junit4:junit4]    >         at org.eclipse.jetty.util.thread.QueuedThreadPool.runJob(QueuedThreadPool.java:599)
[junit4:junit4]    >         at org.eclipse.jetty.util.thread.QueuedThreadPool$3.run(QueuedThreadPool.java:534)
[junit4:junit4]    >         at java.lang.Thread.run(Thread.java:722)
[junit4:junit4]    > 	at __randomizedtesting.SeedInfo.seed([C6F54FC7A3B9989F]:0)
[junit4:junit4] Completed on J0 in 292.06s, 1 test, 2 errors <<< FAILURES!

[...truncated 149 lines...]
BUILD FAILED
/usr/home/hudson/hudson-slave/workspace/Lucene-Solr-Tests-4.x-java7/build.xml:335: The following error occurred while executing this line:
/usr/home/hudson/hudson-slave/workspace/Lucene-Solr-Tests-4.x-java7/build.xml:39: The following error occurred while executing this line:
/usr/home/hudson/hudson-slave/workspace/Lucene-Solr-Tests-4.x-java7/solr/build.xml:178: The following error occurred while executing this line:
/usr/home/hudson/hudson-slave/workspace/Lucene-Solr-Tests-4.x-java7/lucene/module-build.xml:61: The following error occurred while executing this line:
/usr/home/hudson/hudson-slave/workspace/Lucene-Solr-Tests-4.x-java7/lucene/common-build.xml:1163: The following error occurred while executing this line:
/usr/home/hudson/hudson-slave/workspace/Lucene-Solr-Tests-4.x-java7/lucene/common-build.xml:827: There were test failures: 233 suites, 965 tests, 4 suite-level errors, 744 ignored (1 assumption)

Total time: 22 minutes 59 seconds
Build step 'Invoke Ant' marked build as failure
Archiving artifacts
Recording test results
Email was triggered for: Failure
Sending email for trigger: Failure



Mime
View raw message