lucene-dev mailing list archives

Site index · List index
Message view « Date » · « Thread »
Top « Date » · « Thread »
From Alan Woodward <alan.woodw...@romseysoftware.co.uk>
Subject Re: [JENKINS] Lucene-Solr-trunk-Windows (32bit/jdk1.6.0_37) - Build # 1459 - Still Failing!
Date Tue, 06 Nov 2012 09:07:10 GMT
I committed a fix

On 6 Nov 2012, at 07:28, Policeman Jenkins Server wrote:

> Build: http://jenkins.sd-datasolutions.de/job/Lucene-Solr-trunk-Windows/1459/
> Java: 32bit/jdk1.6.0_37 -client -XX:+UseConcMarkSweepGC
> 
> 2 tests failed.
> FAILED:  junit.framework.TestSuite.org.apache.solr.schema.TestBinaryField
> 
> Error Message:
> 2 threads leaked from SUITE scope at org.apache.solr.schema.TestBinaryField:     1) Thread[id=24,
name=metrics-meter-tick-thread-2, state=TIMED_WAITING, group=TGRP-TestBinaryField]       
 at sun.misc.Unsafe.park(Native Method)         at java.util.concurrent.locks.LockSupport.parkNanos(LockSupport.java:196)
        at java.util.concurrent.locks.AbstractQueuedSynchronizer$ConditionObject.awaitNanos(AbstractQueuedSynchronizer.java:2025)
        at java.util.concurrent.DelayQueue.take(DelayQueue.java:164)         at java.util.concurrent.ScheduledThreadPoolExecutor$DelayedWorkQueue.take(ScheduledThreadPoolExecutor.java:609)
        at java.util.concurrent.ScheduledThreadPoolExecutor$DelayedWorkQueue.take(ScheduledThreadPoolExecutor.java:602)
        at java.util.concurrent.ThreadPoolExecutor.getTask(ThreadPoolExecutor.java:947)  
      at java.util.concurrent.ThreadPoolExecutor$Worker.run(ThreadPoolExecutor.java:907) 
       at java.lang.Thread.run(Thread.java:662)    2) Thread[id=23, name=metrics-meter-tick-thread-1,
state=TIMED_WAITING, group=TGRP-TestBinaryField]         at sun.misc.Unsafe.park(Native Method)
        at java.util.concurrent.locks.LockSupport.parkNanos(LockSupport.java:196)        
at java.util.concurrent.locks.AbstractQueuedSynchronizer$ConditionObject.awaitNanos(AbstractQueuedSynchronizer.java:2025)
        at java.util.concurrent.DelayQueue.take(DelayQueue.java:164)         at java.util.concurrent.ScheduledThreadPoolExecutor$DelayedWorkQueue.take(ScheduledThreadPoolExecutor.java:609)
        at java.util.concurrent.ScheduledThreadPoolExecutor$DelayedWorkQueue.take(ScheduledThreadPoolExecutor.java:602)
        at java.util.concurrent.ThreadPoolExecutor.getTask(ThreadPoolExecutor.java:947)  
      at java.util.concurrent.ThreadPoolExecutor$Worker.run(ThreadPoolExecutor.java:907) 
       at java.lang.Thread.run(Thread.java:662)
> 
> Stack Trace:
> com.carrotsearch.randomizedtesting.ThreadLeakError: 2 threads leaked from SUITE scope
at org.apache.solr.schema.TestBinaryField: 
>   1) Thread[id=24, name=metrics-meter-tick-thread-2, state=TIMED_WAITING, group=TGRP-TestBinaryField]
>        at sun.misc.Unsafe.park(Native Method)
>        at java.util.concurrent.locks.LockSupport.parkNanos(LockSupport.java:196)
>        at java.util.concurrent.locks.AbstractQueuedSynchronizer$ConditionObject.awaitNanos(AbstractQueuedSynchronizer.java:2025)
>        at java.util.concurrent.DelayQueue.take(DelayQueue.java:164)
>        at java.util.concurrent.ScheduledThreadPoolExecutor$DelayedWorkQueue.take(ScheduledThreadPoolExecutor.java:609)
>        at java.util.concurrent.ScheduledThreadPoolExecutor$DelayedWorkQueue.take(ScheduledThreadPoolExecutor.java:602)
>        at java.util.concurrent.ThreadPoolExecutor.getTask(ThreadPoolExecutor.java:947)
>        at java.util.concurrent.ThreadPoolExecutor$Worker.run(ThreadPoolExecutor.java:907)
>        at java.lang.Thread.run(Thread.java:662)
>   2) Thread[id=23, name=metrics-meter-tick-thread-1, state=TIMED_WAITING, group=TGRP-TestBinaryField]
>        at sun.misc.Unsafe.park(Native Method)
>        at java.util.concurrent.locks.LockSupport.parkNanos(LockSupport.java:196)
>        at java.util.concurrent.locks.AbstractQueuedSynchronizer$ConditionObject.awaitNanos(AbstractQueuedSynchronizer.java:2025)
>        at java.util.concurrent.DelayQueue.take(DelayQueue.java:164)
>        at java.util.concurrent.ScheduledThreadPoolExecutor$DelayedWorkQueue.take(ScheduledThreadPoolExecutor.java:609)
>        at java.util.concurrent.ScheduledThreadPoolExecutor$DelayedWorkQueue.take(ScheduledThreadPoolExecutor.java:602)
>        at java.util.concurrent.ThreadPoolExecutor.getTask(ThreadPoolExecutor.java:947)
>        at java.util.concurrent.ThreadPoolExecutor$Worker.run(ThreadPoolExecutor.java:907)
>        at java.lang.Thread.run(Thread.java:662)
> 	at __randomizedtesting.SeedInfo.seed([28100922E87E2C5D]:0)
> 
> 
> FAILED:  junit.framework.TestSuite.org.apache.solr.schema.TestBinaryField
> 
> Error Message:
> There are still zombie threads that couldn't be terminated:    1) Thread[id=24, name=metrics-meter-tick-thread-2,
state=TIMED_WAITING, group=TGRP-TestBinaryField]         at sun.misc.Unsafe.park(Native Method)
        at java.util.concurrent.locks.LockSupport.parkNanos(LockSupport.java:196)        
at java.util.concurrent.locks.AbstractQueuedSynchronizer$ConditionObject.awaitNanos(AbstractQueuedSynchronizer.java:2025)
        at java.util.concurrent.DelayQueue.take(DelayQueue.java:164)         at java.util.concurrent.ScheduledThreadPoolExecutor$DelayedWorkQueue.take(ScheduledThreadPoolExecutor.java:609)
        at java.util.concurrent.ScheduledThreadPoolExecutor$DelayedWorkQueue.take(ScheduledThreadPoolExecutor.java:602)
        at java.util.concurrent.ThreadPoolExecutor.getTask(ThreadPoolExecutor.java:947)  
      at java.util.concurrent.ThreadPoolExecutor$Worker.run(ThreadPoolExecutor.java:907) 
       at java.lang.Thread.run(Thread.java:662)    2) Thread[id=23, name=metrics-meter-tick-thread-1,
state=TIMED_WAITING, group=TGRP-TestBinaryField]         at sun.misc.Unsafe.park(Native Method)
        at java.util.concurrent.locks.LockSupport.parkNanos(LockSupport.java:196)        
at java.util.concurrent.locks.AbstractQueuedSynchronizer$ConditionObject.awaitNanos(AbstractQueuedSynchronizer.java:2025)
        at java.util.concurrent.DelayQueue.take(DelayQueue.java:164)         at java.util.concurrent.ScheduledThreadPoolExecutor$DelayedWorkQueue.take(ScheduledThreadPoolExecutor.java:609)
        at java.util.concurrent.ScheduledThreadPoolExecutor$DelayedWorkQueue.take(ScheduledThreadPoolExecutor.java:602)
        at java.util.concurrent.ThreadPoolExecutor.getTask(ThreadPoolExecutor.java:947)  
      at java.util.concurrent.ThreadPoolExecutor$Worker.run(ThreadPoolExecutor.java:907) 
       at java.lang.Thread.run(Thread.java:662)
> 
> Stack Trace:
> com.carrotsearch.randomizedtesting.ThreadLeakError: There are still zombie threads that
couldn't be terminated:
>   1) Thread[id=24, name=metrics-meter-tick-thread-2, state=TIMED_WAITING, group=TGRP-TestBinaryField]
>        at sun.misc.Unsafe.park(Native Method)
>        at java.util.concurrent.locks.LockSupport.parkNanos(LockSupport.java:196)
>        at java.util.concurrent.locks.AbstractQueuedSynchronizer$ConditionObject.awaitNanos(AbstractQueuedSynchronizer.java:2025)
>        at java.util.concurrent.DelayQueue.take(DelayQueue.java:164)
>        at java.util.concurrent.ScheduledThreadPoolExecutor$DelayedWorkQueue.take(ScheduledThreadPoolExecutor.java:609)
>        at java.util.concurrent.ScheduledThreadPoolExecutor$DelayedWorkQueue.take(ScheduledThreadPoolExecutor.java:602)
>        at java.util.concurrent.ThreadPoolExecutor.getTask(ThreadPoolExecutor.java:947)
>        at java.util.concurrent.ThreadPoolExecutor$Worker.run(ThreadPoolExecutor.java:907)
>        at java.lang.Thread.run(Thread.java:662)
>   2) Thread[id=23, name=metrics-meter-tick-thread-1, state=TIMED_WAITING, group=TGRP-TestBinaryField]
>        at sun.misc.Unsafe.park(Native Method)
>        at java.util.concurrent.locks.LockSupport.parkNanos(LockSupport.java:196)
>        at java.util.concurrent.locks.AbstractQueuedSynchronizer$ConditionObject.awaitNanos(AbstractQueuedSynchronizer.java:2025)
>        at java.util.concurrent.DelayQueue.take(DelayQueue.java:164)
>        at java.util.concurrent.ScheduledThreadPoolExecutor$DelayedWorkQueue.take(ScheduledThreadPoolExecutor.java:609)
>        at java.util.concurrent.ScheduledThreadPoolExecutor$DelayedWorkQueue.take(ScheduledThreadPoolExecutor.java:602)
>        at java.util.concurrent.ThreadPoolExecutor.getTask(ThreadPoolExecutor.java:947)
>        at java.util.concurrent.ThreadPoolExecutor$Worker.run(ThreadPoolExecutor.java:907)
>        at java.lang.Thread.run(Thread.java:662)
> 	at __randomizedtesting.SeedInfo.seed([28100922E87E2C5D]:0)
> 
> 
> 
> 
> Build Log:
> [...truncated 7719 lines...]
> [junit4:junit4] Suite: org.apache.solr.schema.TestBinaryField
> [junit4:junit4]   2> -31 T11 oasc.SolrResourceLoader.<init> new SolrResourceLoader
for directory: 'solr/collection1\'
> [junit4:junit4]   2> 825 T11 oejs.Server.doStart jetty-8.1.2.v20120308
> [junit4:junit4]   2> 1077 T11 oejs.AbstractConnector.doStart Started SelectChannelConnector@0.0.0.0:62057
> [junit4:junit4]   2> 1186 T11 oasc.SolrResourceLoader.locateSolrHome JNDI not configured
for solr (NoInitialContextEx)
> [junit4:junit4]   2> 1187 T11 oasc.SolrResourceLoader.locateSolrHome using system
property solr.solr.home: C:\Users\JenkinsSlave\workspace\Lucene-Solr-trunk-Windows\solr\build\solr-core\test\J0\.\solrtest-TestBinaryField-1352186835411\example
> [junit4:junit4]   2> 1187 T11 oasc.SolrResourceLoader.<init> new SolrResourceLoader
for deduced Solr Home: 'C:\Users\JenkinsSlave\workspace\Lucene-Solr-trunk-Windows\solr\build\solr-core\test\J0\.\solrtest-TestBinaryField-1352186835411\example\'
> [junit4:junit4]   2> 1346 T11 oass.SolrDispatchFilter.init SolrDispatchFilter.init()
> [junit4:junit4]   2> 1351 T11 oasc.SolrResourceLoader.locateSolrHome JNDI not configured
for solr (NoInitialContextEx)
> [junit4:junit4]   2> 1353 T11 oasc.SolrResourceLoader.locateSolrHome using system
property solr.solr.home: C:\Users\JenkinsSlave\workspace\Lucene-Solr-trunk-Windows\solr\build\solr-core\test\J0\.\solrtest-TestBinaryField-1352186835411\example
> [junit4:junit4]   2> 1391 T11 oasc.CoreContainer$Initializer.initialize looking for
solr.xml: C:\Users\JenkinsSlave\workspace\Lucene-Solr-trunk-Windows\solr\build\solr-core\test\J0\.\solrtest-TestBinaryField-1352186835411\example\solr.xml
> [junit4:junit4]   2> 1396 T11 oasc.CoreContainer.<init> New CoreContainer 400594
> [junit4:junit4]   2> 1399 T11 oasc.CoreContainer$Initializer.initialize no solr.xml
file found - using default
> [junit4:junit4]   2> 1400 T11 oasc.CoreContainer.load Loading CoreContainer using
Solr Home: 'C:\Users\JenkinsSlave\workspace\Lucene-Solr-trunk-Windows\solr\build\solr-core\test\J0\.\solrtest-TestBinaryField-1352186835411\example\'
> [junit4:junit4]   2> 1401 T11 oasc.SolrResourceLoader.<init> new SolrResourceLoader
for directory: 'C:\Users\JenkinsSlave\workspace\Lucene-Solr-trunk-Windows\solr\build\solr-core\test\J0\.\solrtest-TestBinaryField-1352186835411\example\'
> [junit4:junit4]   2> 1460 T11 oasc.CoreContainer.load Registering Log Listener
> [junit4:junit4]   2> 1741 T11 oasc.CoreContainer.create Creating SolrCore 'collection1'
using instanceDir: C:\Users\JenkinsSlave\workspace\Lucene-Solr-trunk-Windows\solr\build\solr-core\test\J0\.\solrtest-TestBinaryField-1352186835411\example\collection1
> [junit4:junit4]   2> 1744 T11 oasc.SolrResourceLoader.<init> new SolrResourceLoader
for directory: 'C:\Users\JenkinsSlave\workspace\Lucene-Solr-trunk-Windows\solr\build\solr-core\test\J0\.\solrtest-TestBinaryField-1352186835411\example\collection1\'
> [junit4:junit4]   2> 1878 T11 oasc.SolrConfig.<init> Using Lucene MatchVersion:
LUCENE_50
> [junit4:junit4]   2> 2181 T11 oasc.SolrConfig.<init> Loaded SolrConfig: solrconfig.xml
> [junit4:junit4]   2> 2218 T11 oass.IndexSchema.readSchema Reading Solr Schema
> [junit4:junit4]   2> 2232 T11 oass.IndexSchema.readSchema Schema name=test
> [junit4:junit4]   2> 2855 T11 oass.IndexSchema.readSchema unique key field: id
> [junit4:junit4]   2> 2999 T11 oasc.SolrCore.<init> [collection1] Opening new
SolrCore at C:\Users\JenkinsSlave\workspace\Lucene-Solr-trunk-Windows\solr\build\solr-core\test\J0\.\solrtest-TestBinaryField-1352186835411\example\collection1\,
dataDir=C:\Users\JenkinsSlave\workspace\Lucene-Solr-trunk-Windows\solr\build\solr-core\test\J0\.\solrtest-TestBinaryField-1352186835411\example\collection1\data\
> [junit4:junit4]   2> 3000 T11 oasc.SolrCore.<init> JMX monitoring not detected
for core: collection1
> [junit4:junit4]   2> 3019 T11 oasc.SolrCore.initDirectoryFactory org.apache.solr.core.MockDirectoryFactory
> [junit4:junit4]   2> 3111 T11 oasc.CachingDirectoryFactory.injectLockFactory WARNING
No lockType configured for MockDirWrapper(org.apache.lucene.store.RAMDirectory@39da8a lockFactory=org.apache.lucene.store.SingleInstanceLockFactory@3acc67)
assuming 'simple'
> [junit4:junit4]   2> 3114 T11 oasc.CachingDirectoryFactory.get return new directory
for C:\Users\JenkinsSlave\workspace\Lucene-Solr-trunk-Windows\solr\build\solr-core\test\J0\.\solrtest-TestBinaryField-1352186835411\example\collection1\data
forceNew:false
> [junit4:junit4]   2> 3114 T11 oasc.CachingDirectoryFactory.close Releasing directory:C:\Users\JenkinsSlave\workspace\Lucene-Solr-trunk-Windows\solr\build\solr-core\test\J0\.\solrtest-TestBinaryField-1352186835411\example\collection1\data
> [junit4:junit4]   2> 3115 T11 oasc.SolrCore.getNewIndexDir New index directory detected:
old=null new=C:\Users\JenkinsSlave\workspace\Lucene-Solr-trunk-Windows\solr\build\solr-core\test\J0\.\solrtest-TestBinaryField-1352186835411\example\collection1\data\index/
> [junit4:junit4]   2> 3116 T11 oasc.SolrCore.initIndex WARNING [collection1] Solr index
directory 'C:\Users\JenkinsSlave\workspace\Lucene-Solr-trunk-Windows\solr\build\solr-core\test\J0\.\solrtest-TestBinaryField-1352186835411\example\collection1\data\index'
doesn't exist. Creating new index...
> [junit4:junit4]   2> 3139 T11 oasc.CachingDirectoryFactory.get return new directory
for C:\Users\JenkinsSlave\workspace\Lucene-Solr-trunk-Windows\solr\build\solr-core\test\J0\.\solrtest-TestBinaryField-1352186835411\example\collection1\data\index
forceNew:false
> [junit4:junit4]   2> 3503 T11 oasc.SolrDeletionPolicy.onCommit SolrDeletionPolicy.onCommit:
commits:num=1
> [junit4:junit4]   2> 		commit{dir=MockDirWrapper(org.apache.lucene.store.RAMDirectory@145f5e3
lockFactory=org.apache.lucene.store.SingleInstanceLockFactory@170984c),segFN=segments_1,generation=1,filenames=[segments_1]
> [junit4:junit4]   2> 3503 T11 oasc.SolrDeletionPolicy.updateCommits newest commit
= 1[segments_1]
> [junit4:junit4]   2> 3504 T11 oasc.CachingDirectoryFactory.close Releasing directory:C:\Users\JenkinsSlave\workspace\Lucene-Solr-trunk-Windows\solr\build\solr-core\test\J0\.\solrtest-TestBinaryField-1352186835411\example\collection1\data\index
> [junit4:junit4]   2> 4323 T11 oasc.RequestHandlers.initHandlersFromConfig created
standard: solr.StandardRequestHandler
> [junit4:junit4]   2> 4324 T11 oasc.RequestHandlers.initHandlersFromConfig created
defaults: solr.StandardRequestHandler
> [junit4:junit4]   2> 4325 T11 oasc.RequestHandlers.initHandlersFromConfig adding lazy
requestHandler: solr.StandardRequestHandler
> [junit4:junit4]   2> 4328 T11 oasc.RequestHandlers.initHandlersFromConfig created
lazy: solr.StandardRequestHandler
> [junit4:junit4]   2> 4358 T11 oasc.RequestHandlers.initHandlersFromConfig created
/update: solr.UpdateRequestHandler
> [junit4:junit4]   2> 4412 T11 oasc.RequestHandlers.initHandlersFromConfig created
/replication: solr.ReplicationHandler
> [junit4:junit4]   2> 4517 T11 oashl.XMLLoader.init xsltCacheLifetimeSeconds=60
> [junit4:junit4]   2> 4547 T11 oasc.CachingDirectoryFactory.close Releasing directory:C:\Users\JenkinsSlave\workspace\Lucene-Solr-trunk-Windows\solr\build\solr-core\test\J0\.\solrtest-TestBinaryField-1352186835411\example\collection1\data
> [junit4:junit4]   2> 4598 T11 oass.SolrIndexSearcher.<init> Opening Searcher@1e3cc77
main
> [junit4:junit4]   2> 4675 T11 oasu.CommitTracker.<init> Hard AutoCommit: disabled
> [junit4:junit4]   2> 4675 T11 oasu.CommitTracker.<init> Soft AutoCommit: disabled
> [junit4:junit4]   2> 4772 T11 oashc.HttpShardHandlerFactory.getParameter Setting socketTimeout
to: 0
> [junit4:junit4]   2> 4772 T11 oashc.HttpShardHandlerFactory.getParameter Setting urlScheme
to: http://
> [junit4:junit4]   2> 4773 T11 oashc.HttpShardHandlerFactory.getParameter Setting connTimeout
to: 0
> [junit4:junit4]   2> 4773 T11 oashc.HttpShardHandlerFactory.getParameter Setting maxConnectionsPerHost
to: 20
> [junit4:junit4]   2> 4773 T11 oashc.HttpShardHandlerFactory.getParameter Setting corePoolSize
to: 0
> [junit4:junit4]   2> 4774 T11 oashc.HttpShardHandlerFactory.getParameter Setting maximumPoolSize
to: 2147483647
> [junit4:junit4]   2> 4774 T11 oashc.HttpShardHandlerFactory.getParameter Setting maxThreadIdleTime
to: 5
> [junit4:junit4]   2> 4775 T11 oashc.HttpShardHandlerFactory.getParameter Setting sizeOfQueue
to: -1
> [junit4:junit4]   2> 4775 T11 oashc.HttpShardHandlerFactory.getParameter Setting fairnessPolicy
to: false
> [junit4:junit4]   2> 4808 T11 oascsi.HttpClientUtil.createClient Creating new http
client, config:maxConnectionsPerHost=20&maxConnections=10000&socketTimeout=0&connTimeout=0&retry=false
> [junit4:junit4]   2> 5279 T11 oash.ReplicationHandler.inform Commits will be reserved
for  10000
> [junit4:junit4]   2> 5280 T11 oasc.CoreContainer.registerCore registering core: collection1
> [junit4:junit4]   2> 5280 T25 oasc.SolrCore.registerSearcher [collection1] Registered
new searcher Searcher@1e3cc77 main{StandardDirectoryReader(segments_1:1)}
> [junit4:junit4]   2> 5280 T11 oass.SolrDispatchFilter.init user.dir=C:\Users\JenkinsSlave\workspace\Lucene-Solr-trunk-Windows\solr\build\solr-core\test\J0
> [junit4:junit4]   2> 5282 T11 oass.SolrDispatchFilter.init SolrDispatchFilter.init()
done
> [junit4:junit4]   2> 5334 T11 oascsi.HttpClientUtil.createClient Creating new http
client, config:maxConnections=128&maxConnectionsPerHost=32&followRedirects=false
> [junit4:junit4]   2> ASYNC  NEW_CORE C0 name=collection1 org.apache.solr.core.SolrCore@956254
> [junit4:junit4]   2> 6760 T17 C0 oasc.CachingDirectoryFactory.close Releasing directory:C:\Users\JenkinsSlave\workspace\Lucene-Solr-trunk-Windows\solr\build\solr-core\test\J0\.\solrtest-TestBinaryField-1352186835411\example\collection1\data
> [junit4:junit4]   2> 6767 T17 C0 oasc.SolrDeletionPolicy.onInit SolrDeletionPolicy.onInit:
commits:num=1
> [junit4:junit4]   2> 		commit{dir=MockDirWrapper(org.apache.lucene.store.RAMDirectory@145f5e3
lockFactory=org.apache.lucene.store.SingleInstanceLockFactory@170984c),segFN=segments_1,generation=1,filenames=[segments_1]
> [junit4:junit4]   2> 6768 T17 C0 oasc.SolrDeletionPolicy.updateCommits newest commit
= 1[segments_1]
> [junit4:junit4]   2> 7165 T17 C0 UPDATE [collection1] webapp=/example path=/update
params={wt=javabin&version=2} {add=[1]} 0 681
> [junit4:junit4]   2> 7362 T16 C0 UPDATE [collection1] webapp=/example path=/update
params={wt=javabin&version=2} {add=[2]} 0 1
> [junit4:junit4]   2> 7367 T20 C0 UPDATE [collection1] webapp=/example path=/update
params={wt=javabin&version=2} {add=[3]} 0 1
> [junit4:junit4]   2> 7404 T19 C0 oasu.DirectUpdateHandler2.commit start commit{flags=0,_version_=0,optimize=false,openSearcher=true,waitSearcher=true,expungeDeletes=false,softCommit=false}
> [junit4:junit4]   2> 7953 T19 C0 oasc.SolrDeletionPolicy.onCommit SolrDeletionPolicy.onCommit:
commits:num=2
> [junit4:junit4]   2> 		commit{dir=MockDirWrapper(org.apache.lucene.store.RAMDirectory@145f5e3
lockFactory=org.apache.lucene.store.SingleInstanceLockFactory@170984c),segFN=segments_1,generation=1,filenames=[segments_1]
> [junit4:junit4]   2> 		commit{dir=MockDirWrapper(org.apache.lucene.store.RAMDirectory@145f5e3
lockFactory=org.apache.lucene.store.SingleInstanceLockFactory@170984c),segFN=segments_2,generation=2,filenames=[_0.fnm,
_0.tim, _0_nrm.cfe, segments_2, _0.fdx, _0_nrm.cfs, _0.si, _0.doc, _0.tip, _0.fdt]
> [junit4:junit4]   2> 7954 T19 C0 oasc.SolrDeletionPolicy.updateCommits newest commit
= 2[_0.fnm, _0.tim, _0_nrm.cfe, segments_2, _0.fdx, _0_nrm.cfs, _0.si, _0.doc, _0.tip, _0.fdt]
> [junit4:junit4]   2> 7956 T19 C0 oasc.CachingDirectoryFactory.close Releasing directory:C:\Users\JenkinsSlave\workspace\Lucene-Solr-trunk-Windows\solr\build\solr-core\test\J0\.\solrtest-TestBinaryField-1352186835411\example\collection1\data
> [junit4:junit4]   2> 8093 T19 C0 oass.SolrIndexSearcher.<init> Opening Searcher@13f212a
main
> [junit4:junit4]   2> 8100 T19 C0 oasu.DirectUpdateHandler2.commit end_commit_flush
> [junit4:junit4]   2> 8108 T25 oasc.SolrCore.registerSearcher [collection1] Registered
new searcher Searcher@13f212a main{StandardDirectoryReader(segments_2:3 _0(5.0):C3)}
> [junit4:junit4]   2> 8109 T25 oasc.CachingDirectoryFactory.close Releasing directory:C:\Users\JenkinsSlave\workspace\Lucene-Solr-trunk-Windows\solr\build\solr-core\test\J0\.\solrtest-TestBinaryField-1352186835411\example\collection1\data\index
> [junit4:junit4]   2> 8109 T19 C0 UPDATE [collection1] webapp=/example path=/update
params={waitSearcher=true&wt=javabin&commit=true&softCommit=false&version=2}
{commit=} 0 711
> [junit4:junit4]   2> 8460 T15 C0 REQ [collection1] webapp=/example path=/select params={wt=javabin&q=*:*&version=2}
hits=3 status=0 QTime=322 
> [junit4:junit4]   2> 8534 T11 oasc.CoreContainer.shutdown Shutting down CoreContainer
instance=400594
> [junit4:junit4]   2> 8535 T11 oasc.SolrCore.close [collection1]  CLOSING SolrCore
org.apache.solr.core.SolrCore@956254
> [junit4:junit4]   2> 8535 T11 oasu.DirectUpdateHandler2.close closing DirectUpdateHandler2{commits=1,autocommits=0,soft
autocommits=0,optimizes=0,rollbacks=0,expungeDeletes=0,docsPending=0,adds=0,deletesById=0,deletesByQuery=0,errors=0,cumulative_adds=3,cumulative_deletesById=0,cumulative_deletesByQuery=0,cumulative_errors=0}
> [junit4:junit4]   2> 8537 T11 oasc.SolrCore.decrefSolrCoreState Closing SolrCoreState
> [junit4:junit4]   2> 8537 T11 oasu.DefaultSolrCoreState.closeIndexWriter SolrCoreState
ref count has reached 0 - closing IndexWriter
> [junit4:junit4]   2> 8537 T11 oasu.DefaultSolrCoreState.closeIndexWriter closing IndexWriter
with IndexWriterCloser
> [junit4:junit4]   2> 8539 T11 C0 oasc.CachingDirectoryFactory.close Releasing directory:C:\Users\JenkinsSlave\workspace\Lucene-Solr-trunk-Windows\solr\build\solr-core\test\J0\.\solrtest-TestBinaryField-1352186835411\example\collection1\data\index
> [junit4:junit4]   2> 8540 T11 oasc.SolrCore.closeSearcher [collection1] Closing main
searcher on request.
> [junit4:junit4]   2> 8542 T11 oasc.CachingDirectoryFactory.close Releasing directory:C:\Users\JenkinsSlave\workspace\Lucene-Solr-trunk-Windows\solr\build\solr-core\test\J0\.\solrtest-TestBinaryField-1352186835411\example\collection1\data\index
> [junit4:junit4]   2> 8547 T11 oejsh.ContextHandler.doStop stopped o.e.j.s.ServletContextHandler{/example,null}
> [junit4:junit4]   2> 8849 T10 ccr.ThreadLeakControl.checkThreadLeaks WARNING Will
linger awaiting termination of 2 leaked thread(s).
> [junit4:junit4]   2> 28908 T10 ccr.ThreadLeakControl.checkThreadLeaks SEVERE 2 threads
leaked from SUITE scope at org.apache.solr.schema.TestBinaryField: 
> [junit4:junit4]   2> 	   1) Thread[id=24, name=metrics-meter-tick-thread-2, state=TIMED_WAITING,
group=TGRP-TestBinaryField]
> [junit4:junit4]   2> 	        at sun.misc.Unsafe.park(Native Method)
> [junit4:junit4]   2> 	        at java.util.concurrent.locks.LockSupport.parkNanos(LockSupport.java:196)
> [junit4:junit4]   2> 	        at java.util.concurrent.locks.AbstractQueuedSynchronizer$ConditionObject.awaitNanos(AbstractQueuedSynchronizer.java:2025)
> [junit4:junit4]   2> 	        at java.util.concurrent.DelayQueue.take(DelayQueue.java:164)
> [junit4:junit4]   2> 	        at java.util.concurrent.ScheduledThreadPoolExecutor$DelayedWorkQueue.take(ScheduledThreadPoolExecutor.java:609)
> [junit4:junit4]   2> 	        at java.util.concurrent.ScheduledThreadPoolExecutor$DelayedWorkQueue.take(ScheduledThreadPoolExecutor.java:602)
> [junit4:junit4]   2> 	        at java.util.concurrent.ThreadPoolExecutor.getTask(ThreadPoolExecutor.java:947)
> [junit4:junit4]   2> 	        at java.util.concurrent.ThreadPoolExecutor$Worker.run(ThreadPoolExecutor.java:907)
> [junit4:junit4]   2> 	        at java.lang.Thread.run(Thread.java:662)
> [junit4:junit4]   2> 	   2) Thread[id=23, name=metrics-meter-tick-thread-1, state=TIMED_WAITING,
group=TGRP-TestBinaryField]
> [junit4:junit4]   2> 	        at sun.misc.Unsafe.park(Native Method)
> [junit4:junit4]   2> 	        at java.util.concurrent.locks.LockSupport.parkNanos(LockSupport.java:196)
> [junit4:junit4]   2> 	        at java.util.concurrent.locks.AbstractQueuedSynchronizer$ConditionObject.awaitNanos(AbstractQueuedSynchronizer.java:2025)
> [junit4:junit4]   2> 	        at java.util.concurrent.DelayQueue.take(DelayQueue.java:164)
> [junit4:junit4]   2> 	        at java.util.concurrent.ScheduledThreadPoolExecutor$DelayedWorkQueue.take(ScheduledThreadPoolExecutor.java:609)
> [junit4:junit4]   2> 	        at java.util.concurrent.ScheduledThreadPoolExecutor$DelayedWorkQueue.take(ScheduledThreadPoolExecutor.java:602)
> [junit4:junit4]   2> 	        at java.util.concurrent.ThreadPoolExecutor.getTask(ThreadPoolExecutor.java:947)
> [junit4:junit4]   2> 	        at java.util.concurrent.ThreadPoolExecutor$Worker.run(ThreadPoolExecutor.java:907)
> [junit4:junit4]   2> 	        at java.lang.Thread.run(Thread.java:662)
> [junit4:junit4]   2> 28909 T10 ccr.ThreadLeakControl.tryToInterruptAll Starting to
interrupt leaked threads:
> [junit4:junit4]   2> 	   1) Thread[id=24, name=metrics-meter-tick-thread-2, state=TIMED_WAITING,
group=TGRP-TestBinaryField]
> [junit4:junit4]   2> 	   2) Thread[id=23, name=metrics-meter-tick-thread-1, state=TIMED_WAITING,
group=TGRP-TestBinaryField]
> [junit4:junit4]   2> 32189 T10 ccr.ThreadLeakControl.tryToInterruptAll SEVERE There
are still zombie threads that couldn't be terminated:
> [junit4:junit4]   2> 	   1) Thread[id=24, name=metrics-meter-tick-thread-2, state=TIMED_WAITING,
group=TGRP-TestBinaryField]
> [junit4:junit4]   2> 	        at sun.misc.Unsafe.park(Native Method)
> [junit4:junit4]   2> 	        at java.util.concurrent.locks.LockSupport.parkNanos(LockSupport.java:196)
> [junit4:junit4]   2> 	        at java.util.concurrent.locks.AbstractQueuedSynchronizer$ConditionObject.awaitNanos(AbstractQueuedSynchronizer.java:2025)
> [junit4:junit4]   2> 	        at java.util.concurrent.DelayQueue.take(DelayQueue.java:164)
> [junit4:junit4]   2> 	        at java.util.concurrent.ScheduledThreadPoolExecutor$DelayedWorkQueue.take(ScheduledThreadPoolExecutor.java:609)
> [junit4:junit4]   2> 	        at java.util.concurrent.ScheduledThreadPoolExecutor$DelayedWorkQueue.take(ScheduledThreadPoolExecutor.java:602)
> [junit4:junit4]   2> 	        at java.util.concurrent.ThreadPoolExecutor.getTask(ThreadPoolExecutor.java:947)
> [junit4:junit4]   2> 	        at java.util.concurrent.ThreadPoolExecutor$Worker.run(ThreadPoolExecutor.java:907)
> [junit4:junit4]   2> 	        at java.lang.Thread.run(Thread.java:662)
> [junit4:junit4]   2> 	   2) Thread[id=23, name=metrics-meter-tick-thread-1, state=TIMED_WAITING,
group=TGRP-TestBinaryField]
> [junit4:junit4]   2> 	        at sun.misc.Unsafe.park(Native Method)
> [junit4:junit4]   2> 	        at java.util.concurrent.locks.LockSupport.parkNanos(LockSupport.java:196)
> [junit4:junit4]   2> 	        at java.util.concurrent.locks.AbstractQueuedSynchronizer$ConditionObject.awaitNanos(AbstractQueuedSynchronizer.java:2025)
> [junit4:junit4]   2> 	        at java.util.concurrent.DelayQueue.take(DelayQueue.java:164)
> [junit4:junit4]   2> 	        at java.util.concurrent.ScheduledThreadPoolExecutor$DelayedWorkQueue.take(ScheduledThreadPoolExecutor.java:609)
> [junit4:junit4]   2> 	        at java.util.concurrent.ScheduledThreadPoolExecutor$DelayedWorkQueue.take(ScheduledThreadPoolExecutor.java:602)
> [junit4:junit4]   2> 	        at java.util.concurrent.ThreadPoolExecutor.getTask(ThreadPoolExecutor.java:947)
> [junit4:junit4]   2> 	        at java.util.concurrent.ThreadPoolExecutor$Worker.run(ThreadPoolExecutor.java:907)
> [junit4:junit4]   2> 	        at java.lang.Thread.run(Thread.java:662)
> [junit4:junit4]   2> NOTE: test params are: codec=Asserting, sim=RandomSimilarityProvider(queryNorm=true,coord=yes):
{}, locale=hu, timezone=Indian/Mayotte
> [junit4:junit4]   2> NOTE: Windows 7 6.1 x86/Sun Microsystems Inc. 1.6.0_37 (32-bit)/cpus=2,threads=3,free=54791880,total=65470464
> [junit4:junit4]   2> NOTE: All tests run in this JVM: [TestBinaryField]
> [junit4:junit4]   2> NOTE: reproduce with: ant test  -Dtestcase=TestBinaryField -Dtests.seed=28100922E87E2C5D
-Dtests.slow=true -Dtests.locale=hu -Dtests.timezone=Indian/Mayotte -Dtests.file.encoding=ISO-8859-1
> [junit4:junit4] ERROR   0.00s | TestBinaryField (suite) <<<
> [junit4:junit4]    > Throwable #1: com.carrotsearch.randomizedtesting.ThreadLeakError:
2 threads leaked from SUITE scope at org.apache.solr.schema.TestBinaryField: 
> [junit4:junit4]    >    1) Thread[id=24, name=metrics-meter-tick-thread-2, state=TIMED_WAITING,
group=TGRP-TestBinaryField]
> [junit4:junit4]    >         at sun.misc.Unsafe.park(Native Method)
> [junit4:junit4]    >         at java.util.concurrent.locks.LockSupport.parkNanos(LockSupport.java:196)
> [junit4:junit4]    >         at java.util.concurrent.locks.AbstractQueuedSynchronizer$ConditionObject.awaitNanos(AbstractQueuedSynchronizer.java:2025)
> [junit4:junit4]    >         at java.util.concurrent.DelayQueue.take(DelayQueue.java:164)
> [junit4:junit4]    >         at java.util.concurrent.ScheduledThreadPoolExecutor$DelayedWorkQueue.take(ScheduledThreadPoolExecutor.java:609)
> [junit4:junit4]    >         at java.util.concurrent.ScheduledThreadPoolExecutor$DelayedWorkQueue.take(ScheduledThreadPoolExecutor.java:602)
> [junit4:junit4]    >         at java.util.concurrent.ThreadPoolExecutor.getTask(ThreadPoolExecutor.java:947)
> [junit4:junit4]    >         at java.util.concurrent.ThreadPoolExecutor$Worker.run(ThreadPoolExecutor.java:907)
> [junit4:junit4]    >         at java.lang.Thread.run(Thread.java:662)
> [junit4:junit4]    >    2) Thread[id=23, name=metrics-meter-tick-thread-1, state=TIMED_WAITING,
group=TGRP-TestBinaryField]
> [junit4:junit4]    >         at sun.misc.Unsafe.park(Native Method)
> [junit4:junit4]    >         at java.util.concurrent.locks.LockSupport.parkNanos(LockSupport.java:196)
> [junit4:junit4]    >         at java.util.concurrent.locks.AbstractQueuedSynchronizer$ConditionObject.awaitNanos(AbstractQueuedSynchronizer.java:2025)
> [junit4:junit4]    >         at java.util.concurrent.DelayQueue.take(DelayQueue.java:164)
> [junit4:junit4]    >         at java.util.concurrent.ScheduledThreadPoolExecutor$DelayedWorkQueue.take(ScheduledThreadPoolExecutor.java:609)
> [junit4:junit4]    >         at java.util.concurrent.ScheduledThreadPoolExecutor$DelayedWorkQueue.take(ScheduledThreadPoolExecutor.java:602)
> [junit4:junit4]    >         at java.util.concurrent.ThreadPoolExecutor.getTask(ThreadPoolExecutor.java:947)
> [junit4:junit4]    >         at java.util.concurrent.ThreadPoolExecutor$Worker.run(ThreadPoolExecutor.java:907)
> [junit4:junit4]    >         at java.lang.Thread.run(Thread.java:662)
> [junit4:junit4]    > 	at __randomizedtesting.SeedInfo.seed([28100922E87E2C5D]:0)
> [junit4:junit4]    > Throwable #2: com.carrotsearch.randomizedtesting.ThreadLeakError:
There are still zombie threads that couldn't be terminated:
> [junit4:junit4]    >    1) Thread[id=24, name=metrics-meter-tick-thread-2, state=TIMED_WAITING,
group=TGRP-TestBinaryField]
> [junit4:junit4]    >         at sun.misc.Unsafe.park(Native Method)
> [junit4:junit4]    >         at java.util.concurrent.locks.LockSupport.parkNanos(LockSupport.java:196)
> [junit4:junit4]    >         at java.util.concurrent.locks.AbstractQueuedSynchronizer$ConditionObject.awaitNanos(AbstractQueuedSynchronizer.java:2025)
> [junit4:junit4]    >         at java.util.concurrent.DelayQueue.take(DelayQueue.java:164)
> [junit4:junit4]    >         at java.util.concurrent.ScheduledThreadPoolExecutor$DelayedWorkQueue.take(ScheduledThreadPoolExecutor.java:609)
> [junit4:junit4]    >         at java.util.concurrent.ScheduledThreadPoolExecutor$DelayedWorkQueue.take(ScheduledThreadPoolExecutor.java:602)
> [junit4:junit4]    >         at java.util.concurrent.ThreadPoolExecutor.getTask(ThreadPoolExecutor.java:947)
> [junit4:junit4]    >         at java.util.concurrent.ThreadPoolExecutor$Worker.run(ThreadPoolExecutor.java:907)
> [junit4:junit4]    >         at java.lang.Thread.run(Thread.java:662)
> [junit4:junit4]    >    2) Thread[id=23, name=metrics-meter-tick-thread-1, state=TIMED_WAITING,
group=TGRP-TestBinaryField]
> [junit4:junit4]    >         at sun.misc.Unsafe.park(Native Method)
> [junit4:junit4]    >         at java.util.concurrent.locks.LockSupport.parkNanos(LockSupport.java:196)
> [junit4:junit4]    >         at java.util.concurrent.locks.AbstractQueuedSynchronizer$ConditionObject.awaitNanos(AbstractQueuedSynchronizer.java:2025)
> [junit4:junit4]    >         at java.util.concurrent.DelayQueue.take(DelayQueue.java:164)
> [junit4:junit4]    >         at java.util.concurrent.ScheduledThreadPoolExecutor$DelayedWorkQueue.take(ScheduledThreadPoolExecutor.java:609)
> [junit4:junit4]    >         at java.util.concurrent.ScheduledThreadPoolExecutor$DelayedWorkQueue.take(ScheduledThreadPoolExecutor.java:602)
> [junit4:junit4]    >         at java.util.concurrent.ThreadPoolExecutor.getTask(ThreadPoolExecutor.java:947)
> [junit4:junit4]    >         at java.util.concurrent.ThreadPoolExecutor$Worker.run(ThreadPoolExecutor.java:907)
> [junit4:junit4]    >         at java.lang.Thread.run(Thread.java:662)
> [junit4:junit4]    > 	at __randomizedtesting.SeedInfo.seed([28100922E87E2C5D]:0)
> [junit4:junit4] Completed in 33.57s, 1 test, 2 errors <<< FAILURES!
> 
> [...truncated 705 lines...]
> BUILD FAILED
> C:\Users\JenkinsSlave\workspace\Lucene-Solr-trunk-Windows\build.xml:335: The following
error occurred while executing this line:
> C:\Users\JenkinsSlave\workspace\Lucene-Solr-trunk-Windows\build.xml:39: The following
error occurred while executing this line:
> C:\Users\JenkinsSlave\workspace\Lucene-Solr-trunk-Windows\solr\build.xml:178: The following
error occurred while executing this line:
> C:\Users\JenkinsSlave\workspace\Lucene-Solr-trunk-Windows\lucene\module-build.xml:61:
The following error occurred while executing this line:
> C:\Users\JenkinsSlave\workspace\Lucene-Solr-trunk-Windows\lucene\common-build.xml:1163:
The following error occurred while executing this line:
> C:\Users\JenkinsSlave\workspace\Lucene-Solr-trunk-Windows\lucene\common-build.xml:827:
There were test failures: 233 suites, 965 tests, 2 suite-level errors, 881 ignored
> 
> Total time: 19 minutes 42 seconds
> Build step 'Invoke Ant' marked build as failure
> Archiving artifacts
> Recording test results
> Description set: Java: 32bit/jdk1.6.0_37 -client -XX:+UseConcMarkSweepGC
> Email was triggered for: Failure
> Sending email for trigger: Failure
> 
> 
> 
> ---------------------------------------------------------------------
> To unsubscribe, e-mail: dev-unsubscribe@lucene.apache.org
> For additional commands, e-mail: dev-help@lucene.apache.org


---------------------------------------------------------------------
To unsubscribe, e-mail: dev-unsubscribe@lucene.apache.org
For additional commands, e-mail: dev-help@lucene.apache.org


Mime
View raw message