lucene-dev mailing list archives

Site index · List index
Message view « Date » · « Thread »
Top « Date » · « Thread »
From Policeman Jenkins Server <jenk...@sd-datasolutions.de>
Subject [JENKINS] Lucene-Solr-4.x-Windows (32bit/jdk1.7.0_09) - Build # 1561 - Failure!
Date Mon, 12 Nov 2012 07:27:31 GMT
Build: http://jenkins.sd-datasolutions.de/job/Lucene-Solr-4.x-Windows/1561/
Java: 32bit/jdk1.7.0_09 -client -XX:+UseParallelGC

1 tests failed.
REGRESSION:  org.apache.lucene.index.TestConcurrentMergeScheduler.testMaxMergeCount

Error Message:
count should be <= maxMergeCount (= 3)

Stack Trace:
java.lang.IllegalArgumentException: count should be <= maxMergeCount (= 3)
	at __randomizedtesting.SeedInfo.seed([59A6E4BF887057AB:8EC1750C34B1C82D]:0)
	at org.apache.lucene.index.ConcurrentMergeScheduler.setMaxThreadCount(ConcurrentMergeScheduler.java:90)
	at org.apache.lucene.index.TestConcurrentMergeScheduler.testMaxMergeCount(TestConcurrentMergeScheduler.java:303)
	at sun.reflect.NativeMethodAccessorImpl.invoke0(Native Method)
	at sun.reflect.NativeMethodAccessorImpl.invoke(NativeMethodAccessorImpl.java:57)
	at sun.reflect.DelegatingMethodAccessorImpl.invoke(DelegatingMethodAccessorImpl.java:43)
	at java.lang.reflect.Method.invoke(Method.java:601)
	at com.carrotsearch.randomizedtesting.RandomizedRunner.invoke(RandomizedRunner.java:1559)
	at com.carrotsearch.randomizedtesting.RandomizedRunner.access$600(RandomizedRunner.java:79)
	at com.carrotsearch.randomizedtesting.RandomizedRunner$6.evaluate(RandomizedRunner.java:737)
	at com.carrotsearch.randomizedtesting.RandomizedRunner$7.evaluate(RandomizedRunner.java:773)
	at com.carrotsearch.randomizedtesting.RandomizedRunner$8.evaluate(RandomizedRunner.java:787)
	at org.apache.lucene.util.TestRuleSetupTeardownChained$1.evaluate(TestRuleSetupTeardownChained.java:50)
	at org.apache.lucene.util.TestRuleFieldCacheSanity$1.evaluate(TestRuleFieldCacheSanity.java:51)
	at org.apache.lucene.util.AbstractBeforeAfterRule$1.evaluate(AbstractBeforeAfterRule.java:45)
	at com.carrotsearch.randomizedtesting.rules.SystemPropertiesInvariantRule$1.evaluate(SystemPropertiesInvariantRule.java:55)
	at org.apache.lucene.util.TestRuleThreadAndTestName$1.evaluate(TestRuleThreadAndTestName.java:48)
	at org.apache.lucene.util.TestRuleIgnoreAfterMaxFailures$1.evaluate(TestRuleIgnoreAfterMaxFailures.java:70)
	at org.apache.lucene.util.TestRuleMarkFailure$1.evaluate(TestRuleMarkFailure.java:48)
	at com.carrotsearch.randomizedtesting.rules.StatementAdapter.evaluate(StatementAdapter.java:36)
	at com.carrotsearch.randomizedtesting.ThreadLeakControl$StatementRunner.run(ThreadLeakControl.java:358)
	at com.carrotsearch.randomizedtesting.ThreadLeakControl.forkTimeoutingTask(ThreadLeakControl.java:782)
	at com.carrotsearch.randomizedtesting.ThreadLeakControl$3.evaluate(ThreadLeakControl.java:442)
	at com.carrotsearch.randomizedtesting.RandomizedRunner.runSingleTest(RandomizedRunner.java:746)
	at com.carrotsearch.randomizedtesting.RandomizedRunner$3.evaluate(RandomizedRunner.java:648)
	at com.carrotsearch.randomizedtesting.RandomizedRunner$4.evaluate(RandomizedRunner.java:682)
	at com.carrotsearch.randomizedtesting.RandomizedRunner$5.evaluate(RandomizedRunner.java:693)
	at org.apache.lucene.util.AbstractBeforeAfterRule$1.evaluate(AbstractBeforeAfterRule.java:45)
	at org.apache.lucene.util.TestRuleStoreClassName$1.evaluate(TestRuleStoreClassName.java:42)
	at com.carrotsearch.randomizedtesting.rules.SystemPropertiesInvariantRule$1.evaluate(SystemPropertiesInvariantRule.java:55)
	at com.carrotsearch.randomizedtesting.rules.NoShadowingOrOverridesOnMethodsRule$1.evaluate(NoShadowingOrOverridesOnMethodsRule.java:39)
	at com.carrotsearch.randomizedtesting.rules.NoShadowingOrOverridesOnMethodsRule$1.evaluate(NoShadowingOrOverridesOnMethodsRule.java:39)
	at com.carrotsearch.randomizedtesting.rules.StatementAdapter.evaluate(StatementAdapter.java:36)
	at org.apache.lucene.util.TestRuleAssertionsRequired$1.evaluate(TestRuleAssertionsRequired.java:43)
	at org.apache.lucene.util.TestRuleMarkFailure$1.evaluate(TestRuleMarkFailure.java:48)
	at org.apache.lucene.util.TestRuleIgnoreAfterMaxFailures$1.evaluate(TestRuleIgnoreAfterMaxFailures.java:70)
	at org.apache.lucene.util.TestRuleIgnoreTestSuites$1.evaluate(TestRuleIgnoreTestSuites.java:55)
	at com.carrotsearch.randomizedtesting.rules.StatementAdapter.evaluate(StatementAdapter.java:36)
	at com.carrotsearch.randomizedtesting.ThreadLeakControl$StatementRunner.run(ThreadLeakControl.java:358)
	at java.lang.Thread.run(Thread.java:722)




Build Log:
[...truncated 827 lines...]
[junit4:junit4] Suite: org.apache.lucene.index.TestConcurrentMergeScheduler
[junit4:junit4]   2> NOTE: reproduce with: ant test  -Dtestcase=TestConcurrentMergeScheduler
-Dtests.method=testMaxMergeCount -Dtests.seed=59A6E4BF887057AB -Dtests.slow=true -Dtests.locale=en_IN
-Dtests.timezone=America/Argentina/Buenos_Aires -Dtests.file.encoding=ISO-8859-1
[junit4:junit4] ERROR   0.01s | TestConcurrentMergeScheduler.testMaxMergeCount <<<
[junit4:junit4]    > Throwable #1: java.lang.IllegalArgumentException: count should be
<= maxMergeCount (= 3)
[junit4:junit4]    > 	at __randomizedtesting.SeedInfo.seed([59A6E4BF887057AB:8EC1750C34B1C82D]:0)
[junit4:junit4]    > 	at org.apache.lucene.index.ConcurrentMergeScheduler.setMaxThreadCount(ConcurrentMergeScheduler.java:90)
[junit4:junit4]    > 	at org.apache.lucene.index.TestConcurrentMergeScheduler.testMaxMergeCount(TestConcurrentMergeScheduler.java:303)
[junit4:junit4]    > 	at sun.reflect.NativeMethodAccessorImpl.invoke0(Native Method)
[junit4:junit4]    > 	at sun.reflect.NativeMethodAccessorImpl.invoke(NativeMethodAccessorImpl.java:57)
[junit4:junit4]    > 	at sun.reflect.DelegatingMethodAccessorImpl.invoke(DelegatingMethodAccessorImpl.java:43)
[junit4:junit4]    > 	at java.lang.reflect.Method.invoke(Method.java:601)
[junit4:junit4]    > 	at com.carrotsearch.randomizedtesting.RandomizedRunner.invoke(RandomizedRunner.java:1559)
[junit4:junit4]    > 	at com.carrotsearch.randomizedtesting.RandomizedRunner.access$600(RandomizedRunner.java:79)
[junit4:junit4]    > 	at com.carrotsearch.randomizedtesting.RandomizedRunner$6.evaluate(RandomizedRunner.java:737)
[junit4:junit4]    > 	at com.carrotsearch.randomizedtesting.RandomizedRunner$7.evaluate(RandomizedRunner.java:773)
[junit4:junit4]    > 	at com.carrotsearch.randomizedtesting.RandomizedRunner$8.evaluate(RandomizedRunner.java:787)
[junit4:junit4]    > 	at org.apache.lucene.util.TestRuleSetupTeardownChained$1.evaluate(TestRuleSetupTeardownChained.java:50)
[junit4:junit4]    > 	at org.apache.lucene.util.TestRuleFieldCacheSanity$1.evaluate(TestRuleFieldCacheSanity.java:51)
[junit4:junit4]    > 	at org.apache.lucene.util.AbstractBeforeAfterRule$1.evaluate(AbstractBeforeAfterRule.java:45)
[junit4:junit4]    > 	at com.carrotsearch.randomizedtesting.rules.SystemPropertiesInvariantRule$1.evaluate(SystemPropertiesInvariantRule.java:55)
[junit4:junit4]    > 	at org.apache.lucene.util.TestRuleThreadAndTestName$1.evaluate(TestRuleThreadAndTestName.java:48)
[junit4:junit4]    > 	at org.apache.lucene.util.TestRuleIgnoreAfterMaxFailures$1.evaluate(TestRuleIgnoreAfterMaxFailures.java:70)
[junit4:junit4]    > 	at org.apache.lucene.util.TestRuleMarkFailure$1.evaluate(TestRuleMarkFailure.java:48)
[junit4:junit4]    > 	at com.carrotsearch.randomizedtesting.rules.StatementAdapter.evaluate(StatementAdapter.java:36)
[junit4:junit4]    > 	at com.carrotsearch.randomizedtesting.ThreadLeakControl$StatementRunner.run(ThreadLeakControl.java:358)
[junit4:junit4]    > 	at com.carrotsearch.randomizedtesting.ThreadLeakControl.forkTimeoutingTask(ThreadLeakControl.java:782)
[junit4:junit4]    > 	at com.carrotsearch.randomizedtesting.ThreadLeakControl$3.evaluate(ThreadLeakControl.java:442)
[junit4:junit4]    > 	at com.carrotsearch.randomizedtesting.RandomizedRunner.runSingleTest(RandomizedRunner.java:746)
[junit4:junit4]    > 	at com.carrotsearch.randomizedtesting.RandomizedRunner$3.evaluate(RandomizedRunner.java:648)
[junit4:junit4]    > 	at com.carrotsearch.randomizedtesting.RandomizedRunner$4.evaluate(RandomizedRunner.java:682)
[junit4:junit4]    > 	at com.carrotsearch.randomizedtesting.RandomizedRunner$5.evaluate(RandomizedRunner.java:693)
[junit4:junit4]    > 	at org.apache.lucene.util.AbstractBeforeAfterRule$1.evaluate(AbstractBeforeAfterRule.java:45)
[junit4:junit4]    > 	at org.apache.lucene.util.TestRuleStoreClassName$1.evaluate(TestRuleStoreClassName.java:42)
[junit4:junit4]    > 	at com.carrotsearch.randomizedtesting.rules.SystemPropertiesInvariantRule$1.evaluate(SystemPropertiesInvariantRule.java:55)
[junit4:junit4]    > 	at com.carrotsearch.randomizedtesting.rules.NoShadowingOrOverridesOnMethodsRule$1.evaluate(NoShadowingOrOverridesOnMethodsRule.java:39)
[junit4:junit4]    > 	at com.carrotsearch.randomizedtesting.rules.NoShadowingOrOverridesOnMethodsRule$1.evaluate(NoShadowingOrOverridesOnMethodsRule.java:39)
[junit4:junit4]    > 	at com.carrotsearch.randomizedtesting.rules.StatementAdapter.evaluate(StatementAdapter.java:36)
[junit4:junit4]    > 	at org.apache.lucene.util.TestRuleAssertionsRequired$1.evaluate(TestRuleAssertionsRequired.java:43)
[junit4:junit4]    > 	at org.apache.lucene.util.TestRuleMarkFailure$1.evaluate(TestRuleMarkFailure.java:48)
[junit4:junit4]    > 	at org.apache.lucene.util.TestRuleIgnoreAfterMaxFailures$1.evaluate(TestRuleIgnoreAfterMaxFailures.java:70)
[junit4:junit4]    > 	at org.apache.lucene.util.TestRuleIgnoreTestSuites$1.evaluate(TestRuleIgnoreTestSuites.java:55)
[junit4:junit4]    > 	at com.carrotsearch.randomizedtesting.rules.StatementAdapter.evaluate(StatementAdapter.java:36)
[junit4:junit4]    > 	at com.carrotsearch.randomizedtesting.ThreadLeakControl$StatementRunner.run(ThreadLeakControl.java:358)
[junit4:junit4]    > 	at java.lang.Thread.run(Thread.java:722)
[junit4:junit4]   2> NOTE: test params are: codec=Lucene41: {content=PostingsFormat(name=SimpleText),
id=PostingsFormat(name=MockSep)}, sim=DefaultSimilarity, locale=en_IN, timezone=America/Argentina/Buenos_Aires
[junit4:junit4]   2> NOTE: Windows 7 6.1 x86/Oracle Corporation 1.7.0_09 (32-bit)/cpus=2,threads=1,free=61109472,total=331284480
[junit4:junit4]   2> NOTE: All tests run in this JVM: [TestFieldCacheRewriteMethod, TestSloppyPhraseQuery,
Nested, Nested, TestCrash, TestSpecialOperations, TestIndexFileDeleter, TestForTooMuchCloning,
TestNorms, TestScoreCachingWrappingScorer, TestLongPostings, TestCrashCausesCorruptIndex,
ThrowInUncaught, TestSimpleSearchEquivalence, TestTermVectorsWriter, TestTermVectorsReader,
TestNumericTokenStream, TestSimilarity, TestAtomicUpdate, TestLucene40PostingsFormat, TestScorerPerf,
TestConjunctions, TestFieldCacheRangeFilter, TestFileSwitchDirectory, TestBufferedIndexInput,
TestDateFilter, TestMultiValuedNumericRangeQuery, TestField, TestLazyProxSkipping, TestDemo,
TestNot, TestCompoundFile, TestDateTools, TestRecyclingByteBlockAllocator, TestByteArrayDataInput,
TestCustomNorms, TestIndexWriterReader, TestCopyBytes, TestSearchAfter, TestPositiveScoresOnlyCollector,
Test4GBStoredFields, TestIndexWriterOnDiskFull, TestFieldInfos, TestPrefixFilter, TestMinimize,
TestDocValuesScoring, TestIndexWriterConfig, TestNamedSPILoader, TestPayloadTermQuery, TestNGramPhraseQuery,
TestBlockPostingsFormat2, TestIndexWriterCommit, TestLock, TestPrefixCodedTerms, TestBasicOperations,
Nested, TestMockAnalyzer, TestPostingsOffsets, TestDocTermOrds, TestBitUtil, TestAddIndexes,
TestMergeSchedulerExternal, TestPayloads, TestTermsEnum, TestPerSegmentDeletes, TestPriorityQueue,
TestPhrasePrefixQuery, TestUnicodeUtil, TestRamUsageEstimatorOnWildAnimals, TestPackedInts,
TestNRTCachingDirectory, Nested1, Nested, Nested, Nested, Nested, Nested, Nested, Nested,
Nested, Nested, Nested, Nested, Nested, Nested, Nested, Nested, Nested, Nested, Nested, Nested,
Nested, Nested, TestFlushByRamOrCountsPolicy, TestTopDocsCollector, TestPerFieldPostingsFormat2,
TestAttributeSource, TestDocCount, TestSort, TestSpans, TestFieldValueFilter, TestParallelReaderEmptyIndex,
TestIndexableBinaryStringTools, TestAllFilesHaveCodecHeader, TestLucene40PostingsReader, TestDocValues,
TestNoMergePolicy, TestRollingBuffer, TestIOUtils, TestConstantScoreQuery, TestDocsAndPositions,
TestWindowsMMap, TestTimeLimitingCollector, TestOmitPositions, TestDocBoost, TestDeletionPolicy,
TestTopDocsMerge, TestFieldCache, TestCharTermAttributeImpl, TestTerm, TestSimilarityProvider,
TestMultiMMap, TestPostingsFormat, TestConsistentFieldNumbers, TestDirectoryReader, TestMultiTermQueryRewrites,
TestFixedBitSet, TestTopScoreDocCollector, TestVersionComparator, TestReuseDocsEnum, Test2BPostings,
TestCustomSearcherSort, TestMockCharFilter, TestSmallFloat, TestMaxTermFrequency, InBeforeClass,
InAfterClass, NonStringProperties, InTestMethod, TestExternalCodecs, TestParallelCompositeReader,
TestCollectionUtil, TestSearchWithThreads, TestBlockPostingsFormat, TestSizeBoundedForceMerge,
TestBinaryTerms, TestPagedBytes, TestStressAdvance, TestLookaheadTokenFilter, TestNRTReaderWithThreads,
TestSloppyPhraseQuery2, TestSpanMultiTermQueryWrapper, Test2BDocs, TestSegmentTermEnum, TestIndexWriterWithThreads,
TestAssertions, TestCheckIndex, TestCachingCollector, TestTermInfosReaderIndex, TestSameTokenSamePosition,
TestFilterIterator, TestReaderClosed, TestRamUsageEstimator, TestTermVectors, TestDateSort,
Nested1, TestPrefixInBooleanQuery, TestPerFieldPostingsFormat, TestIndexWriterExceptions,
TestSpanFirstQuery, TestMockDirectoryWrapper, TestPrefixQuery, TestCodecs, TestPrefixRandom,
TestCharFilter, TestIndexCommit, TestBooleanScorer, TestSegmentReader, TestNRTThreads, TestDocValuesTypeCompatibility,
TestBytesRef, TestDocumentsWriterStallControl, TestIndexableField, TestRAMDirectory, TestBackwardsCompatibility,
Test2BPostingsBytes, TestPayloadSpans, TestFSTs, TestGraphTokenizers, TestShardSearching,
TestBoolean2, TestNumericRangeQuery64, TestSearcherManager, TestNumericRangeQuery32, TestBasics,
TestByteSlices, TestDuelingCodecs, TestIndexWriter, TestIndexWriterMerging, TestOpenBitSet,
TestIndexWriterMergePolicy, TestNeverDelete, TestPersistentSnapshotDeletionPolicy, TestNRTManager,
TestIndexWriterUnicode, TestArrayUtil, TestIndexWriterDelete, TestDirectoryReaderReopen, TestIndexWriterForceMerge,
TestToken, TestWeakIdentityMap, TestTypePromotion, TestSimpleExplanations, TestStressIndexing,
TestSnapshotDeletionPolicy, TestDeterminizeLexicon, TestIndexWriterNRTIsCurrent, TestRegexpRandom2,
TestTieredMergePolicy, TestDocValuesIndexing, TestConcurrentMergeScheduler]
[junit4:junit4] Completed in 2.26s, 5 tests, 1 error <<< FAILURES!

[...truncated 401 lines...]
BUILD FAILED
C:\Users\JenkinsSlave\workspace\Lucene-Solr-4.x-Windows\build.xml:337: The following error
occurred while executing this line:
C:\Users\JenkinsSlave\workspace\Lucene-Solr-4.x-Windows\build.xml:39: The following error
occurred while executing this line:
C:\Users\JenkinsSlave\workspace\Lucene-Solr-4.x-Windows\lucene\build.xml:50: The following
error occurred while executing this line:
C:\Users\JenkinsSlave\workspace\Lucene-Solr-4.x-Windows\lucene\common-build.xml:1163: The
following error occurred while executing this line:
C:\Users\JenkinsSlave\workspace\Lucene-Solr-4.x-Windows\lucene\common-build.xml:827: There
were test failures: 325 suites, 1862 tests, 1 error, 20 ignored (9 assumptions)

Total time: 9 minutes 15 seconds
Build step 'Invoke Ant' marked build as failure
Archiving artifacts
Recording test results
Description set: Java: 32bit/jdk1.7.0_09 -client -XX:+UseParallelGC
Email was triggered for: Failure
Sending email for trigger: Failure



Mime
View raw message