lucene-dev mailing list archives

Site index · List index
Message view « Date » · « Thread »
Top « Date » · « Thread »
From Policeman Jenkins Server <jenk...@sd-datasolutions.de>
Subject [JENKINS] Lucene-Solr-trunk-Linux (32bit/jdk1.8.0-ea-b58) - Build # 2126 - Failure!
Date Thu, 01 Nov 2012 05:43:57 GMT
Build: http://jenkins.sd-datasolutions.de/job/Lucene-Solr-trunk-Linux/2126/
Java: 32bit/jdk1.8.0-ea-b58 -client -XX:+UseG1GC

1 tests failed.
REGRESSION:  org.apache.lucene.queries.TermsFilterTest.testHashCodeAndEquals

Error Message:


Stack Trace:
java.lang.AssertionError
	at __randomizedtesting.SeedInfo.seed([B4184C56BE5ED838:CEC56212074FA4CD]:0)
	at org.junit.Assert.fail(Assert.java:92)
	at org.junit.Assert.assertTrue(Assert.java:43)
	at org.junit.Assert.assertNotNull(Assert.java:526)
	at org.junit.Assert.assertNotNull(Assert.java:537)
	at org.apache.lucene.queries.TermsFilterTest.termsFilter(TermsFilterTest.java:270)
	at org.apache.lucene.queries.TermsFilterTest.testHashCodeAndEquals(TermsFilterTest.java:293)
	at sun.reflect.NativeMethodAccessorImpl.invoke0(Native Method)
	at sun.reflect.NativeMethodAccessorImpl.invoke(NativeMethodAccessorImpl.java:57)
	at sun.reflect.DelegatingMethodAccessorImpl.invoke(DelegatingMethodAccessorImpl.java:43)
	at java.lang.reflect.Method.invoke(Method.java:474)
	at com.carrotsearch.randomizedtesting.RandomizedRunner.invoke(RandomizedRunner.java:1559)
	at com.carrotsearch.randomizedtesting.RandomizedRunner.access$600(RandomizedRunner.java:79)
	at com.carrotsearch.randomizedtesting.RandomizedRunner$6.evaluate(RandomizedRunner.java:737)
	at com.carrotsearch.randomizedtesting.RandomizedRunner$7.evaluate(RandomizedRunner.java:773)
	at com.carrotsearch.randomizedtesting.RandomizedRunner$8.evaluate(RandomizedRunner.java:787)
	at org.apache.lucene.util.TestRuleSetupTeardownChained$1.evaluate(TestRuleSetupTeardownChained.java:50)
	at org.apache.lucene.util.TestRuleFieldCacheSanity$1.evaluate(TestRuleFieldCacheSanity.java:51)
	at org.apache.lucene.util.AbstractBeforeAfterRule$1.evaluate(AbstractBeforeAfterRule.java:45)
	at com.carrotsearch.randomizedtesting.rules.SystemPropertiesInvariantRule$1.evaluate(SystemPropertiesInvariantRule.java:55)
	at org.apache.lucene.util.TestRuleThreadAndTestName$1.evaluate(TestRuleThreadAndTestName.java:48)
	at org.apache.lucene.util.TestRuleIgnoreAfterMaxFailures$1.evaluate(TestRuleIgnoreAfterMaxFailures.java:70)
	at org.apache.lucene.util.TestRuleMarkFailure$1.evaluate(TestRuleMarkFailure.java:48)
	at com.carrotsearch.randomizedtesting.rules.StatementAdapter.evaluate(StatementAdapter.java:36)
	at com.carrotsearch.randomizedtesting.ThreadLeakControl$StatementRunner.run(ThreadLeakControl.java:358)
	at com.carrotsearch.randomizedtesting.ThreadLeakControl.forkTimeoutingTask(ThreadLeakControl.java:782)
	at com.carrotsearch.randomizedtesting.ThreadLeakControl$3.evaluate(ThreadLeakControl.java:442)
	at com.carrotsearch.randomizedtesting.RandomizedRunner.runSingleTest(RandomizedRunner.java:746)
	at com.carrotsearch.randomizedtesting.RandomizedRunner$3.evaluate(RandomizedRunner.java:648)
	at com.carrotsearch.randomizedtesting.RandomizedRunner$4.evaluate(RandomizedRunner.java:682)
	at com.carrotsearch.randomizedtesting.RandomizedRunner$5.evaluate(RandomizedRunner.java:693)
	at org.apache.lucene.util.AbstractBeforeAfterRule$1.evaluate(AbstractBeforeAfterRule.java:45)
	at org.apache.lucene.util.TestRuleStoreClassName$1.evaluate(TestRuleStoreClassName.java:42)
	at com.carrotsearch.randomizedtesting.rules.SystemPropertiesInvariantRule$1.evaluate(SystemPropertiesInvariantRule.java:55)
	at com.carrotsearch.randomizedtesting.rules.NoShadowingOrOverridesOnMethodsRule$1.evaluate(NoShadowingOrOverridesOnMethodsRule.java:39)
	at com.carrotsearch.randomizedtesting.rules.NoShadowingOrOverridesOnMethodsRule$1.evaluate(NoShadowingOrOverridesOnMethodsRule.java:39)
	at com.carrotsearch.randomizedtesting.rules.StatementAdapter.evaluate(StatementAdapter.java:36)
	at org.apache.lucene.util.TestRuleAssertionsRequired$1.evaluate(TestRuleAssertionsRequired.java:43)
	at org.apache.lucene.util.TestRuleMarkFailure$1.evaluate(TestRuleMarkFailure.java:48)
	at org.apache.lucene.util.TestRuleIgnoreAfterMaxFailures$1.evaluate(TestRuleIgnoreAfterMaxFailures.java:70)
	at org.apache.lucene.util.TestRuleIgnoreTestSuites$1.evaluate(TestRuleIgnoreTestSuites.java:55)
	at com.carrotsearch.randomizedtesting.rules.StatementAdapter.evaluate(StatementAdapter.java:36)
	at com.carrotsearch.randomizedtesting.ThreadLeakControl$StatementRunner.run(ThreadLeakControl.java:358)
	at java.lang.Thread.run(Thread.java:722)




Build Log:
[...truncated 7331 lines...]
[junit4:junit4] Suite: org.apache.lucene.queries.TermsFilterTest
[junit4:junit4]   2> NOTE: reproduce with: ant test  -Dtestcase=TermsFilterTest -Dtests.method=testHashCodeAndEquals
-Dtests.seed=B4184C56BE5ED838 -Dtests.multiplier=3 -Dtests.slow=true -Dtests.locale=sr_BA
-Dtests.timezone=Atlantic/St_Helena -Dtests.file.encoding=ISO-8859-1
[junit4:junit4] FAILURE 0.04s J1 | TermsFilterTest.testHashCodeAndEquals <<<
[junit4:junit4]    > Throwable #1: java.lang.AssertionError
[junit4:junit4]    > 	at __randomizedtesting.SeedInfo.seed([B4184C56BE5ED838:CEC56212074FA4CD]:0)
[junit4:junit4]    > 	at org.junit.Assert.fail(Assert.java:92)
[junit4:junit4]    > 	at org.junit.Assert.assertTrue(Assert.java:43)
[junit4:junit4]    > 	at org.junit.Assert.assertNotNull(Assert.java:526)
[junit4:junit4]    > 	at org.junit.Assert.assertNotNull(Assert.java:537)
[junit4:junit4]    > 	at org.apache.lucene.queries.TermsFilterTest.termsFilter(TermsFilterTest.java:270)
[junit4:junit4]    > 	at org.apache.lucene.queries.TermsFilterTest.testHashCodeAndEquals(TermsFilterTest.java:293)
[junit4:junit4]    > 	at sun.reflect.NativeMethodAccessorImpl.invoke0(Native Method)
[junit4:junit4]    > 	at sun.reflect.NativeMethodAccessorImpl.invoke(NativeMethodAccessorImpl.java:57)
[junit4:junit4]    > 	at sun.reflect.DelegatingMethodAccessorImpl.invoke(DelegatingMethodAccessorImpl.java:43)
[junit4:junit4]    > 	at java.lang.reflect.Method.invoke(Method.java:474)
[junit4:junit4]    > 	at com.carrotsearch.randomizedtesting.RandomizedRunner.invoke(RandomizedRunner.java:1559)
[junit4:junit4]    > 	at com.carrotsearch.randomizedtesting.RandomizedRunner.access$600(RandomizedRunner.java:79)
[junit4:junit4]    > 	at com.carrotsearch.randomizedtesting.RandomizedRunner$6.evaluate(RandomizedRunner.java:737)
[junit4:junit4]    > 	at com.carrotsearch.randomizedtesting.RandomizedRunner$7.evaluate(RandomizedRunner.java:773)
[junit4:junit4]    > 	at com.carrotsearch.randomizedtesting.RandomizedRunner$8.evaluate(RandomizedRunner.java:787)
[junit4:junit4]    > 	at org.apache.lucene.util.TestRuleSetupTeardownChained$1.evaluate(TestRuleSetupTeardownChained.java:50)
[junit4:junit4]    > 	at org.apache.lucene.util.TestRuleFieldCacheSanity$1.evaluate(TestRuleFieldCacheSanity.java:51)
[junit4:junit4]    > 	at org.apache.lucene.util.AbstractBeforeAfterRule$1.evaluate(AbstractBeforeAfterRule.java:45)
[junit4:junit4]    > 	at com.carrotsearch.randomizedtesting.rules.SystemPropertiesInvariantRule$1.evaluate(SystemPropertiesInvariantRule.java:55)
[junit4:junit4]    > 	at org.apache.lucene.util.TestRuleThreadAndTestName$1.evaluate(TestRuleThreadAndTestName.java:48)
[junit4:junit4]    > 	at org.apache.lucene.util.TestRuleIgnoreAfterMaxFailures$1.evaluate(TestRuleIgnoreAfterMaxFailures.java:70)
[junit4:junit4]    > 	at org.apache.lucene.util.TestRuleMarkFailure$1.evaluate(TestRuleMarkFailure.java:48)
[junit4:junit4]    > 	at com.carrotsearch.randomizedtesting.rules.StatementAdapter.evaluate(StatementAdapter.java:36)
[junit4:junit4]    > 	at com.carrotsearch.randomizedtesting.ThreadLeakControl$StatementRunner.run(ThreadLeakControl.java:358)
[junit4:junit4]    > 	at com.carrotsearch.randomizedtesting.ThreadLeakControl.forkTimeoutingTask(ThreadLeakControl.java:782)
[junit4:junit4]    > 	at com.carrotsearch.randomizedtesting.ThreadLeakControl$3.evaluate(ThreadLeakControl.java:442)
[junit4:junit4]    > 	at com.carrotsearch.randomizedtesting.RandomizedRunner.runSingleTest(RandomizedRunner.java:746)
[junit4:junit4]    > 	at com.carrotsearch.randomizedtesting.RandomizedRunner$3.evaluate(RandomizedRunner.java:648)
[junit4:junit4]    > 	at com.carrotsearch.randomizedtesting.RandomizedRunner$4.evaluate(RandomizedRunner.java:682)
[junit4:junit4]    > 	at com.carrotsearch.randomizedtesting.RandomizedRunner$5.evaluate(RandomizedRunner.java:693)
[junit4:junit4]    > 	at org.apache.lucene.util.AbstractBeforeAfterRule$1.evaluate(AbstractBeforeAfterRule.java:45)
[junit4:junit4]    > 	at org.apache.lucene.util.TestRuleStoreClassName$1.evaluate(TestRuleStoreClassName.java:42)
[junit4:junit4]    > 	at com.carrotsearch.randomizedtesting.rules.SystemPropertiesInvariantRule$1.evaluate(SystemPropertiesInvariantRule.java:55)
[junit4:junit4]    > 	at com.carrotsearch.randomizedtesting.rules.NoShadowingOrOverridesOnMethodsRule$1.evaluate(NoShadowingOrOverridesOnMethodsRule.java:39)
[junit4:junit4]    > 	at com.carrotsearch.randomizedtesting.rules.NoShadowingOrOverridesOnMethodsRule$1.evaluate(NoShadowingOrOverridesOnMethodsRule.java:39)
[junit4:junit4]    > 	at com.carrotsearch.randomizedtesting.rules.StatementAdapter.evaluate(StatementAdapter.java:36)
[junit4:junit4]    > 	at org.apache.lucene.util.TestRuleAssertionsRequired$1.evaluate(TestRuleAssertionsRequired.java:43)
[junit4:junit4]    > 	at org.apache.lucene.util.TestRuleMarkFailure$1.evaluate(TestRuleMarkFailure.java:48)
[junit4:junit4]    > 	at org.apache.lucene.util.TestRuleIgnoreAfterMaxFailures$1.evaluate(TestRuleIgnoreAfterMaxFailures.java:70)
[junit4:junit4]    > 	at org.apache.lucene.util.TestRuleIgnoreTestSuites$1.evaluate(TestRuleIgnoreTestSuites.java:55)
[junit4:junit4]    > 	at com.carrotsearch.randomizedtesting.rules.StatementAdapter.evaluate(StatementAdapter.java:36)
[junit4:junit4]    > 	at com.carrotsearch.randomizedtesting.ThreadLeakControl$StatementRunner.run(ThreadLeakControl.java:358)
[junit4:junit4]    > 	at java.lang.Thread.run(Thread.java:722)
[junit4:junit4]   2> NOTE: test params are: codec=Lucene41: {field29=PostingsFormat(name=MockRandom),
field89=Pulsing41(freqCutoff=16 minBlockSize=94 maxBlockSize=277), field93=PostingsFormat(name=Memory
doPackFST= false), field22=PostingsFormat(name=Asserting), field5=Pulsing41(freqCutoff=16
minBlockSize=94 maxBlockSize=277), field20=PostingsFormat(name=Memory doPackFST= false), field87=PostingsFormat(name=MockRandom),
field82=PostingsFormat(name=Memory doPackFST= false), field24=PostingsFormat(name=Memory doPackFST=
false), field95=PostingsFormat(name=Asserting), field78=Pulsing41(freqCutoff=16 minBlockSize=94
maxBlockSize=277), field44=PostingsFormat(name=Asserting), field6=PostingsFormat(name=Memory
doPackFST= false), field62=PostingsFormat(name=Asserting), field79=PostingsFormat(name=Memory
doPackFST= false), field1=Pulsing41(freqCutoff=16 minBlockSize=94 maxBlockSize=277), field81=Pulsing41(freqCutoff=16
minBlockSize=94 maxBlockSize=277), field77=PostingsFormat(name=Asserting), field30=Pulsing41(freqCutoff=16
minBlockSize=94 maxBlockSize=277), field58=PostingsFormat(name=MockRandom), field71=PostingsFormat(name=Memory
doPackFST= false), field19=PostingsFormat(name=Asserting), field63=Pulsing41(freqCutoff=16
minBlockSize=94 maxBlockSize=277), field65=PostingsFormat(name=MockRandom), field16=Pulsing41(freqCutoff=16
minBlockSize=94 maxBlockSize=277), field55=PostingsFormat(name=Asserting), field60=PostingsFormat(name=Memory
doPackFST= false), field18=PostingsFormat(name=MockRandom), field45=Pulsing41(freqCutoff=16
minBlockSize=94 maxBlockSize=277), field43=PostingsFormat(name=MockRandom), field67=Pulsing41(freqCutoff=16
minBlockSize=94 maxBlockSize=277), field23=Pulsing41(freqCutoff=16 minBlockSize=94 maxBlockSize=277),
field97=PostingsFormat(name=Memory doPackFST= false), field54=PostingsFormat(name=MockRandom),
field42=PostingsFormat(name=Memory doPackFST= false), field40=PostingsFormat(name=Asserting),
field21=PostingsFormat(name=MockRandom), field27=Pulsing41(freqCutoff=16 minBlockSize=94 maxBlockSize=277),
field38=Pulsing41(freqCutoff=16 minBlockSize=94 maxBlockSize=277), field46=PostingsFormat(name=Memory
doPackFST= false), field10=PostingsFormat(name=MockRandom), field90=PostingsFormat(name=MockRandom),
field85=Pulsing41(freqCutoff=16 minBlockSize=94 maxBlockSize=277), field9=Pulsing41(freqCutoff=16
minBlockSize=94 maxBlockSize=277), field4=PostingsFormat(name=Asserting), field3=PostingsFormat(name=MockRandom),
field49=Pulsing41(freqCutoff=16 minBlockSize=94 maxBlockSize=277), field35=PostingsFormat(name=Memory
doPackFST= false), field68=PostingsFormat(name=Memory doPackFST= false), field69=PostingsFormat(name=MockRandom),
field57=PostingsFormat(name=Memory doPackFST= false), field28=PostingsFormat(name=Memory doPackFST=
false), field2=PostingsFormat(name=Memory doPackFST= false), field0=PostingsFormat(name=Asserting),
field12=Pulsing41(freqCutoff=16 minBlockSize=94 maxBlockSize=277), field25=PostingsFormat(name=MockRandom),
field11=PostingsFormat(name=Asserting), field66=PostingsFormat(name=Asserting), field91=PostingsFormat(name=Asserting),
field39=PostingsFormat(name=Memory doPackFST= false), field37=PostingsFormat(name=Asserting),
field7=PostingsFormat(name=MockRandom), field88=PostingsFormat(name=Asserting), field61=PostingsFormat(name=MockRandom),
field48=PostingsFormat(name=Asserting), field56=Pulsing41(freqCutoff=16 minBlockSize=94 maxBlockSize=277),
field86=PostingsFormat(name=Memory doPackFST= false), field94=PostingsFormat(name=MockRandom),
field50=PostingsFormat(name=MockRandom), field96=Pulsing41(freqCutoff=16 minBlockSize=94 maxBlockSize=277),
field41=Pulsing41(freqCutoff=16 minBlockSize=94 maxBlockSize=277), field83=PostingsFormat(name=MockRandom),
field59=PostingsFormat(name=Asserting), field33=PostingsFormat(name=Asserting), field75=PostingsFormat(name=Memory
doPackFST= false), field84=PostingsFormat(name=Asserting), field80=PostingsFormat(name=Asserting),
field51=PostingsFormat(name=Asserting), field31=PostingsFormat(name=Memory doPackFST= false),
field34=Pulsing41(freqCutoff=16 minBlockSize=94 maxBlockSize=277), field53=PostingsFormat(name=Memory
doPackFST= false), field17=PostingsFormat(name=Memory doPackFST= false), field26=PostingsFormat(name=Asserting),
field92=Pulsing41(freqCutoff=16 minBlockSize=94 maxBlockSize=277), field13=PostingsFormat(name=Memory
doPackFST= false), field36=PostingsFormat(name=MockRandom), field64=PostingsFormat(name=Memory
doPackFST= false), field47=PostingsFormat(name=MockRandom), field73=PostingsFormat(name=Asserting),
field52=Pulsing41(freqCutoff=16 minBlockSize=94 maxBlockSize=277), field99=PostingsFormat(name=Asserting),
field98=PostingsFormat(name=MockRandom), field74=Pulsing41(freqCutoff=16 minBlockSize=94 maxBlockSize=277),
field8=PostingsFormat(name=Asserting), field32=PostingsFormat(name=MockRandom), field70=Pulsing41(freqCutoff=16
minBlockSize=94 maxBlockSize=277), field76=PostingsFormat(name=MockRandom), field72=PostingsFormat(name=MockRandom),
field15=PostingsFormat(name=Asserting)}, sim=RandomSimilarityProvider(queryNorm=false,coord=yes):
{}, locale=sr_BA, timezone=Atlantic/St_Helena
[junit4:junit4]   2> NOTE: Linux 3.2.0-32-generic i386/Oracle Corporation 1.8.0-ea (32-bit)/cpus=8,threads=1,free=9265200,total=33554432
[junit4:junit4]   2> NOTE: All tests run in this JVM: [TestFunctionQuerySort, TestBoostedQuery,
TestMoreLikeThis, ChainedFilterTest, BooleanFilterTest, TestFieldScoreQuery, TestValueSources,
TermsFilterTest]
[junit4:junit4] Completed on J1 in 0.45s, 8 tests, 1 failure <<< FAILURES!

[...truncated 16 lines...]
BUILD FAILED
/mnt/ssd/jenkins/workspace/Lucene-Solr-trunk-Linux/build.xml:335: The following error occurred
while executing this line:
/mnt/ssd/jenkins/workspace/Lucene-Solr-trunk-Linux/build.xml:39: The following error occurred
while executing this line:
/mnt/ssd/jenkins/workspace/Lucene-Solr-trunk-Linux/lucene/build.xml:520: The following error
occurred while executing this line:
/mnt/ssd/jenkins/workspace/Lucene-Solr-trunk-Linux/lucene/common-build.xml:1692: The following
error occurred while executing this line:
/mnt/ssd/jenkins/workspace/Lucene-Solr-trunk-Linux/lucene/module-build.xml:61: The following
error occurred while executing this line:
/mnt/ssd/jenkins/workspace/Lucene-Solr-trunk-Linux/lucene/common-build.xml:1163: The following
error occurred while executing this line:
/mnt/ssd/jenkins/workspace/Lucene-Solr-trunk-Linux/lucene/common-build.xml:827: There were
test failures: 12 suites, 82 tests, 1 failure

Total time: 13 minutes 17 seconds
Build step 'Invoke Ant' marked build as failure
Archiving artifacts
Recording test results
Description set: Java: 32bit/jdk1.8.0-ea-b58 -client -XX:+UseG1GC
Email was triggered for: Failure
Sending email for trigger: Failure



Mime
View raw message