lucene-dev mailing list archives

Site index · List index
Message view « Date » · « Thread »
Top « Date » · « Thread »
From Policeman Jenkins Server <jenk...@sd-datasolutions.de>
Subject [JENKINS] Lucene-Solr-4.x-Linux (64bit/ibm-j9-jdk7) - Build # 2184 - Failure!
Date Sun, 04 Nov 2012 12:52:27 GMT
Build: http://jenkins.sd-datasolutions.de/job/Lucene-Solr-4.x-Linux/2184/
Java: 64bit/ibm-j9-jdk7 -Xjit:exclude={org/apache/lucene/util/fst/FST.pack(IIF)Lorg/apache/lucene/util/fst/FST;}

6 tests failed.
REGRESSION:  org.apache.solr.TestDistributedGrouping.testDistribSearch

Error Message:
Server at http://127.0.0.1:42350/solr returned non ok status:500, message:Server Error

Stack Trace:
org.apache.solr.common.SolrException: Server at http://127.0.0.1:42350/solr returned non ok status:500, message:Server Error
	at __randomizedtesting.SeedInfo.seed([E1BA296842910361:605CA77035CE635D]:0)
	at org.apache.solr.client.solrj.impl.HttpSolrServer.request(HttpSolrServer.java:372)
	at org.apache.solr.client.solrj.impl.HttpSolrServer.request(HttpSolrServer.java:181)
	at org.apache.solr.client.solrj.request.QueryRequest.process(QueryRequest.java:90)
	at org.apache.solr.client.solrj.SolrServer.query(SolrServer.java:301)
	at org.apache.solr.BaseDistributedSearchTestCase.queryServer(BaseDistributedSearchTestCase.java:371)
	at org.apache.solr.BaseDistributedSearchTestCase.query(BaseDistributedSearchTestCase.java:394)
	at org.apache.solr.BaseDistributedSearchTestCase.query(BaseDistributedSearchTestCase.java:376)
	at org.apache.solr.TestDistributedGrouping.doTest(TestDistributedGrouping.java:146)
	at org.apache.solr.BaseDistributedSearchTestCase.testDistribSearch(BaseDistributedSearchTestCase.java:701)
	at sun.reflect.NativeMethodAccessorImpl.invoke0(Native Method)
	at sun.reflect.NativeMethodAccessorImpl.invoke(NativeMethodAccessorImpl.java:88)
	at sun.reflect.DelegatingMethodAccessorImpl.invoke(DelegatingMethodAccessorImpl.java:55)
	at java.lang.reflect.Method.invoke(Method.java:613)
	at com.carrotsearch.randomizedtesting.RandomizedRunner.invoke(RandomizedRunner.java:1559)
	at com.carrotsearch.randomizedtesting.RandomizedRunner.access$600(RandomizedRunner.java:79)
	at com.carrotsearch.randomizedtesting.RandomizedRunner$6.evaluate(RandomizedRunner.java:737)
	at com.carrotsearch.randomizedtesting.RandomizedRunner$7.evaluate(RandomizedRunner.java:773)
	at com.carrotsearch.randomizedtesting.RandomizedRunner$8.evaluate(RandomizedRunner.java:787)
	at com.carrotsearch.randomizedtesting.rules.SystemPropertiesRestoreRule$1.evaluate(SystemPropertiesRestoreRule.java:53)
	at org.apache.lucene.util.TestRuleSetupTeardownChained$1.evaluate(TestRuleSetupTeardownChained.java:50)
	at org.apache.lucene.util.TestRuleFieldCacheSanity$1.evaluate(TestRuleFieldCacheSanity.java:51)
	at org.apache.lucene.util.AbstractBeforeAfterRule$1.evaluate(AbstractBeforeAfterRule.java:45)
	at com.carrotsearch.randomizedtesting.rules.SystemPropertiesInvariantRule$1.evaluate(SystemPropertiesInvariantRule.java:55)
	at org.apache.lucene.util.TestRuleThreadAndTestName$1.evaluate(TestRuleThreadAndTestName.java:48)
	at org.apache.lucene.util.TestRuleIgnoreAfterMaxFailures$1.evaluate(TestRuleIgnoreAfterMaxFailures.java:70)
	at org.apache.lucene.util.TestRuleMarkFailure$1.evaluate(TestRuleMarkFailure.java:48)
	at com.carrotsearch.randomizedtesting.rules.StatementAdapter.evaluate(StatementAdapter.java:36)
	at com.carrotsearch.randomizedtesting.ThreadLeakControl$StatementRunner.run(ThreadLeakControl.java:358)
	at com.carrotsearch.randomizedtesting.ThreadLeakControl.forkTimeoutingTask(ThreadLeakControl.java:782)
	at com.carrotsearch.randomizedtesting.ThreadLeakControl$3.evaluate(ThreadLeakControl.java:442)
	at com.carrotsearch.randomizedtesting.RandomizedRunner.runSingleTest(RandomizedRunner.java:746)
	at com.carrotsearch.randomizedtesting.RandomizedRunner$3.evaluate(RandomizedRunner.java:648)
	at com.carrotsearch.randomizedtesting.RandomizedRunner$4.evaluate(RandomizedRunner.java:682)
	at com.carrotsearch.randomizedtesting.RandomizedRunner$5.evaluate(RandomizedRunner.java:693)
	at com.carrotsearch.randomizedtesting.rules.StatementAdapter.evaluate(StatementAdapter.java:36)
	at com.carrotsearch.randomizedtesting.rules.SystemPropertiesRestoreRule$1.evaluate(SystemPropertiesRestoreRule.java:53)
	at org.apache.lucene.util.AbstractBeforeAfterRule$1.evaluate(AbstractBeforeAfterRule.java:45)
	at org.apache.lucene.util.TestRuleStoreClassName$1.evaluate(TestRuleStoreClassName.java:42)
	at com.carrotsearch.randomizedtesting.rules.SystemPropertiesInvariantRule$1.evaluate(SystemPropertiesInvariantRule.java:55)
	at com.carrotsearch.randomizedtesting.rules.NoShadowingOrOverridesOnMethodsRule$1.evaluate(NoShadowingOrOverridesOnMethodsRule.java:39)
	at com.carrotsearch.randomizedtesting.rules.NoShadowingOrOverridesOnMethodsRule$1.evaluate(NoShadowingOrOverridesOnMethodsRule.java:39)
	at com.carrotsearch.randomizedtesting.rules.StatementAdapter.evaluate(StatementAdapter.java:36)
	at org.apache.lucene.util.TestRuleAssertionsRequired$1.evaluate(TestRuleAssertionsRequired.java:43)
	at org.apache.lucene.util.TestRuleMarkFailure$1.evaluate(TestRuleMarkFailure.java:48)
	at org.apache.lucene.util.TestRuleIgnoreAfterMaxFailures$1.evaluate(TestRuleIgnoreAfterMaxFailures.java:70)
	at org.apache.lucene.util.TestRuleIgnoreTestSuites$1.evaluate(TestRuleIgnoreTestSuites.java:55)
	at com.carrotsearch.randomizedtesting.rules.StatementAdapter.evaluate(StatementAdapter.java:36)
	at com.carrotsearch.randomizedtesting.ThreadLeakControl$StatementRunner.run(ThreadLeakControl.java:358)
	at java.lang.Thread.run(Thread.java:779)


REGRESSION:  org.apache.solr.TestDistributedSearch.testDistribSearch

Error Message:
Server at http://127.0.0.1:50670/solr returned non ok status:500, message:Server Error

Stack Trace:
org.apache.solr.common.SolrException: Server at http://127.0.0.1:50670/solr returned non ok status:500, message:Server Error
	at __randomizedtesting.SeedInfo.seed([E1BA296842910361:605CA77035CE635D]:0)
	at org.apache.solr.client.solrj.impl.HttpSolrServer.request(HttpSolrServer.java:372)
	at org.apache.solr.client.solrj.impl.HttpSolrServer.request(HttpSolrServer.java:181)
	at org.apache.solr.client.solrj.request.QueryRequest.process(QueryRequest.java:90)
	at org.apache.solr.client.solrj.SolrServer.query(SolrServer.java:301)
	at org.apache.solr.BaseDistributedSearchTestCase.queryServer(BaseDistributedSearchTestCase.java:371)
	at org.apache.solr.BaseDistributedSearchTestCase.query(BaseDistributedSearchTestCase.java:394)
	at org.apache.solr.BaseDistributedSearchTestCase.query(BaseDistributedSearchTestCase.java:376)
	at org.apache.solr.TestDistributedSearch.doTest(TestDistributedSearch.java:218)
	at org.apache.solr.BaseDistributedSearchTestCase.testDistribSearch(BaseDistributedSearchTestCase.java:701)
	at sun.reflect.NativeMethodAccessorImpl.invoke0(Native Method)
	at sun.reflect.NativeMethodAccessorImpl.invoke(NativeMethodAccessorImpl.java:88)
	at sun.reflect.DelegatingMethodAccessorImpl.invoke(DelegatingMethodAccessorImpl.java:55)
	at java.lang.reflect.Method.invoke(Method.java:613)
	at com.carrotsearch.randomizedtesting.RandomizedRunner.invoke(RandomizedRunner.java:1559)
	at com.carrotsearch.randomizedtesting.RandomizedRunner.access$600(RandomizedRunner.java:79)
	at com.carrotsearch.randomizedtesting.RandomizedRunner$6.evaluate(RandomizedRunner.java:737)
	at com.carrotsearch.randomizedtesting.RandomizedRunner$7.evaluate(RandomizedRunner.java:773)
	at com.carrotsearch.randomizedtesting.RandomizedRunner$8.evaluate(RandomizedRunner.java:787)
	at com.carrotsearch.randomizedtesting.rules.SystemPropertiesRestoreRule$1.evaluate(SystemPropertiesRestoreRule.java:53)
	at org.apache.lucene.util.TestRuleSetupTeardownChained$1.evaluate(TestRuleSetupTeardownChained.java:50)
	at org.apache.lucene.util.TestRuleFieldCacheSanity$1.evaluate(TestRuleFieldCacheSanity.java:51)
	at org.apache.lucene.util.AbstractBeforeAfterRule$1.evaluate(AbstractBeforeAfterRule.java:45)
	at com.carrotsearch.randomizedtesting.rules.SystemPropertiesInvariantRule$1.evaluate(SystemPropertiesInvariantRule.java:55)
	at org.apache.lucene.util.TestRuleThreadAndTestName$1.evaluate(TestRuleThreadAndTestName.java:48)
	at org.apache.lucene.util.TestRuleIgnoreAfterMaxFailures$1.evaluate(TestRuleIgnoreAfterMaxFailures.java:70)
	at org.apache.lucene.util.TestRuleMarkFailure$1.evaluate(TestRuleMarkFailure.java:48)
	at com.carrotsearch.randomizedtesting.rules.StatementAdapter.evaluate(StatementAdapter.java:36)
	at com.carrotsearch.randomizedtesting.ThreadLeakControl$StatementRunner.run(ThreadLeakControl.java:358)
	at com.carrotsearch.randomizedtesting.ThreadLeakControl.forkTimeoutingTask(ThreadLeakControl.java:782)
	at com.carrotsearch.randomizedtesting.ThreadLeakControl$3.evaluate(ThreadLeakControl.java:442)
	at com.carrotsearch.randomizedtesting.RandomizedRunner.runSingleTest(RandomizedRunner.java:746)
	at com.carrotsearch.randomizedtesting.RandomizedRunner$3.evaluate(RandomizedRunner.java:648)
	at com.carrotsearch.randomizedtesting.RandomizedRunner$4.evaluate(RandomizedRunner.java:682)
	at com.carrotsearch.randomizedtesting.RandomizedRunner$5.evaluate(RandomizedRunner.java:693)
	at com.carrotsearch.randomizedtesting.rules.StatementAdapter.evaluate(StatementAdapter.java:36)
	at com.carrotsearch.randomizedtesting.rules.SystemPropertiesRestoreRule$1.evaluate(SystemPropertiesRestoreRule.java:53)
	at org.apache.lucene.util.AbstractBeforeAfterRule$1.evaluate(AbstractBeforeAfterRule.java:45)
	at org.apache.lucene.util.TestRuleStoreClassName$1.evaluate(TestRuleStoreClassName.java:42)
	at com.carrotsearch.randomizedtesting.rules.SystemPropertiesInvariantRule$1.evaluate(SystemPropertiesInvariantRule.java:55)
	at com.carrotsearch.randomizedtesting.rules.NoShadowingOrOverridesOnMethodsRule$1.evaluate(NoShadowingOrOverridesOnMethodsRule.java:39)
	at com.carrotsearch.randomizedtesting.rules.NoShadowingOrOverridesOnMethodsRule$1.evaluate(NoShadowingOrOverridesOnMethodsRule.java:39)
	at com.carrotsearch.randomizedtesting.rules.StatementAdapter.evaluate(StatementAdapter.java:36)
	at org.apache.lucene.util.TestRuleAssertionsRequired$1.evaluate(TestRuleAssertionsRequired.java:43)
	at org.apache.lucene.util.TestRuleMarkFailure$1.evaluate(TestRuleMarkFailure.java:48)
	at org.apache.lucene.util.TestRuleIgnoreAfterMaxFailures$1.evaluate(TestRuleIgnoreAfterMaxFailures.java:70)
	at org.apache.lucene.util.TestRuleIgnoreTestSuites$1.evaluate(TestRuleIgnoreTestSuites.java:55)
	at com.carrotsearch.randomizedtesting.rules.StatementAdapter.evaluate(StatementAdapter.java:36)
	at com.carrotsearch.randomizedtesting.ThreadLeakControl$StatementRunner.run(ThreadLeakControl.java:358)
	at java.lang.Thread.run(Thread.java:779)


REGRESSION:  org.apache.solr.cloud.BasicDistributedZk2Test.testDistribSearch

Error Message:
.doc[a_si][0]:org.apache.lucene.document.LazyDocument$LazyField:org.apache.lucene.document.LazyDocument$LazyField@3cf42d45!=org.apache.lucene.document.LazyDocument$LazyField:org.apache.lucene.document.LazyDocument$LazyField@e81454fc

Stack Trace:
junit.framework.AssertionFailedError: .doc[a_si][0]:org.apache.lucene.document.LazyDocument$LazyField:org.apache.lucene.document.LazyDocument$LazyField@3cf42d45!=org.apache.lucene.document.LazyDocument$LazyField:org.apache.lucene.document.LazyDocument$LazyField@e81454fc
	at __randomizedtesting.SeedInfo.seed([E1BA296842910361:605CA77035CE635D]:0)
	at junit.framework.Assert.fail(Assert.java:50)
	at org.apache.solr.BaseDistributedSearchTestCase.compareResponses(BaseDistributedSearchTestCase.java:686)
	at org.apache.solr.BaseDistributedSearchTestCase.query(BaseDistributedSearchTestCase.java:396)
	at org.apache.solr.BaseDistributedSearchTestCase.query(BaseDistributedSearchTestCase.java:376)
	at org.apache.solr.cloud.AbstractFullDistribZkTestBase.checkQueries(AbstractFullDistribZkTestBase.java:570)
	at org.apache.solr.cloud.BasicDistributedZk2Test.doTest(BasicDistributedZk2Test.java:77)
	at org.apache.solr.BaseDistributedSearchTestCase.testDistribSearch(BaseDistributedSearchTestCase.java:695)
	at sun.reflect.NativeMethodAccessorImpl.invoke0(Native Method)
	at sun.reflect.NativeMethodAccessorImpl.invoke(NativeMethodAccessorImpl.java:88)
	at sun.reflect.DelegatingMethodAccessorImpl.invoke(DelegatingMethodAccessorImpl.java:55)
	at java.lang.reflect.Method.invoke(Method.java:613)
	at com.carrotsearch.randomizedtesting.RandomizedRunner.invoke(RandomizedRunner.java:1559)
	at com.carrotsearch.randomizedtesting.RandomizedRunner.access$600(RandomizedRunner.java:79)
	at com.carrotsearch.randomizedtesting.RandomizedRunner$6.evaluate(RandomizedRunner.java:737)
	at com.carrotsearch.randomizedtesting.RandomizedRunner$7.evaluate(RandomizedRunner.java:773)
	at com.carrotsearch.randomizedtesting.RandomizedRunner$8.evaluate(RandomizedRunner.java:787)
	at com.carrotsearch.randomizedtesting.rules.SystemPropertiesRestoreRule$1.evaluate(SystemPropertiesRestoreRule.java:53)
	at org.apache.lucene.util.TestRuleSetupTeardownChained$1.evaluate(TestRuleSetupTeardownChained.java:50)
	at org.apache.lucene.util.TestRuleFieldCacheSanity$1.evaluate(TestRuleFieldCacheSanity.java:51)
	at org.apache.lucene.util.AbstractBeforeAfterRule$1.evaluate(AbstractBeforeAfterRule.java:45)
	at com.carrotsearch.randomizedtesting.rules.SystemPropertiesInvariantRule$1.evaluate(SystemPropertiesInvariantRule.java:55)
	at org.apache.lucene.util.TestRuleThreadAndTestName$1.evaluate(TestRuleThreadAndTestName.java:48)
	at org.apache.lucene.util.TestRuleIgnoreAfterMaxFailures$1.evaluate(TestRuleIgnoreAfterMaxFailures.java:70)
	at org.apache.lucene.util.TestRuleMarkFailure$1.evaluate(TestRuleMarkFailure.java:48)
	at com.carrotsearch.randomizedtesting.rules.StatementAdapter.evaluate(StatementAdapter.java:36)
	at com.carrotsearch.randomizedtesting.ThreadLeakControl$StatementRunner.run(ThreadLeakControl.java:358)
	at com.carrotsearch.randomizedtesting.ThreadLeakControl.forkTimeoutingTask(ThreadLeakControl.java:782)
	at com.carrotsearch.randomizedtesting.ThreadLeakControl$3.evaluate(ThreadLeakControl.java:442)
	at com.carrotsearch.randomizedtesting.RandomizedRunner.runSingleTest(RandomizedRunner.java:746)
	at com.carrotsearch.randomizedtesting.RandomizedRunner$3.evaluate(RandomizedRunner.java:648)
	at com.carrotsearch.randomizedtesting.RandomizedRunner$4.evaluate(RandomizedRunner.java:682)
	at com.carrotsearch.randomizedtesting.RandomizedRunner$5.evaluate(RandomizedRunner.java:693)
	at com.carrotsearch.randomizedtesting.rules.StatementAdapter.evaluate(StatementAdapter.java:36)
	at com.carrotsearch.randomizedtesting.rules.SystemPropertiesRestoreRule$1.evaluate(SystemPropertiesRestoreRule.java:53)
	at org.apache.lucene.util.AbstractBeforeAfterRule$1.evaluate(AbstractBeforeAfterRule.java:45)
	at org.apache.lucene.util.TestRuleStoreClassName$1.evaluate(TestRuleStoreClassName.java:42)
	at com.carrotsearch.randomizedtesting.rules.SystemPropertiesInvariantRule$1.evaluate(SystemPropertiesInvariantRule.java:55)
	at com.carrotsearch.randomizedtesting.rules.NoShadowingOrOverridesOnMethodsRule$1.evaluate(NoShadowingOrOverridesOnMethodsRule.java:39)
	at com.carrotsearch.randomizedtesting.rules.NoShadowingOrOverridesOnMethodsRule$1.evaluate(NoShadowingOrOverridesOnMethodsRule.java:39)
	at com.carrotsearch.randomizedtesting.rules.StatementAdapter.evaluate(StatementAdapter.java:36)
	at org.apache.lucene.util.TestRuleAssertionsRequired$1.evaluate(TestRuleAssertionsRequired.java:43)
	at org.apache.lucene.util.TestRuleMarkFailure$1.evaluate(TestRuleMarkFailure.java:48)
	at org.apache.lucene.util.TestRuleIgnoreAfterMaxFailures$1.evaluate(TestRuleIgnoreAfterMaxFailures.java:70)
	at org.apache.lucene.util.TestRuleIgnoreTestSuites$1.evaluate(TestRuleIgnoreTestSuites.java:55)
	at com.carrotsearch.randomizedtesting.rules.StatementAdapter.evaluate(StatementAdapter.java:36)
	at com.carrotsearch.randomizedtesting.ThreadLeakControl$StatementRunner.run(ThreadLeakControl.java:358)
	at java.lang.Thread.run(Thread.java:779)


REGRESSION:  org.apache.solr.cloud.BasicDistributedZkTest.testDistribSearch

Error Message:
Server at http://127.0.0.1:55412/solr/collection1 returned non ok status:500, message:Server Error

Stack Trace:
org.apache.solr.common.SolrException: Server at http://127.0.0.1:55412/solr/collection1 returned non ok status:500, message:Server Error
	at __randomizedtesting.SeedInfo.seed([E1BA296842910361:605CA77035CE635D]:0)
	at org.apache.solr.client.solrj.impl.HttpSolrServer.request(HttpSolrServer.java:372)
	at org.apache.solr.client.solrj.impl.HttpSolrServer.request(HttpSolrServer.java:181)
	at org.apache.solr.client.solrj.request.QueryRequest.process(QueryRequest.java:90)
	at org.apache.solr.client.solrj.SolrServer.query(SolrServer.java:301)
	at org.apache.solr.BaseDistributedSearchTestCase.query(BaseDistributedSearchTestCase.java:388)
	at org.apache.solr.cloud.BasicDistributedZkTest.doTest(BasicDistributedZkTest.java:273)
	at org.apache.solr.BaseDistributedSearchTestCase.testDistribSearch(BaseDistributedSearchTestCase.java:695)
	at sun.reflect.NativeMethodAccessorImpl.invoke0(Native Method)
	at sun.reflect.NativeMethodAccessorImpl.invoke(NativeMethodAccessorImpl.java:88)
	at sun.reflect.DelegatingMethodAccessorImpl.invoke(DelegatingMethodAccessorImpl.java:55)
	at java.lang.reflect.Method.invoke(Method.java:613)
	at com.carrotsearch.randomizedtesting.RandomizedRunner.invoke(RandomizedRunner.java:1559)
	at com.carrotsearch.randomizedtesting.RandomizedRunner.access$600(RandomizedRunner.java:79)
	at com.carrotsearch.randomizedtesting.RandomizedRunner$6.evaluate(RandomizedRunner.java:737)
	at com.carrotsearch.randomizedtesting.RandomizedRunner$7.evaluate(RandomizedRunner.java:773)
	at com.carrotsearch.randomizedtesting.RandomizedRunner$8.evaluate(RandomizedRunner.java:787)
	at com.carrotsearch.randomizedtesting.rules.SystemPropertiesRestoreRule$1.evaluate(SystemPropertiesRestoreRule.java:53)
	at org.apache.lucene.util.TestRuleSetupTeardownChained$1.evaluate(TestRuleSetupTeardownChained.java:50)
	at org.apache.lucene.util.TestRuleFieldCacheSanity$1.evaluate(TestRuleFieldCacheSanity.java:51)
	at org.apache.lucene.util.AbstractBeforeAfterRule$1.evaluate(AbstractBeforeAfterRule.java:45)
	at com.carrotsearch.randomizedtesting.rules.SystemPropertiesInvariantRule$1.evaluate(SystemPropertiesInvariantRule.java:55)
	at org.apache.lucene.util.TestRuleThreadAndTestName$1.evaluate(TestRuleThreadAndTestName.java:48)
	at org.apache.lucene.util.TestRuleIgnoreAfterMaxFailures$1.evaluate(TestRuleIgnoreAfterMaxFailures.java:70)
	at org.apache.lucene.util.TestRuleMarkFailure$1.evaluate(TestRuleMarkFailure.java:48)
	at com.carrotsearch.randomizedtesting.rules.StatementAdapter.evaluate(StatementAdapter.java:36)
	at com.carrotsearch.randomizedtesting.ThreadLeakControl$StatementRunner.run(ThreadLeakControl.java:358)
	at com.carrotsearch.randomizedtesting.ThreadLeakControl.forkTimeoutingTask(ThreadLeakControl.java:782)
	at com.carrotsearch.randomizedtesting.ThreadLeakControl$3.evaluate(ThreadLeakControl.java:442)
	at com.carrotsearch.randomizedtesting.RandomizedRunner.runSingleTest(RandomizedRunner.java:746)
	at com.carrotsearch.randomizedtesting.RandomizedRunner$3.evaluate(RandomizedRunner.java:648)
	at com.carrotsearch.randomizedtesting.RandomizedRunner$4.evaluate(RandomizedRunner.java:682)
	at com.carrotsearch.randomizedtesting.RandomizedRunner$5.evaluate(RandomizedRunner.java:693)
	at com.carrotsearch.randomizedtesting.rules.StatementAdapter.evaluate(StatementAdapter.java:36)
	at com.carrotsearch.randomizedtesting.rules.SystemPropertiesRestoreRule$1.evaluate(SystemPropertiesRestoreRule.java:53)
	at org.apache.lucene.util.AbstractBeforeAfterRule$1.evaluate(AbstractBeforeAfterRule.java:45)
	at org.apache.lucene.util.TestRuleStoreClassName$1.evaluate(TestRuleStoreClassName.java:42)
	at com.carrotsearch.randomizedtesting.rules.SystemPropertiesInvariantRule$1.evaluate(SystemPropertiesInvariantRule.java:55)
	at com.carrotsearch.randomizedtesting.rules.NoShadowingOrOverridesOnMethodsRule$1.evaluate(NoShadowingOrOverridesOnMethodsRule.java:39)
	at com.carrotsearch.randomizedtesting.rules.NoShadowingOrOverridesOnMethodsRule$1.evaluate(NoShadowingOrOverridesOnMethodsRule.java:39)
	at com.carrotsearch.randomizedtesting.rules.StatementAdapter.evaluate(StatementAdapter.java:36)
	at org.apache.lucene.util.TestRuleAssertionsRequired$1.evaluate(TestRuleAssertionsRequired.java:43)
	at org.apache.lucene.util.TestRuleMarkFailure$1.evaluate(TestRuleMarkFailure.java:48)
	at org.apache.lucene.util.TestRuleIgnoreAfterMaxFailures$1.evaluate(TestRuleIgnoreAfterMaxFailures.java:70)
	at org.apache.lucene.util.TestRuleIgnoreTestSuites$1.evaluate(TestRuleIgnoreTestSuites.java:55)
	at com.carrotsearch.randomizedtesting.rules.StatementAdapter.evaluate(StatementAdapter.java:36)
	at com.carrotsearch.randomizedtesting.ThreadLeakControl$StatementRunner.run(ThreadLeakControl.java:358)
	at java.lang.Thread.run(Thread.java:779)


REGRESSION:  org.apache.solr.handler.component.StatsComponentTest.testStats

Error Message:
Exception during query

Stack Trace:
java.lang.RuntimeException: Exception during query
	at __randomizedtesting.SeedInfo.seed([E1BA296842910361:7B3B70D72A4DCD42]:0)
	at org.apache.solr.util.AbstractSolrTestCase.assertQ(AbstractSolrTestCase.java:283)
	at org.apache.solr.handler.component.StatsComponentTest.doTestFacetStatisticsResult(StatsComponentTest.java:239)
	at org.apache.solr.handler.component.StatsComponentTest.testStats(StatsComponentTest.java:68)
	at sun.reflect.NativeMethodAccessorImpl.invoke0(Native Method)
	at sun.reflect.NativeMethodAccessorImpl.invoke(NativeMethodAccessorImpl.java:88)
	at sun.reflect.DelegatingMethodAccessorImpl.invoke(DelegatingMethodAccessorImpl.java:55)
	at java.lang.reflect.Method.invoke(Method.java:613)
	at com.carrotsearch.randomizedtesting.RandomizedRunner.invoke(RandomizedRunner.java:1559)
	at com.carrotsearch.randomizedtesting.RandomizedRunner.access$600(RandomizedRunner.java:79)
	at com.carrotsearch.randomizedtesting.RandomizedRunner$6.evaluate(RandomizedRunner.java:737)
	at com.carrotsearch.randomizedtesting.RandomizedRunner$7.evaluate(RandomizedRunner.java:773)
	at com.carrotsearch.randomizedtesting.RandomizedRunner$8.evaluate(RandomizedRunner.java:787)
	at com.carrotsearch.randomizedtesting.rules.SystemPropertiesRestoreRule$1.evaluate(SystemPropertiesRestoreRule.java:53)
	at org.apache.lucene.util.TestRuleSetupTeardownChained$1.evaluate(TestRuleSetupTeardownChained.java:50)
	at org.apache.lucene.util.TestRuleFieldCacheSanity$1.evaluate(TestRuleFieldCacheSanity.java:51)
	at org.apache.lucene.util.AbstractBeforeAfterRule$1.evaluate(AbstractBeforeAfterRule.java:45)
	at com.carrotsearch.randomizedtesting.rules.SystemPropertiesInvariantRule$1.evaluate(SystemPropertiesInvariantRule.java:55)
	at org.apache.lucene.util.TestRuleThreadAndTestName$1.evaluate(TestRuleThreadAndTestName.java:48)
	at org.apache.lucene.util.TestRuleIgnoreAfterMaxFailures$1.evaluate(TestRuleIgnoreAfterMaxFailures.java:70)
	at org.apache.lucene.util.TestRuleMarkFailure$1.evaluate(TestRuleMarkFailure.java:48)
	at com.carrotsearch.randomizedtesting.rules.StatementAdapter.evaluate(StatementAdapter.java:36)
	at com.carrotsearch.randomizedtesting.ThreadLeakControl$StatementRunner.run(ThreadLeakControl.java:358)
	at com.carrotsearch.randomizedtesting.ThreadLeakControl.forkTimeoutingTask(ThreadLeakControl.java:782)
	at com.carrotsearch.randomizedtesting.ThreadLeakControl$3.evaluate(ThreadLeakControl.java:442)
	at com.carrotsearch.randomizedtesting.RandomizedRunner.runSingleTest(RandomizedRunner.java:746)
	at com.carrotsearch.randomizedtesting.RandomizedRunner$3.evaluate(RandomizedRunner.java:648)
	at com.carrotsearch.randomizedtesting.RandomizedRunner$4.evaluate(RandomizedRunner.java:682)
	at com.carrotsearch.randomizedtesting.RandomizedRunner$5.evaluate(RandomizedRunner.java:693)
	at com.carrotsearch.randomizedtesting.rules.StatementAdapter.evaluate(StatementAdapter.java:36)
	at com.carrotsearch.randomizedtesting.rules.SystemPropertiesRestoreRule$1.evaluate(SystemPropertiesRestoreRule.java:53)
	at org.apache.lucene.util.AbstractBeforeAfterRule$1.evaluate(AbstractBeforeAfterRule.java:45)
	at org.apache.lucene.util.TestRuleStoreClassName$1.evaluate(TestRuleStoreClassName.java:42)
	at com.carrotsearch.randomizedtesting.rules.SystemPropertiesInvariantRule$1.evaluate(SystemPropertiesInvariantRule.java:55)
	at com.carrotsearch.randomizedtesting.rules.NoShadowingOrOverridesOnMethodsRule$1.evaluate(NoShadowingOrOverridesOnMethodsRule.java:39)
	at com.carrotsearch.randomizedtesting.rules.NoShadowingOrOverridesOnMethodsRule$1.evaluate(NoShadowingOrOverridesOnMethodsRule.java:39)
	at com.carrotsearch.randomizedtesting.rules.StatementAdapter.evaluate(StatementAdapter.java:36)
	at org.apache.lucene.util.TestRuleAssertionsRequired$1.evaluate(TestRuleAssertionsRequired.java:43)
	at org.apache.lucene.util.TestRuleMarkFailure$1.evaluate(TestRuleMarkFailure.java:48)
	at org.apache.lucene.util.TestRuleIgnoreAfterMaxFailures$1.evaluate(TestRuleIgnoreAfterMaxFailures.java:70)
	at org.apache.lucene.util.TestRuleIgnoreTestSuites$1.evaluate(TestRuleIgnoreTestSuites.java:55)
	at com.carrotsearch.randomizedtesting.rules.StatementAdapter.evaluate(StatementAdapter.java:36)
	at com.carrotsearch.randomizedtesting.ThreadLeakControl$StatementRunner.run(ThreadLeakControl.java:358)
	at java.lang.Thread.run(Thread.java:779)
Caused by: java.lang.NullPointerException
	at org.apache.solr.util.NumberUtils.SortableStr2int(NumberUtils.java:162)
	at org.apache.solr.schema.SortableIntField.toObject(SortableIntField.java:96)
	at org.apache.solr.schema.SortableIntField.toObject(SortableIntField.java:55)
	at org.apache.solr.schema.FieldType.toObject(FieldType.java:342)
	at org.apache.solr.handler.component.AbstractStatsValues.accumulate(StatsValuesFactory.java:129)
	at org.apache.solr.handler.component.SimpleStats.getFieldCacheStats(StatsComponent.java:281)
	at org.apache.solr.handler.component.SimpleStats.getStatsFields(StatsComponent.java:227)
	at org.apache.solr.handler.component.SimpleStats.getStatsCounts(StatsComponent.java:201)
	at org.apache.solr.handler.component.StatsComponent.process(StatsComponent.java:70)
	at org.apache.solr.handler.component.SearchHandler.handleRequestBody(SearchHandler.java:206)
	at org.apache.solr.handler.RequestHandlerBase.handleRequest(RequestHandlerBase.java:129)
	at org.apache.solr.core.SolrCore.execute(SolrCore.java:1750)
	at org.apache.solr.util.TestHarness.query(TestHarness.java:364)
	at org.apache.solr.util.TestHarness.query(TestHarness.java:346)
	at org.apache.solr.util.AbstractSolrTestCase.assertQ(AbstractSolrTestCase.java:273)
	... 42 more


REGRESSION:  org.apache.solr.update.AutoCommitTest.testMaxTime

Error Message:
shouldn't find any query failed XPath: //result[@numFound=0]  xml response was: <?xml version="1.0" encoding="UTF-8"?> <response> <lst name="responseHeader"><int name="status">0</int><int name="QTime">1725</int></lst><result name="response" numFound="1" start="0"><doc><int name="id">529</int><int name="range_facet_si">529</int><arr name="range_facet_l"><long>529</long></arr><arr name="range_facet_sl"><long>529</long></arr><arr name="field_t"><str>what's inside?</str></arr><arr name="subject"><str>info</str></arr><int name="intDefault">42</int><date name="timestamp">2012-11-04T12:50:00.649Z</date><arr name="multiDefault"><str>muLti-Default</str></arr></doc></result> </response>   request was: q=id:529&start=0&qt=standard&version=2.2&rows=20

Stack Trace:
java.lang.AssertionError: shouldn't find any query failed XPath: //result[@numFound=0]
 xml response was: <?xml version="1.0" encoding="UTF-8"?>
<response>
<lst name="responseHeader"><int name="status">0</int><int name="QTime">1725</int></lst><result name="response" numFound="1" start="0"><doc><int name="id">529</int><int name="range_facet_si">529</int><arr name="range_facet_l"><long>529</long></arr><arr name="range_facet_sl"><long>529</long></arr><arr name="field_t"><str>what's inside?</str></arr><arr name="subject"><str>info</str></arr><int name="intDefault">42</int><date name="timestamp">2012-11-04T12:50:00.649Z</date><arr name="multiDefault"><str>muLti-Default</str></arr></doc></result>
</response>

 request was: q=id:529&start=0&qt=standard&version=2.2&rows=20
	at __randomizedtesting.SeedInfo.seed([E1BA296842910361:7B4E548ADC0B9F5D]:0)
	at org.junit.Assert.fail(Assert.java:93)
	at org.apache.solr.util.AbstractSolrTestCase.assertQ(AbstractSolrTestCase.java:276)
	at org.apache.solr.update.AutoCommitTest.testMaxTime(AutoCommitTest.java:217)
	at sun.reflect.NativeMethodAccessorImpl.invoke0(Native Method)
	at sun.reflect.NativeMethodAccessorImpl.invoke(NativeMethodAccessorImpl.java:88)
	at sun.reflect.DelegatingMethodAccessorImpl.invoke(DelegatingMethodAccessorImpl.java:55)
	at java.lang.reflect.Method.invoke(Method.java:613)
	at com.carrotsearch.randomizedtesting.RandomizedRunner.invoke(RandomizedRunner.java:1559)
	at com.carrotsearch.randomizedtesting.RandomizedRunner.access$600(RandomizedRunner.java:79)
	at com.carrotsearch.randomizedtesting.RandomizedRunner$6.evaluate(RandomizedRunner.java:737)
	at com.carrotsearch.randomizedtesting.RandomizedRunner$7.evaluate(RandomizedRunner.java:773)
	at com.carrotsearch.randomizedtesting.RandomizedRunner$8.evaluate(RandomizedRunner.java:787)
	at com.carrotsearch.randomizedtesting.rules.SystemPropertiesRestoreRule$1.evaluate(SystemPropertiesRestoreRule.java:53)
	at org.apache.lucene.util.TestRuleSetupTeardownChained$1.evaluate(TestRuleSetupTeardownChained.java:50)
	at org.apache.lucene.util.TestRuleFieldCacheSanity$1.evaluate(TestRuleFieldCacheSanity.java:51)
	at org.apache.lucene.util.AbstractBeforeAfterRule$1.evaluate(AbstractBeforeAfterRule.java:45)
	at com.carrotsearch.randomizedtesting.rules.SystemPropertiesInvariantRule$1.evaluate(SystemPropertiesInvariantRule.java:55)
	at org.apache.lucene.util.TestRuleThreadAndTestName$1.evaluate(TestRuleThreadAndTestName.java:48)
	at org.apache.lucene.util.TestRuleIgnoreAfterMaxFailures$1.evaluate(TestRuleIgnoreAfterMaxFailures.java:70)
	at org.apache.lucene.util.TestRuleMarkFailure$1.evaluate(TestRuleMarkFailure.java:48)
	at com.carrotsearch.randomizedtesting.rules.StatementAdapter.evaluate(StatementAdapter.java:36)
	at com.carrotsearch.randomizedtesting.ThreadLeakControl$StatementRunner.run(ThreadLeakControl.java:358)
	at com.carrotsearch.randomizedtesting.ThreadLeakControl.forkTimeoutingTask(ThreadLeakControl.java:782)
	at com.carrotsearch.randomizedtesting.ThreadLeakControl$3.evaluate(ThreadLeakControl.java:442)
	at com.carrotsearch.randomizedtesting.RandomizedRunner.runSingleTest(RandomizedRunner.java:746)
	at com.carrotsearch.randomizedtesting.RandomizedRunner$3.evaluate(RandomizedRunner.java:648)
	at com.carrotsearch.randomizedtesting.RandomizedRunner$4.evaluate(RandomizedRunner.java:682)
	at com.carrotsearch.randomizedtesting.RandomizedRunner$5.evaluate(RandomizedRunner.java:693)
	at com.carrotsearch.randomizedtesting.rules.StatementAdapter.evaluate(StatementAdapter.java:36)
	at com.carrotsearch.randomizedtesting.rules.SystemPropertiesRestoreRule$1.evaluate(SystemPropertiesRestoreRule.java:53)
	at org.apache.lucene.util.AbstractBeforeAfterRule$1.evaluate(AbstractBeforeAfterRule.java:45)
	at org.apache.lucene.util.TestRuleStoreClassName$1.evaluate(TestRuleStoreClassName.java:42)
	at com.carrotsearch.randomizedtesting.rules.SystemPropertiesInvariantRule$1.evaluate(SystemPropertiesInvariantRule.java:55)
	at com.carrotsearch.randomizedtesting.rules.NoShadowingOrOverridesOnMethodsRule$1.evaluate(NoShadowingOrOverridesOnMethodsRule.java:39)
	at com.carrotsearch.randomizedtesting.rules.NoShadowingOrOverridesOnMethodsRule$1.evaluate(NoShadowingOrOverridesOnMethodsRule.java:39)
	at com.carrotsearch.randomizedtesting.rules.StatementAdapter.evaluate(StatementAdapter.java:36)
	at org.apache.lucene.util.TestRuleAssertionsRequired$1.evaluate(TestRuleAssertionsRequired.java:43)
	at org.apache.lucene.util.TestRuleMarkFailure$1.evaluate(TestRuleMarkFailure.java:48)
	at org.apache.lucene.util.TestRuleIgnoreAfterMaxFailures$1.evaluate(TestRuleIgnoreAfterMaxFailures.java:70)
	at org.apache.lucene.util.TestRuleIgnoreTestSuites$1.evaluate(TestRuleIgnoreTestSuites.java:55)
	at com.carrotsearch.randomizedtesting.rules.StatementAdapter.evaluate(StatementAdapter.java:36)
	at com.carrotsearch.randomizedtesting.ThreadLeakControl$StatementRunner.run(ThreadLeakControl.java:358)
	at java.lang.Thread.run(Thread.java:779)




Build Log:
[...truncated 8417 lines...]
[junit4:junit4] Suite: org.apache.solr.cloud.BasicDistributedZkTest
[junit4:junit4]   2> 7 T195 oas.SolrTestCaseJ4.setUp ###Starting testDistribSearch
[junit4:junit4]   2> Creating dataDir: /mnt/ssd/jenkins/workspace/Lucene-Solr-4.x-Linux/solr/build/solr-core/test/J0/./solrtest-BasicDistributedZkTest-1352033139721
[junit4:junit4]   2> 9 T195 oasc.ZkTestServer.run STARTING ZK TEST SERVER
[junit4:junit4]   2> 10 T196 oazs.ZooKeeperServer.setTickTime tickTime set to 1000
[junit4:junit4]   2> 11 T196 oazs.NIOServerCnxn$Factory.<init> binding to port 0.0.0.0/0.0.0.0:0
[junit4:junit4]   2> 12 T196 oazsp.FileTxnSnapLog.save Snapshotting: 0
[junit4:junit4]   2> 110 T195 oasc.ZkTestServer.run start zk server on port:54660
[junit4:junit4]   2> 110 T195 oaz.ZooKeeper.<init> Initiating client connection, connectString=127.0.0.1:54660 sessionTimeout=10000 watcher=org.apache.solr.common.cloud.ConnectionManager@b33a26bd
[junit4:junit4]   2> 112 T201 oaz.ClientCnxn$SendThread.startConnect Opening socket connection to server /127.0.0.1:54660
[junit4:junit4]   2> 112 T195 oascc.ConnectionManager.waitForConnected Waiting for client to connect to ZooKeeper
[junit4:junit4]   2> 113 T201 oaz.ClientCnxn$SendThread.primeConnection Socket connection established to localhost.localdomain/127.0.0.1:54660, initiating session
[junit4:junit4]   2> 113 T197 oazs.NIOServerCnxn$Factory.run Accepted socket connection from /127.0.0.1:33960
[junit4:junit4]   2> 113 T197 oazs.NIOServerCnxn.readConnectRequest Client attempting to establish new session at /127.0.0.1:33960
[junit4:junit4]   2> 113 T199 oazsp.FileTxnLog.append Creating new log file: log.1
[junit4:junit4]   2> 181 T199 oazs.NIOServerCnxn.finishSessionInit Established session 0x13acb747c0d0000 with negotiated timeout 10000 for client /127.0.0.1:33960
[junit4:junit4]   2> 181 T201 oaz.ClientCnxn$SendThread.readConnectResult Session establishment complete on server localhost.localdomain/127.0.0.1:54660, sessionid = 0x13acb747c0d0000, negotiated timeout = 10000
[junit4:junit4]   2> 181 T202 oascc.ConnectionManager.process Watcher org.apache.solr.common.cloud.ConnectionManager@b33a26bd name:ZooKeeperConnection Watcher:127.0.0.1:54660 got event WatchedEvent state:SyncConnected type:None path:null path:null type:None
[junit4:junit4]   2> 181 T195 oascc.ConnectionManager.waitForConnected Client is connected to ZooKeeper
[junit4:junit4]   2> 182 T195 oascc.SolrZkClient.makePath makePath: /solr
[junit4:junit4]   2> 185 T200 oazs.PrepRequestProcessor.pRequest Processed session termination for sessionid: 0x13acb747c0d0000
[junit4:junit4]   2> 186 T195 oaz.ZooKeeper.close Session: 0x13acb747c0d0000 closed
[junit4:junit4]   2> 186 T197 oazs.NIOServerCnxn.closeSock Closed socket connection for client /127.0.0.1:33960 which had sessionid 0x13acb747c0d0000
[junit4:junit4]   2> 186 T202 oaz.ClientCnxn$EventThread.run EventThread shut down
[junit4:junit4]   2> 186 T195 oaz.ZooKeeper.<init> Initiating client connection, connectString=127.0.0.1:54660/solr sessionTimeout=10000 watcher=org.apache.solr.common.cloud.ConnectionManager@d895a908
[junit4:junit4]   2> 188 T203 oaz.ClientCnxn$SendThread.startConnect Opening socket connection to server /127.0.0.1:54660
[junit4:junit4]   2> 188 T195 oascc.ConnectionManager.waitForConnected Waiting for client to connect to ZooKeeper
[junit4:junit4]   2> 189 T203 oaz.ClientCnxn$SendThread.primeConnection Socket connection established to localhost.localdomain/127.0.0.1:54660, initiating session
[junit4:junit4]   2> 189 T197 oazs.NIOServerCnxn$Factory.run Accepted socket connection from /127.0.0.1:33961
[junit4:junit4]   2> 189 T197 oazs.NIOServerCnxn.readConnectRequest Client attempting to establish new session at /127.0.0.1:33961
[junit4:junit4]   2> 191 T199 oazs.NIOServerCnxn.finishSessionInit Established session 0x13acb747c0d0001 with negotiated timeout 10000 for client /127.0.0.1:33961
[junit4:junit4]   2> 192 T203 oaz.ClientCnxn$SendThread.readConnectResult Session establishment complete on server localhost.localdomain/127.0.0.1:54660, sessionid = 0x13acb747c0d0001, negotiated timeout = 10000
[junit4:junit4]   2> 193 T204 oascc.ConnectionManager.process Watcher org.apache.solr.common.cloud.ConnectionManager@d895a908 name:ZooKeeperConnection Watcher:127.0.0.1:54660/solr got event WatchedEvent state:SyncConnected type:None path:null path:null type:None
[junit4:junit4]   2> 193 T195 oascc.ConnectionManager.waitForConnected Client is connected to ZooKeeper
[junit4:junit4]   2> 194 T195 oascc.SolrZkClient.makePath makePath: /collections/collection1
[junit4:junit4]   2> 199 T195 oascc.SolrZkClient.makePath makePath: /collections/collection1/shards
[junit4:junit4]   2> 202 T195 oascc.SolrZkClient.makePath makePath: /collections/control_collection
[junit4:junit4]   2> 204 T195 oascc.SolrZkClient.makePath makePath: /collections/control_collection/shards
[junit4:junit4]   2> 208 T195 oasc.AbstractZkTestCase.putConfig put /mnt/ssd/jenkins/workspace/Lucene-Solr-4.x-Linux/solr/build/solr-core/test-files/solr/collection1/conf/solrconfig.xml to /configs/conf1/solrconfig.xml
[junit4:junit4]   2> 209 T195 oascc.SolrZkClient.makePath makePath: /configs/conf1/solrconfig.xml
[junit4:junit4]   2> 213 T195 oasc.AbstractZkTestCase.putConfig put /mnt/ssd/jenkins/workspace/Lucene-Solr-4.x-Linux/solr/build/solr-core/test-files/solr/collection1/conf/schema.xml to /configs/conf1/schema.xml
[junit4:junit4]   2> 214 T195 oascc.SolrZkClient.makePath makePath: /configs/conf1/schema.xml
[junit4:junit4]   2> 217 T195 oasc.AbstractZkTestCase.putConfig put /mnt/ssd/jenkins/workspace/Lucene-Solr-4.x-Linux/solr/build/solr-core/test-files/solr/collection1/conf/solrconfig.xml to /configs/conf1/solrconfig.xml
[junit4:junit4]   2> 218 T195 oascc.SolrZkClient.makePath makePath: /configs/conf1/solrconfig.xml
[junit4:junit4]   2> 225 T195 oasc.AbstractZkTestCase.putConfig put /mnt/ssd/jenkins/workspace/Lucene-Solr-4.x-Linux/solr/build/solr-core/test-files/solr/collection1/conf/stopwords.txt to /configs/conf1/stopwords.txt
[junit4:junit4]   2> 226 T195 oascc.SolrZkClient.makePath makePath: /configs/conf1/stopwords.txt
[junit4:junit4]   2> 228 T195 oasc.AbstractZkTestCase.putConfig put /mnt/ssd/jenkins/workspace/Lucene-Solr-4.x-Linux/solr/build/solr-core/test-files/solr/collection1/conf/protwords.txt to /configs/conf1/protwords.txt
[junit4:junit4]   2> 229 T195 oascc.SolrZkClient.makePath makePath: /configs/conf1/protwords.txt
[junit4:junit4]   2> 231 T195 oasc.AbstractZkTestCase.putConfig put /mnt/ssd/jenkins/workspace/Lucene-Solr-4.x-Linux/solr/build/solr-core/test-files/solr/collection1/conf/currency.xml to /configs/conf1/currency.xml
[junit4:junit4]   2> 232 T195 oascc.SolrZkClient.makePath makePath: /configs/conf1/currency.xml
[junit4:junit4]   2> 234 T195 oasc.AbstractZkTestCase.putConfig put /mnt/ssd/jenkins/workspace/Lucene-Solr-4.x-Linux/solr/build/solr-core/test-files/solr/collection1/conf/open-exchange-rates.json to /configs/conf1/open-exchange-rates.json
[junit4:junit4]   2> 235 T195 oascc.SolrZkClient.makePath makePath: /configs/conf1/open-exchange-rates.json
[junit4:junit4]   2> 237 T195 oasc.AbstractZkTestCase.putConfig put /mnt/ssd/jenkins/workspace/Lucene-Solr-4.x-Linux/solr/build/solr-core/test-files/solr/collection1/conf/mapping-ISOLatin1Accent.txt to /configs/conf1/mapping-ISOLatin1Accent.txt
[junit4:junit4]   2> 238 T195 oascc.SolrZkClient.makePath makePath: /configs/conf1/mapping-ISOLatin1Accent.txt
[junit4:junit4]   2> 241 T195 oasc.AbstractZkTestCase.putConfig put /mnt/ssd/jenkins/workspace/Lucene-Solr-4.x-Linux/solr/build/solr-core/test-files/solr/collection1/conf/old_synonyms.txt to /configs/conf1/old_synonyms.txt
[junit4:junit4]   2> 242 T195 oascc.SolrZkClient.makePath makePath: /configs/conf1/old_synonyms.txt
[junit4:junit4]   2> 244 T195 oasc.AbstractZkTestCase.putConfig put /mnt/ssd/jenkins/workspace/Lucene-Solr-4.x-Linux/solr/build/solr-core/test-files/solr/collection1/conf/synonyms.txt to /configs/conf1/synonyms.txt
[junit4:junit4]   2> 244 T195 oascc.SolrZkClient.makePath makePath: /configs/conf1/synonyms.txt
[junit4:junit4]   2> 247 T200 oazs.PrepRequestProcessor.pRequest Processed session termination for sessionid: 0x13acb747c0d0001
[junit4:junit4]   2> 248 T204 oaz.ClientCnxn$EventThread.run EventThread shut down
[junit4:junit4]   2> 248 T195 oaz.ZooKeeper.close Session: 0x13acb747c0d0001 closed
[junit4:junit4]   2> 248 T197 oazs.NIOServerCnxn.closeSock Closed socket connection for client /127.0.0.1:33961 which had sessionid 0x13acb747c0d0001
[junit4:junit4]   2> 249 T195 oejs.Server.doStart jetty-8.1.2.v20120308
[junit4:junit4]   2> 257 T195 oejs.AbstractConnector.doStart Started SelectChannelConnector@0.0.0.0:55412
[junit4:junit4]   2> 258 T195 oasc.SolrResourceLoader.locateSolrHome JNDI not configured for solr (NoInitialContextEx)
[junit4:junit4]   2> 258 T195 oasc.SolrResourceLoader.locateSolrHome using system property solr.solr.home: /mnt/ssd/jenkins/workspace/Lucene-Solr-4.x-Linux/solr/build/solr-core/test-files/solr
[junit4:junit4]   2> 259 T195 oasc.SolrResourceLoader.<init> new SolrResourceLoader for deduced Solr Home: '/mnt/ssd/jenkins/workspace/Lucene-Solr-4.x-Linux/solr/build/solr-core/test-files/solr/'
[junit4:junit4]   2> 268 T195 oass.SolrDispatchFilter.init SolrDispatchFilter.init()
[junit4:junit4]   2> 269 T195 oasc.SolrResourceLoader.locateSolrHome JNDI not configured for solr (NoInitialContextEx)
[junit4:junit4]   2> 269 T195 oasc.SolrResourceLoader.locateSolrHome using system property solr.solr.home: /mnt/ssd/jenkins/workspace/Lucene-Solr-4.x-Linux/solr/build/solr-core/test-files/solr
[junit4:junit4]   2> 270 T195 oasc.CoreContainer$Initializer.initialize looking for solr.xml: /mnt/ssd/jenkins/workspace/Lucene-Solr-4.x-Linux/solr/build/solr-core/test-files/solr/solr.xml
[junit4:junit4]   2> 270 T195 oasc.CoreContainer.<init> New CoreContainer 210044898
[junit4:junit4]   2> 271 T195 oasc.CoreContainer.load Loading CoreContainer using Solr Home: '/mnt/ssd/jenkins/workspace/Lucene-Solr-4.x-Linux/solr/build/solr-core/test-files/solr/'
[junit4:junit4]   2> 271 T195 oasc.SolrResourceLoader.<init> new SolrResourceLoader for directory: '/mnt/ssd/jenkins/workspace/Lucene-Solr-4.x-Linux/solr/build/solr-core/test-files/solr/'
[junit4:junit4]   2> 285 T195 oasc.CoreContainer.load Registering Log Listener
[junit4:junit4]   2> 293 T195 oasc.CoreContainer.initZooKeeper Zookeeper client=127.0.0.1:54660/solr
[junit4:junit4]   2> 295 T195 oaz.ZooKeeper.<init> Initiating client connection, connectString=127.0.0.1:54660/solr sessionTimeout=5000 watcher=org.apache.solr.common.cloud.ConnectionManager@342a9b97
[junit4:junit4]   2> 296 T214 oaz.ClientCnxn$SendThread.startConnect Opening socket connection to server /127.0.0.1:54660
[junit4:junit4]   2> 296 T195 oascc.ConnectionManager.waitForConnected Waiting for client to connect to ZooKeeper
[junit4:junit4]   2> 298 T214 oaz.ClientCnxn$SendThread.primeConnection Socket connection established to localhost.localdomain/127.0.0.1:54660, initiating session
[junit4:junit4]   2> 298 T197 oazs.NIOServerCnxn$Factory.run Accepted socket connection from /127.0.0.1:33962
[junit4:junit4]   2> 299 T197 oazs.NIOServerCnxn.readConnectRequest Client attempting to establish new session at /127.0.0.1:33962
[junit4:junit4]   2> 299 T199 oazs.NIOServerCnxn.finishSessionInit Established session 0x13acb747c0d0002 with negotiated timeout 5000 for client /127.0.0.1:33962
[junit4:junit4]   2> 300 T214 oaz.ClientCnxn$SendThread.readConnectResult Session establishment complete on server localhost.localdomain/127.0.0.1:54660, sessionid = 0x13acb747c0d0002, negotiated timeout = 5000
[junit4:junit4]   2> 300 T215 oascc.ConnectionManager.process Watcher org.apache.solr.common.cloud.ConnectionManager@342a9b97 name:ZooKeeperConnection Watcher:127.0.0.1:54660/solr got event WatchedEvent state:SyncConnected type:None path:null path:null type:None
[junit4:junit4]   2> 301 T195 oascc.ConnectionManager.waitForConnected Client is connected to ZooKeeper
[junit4:junit4]   2> 302 T200 oazs.PrepRequestProcessor.pRequest Got user-level KeeperException when processing sessionid:0x13acb747c0d0002 type:create cxid:0x2 zxid:0xfffffffffffffffe txntype:unknown reqpath:n/a Error Path:/solr/overseer Error:KeeperErrorCode = NodeExists for /solr/overseer
[junit4:junit4]   2> 303 T195 oascc.SolrZkClient.makePath makePath: /live_nodes
[junit4:junit4]   2> 304 T195 oasc.ZkController.createEphemeralLiveNode Register node as live in ZooKeeper:/live_nodes/127.0.0.1:55412_solr
[junit4:junit4]   2> 305 T200 oazs.PrepRequestProcessor.pRequest Got user-level KeeperException when processing sessionid:0x13acb747c0d0002 type:delete cxid:0x7 zxid:0xfffffffffffffffe txntype:unknown reqpath:n/a Error Path:/solr/live_nodes/127.0.0.1:55412_solr Error:KeeperErrorCode = NoNode for /solr/live_nodes/127.0.0.1:55412_solr
[junit4:junit4]   2> 305 T195 oascc.SolrZkClient.makePath makePath: /live_nodes/127.0.0.1:55412_solr
[junit4:junit4]   2> 308 T195 oashc.HttpShardHandlerFactory.getParameter Setting socketTimeout to: 0
[junit4:junit4]   2> 308 T195 oashc.HttpShardHandlerFactory.getParameter Setting urlScheme to: http://
[junit4:junit4]   2> 309 T195 oashc.HttpShardHandlerFactory.getParameter Setting connTimeout to: 0
[junit4:junit4]   2> 309 T195 oashc.HttpShardHandlerFactory.getParameter Setting maxConnectionsPerHost to: 20
[junit4:junit4]   2> 309 T195 oashc.HttpShardHandlerFactory.getParameter Setting corePoolSize to: 0
[junit4:junit4]   2> 310 T195 oashc.HttpShardHandlerFactory.getParameter Setting maximumPoolSize to: 2147483647
[junit4:junit4]   2> 310 T195 oashc.HttpShardHandlerFactory.getParameter Setting maxThreadIdleTime to: 5
[junit4:junit4]   2> 311 T195 oashc.HttpShardHandlerFactory.getParameter Setting sizeOfQueue to: -1
[junit4:junit4]   2> 311 T195 oashc.HttpShardHandlerFactory.getParameter Setting fairnessPolicy to: false
[junit4:junit4]   2> 311 T195 oascsi.HttpClientUtil.createClient Creating new http client, config:maxConnectionsPerHost=20&maxConnections=10000&socketTimeout=0&connTimeout=0&retry=false
[junit4:junit4]   2> 318 T195 oascc.SolrZkClient.makePath makePath: /overseer_elect/election
[junit4:junit4]   2> 322 T200 oazs.PrepRequestProcessor.pRequest Got user-level KeeperException when processing sessionid:0x13acb747c0d0002 type:delete cxid:0x15 zxid:0xfffffffffffffffe txntype:unknown reqpath:n/a Error Path:/solr/overseer_elect/leader Error:KeeperErrorCode = NoNode for /solr/overseer_elect/leader
[junit4:junit4]   2> 323 T195 oascc.SolrZkClient.makePath makePath: /overseer_elect/leader
[junit4:junit4]   2> 324 T195 oasc.Overseer.start Overseer (id=88606843845017602-127.0.0.1:55412_solr-n_0000000000) starting
[junit4:junit4]   2> 325 T200 oazs.PrepRequestProcessor.pRequest Got user-level KeeperException when processing sessionid:0x13acb747c0d0002 type:create cxid:0x1a zxid:0xfffffffffffffffe txntype:unknown reqpath:n/a Error Path:/solr/overseer Error:KeeperErrorCode = NodeExists for /solr/overseer
[junit4:junit4]   2> 326 T200 oazs.PrepRequestProcessor.pRequest Got user-level KeeperException when processing sessionid:0x13acb747c0d0002 type:create cxid:0x1b zxid:0xfffffffffffffffe txntype:unknown reqpath:n/a Error Path:/solr/overseer Error:KeeperErrorCode = NodeExists for /solr/overseer
[junit4:junit4]   2> 327 T200 oazs.PrepRequestProcessor.pRequest Got user-level KeeperException when processing sessionid:0x13acb747c0d0002 type:create cxid:0x1c zxid:0xfffffffffffffffe txntype:unknown reqpath:n/a Error Path:/solr/overseer Error:KeeperErrorCode = NodeExists for /solr/overseer
[junit4:junit4]   2> 327 T200 oazs.PrepRequestProcessor.pRequest Got user-level KeeperException when processing sessionid:0x13acb747c0d0002 type:create cxid:0x1d zxid:0xfffffffffffffffe txntype:unknown reqpath:n/a Error Path:/solr/overseer Error:KeeperErrorCode = NodeExists for /solr/overseer
[junit4:junit4]   2> 328 T217 oasc.OverseerCollectionProcessor.run Process current queue of collection messages
[junit4:junit4]   2> 329 T195 oascc.SolrZkClient.makePath makePath: /clusterstate.json
[junit4:junit4]   2> 332 T195 oascc.ZkStateReader.createClusterStateWatchersAndUpdate Updating cluster state from ZooKeeper... 
[junit4:junit4]   2> 334 T216 oasc.Overseer$ClusterStateUpdater.run Starting to work on the main queue
[junit4:junit4]   2> 337 T195 oasc.CoreContainer.create Creating SolrCore 'collection1' using instanceDir: /mnt/ssd/jenkins/workspace/Lucene-Solr-4.x-Linux/solr/build/solr-core/test-files/solr/collection1
[junit4:junit4]   2> 338 T195 oasc.ZkController.createCollectionZkNode Check for collection zkNode:control_collection
[junit4:junit4]   2> 339 T195 oasc.ZkController.createCollectionZkNode Collection zkNode exists
[junit4:junit4]   2> 339 T195 oasc.ZkController.readConfigName Load collection config from:/collections/control_collection
[junit4:junit4]   2> 340 T195 oasc.SolrResourceLoader.<init> new SolrResourceLoader for directory: '/mnt/ssd/jenkins/workspace/Lucene-Solr-4.x-Linux/solr/build/solr-core/test-files/solr/collection1/'
[junit4:junit4]   2> 341 T195 oasc.SolrResourceLoader.replaceClassLoader Adding 'file:/mnt/ssd/jenkins/workspace/Lucene-Solr-4.x-Linux/solr/build/solr-core/test-files/solr/collection1/lib/README' to classloader
[junit4:junit4]   2> 342 T195 oasc.SolrResourceLoader.replaceClassLoader Adding 'file:/mnt/ssd/jenkins/workspace/Lucene-Solr-4.x-Linux/solr/build/solr-core/test-files/solr/collection1/lib/classes/' to classloader
[junit4:junit4]   2> 372 T195 oasc.SolrConfig.<init> Using Lucene MatchVersion: LUCENE_41
[junit4:junit4]   2> 425 T195 oasc.SolrConfig.<init> Loaded SolrConfig: solrconfig.xml
[junit4:junit4]   2> 426 T195 oass.IndexSchema.readSchema Reading Solr Schema
[junit4:junit4]   2> 435 T195 oass.IndexSchema.readSchema Schema name=test
[junit4:junit4]   2> 1167 T195 oass.OpenExchangeRatesOrgProvider.init Initialized with rates=open-exchange-rates.json, refreshInterval=1440.
[junit4:junit4]   2> 1172 T195 oass.IndexSchema.readSchema default search field in schema is text
[junit4:junit4]   2> 1175 T195 oass.IndexSchema.readSchema unique key field: id
[junit4:junit4]   2> 1187 T195 oass.FileExchangeRateProvider.reload Reloading exchange rates from file currency.xml
[junit4:junit4]   2> 1192 T195 oass.FileExchangeRateProvider.reload Reloading exchange rates from file currency.xml
[junit4:junit4]   2> 1196 T195 oass.OpenExchangeRatesOrgProvider.reload Reloading exchange rates from open-exchange-rates.json
[junit4:junit4]   2> 1198 T195 oass.OpenExchangeRatesOrgProvider.reload Reloading exchange rates from open-exchange-rates.json
[junit4:junit4]   2> 1199 T195 oasc.SolrCore.<init> [collection1] Opening new SolrCore at /mnt/ssd/jenkins/workspace/Lucene-Solr-4.x-Linux/solr/build/solr-core/test-files/solr/collection1/, dataDir=./org.apache.solr.cloud.BasicDistributedZkTest-1352033139721/control/data/
[junit4:junit4]   2> 1200 T195 oasc.JmxMonitoredMap.<init> JMX monitoring is enabled. Adding Solr mbeans to JMX Server: com.sun.jmx.mbeanserver.JmxMBeanServer@c5599598
[junit4:junit4]   2> 1203 T195 oasc.SolrCore.getNewIndexDir New index directory detected: old=null new=./org.apache.solr.cloud.BasicDistributedZkTest-1352033139721/control/data/index/
[junit4:junit4]   2> 1204 T195 oasc.SolrCore.initIndex WARNING [collection1] Solr index directory './org.apache.solr.cloud.BasicDistributedZkTest-1352033139721/control/data/index' doesn't exist. Creating new index...
[junit4:junit4]   2> 1205 T195 oasc.CachingDirectoryFactory.get return new directory for /mnt/ssd/jenkins/workspace/Lucene-Solr-4.x-Linux/solr/build/solr-core/test/J0/./org.apache.solr.cloud.BasicDistributedZkTest-1352033139721/control/data/index forceNew:false
[junit4:junit4]   2> 1212 T195 oasc.SolrDeletionPolicy.onCommit SolrDeletionPolicy.onCommit: commits:num=1
[junit4:junit4]   2> 		commit{dir=NRTCachingDirectory(org.apache.lucene.store.MMapDirectory@/mnt/ssd/jenkins/workspace/Lucene-Solr-4.x-Linux/solr/build/solr-core/test/J0/org.apache.solr.cloud.BasicDistributedZkTest-1352033139721/control/data/index lockFactory=org.apache.lucene.store.NativeFSLockFactory@fbb4e8bd; maxCacheMB=48.0 maxMergeSizeMB=4.0),segFN=segments_1,generation=1,filenames=[segments_1]
[junit4:junit4]   2> 1212 T195 oasc.SolrDeletionPolicy.updateCommits newest commit = 1
[junit4:junit4]   2> 1213 T195 oasc.SolrCore.initWriters created xml: solr.XMLResponseWriter
[junit4:junit4]   2> 1215 T195 oasup.UpdateRequestProcessorChain.init inserting DistributedUpdateProcessorFactory into updateRequestProcessorChain "dedupe"
[junit4:junit4]   2> 1215 T195 oasup.UpdateRequestProcessorChain.init inserting DistributedUpdateProcessorFactory into updateRequestProcessorChain "dedupe-allfields"
[junit4:junit4]   2> 1216 T195 oasup.UpdateRequestProcessorChain.init inserting DistributedUpdateProcessorFactory into updateRequestProcessorChain "stored_sig"
[junit4:junit4]   2> 1217 T195 oasup.UpdateRequestProcessorChain.init inserting DistributedUpdateProcessorFactory into updateRequestProcessorChain "uniq-fields"
[junit4:junit4]   2> 1217 T195 oasup.UpdateRequestProcessorChain.init inserting DistributedUpdateProcessorFactory into updateRequestProcessorChain "distrib-dup-test-chain-implicit"
[junit4:junit4]   2> 1218 T195 oasc.RequestHandlers.initHandlersFromConfig adding lazy requestHandler: solr.ReplicationHandler
[junit4:junit4]   2> 1218 T195 oasc.RequestHandlers.initHandlersFromConfig created /replication: solr.ReplicationHandler
[junit4:junit4]   2> 1219 T195 oasc.RequestHandlers.initHandlersFromConfig created standard: solr.StandardRequestHandler
[junit4:junit4]   2> 1220 T195 oasc.RequestHandlers.initHandlersFromConfig created /get: solr.RealTimeGetHandler
[junit4:junit4]   2> 1220 T195 oasc.RequestHandlers.initHandlersFromConfig created dismax: solr.SearchHandler
[junit4:junit4]   2> 1221 T195 oasc.RequestHandlers.initHandlersFromConfig created mock: org.apache.solr.core.MockQuerySenderListenerReqHandler
[junit4:junit4]   2> 1221 T195 oasc.RequestHandlers.initHandlersFromConfig created /admin/: org.apache.solr.handler.admin.AdminHandlers
[junit4:junit4]   2> 1222 T195 oasc.RequestHandlers.initHandlersFromConfig created defaults: solr.StandardRequestHandler
[junit4:junit4]   2> 1222 T195 oasc.RequestHandlers.initHandlersFromConfig adding lazy requestHandler: solr.StandardRequestHandler
[junit4:junit4]   2> 1223 T195 oasc.RequestHandlers.initHandlersFromConfig created lazy: solr.StandardRequestHandler
[junit4:junit4]   2> 1223 T195 oasc.RequestHandlers.initHandlersFromConfig created /update: solr.UpdateRequestHandler
[junit4:junit4]   2> 1224 T195 oasc.RequestHandlers.initHandlersFromConfig created /terms: org.apache.solr.handler.component.SearchHandler
[junit4:junit4]   2> 1225 T195 oasc.RequestHandlers.initHandlersFromConfig created spellCheckCompRH: org.apache.solr.handler.component.SearchHandler
[junit4:junit4]   2> 1225 T195 oasc.RequestHandlers.initHandlersFromConfig created spellCheckCompRH_Direct: org.apache.solr.handler.component.SearchHandler
[junit4:junit4]   2> 1226 T195 oasc.RequestHandlers.initHandlersFromConfig created spellCheckWithWordbreak: org.apache.solr.handler.component.SearchHandler
[junit4:junit4]   2> 1226 T195 oasc.RequestHandlers.initHandlersFromConfig created spellCheckWithWordbreak_Direct: org.apache.solr.handler.component.SearchHandler
[junit4:junit4]   2> 1227 T195 oasc.RequestHandlers.initHandlersFromConfig created spellCheckCompRH1: org.apache.solr.handler.component.SearchHandler
[junit4:junit4]   2> 1227 T195 oasc.RequestHandlers.initHandlersFromConfig created tvrh: org.apache.solr.handler.component.SearchHandler
[junit4:junit4]   2> 1228 T195 oasc.RequestHandlers.initHandlersFromConfig created /mlt: solr.MoreLikeThisHandler
[junit4:junit4]   2> 1229 T195 oasc.RequestHandlers.initHandlersFromConfig created /debug/dump: solr.DumpRequestHandler
[junit4:junit4]   2> 1230 T195 oashl.XMLLoader.init xsltCacheLifetimeSeconds=60
[junit4:junit4]   2> 1231 T195 oasc.SolrCore.initDeprecatedSupport WARNING solrconfig.xml uses deprecated <admin/gettableFiles>, Please update your config to use the ShowFileRequestHandler.
[junit4:junit4]   2> 1233 T195 oasc.SolrCore.initDeprecatedSupport WARNING adding ShowFileRequestHandler with hidden files: [OLD_SYNONYMS.TXT, PROTWORDS.TXT, STOPWORDS.TXT, OPEN-EXCHANGE-RATES.JSON, CURRENCY.XML, SCHEMA.XML, SYNONYMS.TXT, MAPPING-ISOLATIN1ACCENT.TXT]
[junit4:junit4]   2> 1235 T195 oass.SolrIndexSearcher.<init> Opening Searcher@64665b85 main
[junit4:junit4]   2> 1239 T195 oasu.CommitTracker.<init> Hard AutoCommit: disabled
[junit4:junit4]   2> 1240 T195 oasu.CommitTracker.<init> Soft AutoCommit: disabled
[junit4:junit4]   2> 1240 T195 oashc.SpellCheckComponent.inform Initializing spell checkers
[junit4:junit4]   2> 1251 T195 oass.DirectSolrSpellChecker.init init: {name=direct,classname=DirectSolrSpellChecker,field=lowerfilt,minQueryLength=3}
[junit4:junit4]   2> 1276 T218 oasc.SolrCore.registerSearcher [collection1] Registered new searcher Searcher@64665b85 main{StandardDirectoryReader(segments_1:1)}
[junit4:junit4]   2> 1282 T195 oasc.ZkController.publish numShards not found on descriptor - reading it from system property
[junit4:junit4]   2> 1284 T200 oazs.PrepRequestProcessor.pRequest Got user-level KeeperException when processing sessionid:0x13acb747c0d0002 type:create cxid:0x53 zxid:0xfffffffffffffffe txntype:unknown reqpath:n/a Error Path:/solr/overseer/queue Error:KeeperErrorCode = NoNode for /solr/overseer/queue
[junit4:junit4]   2> 1286 T195 oasc.CoreContainer.register registering core: collection1
[junit4:junit4]   2> 1286 T195 oasc.ZkController.register Register shard - core:collection1 address:http://127.0.0.1:55412/solr shardId:control_shard
[junit4:junit4]   2> 1289 T195 oascsi.HttpClientUtil.createClient Creating new http client, config:maxConnections=10000&maxConnectionsPerHost=20&connTimeout=30000&socketTimeout=30000&retry=false
[junit4:junit4]   2> 1298 T195 oascc.SolrZkClient.makePath makePath: /collections/control_collection/leader_elect/control_shard/election
[junit4:junit4]   2> 1303 T200 oazs.PrepRequestProcessor.pRequest Got user-level KeeperException when processing sessionid:0x13acb747c0d0002 type:delete cxid:0x62 zxid:0xfffffffffffffffe txntype:unknown reqpath:n/a Error Path:/solr/collections/control_collection/leaders Error:KeeperErrorCode = NoNode for /solr/collections/control_collection/leaders
[junit4:junit4]   2> 1304 T195 oasc.ShardLeaderElectionContext.runLeaderProcess Running the leader process.
[junit4:junit4]   2> 1305 T200 oazs.PrepRequestProcessor.pRequest Got user-level KeeperException when processing sessionid:0x13acb747c0d0002 type:create cxid:0x63 zxid:0xfffffffffffffffe txntype:unknown reqpath:n/a Error Path:/solr/overseer Error:KeeperErrorCode = NodeExists for /solr/overseer
[junit4:junit4]   2> 1338 T216 oascc.ZkStateReader.updateClusterState Updating cloud state from ZooKeeper... 
[junit4:junit4]   2> 1339 T216 oasc.Overseer$ClusterStateUpdater.updateState Update state numShards=null message={
[junit4:junit4]   2> 	  "base_url":"http://127.0.0.1:55412/solr",
[junit4:junit4]   2> 	  "state":"down",
[junit4:junit4]   2> 	  "operation":"state",
[junit4:junit4]   2> 	  "node_name":"127.0.0.1:55412_solr",
[junit4:junit4]   2> 	  "numShards":null,
[junit4:junit4]   2> 	  "roles":null,
[junit4:junit4]   2> 	  "collection":"control_collection",
[junit4:junit4]   2> 	  "shard":"control_shard",
[junit4:junit4]   2> 	  "core":"collection1"}
[junit4:junit4]   2> 1341 T200 oazs.PrepRequestProcessor.pRequest Got user-level KeeperException when processing sessionid:0x13acb747c0d0002 type:create cxid:0x6a zxid:0xfffffffffffffffe txntype:unknown reqpath:n/a Error Path:/solr/overseer/queue-work Error:KeeperErrorCode = NoNode for /solr/overseer/queue-work
[junit4:junit4]   2> 1347 T215 oascc.ZkStateReader$2.process A cluster state change has occurred - updating... (1)
[junit4:junit4]   2> 1806 T195 oasc.ShardLeaderElectionContext.waitForReplicasToComeUp Enough replicas found to continue.
[junit4:junit4]   2> 1807 T195 oasc.ShardLeaderElectionContext.runLeaderProcess I may be the new leader - try and sync
[junit4:junit4]   2> 1808 T195 oasc.SyncStrategy.sync Sync replicas to http://127.0.0.1:55412/solr/collection1/
[junit4:junit4]   2> 1809 T195 oasc.SyncStrategy.syncReplicas Sync Success - now sync replicas to me
[junit4:junit4]   2> 1809 T195 oasc.SyncStrategy.syncToMe http://127.0.0.1:55412/solr/collection1/ has no replicas
[junit4:junit4]   2> 1810 T195 oasc.ShardLeaderElectionContext.runLeaderProcess I am the new leader: http://127.0.0.1:55412/solr/collection1/
[junit4:junit4]   2> 1811 T195 oascc.SolrZkClient.makePath makePath: /collections/control_collection/leaders/control_shard
[junit4:junit4]   2> 1814 T200 oazs.PrepRequestProcessor.pRequest Got user-level KeeperException when processing sessionid:0x13acb747c0d0002 type:create cxid:0x88 zxid:0xfffffffffffffffe txntype:unknown reqpath:n/a Error Path:/solr/overseer Error:KeeperErrorCode = NodeExists for /solr/overseer
[junit4:junit4]   2> 1853 T216 oascc.ZkStateReader.updateClusterState Updating cloud state from ZooKeeper... 
[junit4:junit4]   2> 1858 T215 oascc.ZkStateReader$2.process A cluster state change has occurred - updating... (1)
[junit4:junit4]   2> 1866 T195 oasc.ZkController.register We are http://127.0.0.1:55412/solr/collection1/ and leader is http://127.0.0.1:55412/solr/collection1/
[junit4:junit4]   2> 1867 T195 oasc.ZkController.register No LogReplay needed for core=collection1 baseURL=http://127.0.0.1:55412/solr
[junit4:junit4]   2> 1868 T195 oasc.ZkController.checkRecovery I am the leader, no recovery necessary
[junit4:junit4]   2> 1868 T195 oasc.ZkController.publish numShards not found on descriptor - reading it from system property
[junit4:junit4]   2> 1870 T195 oascc.ZkStateReader.updateClusterState Updating cloud state from ZooKeeper... 
[junit4:junit4]   2> 1870 T195 oass.SolrDispatchFilter.init user.dir=/mnt/ssd/jenkins/workspace/Lucene-Solr-4.x-Linux/solr/build/solr-core/test/J0
[junit4:junit4]   2> 1871 T195 oass.SolrDispatchFilter.init SolrDispatchFilter.init() done
[junit4:junit4]   2> 1871 T195 oascsi.HttpClientUtil.createClient Creating new http client, config:maxConnections=128&maxConnectionsPerHost=32&followRedirects=false
[junit4:junit4]   2> 1940 T195 oejs.Server.doStart jetty-8.1.2.v20120308
[junit4:junit4]   2> 1942 T195 oejs.AbstractConnector.doStart Started SelectChannelConnector@0.0.0.0:36297
[junit4:junit4]   2> 1943 T195 oasc.SolrResourceLoader.locateSolrHome JNDI not configured for solr (NoInitialContextEx)
[junit4:junit4]   2> 1944 T195 oasc.SolrResourceLoader.locateSolrHome using system property solr.solr.home: /mnt/ssd/jenkins/workspace/Lucene-Solr-4.x-Linux/solr/build/solr-core/test/J0/./solrtest-jetty1-1352033141589
[junit4:junit4]   2> 1945 T195 oasc.SolrResourceLoader.<init> new SolrResourceLoader for deduced Solr Home: '/mnt/ssd/jenkins/workspace/Lucene-Solr-4.x-Linux/solr/build/solr-core/test/J0/./solrtest-jetty1-1352033141589/'
[junit4:junit4]   2> 1958 T195 oass.SolrDispatchFilter.init SolrDispatchFilter.init()
[junit4:junit4]   2> 1959 T195 oasc.SolrResourceLoader.locateSolrHome JNDI not configured for solr (NoInitialContextEx)
[junit4:junit4]   2> 1959 T195 oasc.SolrResourceLoader.locateSolrHome using system property solr.solr.home: /mnt/ssd/jenkins/workspace/Lucene-Solr-4.x-Linux/solr/build/solr-core/test/J0/./solrtest-jetty1-1352033141589
[junit4:junit4]   2> 1959 T195 oasc.CoreContainer$Initializer.initialize looking for solr.xml: /mnt/ssd/jenkins/workspace/Lucene-Solr-4.x-Linux/solr/build/solr-core/test/J0/./solrtest-jetty1-1352033141589/solr.xml
[junit4:junit4]   2> 1960 T195 oasc.CoreContainer.<init> New CoreContainer 1164646245
[junit4:junit4]   2> 1961 T195 oasc.CoreContainer.load Loading CoreContainer using Solr Home: '/mnt/ssd/jenkins/workspace/Lucene-Solr-4.x-Linux/solr/build/solr-core/test/J0/./solrtest-jetty1-1352033141589/'
[junit4:junit4]   2> 1961 T195 oasc.SolrResourceLoader.<init> new SolrResourceLoader for directory: '/mnt/ssd/jenkins/workspace/Lucene-Solr-4.x-Linux/solr/build/solr-core/test/J0/./solrtest-jetty1-1352033141589/'
[junit4:junit4]   2> 1977 T195 oasc.CoreContainer.load Registering Log Listener
[junit4:junit4]   2> 1985 T195 oasc.CoreContainer.initZooKeeper Zookeeper client=127.0.0.1:54660/solr
[junit4:junit4]   2> 1985 T195 oaz.ZooKeeper.<init> Initiating client connection, connectString=127.0.0.1:54660/solr sessionTimeout=5000 watcher=org.apache.solr.common.cloud.ConnectionManager@8ad91902
[junit4:junit4]   2> 1986 T228 oaz.ClientCnxn$SendThread.startConnect Opening socket connection to server /127.0.0.1:54660
[junit4:junit4]   2> 1986 T195 oascc.ConnectionManager.waitForConnected Waiting for client to connect to ZooKeeper
[junit4:junit4]   2> 1987 T228 oaz.ClientCnxn$SendThread.primeConnection Socket connection established to localhost.localdomain/127.0.0.1:54660, initiating session
[junit4:junit4]   2> 1987 T197 oazs.NIOServerCnxn$Factory.run Accepted socket connection from /127.0.0.1:33963
[junit4:junit4]   2> 1987 T197 oazs.NIOServerCnxn.readConnectRequest Client attempting to establish new session at /127.0.0.1:33963
[junit4:junit4]   2> 1989 T199 oazs.NIOServerCnxn.finishSessionInit Established session 0x13acb747c0d0003 with negotiated timeout 5000 for client /127.0.0.1:33963
[junit4:junit4]   2> 1989 T228 oaz.ClientCnxn$SendThread.readConnectResult Session establishment complete on server localhost.localdomain/127.0.0.1:54660, sessionid = 0x13acb747c0d0003, negotiated timeout = 5000
[junit4:junit4]   2> 1989 T229 oascc.ConnectionManager.process Watcher org.apache.solr.common.cloud.ConnectionManager@8ad91902 name:ZooKeeperConnection Watcher:127.0.0.1:54660/solr got event WatchedEvent state:SyncConnected type:None path:null path:null type:None
[junit4:junit4]   2> 1990 T195 oascc.ConnectionManager.waitForConnected Client is connected to ZooKeeper
[junit4:junit4]   2> 1990 T200 oazs.PrepRequestProcessor.pRequest Got user-level KeeperException when processing sessionid:0x13acb747c0d0003 type:create cxid:0x1 zxid:0xfffffffffffffffe txntype:unknown reqpath:n/a Error Path:/solr/overseer Error:KeeperErrorCode = NodeExists for /solr/overseer
[junit4:junit4]   2> 1991 T200 oazs.PrepRequestProcessor.pRequest Got user-level KeeperException when processing sessionid:0x13acb747c0d0003 type:create cxid:0x2 zxid:0xfffffffffffffffe txntype:unknown reqpath:n/a Error Path:/solr/overseer Error:KeeperErrorCode = NodeExists for /solr/overseer
[junit4:junit4]   2> 1991 T195 oasc.ZkController.createEphemeralLiveNode Register node as live in ZooKeeper:/live_nodes/127.0.0.1:36297_solr
[junit4:junit4]   2> 1992 T200 oazs.PrepRequestProcessor.pRequest Got user-level KeeperException when processing sessionid:0x13acb747c0d0003 type:delete cxid:0x4 zxid:0xfffffffffffffffe txntype:unknown reqpath:n/a Error Path:/solr/live_nodes/127.0.0.1:36297_solr Error:KeeperErrorCode = NoNode for /solr/live_nodes/127.0.0.1:36297_solr
[junit4:junit4]   2> 1992 T195 oascc.SolrZkClient.makePath makePath: /live_nodes/127.0.0.1:36297_solr
[junit4:junit4]   2> 1994 T215 oascc.ZkStateReader$3.process Updating live nodes... (2)
[junit4:junit4]   2> 1999 T195 oashc.HttpShardHandlerFactory.getParameter Setting socketTimeout to: 0
[junit4:junit4]   2> 2000 T195 oashc.HttpShardHandlerFactory.getParameter Setting urlScheme to: http://
[junit4:junit4]   2> 2000 T195 oashc.HttpShardHandlerFactory.getParameter Setting connTimeout to: 0
[junit4:junit4]   2> 2000 T195 oashc.HttpShardHandlerFactory.getParameter Setting maxConnectionsPerHost to: 20
[junit4:junit4]   2> 2001 T195 oashc.HttpShardHandlerFactory.getParameter Setting corePoolSize to: 0
[junit4:junit4]   2> 2002 T195 oashc.HttpShardHandlerFactory.getParameter Setting maximumPoolSize to: 2147483647
[junit4:junit4]   2> 2002 T195 oashc.HttpShardHandlerFactory.getParameter Setting maxThreadIdleTime to: 5
[junit4:junit4]   2> 2003 T195 oashc.HttpShardHandlerFactory.getParameter Setting sizeOfQueue to: -1
[junit4:junit4]   2> 2003 T195 oashc.HttpShardHandlerFactory.getParameter Setting fairnessPolicy to: false
[junit4:junit4]   2> 2004 T195 oascsi.HttpClientUtil.createClient Creating new http client, config:maxConnectionsPerHost=20&maxConnections=10000&socketTimeout=0&connTimeout=0&retry=false
[junit4:junit4]   2> 2018 T195 oascc.ZkStateReader.createClusterStateWatchersAndUpdate Updating cluster state from ZooKeeper... 
[junit4:junit4]   2> 2025 T195 oasc.CoreContainer.create Creating SolrCore 'collection1' using instanceDir: /mnt/ssd/jenkins/workspace/Lucene-Solr-4.x-Linux/solr/build/solr-core/test/J0/./solrtest-jetty1-1352033141589/collection1
[junit4:junit4]   2> 2025 T195 oasc.ZkController.createCollectionZkNode Check for collection zkNode:collection1
[junit4:junit4]   2> 2026 T195 oasc.ZkController.createCollectionZkNode Collection zkNode exists
[junit4:junit4]   2> 2027 T195 oasc.ZkController.readConfigName Load collection config from:/collections/collection1
[junit4:junit4]   2> 2030 T195 oasc.SolrResourceLoader.<init> new SolrResourceLoader for directory: '/mnt/ssd/jenkins/workspace/Lucene-Solr-4.x-Linux/solr/build/solr-core/test/J0/./solrtest-jetty1-1352033141589/collection1/'
[junit4:junit4]   2> 2031 T195 oasc.SolrResourceLoader.replaceClassLoader Adding 'file:/mnt/ssd/jenkins/workspace/Lucene-Solr-4.x-Linux/solr/build/solr-core/test/J0/solrtest-jetty1-1352033141589/collection1/lib/README' to classloader
[junit4:junit4]   2> 2032 T195 oasc.SolrResourceLoader.replaceClassLoader Adding 'file:/mnt/ssd/jenkins/workspace/Lucene-Solr-4.x-Linux/solr/build/solr-core/test/J0/solrtest-jetty1-1352033141589/collection1/lib/classes/' to classloader
[junit4:junit4]   2> 2072 T195 oasc.SolrConfig.<init> Using Lucene MatchVersion: LUCENE_41
[junit4:junit4]   2> 2158 T195 oasc.SolrConfig.<init> Loaded SolrConfig: solrconfig.xml
[junit4:junit4]   2> 2162 T195 oass.IndexSchema.readSchema Reading Solr Schema
[junit4:junit4]   2> 2179 T195 oass.IndexSchema.readSchema Schema name=test
[junit4:junit4]   2> 2361 T216 oascc.ZkStateReader.updateClusterState Updating cloud state from ZooKeeper... 
[junit4:junit4]   2> 2362 T216 oasc.Overseer$ClusterStateUpdater.updateState Update state numShards=null message={
[junit4:junit4]   2> 	  "base_url":"http://127.0.0.1:55412/solr",
[junit4:junit4]   2> 	  "state":"active",
[junit4:junit4]   2> 	  "operation":"state",
[junit4:junit4]   2> 	  "node_name":"127.0.0.1:55412_solr",
[junit4:junit4]   2> 	  "numShards":null,
[junit4:junit4]   2> 	  "roles":null,
[junit4:junit4]   2> 	  "collection":"control_collection",
[junit4:junit4]   2> 	  "shard":"control_shard",
[junit4:junit4]   2> 	  "core":"collection1"}
[junit4:junit4]   2> 2366 T229 oascc.ZkStateReader$2.process A cluster state change has occurred - updating... (2)
[junit4:junit4]   2> 2366 T215 oascc.ZkStateReader$2.process A cluster state change has occurred - updating... (2)
[junit4:junit4]   2> 2860 T195 oass.OpenExchangeRatesOrgProvider.init Initialized with rates=open-exchange-rates.json, refreshInterval=1440.
[junit4:junit4]   2> 2876 T195 oass.IndexSchema.readSchema default search field in schema is text
[junit4:junit4]   2> 2881 T195 oass.IndexSchema.readSchema unique key field: id
[junit4:junit4]   2> 2917 T195 oass.FileExchangeRateProvider.reload Reloading exchange rates from file currency.xml
[junit4:junit4]   2> 2929 T195 oass.FileExchangeRateProvider.reload Reloading exchange rates from file currency.xml
[junit4:junit4]   2> 2945 T195 oass.OpenExchangeRatesOrgProvider.reload Reloading exchange rates from open-exchange-rates.json
[junit4:junit4]   2> 2951 T195 oass.OpenExchangeRatesOrgProvider.reload Reloading exchange rates from open-exchange-rates.json
[junit4:junit4]   2> 2954 T195 oasc.SolrCore.<init> [collection1] Opening new SolrCore at /mnt/ssd/jenkins/workspace/Lucene-Solr-4.x-Linux/solr/build/solr-core/test/J0/./solrtest-jetty1-1352033141589/collection1/, dataDir=./org.apache.solr.cloud.BasicDistributedZkTest-1352033139721/jetty1/
[junit4:junit4]   2> 2955 T195 oasc.JmxMonitoredMap.<init> JMX monitoring is enabled. Adding Solr mbeans to JMX Server: com.sun.jmx.mbeanserver.JmxMBeanServer@c5599598
[junit4:junit4]   2> 2956 T195 oasc.SolrCore.getNewIndexDir New index directory detected: old=null new=./org.apache.solr.cloud.BasicDistributedZkTest-1352033139721/jetty1/index/
[junit4:junit4]   2> 2957 T195 oasc.SolrCore.initIndex WARNING [collection1] Solr index directory './org.apache.solr.cloud.BasicDistributedZkTest-1352033139721/jetty1/index' doesn't exist. Creating new index...
[junit4:junit4]   2> 2959 T195 oasc.CachingDirectoryFactory.get return new directory for /mnt/ssd/jenkins/workspace/Lucene-Solr-4.x-Linux/solr/build/solr-core/test/J0/./org.apache.solr.cloud.BasicDistributedZkTest-1352033139721/jetty1/index forceNew:false
[junit4:junit4]   2> 2971 T195 oasc.SolrDeletionPolicy.onCommit SolrDeletionPolicy.onCommit: commits:num=1
[junit4:junit4]   2> 		commit{dir=NRTCachingDirectory(org.apache.lucene.store.MMapDirectory@/mnt/ssd/jenkins/workspace/Lucene-Solr-4.x-Linux/solr/build/solr-core/test/J0/org.apache.solr.cloud.BasicDistributedZkTest-1352033139721/jetty1/index lockFactory=org.apache.lucene.store.NativeFSLockFactory@13c504fc; maxCacheMB=48.0 maxMergeSizeMB=4.0),segFN=segments_1,generation=1,filenames=[segments_1]
[junit4:junit4]   2> 2971 T195 oasc.SolrDeletionPolicy.updateCommits newest commit = 1
[junit4:junit4]   2> 2972 T195 oasc.SolrCore.initWriters created xml: solr.XMLResponseWriter
[junit4:junit4]   2> 2974 T195 oasup.UpdateRequestProcessorChain.init inserting DistributedUpdateProcessorFactory into updateRequestProcessorChain "dedupe"
[junit4:junit4]   2> 2974 T195 oasup.UpdateRequestProcessorChain.init inserting DistributedUpdateProcessorFactory into updateRequestProcessorChain "dedupe-allfields"
[junit4:junit4]   2> 2975 T195 oasup.UpdateRequestProcessorChain.init inserting DistributedUpdateProcessorFactory into updateRequestProcessorChain "stored_sig"
[junit4:junit4]   2> 2975 T195 oasup.UpdateRequestProcessorChain.init inserting DistributedUpdateProcessorFactory into updateRequestProcessorChain "uniq-fields"
[junit4:junit4]   2> 2976 T195 oasup.UpdateRequestProcessorChain.init inserting DistributedUpdateProcessorFactory into updateRequestProcessorChain "distrib-dup-test-chain-implicit"
[junit4:junit4]   2> 2981 T195 oasc.RequestHandlers.initHandlersFromConfig adding lazy requestHandler: solr.ReplicationHandler
[junit4:junit4]   2> 2982 T195 oasc.RequestHandlers.initHandlersFromConfig created /replication: solr.ReplicationHandler
[junit4:junit4]   2> 2983 T195 oasc.RequestHandlers.initHandlersFromConfig created standard: solr.StandardRequestHandler
[junit4:junit4]   2> 2984 T195 oasc.RequestHandlers.initHandlersFromConfig created /get: solr.RealTimeGetHandler
[junit4:junit4]   2> 2985 T195 oasc.RequestHandlers.initHandlersFromConfig created dismax: solr.SearchHandler
[junit4:junit4]   2> 2986 T195 oasc.RequestHandlers.initHandlersFromConfig created mock: org.apache.solr.core.MockQuerySenderListenerReqHandler
[junit4:junit4]   2> 2987 T195 oasc.RequestHandlers.initHandlersFromConfig created /admin/: org.apache.solr.handler.admin.AdminHandlers
[junit4:junit4]   2> 2988 T195 oasc.RequestHandlers.initHandlersFromConfig created defaults: solr.StandardRequestHandler
[junit4:junit4]   2> 2989 T195 oasc.RequestHandlers.initHandlersFromConfig adding lazy requestHandler: solr.StandardRequestHandler
[junit4:junit4]   2> 2990 T195 oasc.RequestHandlers.initHandlersFromConfig created lazy: solr.StandardRequestHandler
[junit4:junit4]   2> 2991 T195 oasc.RequestHandlers.initHandlersFromConfig created /update: solr.UpdateRequestHandler
[junit4:junit4]   2> 2992 T195 oasc.RequestHandlers.initHandlersFromConfig created /terms: org.apache.solr.handler.component.SearchHandler
[junit4:junit4]   2> 2993 T195 oasc.RequestHandlers.initHandlersFromConfig created spellCheckCompRH: org.apache.solr.handler.component.SearchHandler
[junit4:junit4]   2> 2994 T195 oasc.RequestHandlers.initHandlersFromConfig created spellCheckCompRH_Direct: org.apache.solr.handler.component.SearchHandler
[junit4:junit4]   2> 2995 T195 oasc.RequestHandlers.initHandlersFromConfig created spellCheckWithWordbreak: org.apache.solr.handler.component.SearchHandler
[junit4:junit4]   2> 2996 T195 oasc.RequestHandlers.initHandlersFromConfig created spellCheckWithWordbreak_Direct: org.apache.solr.handler.component.SearchHandler
[junit4:junit4]   2> 2996 T195 oasc.RequestHandlers.initHandlersFromConfig created spellCheckCompRH1: org.apache.solr.handler.component.SearchHandler
[junit4:junit4]   2> 2997 T195 oasc.RequestHandlers.initHandlersFromConfig created tvrh: org.apache.solr.handler.component.SearchHandler
[junit4:junit4]   2> 2998 T195 oasc.RequestHandlers.initHandlersFromConfig created /mlt: solr.MoreLikeThisHandler
[junit4:junit4]   2> 2999 T195 oasc.RequestHandlers.initHandlersFromConfig created /debug/dump: solr.DumpRequestHandler
[junit4:junit4]   2> 3001 T195 oashl.XMLLoader.init xsltCacheLifetimeSeconds=60
[junit4:junit4]   2> 3004 T195 oasc.SolrCore.initDeprecatedSupport WARNING solrconfig.xml uses deprecated <admin/gettableFiles>, Please update your config to use the ShowFileRequestHandler.
[junit4:junit4]   2> 3005 T195 oasc.SolrCore.initDeprecatedSupport WARNING adding ShowFileRequestHandler with hidden files: [OLD_SYNONYMS.TXT, PROTWORDS.TXT, STOPWORDS.TXT, OPEN-EXCHANGE-RATES.JSON, CURRENCY.XML, SCHEMA.XML, SYNONYMS.TXT, MAPPING-ISOLATIN1ACCENT.TXT]
[junit4:junit4]   2> 3008 T195 oass.SolrIndexSearcher.<init> Opening Searcher@1ae111fc main
[junit4:junit4]   2> 3010 T195 oasu.CommitTracker.<init> Hard AutoCommit: disabled
[junit4:junit4]   2> 3010 T195 oasu.CommitTracker.<init> Soft AutoCommit: disabled
[junit4:junit4]   2> 3011 T195 oashc.SpellCheckComponent.inform Initializing spell checkers
[junit4:junit4]   2> 3017 T195 oass.DirectSolrSpellChecker.init init: {name=direct,classname=DirectSolrSpellChecker,field=lowerfilt,minQueryLength=3}
[junit4:junit4]   2> 3062 T230 oasc.SolrCore.registerSearcher [collection1] Registered new searcher Searcher@1ae111fc main{StandardDirectoryReader(segments_1:1)}
[junit4:junit4]   2> 3066 T195 oasc.ZkController.publish numShards not found on descriptor - reading it from system property
[junit4:junit4]   2> 3374 T216 oascc.ZkStateReader.updateClusterState Updating cloud state from ZooKeeper... 
[junit4:junit4]   2> 3375 T216 oasc.Overseer$ClusterStateUpdater.updateState Update state numShards=2 message={
[junit4:junit4]   2> 	  "base_url":"http://127.0.0.1:36297/solr",
[junit4:junit4]   2> 	  "state":"down",
[junit4:junit4]   2> 	  "operation":"state",
[junit4:junit4]   2> 	  "node_name":"127.0.0.1:36297_solr",
[junit4:junit4]   2> 	  "numShards":"2",
[junit4:junit4]   2> 	  "roles":null,
[junit4:junit4]   2> 	  "collection":"collection1",
[junit4:junit4]   2> 	  "shard":null,
[junit4:junit4]   2> 	  "core":"collection1"}
[junit4:junit4]   2> 3375 T216 oasc.Overseer$ClusterStateUpdater.createCollection Create collection collection1 with numShards 2
[junit4:junit4]   2> 3399 T229 oascc.ZkStateReader$2.process A cluster state change has occurred - updating... (2)
[junit4:junit4]   2> 3399 T215 oascc.ZkStateReader$2.process A cluster state change has occurred - updating... (2)
[junit4:junit4]   2> 3568 T195 oasc.CoreContainer.register registering core: collection1
[junit4:junit4]   2> 3569 T195 oasc.ZkController.register Register shard - core:collection1 address:http://127.0.0.1:36297/solr shardId:shard1
[junit4:junit4]   2> 3570 T195 oascc.SolrZkClient.makePath makePath: /collections/collection1/leader_elect/shard1/election
[junit4:junit4]   2> 3575 T200 oazs.PrepRequestProcessor.pRequest Got user-level KeeperException when processing sessionid:0x13acb747c0d0003 type:delete cxid:0x43 zxid:0xfffffffffffffffe txntype:unknown reqpath:n/a Error Path:/solr/collections/collection1/leaders Error:KeeperErrorCode = NoNode for /solr/collections/collection1/leaders
[junit4:junit4]   2> 3575 T195 oasc.ShardLeaderElectionContext.runLeaderProcess Running the leader process.
[junit4:junit4]   2> 3576 T200 oazs.PrepRequestProcessor.pRequest Got user-level KeeperException when processing sessionid:0x13acb747c0d0003 type:create cxid:0x44 zxid:0xfffffffffffffffe txntype:unknown reqpath:n/a Error Path:/solr/overseer Error:KeeperErrorCode = NodeExists for /solr/overseer
[junit4:junit4]   2> 3578 T195 oasc.ShardLeaderElectionContext.waitForReplicasToComeUp Enough replicas found to continue.
[junit4:junit4]   2> 3578 T195 oasc.ShardLeaderElectionContext.runLeaderProcess I may be the new leader - try and sync
[junit4:junit4]   2> 3579 T195 oasc.SyncStrategy.sync Sync replicas to http://127.0.0.1:36297/solr/collection1/
[junit4:junit4]   2> 3579 T195 oasc.SyncStrategy.syncReplicas Sync Success - now sync replicas to me
[junit4:junit4]   2> 3580 T195 oasc.SyncStrategy.syncToMe http://127.0.0.1:36297/solr/collection1/ has no replicas
[junit4:junit4]   2> 3581 T195 oasc.ShardLeaderElectionContext.runLeaderProcess I am the new leader: http://127.0.0.1:36297/solr/collection1/
[junit4:junit4]   2> 3581 T195 oascc.SolrZkClient.makePath makePath: /collections/collection1/leaders/shard1
[junit4:junit4]   2> 3584 T200 oazs.PrepRequestProcessor.pRequest Got user-level KeeperException when processing sessionid:0x13acb747c0d0003 type:create cxid:0x4e zxid:0xfffffffffffffffe txntype:unknown reqpath:n/a Error Path:/solr/overseer Error:KeeperErrorCode = NodeExists for /solr/overseer
[junit4:junit4]   2> 3903 T216 oascc.ZkStateReader.updateClusterState Updating cloud state from ZooKeeper... 
[junit4:junit4]   2> 3908 T229 oascc.ZkStateReader$2.process A cluster state change has occurred - updating... (2)
[junit4:junit4]   2> 3908 T215 oascc.ZkStateReader$2.process A cluster state change has occurred - updating... (2)
[junit4:junit4]   2> 3937 T195 oasc.ZkController.register We are http://127.0.0.1:36297/solr/collection1/ and leader is http://127.0.0.1:36297/solr/collection1/
[junit4:junit4]   2> 3937 T195 oasc.ZkController.register No LogReplay needed for core=collection1 baseURL=http://127.0.0.1:36297/solr
[junit4:junit4]   2> 3938 T195 oasc.ZkController.checkRecovery I am the leader, no recovery necessary
[junit4:junit4]   2> 3938 T195 oasc.ZkController.publish numShards not found on descriptor - reading it from system property
[junit4:junit4]   2> 3940 T195 oascc.ZkStateReader.updateClusterState Updating cloud state from ZooKeeper... 
[junit4:junit4]   2> 3941 T195 oass.SolrDispatchFilter.init user.dir=/mnt/ssd/jenkins/workspace/Lucene-Solr-4.x-Linux/solr/build/solr-core/test/J0
[junit4:junit4]   2> 3941 T195 oass.SolrDispatchFilter.init SolrDispatchFilter.init() done
[junit4:junit4]   2> 3942 T195 oascsi.HttpClientUtil.createClient Creating new http client, config:maxConnections=128&maxConnectionsPerHost=32&followRedirects=false
[junit4:junit4]   2> 4023 T195 oejs.Server.doStart jetty-8.1.2.v20120308
[junit4:junit4]   2> 4025 T195 oejs.AbstractConnector.doStart Started SelectChannelConnector@0.0.0.0:49345
[junit4:junit4]   2> 4025 T195 oasc.SolrResourceLoader.locateSolrHome JNDI not configured for solr (NoInitialContextEx)
[junit4:junit4]   2> 4026 T195 oasc.SolrResourceLoader.locateSolrHome using system property solr.solr.home: /mnt/ssd/jenkins/workspace/Lucene-Solr-4.x-Linux/solr/build/solr-core/test/J0/./solrtest-jetty2-1352033143659
[junit4:junit4]   2> 4026 T195 oasc.SolrResourceLoader.<init> new SolrResourceLoader for deduced Solr Home: '/mnt/ssd/jenkins/workspace/Lucene-Solr-4.x-Linux/solr/build/solr-core/test/J0/./solrtest-jetty2-1352033143659/'
[junit4:junit4]   2> 4036 T195 oass.SolrDispatchFilter.init SolrDispatchFilter.init()
[junit4:junit4]   2> 4036 T195 oasc.SolrResourceLoader.locateSolrHome JNDI not configured for solr (NoInitialContextEx)
[junit4:junit4]   2> 4037 T195 oasc.SolrResourceLoader.locateSolrHome using system property solr.solr.home: /mnt/ssd/jenkins/workspace/Lucene-Solr-4.x-Linux/solr/build/solr-core/test/J0/./solrtest-jetty2-1352033143659
[junit4:junit4]   2> 4037 T195 oasc.CoreContainer$Initializer.initialize looking for solr.xml: /mnt/ssd/jenkins/workspace/Lucene-Solr-4.x-Linux/solr/build/solr-core/test/J0/./solrtest-jetty2-1352033143659/solr.xml
[junit4:junit4]   2> 4038 T195 oasc.CoreContainer.<init> New CoreContainer -1777616275
[junit4:junit4]   2> 4038 T195 oasc.CoreContainer.load Loading CoreContainer using Solr Home: '/mnt/ssd/jenkins/workspace/Lucene-Solr-4.x-Linux/solr/build/solr-core/test/J0/./solrtest-jetty2-1352033143659/'
[junit4:junit4]   2> 4038 T195 oasc.SolrResourceLoader.<init> new SolrResourceLoader for directory: '/mnt/ssd/jenkins/workspace/Lucene-Solr-4.x-Linux/solr/build/solr-core/test/J0/./solrtest-jetty2-1352033143659/'
[junit4:junit4]   2> 4051 T195 oasc.CoreContainer.load Registering Log Listener
[junit4:junit4]   2> 4067 T195 oasc.CoreContainer.initZooKeeper Zookeeper client=127.0.0.1:54660/solr
[junit4:junit4]   2> 4068 T195 oaz.ZooKeeper.<init> Initiating client connection, connectString=127.0.0.1:54660/solr sessionTimeout=5000 watcher=org.apache.solr.common.cloud.ConnectionManager@691aaebc
[junit4:junit4]   2> 4069 T240 oaz.ClientCnxn$SendThread.startConnect Opening socket connection to server /127.0.0.1:54660
[junit4:junit4]   2> 4069 T195 oascc.ConnectionManager.waitForConnected Waiting for client to connect to ZooKeeper
[junit4:junit4]   2> 4070 T240 oaz.ClientCnxn$SendThread.primeConnection Socket connection established to localhost.localdomain/127.0.0.1:54660, initiating session
[junit4:junit4]   2> 4070 T197 oazs.NIOServerCnxn$Factory.run Accepted socket connection from /127.0.0.1:33965
[junit4:junit4]   2> 4071 T197 oazs.NIOServerCnxn.readConnectRequest Client attempting to establish new session at /127.0.0.1:33965
[junit4:junit4]   2> 4072 T199 oazs.NIOServerCnxn.finishSessionInit Established session 0x13acb747c0d0004 with negotiated timeout 5000 for client /127.0.0.1:33965
[junit4:junit4]   2> 4072 T240 oaz.ClientCnxn$SendThread.readConnectResult Session establishment complete on server localhost.localdomain/127.0.0.1:54660, sessionid = 0x13acb747c0d0004, negotiated timeout = 5000
[junit4:junit4]   2> 4072 T241 oascc.ConnectionManager.process Watcher org.apache.solr.common.cloud.ConnectionManager@691aaebc name:ZooKeeperConnection Watcher:127.0.0.1:54660/solr got event WatchedEvent state:SyncConnected type:None path:null path:null type:None
[junit4:junit4]   2> 4073 T195 oascc.ConnectionManager.waitForConnected Client is connected to ZooKeeper
[junit4:junit4]   2> 4074 T200 oazs.PrepRequestProcessor.pRequest Got user-level KeeperException when processing sessionid:0x13acb747c0d0004 type:create cxid:0x1 zxid:0xfffffffffffffffe txntype:unknown reqpath:n/a Error Path:/solr/overseer Error:KeeperErrorCode = NodeExists for /solr/overseer
[junit4:junit4]   2> 4074 T200 oazs.PrepRequestProcessor.pRequest Got user-level KeeperException when processing sessionid:0x13acb747c0d0004 type:create cxid:0x2 zxid:0xfffffffffffffffe txntype:unknown reqpath:n/a Error Path:/solr/overseer Error:KeeperErrorCode = NodeExists for /solr/overseer
[junit4:junit4]   2> 4179 T195 oasc.ZkController.createEphemeralLiveNode Register node as live in ZooKeeper:/live_nodes/127.0.0.1:49345_solr
[junit4:junit4]   2> 4180 T200 oazs.PrepRequestProcessor.pRequest Got user-level KeeperException when processing sessionid:0x13acb747c0d0004 type:delete cxid:0x4 zxid:0xfffffffffffffffe txntype:unknown reqpath:n/a Error Path:/solr/live_nodes/127.0.0.1:49345_solr Error:KeeperErrorCode = NoNode for /solr/live_nodes/127.0.0.1:49345_solr
[junit4:junit4]   2> 4182 T195 oascc.SolrZkClient.makePath makePath: /live_nodes/127.0.0.1:49345_solr
[junit4:junit4]   2> 4184 T229 oascc.ZkStateReader$3.process Updating live nodes... (3)
[junit4:junit4]   2> 4184 T215 oascc.ZkStateReader$3.process Updating live nodes... (3)
[junit4:junit4]   2> 4185 T195 oashc.HttpShardHandlerFactory.getParameter Setting socketTimeout to: 0
[junit4:junit4]   2> 4186 T195 oashc.HttpShardHandlerFactory.getParameter Setting urlScheme to: http://
[junit4:junit4]   2> 4187 T195 oashc.HttpShardHandlerFactory.getParameter Setting connTimeout to: 0
[junit4:junit4]   2> 4187 T195 oashc.HttpShardHandlerFactory.getParameter Setting maxConnectionsPerHost to: 20
[junit4:junit4]   2> 4188 T195 oashc.HttpShardHandlerFactory.getParameter Setting corePoolSize to: 0
[junit4:junit4]   2> 4189 T195 oashc.HttpShardHandlerFactory.getParameter Setting maximumPoolSize to: 2147483647
[junit4:junit4]   2> 4189 T195 oashc.HttpShardHandlerFactory.getParameter Setting maxThreadIdleTime to: 5
[junit4:junit4]   2> 4190 T195 oashc.HttpShardHandlerFactory.getParameter Setting sizeOfQueue to: -1
[junit4:junit4]   2> 4191 T195 oashc.HttpShardHandlerFactory.getParameter Setting fairnessPolicy to: false
[junit4:junit4]   2> 4192 T195 oascsi.HttpClientUtil.createClient Creating new http client, config:maxConnectionsPerHost=20&maxConnections=10000&socketTimeout=0&connTimeout=0&retry=false
[junit4:junit4]   2> 4205 T195 oascc.ZkStateReader.createClusterStateWatchersAndUpdate Updating cluster state from ZooKeeper... 
[junit4:junit4]   2> 4211 T195 oasc.CoreContainer.create Creating SolrCore 'collection1' using instanceDir: /mnt/ssd/jenkins/workspace/Lucene-Solr-4.x-Linux/solr/build/solr-core/test/J0/./solrtest-jetty2-1352033143659/collection1
[junit4:junit4]   2> 4212 T195 oasc.ZkController.createCollectionZkNode Check for collection zkNode:collection1
[junit4:junit4]   2> 4213 T195 oasc.ZkController.createCollectionZkNode Collection zkNode exists
[junit4:junit4]   2> 4214 T195 oasc.ZkController.readConfigName Load collection config from:/collections/collection1
[junit4:junit4]   2> 4215 T195 oasc.SolrResourceLoader.<init> new SolrResourceLoader for directory: '/mnt/ssd/jenkins/workspace/Lucene-Solr-4.x-Linux/solr/build/solr-core/test/J0/./solrtest-jetty2-1352033143659/collection1/'
[junit4:junit4]   2> 4216 T195 oasc.SolrResourceLoader.replaceClassLoader Adding 'file:/mnt/ssd/jenkins/workspace/Lucene-Solr-4.x-Linux/solr/build/solr-core/test/J0/solrtest-jetty2-1352033143659/collection1/lib/README' to classloader
[junit4:junit4]   2> 4217 T195 oasc.SolrResourceLoader.replaceClassLoader Adding 'file:/mnt/ssd/jenkins/workspace/Lucene-Solr-4.x-Linux/solr/build/solr-core/test/J0/solrtest-jetty2-1352033143659/collection1/lib/classes/' to classloader
[junit4:junit4]   2> 4265 T195 oasc.SolrConfig.<init> Using Lucene MatchVersion: LUCENE_41
[junit4:junit4]   2> 4330 T195 oasc.SolrConfig.<init> Loaded SolrConfig: solrconfig.xml
[junit4:junit4]   2> 4332 T195 oass.IndexSchema.readSchema Reading Solr Schema
[junit4:junit4]   2> 4339 T195 oass.IndexSchema.readSchema Schema name=test
[junit4:junit4]   2> 4411 T216 oascc.ZkStateReader.updateClusterState Updating cloud state from ZooKeeper... 
[junit4:junit4]   2> 4412 T216 oasc.Overseer$ClusterStateUpdater.updateState Update state numShards=2 message={
[junit4:junit4]   2> 	  "base_url":"http://127.0.0.1:36297/solr",
[junit4:junit4]   2> 	  "state":"active",
[junit4:junit4]   2> 	  "operation":"state",
[junit4:junit4]   2> 	  "node_name":"127.0.0.1:36297_solr",
[junit4:junit4]   2> 	  "numShards":"2",
[junit4:junit4]   2> 	  "roles":null,
[junit4:junit4]   2> 	  "collection":"collection1",
[junit4:junit4]   2> 	  "shard":"shard1",
[junit4:junit4]   2> 	  "core":"collection1"}
[junit4:junit4]   2> 4417 T229 oascc.ZkStateReader$2.process A cluster state change has occurred - updating... (3)
[junit4:junit4]   2> 4417 T241 oascc.ZkStateReader$2.process A cluster state change has occurred - updating... (3)
[junit4:junit4]   2> 4417 T215 oascc.ZkStateReader$2.process A cluster state change has occurred - updating... (3)
[junit4:junit4]   2> 4923 T195 oass.OpenExchangeRatesOrgProvider.init Initialized with rates=open-exchange-rates.json, refreshInterval=1440.
[junit4:junit4]   2> 4929 T195 oass.IndexSchema.readSchema default search field in schema is text
[junit4:junit4]   2> 4932 T195 oass.IndexSchema.readSchema unique key field: id
[junit4:junit4]   2> 4946 T195 oass.FileExchangeRateProvider.reload Reloading exchange rates from file currency.xml
[junit4:junit4]   2> 4954 T195 oass.FileExchangeRateProvider.reload Reloading exchange rates from file currency.xml
[junit4:junit4]   2> 4961 T195 oass.OpenExchangeRatesOrgProvider.reload Reloading exchange rates from open-exchange-rates.json
[junit4:junit4]   2> 4963 T195 oass.OpenExchangeRatesOrgProvider.reload Reloading exchange rates from open-exchange-rates.json
[junit4:junit4]   2> 4964 T195 oasc.SolrCore.<init> [collection1] Opening new SolrCore at /mnt/ssd/jenkins/workspace/Lucene-Solr-4.x-Linux/solr/build/solr-core/test/J0/./solrtest-jetty2-1352033143659/collection1/, dataDir=./org.apache.solr.cloud.BasicDistributedZkTest-1352033139721/jetty2/
[junit4:junit4]   2> 4965 T195 oasc.JmxMonitoredMap.<init> JMX monitoring is enabled. Adding Solr mbeans to JMX Server: com.sun.jmx.mbeanserver.JmxMBeanServer@c5599598
[junit4:junit4]   2> 4966 T195 oasc.SolrCore.getNewIndexDir New index directory detected: old=null new=./org.apache.solr.cloud.BasicDistributedZkTest-1352033139721/jetty2/index/
[junit4:junit4]   2> 4967 T195 oasc.SolrCore.initIndex WARNING [collection1] Solr index directory './org.apache.solr.cloud.BasicDistributedZkTest-1352033139721/jetty2/index' doesn't exist. Creating new index...
[junit4:junit4]   2> 4968 T195 oasc.CachingDirectoryFactory.get return new directory for /mnt/ssd/jenkins/workspace/Lucene-Solr-4.x-Linux/solr/build/solr-core/test/J0/./org.apache.solr.cloud.BasicDistributedZkTest-1352033139721/jetty2/index forceNew:false
[junit4:junit4]   2> 4991 T195 oasc.SolrDeletionPolicy.onCommit SolrDeletionPolicy.onCommit: commits:num=1
[junit4:junit4]   2> 		commit{dir=NRTCachingDirectory(org.apache.lucene.store.MMapDirectory@/mnt/ssd/jenkins/workspace/Lucene-Solr-4.x-Linux/solr/build/solr-core/test/J0/org.apache.solr.cloud.BasicDistributedZkTest-1352033139721/jetty2/index lockFactory=org.apache.lucene.store.NativeFSLockFactory@3989b65f; maxCacheMB=48.0 maxMergeSizeMB=4.0),segFN=segments_1,generation=1,filenames=[segments_1]
[junit4:junit4]   2> 4992 T195 oasc.SolrDeletionPolicy.updateCommits newest commit = 1
[junit4:junit4]   2> 4993 T195 oasc.SolrCore.initWriters created xml: solr.XMLResponseWriter
[junit4:junit4]   2> 4996 T195 oasup.UpdateRequestProcessorChain.init inserting DistributedUpdateProcessorFactory into updateRequestProcessorChain "dedupe"
[junit4:junit4]   2> 4997 T195 oasup.UpdateRequestProcessorChain.init inserting DistributedUpdateProcessorFactory into updateRequestProcessorChain "dedupe-allfields"
[junit4:junit4]   2> 4998 T195 oasup.UpdateRequestProcessorChain.init inserting DistributedUpdateProcessorFactory into updateRequestProcessorChain "stored_sig"
[junit4:junit4]   2> 4999 T195 oasup.UpdateRequestProcessorChain.init inserting DistributedUpdateProcessorFactory into updateRequestProcessorChain "uniq-fields"
[junit4:junit4]   2> 5000 T195 oasup.UpdateRequestProcessorChain.init inserting DistributedUpdateProcessorFactory into updateRequestProcessorChain "distrib-dup-test-chain-implicit"
[junit4:junit4]   2> 5001 T195 oasc.RequestHandlers.initHandlersFromConfig adding lazy requestHandler: solr.ReplicationHandler
[junit4:junit4]   2> 5002 T195 oasc.RequestHandlers.initHandlersFromConfig created /replication: solr.ReplicationHandler
[junit4:junit4]   2> 5003 T195 oasc.RequestHandlers.initHandlersFromConfig created standard: solr.StandardRequestHandler
[junit4:junit4]   2> 5004 T195 oasc.RequestHandlers.initHandlersFromConfig created /get: solr.RealTimeGetHandler
[junit4:junit4]   2> 5005 T195 oasc.RequestHandlers.initHandlersFromConfig created dismax: solr.SearchHandler
[junit4:junit4]   2> 5006 T195 oasc.RequestHandlers.initHandlersFromConfig created mock: org.apache.solr.core.MockQuerySenderListenerReqHandler
[junit4:junit4]   2> 5007 T195 oasc.RequestHandlers.initHandlersFromConfig created /admin/: org.apache.solr.handler.admin.AdminHandlers
[junit4:junit4]   2> 5008 T195 oasc.RequestHandlers.initHandlersFromConfig created defaults: solr.StandardRequestHandler
[junit4:junit4]   2> 5009 T195 oasc.RequestHandlers.initHandlersFromConfig adding lazy requestHandler: solr.StandardRequestHandler
[junit4:junit4]   2> 5010 T195 oasc.RequestHandlers.initHandlersFromConfig created lazy: solr.StandardRequestHandler
[junit4:junit4]   2> 5011 T195 oasc.RequestHandlers.initHandlersFromConfig created /update: solr.UpdateRequestHandler
[junit4:junit4]   2> 5012 T195 oasc.RequestHandlers.initHandlersFromConfig created /terms: org.apache.solr.handler.component.SearchHandler
[junit4:junit4]   2> 5013 T195 oasc.RequestHandlers.initHandlersFromConfig created spellCheckCompRH: org.apache.solr.handler.component.SearchHandler
[junit4:junit4]   2> 5014 T195 oasc.RequestHandlers.initHandlersFromConfig created spellCheckCompRH_Direct: org.apache.solr.handler.component.SearchHandler
[junit4:junit4]   2> 5015 T195 oasc.RequestHandlers.initHandlersFromConfig created spellCheckWithWordbreak: org.apache.solr.handler.component.SearchHandler
[junit4:junit4]   2> 5016 T195 oasc.RequestHandlers.initHandlersFromConfig created spellCheckWithWordbreak_Direct: org.apache.solr.handler.component.SearchHandler
[junit4:junit4]   2> 5017 T195 oasc.RequestHandlers.initHandlersFromConfig created spellCheckCompRH1: org.apache.solr.handler.component.SearchHandler
[junit4:junit4]   2> 5018 T195 oasc.RequestHandlers.initHandlersFromConfig created tvrh: org.apache.solr.handler.component.SearchHandler
[junit4:junit4]   2> 5019 T195 oasc.RequestHandlers.initHandlersFromConfig created /mlt: solr.MoreLikeThisHandler
[junit4:junit4]   2> 5020 T195 oasc.RequestHandlers.initHandlersFromConfig created /debug/dump: solr.DumpRequestHandler
[junit4:junit4]   2> 5023 T195 oashl.XMLLoader.init xsltCacheLifetimeSeconds=60
[junit4:junit4]   2> 5025 T195 oasc.SolrCore.initDeprecatedSupport WARNING solrconfig.xml uses deprecated <admin/gettableFiles>, Please update your config to use the ShowFileRequestHandler.
[junit4:junit4]   2> 5027 T195 oasc.SolrCore.initDeprecatedSupport WARNING adding ShowFileRequestHandler with hidden files: [OLD_SYNONYMS.TXT, PROTWORDS.TXT, STOPWORDS.TXT, OPEN-EXCHANGE-RATES.JSON, CURRENCY.XML, SCHEMA.XML, SYNONYMS.TXT, MAPPING-ISOLATIN1ACCENT.TXT]
[junit4:junit4]   2> 5031 T195 oass.SolrIndexSearcher.<init> Opening Searcher@33439c4c main
[junit4:junit4]   2> 5032 T195 oasu.CommitTracker.<init> Hard AutoCommit: disabled
[junit4:junit4]   2> 5033 T195 oasu.CommitTracker.<init> Soft AutoCommit: disabled
[junit4:junit4]   2> 5035 T195 oashc.SpellCheckComponent.inform Initializing spell checkers
[junit4:junit4]   2> 5040 T195 oass.DirectSolrSpellChecker.init init: {name=direct,classname=DirectSolrSpellChecker,field=lowerfilt,minQueryLength=3}
[junit4:junit4]   2> 5075 T242 oasc.SolrCore.registerSearcher [collection1] Registered new searcher Searcher@33439c4c main{StandardDirectoryReader(segments_1:1)}
[junit4:junit4]   2> 5081 T195 oasc.ZkController.publish numShards not found on descriptor - reading it from system property
[junit4:junit4]   2> 5422 T216 oascc.ZkStateReader.updateClusterState Updating cloud state from ZooKeeper... 
[junit4:junit4]   2> 5422 T216 oasc.Overseer$ClusterStateUpdater.updateState Update state numShards=2 message={
[junit4:junit4]   2> 	  "base_url":"http://127.0.0.1:49345/solr",
[junit4:junit4]   2> 	  "state":"down",
[junit4:junit4]   2> 	  "operation":"state",
[junit4:junit4]   2> 	  "node_name":"127.0.0.1:49345_solr",
[junit4:junit4]   2> 	  "numShards":"2",
[junit4:junit4]   2> 	  "roles":null,
[junit4:junit4]   2> 	  "collection":"collection1",
[junit4:junit4]   2> 	  "shard":null,
[junit4:junit4]   2> 	  "core":"collection1"}
[junit4:junit4]   2> 5426 T229 oascc.ZkStateReader$2.process A cluster state change has occurred - updating... (3)
[junit4:junit4]   2> 5426 T241 oascc.ZkStateReader$2.process A cluster state change has occurred - updating... (3)
[junit4:junit4]   2> 5426 T215 oascc.ZkStateReader$2.process A cluster state change has occurred - updating... (3)
[junit4:junit4]   2> 5583 T195 oasc.CoreContainer.register registering core: collection1
[junit4:junit4]   2> 5584 T195 oasc.ZkController.register Register shard - core:collection1 address:http://127.0.0.1:49345/solr shardId:shard2
[junit4:junit4]   2> 5586 T195 oascc.SolrZkClient.makePath makePath: /collections/collection1/leader_elect/shard2/election
[junit4:junit4]   2> 5594 T200 oazs.PrepRequestProcessor.pRequest Got user-level KeeperException when processing sessionid:0x13acb747c0d0004 type:delete cxid:0x42 zxid:0xfffffffffffffffe txntype:unknown reqpath:n/a Error Path:/solr/collections/collection1/leaders/shard2 Error:KeeperErrorCode = NoNode for /solr/collections/collection1/leaders/shard2
[junit4:junit4]   2> 5595 T195 oasc.ShardLeaderElectionContext.runLeaderProcess Running the leader process.
[junit4:junit4]   2> 5595 T200 oazs.PrepRequestProcessor.pRequest Got user-level KeeperException when processing sessionid:0x13acb747c0d0004 type:create cxid:0x43 zxid:0xfffffffffffffffe txntype:unknown reqpath:n/a Error Path:/solr/overseer Error:KeeperErrorCode = NodeExists for /solr/overseer
[junit4:junit4]   2> 5597 T195 oasc.ShardLeaderElectionContext.waitForReplicasToComeUp Enough replicas found to continue.
[junit4:junit4]   2> 5598 T195 oasc.ShardLeaderElectionContext.runLeaderProcess I may be the new leader - try and sync
[junit4:junit4]   2> 5599 T195 oasc.SyncStrategy.sync Sync replicas to http://127.0.0.1:49345/solr/collection1/
[junit4:junit4]   2> 5600 T195 oasc.SyncStrategy.syncReplicas Sync Success - now sync replicas to me
[junit4:junit4]   2> 5600 T195 oasc.SyncStrategy.syncToMe http://127.0.0.1:49345/solr/collection1/ has no replicas
[junit4:junit4]   2> 5601 T195 oasc.ShardLeaderElectionContext.runLeaderProcess I am the new leader: http://127.0.0.1:49345/solr/collection1/
[junit4:junit4]   2> 5602 T195 oascc.SolrZkClient.makePath makePath: /collections/collection1/leaders/shard2
[junit4:junit4]   2> 5606 T200 oazs.PrepRequestProcessor.pRequest Got user-level KeeperException when processing sessionid:0x13acb747c0d0004 type:create cxid:0x4c zxid:0xfffffffffffffffe txntype:unknown reqpath:n/a Error Path:/solr/overseer Error:KeeperErrorCode = NodeExists for /solr/overseer
[junit4:junit4]   2> 5929 T216 oascc.ZkStateReader.updateClusterState Updating cloud state from ZooKeeper... 
[junit4:junit4]   2> 5940 T229 oascc.ZkStateReader$2.process A cluster state change has occurred - updating... (3)
[junit4:junit4]   2> 5940 T215 oascc.ZkStateReader$2.process A cluster state change has occurred - updating... (3)
[junit4:junit4]   2> 5940 T241 oascc.ZkStateReader$2.process A cluster state change has occurred - updating... (3)
[junit4:junit4]   2> 5958 T195 oasc.ZkController.register We are http://127.0.0.1:49345/solr/collection1/ and leader is http://127.0.0.1:49345/solr/collection1/
[junit4:junit4]   2> 5959 T195 oasc.ZkController.register No LogReplay needed for core=collection1 baseURL=http://127.0.0.1:49345/solr
[junit4:junit4]   2> 5960 T195 oasc.ZkController.checkRecovery I am the leader, no recovery necessary
[junit4:junit4]   2> 5960 T195 oasc.ZkController.publish numShards not found on descriptor - reading it from system property
[junit4:junit4]   2> 5962 T195 oascc.ZkStateReader.updateClusterState Updating cloud state from ZooKeeper... 
[junit4:junit4]   2> 5964 T195 oass.SolrDispatchFilter.init user.dir=/mnt/ssd/jenkins/workspace/Lucene-Solr-4.x-Linux/solr/build/solr-core/test/J0
[junit4:junit4]   2> 5964 T195 oass.SolrDispatchFilter.init SolrDispatchFilter.init() done
[junit4:junit4]   2> 5965 T195 oascsi.HttpClientUtil.createClient Creating new http client, config:maxConnections=128&maxConnectionsPerHost=32&followRedirects=false
[junit4:junit4]   2> 6070 T195 oejs.Server.doStart jetty-8.1.2.v20120308
[junit4:junit4]   2> 6072 T195 oejs.AbstractConnector.doStart Started SelectChannelConnector@0.0.0.0:53513
[junit4:junit4]   2> 6073 T195 oasc.SolrResourceLoader.locateSolrHome JNDI not configured for solr (NoInitialContextEx)
[junit4:junit4]   2> 6074 T195 oasc.SolrResourceLoader.locateSolrHome using system property solr.solr.home: /mnt/ssd/jenkins/workspace/Lucene-Solr-4.x-Linux/solr/build/solr-core/test/J0/./solrtest-jetty3-1352033145692
[junit4:junit4]   2> 6075 T195 oasc.SolrResourceLoader.<init> new SolrResourceLoader for deduced Solr Home: '/mnt/ssd/jenkins/workspace/Lucene-Solr-4.x-Linux/solr/build/solr-core/test/J0/./solrtest-jetty3-1352033145692/'
[junit4:junit4]   2> 6090 T195 oass.SolrDispatchFilter.init SolrDispatchFilter.init()
[junit4:junit4]   2> 6090 T195 oasc.SolrResourceLoader.locateSolrHome JNDI not configured for solr (NoInitialContextEx)
[junit4:junit4]   2> 6091 T195 oasc.SolrResourceLoader.locateSolrHome using system property solr.solr.home: /mnt/ssd/jenkins/workspace/Lucene-Solr-4.x-Linux/solr/build/solr-core/test/J0/./solrtest-jetty3-1352033145692
[junit4:junit4]   2> 6092 T195 oasc.CoreContainer$Initializer.initialize looking for solr.xml: /mnt/ssd/jenkins/workspace/Lucene-Solr-4.x-Linux/solr/build/solr-core/test/J0/./solrtest-jetty3-1352033145692/solr.xml
[junit4:junit4]   2> 6093 T195 oasc.CoreContainer.<init> New CoreContainer 2012673253
[junit4:junit4]   2> 6093 T195 oasc.CoreContainer.load Loading CoreContainer using Solr Home: '/mnt/ssd/jenkins/workspace/Lucene-Solr-4.x-Linux/solr/build/solr-core/test/J0/./solrtest-jetty3-1352033145692/'
[junit4:junit4]   2> 6094 T195 oasc.SolrResourceLoader.<init> new SolrResourceLoader for directory: '/mnt/ssd/jenkins/workspace/Lucene-Solr-4.x-Linux/solr/build/solr-core/test/J0/./solrtest-jetty3-1352033145692/'
[junit4:junit4]   2> 6112 T195 oasc.CoreContainer.load Registering Log Listener
[junit4:junit4]   2> 6127 T195 oasc.CoreContainer.initZooKeeper Zookeeper client=127.0.0.1:54660/solr
[junit4:junit4]   2> 6129 T195 oaz.ZooKeeper.<init> Initiating client connection, connectString=127.0.0.1:54660/solr sessionTimeout=5000 watcher=org.apache.solr.common.cloud.ConnectionManager@6b0c9a81
[junit4:junit4]   2> 6130 T252 oaz.ClientCnxn$SendThread.startConnect Opening socket connection to server /127.0.0.1:54660
[junit4:junit4]   2> 6130 T195 oascc.ConnectionManager.waitForConnected Waiting for client to connect to ZooKeeper
[junit4:junit4]   2> 6131 T252 oaz.ClientCnxn$SendThread.primeConnection Socket connection established to localhost.localdomain/127.0.0.1:54660, initiating session
[junit4:junit4]   2> 6131 T197 oazs.NIOServerCnxn$Factory.run Accepted socket connection from /127.0.0.1:33967
[junit4:junit4]   2> 6132 T197 oazs.NIOServerCnxn.readConnectRequest Client attempting to establish new session at /127.0.0.1:33967
[junit4:junit4]   2> 6133 T199 oazs.NIOServerCnxn.finishSessionInit Established session 0x13acb747c0d0005 with negotiated timeout 5000 for client /127.0.0.1:33967
[junit4:junit4]   2> 6133 T252 oaz.ClientCnxn$SendThread.readConnectResult Session establishment complete on server localhost.localdomain/127.0.0.1:54660, sessionid = 0x13acb747c0d0005, negotiated timeout = 5000
[junit4:junit4]   2> 6133 T253 oascc.ConnectionManager.process Watcher org.apache.solr.common.cloud.ConnectionManager@6b0c9a81 name:ZooKeeperConnection Watcher:127.0.0.1:54660/solr got event WatchedEvent state:SyncConnected type:None path:null path:null type:None
[junit4:junit4]   2> 6133 T195 oascc.ConnectionManager.waitForConnected Client is connected to ZooKeeper
[junit4:junit4]   2> 6134 T200 oazs.PrepRequestProcessor.pRequest Got user-level KeeperException when processing sessionid:0x13acb747c0d0005 type:create cxid:0x1 zxid:0xfffffffffffffffe txntype:unknown reqpath:n/a Error Path:/solr/overseer Error:KeeperErrorCode = NodeExists for /solr/overseer
[junit4:junit4]   2> 6135 T200 oazs.PrepRequestProcessor.pRequest Got user-level KeeperException when processing sessionid:0x13acb747c0d0005 type:create cxid:0x2 zxid:0xfffffffffffffffe txntype:unknown reqpath:n/a Error Path:/solr/overseer Error:KeeperErrorCode = NodeExists for /solr/overseer
[junit4:junit4]   2> 6136 T195 oasc.ZkController.createEphemeralLiveNode Register node as live in ZooKeeper:/live_nodes/127.0.0.1:53513_solr
[junit4:junit4]   2> 6137 T200 oazs.PrepRequestProcessor.pRequest Got user-level KeeperException when processing sessionid:0x13acb747c0d0005 type:delete cxid:0x4 zxid:0xfffffffffffffffe txntype:unknown reqpath:n/a Error Path:/solr/live_nodes/127.0.0.1:53513_solr Error:KeeperErrorCode = NoNode for /solr/live_nodes/127.0.0.1:53513_solr
[junit4:junit4]   2> 6138 T195 oascc.SolrZkClient.makePath makePath: /live_nodes/127.0.0.1:53513_solr
[junit4:junit4]   2> 6140 T229 oascc.ZkStateReader$3.process Updating live nodes... (4)
[junit4:junit4]   2> 6140 T241 oascc.ZkStateReader$3.process Updating live nodes... (4)
[junit4:junit4]   2> 6140 T215 oascc.ZkStateReader$3.process Updating live nodes... (4)
[junit4:junit4]   2> 6141 T195 oashc.HttpShardHandlerFactory.getParameter Setting socketTimeout to: 0
[junit4:junit4]   2> 6141 T195 oashc.HttpShardHandlerFactory.getParameter Setting urlScheme to: http://
[junit4:junit4]   2> 6142 T195 oashc.HttpShardHandlerFactory.getParameter Setting connTimeout to: 0
[junit4:junit4]   2> 6143 T195 oashc.HttpShardHandlerFactory.getParameter Setting maxConnectionsPerHost to: 20
[junit4:junit4]   2> 6144 T195 oashc.HttpShardHandlerFactory.getParameter Setting corePoolSize to: 0
[junit4:junit4]   2> 6144 T195 oashc.HttpShardHandlerFactory.getParameter Setting maximumPoolSize to: 2147483647
[junit4:junit4]   2> 6145 T195 oashc.HttpShardHandlerFactory.getParameter Setting maxThreadIdleTime to: 5
[junit4:junit4]   2> 6146 T195 oashc.HttpShardHandlerFactory.getParameter Setting sizeOfQueue to: -1
[junit4:junit4]   2> 6146 T195 oashc.HttpShardHandlerFactory.getParameter Setting fairnessPolicy to: false
[junit4:junit4]   2> 6147 T195 oascsi.HttpClientUtil.createClient Creating new http client, config:maxConnectionsPerHost=20&maxConnections=10000&socketTimeout=0&connTimeout=0&retry=false
[junit4:junit4]   2> 6156 T195 oascc.ZkStateReader.createClusterStateWatchersAndUpdate Updating cluster state from ZooKeeper... 
[junit4:junit4]   2> 6162 T195 oasc.CoreContainer.create Creating SolrCore 'collection1' using instanceDir: /mnt/ssd/jenkins/workspace/Lucene-Solr-4.x-Linux/solr/build/solr-core/test/J0/./solrtest-jetty3-1352033145692/collection1
[junit4:junit4]   2> 6163 T195 oasc.ZkController.createCollectionZkNode Check for collection zkNode:collection1
[junit4:junit4]   2> 6164 T195 oasc.ZkController.createCollectionZkNode Collection zkNode exists
[junit4:junit4]   2> 6165 T195 oasc.ZkController.readConfigName Load collection config from:/collections/collection1
[junit4:junit4]   2> 6166 T195 oasc.SolrResourceLoader.<init> new SolrResourceLoader for directory: '/mnt/ssd/jenkins/workspace/Lucene-Solr-4.x-Linux/solr/build/solr-core/test/J0/./solrtest-jetty3-1352033145692/collection1/'
[junit4:junit4]   2> 6167 T195 oasc.SolrResourceLoader.replaceClassLoader Adding 'file:/mnt/ssd/jenkins/workspace/Lucene-Solr-4.x-Linux/solr/build/solr-core/test/J0/solrtest-jetty3-1352033145692/collection1/lib/README' to classloader
[junit4:junit4]   2> 6168 T195 oasc.SolrResourceLoader.replaceClassLoader Adding 'file:/mnt/ssd/jenkins/workspace/Lucene-Solr-4.x-Linux/solr/build/solr-core/test/J0/solrtest-jetty3-1352033145692/collection1/lib/classes/' to classloader
[junit4:junit4]   2> 6209 T195 oasc.SolrConfig.<init> Using Lucene MatchVersion: LUCENE_41
[junit4:junit4]   2> 6269 T195 oasc.SolrConfig.<init> Loaded SolrConfig: solrconfig.xml
[junit4:junit4]   2> 6270 T195 oass.IndexSchema.readSchema Reading Solr Schema
[junit4:junit4]   2> 6278 T195 oass.IndexSchema.readSchema Schema name=test
[junit4:junit4]   2> 6444 T216 oascc.ZkStateReader.updateClusterState Updating cloud state from ZooKeeper... 
[junit4:junit4]   2> 6445 T216 oasc.Overseer$ClusterStateUpdater.updateState Update state numShards=2 message={
[junit4:junit4]   2> 	  "base_url":"http://127.0.0.1:49345/solr",
[junit4:junit4]   2> 	  "state":"active",
[junit4:junit4]   2> 	  "operation":"state",
[junit4:junit4]   2> 	  "node_name":"127.0.0.1:49345_solr",
[junit4:junit4]   2> 	  "numShards":"2",
[junit4:junit4]   2> 	  "roles":null,
[junit4:junit4]   2> 	  "collection":"collection1",
[junit4:junit4]   2> 	  "shard":"shard2",
[junit4:junit4]   2> 	  "core":"collection1"}
[junit4:junit4]   2> 6452 T215 oascc.ZkStateReader$2.process A cluster state change has occurred - updating... (4)
[junit4:junit4]   2> 6452 T253 oascc.ZkStateReader$2.process A cluster state change has occurred - updating... (4)
[junit4:junit4]   2> 6452 T229 oascc.ZkStateReader$2.process A cluster state change has occurred - updating... (4)
[junit4:junit4]   2> 6452 T241 oascc.ZkStateReader$2.process A cluster state change has occurred - updating... (4)
[junit4:junit4]   2> 6785 T195 oass.OpenExchangeRatesOrgProvider.init Initialized with rates=open-exchange-rates.json, refreshInterval=1440.
[junit4:junit4]   2> 6791 T195 oass.IndexSchema.readSchema default search field in schema is text
[junit4:junit4]   2> 6795 T195 oass.IndexSchema.readSchema unique key field: id
[junit4:junit4]   2> 6806 T195 oass.FileExchangeRateProvider.reload Reloading exchange rates from file currency.xml
[junit4:junit4]   2> 6810 T195 oass.FileExchangeRateProvider.reload Reloading exchange rates from file currency.xml
[junit4:junit4]   2> 6815 T195 oass.OpenExchangeRatesOrgProvider.reload Reloading exchange rates from open-exchange-rates.json
[junit4:junit4]   2> 6816 T195 oass.OpenExchangeRatesOrgProvider.reload Reloading exchange rates from open-exchange-rates.json
[junit4:junit4]   2> 6817 T195 oasc.SolrCore.<init> [collection1] Opening new SolrCore at /mnt/ssd/jenkins/workspace/Lucene-Solr-4.x-Linux/solr/build/solr-core/test/J0/./solrtest-jetty3-1352033145692/collection1/, dataDir=./org.apache.solr.cloud.BasicDistributedZkTest-1352033139721/jetty3/
[junit4:junit4]   2> 6818 T195 oasc.JmxMonitoredMap.<init> JMX monitoring is enabled. Adding Solr mbeans to JMX Server: com.sun.jmx.mbeanserver.JmxMBeanServer@c5599598
[junit4:junit4]   2> 6819 T195 oasc.SolrCore.getNewIndexDir New index directory detected: old=null new=./org.apache.solr.cloud.BasicDistributedZkTest-1352033139721/jetty3/index/
[junit4:junit4]   2> 6819 T195 oasc.SolrCore.initIndex WARNING [collection1] Solr index directory './org.apache.solr.cloud.BasicDistributedZkTest-1352033139721/jetty3/index' doesn't exist. Creating new index...
[junit4:junit4]   2> 6820 T195 oasc.CachingDirectoryFactory.get return new directory for /mnt/ssd/jenkins/workspace/Lucene-Solr-4.x-Linux/solr/build/solr-core/test/J0/./org.apache.solr.cloud.BasicDistributedZkTest-1352033139721/jetty3/index forceNew:false
[junit4:junit4]   2> 6824 T195 oasc.SolrDeletionPolicy.onCommit SolrDeletionPolicy.onCommit: commits:num=1
[junit4:junit4]   2> 		commit{dir=NRTCachingDirectory(org.apache.lucene.store.MMapDirectory@/mnt/ssd/jenkins/workspace/Lucene-Solr-4.x-Linux/solr/build/solr-core/test/J0/org.apache.solr.cloud.BasicDistributedZkTest-1352033139721/jetty3/index lockFactory=org.apache.lucene.store.NativeFSLockFactory@80c4f188; maxCacheMB=48.0 maxMergeSizeMB=4.0),segFN=segments_1,generation=1,filenames=[segments_1]
[junit4:junit4]   2> 6824 T195 oasc.SolrDeletionPolicy.updateCommits newest commit = 1
[junit4:junit4]   2> 6825 T195 oasc.SolrCore.initWriters created xml: solr.XMLResponseWriter
[junit4:junit4]   2> 6827 T195 oasup.UpdateRequestProcessorChain.init inserting DistributedUpdateProcessorFactory into updateRequestProcessorChain "dedupe"
[junit4:junit4]   2> 6827 T195 oasup.UpdateRequestProcessorChain.init inserting DistributedUpdateProcessorFactory into updateRequestProcessorChain "dedupe-allfields"
[junit4:junit4]   2> 6828 T195 oasup.UpdateRequestProcessorChain.init inserting DistributedUpdateProcessorFactory into updateRequestProcessorChain "stored_sig"
[junit4:junit4]   2> 6828 T195 oasup.UpdateRequestProcessorChain.init inserting DistributedUpdateProcessorFactory into updateRequestProcessorChain "uniq-fields"
[junit4:junit4]   2> 6829 T195 oasup.UpdateRequestProcessorChain.init inserting DistributedUpdateProcessorFactory into updateRequestProcessorChain "distrib-dup-test-chain-implicit"
[junit4:junit4]   2> 6829 T195 oasc.RequestHandlers.initHandlersFromConfig adding lazy requestHandler: solr.ReplicationHandler
[junit4:junit4]   2> 6830 T195 oasc.RequestHandlers.initHandlersFromConfig created /replication: solr.ReplicationHandler
[junit4:junit4]   2> 6831 T195 oasc.RequestHandlers.initHandlersFromConfig created standard: solr.StandardRequestHandler
[junit4:junit4]   2> 6831 T195 oasc.RequestHandlers.initHandlersFromConfig created /get: solr.RealTimeGetHandler
[junit4:junit4]   2> 6832 T195 oasc.RequestHandlers.initHandlersFromConfig created dismax: solr.SearchHandler
[junit4:junit4]   2> 6833 T195 oasc.RequestHandlers.initHandlersFromConfig created mock: org.apache.solr.core.MockQuerySenderListenerReqHandler
[junit4:junit4]   2> 6833 T195 oasc.RequestHandlers.initHandlersFromConfig created /admin/: org.apache.solr.handler.admin.AdminHandlers
[junit4:junit4]   2> 6834 T195 oasc.RequestHandlers.initHandlersFromConfig created defaults: solr.StandardRequestHandler
[junit4:junit4]   2> 6834 T195 oasc.RequestHandlers.initHandlersFromConfig adding lazy requestHandler: solr.StandardRequestHandler
[junit4:junit4]   2> 6835 T195 oasc.RequestHandlers.initHandlersFromConfig created lazy: solr.StandardRequestHandler
[junit4:junit4]   2> 6836 T195 oasc.RequestHandlers.initHandlersFromConfig created /update: solr.UpdateRequestHandler
[junit4:junit4]   2> 6836 T195 oasc.RequestHandlers.initHandlersFromConfig created /terms: org.apache.solr.handler.component.SearchHandler
[junit4:junit4]   2> 6837 T195 oasc.RequestHandlers.initHandlersFromConfig created spellCheckCompRH: org.apache.solr.handler.component.SearchHandler
[junit4:junit4]   2> 6837 T195 oasc.RequestHandlers.initHandlersFromConfig created spellCheckCompRH_Direct: org.apache.solr.handler.component.SearchHandler
[junit4:junit4]   2> 6838 T195 oasc.RequestHandlers.initHandlersFromConfig created spellCheckWithWordbreak: org.apache.solr.handler.component.SearchHandler
[junit4:junit4]   2> 6839 T195 oasc.RequestHandlers.initHandlersFromConfig created spellCheckWithWordbreak_Direct: org.apache.solr.handler.component.SearchHandler
[junit4:junit4]   2> 6839 T195 oasc.RequestHandlers.initHandlersFromConfig created spellCheckCompRH1: org.apache.solr.handler.component.SearchHandler
[junit4:junit4]   2> 6840 T195 oasc.RequestHandlers.initHandlersFromConfig created tvrh: org.apache.solr.handler.component.SearchHandler
[junit4:junit4]   2> 6841 T195 oasc.RequestHandlers.initHandlersFromConfig created /mlt: solr.MoreLikeThisHandler
[junit4:junit4]   2> 6841 T195 oasc.RequestHandlers.initHandlersFromConfig created /debug/dump: solr.DumpRequestHandler
[junit4:junit4]   2> 6843 T195 oashl.XMLLoader.init xsltCacheLifetimeSeconds=60
[junit4:junit4]   2> 6845 T195 oasc.SolrCore.initDeprecatedSupport WARNING solrconfig.xml uses deprecated <admin/gettableFiles>, Please update your config to use the ShowFileRequestHandler.
[junit4:junit4]   2> 6846 T195 oasc.SolrCore.initDeprecatedSupport WARNING adding ShowFileRequestHandler with hidden files: [OLD_SYNONYMS.TXT, PROTWORDS.TXT, STOPWORDS.TXT, OPEN-EXCHANGE-RATES.JSON, CURRENCY.XML, SCHEMA.XML, SYNONYMS.TXT, MAPPING-ISOLATIN1ACCENT.TXT]
[junit4:junit4]   2> 6848 T195 oass.SolrIndexSearcher.<init> Opening Searcher@5d104163 main
[junit4:junit4]   2> 6849 T195 oasu.CommitTracker.<init> Hard AutoCommit: disabled
[junit4:junit4]   2> 6850 T195 oasu.CommitTracker.<init> Soft AutoCommit: disabled
[junit4:junit4]   2> 6850 T195 oashc.SpellCheckComponent.inform Initializing spell checkers
[junit4:junit4]   2> 6854 T195 oass.DirectSolrSpellChecker.init init: {name=direct,classname=DirectSolrSpellChecker,field=lowerfilt,minQueryLength=3}
[junit4:junit4]   2> 6879 T254 oasc.SolrCore.registerSearcher [collection1] Registered new searcher Searcher@5d104163 main{StandardDirectoryReader(segments_1:1)}
[junit4:junit4]   2> 6889 T195 oasc.ZkController.publish numShards not found on descriptor - reading it from system property
[junit4:junit4]   2> 6954 T216 oascc.ZkStateReader.updateClusterState Updating cloud state from ZooKeeper... 
[junit4:junit4]   2> 6955 T216 oasc.Overseer$ClusterStateUpdater.updateState Update state numShards=2 message={
[junit4:junit4]   2> 	  "base_url":"http://127.0.0.1:53513/solr",
[junit4:junit4]   2> 	  "state":"down",
[junit4:junit4]   2> 	  "operation":"state",
[junit4:junit4]   2> 	  "node_name":"127.0.0.1:53513_solr",
[junit4:junit4]   2> 	  "numShards":"2",
[junit4:junit4]   2> 	  "roles":null,
[junit4:junit4]   2> 	  "collection":"collection1",
[junit4:junit4]   2> 	  "shard":null,
[junit4:junit4]   2> 	  "core":"collection1"}
[junit4:junit4]   2> 6958 T241 oascc.ZkStateReader$2.process A cluster state change has occurred - updating... (4)
[junit4:junit4]   2> 6958 T215 oascc.ZkStateReader$2.process A cluster state change has occurred - updating... (4)
[junit4:junit4]   2> 6958 T229 oascc.ZkStateReader$2.process A cluster state change has occurred - updating... (4)
[junit4:junit4]   2> 6959 T253 oascc.ZkStateReader$2.process A cluster state change has occurred - updating... (4)
[junit4:junit4]   2> 7392 T195 oasc.CoreContainer.register registering core: collection1
[junit4:junit4]   2> 7392 T195 oasc.ZkController.register Register shard - core:collection1 address:http://127.0.0.1:53513/solr shardId:shard1
[junit4:junit4]   2> 7410 T195 oasc.ZkController.register We are http://127.0.0.1:53513/solr/collection1/ and leader is http://127.0.0.1:36297/solr/collection1/
[junit4:junit4]   2> 7411 T195 oasc.ZkController.register No LogReplay needed for core=collection1 baseURL=http://127.0.0.1:53513/solr
[junit4:junit4]   2> 7412 T195 oasc.ZkController.checkRecovery Core needs to recover:collection1
[junit4:junit4]   2> 7413 T195 oasu.DefaultSolrCoreState.doRecovery Running recovery - first canceling any ongoing recovery
[junit4:junit4]   2> ASYNC  NEW_CORE C13 name=collection1 org.apache.solr.core.SolrCore@495eb905 url=http://127.0.0.1:53513/solr/collection1 node=127.0.0.1:53513_solr
[junit4:junit4]   2> 7415 T255 C13 P53513 oasc.RecoveryStrategy.run Starting recovery process.  core=collection1 recoveringAfterStartup=true
[junit4:junit4]   2> 7416 T255 C13 P53513 oasc.RecoveryStrategy.doRecovery ###### startupVersions=[]
[junit4:junit4]   2> 7416 T195 oascc.ZkStateReader.updateClusterState Updating cloud state from ZooKeeper... 
[junit4:junit4]   2> 7416 T255 C13 P53513 oasc.ZkController.publish numShards not found on descriptor - reading it from system property
[junit4:junit4]   2> 7418 T195 oass.SolrDispatchFilter.init user.dir=/mnt/ssd/jenkins/workspace/Lucene-Solr-4.x-Linux/solr/build/solr-core/test/J0
[junit4:junit4]   2> 7419 T255 C13 P53513 oasc.RecoveryStrategy.doRecovery Attempting to PeerSync from http://127.0.0.1:36297/solr/collection1/ core=collection1 - recoveringAfterStartup=true
[junit4:junit4]   2> 7419 T195 oass.SolrDispatchFilter.init SolrDispatchFilter.init() done
[junit4:junit4]   2> 7420 T195 oascsi.HttpClientUtil.createClient Creating new http client, config:maxConnections=128&maxConnectionsPerHost=32&followRedirects=false
[junit4:junit4]   2> 7421 T255 C13 P53513 oascsi.HttpClientUtil.createClient Creating new http client, config:maxConnectionsPerHost=20&maxConnections=10000&connTimeout=30000&socketTimeout=30000&retry=false
[junit4:junit4]   2> 7426 T255 C13 P53513 oasu.PeerSync.sync PeerSync: core=collection1 url=http://127.0.0.1:53513/solr START replicas=[http://127.0.0.1:36297/solr/collection1/] nUpdates=100
[junit4:junit4]   2> 7427 T255 C13 P53513 oasu.PeerSync.sync WARNING no frame of reference to tell of we've missed updates
[junit4:junit4]   2> 7427 T255 C13 P53513 oasc.RecoveryStrategy.doRecovery PeerSync Recovery was not successful - trying replication. core=collection1
[junit4:junit4]   2> 7427 T255 C13 P53513 oasc.RecoveryStrategy.doRecovery Starting Replication Recovery. core=collection1
[junit4:junit4]   2> 7428 T255 C13 P53513 oascsi.HttpClientUtil.createClient Creating new http client, config:maxConnections=128&maxConnectionsPerHost=32&followRedirects=false
[junit4:junit4]   2> ASYNC  NEW_CORE C14 name=collection1 org.apache.solr.core.SolrCore@d13eeb92 url=http://127.0.0.1:36297/solr/collection1 node=127.0.0.1:36297_solr
[junit4:junit4]   2> 7435 T226 C14 P36297 REQ /get {version=2&getVersions=100&qt=/get&wt=javabin&distrib=false} status=0 QTime=0 
[junit4:junit4]   2> 7466 T216 oascc.ZkStateReader.updateClusterState Updating cloud state from ZooKeeper... 
[junit4:junit4]   2> 7468 T216 oasc.Overseer$ClusterStateUpdater.updateState Update state numShards=2 message={
[junit4:junit4]   2> 	  "base_url":"http://127.0.0.1:53513/solr",
[junit4:junit4]   2> 	  "state":"recovering",
[junit4:junit4]   2> 	  "operation":"state",
[junit4:junit4]   2> 	  "node_name":"127.0.0.1:53513_solr",
[junit4:junit4]   2> 	  "numShards":"2",
[junit4:junit4]   2> 	  "roles":null,
[junit4:junit4]   2> 	  "collection":"collection1",
[junit4:junit4]   2> 	  "shard":"shard1",
[junit4:junit4]   2> 	  "core":"collection1"}
[junit4:junit4]   2> 7472 T229 oascc.ZkStateReader$2.process A cluster state change has occurred - updating... (4)
[junit4:junit4]   2> 7473 T253 oascc.ZkStateReader$2.process A cluster state change has occurred - updating... (4)
[junit4:junit4]   2> 7473 T241 oascc.ZkStateReader$2.process A cluster state change has occurred - updating... (4)
[junit4:junit4]   2> 7473 T215 oascc.ZkStateReader$2.process A cluster state change has occurred - updating... (4)
[junit4:junit4]   2> 7533 T195 oejs.Server.doStart jetty-8.1.2.v20120308
[junit4:junit4]   2> 7536 T195 oejs.AbstractConnector.doStart Started SelectChannelConnector@0.0.0.0:33446
[junit4:junit4]   2> 7537 T195 oasc.SolrResourceLoader.locateSolrHome JNDI not configured for solr (NoInitialContextEx)
[junit4:junit4]   2> 7538 T195 oasc.SolrResourceLoader.locateSolrHome using system property solr.solr.home: /mnt/ssd/jenkins/workspace/Lucene-Solr-4.x-Linux/solr/build/solr-core/test/J0/./solrtest-jetty4-1352033147139
[junit4:junit4]   2> 7538 T195 oasc.SolrResourceLoader.<init> new SolrResourceLoader for deduced Solr Home: '/mnt/ssd/jenkins/workspace/Lucene-Solr-4.x-Linux/solr/build/solr-core/test/J0/./solrtest-jetty4-1352033147139/'
[junit4:junit4]   2> 7554 T195 oass.SolrDispatchFilter.init SolrDispatchFilter.init()
[junit4:junit4]   2> 7555 T195 oasc.SolrResourceLoader.locateSolrHome JNDI not configured for solr (NoInitialContextEx)
[junit4:junit4]   2> 7556 T195 oasc.SolrResourceLoader.locateSolrHome using system property solr.solr.home: /mnt/ssd/jenkins/workspace/Lucene-Solr-4.x-Linux/solr/build/solr-core/test/J0/./solrtest-jetty4-1352033147139
[junit4:junit4]   2> 7557 T195 oasc.CoreContainer$Initializer.initialize looking for solr.xml: /mnt/ssd/jenkins/workspace/Lucene-Solr-4.x-Linux/solr/build/solr-core/test/J0/./solrtest-jetty4-1352033147139/solr.xml
[junit4:junit4]   2> 7557 T195 oasc.CoreContainer.<init> New CoreContainer 1849305740
[junit4:junit4]   2> 7558 T195 oasc.CoreContainer.load Loading CoreContainer using Solr Home: '/mnt/ssd/jenkins/workspace/Lucene-Solr-4.x-Linux/solr/build/solr-core/test/J0/./solrtest-jetty4-1352033147139/'
[junit4:junit4]   2> 7559 T195 oasc.SolrResourceLoader.<init> new SolrResourceLoader for directory: '/mnt/ssd/jenkins/workspace/Lucene-Solr-4.x-Linux/solr/build/solr-core/test/J0/./solrtest-jetty4-1352033147139/'
[junit4:junit4]   2> 7578 T195 oasc.CoreContainer.load Registering Log Listener
[junit4:junit4]   2> 7595 T195 oasc.CoreContainer.initZooKeeper Zookeeper client=127.0.0.1:54660/solr
[junit4:junit4]   2> 7596 T195 oaz.ZooKeeper.<init> Initiating client connection, connectString=127.0.0.1:54660/solr sessionTimeout=5000 watcher=org.apache.solr.common.cloud.ConnectionManager@84f34bae
[junit4:junit4]   2> 7597 T266 oaz.ClientCnxn$SendThread.startConnect Opening socket connection to server /127.0.0.1:54660
[junit4:junit4]   2> 7597 T195 oascc.ConnectionManager.waitForConnected Waiting for client to connect to ZooKeeper
[junit4:junit4]   2> 7599 T266 oaz.ClientCnxn$SendThread.primeConnection Socket connection established to localhost.localdomain/127.0.0.1:54660, initiating session
[junit4:junit4]   2> 7599 T197 oazs.NIOServerCnxn$Factory.run Accepted socket connection from /127.0.0.1:33979
[junit4:junit4]   2> 7599 T197 oazs.NIOServerCnxn.readConnectRequest Client attempting to establish new session at /127.0.0.1:33979
[junit4:junit4]   2> 7601 T199 oazs.NIOServerCnxn.finishSessionInit Established session 0x13acb747c0d0006 with negotiated timeout 5000 for client /127.0.0.1:33979
[junit4:junit4]   2> 7601 T266 oaz.ClientCnxn$SendThread.readConnectResult Session establishment complete on server localhost.localdomain/127.0.0.1:54660, sessionid = 0x13acb747c0d0006, negotiated timeout = 5000
[junit4:junit4]   2> 7601 T267 oascc.ConnectionManager.process Watcher org.apache.solr.common.cloud.ConnectionManager@84f34bae name:ZooKeeperConnection Watcher:127.0.0.1:54660/solr got event WatchedEvent state:SyncConnected type:None path:null path:null type:None
[junit4:junit4]   2> 7602 T195 oascc.ConnectionManager.waitForConnected Client is connected to ZooKeeper
[junit4:junit4]   2> 7604 T200 oazs.PrepRequestProcessor.pRequest Got user-level KeeperException when processing sessionid:0x13acb747c0d0006 type:create cxid:0x1 zxid:0xfffffffffffffffe txntype:unknown reqpath:n/a Error Path:/solr/overseer Error:KeeperErrorCode = NodeExists for /solr/overseer
[junit4:junit4]   2> 7605 T200 oazs.PrepRequestProcessor.pRequest Got user-level KeeperException when processing sessionid:0x13acb747c0d0006 type:create cxid:0x2 zxid:0xfffffffffffffffe txntype:unknown reqpath:n/a Error Path:/solr/overseer Error:KeeperErrorCode = NodeExists for /solr/overseer
[junit4:junit4]   2> 7607 T195 oasc.ZkController.createEphemeralLiveNode Register node as live in ZooKeeper:/live_nodes/127.0.0.1:33446_solr
[junit4:junit4]   2> 7608 T200 oazs.PrepRequestProcessor.pRequest Got user-level KeeperException when processing sessionid:0x13acb747c0d0006 type:delete cxid:0x4 zxid:0xfffffffffffffffe txntype:unknown reqpath:n/a Error Path:/solr/live_nodes/127.0.0.1:33446_solr Error:KeeperErrorCode = NoNode for /solr/live_nodes/127.0.0.1:33446_solr
[junit4:junit4]   2> 7609 T195 oascc.SolrZkClient.makePath makePath: /live_nodes/127.0.0.1:33446_solr
[junit4:junit4]   2> 7614 T241 oascc.ZkStateReader$3.process Updating live nodes... (5)
[junit4:junit4]   2> 7614 T229 oascc.ZkStateReader$3.process Updating live nodes... (5)
[junit4:junit4]   2> 7614 T253 oascc.ZkStateReader$3.process Updating live nodes... (5)
[junit4:junit4]   2> 7614 T215 oascc.ZkStateReader$3.process Updating live nodes... (5)
[junit4:junit4]   2> 7616 T195 oashc.HttpShardHandlerFactory.getParameter Setting socketTimeout to: 0
[junit4:junit4]   2> 7617 T195 oashc.HttpShardHandlerFactory.getParameter Setting urlScheme to: http://
[junit4:junit4]   2> 7618 T195 oashc.HttpShardHandlerFactory.getParameter Setting connTimeout to: 0
[junit4:junit4]   2> 7619 T195 oashc.HttpShardHandlerFactory.getParameter Setting maxConnectionsPerHost to: 20
[junit4:junit4]   2> 7620 T195 oashc.HttpShardHandlerFactory.getParameter Setting corePoolSize to: 0
[junit4:junit4]   2> 7621 T195 oashc.HttpShardHandlerFactory.getParameter Setting maximumPoolSize to: 2147483647
[junit4:junit4]   2> 7622 T195 oashc.HttpShardHandlerFactory.getParameter Setting maxThreadIdleTime to: 5
[junit4:junit4]   2> 7623 T195 oashc.HttpShardHandlerFactory.getParameter Setting sizeOfQueue to: -1
[junit4:junit4]   2> 7624 T195 oashc.HttpShardHandlerFactory.getParameter Setting fairnessPolicy to: false
[junit4:junit4]   2> 7626 T195 oascsi.HttpClientUtil.createClient Creating new http client, config:maxConnectionsPerHost=20&maxConnections=10000&socketTimeout=0&connTimeout=0&retry=false
[junit4:junit4]   2> 7640 T195 oascc.ZkStateReader.createClusterStateWatchersAndUpdate Updating cluster state from ZooKeeper... 
[junit4:junit4]   2> 7649 T195 oasc.CoreContainer.create Creating SolrCore 'collection1' using instanceDir: /mnt/ssd/jenkins/workspace/Lucene-Solr-4.x-Linux/solr/build/solr-core/test/J0/./solrtest-jetty4-1352033147139/collection1
[junit4:junit4]   2> 7651 T195 oasc.ZkController.createCollectionZkNode Check for collection zkNode:collection1
[junit4:junit4]   2> 7652 T195 oasc.ZkController.createCollectionZkNode Collection zkNode exists
[junit4:junit4]   2> 7653 T195 oasc.ZkController.readConfigName Load collection config from:/collections/collection1
[junit4:junit4]   2> 7654 T195 oasc.SolrResourceLoader.<init> new SolrResourceLoader for directory: '/mnt/ssd/jenkins/workspace/Lucene-Solr-4.x-Linux/solr/build/solr-core/test/J0/./solrtest-jetty4-1352033147139/collection1/'
[junit4:junit4]   2> 7655 T195 oasc.SolrResourceLoader.replaceClassLoader Adding 'file:/mnt/ssd/jenkins/workspace/Lucene-Solr-4.x-Linux/solr/build/solr-core/test/J0/solrtest-jetty4-1352033147139/collection1/lib/README' to classloader
[junit4:junit4]   2> 7656 T195 oasc.SolrResourceLoader.replaceClassLoader Adding 'file:/mnt/ssd/jenkins/workspace/Lucene-Solr-4.x-Linux/solr/build/solr-core/test/J0/solrtest-jetty4-1352033147139/collection1/lib/classes/' to classloader
[junit4:junit4]   2> 7712 T195 oasc.SolrConfig.<init> Using Lucene MatchVersion: LUCENE_41
[junit4:junit4]   2> 7820 T195 oasc.SolrConfig.<init> Loaded SolrConfig: solrconfig.xml
[junit4:junit4]   2> 7821 T195 oass.IndexSchema.readSchema Reading Solr Schema
[junit4:junit4]   2> 7836 T195 oass.IndexSchema.readSchema Schema name=test
[junit4:junit4]   2> 8373 T195 oass.OpenExchangeRatesOrgProvider.init Initialized with rates=open-exchange-rates.json, refreshInterval=1440.
[junit4:junit4]   2> 8383 T195 oass.IndexSchema.readSchema default search field in schema is text
[junit4:junit4]   2> 8388 T195 oass.IndexSchema.readSchema unique key field: id
[junit4:junit4]   2> 8415 T195 oass.FileExchangeRateProvider.reload Reloading exchange rates from file currency.xml
[junit4:junit4]   2> 8423 T195 oass.FileExchangeRateProvider.reload Reloading exchange rates from file currency.xml
[junit4:junit4]   2> 8435 T195 oass.OpenExchangeRatesOrgProvider.reload Reloading exchange rates from open-exchange-rates.json
[junit4:junit4]   2> 8446 T195 oass.OpenExchangeRatesOrgProvider.reload Reloading exchange rates from open-exchange-rates.json
[junit4:junit4]   2> 8449 T195 oasc.SolrCore.<init> [collection1] Opening new SolrCore at /mnt/ssd/jenkins/workspace/Lucene-Solr-4.x-Linux/solr/build/solr-core/test/J0/./solrtest-jetty4-1352033147139/collection1/, dataDir=./org.apache.solr.cloud.BasicDistributedZkTest-1352033139721/jetty4/
[junit4:junit4]   2> 8450 T195 oasc.JmxMonitoredMap.<init> JMX monitoring is enabled. Adding Solr mbeans to JMX Server: com.sun.jmx.mbeanserver.JmxMBeanServer@c5599598
[junit4:junit4]   2> 8451 T195 oasc.SolrCore.getNewIndexDir New index directory detected: old=null new=./org.apache.solr.cloud.BasicDistributedZkTest-1352033139721/jetty4/index/
[junit4:junit4]   2> 8452 T195 oasc.SolrCore.initIndex WARNING [collection1] Solr index directory './org.apache.solr.cloud.BasicDistributedZkTest-1352033139721/jetty4/index' doesn't exist. Creating new index...
[junit4:junit4]   2> 8453 T195 oasc.CachingDirectoryFactory.get return new directory for /mnt/ssd/jenkins/workspace/Lucene-Solr-4.x-Linux/solr/build/solr-core/test/J0/./org.apache.solr.cloud.BasicDistributedZkTest-1352033139721/jetty4/index forceNew:false
[junit4:junit4]   2> 8457 T195 oasc.SolrDeletionPolicy.onCommit SolrDeletionPolicy.onCommit: commits:num=1
[junit4:junit4]   2> 		commit{dir=NRTCachingDirectory(org.apache.lucene.store.MMapDirectory@/mnt/ssd/jenkins/workspace/Lucene-Solr-4.x-Linux/solr/build/solr-core/test/J0/org.apache.solr.cloud.BasicDistributedZkTest-1352033139721/jetty4/index lockFactory=org.apache.lucene.store.NativeFSLockFactory@60527375; maxCacheMB=48.0 maxMergeSizeMB=4.0),segFN=segments_1,generation=1,filenames=[segments_1]
[junit4:junit4]   2> 8458 T195 oasc.SolrDeletionPolicy.updateCommits newest commit = 1
[junit4:junit4]   2> 8459 T195 oasc.SolrCore.initWriters created xml: solr.XMLResponseWriter
[junit4:junit4]   2> 8463 T195 oasup.UpdateRequestProcessorChain.init inserting DistributedUpdateProcessorFactory into updateRequestProcessorChain "dedupe"
[junit4:junit4]   2> 8464 T195 oasup.UpdateRequestProcessorChain.init inserting DistributedUpdateProcessorFactory into updateRequestProcessorChain "dedupe-allfields"
[junit4:junit4]   2> 8465 T195 oasup.UpdateRequestProcessorChain.init inserting DistributedUpdateProcessorFactory into updateRequestProcessorChain "stored_sig"
[junit4:junit4]   2> 8467 T195 oasup.UpdateRequestProcessorChain.init inserting DistributedUpdateProcessorFactory into updateRequestProcessorChain "uniq-fields"
[junit4:junit4]   2> 8475 T195 oasup.UpdateRequestProcessorChain.init inserting DistributedUpdateProcessorFactory into updateRequestProcessorChain "distrib-dup-test-chain-implicit"
[junit4:junit4]   2> 8476 T195 oasc.RequestHandlers.initHandlersFromConfig adding lazy requestHandler: solr.ReplicationHandler
[junit4:junit4]   2> 8479 T195 oasc.RequestHandlers.initHandlersFromConfig created /replication: solr.ReplicationHandler
[junit4:junit4]   2> 8483 T195 oasc.RequestHandlers.initHandlersFromConfig created standard: solr.StandardRequestHandler
[junit4:junit4]   2> 8487 T195 oasc.RequestHandlers.initHandlersFromConfig created /get: solr.RealTimeGetHandler
[junit4:junit4]   2> 8489 T195 oasc.RequestHandlers.initHandlersFromConfig created dismax: solr.SearchHandler
[junit4:junit4]   2> 8490 T195 oasc.RequestHandlers.initHandlersFromConfig created mock: org.apache.solr.core.MockQuerySenderListenerReqHandler
[junit4:junit4]   2> 8491 T195 oasc.RequestHandlers.initHandlersFromConfig created /admin/: org.apache.solr.handler.admin.AdminHandlers
[junit4:junit4]   2> 8492 T195 oasc.RequestHandlers.initHandlersFromConfig created defaults: solr.StandardRequestHandler
[junit4:junit4]   2> 8493 T195 oasc.RequestHandlers.initHandlersFromConfig adding lazy requestHandler: solr.StandardRequestHandler
[junit4:junit4]   2> 8494 T195 oasc.RequestHandlers.initHandlersFromConfig created lazy: solr.StandardRequestHandler
[junit4:junit4]   2> 8495 T195 oasc.RequestHandlers.initHandlersFromConfig created /update: solr.UpdateRequestHandler
[junit4:junit4]   2> 8499 T195 oasc.RequestHandlers.initHandlersFromConfig created /terms: org.apache.solr.handler.component.SearchHandler
[junit4:junit4]   2> 8502 T195 oasc.RequestHandlers.initHandlersFromConfig created spellCheckCompRH: org.apache.solr.handler.component.SearchHandler
[junit4:junit4]   2> 8506 T195 oasc.RequestHandlers.initHandlersFromConfig created spellCheckCompRH_Direct: org.apache.solr.handler.component.SearchHandler
[junit4:junit4]   2> 8510 T195 oasc.RequestHandlers.initHandlersFromConfig created spellCheckWithWordbreak: org.apache.solr.handler.component.SearchHandler
[junit4:junit4]   2> 8513 T195 oasc.RequestHandlers.initHandlersFromConfig created spellCheckWithWordbreak_Direct: org.apache.solr.handler.component.SearchHandler
[junit4:junit4]   2> 8517 T195 oasc.RequestHandlers.initHandlersFromConfig created spellCheckCompRH1: org.apache.solr.handler.component.SearchHandler
[junit4:junit4]   2> 8519 T195 oasc.RequestHandlers.initHandlersFromConfig created tvrh: org.apache.solr.handler.component.SearchHandler
[junit4:junit4]   2> 8520 T195 oasc.RequestHandlers.initHandlersFromConfig created /mlt: solr.MoreLikeThisHandler
[junit4:junit4]   2> 8521 T195 oasc.RequestHandlers.initHandlersFromConfig created /debug/dump: solr.DumpRequestHandler
[junit4:junit4]   2> 8525 T195 oashl.XMLLoader.init xsltCacheLifetimeSeconds=60
[junit4:junit4]   2> 8531 T195 oasc.SolrCore.initDeprecatedSupport WARNING solrconfig.xml uses deprecated <admin/gettableFiles>, Please update your config to use the ShowFileRequestHandler.
[junit4:junit4]   2> 8537 T195 oasc.SolrCore.initDeprecatedSupport WARNING adding ShowFileRequestHandler with hidden files: [OLD_SYNONYMS.TXT, PROTWORDS.TXT, STOPWORDS.TXT, OPEN-EXCHANGE-RATES.JSON, CURRENCY.XML, SCHEMA.XML, SYNONYMS.TXT, MAPPING-ISOLATIN1ACCENT.TXT]
[junit4:junit4]   2> 8549 T195 oass.SolrIndexSearcher.<init> Opening Searcher@30b24645 main
[junit4:junit4]   2> 8551 T195 oasu.CommitTracker.<init> Hard AutoCommit: disabled
[junit4:junit4]   2> 8552 T195 oasu.CommitTracker.<init> Soft AutoCommit: disabled
[junit4:junit4]   2> 8553 T195 oashc.SpellCheckComponent.inform Initializing spell checkers
[junit4:junit4]   2> 8560 T195 oass.DirectSolrSpellChecker.init init: {name=direct,classname=DirectSolrSpellChecker,field=lowerfilt,minQueryLength=3}
[junit4:junit4]   2> 8628 T268 oasc.SolrCore.registerSearcher [collection1] Registered new searcher Searcher@30b24645 main{StandardDirectoryReader(segments_1:1)}
[junit4:junit4]   2> 8643 T195 oasc.ZkController.publish numShards not found on descriptor - reading it from system property
[junit4:junit4]   2> 8986 T216 oascc.ZkStateReader.updateClusterState Updating cloud state from ZooKeeper... 
[junit4:junit4]   2> 8987 T216 oasc.Overseer$ClusterStateUpdater.updateState Update state numShards=2 message={
[junit4:junit4]   2> 	  "base_url":"http://127.0.0.1:33446/solr",
[junit4:junit4]   2> 	  "state":"down",
[junit4:junit4]   2> 	  "operation":"state",
[junit4:junit4]   2> 	  "node_name":"127.0.0.1:33446_solr",
[junit4:junit4]   2> 	  "numShards":"2",
[junit4:junit4]   2> 	  "roles":null,
[junit4:junit4]   2> 	  "collection":"collection1",
[junit4:junit4]   2> 	  "shard":null,
[junit4:junit4]   2> 	  "core":"collection1"}
[junit4:junit4]   2> 9039 T267 oascc.ZkStateReader$2.process A cluster state change has occurred - updating... (5)
[junit4:junit4]   2> 9039 T241 oascc.ZkStateReader$2.process A cluster state change has occurred - updating... (5)
[junit4:junit4]   2> 9039 T229 oascc.ZkStateReader$2.process A cluster state change has occurred - updating... (5)
[junit4:junit4]   2> 9040 T253 oascc.ZkStateReader$2.process A cluster state change has occurred - updating... (5)
[junit4:junit4]   2> 9040 T215 oascc.ZkStateReader$2.process A cluster state change has occurred - updating... (5)
[junit4:junit4]   2> 9144 T195 oasc.CoreContainer.register registering core: collection1
[junit4:junit4]   2> 9145 T195 oasc.ZkController.register Register shard - core:collection1 address:http://127.0.0.1:33446/solr shardId:shard2
[junit4:junit4]   2> 9148 T195 oasc.ZkController.register We are http://127.0.0.1:33446/solr/collection1/ and leader is http://127.0.0.1:49345/solr/collection1/
[junit4:junit4]   2> 9148 T195 oasc.ZkController.register No LogReplay needed for core=collection1 baseURL=http://127.0.0.1:33446/solr
[junit4:junit4]   2> 9149 T195 oasc.ZkController.checkRecovery Core needs to recover:collection1
[junit4:junit4]   2> 9150 T195 oasu.DefaultSolrCoreState.doRecovery Running recovery - first canceling any ongoing recovery
[junit4:junit4]   2> 9151 T195 oascc.ZkStateReader.updateClusterState Updating cloud state from ZooKeeper... 
[junit4:junit4]   2> 9152 T195 oass.SolrDispatchFilter.init user.dir=/mnt/ssd/jenkins/workspace/Lucene-Solr-4.x-Linux/solr/build/solr-core/test/J0
[junit4:junit4]   2> 9153 T195 oass.SolrDispatchFilter.init SolrDispatchFilter.init() done
[junit4:junit4]   2> 9153 T195 oascsi.HttpClientUtil.createClient Creating new http client, config:maxConnections=128&maxConnectionsPerHost=32&followRedirects=false
[junit4:junit4]   2> 9159 T195 oaz.ZooKeeper.<init> Initiating client connection, connectString=127.0.0.1:54660/solr sessionTimeout=10000 watcher=org.apache.solr.common.cloud.ConnectionManager@836fbd68
[junit4:junit4]   2> ASYNC  NEW_CORE C15 name=collection1 org.apache.solr.core.SolrCore@38ae9e31 url=http://127.0.0.1:33446/solr/collection1 node=127.0.0.1:33446_solr
[junit4:junit4]   2> 9160 T269 C15 P33446 oasc.RecoveryStrategy.run Starting recovery process.  core=collection1 recoveringAfterStartup=true
[junit4:junit4]   2> 9160 T269 C15 P33446 oasc.RecoveryStrategy.doRecovery ###### startupVersions=[]
[junit4:junit4]   2> 9160 T195 oascc.ConnectionManager.waitForConnected Waiting for client to connect to ZooKeeper
[junit4:junit4]   2> 9161 T270 oaz.ClientCnxn$SendThread.startConnect Opening socket connection to server /127.0.0.1:54660
[junit4:junit4]   2> 9162 T197 oazs.NIOServerCnxn$Factory.run Accepted socket connection from /127.0.0.1:33980
[junit4:junit4]   2> 9163 T270 oaz.ClientCnxn$SendThread.primeConnection Socket connection established to localhost.localdomain/127.0.0.1:54660, initiating session
[junit4:junit4]   2> 9163 T197 oazs.NIOServerCnxn.readConnectRequest Client attempting to establish new session at /127.0.0.1:33980
[junit4:junit4]   2> 9161 T269 C15 P33446 oasc.ZkController.publish numShards not found on descriptor - reading it from system property
[junit4:junit4]   2> 9164 T199 oazs.NIOServerCnxn.finishSessionInit Established session 0x13acb747c0d0007 with negotiated timeout 10000 for client /127.0.0.1:33980
[junit4:junit4]   2> 9165 T269 C15 P33446 oasc.RecoveryStrategy.doRecovery Attempting to PeerSync from http://127.0.0.1:49345/solr/collection1/ core=collection1 - recoveringAfterStartup=true
[junit4:junit4]   2> 9165 T270 oaz.ClientCnxn$SendThread.readConnectResult Session establishment complete on server localhost.localdomain/127.0.0.1:54660, sessionid = 0x13acb747c0d0007, negotiated timeout = 10000
[junit4:junit4]   2> 9165 T269 C15 P33446 oasu.PeerSync.sync PeerSync: core=collection1 url=http://127.0.0.1:33446/solr START replicas=[http://127.0.0.1:49345/solr/collection1/] nUpdates=100
[junit4:junit4]   2> 9166 T269 C15 P33446 oasu.PeerSync.sync WARNING no frame of reference to tell of we've missed updates
[junit4:junit4]   2> 9166 T269 C15 P33446 oasc.RecoveryStrategy.doRecovery PeerSync Recovery was not successful - trying replication. core=collection1
[junit4:junit4]   2> 9167 T269 C15 P33446 oasc.RecoveryStrategy.doRecovery Starting Replication Recovery. core=collection1
[junit4:junit4]   2> 9167 T269 C15 P33446 oascsi.HttpClientUtil.createClient Creating new http client, config:maxConnections=128&maxConnectionsPerHost=32&followRedirects=false
[junit4:junit4]   2> 9168 T271 oascc.ConnectionManager.process Watcher org.apache.solr.common.cloud.ConnectionManager@836fbd68 name:ZooKeeperConnection Watcher:127.0.0.1:54660/solr got event WatchedEvent state:SyncConnected type:None path:null path:null type:None
[junit4:junit4]   2> ASYNC  NEW_CORE C16 name=collection1 org.apache.solr.core.SolrCore@ee2d8a37 url=http://127.0.0.1:49345/solr/collection1 node=127.0.0.1:49345_solr
[junit4:junit4]   2> 9173 T239 C16 P49345 REQ /get {version=2&getVersions=100&qt=/get&wt=javabin&distrib=false} status=0 QTime=0 
[junit4:junit4]   2> 9178 T195 oascc.ConnectionManager.waitForConnected Client is connected to ZooKeeper
[junit4:junit4]   2> 9180 T195 oascc.ZkStateReader.createClusterStateWatchersAndUpdate Updating cluster state from ZooKeeper... 
[junit4:junit4]   2> 9183 T195 oasc.ChaosMonkey.monkeyLog monkey: init - expire sessions:true cause connection loss:true
[junit4:junit4]   2> 9184 T195 oascsi.HttpClientUtil.createClient Creating new http client, config:
[junit4:junit4]   2> 9191 T195 oascc.ZkStateReader.updateClusterState Updating cloud state from ZooKeeper... 
[junit4:junit4]   2> 9195 T195 oasc.AbstractDistribZkTestBase.waitForRecoveriesToFinish Wait for recoveries to finish - collection: collection1 failOnTimeout:true timeout (sec):540
[junit4:junit4]   2> 9197 T195 oascc.ZkStateReader.updateClusterState Updating cloud state from ZooKeeper... 
[junit4:junit4]   2> 9545 T216 oascc.ZkStateReader.updateClusterState Updating cloud state from ZooKeeper... 
[junit4:junit4]   2> 9546 T216 oasc.Overseer$ClusterStateUpdater.updateState Update state numShards=2 message={
[junit4:junit4]   2> 	  "base_url":"http://127.0.0.1:33446/solr",
[junit4:junit4]   2> 	  "state":"recovering",
[junit4:junit4]   2> 	  "operation":"state",
[junit4:junit4]   2> 	  "node_name":"127.0.0.1:33446_solr",
[junit4:junit4]   2> 	  "numShards":"2",
[junit4:junit4]   2> 	  "roles":null,
[junit4:junit4]   2> 	  "collection":"collection1",
[junit4:junit4]   2> 	  "shard":"shard2",
[junit4:junit4]   2> 	  "core":"collection1"}
[junit4:junit4]   2> 9551 T241 oascc.ZkStateReader$2.process A cluster state change has occurred - updating... (5)
[junit4:junit4]   2> 9551 T215 oascc.ZkStateReader$2.process A cluster state change has occurred - updating... (5)
[junit4:junit4]   2> 9551 T229 oascc.ZkStateReader$2.process A cluster state change has occurred - updating... (5)
[junit4:junit4]   2> 9552 T253 oascc.ZkStateReader$2.process A cluster state change has occurred - updating... (5)
[junit4:junit4]   2> 9551 T271 oascc.ZkStateReader$2.process A cluster state change has occurred - updating... (5)
[junit4:junit4]   2> 9555 T267 oascc.ZkStateReader$2.process A cluster state change has occurred - updating... (5)
[junit4:junit4]   2> 10199 T195 oascc.ZkStateReader.updateClusterState Updating cloud state from ZooKeeper... 
[junit4:junit4]   2>  C13_STATE=coll:collection1 core:collection1 props:{base_url=http://127.0.0.1:53513/solr, state=recovering, node_name=127.0.0.1:53513_solr, roles=null, collection=collection1, shard=shard1, core=collection1}
[junit4:junit4]   2> 10438 T255 C13 P53513 oasc.RecoveryStrategy.doRecovery Begin buffering updates. core=collection1
[junit4:junit4]   2> 10438 T255 C13 P53513 oasu.UpdateLog.bufferUpdates Starting to buffer updates. FSUpdateLog{state=ACTIVE, tlog=null}
[junit4:junit4]   2> 10439 T255 C13 P53513 oasc.RecoveryStrategy.replicate Attempting to replicate from http://127.0.0.1:36297/solr/collection1/. core=collection1
[junit4:junit4]   2> 10439 T255 C13 P53513 oascsi.HttpClientUtil.createClient Creating new http client, config:maxConnections=128&maxConnectionsPerHost=32&followRedirects=false
[junit4:junit4]   2> 10449 T225 C14 P36297 oascsi.HttpClientUtil.createClient Creating new http client, config:maxConnections=500&maxConnectionsPerHost=16
[junit4:junit4]   2> 10455 T225 C14 P36297 oasu.DirectUpdateHandler2.commit start commit{flags=0,_version_=0,optimize=false,openSearcher=false,waitSearcher=true,expungeDeletes=false,softCommit=false}
[junit4:junit4]   2> 10458 T225 C14 P36297 oasc.SolrDeletionPolicy.onInit SolrDeletionPolicy.onInit: commits:num=1
[junit4:junit4]   2> 		commit{dir=NRTCachingDirectory(org.apache.lucene.store.MMapDirectory@/mnt/ssd/jenkins/workspace/Lucene-Solr-4.x-Linux/solr/build/solr-core/test/J0/org.apache.solr.cloud.BasicDistributedZkTest-1352033139721/jetty1/index lockFactory=org.apache.lucene.store.NativeFSLockFactory@13c504fc; maxCacheMB=48.0 maxMergeSizeMB=4.0),segFN=segments_1,generation=1,filenames=[segments_1]
[junit4:junit4]   2> 10458 T225 C14 P36297 oasc.SolrDeletionPolicy.updateCommits newest commit = 1
[junit4:junit4]   2> 10459 T225 C14 P36297 oass.SolrIndexSearcher.<init> Opening Searcher@290749b9 realtime
[junit4:junit4]   2> 10460 T225 C14 P36297 oasu.DirectUpdateHandler2.commit end_commit_flush
[junit4:junit4]   2> 10461 T225 C14 P36297 /update {softCommit=false&commit_end_point=true&commit=true&version=2&waitSearcher=true&wt=javabin&openSearcher=false} {commit=} 0 15
[junit4:junit4]   2> 10469 T255 C13 P53513 oash.ReplicationHandler.inform Commits will be reserved for  10000
[junit4:junit4]   2> 10469 T255 C13 P53513 oascsi.HttpClientUtil.createClient Creating new http client, config:connTimeout=5000&socketTimeout=20000&allowCompression=false&maxConnections=10000&maxConnectionsPerHost=10000
[junit4:junit4]   2> 10473 T255 C13 P53513 oash.SnapPuller.<init>  No value set for 'pollInterval'. Timer Task not started.
[junit4:junit4]   2> 10476 T224 C14 P36297 oash.ReplicationHandler.inform Commits will be reserved for  10000
[junit4:junit4]   2> 10476 T224 C14 P36297 REQ /replication {version=2&command=indexversion&qt=/replication&wt=javabin} status=0 QTime=1 
[junit4:junit4]   2> 10480 T255 C13 P53513 oasc.SolrDeletionPolicy.onInit SolrDeletionPolicy.onInit: commits:num=1
[junit4:junit4]   2> 		commit{dir=NRTCachingDirectory(org.apache.lucene.store.MMapDirectory@/mnt/ssd/jenkins/workspace/Lucene-Solr-4.x-Linux/solr/build/solr-core/test/J0/org.apache.solr.cloud.BasicDistributedZkTest-1352033139721/jetty3/index lockFactory=org.apache.lucene.store.NativeFSLockFactory@80c4f188; maxCacheMB=48.0 maxMergeSizeMB=4.0),segFN=segments_1,generation=1,filenames=[segments_1]
[junit4:junit4]   2> 10480 T255 C13 P53513 oasc.SolrDeletionPolicy.updateCommits newest commit = 1
[junit4:junit4]   2> 10480 T255 C13 P53513 oasu.DirectUpdateHandler2.commit start commit{flags=0,_version_=0,optimize=false,openSearcher=true,waitSearcher=true,expungeDeletes=false,softCommit=false}
[junit4:junit4]   2> 10549 T255 C13 P53513 oasc.SolrDeletionPolicy.onCommit SolrDeletionPolicy.onCommit: commits:num=2
[junit4:junit4]   2> 		commit{dir=NRTCachingDirectory(org.apache.lucene.store.MMapDirectory@/mnt/ssd/jenkins/workspace/Lucene-Solr-4.x-Linux/solr/build/solr-core/test/J0/org.apache.solr.cloud.BasicDistributedZkTest-1352033139721/jetty3/index lockFactory=org.apache.lucene.store.NativeFSLockFactory@80c4f188; maxCacheMB=48.0 maxMergeSizeMB=4.0),segFN=segments_1,generation=1,filenames=[segments_1]
[junit4:junit4]   2> 		commit{dir=NRTCachingDirectory(org.apache.lucene.store.MMapDirectory@/mnt/ssd/jenkins/workspace/Lucene-Solr-4.x-Linux/solr/build/solr-core/test/J0/org.apache.solr.cloud.BasicDistributedZkTest-1352033139721/jetty3/index lockFactory=org.apache.lucene.store.NativeFSLockFactory@80c4f188; maxCacheMB=48.0 maxMergeSizeMB=4.0),segFN=segments_2,generation=2,filenames=[segments_2]
[junit4:junit4]   2> 10550 T255 C13 P53513 oasc.SolrDeletionPolicy.updateCommits newest commit = 2
[junit4:junit4]   2> 10551 T255 C13 P53513 oass.SolrIndexSearcher.<init> Opening Searcher@8a3573d6 main
[junit4:junit4]   2> 10551 T255 C13 P53513 oasu.DirectUpdateHandler2.commit end_commit_flush
[junit4:junit4]   2> 10553 T254 oasc.SolrCore.registerSearcher [collection1] Registered new searcher Searcher@8a3573d6 main{StandardDirectoryReader(segments_2:2)}
[junit4:junit4]   2> 10554 T255 C13 P53513 oasc.RecoveryStrategy.replay No replay needed. core=collection1
[junit4:junit4]   2> 10554 T255 C13 P53513 oasc.RecoveryStrategy.doRecovery Replication Recovery was successful - registering as Active. core=collection1
[junit4:junit4]   2> 10554 T255 C13 P53513 oasc.ZkController.publish numShards not found on descriptor - reading it from system property
[junit4:junit4]   2> 10556 T255 C13 P53513 oasc.RecoveryStrategy.doRecovery Finished recovery process. core=collection1
[junit4:junit4]   2> 10557 T216 oascc.ZkStateReader.updateClusterState Updating cloud state from ZooKeeper... 
[junit4:junit4]   2> 10558 T216 oasc.Overseer$ClusterStateUpdater.updateState Update state numShards=2 message={
[junit4:junit4]   2> 	  "base_url":"http://127.0.0.1:53513/solr",
[junit4:junit4]   2> 	  "state":"active",
[junit4:junit4]   2> 	  "operation":"state",
[junit4:junit4]   2> 	  "node_name":"127.0.0.1:53513_solr",
[junit4:junit4]   2> 	  "numShards":"2",
[junit4:junit4]   2> 	  "roles":null,
[junit4:junit4]   2> 	  "collection":"collection1",
[junit4:junit4]   2> 	  "shard":"shard1",
[junit4:junit4]   2> 	  "core":"collection1"}
[junit4:junit4]   2> 10563 T241 oascc.ZkStateReader$2.process A cluster state change has occurred - updating... (5)
[junit4:junit4]   2> 10563 T267 oascc.ZkStateReader$2.process A cluster state change has occurred - updating... (5)
[junit4:junit4]   2> 10563 T215 oascc.ZkStateReader$2.process A cluster state change has occurred - updating... (5)
[junit4:junit4]   2> 10564 T271 oascc.ZkStateReader$2.process A cluster state change has occurred - updating... (5)
[junit4:junit4]   2> 10563 T229 oascc.ZkStateReader$2.process A cluster state change has occurred - updating... (5)
[junit4:junit4]   2> 10563 T253 oascc.ZkStateReader$2.process A cluster state change has occurred - updating... (5)
[junit4:junit4]   2> 11201 T195 oascc.ZkStateReader.updateClusterState Updating cloud state from ZooKeeper... 
[junit4:junit4]   2>  C15_STATE=coll:collection1 core:collection1 props:{base_url=http://127.0.0.1:33446/solr, state=recovering, node_name=127.0.0.1:33446_solr, roles=null, collection=collection1, shard=shard2, core=collection1}
[junit4:junit4]   2> 12190 T269 C15 P33446 oasc.RecoveryStrategy.doRecovery Begin buffering updates. core=collection1
[junit4:junit4]   2> 12190 T269 C15 P33446 oasu.UpdateLog.bufferUpdates Starting to buffer updates. FSUpdateLog{state=ACTIVE, tlog=null}
[junit4:junit4]   2> 12191 T269 C15 P33446 oasc.RecoveryStrategy.replicate Attempting to replicate from http://127.0.0.1:49345/solr/collection1/. core=collection1
[junit4:junit4]   2> 12191 T269 C15 P33446 oascsi.HttpClientUtil.createClient Creating new http client, config:maxConnections=128&maxConnectionsPerHost=32&followRedirects=false
[junit4:junit4]   2> 12199 T239 C16 P49345 oasu.DirectUpdateHandler2.commit start commit{flags=0,_version_=0,optimize=false,openSearcher=false,waitSearcher=true,expungeDeletes=false,softCommit=false}
[junit4:junit4]   2> 12202 T239 C16 P49345 oasc.SolrDeletionPolicy.onInit SolrDeletionPolicy.onInit: commits:num=1
[junit4:junit4]   2> 		commit{dir=NRTCachingDirectory(org.apache.lucene.store.MMapDirectory@/mnt/ssd/jenkins/workspace/Lucene-Solr-4.x-Linux/solr/build/solr-core/test/J0/org.apache.solr.cloud.BasicDistributedZkTest-1352033139721/jetty2/index lockFactory=org.apache.lucene.store.NativeFSLockFactory@3989b65f; maxCacheMB=48.0 maxMergeSizeMB=4.0),segFN=segments_1,generation=1,filenames=[segments_1]
[junit4:junit4]   2> 12202 T239 C16 P49345 oasc.SolrDeletionPolicy.updateCommits newest commit = 1
[junit4:junit4]   2> 12203 T239 C16 P49345 oass.SolrIndexSearcher.<init> Opening Searcher@339ffecd realtime
[junit4:junit4]   2> 12203 T195 oascc.ZkStateReader.updateClusterState Updating cloud state from ZooKeeper... 
[junit4:junit4]   2> 12203 T239 C16 P49345 oasu.DirectUpdateHandler2.commit end_commit_flush
[junit4:junit4]   2> 12204 T239 C16 P49345 /update {softCommit=false&commit_end_point=true&commit=true&version=2&waitSearcher=true&wt=javabin&openSearcher=false} {commit=} 0 5
[junit4:junit4]   2> 12204 T269 C15 P33446 oash.ReplicationHandler.inform Commits will be reserved for  10000
[junit4:junit4]   2> 12205 T269 C15 P33446 oash.SnapPuller.<init>  No value set for 'pollInterval'. Timer Task not started.
[junit4:junit4]   2> 12206 T238 C16 P49345 oash.ReplicationHandler.inform Commits will be reserved for  10000
[junit4:junit4]   2> 12206 T238 C16 P49345 REQ /replication {version=2&command=indexversion&qt=/replication&wt=javabin} status=0 QTime=0 
[junit4:junit4]   2> 12209 T269 C15 P33446 oasc.SolrDeletionPolicy.onInit SolrDeletionPolicy.onInit: commits:num=1
[junit4:junit4]   2> 		commit{dir=NRTCachingDirectory(org.apache.lucene.store.MMapDirectory@/mnt/ssd/jenkins/workspace/Lucene-Solr-4.x-Linux/solr/build/solr-core/test/J0/org.apache.solr.cloud.BasicDistributedZkTest-1352033139721/jetty4/index lockFactory=org.apache.lucene.store.NativeFSLockFactory@60527375; maxCacheMB=48.0 maxMergeSizeMB=4.0),segFN=segments_1,generation=1,filenames=[segments_1]
[junit4:junit4]   2> 12209 T269 C15 P33446 oasc.SolrDeletionPolicy.updateCommits newest commit = 1
[junit4:junit4]   2> 12209 T269 C15 P33446 oasu.DirectUpdateHandler2.commit start commit{flags=0,_version_=0,optimize=false,openSearcher=true,waitSearcher=true,expungeDeletes=false,softCommit=false}
[junit4:junit4]   2> 12219 T269 C15 P33446 oasc.SolrDeletionPolicy.onCommit SolrDeletionPolicy.onCommit: commits:num=2
[junit4:junit4]   2> 		commit{dir=NRTCachingDirectory(org.apache.lucene.store.MMapDirectory@/mnt/ssd/jenkins/workspace/Lucene-Solr-4.x-Linux/solr/build/solr-core/test/J0/org.apache.solr.cloud.BasicDistributedZkTest-1352033139721/jetty4/index lockFactory=org.apache.lucene.store.NativeFSLockFactory@60527375; maxCacheMB=48.0 maxMergeSizeMB=4.0),segFN=segments_1,generation=1,filenames=[segments_1]
[junit4:junit4]   2> 		commit{dir=NRTCachingDirectory(org.apache.lucene.store.MMapDirectory@/mnt/ssd/jenkins/workspace/Lucene-Solr-4.x-Linux/solr/build/solr-core/test/J0/org.apache.solr.cloud.BasicDistributedZkTest-1352033139721/jetty4/index lockFactory=org.apache.lucene.store.NativeFSLockFactory@60527375; maxCacheMB=48.0 maxMergeSizeMB=4.0),segFN=segments_2,generation=2,filenames=[segments_2]
[junit4:junit4]   2> 12219 T269 C15 P33446 oasc.SolrDeletionPolicy.updateCommits newest commit = 2
[junit4:junit4]   2> 12221 T269 C15 P33446 oass.SolrIndexSearcher.<init> Opening Searcher@1e649fd6 main
[junit4:junit4]   2> 12221 T269 C15 P33446 oasu.DirectUpdateHandler2.commit end_commit_flush
[junit4:junit4]   2> 12223 T268 oasc.SolrCore.registerSearcher [collection1] Registered new searcher Searcher@1e649fd6 main{StandardDirectoryReader(segments_2:2)}
[junit4:junit4]   2> 12223 T269 C15 P33446 oasc.RecoveryStrategy.replay No replay needed. core=collection1
[junit4:junit4]   2> 12223 T269 C15 P33446 oasc.RecoveryStrategy.doRecovery Replication Recovery was successful - registering as Active. core=collection1
[junit4:junit4]   2> 12223 T269 C15 P33446 oasc.ZkController.publish numShards not found on descriptor - reading it from system property
[junit4:junit4]   2> 12225 T269 C15 P33446 oasc.RecoveryStrategy.doRecovery Finished recovery process. core=collection1
[junit4:junit4]   2> 12572 T216 oascc.ZkStateReader.updateClusterState Updating cloud state from ZooKeeper... 
[junit4:junit4]   2> 12574 T216 oasc.Overseer$ClusterStateUpdater.updateState Update state numShards=2 message={
[junit4:junit4]   2> 	  "base_url":"http://127.0.0.1:33446/solr",
[junit4:junit4]   2> 	  "state":"active",
[junit4:junit4]   2> 	  "operation":"state",
[junit4:junit4]   2> 	  "node_name":"127.0.0.1:33446_solr",
[junit4:junit4]   2> 	  "numShards":"2",
[junit4:junit4]   2> 	  "roles":null,
[junit4:junit4]   2> 	  "collection":"collection1",
[junit4:junit4]   2> 	  "shard":"shard2",
[junit4:junit4]   2> 	  "core":"collection1"}
[junit4:junit4]   2> 12577 T215 oascc.ZkStateReader$2.process A cluster state change has occurred - updating... (5)
[junit4:junit4]   2> 12577 T253 oascc.ZkStateReader$2.process A cluster state change has occurred - updating... (5)
[junit4:junit4]   2> 12577 T229 oascc.ZkStateReader$2.process A cluster state change has occurred - updating... (5)
[junit4:junit4]   2> 12577 T271 oascc.ZkStateReader$2.process A cluster state change has occurred - updating... (5)
[junit4:junit4]   2> 12577 T267 oascc.ZkStateReader$2.process A cluster state change has occurred - updating... (5)
[junit4:junit4]   2> 12577 T241 oascc.ZkStateReader$2.process A cluster state change has occurred - updating... (5)
[junit4:junit4]   2> 13205 T195 oascc.ZkStateReader.updateClusterState Updating cloud state from ZooKeeper... 
[junit4:junit4]   2> ASYNC  NEW_CORE C17 name=collection1 org.apache.solr.core.SolrCore@6be6436c url=http://127.0.0.1:55412/solr/collection1 node=127.0.0.1:55412_solr
[junit4:junit4]   2> 13218 T211 C17 P55412 oasc.SolrDeletionPolicy.onInit SolrDeletionPolicy.onInit: commits:num=1
[junit4:junit4]   2> 		commit{dir=NRTCachingDirectory(org.apache.lucene.store.MMapDirectory@/mnt/ssd/jenkins/workspace/Lucene-Solr-4.x-Linux/solr/build/solr-core/test/J0/org.apache.solr.cloud.BasicDistributedZkTest-1352033139721/control/data/index lockFactory=org.apache.lucene.store.NativeFSLockFactory@fbb4e8bd; maxCacheMB=48.0 maxMergeSizeMB=4.0),segFN=segments_1,generation=1,filenames=[segments_1]
[junit4:junit4]   2> 13219 T211 C17 P55412 oasc.SolrDeletionPolicy.updateCommits newest commit = 1
[junit4:junit4]   2> 13274 T211 C17 P55412 oass.SolrIndexSearcher.<init> Opening Searcher@f1d16814 realtime
[junit4:junit4]   2> 13275 T211 C17 P55412 /update {version=2&wt=javabin} {deleteByQuery=*:* (-1417709515365679104)} 0 61
[junit4:junit4]   2> 13476 T195 oaz.ZooKeeper.<init> Initiating client connection, connectString=127.0.0.1:54660/solr sessionTimeout=10000 watcher=org.apache.solr.common.cloud.ConnectionManager@fa3bfb64
[junit4:junit4]   2> 13479 T273 oaz.ClientCnxn$SendThread.startConnect Opening socket connection to server /127.0.0.1:54660
[junit4:junit4]   2> 13479 T195 oascc.ConnectionManager.waitForConnected Waiting for client to connect to ZooKeeper
[junit4:junit4]   2> 13480 T273 oaz.ClientCnxn$SendThread.primeConnection Socket connection established to localhost.localdomain/127.0.0.1:54660, initiating session
[junit4:junit4]   2> 13480 T197 oazs.NIOServerCnxn$Factory.run Accepted socket connection from /127.0.0.1:33991
[junit4:junit4]   2> 13481 T197 oazs.NIOServerCnxn.readConnectRequest Client attempting to establish new session at /127.0.0.1:33991
[junit4:junit4]   2> 13482 T273 oaz.ClientCnxn$SendThread.readConnectResult Session establishment complete on server localhost.localdomain/127.0.0.1:54660, sessionid = 0x13acb747c0d0008, negotiated timeout = 10000
[junit4:junit4]   2> 13482 T199 oazs.NIOServerCnxn.finishSessionInit Established session 0x13acb747c0d0008 with negotiated timeout 10000 for client /127.0.0.1:33991
[junit4:junit4]   2> 13482 T274 oascc.ConnectionManager.process Watcher org.apache.solr.common.cloud.ConnectionManager@fa3bfb64 name:ZooKeeperConnection Watcher:127.0.0.1:54660/solr got event WatchedEvent state:SyncConnected type:None path:null path:null type:None
[junit4:junit4]   2> 13483 T195 oascc.ConnectionManager.waitForConnected Client is connected to ZooKeeper
[junit4:junit4]   2> 13484 T195 oascc.ZkStateReader.createClusterStateWatchersAndUpdate Updating cluster state from ZooKeeper... 
[junit4:junit4]   2>  C15_STATE=coll:collection1 core:collection1 props:{base_url=http://127.0.0.1:33446/solr, state=active, node_name=127.0.0.1:33446_solr, roles=null, collection=collection1, shard=shard2, core=collection1}
[junit4:junit4]   2> 13499 T263 C15 P33446 oass.SolrIndexSearcher.<init> Opening Searcher@2e5c5fa realtime
[junit4:junit4]   2> 13500 T263 C15 P33446 REQ /update {update.distrib=FROMLEADER&_version_=-1417709515654037504&version=2&wt=javabin&update.from=http://127.0.0.1:49345/solr/collection1/} status=0 QTime=2 
[junit4:junit4]   2>  C13_STATE=coll:collection1 core:collection1 props:{base_url=http://127.0.0.1:53513/solr, state=active, node_name=127.0.0.1:53513_solr, roles=null, collection=collection1, shard=shard1, core=collection1}
[junit4:junit4]   2> 13502 T248 C13 P53513 oass.SolrIndexSearcher.<init> Opening Searcher@c46bf0c8 realtime
[junit4:junit4]   2> 13503 T248 C13 P53513 REQ /update {update.distrib=FROMLEADER&_version_=-1417709515659280384&version=2&wt=javabin&update.from=http://127.0.0.1:36297/solr/collection1/} status=0 QTime=2 
[junit4:junit4]   2> 13504 T225 C14 P36297 REQ /update {update.distrib=TOLEADER&version=2&wt=javabin} status=0 QTime=9 
[junit4:junit4]   2> 13505 T239 C16 P49345 /update {version=2&wt=javabin} {deleteByQuery=*:* (-1417709515654037504)} 0 16
[junit4:junit4]   2> 13519 T210 C17 P55412 /update {version=2&wt=javabin} {add=[1 (1417709515675009024)]} 0 10
[junit4:junit4]   2> 13538 T250 C13 P53513 REQ /update {update.distrib=FROMLEADER&distrib.from=http://127.0.0.1:36297/solr/collection1/&version=2&wt=javabin} status=0 QTime=7 
[junit4:junit4]   2> 13539 T226 C14 P36297 /update {version=2&wt=javabin} {add=[1 (1417709515687591936)]} 0 18
[junit4:junit4]   2> 13548 T212 C17 P55412 /update {version=2&wt=javabin} {add=[2 (1417709515709612032)]} 0 5
[junit4:junit4]   2> 13566 T265 C15 P33446 REQ /update {update.distrib=FROMLEADER&distrib.from=http://127.0.0.1:49345/solr/collection1/&version=2&wt=javabin} status=0 QTime=5 
[junit4:junit4]   2> 13567 T236 C16 P49345 REQ /update {update.distrib=TOLEADER&distrib.from=http://127.0.0.1:36297/solr/collection1/&version=2&wt=javabin} status=0 QTime=14 
[junit4:junit4]   2> 13568 T224 C14 P36297 /update {version=2&wt=javabin} {add=[2]} 0 18
[junit4:junit4]   2> 13574 T211 C17 P55412 /update {version=2&wt=javabin} {add=[3 (1417709515737923584)]} 0 3
[junit4:junit4]   2> 13587 T263 C15 P33446 REQ /update {update.distrib=FROMLEADER&distrib.from=http://127.0.0.1:49345/solr/collection1/&version=2&wt=javabin} status=0 QTime=3 
[junit4:junit4]   2> 13588 T237 C16 P49345 REQ /update {update.distrib=TOLEADER&distrib.from=http://127.0.0.1:36297/solr/collection1/&version=2&wt=javabin} status=0 QTime=9 
[junit4:junit4]   2> 13589 T225 C14 P36297 /update {version=2&wt=javabin} {add=[3]} 0 13
[junit4:junit4]   2> 13597 T213 C17 P55412 /update {version=2&wt=javabin} {add=[4 (1417709515760992256)]} 0 5
[junit4:junit4]   2> 13611 T251 C13 P53513 REQ /update {update.distrib=FROMLEADER&distrib.from=http://127.0.0.1:36297/solr/collection1/&version=2&wt=javabin} status=0 QTime=4 
[junit4:junit4]   2> 13612 T227 C14 P36297 /update {version=2&wt=javabin} {add=[4 (1417709515769380864)]} 0 12
[junit4:junit4]   2> 13619 T210 C17 P55412 /update {version=2&wt=javabin} {add=[5 (1417709515784060928)]} 0 4
[junit4:junit4]   2> 13633 T264 C15 P33446 REQ /update {update.distrib=FROMLEADER&distrib.from=http://127.0.0.1:49345/solr/collection1/&version=2&wt=javabin} status=0 QTime=5 
[junit4:junit4]   2> 13634 T238 C16 P49345 /update {version=2&wt=javabin} {add=[5 (1417709515791400960)]} 0 12
[junit4:junit4]   2> 13640 T211 C17 P55412 /update {version=2&wt=javabin} {add=[6 (1417709515808178176)]} 0 3
[junit4:junit4]   2> 13654 T262 C15 P33446 REQ /update {update.distrib=FROMLEADER&distrib.from=http://127.0.0.1:49345/solr/collection1/&version=2&wt=javabin} status=0 QTime=5 
[junit4:junit4]   2> 13655 T239 C16 P49345 /update {version=2&wt=javabin} {add=[6 (1417709515814469632)]} 0 12
[junit4:junit4]   2> 13663 T213 C17 P55412 /update {version=2&wt=javabin} {add=[7 (1417709515830198272)]} 0 5
[junit4:junit4]   2> 13678 T265 C15 P33446 REQ /update {update.distrib=FROMLEADER&distrib.from=http://127.0.0.1:49345/solr/collection1/&version=2&wt=javabin} status=0 QTime=4 
[junit4:junit4]   2> 13679 T236 C16 P49345 REQ /update {update.distrib=TOLEADER&distrib.from=http://127.0.0.1:36297/solr/collection1/&version=2&wt=javabin} status=0 QTime=11 
[junit4:junit4]   2> 13680 T226 C14 P36297 /update {version=2&wt=javabin} {add=[7]} 0 15
[junit4:junit4]   2> 13686 T212 C17 P55412 /update {version=2&wt=javabin} {add=[8 (1417709515855364096)]} 0 3
[junit4:junit4]   2> 13696 T248 C13 P53513 REQ /update {update.distrib=FROMLEADER&distrib.from=http://127.0.0.1:36297/solr/collection1/&version=2&wt=javabin} status=0 QTime=3 
[junit4:junit4]   2> 13697 T224 C14 P36297 /update {version=2&wt=javabin} {add=[8 (1417709515861655552)]} 0 9
[junit4:junit4]   2> 13702 T210 C17 P55412 /update {version=2&wt=javabin} {add=[9 (1417709515873189888)]} 0 3
[junit4:junit4]   2> 13717 T263 C15 P33446 REQ /update {update.distrib=FROMLEADER&distrib.from=http://127.0.0.1:49345/solr/collection1/&version=2&wt=javabin} status=0 QTime=4 
[junit4:junit4]   2> 13718 T237 C16 P49345 REQ /update {update.distrib=TOLEADER&distrib.from=http://127.0.0.1:36297/solr/collection1/&version=2&wt=javabin} status=0 QTime=10 
[junit4:junit4]   2> 13719 T225 C14 P36297 /update {version=2&wt=javabin} {add=[9]} 0 14
[junit4:junit4]   2> 13738 T211 C17 P55412 /update {version=2&wt=javabin} {add=[10 (1417709515896258560)]} 0 16
[junit4:junit4]   2> 13749 T250 C13 P53513 REQ /update {update.distrib=FROMLEADER&distrib.from=http://127.0.0.1:36297/solr/collection1/&version=2&wt=javabin} status=0 QTime=2 
[junit4:junit4]   2> 13750 T227 C14 P36297 /update {version=2&wt=javabin} {add=[10 (1417709515916181504)]} 0 9
[junit4:junit4]   2> 13758 T213 C17 P55412 /update {version=2&wt=javabin} {add=[11 (1417709515929812992)]} 0 5
[junit4:junit4]   2> 13768 T251 C13 P53513 REQ /update {update.distrib=FROMLEADER&distrib.from=http://127.0.0.1:36297/solr/collection1/&version=2&wt=javabin} status=0 QTime=2 
[junit4:junit4]   2> 13769 T226 C14 P36297 /update {version=2&wt=javabin} {add=[11 (1417709515938201600)]} 0 8
[junit4:junit4]   2> 13775 T212 C17 P55412 /update {version=2&wt=javabin} {add=[12 (1417709515948687360)]} 0 3
[junit4:junit4]   2> 13785 T249 C13 P53513 REQ /update {update.distrib=FROMLEADER&distrib.from=http://127.0.0.1:36297/solr/collection1/&version=2&wt=javabin} status=0 QTime=3 
[junit4:junit4]   2> 13786 T224 C14 P36297 /update {version=2&wt=javabin} {add=[12 (1417709515956027392)]} 0 8
[junit4:junit4]   2> 13793 T210 C17 P55412 /update {version=2&wt=javabin} {add=[13 (1417709515967561728)]} 0 4
[junit4:junit4]   2> 13803 T248 C13 P53513 REQ /update {update.distrib=FROMLEADER&distrib.from=http://127.0.0.1:36297/solr/collection1/&version=2&wt=javabin} status=0 QTime=3 
[junit4:junit4]   2> 13804 T225 C14 P36297 /update {version=2&wt=javabin} {add=[13 (1417709515973853184)]} 0 8
[junit4:junit4]   2> 13810 T211 C17 P55412 /update {version=2&wt=javabin} {add=[14 (1417709515985387520)]} 0 3
[junit4:junit4]   2> 13823 T250 C13 P53513 REQ /update {update.distrib=FROMLEADER&distrib.from=http://127.0.0.1:36297/solr/collection1/&version=2&wt=javabin} status=0 QTime=3 
[junit4:junit4]   2> 13823 T227 C14 P36297 REQ /update {update.distrib=TOLEADER&distrib.from=http://127.0.0.1:49345/solr/collection1/&version=2&wt=javabin} status=0 QTime=8 
[junit4:junit4]   2> 13824 T238 C16 P49345 /update {version=2&wt=javabin} {add=[14]} 0 11
[junit4:junit4]   2> 13830 T213 C17 P55412 /update {version=2&wt=javabin} {add=[15 (1417709516007407616)]} 0 3
[junit4:junit4]   2> 13839 T251 C13 P53513 REQ /update {update.distrib=FROMLEADER&distrib.from=http://127.0.0.1:36297/solr/collection1/&version=2&wt=javabin} status=0 QTime=2 
[junit4:junit4]   2> 13840 T224 C14 P36297 /update {version=2&wt=javabin} {add=[15 (1417709516013699072)]} 0 7
[junit4:junit4]   2> 13846 T212 C17 P55412 /update {version=2&wt=javabin} {add=[16 (1417709516023136256)]} 0 4
[junit4:junit4]   2> 13890 T249 C13 P53513 REQ /update {update.distrib=FROMLEADER&distrib.from=http://127.0.0.1:36297/solr/collection1/&version=2&wt=javabin} status=0 QTime=22 
[junit4:junit4]   2> 13891 T225 C14 P36297 REQ /update {update.distrib=TOLEADER&distrib.from=http://127.0.0.1:49345/solr/collection1/&version=2&wt=javabin} status=0 QTime=40 
[junit4:junit4]   2> 13892 T236 C16 P49345 /update {version=2&wt=javabin} {add=[16]} 0 43
[junit4:junit4]   2> 13909 T210 C17 P55412 /update {version=2&wt=javabin} {add=[17 (1417709516082905088)]} 0 14
[junit4:junit4]   2> 13938 T264 C15 P33446 REQ /update {update.distrib=FROMLEADER&distrib.from=http://127.0.0.1:49345/solr/collection1/&version=2&wt=javabin} status=0 QTime=13 
[junit4:junit4]   2> 13939 T237 C16 P49345 /update {version=2&wt=javabin} {add=[17 (1417709516099682304)]} 0 27
[junit4:junit4]   2> 13944 T211 C17 P55412 /update {version=2&wt=javabin} {add=[100 (1417709516126945280)]} 0 2
[junit4:junit4]   2> 13957 T248 C13 P53513 REQ /update {update.distrib=FROMLEADER&distrib.from=http://127.0.0.1:36297/solr/collection1/&version=2&wt=javabin} status=0 QTime=2 
[junit4:junit4]   2> 13958 T226 C14 P36297 /update {version=2&wt=javabin} {add=[100 (1417709516132188160)]} 0 12
[junit4:junit4]   2> 13964 T213 C17 P55412 /update {version=2&wt=javabin} {add=[101 (1417709516147916800)]} 0 3
[junit4:junit4]   2> 13974 T251 C13 P53513 REQ /update {update.distrib=FROMLEADER&distrib.from=http://127.0.0.1:36297/solr/collection1/&version=2&wt=javabin} status=0 QTime=1 
[junit4:junit4]   2> 13975 T224 C14 P36297 REQ /update {update.distrib=TOLEADER&distrib.from=http://127.0.0.1:49345/solr/collection1/&version=2&wt=javabin} status=0 QTime=6 
[junit4:junit4]   2> 13976 T239 C16 P49345 /update {version=2&wt=javabin} {add=[101]} 0 9
[junit4:junit4]   2> 13999 T212 C17 P55412 /update {version=2&wt=javabin} {add=[102 (1417709516165742592)]} 0 20
[junit4:junit4]   2> 14009 T249 C13 P53513 REQ /update {update.distrib=FROMLEADER&distrib.from=http://127.0.0.1:36297/solr/collection1/&version=2&wt=javabin} status=0 QTime=2 
[junit4:junit4]   2> 14010 T225 C14 P36297 /update {version=2&wt=javabin} {add=[102 (1417709516189859840)]} 0 8
[junit4:junit4]   2> 14018 T210 C17 P55412 /update {version=2&wt=javabin} {add=[103 (1417709516202442752)]} 0 5
[junit4:junit4]   2> 14027 T262 C15 P33446 REQ /update {update.distrib=FROMLEADER&distrib.from=http://127.0.0.1:49345/solr/collection1/&version=2&wt=javabin} status=0 QTime=2 
[junit4:junit4]   2> 14028 T238 C16 P49345 /update {version=2&wt=javabin} {add=[103 (1417709516209782784)]} 0 7
[junit4:junit4]   2> 14033 T213 C17 P55412 /update {version=2&wt=javabin} {add=[104 (1417709516220268544)]} 0 2
[junit4:junit4]   2> 14049 T263 C15 P33446 REQ /update {update.distrib=FROMLEADER&distrib.from=http://127.0.0.1:49345/solr/collection1/&version=2&wt=javabin} status=0 QTime=3 
[junit4:junit4]   2> 14050 T236 C16 P49345 REQ /update {update.distrib=TOLEADER&distrib.from=http://127.0.0.1:36297/solr/collection1/&version=2&wt=javabin} status=0 QTime=10 
[junit4:junit4]   2> 14051 T227 C14 P36297 /update {version=2&wt=javabin} {add=[104]} 0 15
[junit4:junit4]   2> 14055 T212 C17 P55412 /update {version=2&wt=javabin} {add=[105 (1417709516244385792)]} 0 2
[junit4:junit4]   2> 14085 T264 C15 P33446 REQ /update {update.distrib=FROMLEADER&distrib.from=http://127.0.0.1:49345/solr/collection1/&version=2&wt=javabin} status=0 QTime=14 
[junit4:junit4]   2> 14086 T239 C16 P49345 /update {version=2&wt=javabin} {add=[105 (1417709516248580096)]} 0 29
[junit4:junit4]   2> 14090 T210 C17 P55412 /update {version=2&wt=javabin} {add=[106 (1417709516281085952)]} 0 2
[junit4:junit4]   2> 14100 T265 C15 P33446 REQ /update {update.distrib=FROMLEADER&distrib.from=http://127.0.0.1:49345/solr/collection1/&version=2&wt=javabin} status=0 QTime=3 
[junit4:junit4]   2> 14100 T238 C16 P49345 /update {version=2&wt=javabin} {add=[106 (1417709516285280256)]} 0 8
[junit4:junit4]   2> 14105 T211 C17 P55412 /update {version=2&wt=javabin} {add=[107 (1417709516295766016)]} 0 2
[junit4:junit4]   2> 14115 T250 C13 P53513 REQ /update {update.distrib=FROMLEADER&distrib.from=http://127.0.0.1:36297/solr/collection1/&version=2&wt=javabin} status=0 QTime=2 
[junit4:junit4]   2> 14116 T226 C14 P36297 REQ /update {update.distrib=TOLEADER&distrib.from=http://127.0.0.1:49345/solr/collection1/&version=2&wt=javabin} status=0 QTime=6 
[junit4:junit4]   2> 14116 T237 C16 P49345 /update {version=2&wt=javabin} {add=[107]} 0 9
[junit4:junit4]   2> 14120 T213 C17 P55412 /update {version=2&wt=javabin} {add=[108 (1417709516312543232)]} 0 1
[junit4:junit4]   2> 14130 T248 C13 P53513 REQ /update {update.distrib=FROMLEADER&distrib.from=http://127.0.0.1:36297/solr/collection1/&version=2&wt=javabin} status=0 QTime=2 
[junit4:junit4]   2> 14131 T224 C14 P36297 REQ /update {update.distrib=TOLEADER&distrib.from=http://127.0.0.1:49345/solr/collection1/&version=2&wt=javabin} status=0 QTime=6 
[junit4:junit4]   2> 14132 T236 C16 P49345 /update {version=2&wt=javabin} {add=[108]} 0 9
[junit4:junit4]   2> 14136 T212 C17 P55412 /update {version=2&wt=javabin} {add=[109 (1417709516329320448)]} 0 2
[junit4:junit4]   2> 14143 T251 C13 P53513 REQ /update {update.distrib=FROMLEADER&distrib.from=http://127.0.0.1:36297/solr/collection1/&version=2&wt=javabin} status=0 QTime=1 
[junit4:junit4]   2> 14144 T225 C14 P36297 /update {version=2&wt=javabin} {add=[109 (1417709516333514752)]} 0 6
[junit4:junit4]   2> 14148 T210 C17 P55412 /update {version=2&wt=javabin} {add=[110 (1417709516341903360)]} 0 1
[junit4:junit4]   2> 14158 T249 C13 P53513 REQ /update {update.distrib=FROMLEADER&distrib.from=http://127.0.0.1:36297/solr/collection1/&version=2&wt=javabin} status=0 QTime=2 
[junit4:junit4]   2> 14159 T227 C14 P36297 REQ /update {update.distrib=TOLEADER&distrib.from=http://127.0.0.1:49345/solr/collection1/&version=2&wt=javabin} status=0 QTime=6 
[junit4:junit4]   2> 14159 T239 C16 P49345 /update {version=2&wt=javabin} {add=[110]} 0 8
[junit4:junit4]   2> 14164 T211 C17 P55412 /update {version=2&wt=javabin} {add=[111 (1417709516357632000)]} 0 2
[junit4:junit4]   2> 14176 T250 C13 P53513 REQ /update {update.distrib=FROMLEADER&distrib.from=http://127.0.0.1:36297/solr/collection1/&version=2&wt=javabin} status=0 QTime=3 
[junit4:junit4]   2> 14177 T226 C14 P36297 REQ /update {update.distrib=TOLEADER&distrib.from=http://127.0.0.1:49345/solr/collection1/&version=2&wt=javabin} status=0 QTime=8 
[junit4:junit4]   2> 14178 T238 C16 P49345 /update {version=2&wt=javabin} {add=[111]} 0 12
[junit4:junit4]   2> 14190 T213 C17 P55412 /update {version=2&wt=javabin} {add=[112 (1417709516377554944)]} 0 9
[junit4:junit4]   2> 14202 T262 C15 P33446 REQ /update {update.distrib=FROMLEADER&distrib.from=http://127.0.0.1:49345/solr/collection1/&version=2&wt=javabin} status=0 QTime=3 
[junit4:junit4]   2> 14203 T237 C16 P49345 REQ /update {update.distrib=TOLEADER&distrib.from=http://127.0.0.1:36297/solr/collection1/&version=2&wt=javabin} status=0 QTime=8 
[junit4:junit4]   2> 14204 T224 C14 P36297 /update {version=2&wt=javabin} {add=[112]} 0 12
[junit4:junit4]   2> 14210 T212 C17 P55412 /update {version=2&wt=javabin} {add=[113 (1417709516404817920)]} 0 3
[junit4:junit4]   2> 14220 T248 C13 P53513 REQ /update {update.distrib=FROMLEADER&distrib.from=http://127.0.0.1:36297/solr/collection1/&version=2&wt=javabin} status=0 QTime=2 
[junit4:junit4]   2> 14221 T225 C14 P36297 /update {version=2&wt=javabin} {add=[113 (1417709516412157952)]} 0 8
[junit4:junit4]   2> 14226 T210 C17 P55412 /update {version=2&wt=javabin} {add=[114 (1417709516422643712)]} 0 2
[junit4:junit4]   2> 14250 T251 C13 P53513 REQ /update {update.distrib=FROMLEADER&distrib.from=http://127.0.0.1:36297/solr/collection1/&version=2&wt=javabin} status=0 QTime=10 
[junit4:junit4]   2> 14251 T227 C14 P36297 REQ /update {update.distrib=TOLEADER&distrib.from=http://127.0.0.1:49345/solr/collection1/&version=2&wt=javabin} status=0 QTime=19 
[junit4:junit4]   2> 14252 T236 C16 P49345 /update {version=2&wt=javabin} {add=[114]} 0 23
[junit4:junit4]   2> 14256 T211 C17 P55412 /update {version=2&wt=javabin} {add=[115 (1417709516455149568)]} 0 2
[junit4:junit4]   2> 14267 T263 C15 P33446 REQ /update {update.distrib=FROMLEADER&distrib.from=http://127.0.0.1:49345/solr/collection1/&version=2&wt=javabin} status=0 QTime=1 
[junit4:junit4]   2> 14268 T238 C16 P49345 REQ /update {update.distrib=TOLEADER&distrib.from=http://127.0.0.1:36297/solr/collection1/&version=2&wt=javabin} status=0 QTime=7 
[junit4:junit4]   2> 14269 T224 C14 P36297 /update {version=2&wt=javabin} {add=[115]} 0 10
[junit4:junit4]   2> 14274 T212 C17 P55412 /update {version=2&wt=javabin} {add=[116 (1417709516474023936)]} 0 2
[junit4:junit4]   2> 14284 T264 C15 P33446 REQ /update {update.distrib=FROMLEADER&distrib.from=http://127.0.0.1:49345/solr/collection1/&version=2&wt=javabin} status=0 QTime=2 
[junit4:junit4]   2> 14285 T237 C16 P49345 /update {version=2&wt=javabin} {add=[116 (1417709516479266816)]} 0 8
[junit4:junit4]   2> 14290 T210 C17 P55412 /update {version=2&wt=javabin} {add=[117 (1417709516489752576)]} 0 2
[junit4:junit4]   2> 14298 T265 C15 P33446 REQ /update {update.distrib=FROMLEADER&distrib.from=http://127.0.0.1:49345/solr/collection1/&version=2&wt=javabin} status=0 QTime=1 
[junit4:junit4]   2> 14299 T239 C16 P49345 /update {version=2&wt=javabin} {add=[117 (1417709516494995456)]} 0 6
[junit4:junit4]   2> 14304 T211 C17 P55412 /update {version=2&wt=javabin} {add=[118 (1417709516505481216)]} 0 2
[junit4:junit4]   2> 14315 T249 C13 P53513 REQ /update {update.distrib=FROMLEADER&distrib.from=http://127.0.0.1:36297/solr/collection1/&version=2&wt=javabin} status=0 QTime=2 
[junit4:junit4]   2> 14316 T225 C14 P36297 /update {version=2&wt=javabin} {add=[118 (1417709516509675520)]} 0 9
[junit4:junit4]   2> 14321 T213 C17 P55412 /update {version=2&wt=javabin} {add=[119 (1417709516523307008)]} 0 2
[junit4:junit4]   2> 14330 T262 C15 P33446 REQ /update {update.distrib=FROMLEADER&distrib.from=http://127.0.0.1:49345/solr/collection1/&version=2&wt=javabin} status=0 QTime=2 
[junit4:junit4]   2> 14330 T236 C16 P49345 /update {version=2&wt=javabin} {add=[119 (1417709516527501312)]} 0 6
[junit4:junit4]   2> 14335 T212 C17 P55412 /update {version=2&wt=javabin} {add=[120 (1417709516537987072)]} 0 2
[junit4:junit4]   2> 14344 T263 C15 P33446 REQ /update {update.distrib=FROMLEADER&distrib.from=http://127.0.0.1:49345/solr/collection1/&version=2&wt=javabin} status=0 QTime=2 
[junit4:junit4]   2> 14344 T238 C16 P49345 /update {version=2&wt=javabin} {add=[120 (1417709516542181376)]} 0 6
[junit4:junit4]   2> 14349 T210 C17 P55412 /update {version=2&wt=javabin} {add=[121 (1417709516551618560)]} 0 2
[junit4:junit4]   2> 14357 T265 C15 P33446 REQ /update {update.distrib=FROMLEADER&distrib.from=http://127.0.0.1:49345/solr/collection1/&version=2&wt=javabin} status=0 QTime=1 
[junit4:junit4]   2> 14358 T237 C16 P49345 /update {version=2&wt=javabin} {add=[121 (1417709516556861440)]} 0 7
[junit4:junit4]   2> 14368 T211 C17 P55412 /update {version=2&wt=javabin} {add=[122 (1417709516566298624)]} 0 7
[junit4:junit4]   2> 14377 T250 C13 P53513 REQ /update {update.distrib=FROMLEADER&distrib.from=http://127.0.0.1:36297/solr/collection1/&version=2&wt=javabin} status=0 QTime=3 
[junit4:junit4]   2> 14379 T226 C14 P36297 /update {version=2&wt=javabin} {add=[122 (1417709516576784384)]} 0 9
[junit4:junit4]   2> 14408 T213 C17 P55412 /update {version=2&wt=javabin} {add=[123 (1417709516589367296)]} 0 26
[junit4:junit4]   2> 14421 T251 C13 P53513 REQ /update {update.distrib=FROMLEADER&distrib.from=http://127.0.0.1:36297/solr/collection1/&version=2&wt=javabin} status=0 QTime=3 
[junit4:junit4]   2> 14423 T224 C14 P36297 REQ /update {update.distrib=TOLEADER&distrib.from=http://127.0.0.1:49345/solr/collection1/&version=2&wt=javabin} status=0 QTime=9 
[junit4:junit4]   2> 14423 T239 C16 P49345 /update {version=2&wt=javabin} {add=[123]} 0 12
[junit4:junit4]   2> 14429 T212 C17 P55412 /update {version=2&wt=javabin} {add=[124 (1417709516636553216)]} 0 2
[junit4:junit4]   2> 14444 T249 C13 P53513 REQ /update {update.distrib=FROMLEADER&distrib.from=http://127.0.0.1:36297/solr/collection1/&version=2&wt=javabin} status=0 QTime=3 
[junit4:junit4]   2> 14445 T225 C14 P36297 REQ /update {update.distrib=TOLEADER&distrib.from=http://127.0.0.1:49345/solr/collection1/&version=2&wt=javabin} status=0 QTime=8 
[junit4:junit4]   2> 14446 T236 C16 P49345 /update {version=2&wt=javabin} {add=[124]} 0 12
[junit4:junit4]   2> 14453 T211 C17 P55412 /update {version=2&wt=javabin} {add=[125 (1417709516660670464)]} 0 3
[junit4:junit4]   2> 14463 T248 C13 P53513 REQ /update {update.distrib=FROMLEADER&distrib.from=http://127.0.0.1:36297/solr/collection1/&version=2&wt=javabin} status=0 QTime=2 
[junit4:junit4]   2> 14463 T227 C14 P36297 REQ /update {update.distrib=TOLEADER&distrib.from=http://127.0.0.1:49345/solr/collection1/&version=2&wt=javabin} status=0 QTime=6 
[junit4:junit4]   2> 14464 T238 C16 P49345 /update {version=2&wt=javabin} {add=[125]} 0 9
[junit4:junit4]   2> 14468 T213 C17 P55412 /update {version=2&wt=javabin} {add=[126 (1417709516677447680)]} 0 2
[junit4:junit4]   2> 14478 T262 C15 P33446 REQ /update {update.distrib=FROMLEADER&distrib.from=http://127.0.0.1:49345/solr/collection1/&version=2&wt=javabin} status=0 QTime=1 
[junit4:junit4]   2> 14478 T237 C16 P49345 /update {version=2&wt=javabin} {add=[126 (1417709516682690560)]} 0 7
[junit4:junit4]   2> 14483 T210 C17 P55412 /update {version=2&wt=javabin} {add=[127 (1417709516693176320)]} 0 2
[junit4:junit4]   2> 14505 T263 C15 P33446 REQ /update {update.distrib=FROMLEADER&distrib.from=http://127.0.0.1:49345/solr/collection1/&version=2&wt=javabin} status=0 QTime=9 
[junit4:junit4]   2> 14506 T239 C16 P49345 REQ /update {update.distrib=TOLEADER&distrib.from=http://127.0.0.1:36297/solr/collection1/&version=2&wt=javabin} status=0 QTime=18 
[junit4:junit4]   2> 14508 T226 C14 P36297 /update {version=2&wt=javabin} {add=[127]} 0 22
[junit4:junit4]   2> 14518 T212 C17 P55412 /update {version=2&wt=javabin} {add=[128 (1417709516728827904)]} 0 2
[junit4:junit4]   2> 14532 T265 C15 P33446 REQ /update {update.distrib=FROMLEADER&distrib.from=http://127.0.0.1:49345/solr/collection1/&version=2&wt=javabin} status=0 QTime=3 
[junit4:junit4]   2> 14534 T238 C16 P49345 REQ /update {update.distrib=TOLEADER&distrib.from=http://127.0.0.1:36297/solr/collection1/&version=2&wt=javabin} status=0 QTime=10 
[junit4:junit4]   2> 14535 T224 C14 P36297 /update {version=2&wt=javabin} {add=[128]} 0 14
[junit4:junit4]   2> 14540 T211 C17 P55412 /update {version=2&wt=javabin} {add=[129 (1417709516751896576)]} 0 2
[junit4:junit4]   2> 14550 T251 C13 P53513 REQ /update {update.distrib=FROMLEADER&distrib.from=http://127.0.0.1:36297/solr/collection1/&version=2&wt=javabin} status=0 QTime=2 
[junit4:junit4]   2> 14551 T225 C14 P36297 /update {version=2&wt=javabin} {add=[129 (1417709516758188032)]} 0 8
[junit4:junit4]   2> 14557 T213 C17 P55412 /update {version=2&wt=javabin} {add=[130 (1417709516769722368)]} 0 3
[junit4:junit4]   2> 14569 T264 C15 P33446 REQ /update {update.distrib=FROMLEADER&distrib.from=http://127.0.0.1:49345/solr/collection1/&version=2&wt=javabin} status=0 QTime=2 
[junit4:junit4]   2> 14570 T237 C16 P49345 REQ /update {update.distrib=TOLEADER&distrib.from=http://127.0.0.1:36297/solr/collection1/&version=2&wt=javabin} status=0 QTime=8 
[junit4:junit4]   2> 14571 T227 C14 P36297 /update {version=2&wt=javabin} {add=[130]} 0 11
[junit4:junit4]   2> 14576 T210 C17 P55412 /update {version=2&wt=javabin} {add=[131 (1417709516790693888)]} 0 2
[junit4:junit4]   2> 14588 T262 C15 P33446 REQ /update {update.distr

[...truncated too long message...]

ile.encoding=UTF-8
[junit4:junit4] FAILURE 17.3s J1 | BasicDistributedZk2Test.testDistribSearch <<<
[junit4:junit4]    > Throwable #1: junit.framework.AssertionFailedError: .doc[a_si][0]:org.apache.lucene.document.LazyDocument$LazyField:org.apache.lucene.document.LazyDocument$LazyField@3cf42d45!=org.apache.lucene.document.LazyDocument$LazyField:org.apache.lucene.document.LazyDocument$LazyField@e81454fc
[junit4:junit4]    > 	at __randomizedtesting.SeedInfo.seed([E1BA296842910361:605CA77035CE635D]:0)
[junit4:junit4]    > 	at junit.framework.Assert.fail(Assert.java:50)
[junit4:junit4]    > 	at org.apache.solr.BaseDistributedSearchTestCase.compareResponses(BaseDistributedSearchTestCase.java:686)
[junit4:junit4]    > 	at org.apache.solr.BaseDistributedSearchTestCase.query(BaseDistributedSearchTestCase.java:396)
[junit4:junit4]    > 	at org.apache.solr.BaseDistributedSearchTestCase.query(BaseDistributedSearchTestCase.java:376)
[junit4:junit4]    > 	at org.apache.solr.cloud.AbstractFullDistribZkTestBase.checkQueries(AbstractFullDistribZkTestBase.java:570)
[junit4:junit4]    > 	at org.apache.solr.cloud.BasicDistributedZk2Test.doTest(BasicDistributedZk2Test.java:77)
[junit4:junit4]    > 	at org.apache.solr.BaseDistributedSearchTestCase.testDistribSearch(BaseDistributedSearchTestCase.java:695)
[junit4:junit4]    > 	at sun.reflect.NativeMethodAccessorImpl.invoke0(Native Method)
[junit4:junit4]    > 	at sun.reflect.NativeMethodAccessorImpl.invoke(NativeMethodAccessorImpl.java:88)
[junit4:junit4]    > 	at sun.reflect.DelegatingMethodAccessorImpl.invoke(DelegatingMethodAccessorImpl.java:55)
[junit4:junit4]    > 	at java.lang.reflect.Method.invoke(Method.java:613)
[junit4:junit4]    > 	at com.carrotsearch.randomizedtesting.RandomizedRunner.invoke(RandomizedRunner.java:1559)
[junit4:junit4]    > 	at com.carrotsearch.randomizedtesting.RandomizedRunner.access$600(RandomizedRunner.java:79)
[junit4:junit4]    > 	at com.carrotsearch.randomizedtesting.RandomizedRunner$6.evaluate(RandomizedRunner.java:737)
[junit4:junit4]    > 	at com.carrotsearch.randomizedtesting.RandomizedRunner$7.evaluate(RandomizedRunner.java:773)
[junit4:junit4]    > 	at com.carrotsearch.randomizedtesting.RandomizedRunner$8.evaluate(RandomizedRunner.java:787)
[junit4:junit4]    > 	at com.carrotsearch.randomizedtesting.rules.SystemPropertiesRestoreRule$1.evaluate(SystemPropertiesRestoreRule.java:53)
[junit4:junit4]    > 	at org.apache.lucene.util.TestRuleSetupTeardownChained$1.evaluate(TestRuleSetupTeardownChained.java:50)
[junit4:junit4]    > 	at org.apache.lucene.util.TestRuleFieldCacheSanity$1.evaluate(TestRuleFieldCacheSanity.java:51)
[junit4:junit4]    > 	at org.apache.lucene.util.AbstractBeforeAfterRule$1.evaluate(AbstractBeforeAfterRule.java:45)
[junit4:junit4]    > 	at com.carrotsearch.randomizedtesting.rules.SystemPropertiesInvariantRule$1.evaluate(SystemPropertiesInvariantRule.java:55)
[junit4:junit4]    > 	at org.apache.lucene.util.TestRuleThreadAndTestName$1.evaluate(TestRuleThreadAndTestName.java:48)
[junit4:junit4]    > 	at org.apache.lucene.util.TestRuleIgnoreAfterMaxFailures$1.evaluate(TestRuleIgnoreAfterMaxFailures.java:70)
[junit4:junit4]    > 	at org.apache.lucene.util.TestRuleMarkFailure$1.evaluate(TestRuleMarkFailure.java:48)
[junit4:junit4]    > 	at com.carrotsearch.randomizedtesting.rules.StatementAdapter.evaluate(StatementAdapter.java:36)
[junit4:junit4]    > 	at com.carrotsearch.randomizedtesting.ThreadLeakControl$StatementRunner.run(ThreadLeakControl.java:358)
[junit4:junit4]    > 	at com.carrotsearch.randomizedtesting.ThreadLeakControl.forkTimeoutingTask(ThreadLeakControl.java:782)
[junit4:junit4]    > 	at com.carrotsearch.randomizedtesting.ThreadLeakControl$3.evaluate(ThreadLeakControl.java:442)
[junit4:junit4]    > 	at com.carrotsearch.randomizedtesting.RandomizedRunner.runSingleTest(RandomizedRunner.java:746)
[junit4:junit4]    > 	at com.carrotsearch.randomizedtesting.RandomizedRunner$3.evaluate(RandomizedRunner.java:648)
[junit4:junit4]    > 	at com.carrotsearch.randomizedtesting.RandomizedRunner$4.evaluate(RandomizedRunner.java:682)
[junit4:junit4]    > 	at com.carrotsearch.randomizedtesting.RandomizedRunner$5.evaluate(RandomizedRunner.java:693)
[junit4:junit4]    > 	at com.carrotsearch.randomizedtesting.rules.StatementAdapter.evaluate(StatementAdapter.java:36)
[junit4:junit4]    > 	at com.carrotsearch.randomizedtesting.rules.SystemPropertiesRestoreRule$1.evaluate(SystemPropertiesRestoreRule.java:53)
[junit4:junit4]    > 	at org.apache.lucene.util.AbstractBeforeAfterRule$1.evaluate(AbstractBeforeAfterRule.java:45)
[junit4:junit4]    > 	at org.apache.lucene.util.TestRuleStoreClassName$1.evaluate(TestRuleStoreClassName.java:42)
[junit4:junit4]    > 	at com.carrotsearch.randomizedtesting.rules.SystemPropertiesInvariantRule$1.evaluate(SystemPropertiesInvariantRule.java:55)
[junit4:junit4]    > 	at com.carrotsearch.randomizedtesting.rules.NoShadowingOrOverridesOnMethodsRule$1.evaluate(NoShadowingOrOverridesOnMethodsRule.java:39)
[junit4:junit4]    > 	at com.carrotsearch.randomizedtesting.rules.NoShadowingOrOverridesOnMethodsRule$1.evaluate(NoShadowingOrOverridesOnMethodsRule.java:39)
[junit4:junit4]    > 	at com.carrotsearch.randomizedtesting.rules.StatementAdapter.evaluate(StatementAdapter.java:36)
[junit4:junit4]    > 	at org.apache.lucene.util.TestRuleAssertionsRequired$1.evaluate(TestRuleAssertionsRequired.java:43)
[junit4:junit4]    > 	at org.apache.lucene.util.TestRuleMarkFailure$1.evaluate(TestRuleMarkFailure.java:48)
[junit4:junit4]    > 	at org.apache.lucene.util.TestRuleIgnoreAfterMaxFailures$1.evaluate(TestRuleIgnoreAfterMaxFailures.java:70)
[junit4:junit4]    > 	at org.apache.lucene.util.TestRuleIgnoreTestSuites$1.evaluate(TestRuleIgnoreTestSuites.java:55)
[junit4:junit4]    > 	at com.carrotsearch.randomizedtesting.rules.StatementAdapter.evaluate(StatementAdapter.java:36)
[junit4:junit4]    > 	at com.carrotsearch.randomizedtesting.ThreadLeakControl$StatementRunner.run(ThreadLeakControl.java:358)
[junit4:junit4]    > 	at java.lang.Thread.run(Thread.java:779)
[junit4:junit4]   2> 17298 T2412 oas.SolrTestCaseJ4.deleteCore ###deleteCore
[junit4:junit4]   2> NOTE: test params are: codec=SimpleText, sim=DefaultSimilarity, locale=es_HN, timezone=Africa/Ouagadougou
[junit4:junit4]   2> NOTE: Linux 3.2.0-32-generic amd64/IBM Corporation 1.7.0 (64-bit)/cpus=8,threads=1,free=87057216,total=182779904
[junit4:junit4]   2> NOTE: All tests run in this JVM: [BasicFunctionalityTest, TestRecovery, TestSort, SuggesterTSTTest, TestPluginEnable, TestPropInjectDefaults, DistributedQueryElevationComponentTest, ReturnFieldsTest, PrimUtilsTest, TermVectorComponentTest, TimeZoneUtilsTest, LukeRequestHandlerTest, BasicZkTest, LegacyHTMLStripCharFilterTest, TestStressLucene, TestLRUCache, RequiredFieldsTest, ZkCLITest, TestSolrDeletionPolicy1, UUIDFieldTest, HighlighterTest, TestUpdate, PingRequestHandlerTest, QueryParsingTest, ZkSolrClientTest, TestArbitraryIndexDir, URLClassifyProcessorTest, TestOmitPositions, TestDistributedSearch, TestSolrDeletionPolicy2, TestDocumentBuilder, SuggesterTest, SolrIndexConfigTest, SoftAutoCommitTest, TestRealTimeGet, DebugComponentTest, RecoveryZkTest, TestQueryUtils, TestJmxIntegration, EchoParamsTest, TestReplicationHandler, DirectUpdateHandlerTest, TestMultiCoreConfBootstrap, XsltUpdateRequestHandlerTest, IndexSchemaRuntimeFieldTest, DisMaxRequestHandlerTest, TestPropInject, TestDFRSimilarityFactory, SimplePostToolTest, LeaderElectionTest, ScriptEngineTest, ClusterStateTest, OutputWriterTest, TestRemoteStreaming, IndexSchemaTest, OverseerTest, FullSolrCloudDistribCmdsTest, LeaderElectionIntegrationTest, DistributedSpellCheckComponentTest, TestDistributedGrouping, SpellCheckCollatorTest, AutoCommitTest, WordBreakSolrSpellCheckerTest, TestHashPartitioner, StatsComponentTest, TestRangeQuery, ConvertedLegacyTest, PeerSyncTest, SignatureUpdateProcessorFactoryTest, SampleTest, TestIndexSearcher, CoreAdminHandlerTest, TestFunctionQuery, TestTrie, CacheHeaderTest, TestWordDelimiterFilterFactory, PolyFieldTest, TestCSVResponseWriter, MBeansHandlerTest, TermsComponentTest, SolrInfoMBeanTest, TestPHPSerializedResponseWriter, SuggesterWFSTTest, DocumentAnalysisRequestHandlerTest, SolrPluginUtilsTest, FastVectorHighlighterTest, SolrCmdDistributorTest, TestLuceneMatchVersion, TestWriterPerf, NoCacheHeaderTest, AlternateDirectoryTest, BadComponentTest, TestBinaryField, SOLR749Test, TestMergePolicyConfig, TestLFUCache, TestCollationField, IndexReaderFactoryTest, TestSolrCoreProperties, TestBM25SimilarityFactory, TestPhraseSuggestions, TestCodecSupport, TestFastLRUCache, FileUtilsTest, TestSolrXMLSerializer, DOMUtilTest, RAMDirectoryFactoryTest, PathHierarchyTokenizerFactoryTest, BasicDistributedZk2Test]
[junit4:junit4] Completed on J1 in 17.32s, 1 test, 1 failure <<< FAILURES!

[...truncated 56 lines...]
BUILD FAILED
/mnt/ssd/jenkins/workspace/Lucene-Solr-4.x-Linux/build.xml:348: The following error occurred while executing this line:
/mnt/ssd/jenkins/workspace/Lucene-Solr-4.x-Linux/build.xml:39: The following error occurred while executing this line:
/mnt/ssd/jenkins/workspace/Lucene-Solr-4.x-Linux/solr/build.xml:178: The following error occurred while executing this line:
/mnt/ssd/jenkins/workspace/Lucene-Solr-4.x-Linux/lucene/module-build.xml:61: The following error occurred while executing this line:
/mnt/ssd/jenkins/workspace/Lucene-Solr-4.x-Linux/lucene/common-build.xml:1163: The following error occurred while executing this line:
/mnt/ssd/jenkins/workspace/Lucene-Solr-4.x-Linux/lucene/common-build.xml:827: There were test failures: 233 suites, 965 tests, 4 errors, 2 failures, 8 ignored (3 assumptions)

Total time: 23 minutes 27 seconds
Build step 'Invoke Ant' marked build as failure
Archiving artifacts
Recording test results
Description set: Java: 64bit/ibm-j9-jdk7 -Xjit:exclude={org/apache/lucene/util/fst/FST.pack(IIF)Lorg/apache/lucene/util/fst/FST;}
Email was triggered for: Failure
Sending email for trigger: Failure



Mime
View raw message