lucene-dev mailing list archives

Site index · List index
Message view « Date » · « Thread »
Top « Date » · « Thread »
From Policeman Jenkins Server <jenk...@sd-datasolutions.de>
Subject [JENKINS] Lucene-Solr-trunk-Windows (32bit/jdk1.6.0_37) - Build # 1427 - Failure!
Date Sat, 03 Nov 2012 21:52:59 GMT
Build: http://jenkins.sd-datasolutions.de/job/Lucene-Solr-trunk-Windows/1427/
Java: 32bit/jdk1.6.0_37 -client -XX:+UseSerialGC

4 tests failed.
REGRESSION:  org.apache.solr.cloud.BasicDistributedZk2Test.testDistribSearch

Error Message:
Server at http://127.0.0.1:63173/solr/collection1 returned non ok status:503, message:Server is shutting down

Stack Trace:
org.apache.solr.common.SolrException: Server at http://127.0.0.1:63173/solr/collection1 returned non ok status:503, message:Server is shutting down
	at __randomizedtesting.SeedInfo.seed([6D097EBC7284C687:ECEFF0A405DBA6BB]:0)
	at org.apache.solr.client.solrj.impl.HttpSolrServer.request(HttpSolrServer.java:372)
	at org.apache.solr.client.solrj.impl.HttpSolrServer.request(HttpSolrServer.java:181)
	at org.apache.solr.client.solrj.request.AbstractUpdateRequest.process(AbstractUpdateRequest.java:117)
	at org.apache.solr.client.solrj.SolrServer.add(SolrServer.java:116)
	at org.apache.solr.client.solrj.SolrServer.add(SolrServer.java:102)
	at org.apache.solr.cloud.AbstractFullDistribZkTestBase.indexDoc(AbstractFullDistribZkTestBase.java:480)
	at org.apache.solr.BaseDistributedSearchTestCase.indexr(BaseDistributedSearchTestCase.java:293)
	at org.apache.solr.cloud.BasicDistributedZk2Test.doTest(BasicDistributedZk2Test.java:67)
	at org.apache.solr.BaseDistributedSearchTestCase.testDistribSearch(BaseDistributedSearchTestCase.java:695)
	at sun.reflect.NativeMethodAccessorImpl.invoke0(Native Method)
	at sun.reflect.NativeMethodAccessorImpl.invoke(NativeMethodAccessorImpl.java:39)
	at sun.reflect.DelegatingMethodAccessorImpl.invoke(DelegatingMethodAccessorImpl.java:25)
	at java.lang.reflect.Method.invoke(Method.java:597)
	at com.carrotsearch.randomizedtesting.RandomizedRunner.invoke(RandomizedRunner.java:1559)
	at com.carrotsearch.randomizedtesting.RandomizedRunner.access$600(RandomizedRunner.java:79)
	at com.carrotsearch.randomizedtesting.RandomizedRunner$6.evaluate(RandomizedRunner.java:737)
	at com.carrotsearch.randomizedtesting.RandomizedRunner$7.evaluate(RandomizedRunner.java:773)
	at com.carrotsearch.randomizedtesting.RandomizedRunner$8.evaluate(RandomizedRunner.java:787)
	at com.carrotsearch.randomizedtesting.rules.SystemPropertiesRestoreRule$1.evaluate(SystemPropertiesRestoreRule.java:53)
	at org.apache.lucene.util.TestRuleSetupTeardownChained$1.evaluate(TestRuleSetupTeardownChained.java:50)
	at org.apache.lucene.util.TestRuleFieldCacheSanity$1.evaluate(TestRuleFieldCacheSanity.java:51)
	at org.apache.lucene.util.AbstractBeforeAfterRule$1.evaluate(AbstractBeforeAfterRule.java:45)
	at com.carrotsearch.randomizedtesting.rules.SystemPropertiesInvariantRule$1.evaluate(SystemPropertiesInvariantRule.java:55)
	at org.apache.lucene.util.TestRuleThreadAndTestName$1.evaluate(TestRuleThreadAndTestName.java:48)
	at org.apache.lucene.util.TestRuleIgnoreAfterMaxFailures$1.evaluate(TestRuleIgnoreAfterMaxFailures.java:70)
	at org.apache.lucene.util.TestRuleMarkFailure$1.evaluate(TestRuleMarkFailure.java:48)
	at com.carrotsearch.randomizedtesting.rules.StatementAdapter.evaluate(StatementAdapter.java:36)
	at com.carrotsearch.randomizedtesting.ThreadLeakControl$StatementRunner.run(ThreadLeakControl.java:358)
	at com.carrotsearch.randomizedtesting.ThreadLeakControl.forkTimeoutingTask(ThreadLeakControl.java:782)
	at com.carrotsearch.randomizedtesting.ThreadLeakControl$3.evaluate(ThreadLeakControl.java:442)
	at com.carrotsearch.randomizedtesting.RandomizedRunner.runSingleTest(RandomizedRunner.java:746)
	at com.carrotsearch.randomizedtesting.RandomizedRunner$3.evaluate(RandomizedRunner.java:648)
	at com.carrotsearch.randomizedtesting.RandomizedRunner$4.evaluate(RandomizedRunner.java:682)
	at com.carrotsearch.randomizedtesting.RandomizedRunner$5.evaluate(RandomizedRunner.java:693)
	at com.carrotsearch.randomizedtesting.rules.StatementAdapter.evaluate(StatementAdapter.java:36)
	at com.carrotsearch.randomizedtesting.rules.SystemPropertiesRestoreRule$1.evaluate(SystemPropertiesRestoreRule.java:53)
	at org.apache.lucene.util.AbstractBeforeAfterRule$1.evaluate(AbstractBeforeAfterRule.java:45)
	at org.apache.lucene.util.TestRuleStoreClassName$1.evaluate(TestRuleStoreClassName.java:42)
	at com.carrotsearch.randomizedtesting.rules.SystemPropertiesInvariantRule$1.evaluate(SystemPropertiesInvariantRule.java:55)
	at com.carrotsearch.randomizedtesting.rules.NoShadowingOrOverridesOnMethodsRule$1.evaluate(NoShadowingOrOverridesOnMethodsRule.java:39)
	at com.carrotsearch.randomizedtesting.rules.NoShadowingOrOverridesOnMethodsRule$1.evaluate(NoShadowingOrOverridesOnMethodsRule.java:39)
	at com.carrotsearch.randomizedtesting.rules.StatementAdapter.evaluate(StatementAdapter.java:36)
	at org.apache.lucene.util.TestRuleAssertionsRequired$1.evaluate(TestRuleAssertionsRequired.java:43)
	at org.apache.lucene.util.TestRuleMarkFailure$1.evaluate(TestRuleMarkFailure.java:48)
	at org.apache.lucene.util.TestRuleIgnoreAfterMaxFailures$1.evaluate(TestRuleIgnoreAfterMaxFailures.java:70)
	at org.apache.lucene.util.TestRuleIgnoreTestSuites$1.evaluate(TestRuleIgnoreTestSuites.java:55)
	at com.carrotsearch.randomizedtesting.rules.StatementAdapter.evaluate(StatementAdapter.java:36)
	at com.carrotsearch.randomizedtesting.ThreadLeakControl$StatementRunner.run(ThreadLeakControl.java:358)
	at java.lang.Thread.run(Thread.java:662)


FAILED:  junit.framework.TestSuite.org.apache.solr.cloud.BasicDistributedZk2Test

Error Message:
ERROR: SolrZkClient opens=9 closes=8

Stack Trace:
java.lang.AssertionError: ERROR: SolrZkClient opens=9 closes=8
	at __randomizedtesting.SeedInfo.seed([6D097EBC7284C687]:0)
	at org.junit.Assert.fail(Assert.java:93)
	at org.apache.solr.SolrTestCaseJ4.endTrackingZkClients(SolrTestCaseJ4.java:258)
	at org.apache.solr.SolrTestCaseJ4.afterClass(SolrTestCaseJ4.java:98)
	at sun.reflect.NativeMethodAccessorImpl.invoke0(Native Method)
	at sun.reflect.NativeMethodAccessorImpl.invoke(NativeMethodAccessorImpl.java:39)
	at sun.reflect.DelegatingMethodAccessorImpl.invoke(DelegatingMethodAccessorImpl.java:25)
	at java.lang.reflect.Method.invoke(Method.java:597)
	at com.carrotsearch.randomizedtesting.RandomizedRunner.invoke(RandomizedRunner.java:1559)
	at com.carrotsearch.randomizedtesting.RandomizedRunner.access$600(RandomizedRunner.java:79)
	at com.carrotsearch.randomizedtesting.RandomizedRunner$5.evaluate(RandomizedRunner.java:700)
	at com.carrotsearch.randomizedtesting.rules.StatementAdapter.evaluate(StatementAdapter.java:36)
	at com.carrotsearch.randomizedtesting.rules.SystemPropertiesRestoreRule$1.evaluate(SystemPropertiesRestoreRule.java:53)
	at org.apache.lucene.util.AbstractBeforeAfterRule$1.evaluate(AbstractBeforeAfterRule.java:45)
	at org.apache.lucene.util.TestRuleStoreClassName$1.evaluate(TestRuleStoreClassName.java:42)
	at com.carrotsearch.randomizedtesting.rules.SystemPropertiesInvariantRule$1.evaluate(SystemPropertiesInvariantRule.java:55)
	at com.carrotsearch.randomizedtesting.rules.NoShadowingOrOverridesOnMethodsRule$1.evaluate(NoShadowingOrOverridesOnMethodsRule.java:39)
	at com.carrotsearch.randomizedtesting.rules.NoShadowingOrOverridesOnMethodsRule$1.evaluate(NoShadowingOrOverridesOnMethodsRule.java:39)
	at com.carrotsearch.randomizedtesting.rules.StatementAdapter.evaluate(StatementAdapter.java:36)
	at org.apache.lucene.util.TestRuleAssertionsRequired$1.evaluate(TestRuleAssertionsRequired.java:43)
	at org.apache.lucene.util.TestRuleMarkFailure$1.evaluate(TestRuleMarkFailure.java:48)
	at org.apache.lucene.util.TestRuleIgnoreAfterMaxFailures$1.evaluate(TestRuleIgnoreAfterMaxFailures.java:70)
	at org.apache.lucene.util.TestRuleIgnoreTestSuites$1.evaluate(TestRuleIgnoreTestSuites.java:55)
	at com.carrotsearch.randomizedtesting.rules.StatementAdapter.evaluate(StatementAdapter.java:36)
	at com.carrotsearch.randomizedtesting.ThreadLeakControl$StatementRunner.run(ThreadLeakControl.java:358)
	at java.lang.Thread.run(Thread.java:662)


FAILED:  junit.framework.TestSuite.org.apache.solr.cloud.BasicDistributedZk2Test

Error Message:
2 threads leaked from SUITE scope at org.apache.solr.cloud.BasicDistributedZk2Test:     1) Thread[id=173, name=TEST-BasicDistributedZk2Test.testDistribSearch-seed#[6D097EBC7284C687]-EventThread, state=WAITING, group=TGRP-BasicDistributedZk2Test]         at sun.misc.Unsafe.park(Native Method)         at java.util.concurrent.locks.LockSupport.park(LockSupport.java:156)         at java.util.concurrent.locks.AbstractQueuedSynchronizer$ConditionObject.await(AbstractQueuedSynchronizer.java:1987)         at java.util.concurrent.LinkedBlockingQueue.take(LinkedBlockingQueue.java:399)         at org.apache.zookeeper.ClientCnxn$EventThread.run(ClientCnxn.java:498)    2) Thread[id=172, name=TEST-BasicDistributedZk2Test.testDistribSearch-seed#[6D097EBC7284C687]-SendThread(127.0.0.1:63166), state=TIMED_WAITING, group=TGRP-BasicDistributedZk2Test]         at java.lang.Thread.sleep(Native Method)         at org.apache.zookeeper.ClientCnxn$SendThread.startConnect(ClientCnxn.java:1045)         at org.apache.zookeeper.ClientCnxn$SendThread.run(ClientCnxn.java:1101)

Stack Trace:
com.carrotsearch.randomizedtesting.ThreadLeakError: 2 threads leaked from SUITE scope at org.apache.solr.cloud.BasicDistributedZk2Test: 
   1) Thread[id=173, name=TEST-BasicDistributedZk2Test.testDistribSearch-seed#[6D097EBC7284C687]-EventThread, state=WAITING, group=TGRP-BasicDistributedZk2Test]
        at sun.misc.Unsafe.park(Native Method)
        at java.util.concurrent.locks.LockSupport.park(LockSupport.java:156)
        at java.util.concurrent.locks.AbstractQueuedSynchronizer$ConditionObject.await(AbstractQueuedSynchronizer.java:1987)
        at java.util.concurrent.LinkedBlockingQueue.take(LinkedBlockingQueue.java:399)
        at org.apache.zookeeper.ClientCnxn$EventThread.run(ClientCnxn.java:498)
   2) Thread[id=172, name=TEST-BasicDistributedZk2Test.testDistribSearch-seed#[6D097EBC7284C687]-SendThread(127.0.0.1:63166), state=TIMED_WAITING, group=TGRP-BasicDistributedZk2Test]
        at java.lang.Thread.sleep(Native Method)
        at org.apache.zookeeper.ClientCnxn$SendThread.startConnect(ClientCnxn.java:1045)
        at org.apache.zookeeper.ClientCnxn$SendThread.run(ClientCnxn.java:1101)
	at __randomizedtesting.SeedInfo.seed([6D097EBC7284C687]:0)


FAILED:  junit.framework.TestSuite.org.apache.solr.cloud.BasicDistributedZk2Test

Error Message:
There are still zombie threads that couldn't be terminated:    1) Thread[id=172, name=TEST-BasicDistributedZk2Test.testDistribSearch-seed#[6D097EBC7284C687]-SendThread(127.0.0.1:63166), state=TIMED_WAITING, group=TGRP-BasicDistributedZk2Test]         at java.lang.Thread.sleep(Native Method)         at org.apache.zookeeper.ClientCnxn$SendThread.startConnect(ClientCnxn.java:1038)         at org.apache.zookeeper.ClientCnxn$SendThread.run(ClientCnxn.java:1101)

Stack Trace:
com.carrotsearch.randomizedtesting.ThreadLeakError: There are still zombie threads that couldn't be terminated:
   1) Thread[id=172, name=TEST-BasicDistributedZk2Test.testDistribSearch-seed#[6D097EBC7284C687]-SendThread(127.0.0.1:63166), state=TIMED_WAITING, group=TGRP-BasicDistributedZk2Test]
        at java.lang.Thread.sleep(Native Method)
        at org.apache.zookeeper.ClientCnxn$SendThread.startConnect(ClientCnxn.java:1038)
        at org.apache.zookeeper.ClientCnxn$SendThread.run(ClientCnxn.java:1101)
	at __randomizedtesting.SeedInfo.seed([6D097EBC7284C687]:0)




Build Log:
[...truncated 7838 lines...]
[junit4:junit4] Suite: org.apache.solr.cloud.BasicDistributedZk2Test
[junit4:junit4]   2> 16 T151 oas.SolrTestCaseJ4.setUp ###Starting testDistribSearch
[junit4:junit4]   2> Creating dataDir: C:\Users\JenkinsSlave\workspace\Lucene-Solr-trunk-Windows\solr\build\solr-core\test\J0\.\solrtest-BasicDistributedZk2Test-1351979480244
[junit4:junit4]   2> 16 T151 oasc.ZkTestServer.run STARTING ZK TEST SERVER
[junit4:junit4]   2> 110 T152 oaz.Environment.logEnv Server environment:zookeeper.version=3.3.6-1366786, built on 07/29/2012 06:22 GMT
[junit4:junit4]   2> 110 T152 oaz.Environment.logEnv Server environment:host.name=JenkinsSlave-PC
[junit4:junit4]   2> 110 T152 oaz.Environment.logEnv Server environment:java.version=1.6.0_37
[junit4:junit4]   2> 110 T152 oaz.Environment.logEnv Server environment:java.vendor=Sun Microsystems Inc.
[junit4:junit4]   2> 110 T152 oaz.Environment.logEnv Server environment:java.home=C:\Users\JenkinsSlave\tools\java\32bit\jdk1.6.0_37\jre
[junit4:junit4]   2> 110 T152 oaz.Environment.logEnv Server environment:java.class.path=C:\Users\JenkinsSlave\workspace\Lucene-Solr-trunk-Windows\solr\build\solr-core\classes\test;C:\Users\JenkinsSlave\workspace\Lucene-Solr-trunk-Windows\solr\build\solr-test-framework\classes\java;C:\Users\JenkinsSlave\workspace\Lucene-Solr-trunk-Windows\solr\build\solr-core\test-files;C:\Users\JenkinsSlave\workspace\Lucene-Solr-trunk-Windows\lucene\build\test-framework\classes\java;C:\Users\JenkinsSlave\workspace\Lucene-Solr-trunk-Windows\lucene\build\codecs\classes\java;C:\Users\JenkinsSlave\workspace\Lucene-Solr-trunk-Windows\solr\build\solr-solrj\classes\java;C:\Users\JenkinsSlave\workspace\Lucene-Solr-trunk-Windows\solr\build\solr-core\classes\java;C:\Users\JenkinsSlave\workspace\Lucene-Solr-trunk-Windows\lucene\build\analysis\common\lucene-analyzers-common-5.0-SNAPSHOT.jar;C:\Users\JenkinsSlave\workspace\Lucene-Solr-trunk-Windows\lucene\build\analysis\kuromoji\lucene-analyzers-kuromoji-5.0-SNAPSHOT.jar;C:\Users\JenkinsSlave\workspace\Lucene-Solr-trunk-Windows\lucene\build\analysis\phonetic\lucene-analyzers-phonetic-5.0-SNAPSHOT.jar;C:\Users\JenkinsSlave\workspace\Lucene-Solr-trunk-Windows\lucene\build\highlighter\lucene-highlighter-5.0-SNAPSHOT.jar;C:\Users\JenkinsSlave\workspace\Lucene-Solr-trunk-Windows\lucene\build\memory\lucene-memory-5.0-SNAPSHOT.jar;C:\Users\JenkinsSlave\workspace\Lucene-Solr-trunk-Windows\lucene\build\misc\lucene-misc-5.0-SNAPSHOT.jar;C:\Users\JenkinsSlave\workspace\Lucene-Solr-trunk-Windows\lucene\build\spatial\lucene-spatial-5.0-SNAPSHOT.jar;C:\Users\JenkinsSlave\workspace\Lucene-Solr-trunk-Windows\lucene\build\suggest\lucene-suggest-5.0-SNAPSHOT.jar;C:\Users\JenkinsSlave\workspace\Lucene-Solr-trunk-Windows\lucene\build\grouping\lucene-grouping-5.0-SNAPSHOT.jar;C:\Users\JenkinsSlave\workspace\Lucene-Solr-trunk-Windows\lucene\build\queries\lucene-queries-5.0-SNAPSHOT.jar;C:\Users\JenkinsSlave\workspace\Lucene-Solr-trunk-Windows\lucene\build\queryparser\lucene-queryparser-5.0-SNAPSHOT.jar;C:\Users\JenkinsSlave\workspace\Lucene-Solr-trunk-Windows\solr\core\lib\commons-cli-1.2.jar;C:\Users\JenkinsSlave\workspace\Lucene-Solr-trunk-Windows\solr\core\lib\commons-codec-1.7.jar;C:\Users\JenkinsSlave\workspace\Lucene-Solr-trunk-Windows\solr\core\lib\commons-fileupload-1.2.1.jar;C:\Users\JenkinsSlave\workspace\Lucene-Solr-trunk-Windows\solr\core\lib\commons-lang-2.6.jar;C:\Users\JenkinsSlave\workspace\Lucene-Solr-trunk-Windows\solr\core\lib\easymock-2.2.jar;C:\Users\JenkinsSlave\workspace\Lucene-Solr-trunk-Windows\solr\core\lib\guava-r05.jar;C:\Users\JenkinsSlave\workspace\Lucene-Solr-trunk-Windows\solr\core\lib\javax.servlet-api-3.0.1.jar;C:\Users\JenkinsSlave\workspace\Lucene-Solr-trunk-Windows\solr\core\lib\metrics-core-2.1.2.jar;C:\Users\JenkinsSlave\workspace\Lucene-Solr-trunk-Windows\solr\core\lib\spatial4j-0.3.jar;C:\Users\JenkinsSlave\workspace\Lucene-Solr-trunk-Windows\solr\solrj\lib\commons-io-2.1.jar;C:\Users\JenkinsSlave\workspace\Lucene-Solr-trunk-Windows\solr\solrj\lib\httpclient-4.1.3.jar;C:\Users\JenkinsSlave\workspace\Lucene-Solr-trunk-Windows\solr\solrj\lib\httpcore-4.1.4.jar;C:\Users\JenkinsSlave\workspace\Lucene-Solr-trunk-Windows\solr\solrj\lib\httpmime-4.1.3.jar;C:\Users\JenkinsSlave\workspace\Lucene-Solr-trunk-Windows\solr\solrj\lib\jcl-over-slf4j-1.6.4.jar;C:\Users\JenkinsSlave\workspace\Lucene-Solr-trunk-Windows\solr\solrj\lib\log4j-over-slf4j-1.6.4.jar;C:\Users\JenkinsSlave\workspace\Lucene-Solr-trunk-Windows\solr\solrj\lib\slf4j-api-1.6.4.jar;C:\Users\JenkinsSlave\workspace\Lucene-Solr-trunk-Windows\solr\solrj\lib\slf4j-jdk14-1.6.4.jar;C:\Users\JenkinsSlave\workspace\Lucene-Solr-trunk-Windows\solr\solrj\lib\wstx-asl-3.2.7.jar;C:\Users\JenkinsSlave\workspace\Lucene-Solr-trunk-Windows\solr\solrj\lib\zookeeper-3.3.6.jar;C:\Users\JenkinsSlave\workspace\Lucene-Solr-trunk-Windows\solr\example\lib\jetty-continuation-8.1.2.v20120308.jar;C:\Users\JenkinsSlave\workspace\Lucene-Solr-trunk-Windows\solr\example\lib\jetty-deploy-8.1.2.v20120308.jar;C:\Users\JenkinsSlave\workspace\Lucene-Solr-trunk-Windows\solr\example\lib\jetty-http-8.1.2.v20120308.jar;C:\Users\JenkinsSlave\workspace\Lucene-Solr-trunk-Windows\solr\example\lib\jetty-io-8.1.2.v20120308.jar;C:\Users\JenkinsSlave\workspace\Lucene-Solr-trunk-Windows\solr\example\lib\jetty-jmx-8.1.2.v20120308.jar;C:\Users\JenkinsSlave\workspace\Lucene-Solr-trunk-Windows\solr\example\lib\jetty-security-8.1.2.v20120308.jar;C:\Users\JenkinsSlave\workspace\Lucene-Solr-trunk-Windows\solr\example\lib\jetty-server-8.1.2.v20120308.jar;C:\Users\JenkinsSlave\workspace\Lucene-Solr-trunk-Windows\solr\example\lib\jetty-servlet-8.1.2.v20120308.jar;C:\Users\JenkinsSlave\workspace\Lucene-Solr-trunk-Windows\solr\example\lib\jetty-util-8.1.2.v20120308.jar;C:\Users\JenkinsSlave\workspace\Lucene-Solr-trunk-Windows\solr\example\lib\jetty-webapp-8.1.2.v20120308.jar;C:\Users\JenkinsSlave\workspace\Lucene-Solr-trunk-Windows\solr\example\lib\jetty-xml-8.1.2.v20120308.jar;C:\Users\JenkinsSlave\workspace\Lucene-Solr-trunk-Windows\solr\example\lib\servlet-api-3.0.jar;C:\Users\JenkinsSlave\workspace\Lucene-Solr-trunk-Windows\solr\example\example-DIH\solr\db\lib\hsqldb-1.8.0.10.jar;C:\Users\JenkinsSlave\workspace\Lucene-Solr-trunk-Windows\lucene\build\core\classes\java;C:\Users\JenkinsSlave\workspace\Lucene-Solr-trunk-Windows\lucene\test-framework\lib\junit-4.10.jar;C:\Users\JenkinsSlave\workspace\Lucene-Solr-trunk-Windows\lucene\test-framework\lib\randomizedtesting-runner-2.0.4.jar;C:\Users\JenkinsSlave\tools\Ant\ANT_1.8.2\lib\ant-launcher.jar;C:\Users\JenkinsSlave\.ant\lib\ivy-2.2.0.jar;C:\Users\JenkinsSlave\tools\Ant\ANT_1.8.2\lib\ant-antlr.jar;C:\Users\JenkinsSlave\tools\Ant\ANT_1.8.2\lib\ant-apache-bcel.jar;C:\Users\JenkinsSlave\tools\Ant\ANT_1.8.2\lib\ant-apache-bsf.jar;C:\Users\JenkinsSlave\tools\Ant\ANT_1.8.2\lib\ant-apache-log4j.jar;C:\Users\JenkinsSlave\tools\Ant\ANT_1.8.2\lib\ant-apache-oro.jar;C:\Users\JenkinsSlave\tools\Ant\ANT_1.8.2\lib\ant-apache-regexp.jar;C:\Users\JenkinsSlave\tools\Ant\ANT_1.8.2\lib\ant-apache-resolver.jar;C:\Users\JenkinsSlave\tools\Ant\ANT_1.8.2\lib\ant-apache-xalan2.jar;C:\Users\JenkinsSlave\tools\Ant\ANT_1.8.2\lib\ant-commons-logging.jar;C:\Users\JenkinsSlave\tools\Ant\ANT_1.8.2\lib\ant-commons-net.jar;C:\Users\JenkinsSlave\tools\Ant\ANT_1.8.2\lib\ant-jai.jar;C:\Users\JenkinsSlave\tools\Ant\ANT_1.8.2\lib\ant-javamail.jar;C:\Users\JenkinsSlave\tools\Ant\ANT_1.8.2\lib\ant-jdepend.jar;C:\Users\JenkinsSlave\tools\Ant\ANT_1.8.2\lib\ant-jmf.jar;C:\Users\JenkinsSlave\tools\Ant\ANT_1.8.2\lib\ant-jsch.jar;C:\Users\JenkinsSlave\tools\Ant\ANT_1.8.2\lib\ant-junit.jar;C:\Users\JenkinsSlave\tools\Ant\ANT_1.8.2\lib\ant-junit4.jar;C:\Users\JenkinsSlave\tools\Ant\ANT_1.8.2\lib\ant-netrexx.jar;C:\Users\JenkinsSlave\tools\Ant\ANT_1.8.2\lib\ant-swing.jar;C:\Users\JenkinsSlave\tools\Ant\ANT_1.8.2\lib\ant-testutil.jar;C:\Users\JenkinsSlave\tools\Ant\ANT_1.8.2\lib\ant.jar;C:\Users\JenkinsSlave\tools\java\32bit\jdk1.6.0_37\lib\tools.jar;C:\Users\JenkinsSlave\.ivy2\cache\com.carrotsearch.randomizedtesting\junit4-ant\jars\junit4-ant-2.0.4.jar
[junit4:junit4]   2> 110 T152 oaz.Environment.logEnv Server environment:java.library.path=C:\Users\JenkinsSlave\tools\java\32bit\jdk1.6.0_37\jre\bin;C:\Windows\Sun\Java\bin;C:\Windows\system32;C:\Windows;C:\Users\JenkinsSlave\tools\java\32bit\jdk1.6.0_37\bin;C:\Windows\system32;C:\Windows;C:\Windows\System32\Wbem;C:\Windows\System32\WindowsPowerShell\v1.0\;C:\Program Files (x86)\Subversion\bin;.
[junit4:junit4]   2> 110 T152 oaz.Environment.logEnv Server environment:java.io.tmpdir=.
[junit4:junit4]   2> 110 T152 oaz.Environment.logEnv Server environment:java.compiler=<NA>
[junit4:junit4]   2> 110 T152 oaz.Environment.logEnv Server environment:os.name=Windows 7
[junit4:junit4]   2> 110 T152 oaz.Environment.logEnv Server environment:os.arch=x86
[junit4:junit4]   2> 110 T152 oaz.Environment.logEnv Server environment:os.version=6.1
[junit4:junit4]   2> 110 T152 oaz.Environment.logEnv Server environment:user.name=JenkinsSlave
[junit4:junit4]   2> 110 T152 oaz.Environment.logEnv Server environment:user.home=C:\Users\JenkinsSlave
[junit4:junit4]   2> 110 T152 oaz.Environment.logEnv Server environment:user.dir=C:\Users\JenkinsSlave\workspace\Lucene-Solr-trunk-Windows\solr\build\solr-core\test\J0
[junit4:junit4]   2> 141 T152 oazs.ZooKeeperServer.setTickTime tickTime set to 1000
[junit4:junit4]   2> 157 T152 oazs.NIOServerCnxn$Factory.<init> binding to port 0.0.0.0/0.0.0.0:0
[junit4:junit4]   2> 203 T152 oazsp.FileTxnSnapLog.save Snapshotting: 0
[junit4:junit4]   2> 235 T151 oasc.ZkTestServer.run start zk server on port:63166
[junit4:junit4]   2> 391 T151 oaz.Environment.logEnv Client environment:zookeeper.version=3.3.6-1366786, built on 07/29/2012 06:22 GMT
[junit4:junit4]   2> 391 T151 oaz.Environment.logEnv Client environment:host.name=JenkinsSlave-PC
[junit4:junit4]   2> 391 T151 oaz.Environment.logEnv Client environment:java.version=1.6.0_37
[junit4:junit4]   2> 391 T151 oaz.Environment.logEnv Client environment:java.vendor=Sun Microsystems Inc.
[junit4:junit4]   2> 391 T151 oaz.Environment.logEnv Client environment:java.home=C:\Users\JenkinsSlave\tools\java\32bit\jdk1.6.0_37\jre
[junit4:junit4]   2> 391 T151 oaz.Environment.logEnv Client environment:java.class.path=C:\Users\JenkinsSlave\workspace\Lucene-Solr-trunk-Windows\solr\build\solr-core\classes\test;C:\Users\JenkinsSlave\workspace\Lucene-Solr-trunk-Windows\solr\build\solr-test-framework\classes\java;C:\Users\JenkinsSlave\workspace\Lucene-Solr-trunk-Windows\solr\build\solr-core\test-files;C:\Users\JenkinsSlave\workspace\Lucene-Solr-trunk-Windows\lucene\build\test-framework\classes\java;C:\Users\JenkinsSlave\workspace\Lucene-Solr-trunk-Windows\lucene\build\codecs\classes\java;C:\Users\JenkinsSlave\workspace\Lucene-Solr-trunk-Windows\solr\build\solr-solrj\classes\java;C:\Users\JenkinsSlave\workspace\Lucene-Solr-trunk-Windows\solr\build\solr-core\classes\java;C:\Users\JenkinsSlave\workspace\Lucene-Solr-trunk-Windows\lucene\build\analysis\common\lucene-analyzers-common-5.0-SNAPSHOT.jar;C:\Users\JenkinsSlave\workspace\Lucene-Solr-trunk-Windows\lucene\build\analysis\kuromoji\lucene-analyzers-kuromoji-5.0-SNAPSHOT.jar;C:\Users\JenkinsSlave\workspace\Lucene-Solr-trunk-Windows\lucene\build\analysis\phonetic\lucene-analyzers-phonetic-5.0-SNAPSHOT.jar;C:\Users\JenkinsSlave\workspace\Lucene-Solr-trunk-Windows\lucene\build\highlighter\lucene-highlighter-5.0-SNAPSHOT.jar;C:\Users\JenkinsSlave\workspace\Lucene-Solr-trunk-Windows\lucene\build\memory\lucene-memory-5.0-SNAPSHOT.jar;C:\Users\JenkinsSlave\workspace\Lucene-Solr-trunk-Windows\lucene\build\misc\lucene-misc-5.0-SNAPSHOT.jar;C:\Users\JenkinsSlave\workspace\Lucene-Solr-trunk-Windows\lucene\build\spatial\lucene-spatial-5.0-SNAPSHOT.jar;C:\Users\JenkinsSlave\workspace\Lucene-Solr-trunk-Windows\lucene\build\suggest\lucene-suggest-5.0-SNAPSHOT.jar;C:\Users\JenkinsSlave\workspace\Lucene-Solr-trunk-Windows\lucene\build\grouping\lucene-grouping-5.0-SNAPSHOT.jar;C:\Users\JenkinsSlave\workspace\Lucene-Solr-trunk-Windows\lucene\build\queries\lucene-queries-5.0-SNAPSHOT.jar;C:\Users\JenkinsSlave\workspace\Lucene-Solr-trunk-Windows\lucene\build\queryparser\lucene-queryparser-5.0-SNAPSHOT.jar;C:\Users\JenkinsSlave\workspace\Lucene-Solr-trunk-Windows\solr\core\lib\commons-cli-1.2.jar;C:\Users\JenkinsSlave\workspace\Lucene-Solr-trunk-Windows\solr\core\lib\commons-codec-1.7.jar;C:\Users\JenkinsSlave\workspace\Lucene-Solr-trunk-Windows\solr\core\lib\commons-fileupload-1.2.1.jar;C:\Users\JenkinsSlave\workspace\Lucene-Solr-trunk-Windows\solr\core\lib\commons-lang-2.6.jar;C:\Users\JenkinsSlave\workspace\Lucene-Solr-trunk-Windows\solr\core\lib\easymock-2.2.jar;C:\Users\JenkinsSlave\workspace\Lucene-Solr-trunk-Windows\solr\core\lib\guava-r05.jar;C:\Users\JenkinsSlave\workspace\Lucene-Solr-trunk-Windows\solr\core\lib\javax.servlet-api-3.0.1.jar;C:\Users\JenkinsSlave\workspace\Lucene-Solr-trunk-Windows\solr\core\lib\metrics-core-2.1.2.jar;C:\Users\JenkinsSlave\workspace\Lucene-Solr-trunk-Windows\solr\core\lib\spatial4j-0.3.jar;C:\Users\JenkinsSlave\workspace\Lucene-Solr-trunk-Windows\solr\solrj\lib\commons-io-2.1.jar;C:\Users\JenkinsSlave\workspace\Lucene-Solr-trunk-Windows\solr\solrj\lib\httpclient-4.1.3.jar;C:\Users\JenkinsSlave\workspace\Lucene-Solr-trunk-Windows\solr\solrj\lib\httpcore-4.1.4.jar;C:\Users\JenkinsSlave\workspace\Lucene-Solr-trunk-Windows\solr\solrj\lib\httpmime-4.1.3.jar;C:\Users\JenkinsSlave\workspace\Lucene-Solr-trunk-Windows\solr\solrj\lib\jcl-over-slf4j-1.6.4.jar;C:\Users\JenkinsSlave\workspace\Lucene-Solr-trunk-Windows\solr\solrj\lib\log4j-over-slf4j-1.6.4.jar;C:\Users\JenkinsSlave\workspace\Lucene-Solr-trunk-Windows\solr\solrj\lib\slf4j-api-1.6.4.jar;C:\Users\JenkinsSlave\workspace\Lucene-Solr-trunk-Windows\solr\solrj\lib\slf4j-jdk14-1.6.4.jar;C:\Users\JenkinsSlave\workspace\Lucene-Solr-trunk-Windows\solr\solrj\lib\wstx-asl-3.2.7.jar;C:\Users\JenkinsSlave\workspace\Lucene-Solr-trunk-Windows\solr\solrj\lib\zookeeper-3.3.6.jar;C:\Users\JenkinsSlave\workspace\Lucene-Solr-trunk-Windows\solr\example\lib\jetty-continuation-8.1.2.v20120308.jar;C:\Users\JenkinsSlave\workspace\Lucene-Solr-trunk-Windows\solr\example\lib\jetty-deploy-8.1.2.v20120308.jar;C:\Users\JenkinsSlave\workspace\Lucene-Solr-trunk-Windows\solr\example\lib\jetty-http-8.1.2.v20120308.jar;C:\Users\JenkinsSlave\workspace\Lucene-Solr-trunk-Windows\solr\example\lib\jetty-io-8.1.2.v20120308.jar;C:\Users\JenkinsSlave\workspace\Lucene-Solr-trunk-Windows\solr\example\lib\jetty-jmx-8.1.2.v20120308.jar;C:\Users\JenkinsSlave\workspace\Lucene-Solr-trunk-Windows\solr\example\lib\jetty-security-8.1.2.v20120308.jar;C:\Users\JenkinsSlave\workspace\Lucene-Solr-trunk-Windows\solr\example\lib\jetty-server-8.1.2.v20120308.jar;C:\Users\JenkinsSlave\workspace\Lucene-Solr-trunk-Windows\solr\example\lib\jetty-servlet-8.1.2.v20120308.jar;C:\Users\JenkinsSlave\workspace\Lucene-Solr-trunk-Windows\solr\example\lib\jetty-util-8.1.2.v20120308.jar;C:\Users\JenkinsSlave\workspace\Lucene-Solr-trunk-Windows\solr\example\lib\jetty-webapp-8.1.2.v20120308.jar;C:\Users\JenkinsSlave\workspace\Lucene-Solr-trunk-Windows\solr\example\lib\jetty-xml-8.1.2.v20120308.jar;C:\Users\JenkinsSlave\workspace\Lucene-Solr-trunk-Windows\solr\example\lib\servlet-api-3.0.jar;C:\Users\JenkinsSlave\workspace\Lucene-Solr-trunk-Windows\solr\example\example-DIH\solr\db\lib\hsqldb-1.8.0.10.jar;C:\Users\JenkinsSlave\workspace\Lucene-Solr-trunk-Windows\lucene\build\core\classes\java;C:\Users\JenkinsSlave\workspace\Lucene-Solr-trunk-Windows\lucene\test-framework\lib\junit-4.10.jar;C:\Users\JenkinsSlave\workspace\Lucene-Solr-trunk-Windows\lucene\test-framework\lib\randomizedtesting-runner-2.0.4.jar;C:\Users\JenkinsSlave\tools\Ant\ANT_1.8.2\lib\ant-launcher.jar;C:\Users\JenkinsSlave\.ant\lib\ivy-2.2.0.jar;C:\Users\JenkinsSlave\tools\Ant\ANT_1.8.2\lib\ant-antlr.jar;C:\Users\JenkinsSlave\tools\Ant\ANT_1.8.2\lib\ant-apache-bcel.jar;C:\Users\JenkinsSlave\tools\Ant\ANT_1.8.2\lib\ant-apache-bsf.jar;C:\Users\JenkinsSlave\tools\Ant\ANT_1.8.2\lib\ant-apache-log4j.jar;C:\Users\JenkinsSlave\tools\Ant\ANT_1.8.2\lib\ant-apache-oro.jar;C:\Users\JenkinsSlave\tools\Ant\ANT_1.8.2\lib\ant-apache-regexp.jar;C:\Users\JenkinsSlave\tools\Ant\ANT_1.8.2\lib\ant-apache-resolver.jar;C:\Users\JenkinsSlave\tools\Ant\ANT_1.8.2\lib\ant-apache-xalan2.jar;C:\Users\JenkinsSlave\tools\Ant\ANT_1.8.2\lib\ant-commons-logging.jar;C:\Users\JenkinsSlave\tools\Ant\ANT_1.8.2\lib\ant-commons-net.jar;C:\Users\JenkinsSlave\tools\Ant\ANT_1.8.2\lib\ant-jai.jar;C:\Users\JenkinsSlave\tools\Ant\ANT_1.8.2\lib\ant-javamail.jar;C:\Users\JenkinsSlave\tools\Ant\ANT_1.8.2\lib\ant-jdepend.jar;C:\Users\JenkinsSlave\tools\Ant\ANT_1.8.2\lib\ant-jmf.jar;C:\Users\JenkinsSlave\tools\Ant\ANT_1.8.2\lib\ant-jsch.jar;C:\Users\JenkinsSlave\tools\Ant\ANT_1.8.2\lib\ant-junit.jar;C:\Users\JenkinsSlave\tools\Ant\ANT_1.8.2\lib\ant-junit4.jar;C:\Users\JenkinsSlave\tools\Ant\ANT_1.8.2\lib\ant-netrexx.jar;C:\Users\JenkinsSlave\tools\Ant\ANT_1.8.2\lib\ant-swing.jar;C:\Users\JenkinsSlave\tools\Ant\ANT_1.8.2\lib\ant-testutil.jar;C:\Users\JenkinsSlave\tools\Ant\ANT_1.8.2\lib\ant.jar;C:\Users\JenkinsSlave\tools\java\32bit\jdk1.6.0_37\lib\tools.jar;C:\Users\JenkinsSlave\.ivy2\cache\com.carrotsearch.randomizedtesting\junit4-ant\jars\junit4-ant-2.0.4.jar
[junit4:junit4]   2> 391 T151 oaz.Environment.logEnv Client environment:java.library.path=C:\Users\JenkinsSlave\tools\java\32bit\jdk1.6.0_37\jre\bin;C:\Windows\Sun\Java\bin;C:\Windows\system32;C:\Windows;C:\Users\JenkinsSlave\tools\java\32bit\jdk1.6.0_37\bin;C:\Windows\system32;C:\Windows;C:\Windows\System32\Wbem;C:\Windows\System32\WindowsPowerShell\v1.0\;C:\Program Files (x86)\Subversion\bin;.
[junit4:junit4]   2> 391 T151 oaz.Environment.logEnv Client environment:java.io.tmpdir=.
[junit4:junit4]   2> 391 T151 oaz.Environment.logEnv Client environment:java.compiler=<NA>
[junit4:junit4]   2> 391 T151 oaz.Environment.logEnv Client environment:os.name=Windows 7
[junit4:junit4]   2> 391 T151 oaz.Environment.logEnv Client environment:os.arch=x86
[junit4:junit4]   2> 391 T151 oaz.Environment.logEnv Client environment:os.version=6.1
[junit4:junit4]   2> 391 T151 oaz.Environment.logEnv Client environment:user.name=JenkinsSlave
[junit4:junit4]   2> 391 T151 oaz.Environment.logEnv Client environment:user.home=C:\Users\JenkinsSlave
[junit4:junit4]   2> 391 T151 oaz.Environment.logEnv Client environment:user.dir=C:\Users\JenkinsSlave\workspace\Lucene-Solr-trunk-Windows\solr\build\solr-core\test\J0
[junit4:junit4]   2> 407 T151 oaz.ZooKeeper.<init> Initiating client connection, connectString=127.0.0.1:63166 sessionTimeout=10000 watcher=org.apache.solr.common.cloud.ConnectionManager@c914b6
[junit4:junit4]   2> 453 T157 oaz.ClientCnxn$SendThread.startConnect Opening socket connection to server /127.0.0.1:63166
[junit4:junit4]   2> 453 T151 oascc.ConnectionManager.waitForConnected Waiting for client to connect to ZooKeeper
[junit4:junit4]   2> 453 T157 oaz.ClientCnxn$SendThread.primeConnection Socket connection established to 127.0.0.1/127.0.0.1:63166, initiating session
[junit4:junit4]   2> 453 T153 oazs.NIOServerCnxn$Factory.run Accepted socket connection from /127.0.0.1:63169
[junit4:junit4]   2> 469 T153 oazs.NIOServerCnxn.readConnectRequest Client attempting to establish new session at /127.0.0.1:63169
[junit4:junit4]   2> 485 T155 oazsp.FileTxnLog.append Creating new log file: log.1
[junit4:junit4]   2> 532 T155 oazs.NIOServerCnxn.finishSessionInit Established session 0x13ac841b58f0000 with negotiated timeout 10000 for client /127.0.0.1:63169
[junit4:junit4]   2> 532 T157 oaz.ClientCnxn$SendThread.readConnectResult Session establishment complete on server 127.0.0.1/127.0.0.1:63166, sessionid = 0x13ac841b58f0000, negotiated timeout = 10000
[junit4:junit4]   2> 547 T158 oascc.ConnectionManager.process Watcher org.apache.solr.common.cloud.ConnectionManager@c914b6 name:ZooKeeperConnection Watcher:127.0.0.1:63166 got event WatchedEvent state:SyncConnected type:None path:null path:null type:None
[junit4:junit4]   2> 547 T151 oascc.ConnectionManager.waitForConnected Client is connected to ZooKeeper
[junit4:junit4]   2> 547 T151 oascc.SolrZkClient.makePath makePath: /solr
[junit4:junit4]   2> 625 T156 oazs.PrepRequestProcessor.pRequest Processed session termination for sessionid: 0x13ac841b58f0000
[junit4:junit4]   2> 625 T151 oaz.ZooKeeper.close Session: 0x13ac841b58f0000 closed
[junit4:junit4]   2> 625 T158 oaz.ClientCnxn$EventThread.run EventThread shut down
[junit4:junit4]   2> 625 T151 oaz.ZooKeeper.<init> Initiating client connection, connectString=127.0.0.1:63166/solr sessionTimeout=10000 watcher=org.apache.solr.common.cloud.ConnectionManager@674bf6
[junit4:junit4]   2> 625 T159 oaz.ClientCnxn$SendThread.startConnect Opening socket connection to server /127.0.0.1:63166
[junit4:junit4]   2> 625 T151 oascc.ConnectionManager.waitForConnected Waiting for client to connect to ZooKeeper
[junit4:junit4]   2> 625 T159 oaz.ClientCnxn$SendThread.primeConnection Socket connection established to 127.0.0.1/127.0.0.1:63166, initiating session
[junit4:junit4]   2> 688 T153 oazs.NIOServerCnxn.closeSock Closed socket connection for client /127.0.0.1:63169 which had sessionid 0x13ac841b58f0000
[junit4:junit4]   2> 688 T153 oazs.NIOServerCnxn$Factory.run Accepted socket connection from /127.0.0.1:63172
[junit4:junit4]   2> 688 T153 oazs.NIOServerCnxn.readConnectRequest Client attempting to establish new session at /127.0.0.1:63172
[junit4:junit4]   2> 703 T155 oazs.NIOServerCnxn.finishSessionInit Established session 0x13ac841b58f0001 with negotiated timeout 10000 for client /127.0.0.1:63172
[junit4:junit4]   2> 703 T159 oaz.ClientCnxn$SendThread.readConnectResult Session establishment complete on server 127.0.0.1/127.0.0.1:63166, sessionid = 0x13ac841b58f0001, negotiated timeout = 10000
[junit4:junit4]   2> 703 T160 oascc.ConnectionManager.process Watcher org.apache.solr.common.cloud.ConnectionManager@674bf6 name:ZooKeeperConnection Watcher:127.0.0.1:63166/solr got event WatchedEvent state:SyncConnected type:None path:null path:null type:None
[junit4:junit4]   2> 703 T151 oascc.ConnectionManager.waitForConnected Client is connected to ZooKeeper
[junit4:junit4]   2> 719 T151 oascc.SolrZkClient.makePath makePath: /collections/collection1
[junit4:junit4]   2> 766 T151 oascc.SolrZkClient.makePath makePath: /collections/collection1/shards
[junit4:junit4]   2> 797 T151 oascc.SolrZkClient.makePath makePath: /collections/control_collection
[junit4:junit4]   2> 813 T151 oascc.SolrZkClient.makePath makePath: /collections/control_collection/shards
[junit4:junit4]   2> 844 T151 oasc.AbstractZkTestCase.putConfig put C:\Users\JenkinsSlave\workspace\Lucene-Solr-trunk-Windows\solr\build\solr-core\test-files\solr\collection1\conf\solrconfig.xml to /configs/conf1/solrconfig.xml
[junit4:junit4]   2> 860 T151 oascc.SolrZkClient.makePath makePath: /configs/conf1/solrconfig.xml
[junit4:junit4]   2> 891 T151 oasc.AbstractZkTestCase.putConfig put C:\Users\JenkinsSlave\workspace\Lucene-Solr-trunk-Windows\solr\build\solr-core\test-files\solr\collection1\conf\schema.xml to /configs/conf1/schema.xml
[junit4:junit4]   2> 891 T151 oascc.SolrZkClient.makePath makePath: /configs/conf1/schema.xml
[junit4:junit4]   2> 907 T151 oasc.AbstractZkTestCase.putConfig put C:\Users\JenkinsSlave\workspace\Lucene-Solr-trunk-Windows\solr\build\solr-core\test-files\solr\collection1\conf\solrconfig.xml to /configs/conf1/solrconfig.xml
[junit4:junit4]   2> 907 T151 oascc.SolrZkClient.makePath makePath: /configs/conf1/solrconfig.xml
[junit4:junit4]   2> 938 T151 oasc.AbstractZkTestCase.putConfig put C:\Users\JenkinsSlave\workspace\Lucene-Solr-trunk-Windows\solr\build\solr-core\test-files\solr\collection1\conf\stopwords.txt to /configs/conf1/stopwords.txt
[junit4:junit4]   2> 938 T151 oascc.SolrZkClient.makePath makePath: /configs/conf1/stopwords.txt
[junit4:junit4]   2> 953 T151 oasc.AbstractZkTestCase.putConfig put C:\Users\JenkinsSlave\workspace\Lucene-Solr-trunk-Windows\solr\build\solr-core\test-files\solr\collection1\conf\protwords.txt to /configs/conf1/protwords.txt
[junit4:junit4]   2> 953 T151 oascc.SolrZkClient.makePath makePath: /configs/conf1/protwords.txt
[junit4:junit4]   2> 969 T151 oasc.AbstractZkTestCase.putConfig put C:\Users\JenkinsSlave\workspace\Lucene-Solr-trunk-Windows\solr\build\solr-core\test-files\solr\collection1\conf\currency.xml to /configs/conf1/currency.xml
[junit4:junit4]   2> 969 T151 oascc.SolrZkClient.makePath makePath: /configs/conf1/currency.xml
[junit4:junit4]   2> 1000 T151 oasc.AbstractZkTestCase.putConfig put C:\Users\JenkinsSlave\workspace\Lucene-Solr-trunk-Windows\solr\build\solr-core\test-files\solr\collection1\conf\open-exchange-rates.json to /configs/conf1/open-exchange-rates.json
[junit4:junit4]   2> 1000 T151 oascc.SolrZkClient.makePath makePath: /configs/conf1/open-exchange-rates.json
[junit4:junit4]   2> 1000 T151 oasc.AbstractZkTestCase.putConfig put C:\Users\JenkinsSlave\workspace\Lucene-Solr-trunk-Windows\solr\build\solr-core\test-files\solr\collection1\conf\mapping-ISOLatin1Accent.txt to /configs/conf1/mapping-ISOLatin1Accent.txt
[junit4:junit4]   2> 1000 T151 oascc.SolrZkClient.makePath makePath: /configs/conf1/mapping-ISOLatin1Accent.txt
[junit4:junit4]   2> 1032 T151 oasc.AbstractZkTestCase.putConfig put C:\Users\JenkinsSlave\workspace\Lucene-Solr-trunk-Windows\solr\build\solr-core\test-files\solr\collection1\conf\old_synonyms.txt to /configs/conf1/old_synonyms.txt
[junit4:junit4]   2> 1032 T151 oascc.SolrZkClient.makePath makePath: /configs/conf1/old_synonyms.txt
[junit4:junit4]   2> 1047 T151 oasc.AbstractZkTestCase.putConfig put C:\Users\JenkinsSlave\workspace\Lucene-Solr-trunk-Windows\solr\build\solr-core\test-files\solr\collection1\conf\synonyms.txt to /configs/conf1/synonyms.txt
[junit4:junit4]   2> 1047 T151 oascc.SolrZkClient.makePath makePath: /configs/conf1/synonyms.txt
[junit4:junit4]   2> 1078 T156 oazs.PrepRequestProcessor.pRequest Processed session termination for sessionid: 0x13ac841b58f0001
[junit4:junit4]   2> 1094 T151 oaz.ZooKeeper.close Session: 0x13ac841b58f0001 closed
[junit4:junit4]   2> 1094 T153 oazs.NIOServerCnxn.closeSock Closed socket connection for client /127.0.0.1:63172 which had sessionid 0x13ac841b58f0001
[junit4:junit4]   2> 1094 T160 oaz.ClientCnxn$EventThread.run EventThread shut down
[junit4:junit4]   2> 1407 T151 oejs.Server.doStart jetty-8.1.2.v20120308
[junit4:junit4]   2> 1407 T151 oejs.AbstractConnector.doStart Started SelectChannelConnector@0.0.0.0:63173
[junit4:junit4]   2> 1407 T151 oasc.SolrResourceLoader.locateSolrHome JNDI not configured for solr (NoInitialContextEx)
[junit4:junit4]   2> 1407 T151 oasc.SolrResourceLoader.locateSolrHome using system property solr.solr.home: C:\Users\JenkinsSlave\workspace\Lucene-Solr-trunk-Windows\solr\build\solr-core\test\J0\.\org.apache.solr.cloud.BasicDistributedZk2Test-controljetty-1351979481322
[junit4:junit4]   2> 1407 T151 oasc.SolrResourceLoader.<init> new SolrResourceLoader for deduced Solr Home: 'C:\Users\JenkinsSlave\workspace\Lucene-Solr-trunk-Windows\solr\build\solr-core\test\J0\.\org.apache.solr.cloud.BasicDistributedZk2Test-controljetty-1351979481322\'
[junit4:junit4]   2> 1438 T151 oass.SolrDispatchFilter.init SolrDispatchFilter.init()
[junit4:junit4]   2> 1438 T151 oasc.SolrResourceLoader.locateSolrHome JNDI not configured for solr (NoInitialContextEx)
[junit4:junit4]   2> 1438 T151 oasc.SolrResourceLoader.locateSolrHome using system property solr.solr.home: C:\Users\JenkinsSlave\workspace\Lucene-Solr-trunk-Windows\solr\build\solr-core\test\J0\.\org.apache.solr.cloud.BasicDistributedZk2Test-controljetty-1351979481322
[junit4:junit4]   2> 1438 T151 oasc.CoreContainer$Initializer.initialize looking for solr.xml: C:\Users\JenkinsSlave\workspace\Lucene-Solr-trunk-Windows\solr\build\solr-core\test\J0\.\org.apache.solr.cloud.BasicDistributedZk2Test-controljetty-1351979481322\solr.xml
[junit4:junit4]   2> 1438 T151 oasc.CoreContainer.<init> New CoreContainer 1366216
[junit4:junit4]   2> 1438 T151 oasc.CoreContainer.load Loading CoreContainer using Solr Home: 'C:\Users\JenkinsSlave\workspace\Lucene-Solr-trunk-Windows\solr\build\solr-core\test\J0\.\org.apache.solr.cloud.BasicDistributedZk2Test-controljetty-1351979481322\'
[junit4:junit4]   2> 1438 T151 oasc.SolrResourceLoader.<init> new SolrResourceLoader for directory: 'C:\Users\JenkinsSlave\workspace\Lucene-Solr-trunk-Windows\solr\build\solr-core\test\J0\.\org.apache.solr.cloud.BasicDistributedZk2Test-controljetty-1351979481322\'
[junit4:junit4]   2> 1453 T151 oasc.CoreContainer.load Registering Log Listener
[junit4:junit4]   2> 1469 T151 oasc.CoreContainer.initZooKeeper Zookeeper client=127.0.0.1:63166/solr
[junit4:junit4]   2> 1500 T151 oaz.ZooKeeper.<init> Initiating client connection, connectString=127.0.0.1:63166/solr sessionTimeout=5000 watcher=org.apache.solr.common.cloud.ConnectionManager@11da1d1
[junit4:junit4]   2> 1500 T170 oaz.ClientCnxn$SendThread.startConnect Opening socket connection to server /127.0.0.1:63166
[junit4:junit4]   2> 1500 T151 oascc.ConnectionManager.waitForConnected Waiting for client to connect to ZooKeeper
[junit4:junit4]   2> 1500 T170 oaz.ClientCnxn$SendThread.primeConnection Socket connection established to 127.0.0.1/127.0.0.1:63166, initiating session
[junit4:junit4]   2> 1500 T153 oazs.NIOServerCnxn$Factory.run Accepted socket connection from /127.0.0.1:63178
[junit4:junit4]   2> 1500 T153 oazs.NIOServerCnxn.readConnectRequest Client attempting to establish new session at /127.0.0.1:63178
[junit4:junit4]   2> 1516 T155 oazs.NIOServerCnxn.finishSessionInit Established session 0x13ac841b58f0002 with negotiated timeout 5000 for client /127.0.0.1:63178
[junit4:junit4]   2> 1516 T170 oaz.ClientCnxn$SendThread.readConnectResult Session establishment complete on server 127.0.0.1/127.0.0.1:63166, sessionid = 0x13ac841b58f0002, negotiated timeout = 5000
[junit4:junit4]   2> 1516 T171 oascc.ConnectionManager.process Watcher org.apache.solr.common.cloud.ConnectionManager@11da1d1 name:ZooKeeperConnection Watcher:127.0.0.1:63166/solr got event WatchedEvent state:SyncConnected type:None path:null path:null type:None
[junit4:junit4]   2> 1516 T151 oascc.ConnectionManager.waitForConnected Client is connected to ZooKeeper
[junit4:junit4]   2> 1563 T156 oazs.PrepRequestProcessor.pRequest Got user-level KeeperException when processing sessionid:0x13ac841b58f0002 type:create cxid:0x2 zxid:0xfffffffffffffffe txntype:unknown reqpath:n/a Error Path:/solr/overseer Error:KeeperErrorCode = NodeExists for /solr/overseer
[junit4:junit4]   2> 1594 T151 oascc.SolrZkClient.makePath makePath: /live_nodes
[junit4:junit4]   2> 1610 T151 oasc.ZkController.createEphemeralLiveNode Register node as live in ZooKeeper:/live_nodes/127.0.0.1:63173_solr
[junit4:junit4]   2> 1610 T156 oazs.PrepRequestProcessor.pRequest Got user-level KeeperException when processing sessionid:0x13ac841b58f0002 type:delete cxid:0x7 zxid:0xfffffffffffffffe txntype:unknown reqpath:n/a Error Path:/solr/live_nodes/127.0.0.1:63173_solr Error:KeeperErrorCode = NoNode for /solr/live_nodes/127.0.0.1:63173_solr
[junit4:junit4]   2> 4953 T170 oaz.ClientCnxn$SendThread.run Client session timed out, have not heard from server in 3343ms for sessionid 0x13ac841b58f0002, closing socket connection and attempting reconnect
[junit4:junit4]   2> 7875 T153 oazs.NIOServerCnxn.doIO WARNING EndOfStreamException: Unable to read additional data from client sessionid 0x13ac841b58f0002, likely client has closed socket
[junit4:junit4]   2> 7860 T155 oazsp.FileTxnLog.commit WARNING fsync-ing the write ahead log in SyncThread:0 took 6272ms which will adversely effect operation latency. See the ZooKeeper troubleshooting guide
[junit4:junit4]   2> 7891 T153 oazs.NIOServerCnxn.closeSock Closed socket connection for client /127.0.0.1:63178 which had sessionid 0x13ac841b58f0002
[junit4:junit4]   2> 7985 T171 oascc.ConnectionManager.process Watcher org.apache.solr.common.cloud.ConnectionManager@11da1d1 name:ZooKeeperConnection Watcher:127.0.0.1:63166/solr got event WatchedEvent state:Disconnected type:None path:null path:null type:None
[junit4:junit4]   2> 7985 T171 oascc.ConnectionManager.process zkClient has disconnected
[junit4:junit4]   2> 8772 T154 oazs.ZooKeeperServer.expire Expiring session 0x13ac841b58f0002, timeout of 5000ms exceeded
[junit4:junit4]   2> 8773 T156 oazs.PrepRequestProcessor.pRequest Processed session termination for sessionid: 0x13ac841b58f0002
[junit4:junit4]   2> 9830 T170 oaz.ClientCnxn$SendThread.startConnect Opening socket connection to server 127.0.0.1/127.0.0.1:63166
[junit4:junit4]   2> 9830 T170 oaz.ClientCnxn$SendThread.primeConnection Socket connection established to 127.0.0.1/127.0.0.1:63166, initiating session
[junit4:junit4]   2> 9830 T153 oazs.NIOServerCnxn$Factory.run Accepted socket connection from /127.0.0.1:63179
[junit4:junit4]   2> 9830 T153 oazs.NIOServerCnxn.readConnectRequest Client attempting to renew session 0x13ac841b58f0002 at /127.0.0.1:63179
[junit4:junit4]   2> 9830 T153 oazs.NIOServerCnxn.finishSessionInit Invalid session 0x13ac841b58f0002 for client /127.0.0.1:63179, probably expired
[junit4:junit4]   2> 9830 T171 oascc.ConnectionManager.process Watcher org.apache.solr.common.cloud.ConnectionManager@11da1d1 name:ZooKeeperConnection Watcher:127.0.0.1:63166/solr got event WatchedEvent state:Expired type:None path:null path:null type:None
[junit4:junit4]   2> 9830 T171 oascc.ConnectionManager.process Our previous ZooKeeper session was expired. Attempting to reconnect to recover relationship with ZooKeeper...
[junit4:junit4]   2> 9830 T170 oaz.ClientCnxn$SendThread.run Unable to reconnect to ZooKeeper service, session 0x13ac841b58f0002 has expired, closing socket connection
[junit4:junit4]   2> 9830 T171 oascc.DefaultConnectionStrategy.reconnect Connection expired - starting a new one...
[junit4:junit4]   2> 9830 T153 oazs.NIOServerCnxn.closeSock Closed socket connection for client /127.0.0.1:63179 which had sessionid 0x13ac841b58f0002
[junit4:junit4]   2> 9830 T171 oaz.ZooKeeper.<init> Initiating client connection, connectString=127.0.0.1:63166/solr sessionTimeout=5000 watcher=org.apache.solr.common.cloud.ConnectionManager@11da1d1
[junit4:junit4]   2> 9830 T171 oascc.ConnectionManager.waitForConnected Waiting for client to connect to ZooKeeper
[junit4:junit4]   2> 9830 T172 oaz.ClientCnxn$SendThread.startConnect Opening socket connection to server /127.0.0.1:63166
[junit4:junit4]   2> 9830 T172 oaz.ClientCnxn$SendThread.primeConnection Socket connection established to 127.0.0.1/127.0.0.1:63166, initiating session
[junit4:junit4]   2> 9830 T153 oazs.NIOServerCnxn$Factory.run Accepted socket connection from /127.0.0.1:63182
[junit4:junit4]   2> 9830 T153 oazs.NIOServerCnxn.readConnectRequest Client attempting to establish new session at /127.0.0.1:63182
[junit4:junit4]   2> 9846 T155 oazs.NIOServerCnxn.finishSessionInit Established session 0x13ac841b58f0003 with negotiated timeout 5000 for client /127.0.0.1:63182
[junit4:junit4]   2> 9846 T172 oaz.ClientCnxn$SendThread.readConnectResult Session establishment complete on server 127.0.0.1/127.0.0.1:63166, sessionid = 0x13ac841b58f0003, negotiated timeout = 5000
[junit4:junit4]   2> 9846 T173 oascc.ConnectionManager.process Watcher org.apache.solr.common.cloud.ConnectionManager@11da1d1 name:ZooKeeperConnection Watcher:127.0.0.1:63166/solr got event WatchedEvent state:SyncConnected type:None path:null path:null type:None
[junit4:junit4]   2> 9846 T171 oascc.ConnectionManager.waitForConnected Client is connected to ZooKeeper
[junit4:junit4]   2> 9846 T171 oascc.ConnectionManager$1.update Connection with ZooKeeper reestablished.
[junit4:junit4]   2> 9846 T171 oashc.HttpShardHandlerFactory.getParameter Setting socketTimeout to: 0
[junit4:junit4]   2> 9846 T171 oashc.HttpShardHandlerFactory.getParameter Setting urlScheme to: http://
[junit4:junit4]   2> 9846 T171 oashc.HttpShardHandlerFactory.getParameter Setting connTimeout to: 0
[junit4:junit4]   2> 9846 T171 oashc.HttpShardHandlerFactory.getParameter Setting maxConnectionsPerHost to: 20
[junit4:junit4]   2> 9846 T171 oashc.HttpShardHandlerFactory.getParameter Setting corePoolSize to: 0
[junit4:junit4]   2> 9846 T171 oashc.HttpShardHandlerFactory.getParameter Setting maximumPoolSize to: 2147483647
[junit4:junit4]   2> 9846 T171 oashc.HttpShardHandlerFactory.getParameter Setting maxThreadIdleTime to: 5
[junit4:junit4]   2> 9846 T171 oashc.HttpShardHandlerFactory.getParameter Setting sizeOfQueue to: -1
[junit4:junit4]   2> 9846 T171 oashc.HttpShardHandlerFactory.getParameter Setting fairnessPolicy to: false
[junit4:junit4]   2> 9846 T171 oascsi.HttpClientUtil.createClient Creating new http client, config:maxConnectionsPerHost=20&maxConnections=10000&socketTimeout=0&connTimeout=0&retry=false
[junit4:junit4]   2> 9877 T171 oasc.SolrException.log SEVERE :java.lang.NullPointerException
[junit4:junit4]   2> 		at org.apache.solr.cloud.ZkController$1.command(ZkController.java:194)
[junit4:junit4]   2> 		at org.apache.solr.common.cloud.ConnectionManager$1.update(ConnectionManager.java:116)
[junit4:junit4]   2> 		at org.apache.solr.common.cloud.DefaultConnectionStrategy.reconnect(DefaultConnectionStrategy.java:46)
[junit4:junit4]   2> 		at org.apache.solr.common.cloud.ConnectionManager.process(ConnectionManager.java:90)
[junit4:junit4]   2> 		at org.apache.zookeeper.ClientCnxn$EventThread.processEvent(ClientCnxn.java:526)
[junit4:junit4]   2> 		at org.apache.zookeeper.ClientCnxn$EventThread.run(ClientCnxn.java:502)
[junit4:junit4]   2> 	
[junit4:junit4]   2> 9877 T171 oasc.SolrException.log SEVERE Reconnect to ZooKeeper failed:org.apache.solr.common.cloud.ZooKeeperException: 
[junit4:junit4]   2> 		at org.apache.solr.cloud.ZkController$1.command(ZkController.java:222)
[junit4:junit4]   2> 		at org.apache.solr.common.cloud.ConnectionManager$1.update(ConnectionManager.java:116)
[junit4:junit4]   2> 		at org.apache.solr.common.cloud.DefaultConnectionStrategy.reconnect(DefaultConnectionStrategy.java:46)
[junit4:junit4]   2> 		at org.apache.solr.common.cloud.ConnectionManager.process(ConnectionManager.java:90)
[junit4:junit4]   2> 		at org.apache.zookeeper.ClientCnxn$EventThread.processEvent(ClientCnxn.java:526)
[junit4:junit4]   2> 		at org.apache.zookeeper.ClientCnxn$EventThread.run(ClientCnxn.java:502)
[junit4:junit4]   2> 	Caused by: java.lang.NullPointerException
[junit4:junit4]   2> 		at org.apache.solr.cloud.ZkController$1.command(ZkController.java:194)
[junit4:junit4]   2> 		... 5 more
[junit4:junit4]   2> 	
[junit4:junit4]   2> 9877 T171 oascc.DefaultConnectionStrategy.reconnect Reconnect to ZooKeeper failed
[junit4:junit4]   2> 9877 T171 oascc.ConnectionManager.process Connected:true
[junit4:junit4]   2> 9877 T171 oaz.ClientCnxn$EventThread.run EventThread shut down
[junit4:junit4]   2> 9940 T151 oasc.ZkController.init SEVERE  org.apache.zookeeper.KeeperException$SessionExpiredException: KeeperErrorCode = Session expired for /live_nodes/127.0.0.1:63173_solr
[junit4:junit4]   2> 	at org.apache.zookeeper.KeeperException.create(KeeperException.java:118)
[junit4:junit4]   2> 	at org.apache.zookeeper.KeeperException.create(KeeperException.java:42)
[junit4:junit4]   2> 	at org.apache.zookeeper.ZooKeeper.delete(ZooKeeper.java:734)
[junit4:junit4]   2> 	at org.apache.solr.common.cloud.SolrZkClient$2.execute(SolrZkClient.java:144)
[junit4:junit4]   2> 	at org.apache.solr.common.cloud.SolrZkClient$2.execute(SolrZkClient.java:141)
[junit4:junit4]   2> 	at org.apache.solr.common.cloud.ZkCmdExecutor.retryOperation(ZkCmdExecutor.java:63)
[junit4:junit4]   2> 	at org.apache.solr.common.cloud.SolrZkClient.delete(SolrZkClient.java:141)
[junit4:junit4]   2> 	at org.apache.solr.cloud.ZkController.createEphemeralLiveNode(ZkController.java:466)
[junit4:junit4]   2> 	at org.apache.solr.cloud.ZkController.init(ZkController.java:415)
[junit4:junit4]   2> 	at org.apache.solr.cloud.ZkController.<init>(ZkController.java:237)
[junit4:junit4]   2> 	at org.apache.solr.core.CoreContainer.initZooKeeper(CoreContainer.java:229)
[junit4:junit4]   2> 	at org.apache.solr.core.CoreContainer.load(CoreContainer.java:479)
[junit4:junit4]   2> 	at org.apache.solr.core.CoreContainer.load(CoreContainer.java:375)
[junit4:junit4]   2> 	at org.apache.solr.core.CoreContainer$Initializer.initialize(CoreContainer.java:307)
[junit4:junit4]   2> 	at org.apache.solr.servlet.SolrDispatchFilter.init(SolrDispatchFilter.java:107)
[junit4:junit4]   2> 	at org.eclipse.jetty.servlet.FilterHolder.doStart(FilterHolder.java:114)
[junit4:junit4]   2> 	at org.eclipse.jetty.util.component.AbstractLifeCycle.start(AbstractLifeCycle.java:59)
[junit4:junit4]   2> 	at org.eclipse.jetty.servlet.ServletHandler.initialize(ServletHandler.java:754)
[junit4:junit4]   2> 	at org.eclipse.jetty.servlet.ServletHandler.updateMappings(ServletHandler.java:1227)
[junit4:junit4]   2> 	at org.eclipse.jetty.servlet.ServletHandler.setFilterMappings(ServletHandler.java:1263)
[junit4:junit4]   2> 	at org.eclipse.jetty.servlet.ServletHandler.addFilterWithMapping(ServletHandler.java:965)
[junit4:junit4]   2> 	at org.eclipse.jetty.servlet.ServletHandler.addFilterWithMapping(ServletHandler.java:923)
[junit4:junit4]   2> 	at org.eclipse.jetty.servlet.ServletContextHandler.addFilter(ServletContextHandler.java:333)
[junit4:junit4]   2> 	at org.apache.solr.client.solrj.embedded.JettySolrRunner$1.lifeCycleStarted(JettySolrRunner.java:173)
[junit4:junit4]   2> 	at org.eclipse.jetty.util.component.AbstractLifeCycle.setStarted(AbstractLifeCycle.java:169)
[junit4:junit4]   2> 	at org.eclipse.jetty.util.component.AbstractLifeCycle.start(AbstractLifeCycle.java:60)
[junit4:junit4]   2> 	at org.apache.solr.client.solrj.embedded.JettySolrRunner.start(JettySolrRunner.java:225)
[junit4:junit4]   2> 	at org.apache.solr.client.solrj.embedded.JettySolrRunner.start(JettySolrRunner.java:205)
[junit4:junit4]   2> 	at org.apache.solr.BaseDistributedSearchTestCase.createJetty(BaseDistributedSearchTestCase.java:262)
[junit4:junit4]   2> 	at org.apache.solr.BaseDistributedSearchTestCase.createJetty(BaseDistributedSearchTestCase.java:254)
[junit4:junit4]   2> 	at org.apache.solr.cloud.AbstractFullDistribZkTestBase.createServers(AbstractFullDistribZkTestBase.java:235)
[junit4:junit4]   2> 	at org.apache.solr.BaseDistributedSearchTestCase.testDistribSearch(BaseDistributedSearchTestCase.java:693)
[junit4:junit4]   2> 	at sun.reflect.NativeMethodAccessorImpl.invoke0(Native Method)
[junit4:junit4]   2> 	at sun.reflect.NativeMethodAccessorImpl.invoke(NativeMethodAccessorImpl.java:39)
[junit4:junit4]   2> 	at sun.reflect.DelegatingMethodAccessorImpl.invoke(DelegatingMethodAccessorImpl.java:25)
[junit4:junit4]   2> 	at java.lang.reflect.Method.invoke(Method.java:597)
[junit4:junit4]   2> 	at com.carrotsearch.randomizedtesting.RandomizedRunner.invoke(RandomizedRunner.java:1559)
[junit4:junit4]   2> 	at com.carrotsearch.randomizedtesting.RandomizedRunner.access$600(RandomizedRunner.java:79)
[junit4:junit4]   2> 	at com.carrotsearch.randomizedtesting.RandomizedRunner$6.evaluate(RandomizedRunner.java:737)
[junit4:junit4]   2> 	at com.carrotsearch.randomizedtesting.RandomizedRunner$7.evaluate(RandomizedRunner.java:773)
[junit4:junit4]   2> 	at com.carrotsearch.randomizedtesting.RandomizedRunner$8.evaluate(RandomizedRunner.java:787)
[junit4:junit4]   2> 	at com.carrotsearch.randomizedtesting.rules.SystemPropertiesRestoreRule$1.evaluate(SystemPropertiesRestoreRule.java:53)
[junit4:junit4]   2> 	at org.apache.lucene.util.TestRuleSetupTeardownChained$1.evaluate(TestRuleSetupTeardownChained.java:50)
[junit4:junit4]   2> 	at org.apache.lucene.util.TestRuleFieldCacheSanity$1.evaluate(TestRuleFieldCacheSanity.java:51)
[junit4:junit4]   2> 	at org.apache.lucene.util.AbstractBeforeAfterRule$1.evaluate(AbstractBeforeAfterRule.java:45)
[junit4:junit4]   2> 	at com.carrotsearch.randomizedtesting.rules.SystemPropertiesInvariantRule$1.evaluate(SystemPropertiesInvariantRule.java:55)
[junit4:junit4]   2> 	at org.apache.lucene.util.TestRuleThreadAndTestName$1.evaluate(TestRuleThreadAndTestName.java:48)
[junit4:junit4]   2> 	at org.apache.lucene.util.TestRuleIgnoreAfterMaxFailures$1.evaluate(TestRuleIgnoreAfterMaxFailures.java:70)
[junit4:junit4]   2> 	at org.apache.lucene.util.TestRuleMarkFailure$1.evaluate(TestRuleMarkFailure.java:48)
[junit4:junit4]   2> 	at com.carrotsearch.randomizedtesting.rules.StatementAdapter.evaluate(StatementAdapter.java:36)
[junit4:junit4]   2> 	at com.carrotsearch.randomizedtesting.ThreadLeakControl$StatementRunner.run(ThreadLeakControl.java:358)
[junit4:junit4]   2> 	at com.carrotsearch.randomizedtesting.ThreadLeakControl.forkTimeoutingTask(ThreadLeakControl.java:782)
[junit4:junit4]   2> 	at com.carrotsearch.randomizedtesting.ThreadLeakControl$3.evaluate(ThreadLeakControl.java:442)
[junit4:junit4]   2> 	at com.carrotsearch.randomizedtesting.RandomizedRunner.runSingleTest(RandomizedRunner.java:746)
[junit4:junit4]   2> 	at com.carrotsearch.randomizedtesting.RandomizedRunner$3.evaluate(RandomizedRunner.java:648)
[junit4:junit4]   2> 	at com.carrotsearch.randomizedtesting.RandomizedRunner$4.evaluate(RandomizedRunner.java:682)
[junit4:junit4]   2> 	at com.carrotsearch.randomizedtesting.RandomizedRunner$5.evaluate(RandomizedRunner.java:693)
[junit4:junit4]   2> 	at com.carrotsearch.randomizedtesting.rules.StatementAdapter.evaluate(StatementAdapter.java:36)
[junit4:junit4]   2> 	at com.carrotsearch.randomizedtesting.rules.SystemPropertiesRestoreRule$1.evaluate(SystemPropertiesRestoreRule.java:53)
[junit4:junit4]   2> 	at org.apache.lucene.util.AbstractBeforeAfterRule$1.evaluate(AbstractBeforeAfterRule.java:45)
[junit4:junit4]   2> 	at org.apache.lucene.util.TestRuleStoreClassName$1.evaluate(TestRuleStoreClassName.java:42)
[junit4:junit4]   2> 	at com.carrotsearch.randomizedtesting.rules.SystemPropertiesInvariantRule$1.evaluate(SystemPropertiesInvariantRule.java:55)
[junit4:junit4]   2> 	at com.carrotsearch.randomizedtesting.rules.NoShadowingOrOverridesOnMethodsRule$1.evaluate(NoShadowingOrOverridesOnMethodsRule.java:39)
[junit4:junit4]   2> 	at com.carrotsearch.randomizedtesting.rules.NoShadowingOrOverridesOnMethodsRule$1.evaluate(NoShadowingOrOverridesOnMethodsRule.java:39)
[junit4:junit4]   2> 	at com.carrotsearch.randomizedtesting.rules.StatementAdapter.evaluate(StatementAdapter.java:36)
[junit4:junit4]   2> 	at org.apache.lucene.util.TestRuleAssertionsRequired$1.evaluate(TestRuleAssertionsRequired.java:43)
[junit4:junit4]   2> 	at org.apache.lucene.util.TestRuleMarkFailure$1.evaluate(TestRuleMarkFailure.java:48)
[junit4:junit4]   2> 	at org.apache.lucene.util.TestRuleIgnoreAfterMaxFailures$1.evaluate(TestRuleIgnoreAfterMaxFailures.java:70)
[junit4:junit4]   2> 	at org.apache.lucene.util.TestRuleIgnoreTestSuites$1.evaluate(TestRuleIgnoreTestSuites.java:55)
[junit4:junit4]   2> 	at com.carrotsearch.randomizedtesting.rules.StatementAdapter.evaluate(StatementAdapter.java:36)
[junit4:junit4]   2> 	at com.carrotsearch.randomizedtesting.ThreadLeakControl$StatementRunner.run(ThreadLeakControl.java:358)
[junit4:junit4]   2> 	at java.lang.Thread.run(Thread.java:662)
[junit4:junit4]   2> 
[junit4:junit4]   2> 9940 T151 oass.SolrDispatchFilter.init SEVERE Could not start Solr. Check solr/home property and the logs
[junit4:junit4]   2> 9940 T151 oasc.SolrException.log SEVERE null:org.apache.solr.common.cloud.ZooKeeperException: 
[junit4:junit4]   2> 		at org.apache.solr.cloud.ZkController.init(ZkController.java:442)
[junit4:junit4]   2> 		at org.apache.solr.cloud.ZkController.<init>(ZkController.java:237)
[junit4:junit4]   2> 		at org.apache.solr.core.CoreContainer.initZooKeeper(CoreContainer.java:229)
[junit4:junit4]   2> 		at org.apache.solr.core.CoreContainer.load(CoreContainer.java:479)
[junit4:junit4]   2> 		at org.apache.solr.core.CoreContainer.load(CoreContainer.java:375)
[junit4:junit4]   2> 		at org.apache.solr.core.CoreContainer$Initializer.initialize(CoreContainer.java:307)
[junit4:junit4]   2> 		at org.apache.solr.servlet.SolrDispatchFilter.init(SolrDispatchFilter.java:107)
[junit4:junit4]   2> 		at org.eclipse.jetty.servlet.FilterHolder.doStart(FilterHolder.java:114)
[junit4:junit4]   2> 		at org.eclipse.jetty.util.component.AbstractLifeCycle.start(AbstractLifeCycle.java:59)
[junit4:junit4]   2> 		at org.eclipse.jetty.servlet.ServletHandler.initialize(ServletHandler.java:754)
[junit4:junit4]   2> 		at org.eclipse.jetty.servlet.ServletHandler.updateMappings(ServletHandler.java:1227)
[junit4:junit4]   2> 		at org.eclipse.jetty.servlet.ServletHandler.setFilterMappings(ServletHandler.java:1263)
[junit4:junit4]   2> 		at org.eclipse.jetty.servlet.ServletHandler.addFilterWithMapping(ServletHandler.java:965)
[junit4:junit4]   2> 		at org.eclipse.jetty.servlet.ServletHandler.addFilterWithMapping(ServletHandler.java:923)
[junit4:junit4]   2> 		at org.eclipse.jetty.servlet.ServletContextHandler.addFilter(ServletContextHandler.java:333)
[junit4:junit4]   2> 		at org.apache.solr.client.solrj.embedded.JettySolrRunner$1.lifeCycleStarted(JettySolrRunner.java:173)
[junit4:junit4]   2> 		at org.eclipse.jetty.util.component.AbstractLifeCycle.setStarted(AbstractLifeCycle.java:169)
[junit4:junit4]   2> 		at org.eclipse.jetty.util.component.AbstractLifeCycle.start(AbstractLifeCycle.java:60)
[junit4:junit4]   2> 		at org.apache.solr.client.solrj.embedded.JettySolrRunner.start(JettySolrRunner.java:225)
[junit4:junit4]   2> 		at org.apache.solr.client.solrj.embedded.JettySolrRunner.start(JettySolrRunner.java:205)
[junit4:junit4]   2> 		at org.apache.solr.BaseDistributedSearchTestCase.createJetty(BaseDistributedSearchTestCase.java:262)
[junit4:junit4]   2> 		at org.apache.solr.BaseDistributedSearchTestCase.createJetty(BaseDistributedSearchTestCase.java:254)
[junit4:junit4]   2> 		at org.apache.solr.cloud.AbstractFullDistribZkTestBase.createServers(AbstractFullDistribZkTestBase.java:235)
[junit4:junit4]   2> 		at org.apache.solr.BaseDistributedSearchTestCase.testDistribSearch(BaseDistributedSearchTestCase.java:693)
[junit4:junit4]   2> 		at sun.reflect.NativeMethodAccessorImpl.invoke0(Native Method)
[junit4:junit4]   2> 		at sun.reflect.NativeMethodAccessorImpl.invoke(NativeMethodAccessorImpl.java:39)
[junit4:junit4]   2> 		at sun.reflect.DelegatingMethodAccessorImpl.invoke(DelegatingMethodAccessorImpl.java:25)
[junit4:junit4]   2> 		at java.lang.reflect.Method.invoke(Method.java:597)
[junit4:junit4]   2> 		at com.carrotsearch.randomizedtesting.RandomizedRunner.invoke(RandomizedRunner.java:1559)
[junit4:junit4]   2> 		at com.carrotsearch.randomizedtesting.RandomizedRunner.access$600(RandomizedRunner.java:79)
[junit4:junit4]   2> 		at com.carrotsearch.randomizedtesting.RandomizedRunner$6.evaluate(RandomizedRunner.java:737)
[junit4:junit4]   2> 		at com.carrotsearch.randomizedtesting.RandomizedRunner$7.evaluate(RandomizedRunner.java:773)
[junit4:junit4]   2> 		at com.carrotsearch.randomizedtesting.RandomizedRunner$8.evaluate(RandomizedRunner.java:787)
[junit4:junit4]   2> 		at com.carrotsearch.randomizedtesting.rules.SystemPropertiesRestoreRule$1.evaluate(SystemPropertiesRestoreRule.java:53)
[junit4:junit4]   2> 		at org.apache.lucene.util.TestRuleSetupTeardownChained$1.evaluate(TestRuleSetupTeardownChained.java:50)
[junit4:junit4]   2> 		at org.apache.lucene.util.TestRuleFieldCacheSanity$1.evaluate(TestRuleFieldCacheSanity.java:51)
[junit4:junit4]   2> 		at org.apache.lucene.util.AbstractBeforeAfterRule$1.evaluate(AbstractBeforeAfterRule.java:45)
[junit4:junit4]   2> 		at com.carrotsearch.randomizedtesting.rules.SystemPropertiesInvariantRule$1.evaluate(SystemPropertiesInvariantRule.java:55)
[junit4:junit4]   2> 		at org.apache.lucene.util.TestRuleThreadAndTestName$1.evaluate(TestRuleThreadAndTestName.java:48)
[junit4:junit4]   2> 		at org.apache.lucene.util.TestRuleIgnoreAfterMaxFailures$1.evaluate(TestRuleIgnoreAfterMaxFailures.java:70)
[junit4:junit4]   2> 		at org.apache.lucene.util.TestRuleMarkFailure$1.evaluate(TestRuleMarkFailure.java:48)
[junit4:junit4]   2> 		at com.carrotsearch.randomizedtesting.rules.StatementAdapter.evaluate(StatementAdapter.java:36)
[junit4:junit4]   2> 		at com.carrotsearch.randomizedtesting.ThreadLeakControl$StatementRunner.run(ThreadLeakControl.java:358)
[junit4:junit4]   2> 		at com.carrotsearch.randomizedtesting.ThreadLeakControl.forkTimeoutingTask(ThreadLeakControl.java:782)
[junit4:junit4]   2> 		at com.carrotsearch.randomizedtesting.ThreadLeakControl$3.evaluate(ThreadLeakControl.java:442)
[junit4:junit4]   2> 		at com.carrotsearch.randomizedtesting.RandomizedRunner.runSingleTest(RandomizedRunner.java:746)
[junit4:junit4]   2> 		at com.carrotsearch.randomizedtesting.RandomizedRunner$3.evaluate(RandomizedRunner.java:648)
[junit4:junit4]   2> 		at com.carrotsearch.randomizedtesting.RandomizedRunner$4.evaluate(RandomizedRunner.java:682)
[junit4:junit4]   2> 		at com.carrotsearch.randomizedtesting.RandomizedRunner$5.evaluate(RandomizedRunner.java:693)
[junit4:junit4]   2> 		at com.carrotsearch.randomizedtesting.rules.StatementAdapter.evaluate(StatementAdapter.java:36)
[junit4:junit4]   2> 		at com.carrotsearch.randomizedtesting.rules.SystemPropertiesRestoreRule$1.evaluate(SystemPropertiesRestoreRule.java:53)
[junit4:junit4]   2> 		at org.apache.lucene.util.AbstractBeforeAfterRule$1.evaluate(AbstractBeforeAfterRule.java:45)
[junit4:junit4]   2> 		at org.apache.lucene.util.TestRuleStoreClassName$1.evaluate(TestRuleStoreClassName.java:42)
[junit4:junit4]   2> 		at com.carrotsearch.randomizedtesting.rules.SystemPropertiesInvariantRule$1.evaluate(SystemPropertiesInvariantRule.java:55)
[junit4:junit4]   2> 		at com.carrotsearch.randomizedtesting.rules.NoShadowingOrOverridesOnMethodsRule$1.evaluate(NoShadowingOrOverridesOnMethodsRule.java:39)
[junit4:junit4]   2> 		at com.carrotsearch.randomizedtesting.rules.NoShadowingOrOverridesOnMethodsRule$1.evaluate(NoShadowingOrOverridesOnMethodsRule.java:39)
[junit4:junit4]   2> 		at com.carrotsearch.randomizedtesting.rules.StatementAdapter.evaluate(StatementAdapter.java:36)
[junit4:junit4]   2> 		at org.apache.lucene.util.TestRuleAssertionsRequired$1.evaluate(TestRuleAssertionsRequired.java:43)
[junit4:junit4]   2> 		at org.apache.lucene.util.TestRuleMarkFailure$1.evaluate(TestRuleMarkFailure.java:48)
[junit4:junit4]   2> 		at org.apache.lucene.util.TestRuleIgnoreAfterMaxFailures$1.evaluate(TestRuleIgnoreAfterMaxFailures.java:70)
[junit4:junit4]   2> 		at org.apache.lucene.util.TestRuleIgnoreTestSuites$1.evaluate(TestRuleIgnoreTestSuites.java:55)
[junit4:junit4]   2> 		at com.carrotsearch.randomizedtesting.rules.StatementAdapter.evaluate(StatementAdapter.java:36)
[junit4:junit4]   2> 		at com.carrotsearch.randomizedtesting.ThreadLeakControl$StatementRunner.run(ThreadLeakControl.java:358)
[junit4:junit4]   2> 		at java.lang.Thread.run(Thread.java:662)
[junit4:junit4]   2> 	Caused by: org.apache.zookeeper.KeeperException$SessionExpiredException: KeeperErrorCode = Session expired for /live_nodes/127.0.0.1:63173_solr
[junit4:junit4]   2> 		at org.apache.zookeeper.KeeperException.create(KeeperException.java:118)
[junit4:junit4]   2> 		at org.apache.zookeeper.KeeperException.create(KeeperException.java:42)
[junit4:junit4]   2> 		at org.apache.zookeeper.ZooKeeper.delete(ZooKeeper.java:734)
[junit4:junit4]   2> 		at org.apache.solr.common.cloud.SolrZkClient$2.execute(SolrZkClient.java:144)
[junit4:junit4]   2> 		at org.apache.solr.common.cloud.SolrZkClient$2.execute(SolrZkClient.java:141)
[junit4:junit4]   2> 		at org.apache.solr.common.cloud.ZkCmdExecutor.retryOperation(ZkCmdExecutor.java:63)
[junit4:junit4]   2> 		at org.apache.solr.common.cloud.SolrZkClient.delete(SolrZkClient.java:141)
[junit4:junit4]   2> 		at org.apache.solr.cloud.ZkController.createEphemeralLiveNode(ZkController.java:466)
[junit4:junit4]   2> 		at org.apache.solr.cloud.ZkController.init(ZkController.java:415)
[junit4:junit4]   2> 		... 63 more
[junit4:junit4]   2> 	
[junit4:junit4]   2> 9940 T151 oass.SolrDispatchFilter.init SolrDispatchFilter.init() done
[junit4:junit4]   2> 9940 T151 oascsi.HttpClientUtil.createClient Creating new http client, config:maxConnections=128&maxConnectionsPerHost=32&followRedirects=false
[junit4:junit4]   2> 9940 T151 oascsi.HttpClientUtil.createClient Creating new http client, config:
[junit4:junit4]   2> 9971 T151 oaz.ZooKeeper.<init> Initiating client connection, connectString=127.0.0.1:63166/solr sessionTimeout=10000 watcher=org.apache.solr.common.cloud.ConnectionManager@36f0c9
[junit4:junit4]   2> 9971 T151 oascc.ConnectionManager.waitForConnected Waiting for client to connect to ZooKeeper
[junit4:junit4]   2> 9971 T174 oaz.ClientCnxn$SendThread.startConnect Opening socket connection to server /127.0.0.1:63166
[junit4:junit4]   2> 9971 T174 oaz.ClientCnxn$SendThread.primeConnection Socket connection established to 127.0.0.1/127.0.0.1:63166, initiating session
[junit4:junit4]   2> 9971 T153 oazs.NIOServerCnxn$Factory.run Accepted socket connection from /127.0.0.1:63185
[junit4:junit4]   2> 9971 T153 oazs.NIOServerCnxn.readConnectRequest Client attempting to establish new session at /127.0.0.1:63185
[junit4:junit4]   2> 10002 T155 oazs.NIOServerCnxn.finishSessionInit Established session 0x13ac841b58f0004 with negotiated timeout 10000 for client /127.0.0.1:63185
[junit4:junit4]   2> 10002 T174 oaz.ClientCnxn$SendThread.readConnectResult Session establishment complete on server 127.0.0.1/127.0.0.1:63166, sessionid = 0x13ac841b58f0004, negotiated timeout = 10000
[junit4:junit4]   2> 10002 T175 oascc.ConnectionManager.process Watcher org.apache.solr.common.cloud.ConnectionManager@36f0c9 name:ZooKeeperConnection Watcher:127.0.0.1:63166/solr got event WatchedEvent state:SyncConnected type:None path:null path:null type:None
[junit4:junit4]   2> 10002 T151 oascc.ConnectionManager.waitForConnected Client is connected to ZooKeeper
[junit4:junit4]   2> 10002 T151 oascc.SolrZkClient.makePath makePath: /clusterstate.json
[junit4:junit4]   2> 10018 T151 oascc.ZkStateReader.createClusterStateWatchersAndUpdate Updating cluster state from ZooKeeper... 
[junit4:junit4]   2> 10065 T151 oasc.ChaosMonkey.monkeyLog monkey: init - expire sessions:true cause connection loss:true
[junit4:junit4]   2> 10346 T151 oejs.Server.doStart jetty-8.1.2.v20120308
[junit4:junit4]   2> 10346 T151 oejs.AbstractConnector.doStart Started SelectChannelConnector@0.0.0.0:63186
[junit4:junit4]   2> 10346 T151 oasc.SolrResourceLoader.locateSolrHome JNDI not configured for solr (NoInitialContextEx)
[junit4:junit4]   2> 10346 T151 oasc.SolrResourceLoader.locateSolrHome using system property solr.solr.home: C:\Users\JenkinsSlave\workspace\Lucene-Solr-trunk-Windows\solr\build\solr-core\test\J0\.\org.apache.solr.cloud.BasicDistributedZk2Test-jetty1-1351979490293
[junit4:junit4]   2> 10346 T151 oasc.SolrResourceLoader.<init> new SolrResourceLoader for deduced Solr Home: 'C:\Users\JenkinsSlave\workspace\Lucene-Solr-trunk-Windows\solr\build\solr-core\test\J0\.\org.apache.solr.cloud.BasicDistributedZk2Test-jetty1-1351979490293\'
[junit4:junit4]   2> 10377 T151 oass.SolrDispatchFilter.init SolrDispatchFilter.init()
[junit4:junit4]   2> 10377 T151 oasc.SolrResourceLoader.locateSolrHome JNDI not configured for solr (NoInitialContextEx)
[junit4:junit4]   2> 10377 T151 oasc.SolrResourceLoader.locateSolrHome using system property solr.solr.home: C:\Users\JenkinsSlave\workspace\Lucene-Solr-trunk-Windows\solr\build\solr-core\test\J0\.\org.apache.solr.cloud.BasicDistributedZk2Test-jetty1-1351979490293
[junit4:junit4]   2> 10377 T151 oasc.CoreContainer$Initializer.initialize looking for solr.xml: C:\Users\JenkinsSlave\workspace\Lucene-Solr-trunk-Windows\solr\build\solr-core\test\J0\.\org.apache.solr.cloud.BasicDistributedZk2Test-jetty1-1351979490293\solr.xml
[junit4:junit4]   2> 10377 T151 oasc.CoreContainer.<init> New CoreContainer 4731499
[junit4:junit4]   2> 10377 T151 oasc.CoreContainer.load Loading CoreContainer using Solr Home: 'C:\Users\JenkinsSlave\workspace\Lucene-Solr-trunk-Windows\solr\build\solr-core\test\J0\.\org.apache.solr.cloud.BasicDistributedZk2Test-jetty1-1351979490293\'
[junit4:junit4]   2> 10377 T151 oasc.SolrResourceLoader.<init> new SolrResourceLoader for directory: 'C:\Users\JenkinsSlave\workspace\Lucene-Solr-trunk-Windows\solr\build\solr-core\test\J0\.\org.apache.solr.cloud.BasicDistributedZk2Test-jetty1-1351979490293\'
[junit4:junit4]   2> 10409 T151 oasc.CoreContainer.load Registering Log Listener
[junit4:junit4]   2> 10424 T151 oasc.CoreContainer.initZooKeeper Zookeeper client=127.0.0.1:63166/solr
[junit4:junit4]   2> 10424 T151 oaz.ZooKeeper.<init> Initiating client connection, connectString=127.0.0.1:63166/solr sessionTimeout=5000 watcher=org.apache.solr.common.cloud.ConnectionManager@18628c8
[junit4:junit4]   2> 10424 T185 oaz.ClientCnxn$SendThread.startConnect Opening socket connection to server /127.0.0.1:63166
[junit4:junit4]   2> 10424 T151 oascc.ConnectionManager.waitForConnected Waiting for client to connect to ZooKeeper
[junit4:junit4]   2> 10424 T185 oaz.ClientCnxn$SendThread.primeConnection Socket connection established to 127.0.0.1/127.0.0.1:63166, initiating session
[junit4:junit4]   2> 10424 T153 oazs.NIOServerCnxn$Factory.run Accepted socket connection from /127.0.0.1:63191
[junit4:junit4]   2> 10424 T153 oazs.NIOServerCnxn.readConnectRequest Client attempting to establish new session at /127.0.0.1:63191
[junit4:junit4]   2> 10440 T155 oazs.NIOServerCnxn.finishSessionInit Established session 0x13ac841b58f0005 with negotiated timeout 5000 for client /127.0.0.1:63191
[junit4:junit4]   2> 10440 T185 oaz.ClientCnxn$SendThread.readConnectResult Session establishment complete on server 127.0.0.1/127.0.0.1:63166, sessionid = 0x13ac841b58f0005, negotiated timeout = 5000
[junit4:junit4]   2> 10440 T186 oascc.ConnectionManager.process Watcher org.apache.solr.common.cloud.ConnectionManager@18628c8 name:ZooKeeperConnection Watcher:127.0.0.1:63166/solr got event WatchedEvent state:SyncConnected type:None path:null path:null type:None
[junit4:junit4]   2> 10440 T151 oascc.ConnectionManager.waitForConnected Client is connected to ZooKeeper
[junit4:junit4]   2> 10440 T156 oazs.PrepRequestProcessor.pRequest Got user-level KeeperException when processing sessionid:0x13ac841b58f0005 type:create cxid:0x1 zxid:0xfffffffffffffffe txntype:unknown reqpath:n/a Error Path:/solr/overseer Error:KeeperErrorCode = NodeExists for /solr/overseer
[junit4:junit4]   2> 10440 T156 oazs.PrepRequestProcessor.pRequest Got user-level KeeperException when processing sessionid:0x13ac841b58f0005 type:create cxid:0x2 zxid:0xfffffffffffffffe txntype:unknown reqpath:n/a Error Path:/solr/overseer Error:KeeperErrorCode = NodeExists for /solr/overseer
[junit4:junit4]   2> 10471 T151 oasc.ZkController.createEphemeralLiveNode Register node as live in ZooKeeper:/live_nodes/127.0.0.1:63186_solr
[junit4:junit4]   2> 10471 T156 oazs.PrepRequestProcessor.pRequest Got user-level KeeperException when processing sessionid:0x13ac841b58f0005 type:delete cxid:0x4 zxid:0xfffffffffffffffe txntype:unknown reqpath:n/a Error Path:/solr/live_nodes/127.0.0.1:63186_solr Error:KeeperErrorCode = NoNode for /solr/live_nodes/127.0.0.1:63186_solr
[junit4:junit4]   2> 10487 T151 oascc.SolrZkClient.makePath makePath: /live_nodes/127.0.0.1:63186_solr
[junit4:junit4]   2> 10518 T175 oascc.ZkStateReader$3.process Updating live nodes... (1)
[junit4:junit4]   2> 10518 T151 oashc.HttpShardHandlerFactory.getParameter Setting socketTimeout to: 0
[junit4:junit4]   2> 10518 T151 oashc.HttpShardHandlerFactory.getParameter Setting urlScheme to: http://
[junit4:junit4]   2> 10518 T151 oashc.HttpShardHandlerFactory.getParameter Setting connTimeout to: 0
[junit4:junit4]   2> 10518 T151 oashc.HttpShardHandlerFactory.getParameter Setting maxConnectionsPerHost to: 20
[junit4:junit4]   2> 10518 T151 oashc.HttpShardHandlerFactory.getParameter Setting corePoolSize to: 0
[junit4:junit4]   2> 10518 T151 oashc.HttpShardHandlerFactory.getParameter Setting maximumPoolSize to: 2147483647
[junit4:junit4]   2> 10518 T151 oashc.HttpShardHandlerFactory.getParameter Setting maxThreadIdleTime to: 5
[junit4:junit4]   2> 10518 T151 oashc.HttpShardHandlerFactory.getParameter Setting sizeOfQueue to: -1
[junit4:junit4]   2> 10518 T151 oashc.HttpShardHandlerFactory.getParameter Setting fairnessPolicy to: false
[junit4:junit4]   2> 10518 T151 oascsi.HttpClientUtil.createClient Creating new http client, config:maxConnectionsPerHost=20&maxConnections=10000&socketTimeout=0&connTimeout=0&retry=false
[junit4:junit4]   2> 10534 T151 oascc.SolrZkClient.makePath makePath: /overseer_elect/election
[junit4:junit4]   2> 10596 T156 oazs.PrepRequestProcessor.pRequest Got user-level KeeperException when processing sessionid:0x13ac841b58f0005 type:delete cxid:0x12 zxid:0xfffffffffffffffe txntype:unknown reqpath:n/a Error Path:/solr/overseer_elect/leader Error:KeeperErrorCode = NoNode for /solr/overseer_elect/leader
[junit4:junit4]   2> 10612 T151 oascc.SolrZkClient.makePath makePath: /overseer_elect/leader
[junit4:junit4]   2> 10627 T151 oasc.Overseer.start Overseer (id=88603327231623173-127.0.0.1:63186_solr-n_0000000000) starting
[junit4:junit4]   2> 10643 T156 oazs.PrepRequestProcessor.pRequest Got user-level KeeperException when processing sessionid:0x13ac841b58f0005 type:create cxid:0x17 zxid:0xfffffffffffffffe txntype:unknown reqpath:n/a Error Path:/solr/overseer Error:KeeperErrorCode = NodeExists for /solr/overseer
[junit4:junit4]   2> 10659 T156 oazs.PrepRequestProcessor.pRequest Got user-level KeeperException when processing sessionid:0x13ac841b58f0005 type:create cxid:0x18 zxid:0xfffffffffffffffe txntype:unknown reqpath:n/a Error Path:/solr/overseer Error:KeeperErrorCode = NodeExists for /solr/overseer
[junit4:junit4]   2> 10690 T156 oazs.PrepRequestProcessor.pRequest Got user-level KeeperException when processing sessionid:0x13ac841b58f0005 type:create cxid:0x19 zxid:0xfffffffffffffffe txntype:unknown reqpath:n/a Error Path:/solr/overseer Error:KeeperErrorCode = NodeExists for /solr/overseer
[junit4:junit4]   2> 10705 T156 oazs.PrepRequestProcessor.pRequest Got user-level KeeperException when processing sessionid:0x13ac841b58f0005 type:create cxid:0x1a zxid:0xfffffffffffffffe txntype:unknown reqpath:n/a Error Path:/solr/overseer Error:KeeperErrorCode = NodeExists for /solr/overseer
[junit4:junit4]   2> 10721 T188 oasc.OverseerCollectionProcessor.run Process current queue of collection messages
[junit4:junit4]   2> 10721 T151 oascc.ZkStateReader.createClusterStateWatchersAndUpdate Updating cluster state from ZooKeeper... 
[junit4:junit4]   2> 10737 T187 oasc.Overseer$ClusterStateUpdater.run Starting to work on the main queue
[junit4:junit4]   2> 10752 T151 oasc.CoreContainer.create Creating SolrCore 'collection1' using instanceDir: C:\Users\JenkinsSlave\workspace\Lucene-Solr-trunk-Windows\solr\build\solr-core\test\J0\.\org.apache.solr.cloud.BasicDistributedZk2Test-jetty1-1351979490293\collection1
[junit4:junit4]   2> 10752 T151 oasc.ZkController.createCollectionZkNode Check for collection zkNode:collection1
[junit4:junit4]   2> 10768 T151 oasc.ZkController.createCollectionZkNode Collection zkNode exists
[junit4:junit4]   2> 10768 T151 oasc.ZkController.readConfigName Load collection config from:/collections/collection1
[junit4:junit4]   2> 10768 T151 oasc.SolrResourceLoader.<init> new SolrResourceLoader for directory: 'C:\Users\JenkinsSlave\workspace\Lucene-Solr-trunk-Windows\solr\build\solr-core\test\J0\.\org.apache.solr.cloud.BasicDistributedZk2Test-jetty1-1351979490293\collection1\'
[junit4:junit4]   2> 10768 T151 oasc.SolrResourceLoader.replaceClassLoader Adding 'file:/C:/Users/JenkinsSlave/workspace/Lucene-Solr-trunk-Windows/solr/build/solr-core/test/J0/org.apache.solr.cloud.BasicDistributedZk2Test-jetty1-1351979490293/collection1/lib/classes/' to classloader
[junit4:junit4]   2> 10768 T151 oasc.SolrResourceLoader.replaceClassLoader Adding 'file:/C:/Users/JenkinsSlave/workspace/Lucene-Solr-trunk-Windows/solr/build/solr-core/test/J0/org.apache.solr.cloud.BasicDistributedZk2Test-jetty1-1351979490293/collection1/lib/README' to classloader
[junit4:junit4]   2> 10830 T151 oasc.SolrConfig.<init> Using Lucene MatchVersion: LUCENE_50
[junit4:junit4]   2> 10909 T151 oasc.SolrConfig.<init> Loaded SolrConfig: solrconfig.xml
[junit4:junit4]   2> 10909 T151 oass.IndexSchema.readSchema Reading Solr Schema
[junit4:junit4]   2> 10909 T151 oass.IndexSchema.readSchema Schema name=test
[junit4:junit4]   2> 11596 T151 oass.OpenExchangeRatesOrgProvider.init Initialized with rates=open-exchange-rates.json, refreshInterval=1440.
[junit4:junit4]   2> 11612 T151 oass.IndexSchema.readSchema default search field in schema is text
[junit4:junit4]   2> 11612 T151 oass.IndexSchema.readSchema unique key field: id
[junit4:junit4]   2> 11643 T151 oass.FileExchangeRateProvider.reload Reloading exchange rates from file currency.xml
[junit4:junit4]   2> 11643 T151 oass.FileExchangeRateProvider.reload Reloading exchange rates from file currency.xml
[junit4:junit4]   2> 11659 T151 oass.OpenExchangeRatesOrgProvider.reload Reloading exchange rates from open-exchange-rates.json
[junit4:junit4]   2> 11659 T151 oass.OpenExchangeRatesOrgProvider.reload Reloading exchange rates from open-exchange-rates.json
[junit4:junit4]   2> 11659 T151 oasc.SolrCore.<init> [collection1] Opening new SolrCore at C:\Users\JenkinsSlave\workspace\Lucene-Solr-trunk-Windows\solr\build\solr-core\test\J0\.\org.apache.solr.cloud.BasicDistributedZk2Test-jetty1-1351979490293\collection1\, dataDir=.\org.apache.solr.cloud.BasicDistributedZk2Test-1351979480244/jetty1\
[junit4:junit4]   2> 11659 T151 oasc.JmxMonitoredMap.<init> JMX monitoring is enabled. Adding Solr mbeans to JMX Server: com.sun.jmx.mbeanserver.JmxMBeanServer@10f41e9
[junit4:junit4]   2> 11659 T151 oasc.SolrCore.initDirectoryFactory solr.NRTCachingDirectoryFactory
[junit4:junit4]   2> 11690 T151 oasc.CachingDirectoryFactory.injectLockFactory WARNING No lockType configured for NRTCachingDirectory(org.apache.lucene.store.SimpleFSDirectory@C:\Users\JenkinsSlave\workspace\Lucene-Solr-trunk-Windows\solr\build\solr-core\test\J0\org.apache.solr.cloud.BasicDistributedZk2Test-1351979480244\jetty1 lockFactory=org.apache.lucene.store.NativeFSLockFactory@6bc02d; maxCacheMB=48.0 maxMergeSizeMB=4.0) assuming 'simple'
[junit4:junit4]   2> 11690 T151 oasc.CachingDirectoryFactory.get return new directory for C:\Users\JenkinsSlave\workspace\Lucene-Solr-trunk-Windows\solr\build\solr-core\test\J0\.\org.apache.solr.cloud.BasicDistributedZk2Test-1351979480244\jetty1 forceNew:false
[junit4:junit4]   2> 11690 T151 oasc.CachingDirectoryFactory.close Releasing directory:C:\Users\JenkinsSlave\workspace\Lucene-Solr-trunk-Windows\solr\build\solr-core\test\J0\.\org.apache.solr.cloud.BasicDistributedZk2Test-1351979480244\jetty1
[junit4:junit4]   2> 11690 T151 oasc.SolrCore.getNewIndexDir New index directory detected: old=null new=.\org.apache.solr.cloud.BasicDistributedZk2Test-1351979480244/jetty1\index/
[junit4:junit4]   2> 11690 T151 oasc.SolrCore.initIndex WARNING [collection1] Solr index directory '.\org.apache.solr.cloud.BasicDistributedZk2Test-1351979480244\jetty1\index' doesn't exist. Creating new index...
[junit4:junit4]   2> 11690 T151 oasc.CachingDirectoryFactory.get return new directory for C:\Users\JenkinsSlave\workspace\Lucene-Solr-trunk-Windows\solr\build\solr-core\test\J0\.\org.apache.solr.cloud.BasicDistributedZk2Test-1351979480244\jetty1\index forceNew:false
[junit4:junit4]   2> 11721 T151 oasc.SolrDeletionPolicy.onCommit SolrDeletionPolicy.onCommit: commits:num=1
[junit4:junit4]   2> 		commit{dir=NRTCachingDirectory(org.apache.lucene.store.SimpleFSDirectory@C:\Users\JenkinsSlave\workspace\Lucene-Solr-trunk-Windows\solr\build\solr-core\test\J0\org.apache.solr.cloud.BasicDistributedZk2Test-1351979480244\jetty1\index lockFactory=org.apache.lucene.store.NativeFSLockFactory@180ce9c; maxCacheMB=48.0 maxMergeSizeMB=4.0),segFN=segments_1,generation=1,filenames=[segments_1]
[junit4:junit4]   2> 11721 T151 oasc.SolrDeletionPolicy.updateCommits newest commit = 1[segments_1]
[junit4:junit4]   2> 11721 T151 oasc.CachingDirectoryFactory.close Releasing directory:C:\Users\JenkinsSlave\workspace\Lucene-Solr-trunk-Windows\solr\build\solr-core\test\J0\.\org.apache.solr.cloud.BasicDistributedZk2Test-1351979480244\jetty1\index
[junit4:junit4]   2> 11721 T151 oasc.SolrCore.initWriters created xml: solr.XMLResponseWriter
[junit4:junit4]   2> 11721 T151 oasup.UpdateRequestProcessorChain.init inserting DistributedUpdateProcessorFactory into updateRequestProcessorChain "dedupe"
[junit4:junit4]   2> 11721 T151 oasup.UpdateRequestProcessorChain.init inserting DistributedUpdateProcessorFactory into updateRequestProcessorChain "dedupe-allfields"
[junit4:junit4]   2> 11721 T151 oasup.UpdateRequestProcessorChain.init inserting DistributedUpdateProcessorFactory into updateRequestProcessorChain "stored_sig"
[junit4:junit4]   2> 11721 T151 oasup.UpdateRequestProcessorChain.init inserting DistributedUpdateProcessorFactory into updateRequestProcessorChain "uniq-fields"
[junit4:junit4]   2> 11721 T151 oasup.UpdateRequestProcessorChain.init inserting DistributedUpdateProcessorFactory into updateRequestProcessorChain "distrib-dup-test-chain-implicit"
[junit4:junit4]   2> 11721 T151 oasc.RequestHandlers.initHandlersFromConfig adding lazy requestHandler: solr.ReplicationHandler
[junit4:junit4]   2> 11721 T151 oasc.RequestHandlers.initHandlersFromConfig created /replication: solr.ReplicationHandler
[junit4:junit4]   2> 11721 T151 oasc.RequestHandlers.initHandlersFromConfig created standard: solr.StandardRequestHandler
[junit4:junit4]   2> 11721 T151 oasc.RequestHandlers.initHandlersFromConfig created /get: solr.RealTimeGetHandler
[junit4:junit4]   2> 11721 T151 oasc.RequestHandlers.initHandlersFromConfig created dismax: solr.SearchHandler
[junit4:junit4]   2> 11721 T151 oasc.RequestHandlers.initHandlersFromConfig created mock: org.apache.solr.core.MockQuerySenderListenerReqHandler
[junit4:junit4]   2> 11721 T151 oasc.RequestHandlers.initHandlersFromConfig created /admin/: org.apache.solr.handler.admin.AdminHandlers
[junit4:junit4]   2> 11721 T151 oasc.RequestHandlers.initHandlersFromConfig created defaults: solr.StandardRequestHandler
[junit4:junit4]   2> 11721 T151 oasc.RequestHandlers.initHandlersFromConfig adding lazy requestHandler: solr.StandardRequestHandler
[junit4:junit4]   2> 11721 T151 oasc.RequestHandlers.initHandlersFromConfig created lazy: solr.StandardRequestHandler
[junit4:junit4]   2> 11721 T151 oasc.RequestHandlers.initHandlersFromConfig created /update: solr.UpdateRequestHandler
[junit4:junit4]   2> 11721 T151 oasc.RequestHandlers.initHandlersFromConfig created /terms: org.apache.solr.handler.component.SearchHandler
[junit4:junit4]   2> 11721 T151 oasc.RequestHandlers.initHandlersFromConfig created spellCheckCompRH: org.apache.solr.handler.component.SearchHandler
[junit4:junit4]   2> 11721 T151 oasc.RequestHandlers.initHandlersFromConfig created spellCheckCompRH_Direct: org.apache.solr.handler.component.SearchHandler
[junit4:junit4]   2> 11721 T151 oasc.RequestHandlers.initHandlersFromConfig created spellCheckWithWordbreak: org.apache.solr.handler.component.SearchHandler
[junit4:junit4]   2> 11737 T151 oasc.RequestHandlers.initHandlersFromConfig created spellCheckWithWordbreak_Direct: org.apache.solr.handler.component.SearchHandler
[junit4:junit4]   2> 11737 T151 oasc.RequestHandlers.initHandlersFromConfig created spellCheckCompRH1: org.apache.solr.handler.component.SearchHandler
[junit4:junit4]   2> 11737 T151 oasc.RequestHandlers.initHandlersFromConfig created tvrh: org.apache.solr.handler.component.SearchHandler
[junit4:junit4]   2> 11737 T151 oasc.RequestHandlers.initHandlersFromConfig created /mlt: solr.MoreLikeThisHandler
[junit4:junit4]   2> 11737 T151 oasc.RequestHandlers.initHandlersFromConfig created /debug/dump: solr.DumpRequestHandler
[junit4:junit4]   2> 11737 T151 oashl.XMLLoader.init xsltCacheLifetimeSeconds=60
[junit4:junit4]   2> 11737 T151 oasc.SolrCore.initDeprecatedSupport WARNING solrconfig.xml uses deprecated <admin/gettableFiles>, Please update your config to use the ShowFileRequestHandler.
[junit4:junit4]   2> 11752 T151 oasc.SolrCore.initDeprecatedSupport WARNING adding ShowFileRequestHandler with hidden files: [SCHEMA.XML, OLD_SYNONYMS.TXT, STOPWORDS.TXT, PROTWORDS.TXT, OPEN-EXCHANGE-RATES.JSON, SYNONYMS.TXT, CURRENCY.XML, MAPPING-ISOLATIN1ACCENT.TXT]
[junit4:junit4]   2> 11752 T151 oasc.CachingDirectoryFactory.close Releasing directory:C:\Users\JenkinsSlave\workspace\Lucene-Solr-trunk-Windows\solr\build\solr-core\test\J0\.\org.apache.solr.cloud.BasicDistributedZk2Test-1351979480244\jetty1
[junit4:junit4]   2> 11752 T151 oass.SolrIndexSearcher.<init> Opening Searcher@1caa2ba main
[junit4:junit4]   2> 11752 T151 oasu.CommitTracker.<init> Hard AutoCommit: disabled
[junit4:junit4]   2> 11752 T151 oasu.CommitTracker.<init> Soft AutoCommit: disabled
[junit4:junit4]   2> 11752 T151 oashc.SpellCheckComponent.inform Initializing spell checkers
[junit4:junit4]   2> 11768 T151 oass.DirectSolrSpellChecker.init init: {name=direct,classname=DirectSolrSpellChecker,field=lowerfilt,minQueryLength=3}
[junit4:junit4]   2> 11877 T189 oasc.SolrCore.registerSearcher [collection1] Registered new searcher Searcher@1caa2ba main{StandardDirectoryReader(segments_1:1)}
[junit4:junit4]   2> 11877 T151 oasc.ZkController.publish numShards not found on descriptor - reading it from system property
[junit4:junit4]   2> 11877 T156 oazs.PrepRequestProcessor.pRequest Got user-level KeeperException when processing sessionid:0x13ac841b58f0005 type:create cxid:0x50 zxid:0xfffffffffffffffe txntype:unknown reqpath:n/a Error Path:/solr/overseer/queue Error:KeeperErrorCode = NoNode for /solr/overseer/queue
[junit4:junit4]   2> 12268 T187 oascc.ZkStateReader.updateClusterState Updating cloud state from ZooKeeper... 
[junit4:junit4]   2> 12268 T187 oasc.Overseer$ClusterStateUpdater.updateState Update state numShards=2 message={
[junit4:junit4]   2> 	  "operation":"state",
[junit4:junit4]   2> 	  "numShards":"2",
[junit4:junit4]   2> 	  "shard":null,
[junit4:junit4]   2> 	  "roles":null,
[junit4:junit4]   2> 	  "state":"down",
[junit4:junit4]   2> 	  "core":"collection1",
[junit4:junit4]   2> 	  "collection":"collection1",
[junit4:junit4]   2> 	  "node_name":"127.0.0.1:63186_solr",
[junit4:junit4]   2> 	  "base_url":"http://127.0.0.1:63186/solr"}
[junit4:junit4]   2> 12268 T187 oasc.Overseer$ClusterStateUpdater.createCollection Create collection collection1 with numShards 2
[junit4:junit4]   2> 12284 T156 oazs.PrepRequestProcessor.pRequest Got user-level KeeperException when processing sessionid:0x13ac841b58f0005 type:create cxid:0x58 zxid:0xfffffffffffffffe txntype:unknown reqpath:n/a Error Path:/solr/overseer/queue-work Error:KeeperErrorCode = NoNode for /solr/overseer/queue-work
[junit4:junit4]   2> 12299 T175 oascc.ZkStateReader$2.process A cluster state change has occurred - updating... (1)
[junit4:junit4]   2> 12299 T186 oascc.ZkStateReader$2.process A cluster state change has occurred - updating... (1)
[junit4:junit4]   2> 12393 T151 oasc.CoreContainer.registerCore registering core: collection1
[junit4:junit4]   2> 12393 T151 oasc.ZkController.register Register shard - core:collection1 address:http://127.0.0.1:63186/solr shardId:shard1
[junit4:junit4]   2> 12393 T151 oascsi.HttpClientUtil.createClient Creating new http client, config:maxConnections=10000&maxConnectionsPerHost=20&connTimeout=30000&socketTimeout=30000&retry=false
[junit4:junit4]   2> 12409 T151 oascc.SolrZkClient.makePath makePath: /collections/collection1/leader_elect/shard1/election
[junit4:junit4]   2> 12424 T156 oazs.PrepRequestProcessor.pRequest Got user-level KeeperException when processing sessionid:0x13ac841b58f0005 type:delete cxid:0x72 zxid:0xfffffffffffffffe txntype:unknown reqpath:n/a Error Path:/solr/collections/collection1/leaders Error:KeeperErrorCode = NoNode for /solr/collections/collection1/leaders
[junit4:junit4]   2> 12424 T151 oasc.ShardLeaderElectionContext.runLeaderProcess Running the leader process.
[junit4:junit4]   2> 12424 T156 oazs.PrepRequestProcessor.pRequest Got user-level KeeperException when processing sessionid:0x13ac841b58f0005 type:create cxid:0x73 zxid:0xfffffffffffffffe txntype:unknown reqpath:n/a Error Path:/solr/overseer Error:KeeperErrorCode = NodeExists for /solr/overseer
[junit4:junit4]   2> 12424 T151 oasc.ShardLeaderElectionContext.waitForReplicasToComeUp Enough replicas found to continue.
[junit4:junit4]   2> 12424 T151 oasc.ShardLeaderElectionContext.runLeaderProcess I may be the new leader - try and sync
[junit4:junit4]   2> 12424 T151 oasc.SyncStrategy.sync Sync replicas to http://127.0.0.1:63186/solr/collection1/
[junit4:junit4]   2> 12424 T151 oasc.SyncStrategy.syncReplicas Sync Success - now sync replicas to me
[junit4:junit4]   2> 12424 T151 oasc.SyncStrategy.syncToMe http://127.0.0.1:63186/solr/collection1/ has no replicas
[junit4:junit4]   2> 12424 T151 oasc.ShardLeaderElectionContext.runLeaderProcess I am the new leader: http://127.0.0.1:63186/solr/collection1/
[junit4:junit4]   2> 12424 T151 oascc.SolrZkClient.makePath makePath: /collections/collection1/leaders/shard1
[junit4:junit4]   2> 12440 T156 oazs.PrepRequestProcessor.pRequest Got user-level KeeperException when processing sessionid:0x13ac841b58f0005 type:create cxid:0x7d zxid:0xfffffffffffffffe txntype:unknown reqpath:n/a Error Path:/solr/overseer Error:KeeperErrorCode = NodeExists for /solr/overseer
[junit4:junit4]   2> 12815 T187 oascc.ZkStateReader.updateClusterState Updating cloud state from ZooKeeper... 
[junit4:junit4]   2> 12830 T186 oascc.ZkStateReader$2.process A cluster state change has occurred - updating... (1)
[junit4:junit4]   2> 12830 T175 oascc.ZkStateReader$2.process A cluster state change has occurred - updating... (1)
[junit4:junit4]   2> 12877 T151 oasc.ZkController.register We are http://127.0.0.1:63186/solr/collection1/ and leader is http://127.0.0.1:63186/solr/collection1/
[junit4:junit4]   2> 12877 T151 oasc.ZkController.register No LogReplay needed for core=collection1 baseURL=http://127.0.0.1:63186/solr
[junit4:junit4]   2> 12877 T151 oasc.ZkController.checkRecovery I am the leader, no recovery necessary
[junit4:junit4]   2> 12877 T151 oasc.ZkController.publish numShards not found on descriptor - reading it from system property
[junit4:junit4]   2> 12877 T151 oascc.ZkStateReader.updateClusterState Updating cloud state from ZooKeeper... 
[junit4:junit4]   2> 12877 T151 oass.SolrDispatchFilter.init user.dir=C:\Users\JenkinsSlave\workspace\Lucene-Solr-trunk-Windows\solr\build\solr-core\test\J0
[junit4:junit4]   2> 12877 T151 oass.SolrDispatchFilter.init SolrDispatchFilter.init() done
[junit4:junit4]   2> 12877 T151 oascsi.HttpClientUtil.createClient Creating new http client, config:maxConnections=128&maxConnectionsPerHost=32&followRedirects=false
[junit4:junit4]   2> 13205 T151 oejs.Server.doStart jetty-8.1.2.v20120308
[junit4:junit4]   2> 13221 T151 oejs.AbstractConnector.doStart Started SelectChannelConnector@0.0.0.0:63192
[junit4:junit4]   2> 13221 T151 oasc.SolrResourceLoader.locateSolrHome JNDI not configured for solr (NoInitialContextEx)
[junit4:junit4]   2> 13221 T151 oasc.SolrResourceLoader.locateSolrHome using system property solr.solr.home: C:\Users\JenkinsSlave\workspace\Lucene-Solr-trunk-Windows\solr\build\solr-core\test\J0\.\org.apache.solr.cloud.BasicDistributedZk2Test-jetty2-1351979493105
[junit4:junit4]   2> 13221 T151 oasc.SolrResourceLoader.<init> new SolrResourceLoader for deduced Solr Home: 'C:\Users\JenkinsSlave\workspace\Lucene-Solr-trunk-Windows\solr\build\solr-core\test\J0\.\org.apache.solr.cloud.BasicDistributedZk2Test-jetty2-1351979493105\'
[junit4:junit4]   2> 13237 T151 oass.SolrDispatchFilter.init SolrDispatchFilter.init()
[junit4:junit4]   2> 13237 T151 oasc.SolrResourceLoader.locateSolrHome JNDI not configured for solr (NoInitialContextEx)
[junit4:junit4]   2> 13252 T151 oasc.SolrResourceLoader.locateSolrHome using system property solr.solr.home: C:\Users\JenkinsSlave\workspace\Lucene-Solr-trunk-Windows\solr\build\solr-core\test\J0\.\org.apache.solr.cloud.BasicDistributedZk2Test-jetty2-1351979493105
[junit4:junit4]   2> 13252 T151 oasc.CoreContainer$Initializer.initialize looking for solr.xml: C:\Users\JenkinsSlave\workspace\Lucene-Solr-trunk-Windows\solr\build\solr-core\test\J0\.\org.apache.solr.cloud.BasicDistributedZk2Test-jetty2-1351979493105\solr.xml
[junit4:junit4]   2> 13252 T151 oasc.CoreContainer.<init> New CoreContainer 9887497
[junit4:junit4]   2> 13252 T151 oasc.CoreContainer.load Loading CoreContainer using Solr Home: 'C:\Users\JenkinsSlave\workspace\Lucene-Solr-trunk-Windows\solr\build\solr-core\test\J0\.\org.apache.solr.cloud.BasicDistributedZk2Test-jetty2-1351979493105\'
[junit4:junit4]   2> 13252 T151 oasc.SolrResourceLoader.<init> new SolrResourceLoader for directory: 'C:\Users\JenkinsSlave\workspace\Lucene-Solr-trunk-Windows\solr\build\solr-core\test\J0\.\org.apache.solr.cloud.BasicDistributedZk2Test-jetty2-1351979493105\'
[junit4:junit4]   2> 13268 T151 oasc.CoreContainer.load Registering Log Listener
[junit4:junit4]   2> 13284 T151 oasc.CoreContainer.initZooKeeper Zookeeper client=127.0.0.1:63166/solr
[junit4:junit4]   2> 13284 T151 oaz.ZooKeeper.<init> Initiating client connection, connectString=127.0.0.1:63166/solr sessionTimeout=5000 watcher=org.apache.solr.common.cloud.ConnectionManager@c3fc68
[junit4:junit4]   2> 13299 T151 oascc.ConnectionManager.waitForConnected Waiting for client to connect to ZooKeeper
[junit4:junit4]   2> 13299 T199 oaz.ClientCnxn$SendThread.startConnect Opening socket connection to server /127.0.0.1:63166
[junit4:junit4]   2> 13299 T199 oaz.ClientCnxn$SendThread.primeConnection Socket connection established to 127.0.0.1/127.0.0.1:63166, initiating session
[junit4:junit4]   2> 13299 T153 oazs.NIOServerCnxn$Factory.run Accepted socket connection from /127.0.0.1:63197
[junit4:junit4]   2> 13299 T153 oazs.NIOServerCnxn.readConnectRequest Client attempting to establish new session at /127.0.0.1:63197
[junit4:junit4]   2> 13330 T155 oazs.NIOServerCnxn.finishSessionInit Established session 0x13ac841b58f0006 with negotiated timeout 5000 for client /127.0.0.1:63197
[junit4:junit4]   2> 13330 T199 oaz.ClientCnxn$SendThread.readConnectResult Session establishment complete on server 127.0.0.1/127.0.0.1:63166, sessionid = 0x13ac841b58f0006, negotiated timeout = 5000
[junit4:junit4]   2> 13330 T200 oascc.ConnectionManager.process Watcher org.apache.solr.common.cloud.ConnectionManager@c3fc68 name:ZooKeeperConnection Watcher:127.0.0.1:63166/solr got event WatchedEvent state:SyncConnected type:None path:null path:null type:None
[junit4:junit4]   2> 13330 T151 oascc.ConnectionManager.waitForConnected Client is connected to ZooKeeper
[junit4:junit4]   2> 13346 T156 oazs.PrepRequestProcessor.pRequest Got user-level KeeperException when processing sessionid:0x13ac841b58f0006 type:create cxid:0x1 zxid:0xfffffffffffffffe txntype:unknown reqpath:n/a Error Path:/solr/overseer Error:KeeperErrorCode = NodeExists for /solr/overseer
[junit4:junit4]   2> 13362 T187 oascc.ZkStateReader.updateClusterState Updating cloud state from ZooKeeper... 
[junit4:junit4]   2> 13362 T156 oazs.PrepRequestProcessor.pRequest Got user-level KeeperException when processing sessionid:0x13ac841b58f0006 type:create cxid:0x2 zxid:0xfffffffffffffffe txntype:unknown reqpath:n/a Error Path:/solr/overseer Error:KeeperErrorCode = NodeExists for /solr/overseer
[junit4:junit4]   2> 13362 T187 oasc.Overseer$ClusterStateUpdater.updateState Update state numShards=2 message={
[junit4:junit4]   2> 	  "operation":"state",
[junit4:junit4]   2> 	  "numShards":"2",
[junit4:junit4]   2> 	  "shard":"shard1",
[junit4:junit4]   2> 	  "roles":null,
[junit4:junit4]   2> 	  "state":"active",
[junit4:junit4]   2> 	  "core":"collection1",
[junit4:junit4]   2> 	  "collection":"collection1",
[junit4:junit4]   2> 	  "node_name":"127.0.0.1:63186_solr",
[junit4:junit4]   2> 	  "base_url":"http://127.0.0.1:63186/solr"}
[junit4:junit4]   2> 13362 T151 oasc.ZkController.createEphemeralLiveNode Register node as live in ZooKeeper:/live_nodes/127.0.0.1:63192_solr
[junit4:junit4]   2> 13362 T156 oazs.PrepRequestProcessor.pRequest Got user-level KeeperException when processing sessionid:0x13ac841b58f0006 type:delete cxid:0x4 zxid:0xfffffffffffffffe txntype:unknown reqpath:n/a Error Path:/solr/live_nodes/127.0.0.1:63192_solr Error:KeeperErrorCode = NoNode for /solr/live_nodes/127.0.0.1:63192_solr
[junit4:junit4]   2> 13393 T151 oascc.SolrZkClient.makePath makePath: /live_nodes/127.0.0.1:63192_solr
[junit4:junit4]   2> 13440 T175 oascc.ZkStateReader$2.process A cluster state change has occurred - updating... (1)
[junit4:junit4]   2> 13440 T186 oascc.ZkStateReader$2.process A cluster state change has occurred - updating... (1)
[junit4:junit4]   2> 13471 T151 oashc.HttpShardHandlerFactory.getParameter Setting socketTimeout to: 0
[junit4:junit4]   2> 13471 T151 oashc.HttpShardHandlerFactory.getParameter Setting urlScheme to: http://
[junit4:junit4]   2> 13471 T151 oashc.HttpShardHandlerFactory.getParameter Setting connTimeout to: 0
[junit4:junit4]   2> 13471 T151 oashc.HttpShardHandlerFactory.getParameter Setting maxConnectionsPerHost to: 20
[junit4:junit4]   2> 13471 T175 oascc.ZkStateReader$3.process Updating live nodes... (2)
[junit4:junit4]   2> 13471 T151 oashc.HttpShardHandlerFactory.getParameter Setting corePoolSize to: 0
[junit4:junit4]   2> 13471 T175 oascc.ZkStateReader$2.process A cluster state change has occurred - updating... (2)
[junit4:junit4]   2> 13471 T151 oashc.HttpShardHandlerFactory.getParameter Setting maximumPoolSize to: 2147483647
[junit4:junit4]   2> 13471 T151 oashc.HttpShardHandlerFactory.getParameter Setting maxThreadIdleTime to: 5
[junit4:junit4]   2> 13471 T151 oashc.HttpShardHandlerFactory.getParameter Setting sizeOfQueue to: -1
[junit4:junit4]   2> 13471 T151 oashc.HttpShardHandlerFactory.getParameter Setting fairnessPolicy to: false
[junit4:junit4]   2> 13471 T151 oascsi.HttpClientUtil.createClient Creating new http client, config:maxConnectionsPerHost=20&maxConnections=10000&socketTimeout=0&connTimeout=0&retry=false
[junit4:junit4]   2> 13502 T186 oascc.ZkStateReader$3.process Updating live nodes... (2)
[junit4:junit4]   2> 13502 T186 oascc.ZkStateReader$2.process A cluster state change has occurred - updating... (2)
[junit4:junit4]   2> 13502 T151 oascc.ZkStateReader.createClusterStateWatchersAndUpdate Updating cluster state from ZooKeeper... 
[junit4:junit4]   2> 13502 T151 oasc.CoreContainer.create Creating SolrCore 'collection1' using instanceDir: C:\Users\JenkinsSlave\workspace\Lucene-Solr-trunk-Windows\solr\build\solr-core\test\J0\.\org.apache.solr.cloud.BasicDistributedZk2Test-jetty2-1351979493105\collection1
[junit4:junit4]   2> 13502 T151 oasc.ZkController.createCollectionZkNode Check for collection zkNode:collection1
[junit4:junit4]   2> 13502 T151 oasc.ZkController.createCollectionZkNode Collection zkNode exists
[junit4:junit4]   2> 13502 T151 oasc.ZkController.readConfigName Load collection config from:/collections/collection1
[junit4:junit4]   2> 13518 T151 oasc.SolrResourceLoader.<init> new SolrResourceLoader for directory: 'C:\Users\JenkinsSlave\workspace\Lucene-Solr-trunk-Windows\solr\build\solr-core\test\J0\.\org.apache.solr.cloud.BasicDistributedZk2Test-jetty2-1351979493105\collection1\'
[junit4:junit4]   2> 13518 T151 oasc.SolrResourceLoader.replaceClassLoader Adding 'file:/C:/Users/JenkinsSlave/workspace/Lucene-Solr-trunk-Windows/solr/build/solr-core/test/J0/org.apache.solr.cloud.BasicDistributedZk2Test-jetty2-1351979493105/collection1/lib/classes/' to classloader
[junit4:junit4]   2> 13518 T151 oasc.SolrResourceLoader.replaceClassLoader Adding 'file:/C:/Users/JenkinsSlave/workspace/Lucene-Solr-trunk-Windows/solr/build/solr-core/test/J0/org.apache.solr.cloud.BasicDistributedZk2Test-jetty2-1351979493105/collection1/lib/README' to classloader
[junit4:junit4]   2> 13565 T151 oasc.SolrConfig.<init> Using Lucene MatchVersion: LUCENE_50
[junit4:junit4]   2> 13643 T151 oasc.SolrConfig.<init> Loaded SolrConfig: solrconfig.xml
[junit4:junit4]   2> 13643 T151 oass.IndexSchema.readSchema Reading Solr Schema
[junit4:junit4]   2> 13643 T151 oass.IndexSchema.readSchema Schema name=test
[junit4:junit4]   2> 14346 T151 oass.OpenExchangeRatesOrgProvider.init Initialized with rates=open-exchange-rates.json, refreshInterval=1440.
[junit4:junit4]   2> 14362 T151 oass.IndexSchema.readSchema default search field in schema is text
[junit4:junit4]   2> 14362 T151 oass.IndexSchema.readSchema unique key field: id
[junit4:junit4]   2> 14377 T151 oass.FileExchangeRateProvider.reload Reloading exchange rates from file currency.xml
[junit4:junit4]   2> 14393 T151 oass.FileExchangeRateProvider.reload Reloading exchange rates from file currency.xml
[junit4:junit4]   2> 14393 T151 oass.OpenExchangeRatesOrgProvider.reload Reloading exchange rates from open-exchange-rates.json
[junit4:junit4]   2> 14393 T151 oass.OpenExchangeRatesOrgProvider.reload Reloading exchange rates from open-exchange-rates.json
[junit4:junit4]   2> 14393 T151 oasc.SolrCore.<init> [collection1] Opening new SolrCore at C:\Users\JenkinsSlave\workspace\Lucene-Solr-trunk-Windows\solr\build\solr-core\test\J0\.\org.apache.solr.cloud.BasicDistributedZk2Test-jetty2-1351979493105\collection1\, dataDir=.\org.apache.solr.cloud.BasicDistributedZk2Test-1351979480244/jetty2\
[junit4:junit4]   2> 14393 T151 oasc.JmxMonitoredMap.<init> JMX monitoring is enabled. Adding Solr mbeans to JMX Server: com.sun.jmx.mbeanserver.JmxMBeanServer@10f41e9
[junit4:junit4]   2> 14409 T151 oasc.SolrCore.initDirectoryFactory solr.NRTCachingDirectoryFactory
[junit4:junit4]   2> 14409 T151 oasc.CachingDirectoryFactory.injectLockFactory WARNING No lockType configured for NRTCachingDirectory(org.apache.lucene.store.SimpleFSDirectory@C:\Users\JenkinsSlave\workspace\Lucene-Solr-trunk-Windows\solr\build\solr-core\test\J0\org.apache.solr.cloud.BasicDistributedZk2Test-1351979480244\jetty2 lockFactory=org.apache.lucene.store.NativeFSLockFactory@16d0a8c; maxCacheMB=48.0 maxMergeSizeMB=4.0) assuming 'simple'
[junit4:junit4]   2> 14409 T151 oasc.CachingDirectoryFactory.get return new directory for C:\Users\JenkinsSlave\workspace\Lucene-Solr-trunk-Windows\solr\build\solr-core\test\J0\.\org.apache.solr.cloud.BasicDistributedZk2Test-1351979480244\jetty2 forceNew:false
[junit4:junit4]   2> 14409 T151 oasc.CachingDirectoryFactory.close Releasing directory:C:\Users\JenkinsSlave\workspace\Lucene-Solr-trunk-Windows\solr\build\solr-core\test\J0\.\org.apache.solr.cloud.BasicDistributedZk2Test-1351979480244\jetty2
[junit4:junit4]   2> 14409 T151 oasc.SolrCore.getNewIndexDir New index directory detected: old=null new=.\org.apache.solr.cloud.BasicDistributedZk2Test-1351979480244/jetty2\index/
[junit4:junit4]   2> 14409 T151 oasc.SolrCore.initIndex WARNING [collection1] Solr index directory '.\org.apache.solr.cloud.BasicDistributedZk2Test-1351979480244\jetty2\index' doesn't exist. Creating new index...
[junit4:junit4]   2> 14409 T151 oasc.CachingDirectoryFactory.get return new directory for C:\Users\JenkinsSlave\workspace\Lucene-Solr-trunk-Windows\solr\build\solr-core\test\J0\.\org.apache.solr.cloud.BasicDistributedZk2Test-1351979480244\jetty2\index forceNew:false
[junit4:junit4]   2> 14424 T151 oasc.SolrDeletionPolicy.onCommit SolrDeletionPolicy.onCommit: commits:num=1
[junit4:junit4]   2> 		commit{dir=NRTCachingDirectory(org.apache.lucene.store.SimpleFSDirectory@C:\Users\JenkinsSlave\workspace\Lucene-Solr-trunk-Windows\solr\build\solr-core\test\J0\org.apache.solr.cloud.BasicDistributedZk2Test-1351979480244\jetty2\index lockFactory=org.apache.lucene.store.NativeFSLockFactory@1997837; maxCacheMB=48.0 maxMergeSizeMB=4.0),segFN=segments_1,generation=1,filenames=[segments_1]
[junit4:junit4]   2> 14424 T151 oasc.SolrDeletionPolicy.updateCommits newest commit = 1[segments_1]
[junit4:junit4]   2> 14424 T151 oasc.CachingDirectoryFactory.close Releasing directory:C:\Users\JenkinsSlave\workspace\Lucene-Solr-trunk-Windows\solr\build\solr-core\test\J0\.\org.apache.solr.cloud.BasicDistributedZk2Test-1351979480244\jetty2\index
[junit4:junit4]   2> 14424 T151 oasc.SolrCore.initWriters created xml: solr.XMLResponseWriter
[junit4:junit4]   2> 14424 T151 oasup.UpdateRequestProcessorChain.init inserting DistributedUpdateProcessorFactory into updateRequestProcessorChain "dedupe"
[junit4:junit4]   2> 14424 T151 oasup.UpdateRequestProcessorChain.init inserting DistributedUpdateProcessorFactory into updateRequestProcessorChain "dedupe-allfields"
[junit4:junit4]   2> 14424 T151 oasup.UpdateRequestProcessorChain.init inserting DistributedUpdateProcessorFactory into updateRequestProcessorChain "stored_sig"
[junit4:junit4]   2> 14424 T151 oasup.UpdateRequestProcessorChain.init inserting DistributedUpdateProcessorFactory into updateRequestProcessorChain "uniq-fields"
[junit4:junit4]   2> 14424 T151 oasup.UpdateRequestProcessorChain.init inserting DistributedUpdateProcessorFactory into updateRequestProcessorChain "distrib-dup-test-chain-implicit"
[junit4:junit4]   2> 14424 T151 oasc.RequestHandlers.initHandlersFromConfig adding lazy requestHandler: solr.ReplicationHandler
[junit4:junit4]   2> 14424 T151 oasc.RequestHandlers.initHandlersFromConfig created /replication: solr.ReplicationHandler
[junit4:junit4]   2> 14424 T151 oasc.RequestHandlers.initHandlersFromConfig created standard: solr.StandardRequestHandler
[junit4:junit4]   2> 14424 T151 oasc.RequestHandlers.initHandlersFromConfig created /get: solr.RealTimeGetHandler
[junit4:junit4]   2> 14424 T151 oasc.RequestHandlers.initHandlersFromConfig created dismax: solr.SearchHandler
[junit4:junit4]   2> 14424 T151 oasc.RequestHandlers.initHandlersFromConfig created mock: org.apache.solr.core.MockQuerySenderListenerReqHandler
[junit4:junit4]   2> 14424 T151 oasc.RequestHandlers.initHandlersFromConfig created /admin/: org.apache.solr.handler.admin.AdminHandlers
[junit4:junit4]   2> 14424 T151 oasc.RequestHandlers.initHandlersFromConfig created defaults: solr.StandardRequestHandler
[junit4:junit4]   2> 14424 T151 oasc.RequestHandlers.initHandlersFromConfig adding lazy requestHandler: solr.StandardRequestHandler
[junit4:junit4]   2> 14424 T151 oasc.RequestHandlers.initHandlersFromConfig created lazy: solr.StandardRequestHandler
[junit4:junit4]   2> 14424 T151 oasc.RequestHandlers.initHandlersFromConfig created /update: solr.UpdateRequestHandler
[junit4:junit4]   2> 14424 T151 oasc.RequestHandlers.initHandlersFromConfig created /terms: org.apache.solr.handler.component.SearchHandler
[junit4:junit4]   2> 14424 T151 oasc.RequestHandlers.initHandlersFromConfig created spellCheckCompRH: org.apache.solr.handler.component.SearchHandler
[junit4:junit4]   2> 14424 T151 oasc.RequestHandlers.initHandlersFromConfig created spellCheckCompRH_Direct: org.apache.solr.handler.component.SearchHandler
[junit4:junit4]   2> 14424 T151 oasc.RequestHandlers.initHandlersFromConfig created spellCheckWithWordbreak: org.apache.solr.handler.component.SearchHandler
[junit4:junit4]   2> 14440 T151 oasc.RequestHandlers.initHandlersFromConfig created spellCheckWithWordbreak_Direct: org.apache.solr.handler.component.SearchHandler
[junit4:junit4]   2> 14440 T151 oasc.RequestHandlers.initHandlersFromConfig created spellCheckCompRH1: org.apache.solr.handler.component.SearchHandler
[junit4:junit4]   2> 14440 T151 oasc.RequestHandlers.initHandlersFromConfig created tvrh: org.apache.solr.handler.component.SearchHandler
[junit4:junit4]   2> 14440 T151 oasc.RequestHandlers.initHandlersFromConfig created /mlt: solr.MoreLikeThisHandler
[junit4:junit4]   2> 14440 T151 oasc.RequestHandlers.initHandlersFromConfig created /debug/dump: solr.DumpRequestHandler
[junit4:junit4]   2> 14440 T151 oashl.XMLLoader.init xsltCacheLifetimeSeconds=60
[junit4:junit4]   2> 14455 T151 oasc.SolrCore.initDeprecatedSupport WARNING solrconfig.xml uses deprecated <admin/gettableFiles>, Please update your config to use the ShowFileRequestHandler.
[junit4:junit4]   2> 14455 T151 oasc.SolrCore.initDeprecatedSupport WARNING adding ShowFileRequestHandler with hidden files: [SCHEMA.XML, OLD_SYNONYMS.TXT, STOPWORDS.TXT, PROTWORDS.TXT, OPEN-EXCHANGE-RATES.JSON, SYNONYMS.TXT, CURRENCY.XML, MAPPING-ISOLATIN1ACCENT.TXT]
[junit4:junit4]   2> 14455 T151 oasc.CachingDirectoryFactory.close Releasing directory:C:\Users\JenkinsSlave\workspace\Lucene-Solr-trunk-Windows\solr\build\solr-core\test\J0\.\org.apache.solr.cloud.BasicDistributedZk2Test-1351979480244\jetty2
[junit4:junit4]   2> 14455 T151 oass.SolrIndexSearcher.<init> Opening Searcher@1f676cb main
[junit4:junit4]   2> 14455 T151 oasu.CommitTracker.<init> Hard AutoCommit: disabled
[junit4:junit4]   2> 14455 T151 oasu.CommitTracker.<init> Soft AutoCommit: disabled
[junit4:junit4]   2> 14455 T151 oashc.SpellCheckComponent.inform Initializing spell checkers
[junit4:junit4]   2> 14471 T151 oass.DirectSolrSpellChecker.init init: {name=direct,classname=DirectSolrSpellChecker,field=lowerfilt,minQueryLength=3}
[junit4:junit4]   2> 14534 T201 oasc.SolrCore.registerSearcher [collection1] Registered new searcher Searcher@1f676cb main{StandardDirectoryReader(segments_1:1)}
[junit4:junit4]   2> 14534 T151 oasc.ZkController.publish numShards not found on descriptor - reading it from system property
[junit4:junit4]   2> 14987 T187 oascc.ZkStateReader.updateClusterState Updating cloud state from ZooKeeper... 
[junit4:junit4]   2> 14987 T187 oasc.Overseer$ClusterStateUpdater.updateState Update state numShards=2 message={
[junit4:junit4]   2> 	  "operation":"state",
[junit4:junit4]   2> 	  "numShards":"2",
[junit4:junit4]   2> 	  "shard":null,
[junit4:junit4]   2> 	  "roles":null,
[junit4:junit4]   2> 	  "state":"down",
[junit4:junit4]   2> 	  "core":"collection1",
[junit4:junit4]   2> 	  "collection":"collection1",
[junit4:junit4]   2> 	  "node_name":"127.0.0.1:63192_solr",
[junit4:junit4]   2> 	  "base_url":"http://127.0.0.1:63192/solr"}
[junit4:junit4]   2> 14987 T186 oascc.ZkStateReader$2.process A cluster state change has occurred - updating... (2)
[junit4:junit4]   2> 14987 T175 oascc.ZkStateReader$2.process A cluster state change has occurred - updating... (2)
[junit4:junit4]   2> 14987 T200 oascc.ZkStateReader$2.process A cluster state change has occurred - updating... (2)
[junit4:junit4]   2> 15034 T151 oasc.CoreContainer.registerCore registering core: collection1
[junit4:junit4]   2> 15034 T151 oasc.ZkController.register Register shard - core:collection1 address:http://127.0.0.1:63192/solr shardId:shard2
[junit4:junit4]   2> 15034 T151 oascc.SolrZkClient.makePath makePath: /collections/collection1/leader_elect/shard2/election
[junit4:junit4]   2> 15034 T156 oazs.PrepRequestProcessor.pRequest Got user-level KeeperException when processing sessionid:0x13ac841b58f0006 type:delete cxid:0x42 zxid:0xfffffffffffffffe txntype:unknown reqpath:n/a Error Path:/solr/collections/collection1/leaders/shard2 Error:KeeperErrorCode = NoNode for /solr/collections/collection1/leaders/shard2
[junit4:junit4]   2> 15049 T151 oasc.ShardLeaderElectionContext.runLeaderProcess Running the leader process.
[junit4:junit4]   2> 15049 T156 oazs.PrepRequestProcessor.pRequest Got user-level KeeperException when processing sessionid:0x13ac841b58f0006 type:create cxid:0x43 zxid:0xfffffffffffffffe txntype:unknown reqpath:n/a Error Path:/solr/overseer Error:KeeperErrorCode = NodeExists for /solr/overseer
[junit4:junit4]   2> 15049 T151 oasc.ShardLeaderElectionContext.waitForReplicasToComeUp Enough replicas found to continue.
[junit4:junit4]   2> 15049 T151 oasc.ShardLeaderElectionContext.runLeaderProcess I may be the new leader - try and sync
[junit4:junit4]   2> 15049 T151 oasc.SyncStrategy.sync Sync replicas to http://127.0.0.1:63192/solr/collection1/
[junit4:junit4]   2> 15049 T151 oasc.SyncStrategy.syncReplicas Sync Success - now sync replicas to me
[junit4:junit4]   2> 15049 T151 oasc.SyncStrategy.syncToMe http://127.0.0.1:63192/solr/collection1/ has no replicas
[junit4:junit4]   2> 15049 T151 oasc.ShardLeaderElectionContext.runLeaderProcess I am the new leader: http://127.0.0.1:63192/solr/collection1/
[junit4:junit4]   2> 15049 T151 oascc.SolrZkClient.makePath makePath: /collections/collection1/leaders/shard2
[junit4:junit4]   2> 15049 T156 oazs.PrepRequestProcessor.pRequest Got user-level KeeperException when processing sessionid:0x13ac841b58f0006 type:create cxid:0x4c zxid:0xfffffffffffffffe txntype:unknown reqpath:n/a Error Path:/solr/overseer Error:KeeperErrorCode = NodeExists for /solr/overseer
[junit4:junit4]   2> 15502 T187 oascc.ZkStateReader.updateClusterState Updating cloud state from ZooKeeper... 
[junit4:junit4]   2> 15518 T186 oascc.ZkStateReader$2.process A cluster state change has occurred - updating... (2)
[junit4:junit4]   2> 15518 T200 oascc.ZkStateReader$2.process A cluster state change has occurred - updating... (2)
[junit4:junit4]   2> 15518 T175 oascc.ZkStateReader$2.process A cluster state change has occurred - updating... (2)
[junit4:junit4]   2> 15565 T151 oasc.ZkController.register We are http://127.0.0.1:63192/solr/collection1/ and leader is http://127.0.0.1:63192/solr/collection1/
[junit4:junit4]   2> 15565 T151 oasc.ZkController.register No LogReplay needed for core=collection1 baseURL=http://127.0.0.1:63192/solr
[junit4:junit4]   2> 15565 T151 oasc.ZkController.checkRecovery I am the leader, no recovery necessary
[junit4:junit4]   2> 15565 T151 oasc.ZkController.publish numShards not found on descriptor - reading it from system property
[junit4:junit4]   2> 15565 T151 oascc.ZkStateReader.updateClusterState Updating cloud state from ZooKeeper... 
[junit4:junit4]   2> 15565 T151 oass.SolrDispatchFilter.init user.dir=C:\Users\JenkinsSlave\workspace\Lucene-Solr-trunk-Windows\solr\build\solr-core\test\J0
[junit4:junit4]   2> 15565 T151 oass.SolrDispatchFilter.init SolrDispatchFilter.init() done
[junit4:junit4]   2> 15565 T151 oascsi.HttpClientUtil.createClient Creating new http client, config:maxConnections=128&maxConnectionsPerHost=32&followRedirects=false
[junit4:junit4]   2> 15909 T151 oejs.Server.doStart jetty-8.1.2.v20120308
[junit4:junit4]   2> 15909 T151 oejs.AbstractConnector.doStart Started SelectChannelConnector@0.0.0.0:63198
[junit4:junit4]   2> 15909 T151 oasc.SolrResourceLoader.locateSolrHome JNDI not configured for solr (NoInitialContextEx)
[junit4:junit4]   2> 15909 T151 oasc.SolrResourceLoader.locateSolrHome using system property solr.solr.home: C:\Users\JenkinsSlave\workspace\Lucene-Solr-trunk-Windows\solr\build\solr-core\test\J0\.\org.apache.solr.cloud.BasicDistributedZk2Test-jetty3-1351979495808
[junit4:junit4]   2> 15909 T151 oasc.SolrResourceLoader.<init> new SolrResourceLoader for deduced Solr Home: 'C:\Users\JenkinsSlave\workspace\Lucene-Solr-trunk-Windows\solr\build\solr-core\test\J0\.\org.apache.solr.cloud.BasicDistributedZk2Test-jetty3-1351979495808\'
[junit4:junit4]   2> 15940 T151 oass.SolrDispatchFilter.init SolrDispatchFilter.init()
[junit4:junit4]   2> 15940 T151 oasc.SolrResourceLoader.locateSolrHome JNDI not configured for solr (NoInitialContextEx)
[junit4:junit4]   2> 15940 T151 oasc.SolrResourceLoader.locateSolrHome using system property solr.solr.home: C:\Users\JenkinsSlave\workspace\Lucene-Solr-trunk-Windows\solr\build\solr-core\test\J0\.\org.apache.solr.cloud.BasicDistributedZk2Test-jetty3-1351979495808
[junit4:junit4]   2> 15940 T151 oasc.CoreContainer$Initializer.initialize looking for solr.xml: C:\Users\JenkinsSlave\workspace\Lucene-Solr-trunk-Windows\solr\build\solr-core\test\J0\.\org.apache.solr.cloud.BasicDistributedZk2Test-jetty3-1351979495808\solr.xml
[junit4:junit4]   2> 15940 T151 oasc.CoreContainer.<init> New CoreContainer 10251886
[junit4:junit4]   2> 15940 T151 oasc.CoreContainer.load Loading CoreContainer using Solr Home: 'C:\Users\JenkinsSlave\workspace\Lucene-Solr-trunk-Windows\solr\build\solr-core\test\J0\.\org.apache.solr.cloud.BasicDistributedZk2Test-jetty3-1351979495808\'
[junit4:junit4]   2> 15940 T151 oasc.SolrResourceLoader.<init> new SolrResourceLoader for directory: 'C:\Users\JenkinsSlave\workspace\Lucene-Solr-trunk-Windows\solr\build\solr-core\test\J0\.\org.apache.solr.cloud.BasicDistributedZk2Test-jetty3-1351979495808\'
[junit4:junit4]   2> 15971 T151 oasc.CoreContainer.load Registering Log Listener
[junit4:junit4]   2> 15987 T151 oasc.CoreContainer.initZooKeeper Zookeeper client=127.0.0.1:63166/solr
[junit4:junit4]   2> 15987 T151 oaz.ZooKeeper.<init> Initiating client connection, connectString=127.0.0.1:63166/solr sessionTimeout=5000 watcher=org.apache.solr.common.cloud.ConnectionManager@1cfd989
[junit4:junit4]   2> 15987 T211 oaz.ClientCnxn$SendThread.startConnect Opening socket connection to server /127.0.0.1:63166
[junit4:junit4]   2> 15987 T151 oascc.ConnectionManager.waitForConnected Waiting for client to connect to ZooKeeper
[junit4:junit4]   2> 15987 T211 oaz.ClientCnxn$SendThread.primeConnection Socket connection established to 127.0.0.1/127.0.0.1:63166, initiating session
[junit4:junit4]   2> 15987 T153 oazs.NIOServerCnxn$Factory.run Accepted socket connection from /127.0.0.1:63203
[junit4:junit4]   2> 15987 T153 oazs.NIOServerCnxn.readConnectRequest Client attempting to establish new session at /127.0.0.1:63203
[junit4:junit4]   2> 16002 T155 oazs.NIOServerCnxn.finishSessionInit Established session 0x13ac841b58f0007 with negotiated timeout 5000 for client /127.0.0.1:63203
[junit4:junit4]   2> 16002 T211 oaz.ClientCnxn$SendThread.readConnectResult Session establishment complete on server 127.0.0.1/127.0.0.1:63166, sessionid = 0x13ac841b58f0007, negotiated timeout = 5000
[junit4:junit4]   2> 16002 T212 oascc.ConnectionManager.process Watcher org.apache.solr.common.cloud.ConnectionManager@1cfd989 name:ZooKeeperConnection Watcher:127.0.0.1:63166/solr got event WatchedEvent state:SyncConnected type:None path:null path:null type:None
[junit4:junit4]   2> 16002 T151 oascc.ConnectionManager.waitForConnected Client is connected to ZooKeeper
[junit4:junit4]   2> 16002 T156 oazs.PrepRequestProcessor.pRequest Got user-level KeeperException when processing sessionid:0x13ac841b58f0007 type:create cxid:0x1 zxid:0xfffffffffffffffe txntype:unknown reqpath:n/a Error Path:/solr/overseer Error:KeeperErrorCode = NodeExists for /solr/overseer
[junit4:junit4]   2> 16002 T156 oazs.PrepRequestProcessor.pRequest Got user-level KeeperException when processing sessionid:0x13ac841b58f0007 type:create cxid:0x2 zxid:0xfffffffffffffffe txntype:unknown reqpath:n/a Error Path:/solr/overseer Error:KeeperErrorCode = NodeExists for /solr/overseer
[junit4:junit4]   2> 16002 T151 oasc.ZkController.createEphemeralLiveNode Register node as live in ZooKeeper:/live_nodes/127.0.0.1:63198_solr
[junit4:junit4]   2> 16002 T156 oazs.PrepRequestProcessor.pRequest Got user-level KeeperException when processing sessionid:0x13ac841b58f0007 type:delete cxid:0x4 zxid:0xfffffffffffffffe txntype:unknown reqpath:n/a Error Path:/solr/live_nodes/127.0.0.1:63198_solr Error:KeeperErrorCode = NoNode for /solr/live_nodes/127.0.0.1:63198_solr
[junit4:junit4]   2> 16018 T151 oascc.SolrZkClient.makePath makePath: /live_nodes/127.0.0.1:63198_solr
[junit4:junit4]   2> 16018 T200 oascc.ZkStateReader$2.process A cluster state change has occurred - updating... (2)
[junit4:junit4]   2> 16018 T186 oascc.ZkStateReader$2.process A cluster state change has occurred - updating... (2)
[junit4:junit4]   2> 16018 T175 oascc.ZkStateReader$2.process A cluster state change has occurred - updating... (2)
[junit4:junit4]   2> 16018 T151 oashc.HttpShardHandlerFactory.getParameter Setting socketTimeout to: 0
[junit4:junit4]   2> 16018 T151 oashc.HttpShardHandlerFactory.getParameter Setting urlScheme to: http://
[junit4:junit4]   2> 16018 T200 oascc.ZkStateReader$3.process Updating live nodes... (3)
[junit4:junit4]   2> 16018 T151 oashc.HttpShardHandlerFactory.getParameter Setting connTimeout to: 0
[junit4:junit4]   2> 16018 T151 oashc.HttpShardHandlerFactory.getParameter Setting maxConnectionsPerHost to: 20
[junit4:junit4]   2> 16018 T151 oashc.HttpShardHandlerFactory.getParameter Setting corePoolSize to: 0
[junit4:junit4]   2> 16018 T151 oashc.HttpShardHandlerFactory.getParameter Setting maximumPoolSize to: 2147483647
[junit4:junit4]   2> 16018 T151 oashc.HttpShardHandlerFactory.getParameter Setting maxThreadIdleTime to: 5
[junit4:junit4]   2> 16018 T151 oashc.HttpShardHandlerFactory.getParameter Setting sizeOfQueue to: -1
[junit4:junit4]   2> 16018 T151 oashc.HttpShardHandlerFactory.getParameter Setting fairnessPolicy to: false
[junit4:junit4]   2> 16018 T186 oascc.ZkStateReader$3.process Updating live nodes... (3)
[junit4:junit4]   2> 16018 T151 oascsi.HttpClientUtil.createClient Creating new http client, config:maxConnectionsPerHost=20&maxConnections=10000&socketTimeout=0&connTimeout=0&retry=false
[junit4:junit4]   2> 16018 T175 oascc.ZkStateReader$3.process Updating live nodes... (3)
[junit4:junit4]   2> 16034 T187 oascc.ZkStateReader.updateClusterState Updating cloud state from ZooKeeper... 
[junit4:junit4]   2> 16034 T187 oasc.Overseer$ClusterStateUpdater.updateState Update state numShards=2 message={
[junit4:junit4]   2> 	  "operation":"state",
[junit4:junit4]   2> 	  "numShards":"2",
[junit4:junit4]   2> 	  "shard":"shard2",
[junit4:junit4]   2> 	  "roles":null,
[junit4:junit4]   2> 	  "state":"active",
[junit4:junit4]   2> 	  "core":"collection1",
[junit4:junit4]   2> 	  "collection":"collection1",
[junit4:junit4]   2> 	  "node_name":"127.0.0.1:63192_solr",
[junit4:junit4]   2> 	  "base_url":"http://127.0.0.1:63192/solr"}
[junit4:junit4]   2> 16034 T151 oascc.ZkStateReader.createClusterStateWatchersAndUpdate Updating cluster state from ZooKeeper... 
[junit4:junit4]   2> 16034 T212 oascc.ZkStateReader$2.process A cluster state change has occurred - updating... (3)
[junit4:junit4]   2> 16049 T175 oascc.ZkStateReader$2.process A cluster state change has occurred - updating... (3)
[junit4:junit4]   2> 16049 T186 oascc.ZkStateReader$2.process A cluster state change has occurred - updating... (3)
[junit4:junit4]   2> 16049 T200 oascc.ZkStateReader$2.process A cluster state change has occurred - updating... (3)
[junit4:junit4]   2> 16049 T151 oasc.CoreContainer.create Creating SolrCore 'collection1' using instanceDir: C:\Users\JenkinsSlave\workspace\Lucene-Solr-trunk-Windows\solr\build\solr-core\test\J0\.\org.apache.solr.cloud.BasicDistributedZk2Test-jetty3-1351979495808\collection1
[junit4:junit4]   2> 16049 T151 oasc.ZkController.createCollectionZkNode Check for collection zkNode:collection1
[junit4:junit4]   2> 16049 T151 oasc.ZkController.createCollectionZkNode Collection zkNode exists
[junit4:junit4]   2> 16049 T151 oasc.ZkController.readConfigName Load collection config from:/collections/collection1
[junit4:junit4]   2> 16049 T151 oasc.SolrResourceLoader.<init> new SolrResourceLoader for directory: 'C:\Users\JenkinsSlave\workspace\Lucene-Solr-trunk-Windows\solr\build\solr-core\test\J0\.\org.apache.solr.cloud.BasicDistributedZk2Test-jetty3-1351979495808\collection1\'
[junit4:junit4]   2> 16049 T151 oasc.SolrResourceLoader.replaceClassLoader Adding 'file:/C:/Users/JenkinsSlave/workspace/Lucene-Solr-trunk-Windows/solr/build/solr-core/test/J0/org.apache.solr.cloud.BasicDistributedZk2Test-jetty3-1351979495808/collection1/lib/classes/' to classloader
[junit4:junit4]   2> 16049 T151 oasc.SolrResourceLoader.replaceClassLoader Adding 'file:/C:/Users/JenkinsSlave/workspace/Lucene-Solr-trunk-Windows/solr/build/solr-core/test/J0/org.apache.solr.cloud.BasicDistributedZk2Test-jetty3-1351979495808/collection1/lib/README' to classloader
[junit4:junit4]   2> 16284 T151 oasc.SolrConfig.<init> Using Lucene MatchVersion: LUCENE_50
[junit4:junit4]   2> 16393 T151 oasc.SolrConfig.<init> Loaded SolrConfig: solrconfig.xml
[junit4:junit4]   2> 16393 T151 oass.IndexSchema.readSchema Reading Solr Schema
[junit4:junit4]   2> 16409 T151 oass.IndexSchema.readSchema Schema name=test
[junit4:junit4]   2> 17268 T151 oass.OpenExchangeRatesOrgProvider.init Initialized with rates=open-exchange-rates.json, refreshInterval=1440.
[junit4:junit4]   2> 17284 T151 oass.IndexSchema.readSchema default search field in schema is text
[junit4:junit4]   2> 17284 T151 oass.IndexSchema.readSchema unique key field: id
[junit4:junit4]   2> 17299 T151 oass.FileExchangeRateProvider.reload Reloading exchange rates from file currency.xml
[junit4:junit4]   2> 17299 T151 oass.FileExchangeRateProvider.reload Reloading exchange rates from file currency.xml
[junit4:junit4]   2> 17315 T151 oass.OpenExchangeRatesOrgProvider.reload Reloading exchange rates from open-exchange-rates.json
[junit4:junit4]   2> 17315 T151 oass.OpenExchangeRatesOrgProvider.reload Reloading exchange rates from open-exchange-rates.json
[junit4:junit4]   2> 17315 T151 oasc.SolrCore.<init> [collection1] Opening new SolrCore at C:\Users\JenkinsSlave\workspace\Lucene-Solr-trunk-Windows\solr\build\solr-core\test\J0\.\org.apache.solr.cloud.BasicDistributedZk2Test-jetty3-1351979495808\collection1\, dataDir=.\org.apache.solr.cloud.BasicDistributedZk2Test-1351979480244/jetty3\
[junit4:junit4]   2> 17315 T151 oasc.JmxMonitoredMap.<init> JMX monitoring is enabled. Adding Solr mbeans to JMX Server: com.sun.jmx.mbeanserver.JmxMBeanServer@10f41e9
[junit4:junit4]   2> 17315 T151 oasc.SolrCore.initDirectoryFactory solr.NRTCachingDirectoryFactory
[junit4:junit4]   2> 17315 T151 oasc.CachingDirectoryFactory.injectLockFactory WARNING No lockType configured for NRTCachingDirectory(org.apache.lucene.store.SimpleFSDirectory@C:\Users\JenkinsSlave\workspace\Lucene-Solr-trunk-Windows\solr\build\solr-core\test\J0\org.apache.solr.cloud.BasicDistributedZk2Test-1351979480244\jetty3 lockFactory=org.apache.lucene.store.NativeFSLockFactory@16c01c8; maxCacheMB=48.0 maxMergeSizeMB=4.0) assuming 'simple'
[junit4:junit4]   2> 17315 T151 oasc.CachingDirectoryFactory.get return new directory for C:\Users\JenkinsSlave\workspace\Lucene-Solr-trunk-Windows\solr\build\solr-core\test\J0\.\org.apache.solr.cloud.BasicDistributedZk2Test-1351979480244\jetty3 forceNew:false
[junit4:junit4]   2> 17315 T151 oasc.CachingDirectoryFactory.close Releasing directory:C:\Users\JenkinsSlave\workspace\Lucene-Solr-trunk-Windows\solr\build\solr-core\test\J0\.\org.apache.solr.cloud.BasicDistributedZk2Test-1351979480244\jetty3
[junit4:junit4]   2> 17315 T151 oasc.SolrCore.getNewIndexDir New index directory detected: old=null new=.\org.apache.solr.cloud.BasicDistributedZk2Test-1351979480244/jetty3\index/
[junit4:junit4]   2> 17315 T151 oasc.SolrCore.initIndex WARNING [collection1] Solr index directory '.\org.apache.solr.cloud.BasicDistributedZk2Test-1351979480244\jetty3\index' doesn't exist. Creating new index...
[junit4:junit4]   2> 17330 T151 oasc.CachingDirectoryFactory.get return new directory for C:\Users\JenkinsSlave\workspace\Lucene-Solr-trunk-Windows\solr\build\solr-core\test\J0\.\org.apache.solr.cloud.BasicDistributedZk2Test-1351979480244\jetty3\index forceNew:false
[junit4:junit4]   2> 17330 T151 oasc.SolrDeletionPolicy.onCommit SolrDeletionPolicy.onCommit: commits:num=1
[junit4:junit4]   2> 		commit{dir=NRTCachingDirectory(org.apache.lucene.store.SimpleFSDirectory@C:\Users\JenkinsSlave\workspace\Lucene-Solr-trunk-Windows\solr\build\solr-core\test\J0\org.apache.solr.cloud.BasicDistributedZk2Test-1351979480244\jetty3\index lockFactory=org.apache.lucene.store.NativeFSLockFactory@1f5dc33; maxCacheMB=48.0 maxMergeSizeMB=4.0),segFN=segments_1,generation=1,filenames=[segments_1]
[junit4:junit4]   2> 17330 T151 oasc.SolrDeletionPolicy.updateCommits newest commit = 1[segments_1]
[junit4:junit4]   2> 17346 T151 oasc.CachingDirectoryFactory.close Releasing directory:C:\Users\JenkinsSlave\workspace\Lucene-Solr-trunk-Windows\solr\build\solr-core\test\J0\.\org.apache.solr.cloud.BasicDistributedZk2Test-1351979480244\jetty3\index
[junit4:junit4]   2> 17346 T151 oasc.SolrCore.initWriters created xml: solr.XMLResponseWriter
[junit4:junit4]   2> 17346 T151 oasup.UpdateRequestProcessorChain.init inserting DistributedUpdateProcessorFactory into updateRequestProcessorChain "dedupe"
[junit4:junit4]   2> 17346 T151 oasup.UpdateRequestProcessorChain.init inserting DistributedUpdateProcessorFactory into updateRequestProcessorChain "dedupe-allfields"
[junit4:junit4]   2> 17346 T151 oasup.UpdateRequestProcessorChain.init inserting DistributedUpdateProcessorFactory into updateRequestProcessorChain "stored_sig"
[junit4:junit4]   2> 17346 T151 oasup.UpdateRequestProcessorChain.init inserting DistributedUpdateProcessorFactory into updateRequestProcessorChain "uniq-fields"
[junit4:junit4]   2> 17346 T151 oasup.UpdateRequestProcessorChain.init inserting DistributedUpdateProcessorFactory into updateRequestProcessorChain "distrib-dup-test-chain-implicit"
[junit4:junit4]   2> 17346 T151 oasc.RequestHandlers.initHandlersFromConfig adding lazy requestHandler: solr.ReplicationHandler
[junit4:junit4]   2> 17346 T151 oasc.RequestHandlers.initHandlersFromConfig created /replication: solr.ReplicationHandler
[junit4:junit4]   2> 17346 T151 oasc.RequestHandlers.initHandlersFromConfig created standard: solr.StandardRequestHandler
[junit4:junit4]   2> 17346 T151 oasc.RequestHandlers.initHandlersFromConfig created /get: solr.RealTimeGetHandler
[junit4:junit4]   2> 17346 T151 oasc.RequestHandlers.initHandlersFromConfig created dismax: solr.SearchHandler
[junit4:junit4]   2> 17346 T151 oasc.RequestHandlers.initHandlersFromConfig created mock: org.apache.solr.core.MockQuerySenderListenerReqHandler
[junit4:junit4]   2> 17346 T151 oasc.RequestHandlers.initHandlersFromConfig created /admin/: org.apache.solr.handler.admin.AdminHandlers
[junit4:junit4]   2> 17346 T151 oasc.RequestHandlers.initHandlersFromConfig created defaults: solr.StandardRequestHandler
[junit4:junit4]   2> 17362 T151 oasc.RequestHandlers.initHandlersFromConfig adding lazy requestHandler: solr.StandardRequestHandler
[junit4:junit4]   2> 17362 T151 oasc.RequestHandlers.initHandlersFromConfig created lazy: solr.StandardRequestHandler
[junit4:junit4]   2> 17362 T151 oasc.RequestHandlers.initHandlersFromConfig created /update: solr.UpdateRequestHandler
[junit4:junit4]   2> 17362 T151 oasc.RequestHandlers.initHandlersFromConfig created /terms: org.apache.solr.handler.component.SearchHandler
[junit4:junit4]   2> 17362 T151 oasc.RequestHandlers.initHandlersFromConfig created spellCheckCompRH: org.apache.solr.handler.component.SearchHandler
[junit4:junit4]   2> 17362 T151 oasc.RequestHandlers.initHandlersFromConfig created spellCheckCompRH_Direct: org.apache.solr.handler.component.SearchHandler
[junit4:junit4]   2> 17362 T151 oasc.RequestHandlers.initHandlersFromConfig created spellCheckWithWordbreak: org.apache.solr.handler.component.SearchHandler
[junit4:junit4]   2> 17362 T151 oasc.RequestHandlers.initHandlersFromConfig created spellCheckWithWordbreak_Direct: org.apache.solr.handler.component.SearchHandler
[junit4:junit4]   2> 17362 T151 oasc.RequestHandlers.initHandlersFromConfig created spellCheckCompRH1: org.apache.solr.handler.component.SearchHandler
[junit4:junit4]   2> 17377 T151 oasc.RequestHandlers.initHandlersFromConfig created tvrh: org.apache.solr.handler.component.SearchHandler
[junit4:junit4]   2> 17377 T151 oasc.RequestHandlers.initHandlersFromConfig created /mlt: solr.MoreLikeThisHandler
[junit4:junit4]   2> 17377 T151 oasc.RequestHandlers.initHandlersFromConfig created /debug/dump: solr.DumpRequestHandler
[junit4:junit4]   2> 17393 T151 oashl.XMLLoader.init xsltCacheLifetimeSeconds=60
[junit4:junit4]   2> 17393 T151 oasc.SolrCore.initDeprecatedSupport WARNING solrconfig.xml uses deprecated <admin/gettableFiles>, Please update your config to use the ShowFileRequestHandler.
[junit4:junit4]   2> 17393 T151 oasc.SolrCore.initDeprecatedSupport WARNING adding ShowFileRequestHandler with hidden files: [SCHEMA.XML, OLD_SYNONYMS.TXT, STOPWORDS.TXT, PROTWORDS.TXT, OPEN-EXCHANGE-RATES.JSON, SYNONYMS.TXT, CURRENCY.XML, MAPPING-ISOLATIN1ACCENT.TXT]
[junit4:junit4]   2> 17409 T151 oasc.CachingDirectoryFactory.close Releasing directory:C:\Users\JenkinsSlave\workspace\Lucene-Solr-trunk-Windows\solr\build\solr-core\test\J0\.\org.apache.solr.cloud.BasicDistributedZk2Test-1351979480244\jetty3
[junit4:junit4]   2> 17409 T151 oass.SolrIndexSearcher.<init> Opening Searcher@1617fc5 main
[junit4:junit4]   2> 17409 T151 oasu.CommitTracker.<init> Hard AutoCommit: disabled
[junit4:junit4]   2> 17409 T151 oasu.CommitTracker.<init> Soft AutoCommit: disabled
[junit4:junit4]   2> 17409 T151 oashc.SpellCheckComponent.inform Initializing spell checkers
[junit4:junit4]   2> 17424 T151 oass.DirectSolrSpellChecker.init init: {name=direct,classname=DirectSolrSpellChecker,field=lowerfilt,minQueryLength=3}
[junit4:junit4]   2> 17502 T213 oasc.SolrCore.registerSearcher [collection1] Registered new searcher Searcher@1617fc5 main{StandardDirectoryReader(segments_1:1)}
[junit4:junit4]   2> 17518 T151 oasc.ZkController.publish numShards not found on descriptor - reading it from system property
[junit4:junit4]   2> 17549 T187 oascc.ZkStateReader.updateClusterState Updating cloud state from ZooKeeper... 
[junit4:junit4]   2> 17549 T187 oasc.Overseer$ClusterStateUpdater.updateState Update state numShards=2 message={
[junit4:junit4]   2> 	  "operation":"state",
[junit4:junit4]   2> 	  "numShards":"2",
[junit4:junit4]   2> 	  "shard":null,
[junit4:junit4]   2> 	  "roles":null,
[junit4:junit4]   2> 	  "state":"down",
[junit4:junit4]   2> 	  "core":"collection1",
[junit4:junit4]   2> 	  "collection":"collection1",
[junit4:junit4]   2> 	  "node_name":"127.0.0.1:63198_solr",
[junit4:junit4]   2> 	  "base_url":"http://127.0.0.1:63198/solr"}
[junit4:junit4]   2> 17549 T212 oascc.ZkStateReader$2.process A cluster state change has occurred - updating... (3)
[junit4:junit4]   2> 17549 T200 oascc.ZkStateReader$2.process A cluster state change has occurred - updating... (3)
[junit4:junit4]   2> 17549 T175 oascc.ZkStateReader$2.process A cluster state change has occurred - updating... (3)
[junit4:junit4]   2> 17549 T186 oascc.ZkStateReader$2.process A cluster state change has occurred - updating... (3)
[junit4:junit4]   2> 18018 T151 oasc.CoreContainer.registerCore registering core: collection1
[junit4:junit4]   2> 18018 T151 oasc.ZkController.register Register shard - core:collection1 address:http://127.0.0.1:63198/solr shardId:shard1
[junit4:junit4]   2> 18018 T151 oasc.ZkController.register We are http://127.0.0.1:63198/solr/collection1/ and leader is http://127.0.0.1:63186/solr/collection1/
[junit4:junit4]   2> 18018 T151 oasc.ZkController.register No LogReplay needed for core=collection1 baseURL=http://127.0.0.1:63198/solr
[junit4:junit4]   2> 18018 T151 oasc.ZkController.checkRecovery Core needs to recover:collection1
[junit4:junit4]   2> 18018 T151 oasu.DefaultSolrCoreState.doRecovery Running recovery - first canceling any ongoing recovery
[junit4:junit4]   2> ASYNC  NEW_CORE C17 name=collection1 org.apache.solr.core.SolrCore@8c0b5a url=http://127.0.0.1:63198/solr/collection1 node=127.0.0.1:63198_solr
[junit4:junit4]   2> 18034 T214 C17 P63198 oasc.RecoveryStrategy.run Starting recovery process.  core=collection1 recoveringAfterStartup=true
[junit4:junit4]   2> 18034 T214 C17 P63198 oasc.RecoveryStrategy.doRecovery ###### startupVersions=[]
[junit4:junit4]   2> 18034 T214 C17 P63198 oasc.ZkController.publish numShards not found on descriptor - reading it from system property
[junit4:junit4]   2> 18034 T151 oascc.ZkStateReader.updateClusterState Updating cloud state from ZooKeeper... 
[junit4:junit4]   2> 18034 T214 C17 P63198 oasc.RecoveryStrategy.doRecovery Attempting to PeerSync from http://127.0.0.1:63186/solr/collection1/ core=collection1 - recoveringAfterStartup=true
[junit4:junit4]   2> 18034 T151 oass.SolrDispatchFilter.init user.dir=C:\Users\JenkinsSlave\workspace\Lucene-Solr-trunk-Windows\solr\build\solr-core\test\J0
[junit4:junit4]   2> 18034 T151 oass.SolrDispatchFilter.init SolrDispatchFilter.init() done
[junit4:junit4]   2> 18034 T151 oascsi.HttpClientUtil.createClient Creating new http client, config:maxConnections=128&maxConnectionsPerHost=32&followRedirects=false
[junit4:junit4]   2> 18049 T214 C17 P63198 oascsi.HttpClientUtil.createClient Creating new http client, config:maxConnectionsPerHost=20&maxConnections=10000&connTimeout=30000&socketTimeout=30000&retry=false
[junit4:junit4]   2> 18065 T214 C17 P63198 oasu.PeerSync.sync PeerSync: core=collection1 url=http://127.0.0.1:63198/solr START replicas=[http://127.0.0.1:63186/solr/collection1/] nUpdates=100
[junit4:junit4]   2> 18065 T214 C17 P63198 oasu.PeerSync.sync WARNING no frame of reference to tell of we've missed updates
[junit4:junit4]   2> 18080 T214 C17 P63198 oasc.RecoveryStrategy.doRecovery PeerSync Recovery was not successful - trying replication. core=collection1
[junit4:junit4]   2> 18080 T214 C17 P63198 oasc.RecoveryStrategy.doRecovery Starting Replication Recovery. core=collection1
[junit4:junit4]   2> 18080 T214 C17 P63198 oascsi.HttpClientUtil.createClient Creating new http client, config:maxConnections=128&maxConnectionsPerHost=32&followRedirects=false
[junit4:junit4]   2> 18080 T187 oascc.ZkStateReader.updateClusterState Updating cloud state from ZooKeeper... 
[junit4:junit4]   2> 18080 T187 oasc.Overseer$ClusterStateUpdater.updateState Update state numShards=2 message={
[junit4:junit4]   2> 	  "operation":"state",
[junit4:junit4]   2> 	  "numShards":"2",
[junit4:junit4]   2> 	  "shard":"shard1",
[junit4:junit4]   2> 	  "roles":null,
[junit4:junit4]   2> 	  "state":"recovering",
[junit4:junit4]   2> 	  "core":"collection1",
[junit4:junit4]   2> 	  "collection":"collection1",
[junit4:junit4]   2> 	  "node_name":"127.0.0.1:63198_solr",
[junit4:junit4]   2> 	  "base_url":"http://127.0.0.1:63198/solr"}
[junit4:junit4]   2> ASYNC  NEW_CORE C18 name=collection1 org.apache.solr.core.SolrCore@921fc7 url=http://127.0.0.1:63186/solr/collection1 node=127.0.0.1:63186_solr
[junit4:junit4]   2> 18112 T180 C18 P63186 REQ /get {distrib=false&qt=/get&wt=javabin&version=2&getVersions=100} status=0 QTime=0 
[junit4:junit4]   2> 18127 T175 oascc.ZkStateReader$2.process A cluster state change has occurred - updating... (3)
[junit4:junit4]   2> 18127 T212 oascc.ZkStateReader$2.process A cluster state change has occurred - updating... (3)
[junit4:junit4]   2> 18127 T200 oascc.ZkStateReader$2.process A cluster state change has occurred - updating... (3)
[junit4:junit4]   2> 18127 T186 oascc.ZkStateReader$2.process A cluster state change has occurred - updating... (3)
[junit4:junit4]   2> 18518 T151 oejs.Server.doStart jetty-8.1.2.v20120308
[junit4:junit4]   2> 18518 T151 oejs.AbstractConnector.doStart Started SelectChannelConnector@0.0.0.0:63206
[junit4:junit4]   2> 18518 T151 oasc.SolrResourceLoader.locateSolrHome JNDI not configured for solr (NoInitialContextEx)
[junit4:junit4]   2> 18518 T151 oasc.SolrResourceLoader.locateSolrHome using system property solr.solr.home: C:\Users\JenkinsSlave\workspace\Lucene-Solr-trunk-Windows\solr\build\solr-core\test\J0\.\org.apache.solr.cloud.BasicDistributedZk2Test-jetty4-1351979498277
[junit4:junit4]   2> 18518 T151 oasc.SolrResourceLoader.<init> new SolrResourceLoader for deduced Solr Home: 'C:\Users\JenkinsSlave\workspace\Lucene-Solr-trunk-Windows\solr\build\solr-core\test\J0\.\org.apache.solr.cloud.BasicDistributedZk2Test-jetty4-1351979498277\'
[junit4:junit4]   2> 18565 T151 oass.SolrDispatchFilter.init SolrDispatchFilter.init()
[junit4:junit4]   2> 18565 T151 oasc.SolrResourceLoader.locateSolrHome JNDI not configured for solr (NoInitialContextEx)
[junit4:junit4]   2> 18565 T151 oasc.SolrResourceLoader.locateSolrHome using system property solr.solr.home: C:\Users\JenkinsSlave\workspace\Lucene-Solr-trunk-Windows\solr\build\solr-core\test\J0\.\org.apache.solr.cloud.BasicDistributedZk2Test-jetty4-1351979498277
[junit4:junit4]   2> 18565 T151 oasc.CoreContainer$Initializer.initialize looking for solr.xml: C:\Users\JenkinsSlave\workspace\Lucene-Solr-trunk-Windows\solr\build\solr-core\test\J0\.\org.apache.solr.cloud.BasicDistributedZk2Test-jetty4-1351979498277\solr.xml
[junit4:junit4]   2> 18565 T151 oasc.CoreContainer.<init> New CoreContainer 3191448
[junit4:junit4]   2> 18565 T151 oasc.CoreContainer.load Loading CoreContainer using Solr Home: 'C:\Users\JenkinsSlave\workspace\Lucene-Solr-trunk-Windows\solr\build\solr-core\test\J0\.\org.apache.solr.cloud.BasicDistributedZk2Test-jetty4-1351979498277\'
[junit4:junit4]   2> 18565 T151 oasc.SolrResourceLoader.<init> new SolrResourceLoader for directory: 'C:\Users\JenkinsSlave\workspace\Lucene-Solr-trunk-Windows\solr\build\solr-core\test\J0\.\org.apache.solr.cloud.BasicDistributedZk2Test-jetty4-1351979498277\'
[junit4:junit4]   2> 18596 T151 oasc.CoreContainer.load Registering Log Listener
[junit4:junit4]   2> 18627 T151 oasc.CoreContainer.initZooKeeper Zookeeper client=127.0.0.1:63166/solr
[junit4:junit4]   2> 18627 T151 oaz.ZooKeeper.<init> Initiating client connection, connectString=127.0.0.1:63166/solr sessionTimeout=5000 watcher=org.apache.solr.common.cloud.ConnectionManager@4bb4af
[junit4:junit4]   2> 18627 T225 oaz.ClientCnxn$SendThread.startConnect Opening socket connection to server /127.0.0.1:63166
[junit4:junit4]   2> 18627 T151 oascc.ConnectionManager.waitForConnected Waiting for client to connect to ZooKeeper
[junit4:junit4]   2> 18627 T225 oaz.ClientCnxn$SendThread.primeConnection Socket connection established to 127.0.0.1/127.0.0.1:63166, initiating session
[junit4:junit4]   2> 18627 T153 oazs.NIOServerCnxn$Factory.run Accepted socket connection from /127.0.0.1:63211
[junit4:junit4]   2> 18627 T153 oazs.NIOServerCnxn.readConnectRequest Client attempting to establish new session at /127.0.0.1:63211
[junit4:junit4]   2> 18643 T155 oazs.NIOServerCnxn.finishSessionInit Established session 0x13ac841b58f0008 with negotiated timeout 5000 for client /127.0.0.1:63211
[junit4:junit4]   2> 18643 T225 oaz.ClientCnxn$SendThread.readConnectResult Session establishment complete on server 127.0.0.1/127.0.0.1:63166, sessionid = 0x13ac841b58f0008, negotiated timeout = 5000
[junit4:junit4]   2> 18643 T226 oascc.ConnectionManager.process Watcher org.apache.solr.common.cloud.ConnectionManager@4bb4af name:ZooKeeperConnection Watcher:127.0.0.1:63166/solr got event WatchedEvent state:SyncConnected type:None path:null path:null type:None
[junit4:junit4]   2> 18643 T151 oascc.ConnectionManager.waitForConnected Client is connected to ZooKeeper
[junit4:junit4]   2> 18643 T156 oazs.PrepRequestProcessor.pRequest Got user-level KeeperException when processing sessionid:0x13ac841b58f0008 type:create cxid:0x1 zxid:0xfffffffffffffffe txntype:unknown reqpath:n/a Error Path:/solr/overseer Error:KeeperErrorCode = NodeExists for /solr/overseer
[junit4:junit4]   2> 18643 T156 oazs.PrepRequestProcessor.pRequest Got user-level KeeperException when processing sessionid:0x13ac841b58f0008 type:create cxid:0x2 zxid:0xfffffffffffffffe txntype:unknown reqpath:n/a Error Path:/solr/overseer Error:KeeperErrorCode = NodeExists for /solr/overseer
[junit4:junit4]   2> 18643 T151 oasc.ZkController.createEphemeralLiveNode Register node as live in ZooKeeper:/live_nodes/127.0.0.1:63206_solr
[junit4:junit4]   2> 18643 T156 oazs.PrepRequestProcessor.pRequest Got user-level KeeperException when processing sessionid:0x13ac841b58f0008 type:delete cxid:0x4 zxid:0xfffffffffffffffe txntype:unknown reqpath:n/a Error Path:/solr/live_nodes/127.0.0.1:63206_solr Error:KeeperErrorCode = NoNode for /solr/live_nodes/127.0.0.1:63206_solr
[junit4:junit4]   2> 18659 T151 oascc.SolrZkClient.makePath makePath: /live_nodes/127.0.0.1:63206_solr
[junit4:junit4]   2> 18659 T212 oascc.ZkStateReader$2.process A cluster state change has occurred - updating... (3)
[junit4:junit4]   2> 18659 T200 oascc.ZkStateReader$2.process A cluster state change has occurred - updating... (3)
[junit4:junit4]   2> 18659 T186 oascc.ZkStateReader$2.process A cluster state change has occurred - updating... (3)
[junit4:junit4]   2> 18659 T175 oascc.ZkStateReader$2.process A cluster state change has occurred - updating... (3)
[junit4:junit4]   2> 18659 T151 oashc.HttpShardHandlerFactory.getParameter Setting socketTimeout to: 0
[junit4:junit4]   2> 18659 T151 oashc.HttpShardHandlerFactory.getParameter Setting urlScheme to: http://
[junit4:junit4]   2> 18659 T151 oashc.HttpShardHandlerFactory.getParameter Setting connTimeout to: 0
[junit4:junit4]   2> 18659 T151 oashc.HttpShardHandlerFactory.getParameter Setting maxConnectionsPerHost to: 20
[junit4:junit4]   2> 18659 T151 oashc.HttpShardHandlerFactory.getParameter Setting corePoolSize to: 0
[junit4:junit4]   2> 18659 T212 oascc.ZkStateReader$3.process Updating live nodes... (4)
[junit4:junit4]   2> 18659 T151 oashc.HttpShardHandlerFactory.getParameter Setting maximumPoolSize to: 2147483647
[junit4:junit4]   2> 18659 T151 oashc.HttpShardHandlerFactory.getParameter Setting maxThreadIdleTime to: 5
[junit4:junit4]   2> 18659 T151 oashc.HttpShardHandlerFactory.getParameter Setting sizeOfQueue to: -1
[junit4:junit4]   2> 18659 T151 oashc.HttpShardHandlerFactory.getParameter Setting fairnessPolicy to: false
[junit4:junit4]   2> 18659 T151 oascsi.HttpClientUtil.createClient Creating new http client, config:maxConnectionsPerHost=20&maxConnections=10000&socketTimeout=0&connTimeout=0&retry=false
[junit4:junit4]   2> 18659 T175 oascc.ZkStateReader$3.process Updating live nodes... (4)
[junit4:junit4]   2> 18659 T186 oascc.ZkStateReader$3.process Updating live nodes... (4)
[junit4:junit4]   2> 18659 T200 oascc.ZkStateReader$3.process Updating live nodes... (4)
[junit4:junit4]   2> 18674 T151 oascc.ZkStateReader.createClusterStateWatchersAndUpdate Updating cluster state from ZooKeeper... 
[junit4:junit4]   2> 18690 T151 oasc.CoreContainer.create Creating SolrCore 'collection1' using instanceDir: C:\Users\JenkinsSlave\workspace\Lucene-Solr-trunk-Windows\solr\build\solr-core\test\J0\.\org.apache.solr.cloud.BasicDistributedZk2Test-jetty4-1351979498277\collection1
[junit4:junit4]   2> 18705 T151 oasc.ZkController.createCollectionZkNode Check for collection zkNode:collection1
[junit4:junit4]   2> 18705 T151 oasc.ZkController.createCollectionZkNode Collection zkNode exists
[junit4:junit4]   2> 18705 T151 oasc.ZkController.readConfigName Load collection config from:/collections/collection1
[junit4:junit4]   2> 18705 T151 oasc.SolrResourceLoader.<init> new SolrResourceLoader for directory: 'C:\Users\JenkinsSlave\workspace\Lucene-Solr-trunk-Windows\solr\build\solr-core\test\J0\.\org.apache.solr.cloud.BasicDistributedZk2Test-jetty4-1351979498277\collection1\'
[junit4:junit4]   2> 18705 T151 oasc.SolrResourceLoader.replaceClassLoader Adding 'file:/C:/Users/JenkinsSlave/workspace/Lucene-Solr-trunk-Windows/solr/build/solr-core/test/J0/org.apache.solr.cloud.BasicDistributedZk2Test-jetty4-1351979498277/collection1/lib/classes/' to classloader
[junit4:junit4]   2> 18705 T151 oasc.SolrResourceLoader.replaceClassLoader Adding 'file:/C:/Users/JenkinsSlave/workspace/Lucene-Solr-trunk-Windows/solr/build/solr-core/test/J0/org.apache.solr.cloud.BasicDistributedZk2Test-jetty4-1351979498277/collection1/lib/README' to classloader
[junit4:junit4]   2> 18768 T151 oasc.SolrConfig.<init> Using Lucene MatchVersion: LUCENE_50
[junit4:junit4]   2> 18893 T151 oasc.SolrConfig.<init> Loaded SolrConfig: solrconfig.xml
[junit4:junit4]   2> 18893 T151 oass.IndexSchema.readSchema Reading Solr Schema
[junit4:junit4]   2> 18909 T151 oass.IndexSchema.readSchema Schema name=test
[junit4:junit4]   2> 20034 T151 oass.OpenExchangeRatesOrgProvider.init Initialized with rates=open-exchange-rates.json, refreshInterval=1440.
[junit4:junit4]   2> 20049 T151 oass.IndexSchema.readSchema default search field in schema is text
[junit4:junit4]   2> 20065 T151 oass.IndexSchema.readSchema unique key field: id
[junit4:junit4]   2> 20080 T151 oass.FileExchangeRateProvider.reload Reloading exchange rates from file currency.xml
[junit4:junit4]   2> 20096 T151 oass.FileExchangeRateProvider.reload Reloading exchange rates from file currency.xml
[junit4:junit4]   2> 20096 T151 oass.OpenExchangeRatesOrgProvider.reload Reloading exchange rates from open-exchange-rates.json
[junit4:junit4]   2> 20096 T151 oass.OpenExchangeRatesOrgProvider.reload Reloading exchange rates from open-exchange-rates.json
[junit4:junit4]   2> 20112 T151 oasc.SolrCore.<init> [collection1] Opening new SolrCore at C:\Users\JenkinsSlave\workspace\Lucene-Solr-trunk-Windows\solr\build\solr-core\test\J0\.\org.apache.solr.cloud.BasicDistributedZk2Test-jetty4-1351979498277\collection1\, dataDir=.\org.apache.solr.cloud.BasicDistributedZk2Test-1351979480244/jetty4\
[junit4:junit4]   2> 20112 T151 oasc.JmxMonitoredMap.<init> JMX monitoring is enabled. Adding Solr mbeans to JMX Server: com.sun.jmx.mbeanserver.JmxMBeanServer@10f41e9
[junit4:junit4]   2> 20112 T151 oasc.SolrCore.initDirectoryFactory solr.NRTCachingDirectoryFactory
[junit4:junit4]   2> 20112 T151 oasc.CachingDirectoryFactory.injectLockFactory WARNING No lockType configured for NRTCachingDirectory(org.apache.lucene.store.SimpleFSDirectory@C:\Users\JenkinsSlave\workspace\Lucene-Solr-trunk-Windows\solr\build\solr-core\test\J0\org.apache.solr.cloud.BasicDistributedZk2Test-1351979480244\jetty4 lockFactory=org.apache.lucene.store.NativeFSLockFactory@107e78; maxCacheMB=48.0 maxMergeSizeMB=4.0) assuming 'simple'
[junit4:junit4]   2> 20112 T151 oasc.CachingDirectoryFactory.get return new directory for C:\Users\JenkinsSlave\workspace\Lucene-Solr-trunk-Windows\solr\build\solr-core\test\J0\.\org.apache.solr.cloud.BasicDistributedZk2Test-1351979480244\jetty4 forceNew:false
[junit4:junit4]   2> 20112 T151 oasc.CachingDirectoryFactory.close Releasing directory:C:\Users\JenkinsSlave\workspace\Lucene-Solr-trunk-Windows\solr\build\solr-core\test\J0\.\org.apache.solr.cloud.BasicDistributedZk2Test-1351979480244\jetty4
[junit4:junit4]   2> 20112 T151 oasc.SolrCore.getNewIndexDir New index directory detected: old=null new=.\org.apache.solr.cloud.BasicDistributedZk2Test-1351979480244/jetty4\index/
[junit4:junit4]   2> 20112 T151 oasc.SolrCore.initIndex WARNING [collection1] Solr index directory '.\org.apache.solr.cloud.BasicDistributedZk2Test-1351979480244\jetty4\index' doesn't exist. Creating new index...
[junit4:junit4]   2> 20112 T151 oasc.CachingDirectoryFactory.get return new directory for C:\Users\JenkinsSlave\workspace\Lucene-Solr-trunk-Windows\solr\build\solr-core\test\J0\.\org.apache.solr.cloud.BasicDistributedZk2Test-1351979480244\jetty4\index forceNew:false
[junit4:junit4]   2> 20127 T151 oasc.SolrDeletionPolicy.onCommit SolrDeletionPolicy.onCommit: commits:num=1
[junit4:junit4]   2> 		commit{dir=NRTCachingDirectory(org.apache.lucene.store.SimpleFSDirectory@C:\Users\JenkinsSlave\workspace\Lucene-Solr-trunk-Windows\solr\build\solr-core\test\J0\org.apache.solr.cloud.BasicDistributedZk2Test-1351979480244\jetty4\index lockFactory=org.apache.lucene.store.NativeFSLockFactory@139e19c; maxCacheMB=48.0 maxMergeSizeMB=4.0),segFN=segments_1,generation=1,filenames=[segments_1]
[junit4:junit4]   2> 20127 T151 oasc.SolrDeletionPolicy.updateCommits newest commit = 1[segments_1]
[junit4:junit4]   2> 20127 T151 oasc.CachingDirectoryFactory.close Releasing directory:C:\Users\JenkinsSlave\workspace\Lucene-Solr-trunk-Windows\solr\build\solr-core\test\J0\.\org.apache.solr.cloud.BasicDistributedZk2Test-1351979480244\jetty4\index
[junit4:junit4]   2> 20127 T151 oasc.SolrCore.initWriters created xml: solr.XMLResponseWriter
[junit4:junit4]   2> 20127 T151 oasup.UpdateRequestProcessorChain.init inserting DistributedUpdateProcessorFactory into updateRequestProcessorChain "dedupe"
[junit4:junit4]   2> 20127 T151 oasup.UpdateRequestProcessorChain.init inserting DistributedUpdateProcessorFactory into updateRequestProcessorChain "dedupe-allfields"
[junit4:junit4]   2> 20127 T151 oasup.UpdateRequestProcessorChain.init inserting DistributedUpdateProcessorFactory into updateRequestProcessorChain "stored_sig"
[junit4:junit4]   2> 20127 T151 oasup.UpdateRequestProcessorChain.init inserting DistributedUpdateProcessorFactory into updateRequestProcessorChain "uniq-fields"
[junit4:junit4]   2> 20127 T151 oasup.UpdateRequestProcessorChain.init inserting DistributedUpdateProcessorFactory into updateRequestProcessorChain "distrib-dup-test-chain-implicit"
[junit4:junit4]   2> 20127 T151 oasc.RequestHandlers.initHandlersFromConfig adding lazy requestHandler: solr.ReplicationHandler
[junit4:junit4]   2> 20143 T151 oasc.RequestHandlers.initHandlersFromConfig created /replication: solr.ReplicationHandler
[junit4:junit4]   2> 20143 T151 oasc.RequestHandlers.initHandlersFromConfig created standard: solr.StandardRequestHandler
[junit4:junit4]   2> 20143 T151 oasc.RequestHandlers.initHandlersFromConfig created /get: solr.RealTimeGetHandler
[junit4:junit4]   2> 20143 T151 oasc.RequestHandlers.initHandlersFromConfig created dismax: solr.SearchHandler
[junit4:junit4]   2> 20143 T151 oasc.RequestHandlers.initHandlersFromConfig created mock: org.apache.solr.core.MockQuerySenderListenerReqHandler
[junit4:junit4]   2> 20143 T151 oasc.RequestHandlers.initHandlersFromConfig created /admin/: org.apache.solr.handler.admin.AdminHandlers
[junit4:junit4]   2> 20143 T151 oasc.RequestHandlers.initHandlersFromConfig created defaults: solr.StandardRequestHandler
[junit4:junit4]   2> 20143 T151 oasc.RequestHandlers.initHandlersFromConfig adding lazy requestHandler: solr.StandardRequestHandler
[junit4:junit4]   2> 20143 T151 oasc.RequestHandlers.initHandlersFromConfig created lazy: solr.StandardRequestHandler
[junit4:junit4]   2> 20143 T151 oasc.RequestHandlers.initHandlersFromConfig created /update: solr.UpdateRequestHandler
[junit4:junit4]   2> 20159 T151 oasc.RequestHandlers.initHandlersFromConfig created /terms: org.apache.solr.handler.component.SearchHandler
[junit4:junit4]   2> 20159 T151 oasc.RequestHandlers.initHandlersFromConfig created spellCheckCompRH: org.apache.solr.handler.component.SearchHandler
[junit4:junit4]   2> 20159 T151 oasc.RequestHandlers.initHandlersFromConfig created spellCheckCompRH_Direct: org.apache.solr.handler.component.SearchHandler
[junit4:junit4]   2> 20159 T151 oasc.RequestHandlers.initHandlersFromConfig created spellCheckWithWordbreak: org.apache.solr.handler.component.SearchHandler
[junit4:junit4]   2> 20159 T151 oasc.RequestHandlers.initHandlersFromConfig created spellCheckWithWordbreak_Direct: org.apache.solr.handler.component.SearchHandler
[junit4:junit4]   2> 20159 T151 oasc.RequestHandlers.initHandlersFromConfig created spellCheckCompRH1: org.apache.solr.handler.component.SearchHandler
[junit4:junit4]   2> 20159 T151 oasc.RequestHandlers.initHandlersFromConfig created tvrh: org.apache.solr.handler.component.SearchHandler
[junit4:junit4]   2> 20159 T151 oasc.RequestHandlers.initHandlersFromConfig created /mlt: solr.MoreLikeThisHandler
[junit4:junit4]   2> 20159 T151 oasc.RequestHandlers.initHandlersFromConfig created /debug/dump: solr.DumpRequestHandler
[junit4:junit4]   2> 20174 T151 oashl.XMLLoader.init xsltCacheLifetimeSeconds=60
[junit4:junit4]   2> 20190 T151 oasc.SolrCore.initDeprecatedSupport WARNING solrconfig.xml uses deprecated <admin/gettableFiles>, Please update your config to use the ShowFileRequestHandler.
[junit4:junit4]   2> 20190 T151 oasc.SolrCore.initDeprecatedSupport WARNING adding ShowFileRequestHandler with hidden files: [SCHEMA.XML, OLD_SYNONYMS.TXT, STOPWORDS.TXT, PROTWORDS.TXT, OPEN-EXCHANGE-RATES.JSON, SYNONYMS.TXT, CURRENCY.XML, MAPPING-ISOLATIN1ACCENT.TXT]
[junit4:junit4]   2> 20190 T151 oasc.CachingDirectoryFactory.close Releasing directory:C:\Users\JenkinsSlave\workspace\Lucene-Solr-trunk-Windows\solr\build\solr-core\test\J0\.\org.apache.solr.cloud.BasicDistributedZk2Test-1351979480244\jetty4
[junit4:junit4]   2> 20190 T151 oass.SolrIndexSearcher.<init> Opening Searcher@1b57f7 main
[junit4:junit4]   2> 20205 T151 oasu.CommitTracker.<init> Hard AutoCommit: disabled
[junit4:junit4]   2> 20205 T151 oasu.CommitTracker.<init> Soft AutoCommit: disabled
[junit4:junit4]   2> 20205 T151 oashc.SpellCheckComponent.inform Initializing spell checkers
[junit4:junit4]   2> 20205 T151 oass.DirectSolrSpellChecker.init init: {name=direct,classname=DirectSolrSpellChecker,field=lowerfilt,minQueryLength=3}
[junit4:junit4]   2> 20299 T227 oasc.SolrCore.registerSearcher [collection1] Registered new searcher Searcher@1b57f7 main{StandardDirectoryReader(segments_1:1)}
[junit4:junit4]   2> 20299 T151 oasc.ZkController.publish numShards not found on descriptor - reading it from system property
[junit4:junit4]   2> 20643 T187 oascc.ZkStateReader.updateClusterState Updating cloud state from ZooKeeper... 
[junit4:junit4]   2> 20643 T187 oasc.Overseer$ClusterStateUpdater.updateState Update state numShards=2 message={
[junit4:junit4]   2> 	  "operation":"state",
[junit4:junit4]   2> 	  "numShards":"2",
[junit4:junit4]   2> 	  "shard":null,
[junit4:junit4]   2> 	  "roles":null,
[junit4:junit4]   2> 	  "state":"down",
[junit4:junit4]   2> 	  "core":"collection1",
[junit4:junit4]   2> 	  "collection":"collection1",
[junit4:junit4]   2> 	  "node_name":"127.0.0.1:63206_solr",
[junit4:junit4]   2> 	  "base_url":"http://127.0.0.1:63206/solr"}
[junit4:junit4]   2> 20643 T212 oascc.ZkStateReader$2.process A cluster state change has occurred - updating... (4)
[junit4:junit4]   2> 20643 T226 oascc.ZkStateReader$2.process A cluster state change has occurred - updating... (4)
[junit4:junit4]   2> 20643 T186 oascc.ZkStateReader$2.process A cluster state change has occurred - updating... (4)
[junit4:junit4]   2> 20643 T175 oascc.ZkStateReader$2.process A cluster state change has occurred - updating... (4)
[junit4:junit4]   2> 20643 T200 oascc.ZkStateReader$2.process A cluster state change has occurred - updating... (4)
[junit4:junit4]   2> 20799 T151 oasc.CoreContainer.registerCore registering core: collection1
[junit4:junit4]   2> 20799 T151 oasc.ZkController.register Register shard - core:collection1 address:http://127.0.0.1:63206/solr shardId:shard2
[junit4:junit4]   2> 20799 T151 oasc.ZkController.register We are http://127.0.0.1:63206/solr/collection1/ and leader is http://127.0.0.1:63192/solr/collection1/
[junit4:junit4]   2> 20799 T151 oasc.ZkController.register No LogReplay needed for core=collection1 baseURL=http://127.0.0.1:63206/solr
[junit4:junit4]   2> 20799 T151 oasc.ZkController.checkRecovery Core needs to recover:collection1
[junit4:junit4]   2> 20799 T151 oasu.DefaultSolrCoreState.doRecovery Running recovery - first canceling any ongoing recovery
[junit4:junit4]   2> ASYNC  NEW_CORE C19 name=collection1 org.apache.solr.core.SolrCore@d72782 url=http://127.0.0.1:63206/solr/collection1 node=127.0.0.1:63206_solr
[junit4:junit4]   2> 20799 T228 C19 P63206 oasc.RecoveryStrategy.run Starting recovery process.  core=collection1 recoveringAfterStartup=true
[junit4:junit4]   2> 20799 T228 C19 P63206 oasc.RecoveryStrategy.doRecovery ###### startupVersions=[]
[junit4:junit4]   2> 20799 T151 oascc.ZkStateReader.updateClusterState Updating cloud state from ZooKeeper... 
[junit4:junit4]   2> 20799 T228 C19 P63206 oasc.ZkController.publish numShards not found on descriptor - reading it from system property
[junit4:junit4]   2> 20799 T151 oass.SolrDispatchFilter.init user.dir=C:\Users\JenkinsSlave\workspace\Lucene-Solr-trunk-Windows\solr\build\solr-core\test\J0
[junit4:junit4]   2> 20799 T151 oass.SolrDispatchFilter.init SolrDispatchFilter.init() done
[junit4:junit4]   2> 20799 T151 oascsi.HttpClientUtil.createClient Creating new http client, config:maxConnections=128&maxConnectionsPerHost=32&followRedirects=false
[junit4:junit4]   2> 20799 T228 C19 P63206 oasc.RecoveryStrategy.doRecovery Attempting to PeerSync from http://127.0.0.1:63192/solr/collection1/ core=collection1 - recoveringAfterStartup=true
[junit4:junit4]   2> 20799 T228 C19 P63206 oasu.PeerSync.sync PeerSync: core=collection1 url=http://127.0.0.1:63206/solr START replicas=[http://127.0.0.1:63192/solr/collection1/] nUpdates=100
[junit4:junit4]   2> 20799 T228 C19 P63206 oasu.PeerSync.sync WARNING no frame of reference to tell of we've missed updates
[junit4:junit4]   2> 20799 T228 C19 P63206 oasc.RecoveryStrategy.doRecovery PeerSync Recovery was not successful - trying replication. core=collection1
[junit4:junit4]   2> 20799 T228 C19 P63206 oasc.RecoveryStrategy.doRecovery Starting Replication Recovery. core=collection1
[junit4:junit4]   2> 20799 T228 C19 P63206 oascsi.HttpClientUtil.createClient Creating new http client, config:maxConnections=128&maxConnectionsPerHost=32&followRedirects=false
[junit4:junit4]   2> 20815 T151 oascc.ZkStateReader.updateClusterState Updating cloud state from ZooKeeper... 
[junit4:junit4]   2> ASYNC  NEW_CORE C20 name=collection1 org.apache.solr.core.SolrCore@1e9fd86 url=http://127.0.0.1:63192/solr/collection1 node=127.0.0.1:63192_solr
[junit4:junit4]   2> 20830 T194 C20 P63192 REQ /get {distrib=false&qt=/get&wt=javabin&version=2&getVersions=100} status=0 QTime=0 
[junit4:junit4]   2> 20846 T151 oaz.ZooKeeper.<init> Initiating client connection, connectString=127.0.0.1:63166 sessionTimeout=10000 watcher=org.apache.solr.common.cloud.ConnectionManager@f1df56
[junit4:junit4]   2> 20846 T151 oascc.ConnectionManager.waitForConnected Waiting for client to connect to ZooKeeper
[junit4:junit4]   2> 20846 T230 oaz.ClientCnxn$SendThread.startConnect Opening socket connection to server /127.0.0.1:63166
[junit4:junit4]   2> 20862 T153 oazs.NIOServerCnxn$Factory.run Accepted socket connection from /127.0.0.1:63217
[junit4:junit4]   2> 20862 T230 oaz.ClientCnxn$SendThread.primeConnection Socket connection established to 127.0.0.1/127.0.0.1:63166, initiating session
[junit4:junit4]   2> 20862 T153 oazs.NIOServerCnxn.readConnectRequest Client attempting to establish new session at /127.0.0.1:63217
[junit4:junit4]   2> 20862 T155 oazs.NIOServerCnxn.finishSessionInit Established session 0x13ac841b58f0009 with negotiated timeout 10000 for client /127.0.0.1:63217
[junit4:junit4]   2> 20862 T230 oaz.ClientCnxn$SendThread.readConnectResult Session establishment complete on server 127.0.0.1/127.0.0.1:63166, sessionid = 0x13ac841b58f0009, negotiated timeout = 10000
[junit4:junit4]   2> 20862 T231 oascc.ConnectionManager.process Watcher org.apache.solr.common.cloud.ConnectionManager@f1df56 name:ZooKeeperConnection Watcher:127.0.0.1:63166 got event WatchedEvent state:SyncConnected type:None path:null path:null type:None
[junit4:junit4]   2> 20862 T151 oascc.ConnectionManager.waitForConnected Client is connected to ZooKeeper
[junit4:junit4]   1> / (2)
[junit4:junit4]   1> DATA:
[junit4:junit4]   1>     
[junit4:junit4]   1>  /solr (6)
[junit4:junit4]   1>   /solr/configs (1)
[junit4:junit4]   1>    /solr/configs/conf1 (9)
[junit4:junit4]   1>     /solr/configs/conf1/mapping-ISOLatin1Accent.txt (0)
[junit4:junit4]   1>     DATA: ...supressed...
[junit4:junit4]   1>     /solr/configs/conf1/currency.xml (0)
[junit4:junit4]   1>     DATA: ...supressed...
[junit4:junit4]   1>     /solr/configs/conf1/protwords.txt (0)
[junit4:junit4]   1>     DATA: ...supressed...
[junit4:junit4]   1>     /solr/configs/conf1/synonyms.txt (0)
[junit4:junit4]   1>     DATA: ...supressed...
[junit4:junit4]   1>     /solr/configs/conf1/old_synonyms.txt (0)
[junit4:junit4]   1>     DATA: ...supressed...
[junit4:junit4]   1>     /solr/configs/conf1/solrconfig.xml (0)
[junit4:junit4]   1>     DATA: ...supressed...
[junit4:junit4]   1>     /solr/configs/conf1/stopwords.txt (0)
[junit4:junit4]   1>     DATA: ...supressed...
[junit4:junit4]   1>     /solr/configs/conf1/open-exchange-rates.json (0)
[junit4:junit4]   1>     DATA:
[junit4:junit4]   1>         {
[junit4:junit4]   1>           "disclaimer": "This data is collected from various providers and provided free of charge for informational purposes only, with no guarantee whatsoever of accuracy, validity, availability or fitness for any purpose; use at your own risk. Other than that - have fun, and please share/watch/fork if you think data like this should be free!",
[junit4:junit4]   1>           "license": "Data collected from various providers with public-facing APIs; copyright may apply; not for resale; no warranties given.",
[junit4:junit4]   1>           "timestamp": 1332070464,
[junit4:junit4]   1>           "base": "USD",
[junit4:junit4]   1>           "rates": {
[junit4:junit4]   1>             "AED": 3.6732,
[junit4:junit4]   1>             "AFN": 48.299999,
[junit4:junit4]   1>             "ALL": 105.919998,
[junit4:junit4]   1>             "AMD": 388.890015,
[junit4:junit4]   1>             "ANG": 1.79,
[junit4:junit4]   1>             "AOA": 94.769997,
[junit4:junit4]   1>             "ARS": 4.35,
[junit4:junit4]   1>             "AUD": 0.943931,
[junit4:junit4]   1>             "AWG": 1.7899,
[junit4:junit4]   1>             "AZN": 0.7863,
[junit4:junit4]   1>             "BAM": 1.48775,
[junit4:junit4]   1>             "BBD": 2,
[junit4:junit4]   1>             "BDT": 82,
[junit4:junit4]   1>             "BGN": 1.4962,
[junit4:junit4]   1>             "BHD": 0.37703,
[junit4:junit4]   1>             "BIF": 1304.170044,
[junit4:junit4]   1>             "BMD": 1,
[junit4:junit4]   1>             "BND": 1.2575,
[junit4:junit4]   1>             "BOB": 6.91,
[junit4:junit4]   1>             "BRL": 1.8003,
[junit4:junit4]   1>             "BSD": 1,
[junit4:junit4]   1>             "BTN": 50.185001,
[junit4:junit4]   1>             "BWP": 7.2307,
[junit4:junit4]   1>             "BYR": 8150,
[junit4:junit4]   1>             "BZD": 1.9135,
[junit4:junit4]   1>             "CAD": 0.9921,
[junit4:junit4]   1>             "CDF": 917.276917,
[junit4:junit4]   1>             "CHF": 0.9164,
[junit4:junit4]   1>             "CLF": 0.02146,
[junit4:junit4]   1>             "CLP": 482.75,
[junit4:junit4]   1>             "CNY": 6.3239,
[junit4:junit4]   1>             "COP": 1760,
[junit4:junit4]   1>             "CRC": 507.600006,
[junit4:junit4]   1>             "CUP": 1,
[junit4:junit4]   1>             "CVE": 84.190002,
[junit4:junit4]   1>             "CZK": 18.606001,
[junit4:junit4]   1>             "DJF": 179.490005,
[junit4:junit4]   1>             "DKK": 5.64424,
[junit4:junit4]   1>             "DOP": 39.025002,
[junit4:junit4]   1>             "DZD": 74.544998,
[junit4:junit4]   1>             "EGP": 6.0385,
[junit4:junit4]   1>             "ETB": 17.720449,
[junit4:junit4]   1>             "EUR": 0.758956,
[junit4:junit4]   1>             "FJD": 1.7734,
[junit4:junit4]   1>             "FKP": 0.6316,
[junit4:junit4]   1>             "GBP": 0.631373,
[junit4:junit4]   1>             "GEL": 1.6469,
[junit4:junit4]   1>             "GHS": 1.7455,
[junit4:junit4]   1>             "GIP": 0.63165,
[junit4:junit4]   1>             "GMD": 31.5,
[junit4:junit4]   1>             "GNF": 7100,
[junit4:junit4]   1>             "GTQ": 7.6975,
[junit4:junit4]   1>             "GYD": 203.699997,
[junit4:junit4]   1>             "HKD": 7.76306,
[junit4:junit4]   1>             "HNL": 19.055,
[junit4:junit4]   1>             "HRK": 5.7333,
[junit4:junit4]   1>             "HTG": 41,
[junit4:junit4]   1>             "HUF": 219.850006,
[junit4:junit4]   1>             "IDR": 9118,
[junit4:junit4]   1>             "IEP": 0.5978,
[junit4:junit4]   1>             "ILS": 3.7542,
[junit4:junit4]   1>             "INR": 50.165001,
[junit4:junit4]   1>             "IQD": 1165.5,
[junit4:junit4]   1>             "IRR": 12308,
[junit4:junit4]   1>             "ISK": 127.440002,
[junit4:junit4]   1>             "JMD": 86.699997,
[junit4:junit4]   1>             "JOD": 0.7095,
[junit4:junit4]   1>             "JPY": 83.445,
[junit4:junit4]   1>             "KES": 83.18,
[junit4:junit4]   1>             "KGS": 46.699402,
[junit4:junit4]   1>             "KHR": 4010.300049,
[junit4:junit4]   1>             "KMF": 373.424255,
[junit4:junit4]   1>             "KPW": 900,
[junit4:junit4]   1>             "KRW": 1125.849976,
[junit4:junit4]   1>             "KWD": 0.27925,
[junit4:junit4]   1>             "KZT": 147.690002,
[junit4:junit4]   1>             "LAK": 7993.799805,
[junit4:junit4]   1>             "LBP": 1504,
[junit4:junit4]   1>             "LKR": 125.224998,
[junit4:junit4]   1>             "LRD": 73.459999,
[junit4:junit4]   1>             "LSL": 7.5768,
[junit4:junit4]   1>             "LTL": 2.6219,
[junit4:junit4]   1>             "LVL": 0.5291,
[junit4:junit4]   1>             "LYD": 1.2572,
[junit4:junit4]   1>             "MAD": 8.4611,
[junit4:junit4]   1>             "MDL": 11.89,
[junit4:junit4]   1>             "MGA": 2155,
[junit4:junit4]   1>             "MKD": 46.705002,
[junit4:junit4]   1>             "MMK": 6.51,
[junit4:junit4]   1>             "MNT": 1322.5,
[junit4:junit4]   1>             "MOP": 7.9958,
[junit4:junit4]   1>             "MRO": 293,
[junit4:junit4]   1>             "MUR": 29.110001,
[junit4:junit4]   1>             "MVR": 15.36,
[junit4:junit4]   1>             "MWK": 165.206207,
[junit4:junit4]   1>             "MXN": 12.6745,
[junit4:junit4]   1>             "MYR": 3.0575,
[junit4:junit4]   1>             "MZN": 27.200001,
[junit4:junit4]   1>             "NAD": 7.58,
[junit4:junit4]   1>             "NGN": 157.600006,
[junit4:junit4]   1>             "NIO": 23.215,
[junit4:junit4]   1>             "NOK": 5.73163,
[junit4:junit4]   1>             "NPR": 80.620003,
[junit4:junit4]   1>             "NZD": 1.212269,
[junit4:junit4]   1>             "OMR": 0.38485,
[junit4:junit4]   1>             "PAB": 1,
[junit4:junit4]   1>             "PEN": 2.674,
[junit4:junit4]   1>             "PGK": 2.0627,
[junit4:junit4]   1>             "PHP": 43.02,
[junit4:junit4]   1>             "PKR": 90.800003,
[junit4:junit4]   1>             "PLN": 3.1285,
[junit4:junit4]   1>             "PYG": 4245,
[junit4:junit4]   1>             "QAR": 3.6415,
[junit4:junit4]   1>             "RON": 3.3256,
[junit4:junit4]   1>             "RSD": 84.100502,
[junit4:junit4]   1>             "RUB": 29.2342,
[junit4:junit4]   1>             "RWF": 606.717468,
[junit4:junit4]   1>             "SAR": 3.7505,
[junit4:junit4]   1>             "SBD": 7.075973,
[junit4:junit4]   1>             "SCR": 14.0447,
[junit4:junit4]   1>             "SDG": 2.6765,
[junit4:junit4]   1>             "SEK": 6.74525,
[junit4:junit4]   1>             "SGD": 1.258,
[junit4:junit4]   1>             "SHP": 0.63165,
[junit4:junit4]   1>             "SLL": 4364.5,
[junit4:junit4]   1>             "SOS": 1629,
[junit4:junit4]   1>             "SRD": 3.2875,
[junit4:junit4]   1>             "STD": 18650,
[junit4:junit4]   1>             "SVC": 8.7475,
[junit4:junit4]   1>             "SYP": 57.450001,
[junit4:junit4]   1>             "SZL": 7.5752,
[junit4:junit4]   1>             "THB": 30.700001,
[junit4:junit4]   1>             "TJS": 4.7588,
[junit4:junit4]   1>             "TMT": 2.85,
[junit4:junit4]   1>             "TND": 1.5178,
[junit4:junit4]   1>             "TOP": 1.693601,
[junit4:junit4]   1>             "TRY": 1.796,
[junit4:junit4]   1>             "TTD": 6.40015,
[junit4:junit4]   1>             "TWD": 29.532,
[junit4:junit4]   1>             "TZS": 1595,
[junit4:junit4]   1>             "UAH": 8.029,
[junit4:junit4]   1>             "UGX": 2481.699951,
[junit4:junit4]   1>             "USD": 1,
[junit4:junit4]   1>             "UYU": 19.469999,
[junit4:junit4]   1>             "UZS": 1835.75,
[junit4:junit4]   1>             "VEF": 4.295,
[junit4:junit4]   1>             "VND": 20820,
[junit4:junit4]   1>             "VUV": 90.199997,
[junit4:junit4]   1>             "WST": 2.247475,
[junit4:junit4]   1>             "XAF": 497.898987,
[junit4:junit4]   1>             "XCD": 2.7,
[junit4:junit4]   1>             "XDR": 0.652794,
[junit4:junit4]   1>             "XOF": 498.399994,
[junit4:junit4]   1>             "XPF": 90.639999,
[junit4:junit4]   1>             "YER": 216.005005,
[junit4:junit4]   1>             "ZAR": 7.5688,
[junit4:junit4]   1>             "ZMK": 5271.5,
[junit4:junit4]   1>             "ZWD": 378.700012,
[junit4:junit4]   1>             "ZWL": 322.355011
[junit4:junit4]   1>           }
[junit4:junit4]   1>         }
[junit4:junit4]   1>     /solr/configs/conf1/schema.xml (0)
[junit4:junit4]   1>     DATA: ...supressed...
[junit4:junit4]   1>   /solr/live_nodes (4)
[junit4:junit4]   1>    /solr/live_nodes/127.0.0.1:63198_solr (0)
[junit4:junit4]   1>    /solr/live_nodes/127.0.0.1:63192_solr (0)
[junit4:junit4]   1>    /solr/live_nodes/127.0.0.1:63206_solr (0)
[junit4:junit4]   1>    /solr/live_nodes/127.0.0.1:63186_solr (0)
[junit4:junit4]   1>   /solr/overseer (3)
[junit4:junit4]   1>   DATA:
[junit4:junit4]   1>       
[junit4:junit4]   1>    /solr/overseer/queue (1)
[junit4:junit4]   1>    DATA:
[junit4:junit4]   1>        
[junit4:junit4]   1>     /solr/overseer/queue/qn-0000000022 (0)
[junit4:junit4]   1>     DATA:
[junit4:junit4]   1>         {
[junit4:junit4]   1>           "operation":"state",
[junit4:junit4]   1>           "numShards":"2",
[junit4:junit4]   1>           "shard":"shard2",
[junit4:junit4]   1>           "roles":null,
[junit4:junit4]   1>           "state":"recovering",
[junit4:junit4]   1>           "core":"collection1",
[junit4:junit4]   1>           "collection":"collection1",
[junit4:junit4]   1>           "node_name":"127.0.0.1:63206_solr",
[junit4:junit4]   1>           "base_url":"http://127.0.0.1:63206/solr"}
[junit4:junit4]   1>    /solr/overseer/queue-work (0)
[junit4:junit4]   1>    DATA:
[junit4:junit4]   1>        
[junit4:junit4]   1>    /solr/overseer/collection-queue-work (0)
[junit4:junit4]   1>    DATA:
[junit4:junit4]   1>        
[junit4:junit4]   1>   /solr/overseer_elect (2)
[junit4:junit4]   1>    /solr/overseer_elect/election (4)
[junit4:junit4]   1>     /solr/overseer_elect/election/88603327231623175-127.0.0.1:63198_solr-n_0000000002 (0)
[junit4:junit4]   1>     /solr/overseer_elect/election/88603327231623176-127.0.0.1:63206_solr-n_0000000003 (0)
[junit4:junit4]   1>     /solr/overseer_elect/election/88603327231623174-127.0.0.1:63192_solr-n_0000000001 (0)
[junit4:junit4]   1>     /solr/overseer_elect/election/88603327231623173-127.0.0.1:63186_solr-n_0000000000 (0)
[junit4:junit4]   1>    /solr/overseer_elect/leader (0)
[junit4:junit4]   1>    DATA:
[junit4:junit4]   1>        {"id":"88603327231623173-127.0.0.1:63186_solr-n_0000000000"}
[junit4:junit4]   1>   /solr/collections (2)
[junit4:junit4]   1>    /solr/collections/collection1 (3)
[junit4:junit4]   1>    DATA:
[junit4:junit4]   1>        {"configName":"conf1"}
[junit4:junit4]   1>     /solr/collections/collection1/shards (0)
[junit4:junit4]   1>     /solr/collections/collection1/leader_elect (2)
[junit4:junit4]   1>      /solr/collections/collection1/leader_elect/shard1 (1)
[junit4:junit4]   1>       /solr/collections/collection1/leader_elect/shard1/election (2)
[junit4:junit4]   1>        /solr/collections/collection1/leader_elect/shard1/election/88603327231623175-127.0.0.1:63198_solr_collection1-n_0000000001 (0)
[junit4:junit4]   1>        /solr/collections/collection1/leader_elect/shard1/election/88603327231623173-127.0.0.1:63186_solr_collection1-n_0000000000 (0)
[junit4:junit4]   1>      /solr/collections/collection1/leader_elect/shard2 (1)
[junit4:junit4]   1>       /solr/collections/collection1/leader_elect/shard2/election (2)
[junit4:junit4]   1>        /solr/collections/collection1/leader_elect/shard2/election/88603327231623174-127.0.0.1:63192_solr_collection1-n_0000000000 (0)
[junit4:junit4]   2> 20924 T156 oazs.PrepRequestProcessor.pRequest Processed session termination for sessionid: 0x13ac841b58f0009
[junit4:junit4]   2> 20924 T153 oazs.NIOServerCnxn.doIO WARNING EndOfStreamException: Unable to read additional data from client sessionid 0x13ac841b58f0009, likely client has closed socket
[junit4:junit4]   2> 20924 T151 oaz.ZooKeeper.close Session: 0x13ac841b58f0009 closed
[junit4:junit4]   2> 20924 T231 oaz.ClientCnxn$EventThread.run EventThread shut down
[junit4:junit4]   2> 20924 T153 oazs.NIOServerCnxn.closeSock Closed socket connection for client /127.0.0.1:63217 which had sessionid 0x13ac841b58f0009
[junit4:junit4]   2> 20924 T156 oazs.PrepRequestProcessor.pRequest Processed session termination for sessionid: 0x13ac841b58f0004
[junit4:junit4]   2> 20924 T151 oaz.ZooKeeper.close Session: 0x13ac841b58f0004 closed
[junit4:junit4]   2> 20924 T156 oazs.PrepRequestProcessor.run PrepRequestProcessor exited loop!
[junit4:junit4]   2> 20924 T153 oazs.NIOServerCnxn.closeSock Closed socket connection for client /127.0.0.1:63185 which had sessionid 0x13ac841b58f0004
[junit4:junit4]   2> 20924 T155 oazs.SyncRequestProcessor.run SyncRequestProcessor exited!
[junit4:junit4]   2> 20924 T151 oazs.FinalRequestProcessor.shutdown shutdown of request processor complete
[junit4:junit4]   2> 20924 T175 oaz.ClientCnxn$EventThread.run EventThread shut down
[junit4:junit4]   2>  C17_STATE=coll:collection1 core:collection1 props:{shard=shard1, roles=null, state=recovering, core=collection1, collection=collection1, node_name=127.0.0.1:63198_solr, base_url=http://127.0.0.1:63198/solr}
[junit4:junit4]   2> 21127 T214 C17 P63198 oasc.RecoveryStrategy.doRecovery Begin buffering updates. core=collection1
[junit4:junit4]   2> 23190 T214 C17 P63198 oasu.UpdateLog.bufferUpdates Starting to buffer updates. FSUpdateLog{state=ACTIVE, tlog=null}
[junit4:junit4]   2> 23190 T214 C17 P63198 oasc.RecoveryStrategy.replicate Attempting to replicate from http://127.0.0.1:63186/solr/collection1/. core=collection1
[junit4:junit4]   2> 21784 T154 oazs.SessionTrackerImpl.run SessionTrackerImpl exited loop!
[junit4:junit4]   2> 23190 T151 oazs.NIOServerCnxn.closeSock Closed socket connection for client /127.0.0.1:63203 which had sessionid 0x13ac841b58f0007
[junit4:junit4]   2> 23190 T214 C17 P63198 oascsi.HttpClientUtil.createClient Creating new http client, config:maxConnections=128&maxConnectionsPerHost=32&followRedirects=false
[junit4:junit4]   2> 23190 T151 oazs.NIOServerCnxn.closeSock Closed socket connection for client /127.0.0.1:63211 which had sessionid 0x13ac841b58f0008
[junit4:junit4]   2> 23190 T151 oazs.NIOServerCnxn.closeSock Closed socket connection for client /127.0.0.1:63191 which had sessionid 0x13ac841b58f0005
[junit4:junit4]   2> 23190 T151 oazs.NIOServerCnxn.closeSock Closed socket connection for client /127.0.0.1:63197 which had sessionid 0x13ac841b58f0006
[junit4:junit4]   2> 23190 T151 oazs.NIOServerCnxn.closeSock Closed socket connection for client /127.0.0.1:63182 which had sessionid 0x13ac841b58f0003
[junit4:junit4]   2> 23190 T211 oaz.ClientCnxn$SendThread.run Unable to read additional data from server sessionid 0x13ac841b58f0007, likely server has closed socket, closing socket connection and attempting reconnect
[junit4:junit4]   2> 23190 T225 oaz.ClientCnxn$SendThread.run Unable to read additional data from server sessionid 0x13ac841b58f0008, likely server has closed socket, closing socket connection and attempting reconnect
[junit4:junit4]   2> 23190 T185 oaz.ClientCnxn$SendThread.run Unable to read additional data from server sessionid 0x13ac841b58f0005, likely server has closed socket, closing socket connection and attempting reconnect
[junit4:junit4]   2> 23190 T199 oaz.ClientCnxn$SendThread.run Unable to read additional data from server sessionid 0x13ac841b58f0006, likely server has closed socket, closing socket connection and attempting reconnect
[junit4:junit4]   2> 23190 T172 oaz.ClientCnxn$SendThread.run Unable to read additional data from server sessionid 0x13ac841b58f0003, likely server has closed socket, closing socket connection and attempting reconnect
[junit4:junit4]   2> 23190 T153 oazs.NIOServerCnxn.doIO WARNING Exception causing close of session 0x13ac841b58f0006 due to java.nio.channels.CancelledKeyException
[junit4:junit4]   2> 23190 T153 oazs.NIOServerCnxn$Factory.run NIOServerCnxn factory exited run method
[junit4:junit4]   2> 23190 T151 oazs.FinalRequestProcessor.shutdown shutdown of request processor complete
[junit4:junit4]   2> 23190 T151 oasc.ChaosMonkey.monkeyLog monkey: stop shard! 63173
[junit4:junit4]   2> 23205 T151 oejsh.ContextHandler.doStop stopped o.e.j.s.ServletContextHandler{/solr,null}
[junit4:junit4]   2> 23221 T182 C18 P63186 oascsi.HttpClientUtil.createClient Creating new http client, config:maxConnections=500&maxConnectionsPerHost=16
[junit4:junit4]   2> 23221 T182 C18 P63186 oasu.DirectUpdateHandler2.commit start commit{flags=0,_version_=0,optimize=false,openSearcher=false,waitSearcher=true,expungeDeletes=false,softCommit=false}
[junit4:junit4]   2> 23221 T182 C18 P63186 oasc.CachingDirectoryFactory.close Releasing directory:C:\Users\JenkinsSlave\workspace\Lucene-Solr-trunk-Windows\solr\build\solr-core\test\J0\.\org.apache.solr.cloud.BasicDistributedZk2Test-1351979480244\jetty1
[junit4:junit4]   2> 23241 T182 C18 P63186 oasc.SolrDeletionPolicy.onInit SolrDeletionPolicy.onInit: commits:num=1
[junit4:junit4]   2> 		commit{dir=NRTCachingDirectory(org.apache.lucene.store.SimpleFSDirectory@C:\Users\JenkinsSlave\workspace\Lucene-Solr-trunk-Windows\solr\build\solr-core\test\J0\org.apache.solr.cloud.BasicDistributedZk2Test-1351979480244\jetty1\index lockFactory=org.apache.lucene.store.NativeFSLockFactory@180ce9c; maxCacheMB=48.0 maxMergeSizeMB=4.0),segFN=segments_1,generation=1,filenames=[segments_1]
[junit4:junit4]   2> 23242 T182 C18 P63186 oasc.SolrDeletionPolicy.updateCommits newest commit = 1[segments_1]
[junit4:junit4]   2> 23244 T182 C18 P63186 oasc.CachingDirectoryFactory.close Releasing directory:C:\Users\JenkinsSlave\workspace\Lucene-Solr-trunk-Windows\solr\build\solr-core\test\J0\.\org.apache.solr.cloud.BasicDistributedZk2Test-1351979480244\jetty1
[junit4:junit4]   2> 23244 T182 C18 P63186 oass.SolrIndexSearcher.<init> Opening Searcher@10d19a9 realtime
[junit4:junit4]   2> 23244 T182 C18 P63186 oasu.DirectUpdateHandler2.commit end_commit_flush
[junit4:junit4]   2> 23244 T182 C18 P63186 /update {waitSearcher=true&openSearcher=false&commit=true&commit_end_point=true&wt=javabin&softCommit=false&version=2} {commit=} 0 54
[junit4:junit4]   2> 23262 T151 oasc.ChaosMonkey.monkeyLog monkey: stop shard! 63186
[junit4:junit4]   2> 23263 T151 oasc.CoreContainer.shutdown Shutting down CoreContainer instance=4731499
[junit4:junit4]   2> 23263 T151 oasc.SolrCore.close [collection1]  CLOSING SolrCore org.apache.solr.core.SolrCore@921fc7
[junit4:junit4]   2> 23279 T151 oasu.DirectUpdateHandler2.close closing DirectUpdateHandler2{commits=1,autocommits=0,soft autocommits=0,optimizes=0,rollbacks=0,expungeDeletes=0,docsPending=0,adds=0,deletesById=0,deletesByQuery=0,errors=0,cumulative_adds=0,cumulative_deletesById=0,cumulative_deletesByQuery=0,cumulative_errors=0}
[junit4:junit4]   2> 23279 T151 oasc.SolrCore.decrefSolrCoreState Closing SolrCoreState
[junit4:junit4]   2> 23279 T151 oasu.DefaultSolrCoreState.closeIndexWriter SolrCoreState ref count has reached 0 - closing IndexWriter
[junit4:junit4]   2> 23279 T151 oasu.DefaultSolrCoreState.closeIndexWriter closing IndexWriter with IndexWriterCloser
[junit4:junit4]   2> 23279 T151 C18 P63186 oasc.CachingDirectoryFactory.close Releasing directory:C:\Users\JenkinsSlave\workspace\Lucene-Solr-trunk-Windows\solr\build\solr-core\test\J0\.\org.apache.solr.cloud.BasicDistributedZk2Test-1351979480244\jetty1\index
[junit4:junit4]   2> 23279 T151 oasc.SolrCore.closeSearcher [collection1] Closing main searcher on request.
[junit4:junit4]   2> 23279 T151 oasc.CachingDirectoryFactory.close Releasing directory:C:\Users\JenkinsSlave\workspace\Lucene-Solr-trunk-Windows\solr\build\solr-core\test\J0\.\org.apache.solr.cloud.BasicDistributedZk2Test-1351979480244\jetty1\index
[junit4:junit4]   2> 23279 T151 oasc.CachingDirectoryFactory.close Releasing directory:C:\Users\JenkinsSlave\workspace\Lucene-Solr-trunk-Windows\solr\build\solr-core\test\J0\.\org.apache.solr.cloud.BasicDistributedZk2Test-1351979480244\jetty1\index
[junit4:junit4]   2> 23294 T151 oaz.ZooKeeper.close Session: 0x13ac841b58f0005 closed
[junit4:junit4]   2> 23294 T187 oasc.Overseer$ClusterStateUpdater.amILeader According to ZK I (id=88603327231623173-127.0.0.1:63186_solr-n_0000000000) am no longer a leader.
[junit4:junit4]   2> 23294 T212 oascc.ConnectionManager.process Watcher org.apache.solr.common.cloud.ConnectionManager@1cfd989 name:ZooKeeperConnection Watcher:127.0.0.1:63166/solr got event WatchedEvent state:Disconnected type:None path:null path:null type:None
[junit4:junit4]   2> 23294 T186 oaz.ClientCnxn$EventThread.run EventThread shut down
[junit4:junit4]   2> 23294 T173 oascc.ConnectionManager.process Watcher org.apache.solr.common.cloud.ConnectionManager@11da1d1 name:ZooKeeperConnection Watcher:127.0.0.1:63166/solr got event WatchedEvent state:Disconnected type:None path:null path:null type:None
[junit4:junit4]   2> 23294 T173 oascc.ConnectionManager.process zkClient has disconnected
[junit4:junit4]   2> 23294 T226 oascc.Conn

[...truncated too long message...]

connection to server 127.0.0.1/127.0.0.1:63166
[junit4:junit4]   2> 56416 T172 oaz.ClientCnxn$SendThread.run WARNING Session 0x13ac841b58f0003 for server null, unexpected error, closing socket connection and attempting reconnect java.nio.channels.ClosedByInterruptException
[junit4:junit4]   2> 	at java.nio.channels.spi.AbstractInterruptibleChannel.end(AbstractInterruptibleChannel.java:184)
[junit4:junit4]   2> 	at sun.nio.ch.SocketChannelImpl.finishConnect(SocketChannelImpl.java:635)
[junit4:junit4]   2> 	at org.apache.zookeeper.ClientCnxn$SendThread.run(ClientCnxn.java:1143)
[junit4:junit4]   2> 
[junit4:junit4]   2> 56891 T172 oaz.ClientCnxn$SendThread.startConnect WARNING Unexpected exception java.lang.InterruptedException: sleep interrupted
[junit4:junit4]   2> 	at java.lang.Thread.sleep(Native Method)
[junit4:junit4]   2> 	at org.apache.zookeeper.ClientCnxn$SendThread.startConnect(ClientCnxn.java:1045)
[junit4:junit4]   2> 	at org.apache.zookeeper.ClientCnxn$SendThread.run(ClientCnxn.java:1101)
[junit4:junit4]   2> 
[junit4:junit4]   2> 56891 T172 oaz.ClientCnxn$SendThread.startConnect Opening socket connection to server 127.0.0.1/127.0.0.1:63166
[junit4:junit4]   2> 57922 T172 oaz.ClientCnxn$SendThread.run WARNING Session 0x13ac841b58f0003 for server null, unexpected error, closing socket connection and attempting reconnect java.nio.channels.ClosedByInterruptException
[junit4:junit4]   2> 	at java.nio.channels.spi.AbstractInterruptibleChannel.end(AbstractInterruptibleChannel.java:184)
[junit4:junit4]   2> 	at sun.nio.ch.SocketChannelImpl.finishConnect(SocketChannelImpl.java:635)
[junit4:junit4]   2> 	at org.apache.zookeeper.ClientCnxn$SendThread.run(ClientCnxn.java:1143)
[junit4:junit4]   2> 
[junit4:junit4]   2> 58391 T150 ccr.ThreadLeakControl.tryToInterruptAll SEVERE There are still zombie threads that couldn't be terminated:
[junit4:junit4]   2> 	   1) Thread[id=172, name=TEST-BasicDistributedZk2Test.testDistribSearch-seed#[6D097EBC7284C687]-SendThread(127.0.0.1:63166), state=TIMED_WAITING, group=TGRP-BasicDistributedZk2Test]
[junit4:junit4]   2> 	        at java.lang.Thread.sleep(Native Method)
[junit4:junit4]   2> 	        at org.apache.zookeeper.ClientCnxn$SendThread.startConnect(ClientCnxn.java:1038)
[junit4:junit4]   2> 	        at org.apache.zookeeper.ClientCnxn$SendThread.run(ClientCnxn.java:1101)
[junit4:junit4]   2> NOTE: test params are: codec=Lucene41: {}, sim=RandomSimilarityProvider(queryNorm=true,coord=no): {}, locale=mt, timezone=Europe/London
[junit4:junit4]   2> NOTE: Windows 7 6.1 x86/Sun Microsystems Inc. 1.6.0_37 (32-bit)/cpus=2,threads=2,free=9339128,total=26443776
[junit4:junit4]   2> NOTE: All tests run in this JVM: [TestTrie, TestCSVLoader, XsltUpdateRequestHandlerTest, CurrencyFieldTest, TestStressRecovery, TestQuerySenderListener, PrimitiveFieldTypeTest, TestDocumentBuilder, TestSolrDeletionPolicy2, BadComponentTest, UpdateParamsTest, TestIndexSearcher, TestCSVResponseWriter, SignatureUpdateProcessorFactoryTest, IndexReaderFactoryTest, TestCharFilters, DOMUtilTest, TestBinaryResponseWriter, DistributedQueryElevationComponentTest, ConvertedLegacyTest, SolrIndexConfigTest, TestHashPartitioner, IndexSchemaTest, BasicDistributedZk2Test]
[junit4:junit4]   2> NOTE: reproduce with: ant test  -Dtestcase=BasicDistributedZk2Test -Dtests.seed=6D097EBC7284C687 -Dtests.slow=true -Dtests.locale=mt -Dtests.timezone=Europe/London -Dtests.file.encoding=UTF-8
[junit4:junit4] ERROR   0.00s | BasicDistributedZk2Test (suite) <<<
[junit4:junit4]    > Throwable #1: java.lang.AssertionError: ERROR: SolrZkClient opens=9 closes=8
[junit4:junit4]    > 	at __randomizedtesting.SeedInfo.seed([6D097EBC7284C687]:0)
[junit4:junit4]    > 	at org.junit.Assert.fail(Assert.java:93)
[junit4:junit4]    > 	at org.apache.solr.SolrTestCaseJ4.endTrackingZkClients(SolrTestCaseJ4.java:258)
[junit4:junit4]    > 	at org.apache.solr.SolrTestCaseJ4.afterClass(SolrTestCaseJ4.java:98)
[junit4:junit4]    > 	at sun.reflect.NativeMethodAccessorImpl.invoke0(Native Method)
[junit4:junit4]    > 	at sun.reflect.NativeMethodAccessorImpl.invoke(NativeMethodAccessorImpl.java:39)
[junit4:junit4]    > 	at sun.reflect.DelegatingMethodAccessorImpl.invoke(DelegatingMethodAccessorImpl.java:25)
[junit4:junit4]    > 	at java.lang.reflect.Method.invoke(Method.java:597)
[junit4:junit4]    > 	at com.carrotsearch.randomizedtesting.RandomizedRunner.invoke(RandomizedRunner.java:1559)
[junit4:junit4]    > 	at com.carrotsearch.randomizedtesting.RandomizedRunner.access$600(RandomizedRunner.java:79)
[junit4:junit4]    > 	at com.carrotsearch.randomizedtesting.RandomizedRunner$5.evaluate(RandomizedRunner.java:700)
[junit4:junit4]    > 	at com.carrotsearch.randomizedtesting.rules.StatementAdapter.evaluate(StatementAdapter.java:36)
[junit4:junit4]    > 	at com.carrotsearch.randomizedtesting.rules.SystemPropertiesRestoreRule$1.evaluate(SystemPropertiesRestoreRule.java:53)
[junit4:junit4]    > 	at org.apache.lucene.util.AbstractBeforeAfterRule$1.evaluate(AbstractBeforeAfterRule.java:45)
[junit4:junit4]    > 	at org.apache.lucene.util.TestRuleStoreClassName$1.evaluate(TestRuleStoreClassName.java:42)
[junit4:junit4]    > 	at com.carrotsearch.randomizedtesting.rules.SystemPropertiesInvariantRule$1.evaluate(SystemPropertiesInvariantRule.java:55)
[junit4:junit4]    > 	at com.carrotsearch.randomizedtesting.rules.NoShadowingOrOverridesOnMethodsRule$1.evaluate(NoShadowingOrOverridesOnMethodsRule.java:39)
[junit4:junit4]    > 	at com.carrotsearch.randomizedtesting.rules.NoShadowingOrOverridesOnMethodsRule$1.evaluate(NoShadowingOrOverridesOnMethodsRule.java:39)
[junit4:junit4]    > 	at com.carrotsearch.randomizedtesting.rules.StatementAdapter.evaluate(StatementAdapter.java:36)
[junit4:junit4]    > 	at org.apache.lucene.util.TestRuleAssertionsRequired$1.evaluate(TestRuleAssertionsRequired.java:43)
[junit4:junit4]    > 	at org.apache.lucene.util.TestRuleMarkFailure$1.evaluate(TestRuleMarkFailure.java:48)
[junit4:junit4]    > 	at org.apache.lucene.util.TestRuleIgnoreAfterMaxFailures$1.evaluate(TestRuleIgnoreAfterMaxFailures.java:70)
[junit4:junit4]    > 	at org.apache.lucene.util.TestRuleIgnoreTestSuites$1.evaluate(TestRuleIgnoreTestSuites.java:55)
[junit4:junit4]    > 	at com.carrotsearch.randomizedtesting.rules.StatementAdapter.evaluate(StatementAdapter.java:36)
[junit4:junit4]    > 	at com.carrotsearch.randomizedtesting.ThreadLeakControl$StatementRunner.run(ThreadLeakControl.java:358)
[junit4:junit4]    > 	at java.lang.Thread.run(Thread.java:662)
[junit4:junit4]    > Throwable #2: com.carrotsearch.randomizedtesting.ThreadLeakError: 2 threads leaked from SUITE scope at org.apache.solr.cloud.BasicDistributedZk2Test: 
[junit4:junit4]    >    1) Thread[id=173, name=TEST-BasicDistributedZk2Test.testDistribSearch-seed#[6D097EBC7284C687]-EventThread, state=WAITING, group=TGRP-BasicDistributedZk2Test]
[junit4:junit4]    >         at sun.misc.Unsafe.park(Native Method)
[junit4:junit4]    >         at java.util.concurrent.locks.LockSupport.park(LockSupport.java:156)
[junit4:junit4]    >         at java.util.concurrent.locks.AbstractQueuedSynchronizer$ConditionObject.await(AbstractQueuedSynchronizer.java:1987)
[junit4:junit4]    >         at java.util.concurrent.LinkedBlockingQueue.take(LinkedBlockingQueue.java:399)
[junit4:junit4]    >         at org.apache.zookeeper.ClientCnxn$EventThread.run(ClientCnxn.java:498)
[junit4:junit4]    >    2) Thread[id=172, name=TEST-BasicDistributedZk2Test.testDistribSearch-seed#[6D097EBC7284C687]-SendThread(127.0.0.1:63166), state=TIMED_WAITING, group=TGRP-BasicDistributedZk2Test]
[junit4:junit4]    >         at java.lang.Thread.sleep(Native Method)
[junit4:junit4]    >         at org.apache.zookeeper.ClientCnxn$SendThread.startConnect(ClientCnxn.java:1045)
[junit4:junit4]    >         at org.apache.zookeeper.ClientCnxn$SendThread.run(ClientCnxn.java:1101)
[junit4:junit4]    > 	at __randomizedtesting.SeedInfo.seed([6D097EBC7284C687]:0)
[junit4:junit4]    > Throwable #3: com.carrotsearch.randomizedtesting.ThreadLeakError: There are still zombie threads that couldn't be terminated:
[junit4:junit4]    >    1) Thread[id=172, name=TEST-BasicDistributedZk2Test.testDistribSearch-seed#[6D097EBC7284C687]-SendThread(127.0.0.1:63166), state=TIMED_WAITING, group=TGRP-BasicDistributedZk2Test]
[junit4:junit4]    >         at java.lang.Thread.sleep(Native Method)
[junit4:junit4]    >         at org.apache.zookeeper.ClientCnxn$SendThread.startConnect(ClientCnxn.java:1038)
[junit4:junit4]    >         at org.apache.zookeeper.ClientCnxn$SendThread.run(ClientCnxn.java:1101)
[junit4:junit4]    > 	at __randomizedtesting.SeedInfo.seed([6D097EBC7284C687]:0)
[junit4:junit4] Completed in 58.46s, 1 test, 1 failure, 3 errors <<< FAILURES!

[...truncated 637 lines...]
BUILD FAILED
C:\Users\JenkinsSlave\workspace\Lucene-Solr-trunk-Windows\build.xml:335: The following error occurred while executing this line:
C:\Users\JenkinsSlave\workspace\Lucene-Solr-trunk-Windows\build.xml:39: The following error occurred while executing this line:
C:\Users\JenkinsSlave\workspace\Lucene-Solr-trunk-Windows\solr\build.xml:178: The following error occurred while executing this line:
C:\Users\JenkinsSlave\workspace\Lucene-Solr-trunk-Windows\lucene\module-build.xml:61: The following error occurred while executing this line:
C:\Users\JenkinsSlave\workspace\Lucene-Solr-trunk-Windows\lucene\common-build.xml:1163: The following error occurred while executing this line:
C:\Users\JenkinsSlave\workspace\Lucene-Solr-trunk-Windows\lucene\common-build.xml:827: There were test failures: 233 suites, 965 tests, 3 suite-level errors, 1 error, 828 ignored (1 assumption)

Total time: 20 minutes 3 seconds
Build step 'Invoke Ant' marked build as failure
Archiving artifacts
Recording test results
Description set: Java: 32bit/jdk1.6.0_37 -client -XX:+UseSerialGC
Email was triggered for: Failure
Sending email for trigger: Failure



Mime
View raw message