lucene-dev mailing list archives

Site index · List index
Message view « Date » · « Thread »
Top « Date » · « Thread »
From Policeman Jenkins Server <jenk...@sd-datasolutions.de>
Subject [JENKINS] Lucene-Solr-trunk-Windows (32bit/jdk1.6.0_37) - Build # 1487 - Failure!
Date Thu, 08 Nov 2012 12:58:43 GMT
Build: http://jenkins.sd-datasolutions.de/job/Lucene-Solr-trunk-Windows/1487/
Java: 32bit/jdk1.6.0_37 -server -XX:+UseConcMarkSweepGC

1 tests failed.
REGRESSION:  org.apache.solr.cloud.BasicDistributedZkTest.testDistribSearch

Error Message:
There are still nodes recoverying - waited for 180 seconds

Stack Trace:
java.lang.AssertionError: There are still nodes recoverying - waited for 180 seconds
	at __randomizedtesting.SeedInfo.seed([83A716744245D90:89DCFF7F337B3DAC]:0)
	at org.junit.Assert.fail(Assert.java:93)
	at org.apache.solr.cloud.AbstractDistribZkTestBase.waitForRecoveriesToFinish(AbstractDistribZkTestBase.java:166)
	at org.apache.solr.cloud.AbstractDistribZkTestBase.waitForRecoveriesToFinish(AbstractDistribZkTestBase.java:116)
	at org.apache.solr.cloud.AbstractDistribZkTestBase.waitForRecoveriesToFinish(AbstractDistribZkTestBase.java:111)
	at org.apache.solr.cloud.AbstractFullDistribZkTestBase.waitForRecoveriesToFinish(AbstractFullDistribZkTestBase.java:553)
	at org.apache.solr.cloud.BasicDistributedZkTest.doTest(BasicDistributedZkTest.java:169)
	at org.apache.solr.BaseDistributedSearchTestCase.testDistribSearch(BaseDistributedSearchTestCase.java:695)
	at sun.reflect.NativeMethodAccessorImpl.invoke0(Native Method)
	at sun.reflect.NativeMethodAccessorImpl.invoke(NativeMethodAccessorImpl.java:39)
	at sun.reflect.DelegatingMethodAccessorImpl.invoke(DelegatingMethodAccessorImpl.java:25)
	at java.lang.reflect.Method.invoke(Method.java:597)
	at com.carrotsearch.randomizedtesting.RandomizedRunner.invoke(RandomizedRunner.java:1559)
	at com.carrotsearch.randomizedtesting.RandomizedRunner.access$600(RandomizedRunner.java:79)
	at com.carrotsearch.randomizedtesting.RandomizedRunner$6.evaluate(RandomizedRunner.java:737)
	at com.carrotsearch.randomizedtesting.RandomizedRunner$7.evaluate(RandomizedRunner.java:773)
	at com.carrotsearch.randomizedtesting.RandomizedRunner$8.evaluate(RandomizedRunner.java:787)
	at com.carrotsearch.randomizedtesting.rules.SystemPropertiesRestoreRule$1.evaluate(SystemPropertiesRestoreRule.java:53)
	at org.apache.lucene.util.TestRuleSetupTeardownChained$1.evaluate(TestRuleSetupTeardownChained.java:50)
	at org.apache.lucene.util.TestRuleFieldCacheSanity$1.evaluate(TestRuleFieldCacheSanity.java:51)
	at org.apache.lucene.util.AbstractBeforeAfterRule$1.evaluate(AbstractBeforeAfterRule.java:45)
	at com.carrotsearch.randomizedtesting.rules.SystemPropertiesInvariantRule$1.evaluate(SystemPropertiesInvariantRule.java:55)
	at org.apache.lucene.util.TestRuleThreadAndTestName$1.evaluate(TestRuleThreadAndTestName.java:48)
	at org.apache.lucene.util.TestRuleIgnoreAfterMaxFailures$1.evaluate(TestRuleIgnoreAfterMaxFailures.java:70)
	at org.apache.lucene.util.TestRuleMarkFailure$1.evaluate(TestRuleMarkFailure.java:48)
	at com.carrotsearch.randomizedtesting.rules.StatementAdapter.evaluate(StatementAdapter.java:36)
	at com.carrotsearch.randomizedtesting.ThreadLeakControl$StatementRunner.run(ThreadLeakControl.java:358)
	at com.carrotsearch.randomizedtesting.ThreadLeakControl.forkTimeoutingTask(ThreadLeakControl.java:782)
	at com.carrotsearch.randomizedtesting.ThreadLeakControl$3.evaluate(ThreadLeakControl.java:442)
	at com.carrotsearch.randomizedtesting.RandomizedRunner.runSingleTest(RandomizedRunner.java:746)
	at com.carrotsearch.randomizedtesting.RandomizedRunner$3.evaluate(RandomizedRunner.java:648)
	at com.carrotsearch.randomizedtesting.RandomizedRunner$4.evaluate(RandomizedRunner.java:682)
	at com.carrotsearch.randomizedtesting.RandomizedRunner$5.evaluate(RandomizedRunner.java:693)
	at com.carrotsearch.randomizedtesting.rules.StatementAdapter.evaluate(StatementAdapter.java:36)
	at com.carrotsearch.randomizedtesting.rules.SystemPropertiesRestoreRule$1.evaluate(SystemPropertiesRestoreRule.java:53)
	at org.apache.lucene.util.AbstractBeforeAfterRule$1.evaluate(AbstractBeforeAfterRule.java:45)
	at org.apache.lucene.util.TestRuleStoreClassName$1.evaluate(TestRuleStoreClassName.java:42)
	at com.carrotsearch.randomizedtesting.rules.SystemPropertiesInvariantRule$1.evaluate(SystemPropertiesInvariantRule.java:55)
	at com.carrotsearch.randomizedtesting.rules.NoShadowingOrOverridesOnMethodsRule$1.evaluate(NoShadowingOrOverridesOnMethodsRule.java:39)
	at com.carrotsearch.randomizedtesting.rules.NoShadowingOrOverridesOnMethodsRule$1.evaluate(NoShadowingOrOverridesOnMethodsRule.java:39)
	at com.carrotsearch.randomizedtesting.rules.StatementAdapter.evaluate(StatementAdapter.java:36)
	at org.apache.lucene.util.TestRuleAssertionsRequired$1.evaluate(TestRuleAssertionsRequired.java:43)
	at org.apache.lucene.util.TestRuleMarkFailure$1.evaluate(TestRuleMarkFailure.java:48)
	at org.apache.lucene.util.TestRuleIgnoreAfterMaxFailures$1.evaluate(TestRuleIgnoreAfterMaxFailures.java:70)
	at org.apache.lucene.util.TestRuleIgnoreTestSuites$1.evaluate(TestRuleIgnoreTestSuites.java:55)
	at com.carrotsearch.randomizedtesting.rules.StatementAdapter.evaluate(StatementAdapter.java:36)
	at com.carrotsearch.randomizedtesting.ThreadLeakControl$StatementRunner.run(ThreadLeakControl.java:358)
	at java.lang.Thread.run(Thread.java:662)




Build Log:
[...truncated 8063 lines...]
[junit4:junit4] Suite: org.apache.solr.cloud.BasicDistributedZkTest
[junit4:junit4]   2> 8 T992 oas.SolrTestCaseJ4.setUp ###Starting testDistribSearch
[junit4:junit4]   2> Creating dataDir: C:\Users\JenkinsSlave\workspace\Lucene-Solr-trunk-Windows\solr\build\solr-core\test\J0\.\solrtest-BasicDistributedZkTest-1352378471570
[junit4:junit4]   2> 11 T992 oasc.ZkTestServer.run STARTING ZK TEST SERVER
[junit4:junit4]   2> 13 T993 oazs.ZooKeeperServer.setTickTime tickTime set to 1000
[junit4:junit4]   2> 14 T993 oazs.NIOServerCnxn$Factory.<init> binding to port 0.0.0.0/0.0.0.0:0
[junit4:junit4]   2> 15 T993 oazsp.FileTxnSnapLog.save Snapshotting: 0
[junit4:junit4]   2> 93 T992 oasc.ZkTestServer.run start zk server on port:59399
[junit4:junit4]   2> 93 T992 oaz.ZooKeeper.<init> Initiating client connection, connectString=127.0.0.1:59399 sessionTimeout=10000 watcher=org.apache.solr.common.cloud.ConnectionManager@a3f1cc
[junit4:junit4]   2> 95 T998 oaz.ClientCnxn$SendThread.startConnect Opening socket connection to server /127.0.0.1:59399
[junit4:junit4]   2> 95 T992 oascc.ConnectionManager.waitForConnected Waiting for client to connect to ZooKeeper
[junit4:junit4]   2> 97 T994 oazs.NIOServerCnxn$Factory.run Accepted socket connection from /127.0.0.1:59402
[junit4:junit4]   2> 97 T998 oaz.ClientCnxn$SendThread.primeConnection Socket connection established to 127.0.0.1/127.0.0.1:59399, initiating session
[junit4:junit4]   2> 97 T994 oazs.NIOServerCnxn.readConnectRequest Client attempting to establish new session at /127.0.0.1:59402
[junit4:junit4]   2> 97 T996 oazsp.FileTxnLog.append Creating new log file: log.1
[junit4:junit4]   2> 101 T996 oazs.NIOServerCnxn.finishSessionInit Established session 0x13ae009d4990000 with negotiated timeout 10000 for client /127.0.0.1:59402
[junit4:junit4]   2> 102 T998 oaz.ClientCnxn$SendThread.readConnectResult Session establishment complete on server 127.0.0.1/127.0.0.1:59399, sessionid = 0x13ae009d4990000, negotiated timeout = 10000
[junit4:junit4]   2> 102 T999 oascc.ConnectionManager.process Watcher org.apache.solr.common.cloud.ConnectionManager@a3f1cc name:ZooKeeperConnection Watcher:127.0.0.1:59399 got event WatchedEvent state:SyncConnected type:None path:null path:null type:None
[junit4:junit4]   2> 102 T992 oascc.ConnectionManager.waitForConnected Client is connected to ZooKeeper
[junit4:junit4]   2> 102 T992 oascc.SolrZkClient.makePath makePath: /solr
[junit4:junit4]   2> 105 T997 oazs.PrepRequestProcessor.pRequest Processed session termination for sessionid: 0x13ae009d4990000
[junit4:junit4]   2> 106 T992 oaz.ZooKeeper.close Session: 0x13ae009d4990000 closed
[junit4:junit4]   2> 106 T994 oazs.NIOServerCnxn.doIO WARNING EndOfStreamException: Unable to read additional data from client sessionid 0x13ae009d4990000, likely client has closed socket
[junit4:junit4]   2> 106 T992 oaz.ZooKeeper.<init> Initiating client connection, connectString=127.0.0.1:59399/solr sessionTimeout=10000 watcher=org.apache.solr.common.cloud.ConnectionManager@1412a15
[junit4:junit4]   2> 107 T999 oaz.ClientCnxn$EventThread.run EventThread shut down
[junit4:junit4]   2> 109 T1000 oaz.ClientCnxn$SendThread.startConnect Opening socket connection to server /127.0.0.1:59399
[junit4:junit4]   2> 109 T992 oascc.ConnectionManager.waitForConnected Waiting for client to connect to ZooKeeper
[junit4:junit4]   2> 109 T994 oazs.NIOServerCnxn.closeSock Closed socket connection for client /127.0.0.1:59402 which had sessionid 0x13ae009d4990000
[junit4:junit4]   2> 110 T1000 oaz.ClientCnxn$SendThread.primeConnection Socket connection established to 127.0.0.1/127.0.0.1:59399, initiating session
[junit4:junit4]   2> 110 T994 oazs.NIOServerCnxn$Factory.run Accepted socket connection from /127.0.0.1:59405
[junit4:junit4]   2> 111 T994 oazs.NIOServerCnxn.readConnectRequest Client attempting to establish new session at /127.0.0.1:59405
[junit4:junit4]   2> 112 T996 oazs.NIOServerCnxn.finishSessionInit Established session 0x13ae009d4990001 with negotiated timeout 10000 for client /127.0.0.1:59405
[junit4:junit4]   2> 112 T1000 oaz.ClientCnxn$SendThread.readConnectResult Session establishment complete on server 127.0.0.1/127.0.0.1:59399, sessionid = 0x13ae009d4990001, negotiated timeout = 10000
[junit4:junit4]   2> 113 T1001 oascc.ConnectionManager.process Watcher org.apache.solr.common.cloud.ConnectionManager@1412a15 name:ZooKeeperConnection Watcher:127.0.0.1:59399/solr got event WatchedEvent state:SyncConnected type:None path:null path:null type:None
[junit4:junit4]   2> 113 T992 oascc.ConnectionManager.waitForConnected Client is connected to ZooKeeper
[junit4:junit4]   2> 113 T992 oascc.SolrZkClient.makePath makePath: /collections/collection1
[junit4:junit4]   2> 122 T992 oascc.SolrZkClient.makePath makePath: /collections/collection1/shards
[junit4:junit4]   2> 126 T992 oascc.SolrZkClient.makePath makePath: /collections/control_collection
[junit4:junit4]   2> 129 T992 oascc.SolrZkClient.makePath makePath: /collections/control_collection/shards
[junit4:junit4]   2> 133 T992 oasc.AbstractZkTestCase.putConfig put C:\Users\JenkinsSlave\workspace\Lucene-Solr-trunk-Windows\solr\build\solr-core\test-files\solr\collection1\conf\solrconfig.xml to /configs/conf1/solrconfig.xml
[junit4:junit4]   2> 134 T992 oascc.SolrZkClient.makePath makePath: /configs/conf1/solrconfig.xml
[junit4:junit4]   2> 139 T992 oasc.AbstractZkTestCase.putConfig put C:\Users\JenkinsSlave\workspace\Lucene-Solr-trunk-Windows\solr\build\solr-core\test-files\solr\collection1\conf\schema.xml to /configs/conf1/schema.xml
[junit4:junit4]   2> 140 T992 oascc.SolrZkClient.makePath makePath: /configs/conf1/schema.xml
[junit4:junit4]   2> 145 T992 oasc.AbstractZkTestCase.putConfig put C:\Users\JenkinsSlave\workspace\Lucene-Solr-trunk-Windows\solr\build\solr-core\test-files\solr\collection1\conf\solrconfig.xml to /configs/conf1/solrconfig.xml
[junit4:junit4]   2> 145 T992 oascc.SolrZkClient.makePath makePath: /configs/conf1/solrconfig.xml
[junit4:junit4]   2> 149 T992 oasc.AbstractZkTestCase.putConfig put C:\Users\JenkinsSlave\workspace\Lucene-Solr-trunk-Windows\solr\build\solr-core\test-files\solr\collection1\conf\stopwords.txt to /configs/conf1/stopwords.txt
[junit4:junit4]   2> 150 T992 oascc.SolrZkClient.makePath makePath: /configs/conf1/stopwords.txt
[junit4:junit4]   2> 153 T992 oasc.AbstractZkTestCase.putConfig put C:\Users\JenkinsSlave\workspace\Lucene-Solr-trunk-Windows\solr\build\solr-core\test-files\solr\collection1\conf\protwords.txt to /configs/conf1/protwords.txt
[junit4:junit4]   2> 154 T992 oascc.SolrZkClient.makePath makePath: /configs/conf1/protwords.txt
[junit4:junit4]   2> 157 T992 oasc.AbstractZkTestCase.putConfig put C:\Users\JenkinsSlave\workspace\Lucene-Solr-trunk-Windows\solr\build\solr-core\test-files\solr\collection1\conf\currency.xml to /configs/conf1/currency.xml
[junit4:junit4]   2> 158 T992 oascc.SolrZkClient.makePath makePath: /configs/conf1/currency.xml
[junit4:junit4]   2> 161 T992 oasc.AbstractZkTestCase.putConfig put C:\Users\JenkinsSlave\workspace\Lucene-Solr-trunk-Windows\solr\build\solr-core\test-files\solr\collection1\conf\open-exchange-rates.json to /configs/conf1/open-exchange-rates.json
[junit4:junit4]   2> 161 T992 oascc.SolrZkClient.makePath makePath: /configs/conf1/open-exchange-rates.json
[junit4:junit4]   2> 166 T992 oasc.AbstractZkTestCase.putConfig put C:\Users\JenkinsSlave\workspace\Lucene-Solr-trunk-Windows\solr\build\solr-core\test-files\solr\collection1\conf\mapping-ISOLatin1Accent.txt to /configs/conf1/mapping-ISOLatin1Accent.txt
[junit4:junit4]   2> 167 T992 oascc.SolrZkClient.makePath makePath: /configs/conf1/mapping-ISOLatin1Accent.txt
[junit4:junit4]   2> 173 T992 oasc.AbstractZkTestCase.putConfig put C:\Users\JenkinsSlave\workspace\Lucene-Solr-trunk-Windows\solr\build\solr-core\test-files\solr\collection1\conf\old_synonyms.txt to /configs/conf1/old_synonyms.txt
[junit4:junit4]   2> 174 T992 oascc.SolrZkClient.makePath makePath: /configs/conf1/old_synonyms.txt
[junit4:junit4]   2> 177 T992 oasc.AbstractZkTestCase.putConfig put C:\Users\JenkinsSlave\workspace\Lucene-Solr-trunk-Windows\solr\build\solr-core\test-files\solr\collection1\conf\synonyms.txt to /configs/conf1/synonyms.txt
[junit4:junit4]   2> 178 T992 oascc.SolrZkClient.makePath makePath: /configs/conf1/synonyms.txt
[junit4:junit4]   2> 182 T997 oazs.PrepRequestProcessor.pRequest Processed session termination for sessionid: 0x13ae009d4990001
[junit4:junit4]   2> 182 T1001 oaz.ClientCnxn$EventThread.run EventThread shut down
[junit4:junit4]   2> 182 T992 oaz.ZooKeeper.close Session: 0x13ae009d4990001 closed
[junit4:junit4]   2> 183 T994 oazs.NIOServerCnxn.closeSock Closed socket connection for client /127.0.0.1:59405 which had sessionid 0x13ae009d4990001
[junit4:junit4]   2> 458 T992 oejs.Server.doStart jetty-8.1.7.v20120910
[junit4:junit4]   2> 470 T992 oejs.AbstractConnector.doStart Started SelectChannelConnector@0.0.0.0:59406
[junit4:junit4]   2> 470 T992 oasc.SolrResourceLoader.locateSolrHome JNDI not configured for solr (NoInitialContextEx)
[junit4:junit4]   2> 470 T992 oasc.SolrResourceLoader.locateSolrHome using system property solr.solr.home: C:\Users\JenkinsSlave\workspace\Lucene-Solr-trunk-Windows\solr\build\solr-core\test\J0\.\org.apache.solr.cloud.BasicDistributedZkTest-controljetty-1352378471744
[junit4:junit4]   2> 470 T992 oasc.SolrResourceLoader.<init> new SolrResourceLoader for deduced Solr Home: 'C:\Users\JenkinsSlave\workspace\Lucene-Solr-trunk-Windows\solr\build\solr-core\test\J0\.\org.apache.solr.cloud.BasicDistributedZkTest-controljetty-1352378471744\'
[junit4:junit4]   2> 498 T992 oass.SolrDispatchFilter.init SolrDispatchFilter.init()
[junit4:junit4]   2> 498 T992 oasc.SolrResourceLoader.locateSolrHome JNDI not configured for solr (NoInitialContextEx)
[junit4:junit4]   2> 500 T992 oasc.SolrResourceLoader.locateSolrHome using system property solr.solr.home: C:\Users\JenkinsSlave\workspace\Lucene-Solr-trunk-Windows\solr\build\solr-core\test\J0\.\org.apache.solr.cloud.BasicDistributedZkTest-controljetty-1352378471744
[junit4:junit4]   2> 500 T992 oasc.CoreContainer$Initializer.initialize looking for solr.xml: C:\Users\JenkinsSlave\workspace\Lucene-Solr-trunk-Windows\solr\build\solr-core\test\J0\.\org.apache.solr.cloud.BasicDistributedZkTest-controljetty-1352378471744\solr.xml
[junit4:junit4]   2> 500 T992 oasc.CoreContainer.<init> New CoreContainer 28705042
[junit4:junit4]   2> 501 T992 oasc.CoreContainer.load Loading CoreContainer using Solr Home: 'C:\Users\JenkinsSlave\workspace\Lucene-Solr-trunk-Windows\solr\build\solr-core\test\J0\.\org.apache.solr.cloud.BasicDistributedZkTest-controljetty-1352378471744\'
[junit4:junit4]   2> 501 T992 oasc.SolrResourceLoader.<init> new SolrResourceLoader for directory: 'C:\Users\JenkinsSlave\workspace\Lucene-Solr-trunk-Windows\solr\build\solr-core\test\J0\.\org.apache.solr.cloud.BasicDistributedZkTest-controljetty-1352378471744\'
[junit4:junit4]   2> 520 T992 oasc.CoreContainer.load Registering Log Listener
[junit4:junit4]   2> 536 T992 oasc.CoreContainer.initZooKeeper Zookeeper client=127.0.0.1:59399/solr
[junit4:junit4]   2> 537 T992 oaz.ZooKeeper.<init> Initiating client connection, connectString=127.0.0.1:59399/solr sessionTimeout=5000 watcher=org.apache.solr.common.cloud.ConnectionManager@1d3f12
[junit4:junit4]   2> 539 T1011 oaz.ClientCnxn$SendThread.startConnect Opening socket connection to server /127.0.0.1:59399
[junit4:junit4]   2> 543 T1011 oaz.ClientCnxn$SendThread.primeConnection Socket connection established to 127.0.0.1/127.0.0.1:59399, initiating session
[junit4:junit4]   2> 543 T992 oascc.ConnectionManager.waitForConnected Waiting for client to connect to ZooKeeper
[junit4:junit4]   2> 545 T994 oazs.NIOServerCnxn$Factory.run Accepted socket connection from /127.0.0.1:59411
[junit4:junit4]   2> 545 T994 oazs.NIOServerCnxn.readConnectRequest Client attempting to establish new session at /127.0.0.1:59411
[junit4:junit4]   2> 556 T1011 oaz.ClientCnxn$SendThread.readConnectResult Session establishment complete on server 127.0.0.1/127.0.0.1:59399, sessionid = 0x13ae009d4990002, negotiated timeout = 5000
[junit4:junit4]   2> 556 T996 oazs.NIOServerCnxn.finishSessionInit Established session 0x13ae009d4990002 with negotiated timeout 5000 for client /127.0.0.1:59411
[junit4:junit4]   2> 556 T1012 oascc.ConnectionManager.process Watcher org.apache.solr.common.cloud.ConnectionManager@1d3f12 name:ZooKeeperConnection Watcher:127.0.0.1:59399/solr got event WatchedEvent state:SyncConnected type:None path:null path:null type:None
[junit4:junit4]   2> 557 T992 oascc.ConnectionManager.waitForConnected Client is connected to ZooKeeper
[junit4:junit4]   2> 559 T997 oazs.PrepRequestProcessor.pRequest Got user-level KeeperException when processing sessionid:0x13ae009d4990002 type:create cxid:0x2 zxid:0xfffffffffffffffe txntype:unknown reqpath:n/a Error Path:/solr/overseer Error:KeeperErrorCode = NodeExists for /solr/overseer
[junit4:junit4]   2> 562 T992 oascc.SolrZkClient.makePath makePath: /live_nodes
[junit4:junit4]   2> 564 T992 oasc.ZkController.createEphemeralLiveNode Register node as live in ZooKeeper:/live_nodes/127.0.0.1:59406_solr
[junit4:junit4]   2> 565 T997 oazs.PrepRequestProcessor.pRequest Got user-level KeeperException when processing sessionid:0x13ae009d4990002 type:delete cxid:0x7 zxid:0xfffffffffffffffe txntype:unknown reqpath:n/a Error Path:/solr/live_nodes/127.0.0.1:59406_solr Error:KeeperErrorCode = NoNode for /solr/live_nodes/127.0.0.1:59406_solr
[junit4:junit4]   2> 567 T992 oascc.SolrZkClient.makePath makePath: /live_nodes/127.0.0.1:59406_solr
[junit4:junit4]   2> 571 T992 oashc.HttpShardHandlerFactory.getParameter Setting socketTimeout to: 0
[junit4:junit4]   2> 571 T992 oashc.HttpShardHandlerFactory.getParameter Setting urlScheme to: http://
[junit4:junit4]   2> 571 T992 oashc.HttpShardHandlerFactory.getParameter Setting connTimeout to: 0
[junit4:junit4]   2> 571 T992 oashc.HttpShardHandlerFactory.getParameter Setting maxConnectionsPerHost to: 20
[junit4:junit4]   2> 571 T992 oashc.HttpShardHandlerFactory.getParameter Setting corePoolSize to: 0
[junit4:junit4]   2> 572 T992 oashc.HttpShardHandlerFactory.getParameter Setting maximumPoolSize to: 2147483647
[junit4:junit4]   2> 572 T992 oashc.HttpShardHandlerFactory.getParameter Setting maxThreadIdleTime to: 5
[junit4:junit4]   2> 573 T992 oashc.HttpShardHandlerFactory.getParameter Setting sizeOfQueue to: -1
[junit4:junit4]   2> 573 T992 oashc.HttpShardHandlerFactory.getParameter Setting fairnessPolicy to: false
[junit4:junit4]   2> 573 T992 oascsi.HttpClientUtil.createClient Creating new http client, config:maxConnectionsPerHost=20&maxConnections=10000&socketTimeout=0&connTimeout=0&retry=false
[junit4:junit4]   2> 624 T992 oascc.SolrZkClient.makePath makePath: /overseer_elect/election
[junit4:junit4]   2> 632 T997 oazs.PrepRequestProcessor.pRequest Got user-level KeeperException when processing sessionid:0x13ae009d4990002 type:delete cxid:0x15 zxid:0xfffffffffffffffe txntype:unknown reqpath:n/a Error Path:/solr/overseer_elect/leader Error:KeeperErrorCode = NoNode for /solr/overseer_elect/leader
[junit4:junit4]   2> 634 T992 oascc.SolrZkClient.makePath makePath: /overseer_elect/leader
[junit4:junit4]   2> 637 T992 oasc.Overseer.start Overseer (id=88629475513270274-127.0.0.1:59406_solr-n_0000000000) starting
[junit4:junit4]   2> 638 T997 oazs.PrepRequestProcessor.pRequest Got user-level KeeperException when processing sessionid:0x13ae009d4990002 type:create cxid:0x1a zxid:0xfffffffffffffffe txntype:unknown reqpath:n/a Error Path:/solr/overseer Error:KeeperErrorCode = NodeExists for /solr/overseer
[junit4:junit4]   2> 639 T997 oazs.PrepRequestProcessor.pRequest Got user-level KeeperException when processing sessionid:0x13ae009d4990002 type:create cxid:0x1b zxid:0xfffffffffffffffe txntype:unknown reqpath:n/a Error Path:/solr/overseer Error:KeeperErrorCode = NodeExists for /solr/overseer
[junit4:junit4]   2> 640 T997 oazs.PrepRequestProcessor.pRequest Got user-level KeeperException when processing sessionid:0x13ae009d4990002 type:create cxid:0x1c zxid:0xfffffffffffffffe txntype:unknown reqpath:n/a Error Path:/solr/overseer Error:KeeperErrorCode = NodeExists for /solr/overseer
[junit4:junit4]   2> 642 T997 oazs.PrepRequestProcessor.pRequest Got user-level KeeperException when processing sessionid:0x13ae009d4990002 type:create cxid:0x1d zxid:0xfffffffffffffffe txntype:unknown reqpath:n/a Error Path:/solr/overseer Error:KeeperErrorCode = NodeExists for /solr/overseer
[junit4:junit4]   2> 644 T1014 oasc.OverseerCollectionProcessor.run Process current queue of collection messages
[junit4:junit4]   2> 645 T992 oascc.SolrZkClient.makePath makePath: /clusterstate.json
[junit4:junit4]   2> 648 T992 oascc.ZkStateReader.createClusterStateWatchersAndUpdate Updating cluster state from ZooKeeper... 
[junit4:junit4]   2> 653 T1013 oasc.Overseer$ClusterStateUpdater.run Starting to work on the main queue
[junit4:junit4]   2> 660 T992 oasc.CoreContainer.create Creating SolrCore 'collection1' using instanceDir: C:\Users\JenkinsSlave\workspace\Lucene-Solr-trunk-Windows\solr\build\solr-core\test\J0\.\org.apache.solr.cloud.BasicDistributedZkTest-controljetty-1352378471744\collection1
[junit4:junit4]   2> 661 T992 oasc.ZkController.createCollectionZkNode Check for collection zkNode:control_collection
[junit4:junit4]   2> 662 T992 oasc.ZkController.createCollectionZkNode Collection zkNode exists
[junit4:junit4]   2> 663 T992 oasc.ZkController.readConfigName Load collection config from:/collections/control_collection
[junit4:junit4]   2> 665 T992 oasc.SolrResourceLoader.<init> new SolrResourceLoader for directory: 'C:\Users\JenkinsSlave\workspace\Lucene-Solr-trunk-Windows\solr\build\solr-core\test\J0\.\org.apache.solr.cloud.BasicDistributedZkTest-controljetty-1352378471744\collection1\'
[junit4:junit4]   2> 667 T992 oasc.SolrResourceLoader.replaceClassLoader Adding 'file:/C:/Users/JenkinsSlave/workspace/Lucene-Solr-trunk-Windows/solr/build/solr-core/test/J0/org.apache.solr.cloud.BasicDistributedZkTest-controljetty-1352378471744/collection1/lib/classes/' to classloader
[junit4:junit4]   2> 668 T992 oasc.SolrResourceLoader.replaceClassLoader Adding 'file:/C:/Users/JenkinsSlave/workspace/Lucene-Solr-trunk-Windows/solr/build/solr-core/test/J0/org.apache.solr.cloud.BasicDistributedZkTest-controljetty-1352378471744/collection1/lib/README' to classloader
[junit4:junit4]   2> 709 T992 oasc.SolrConfig.<init> Using Lucene MatchVersion: LUCENE_50
[junit4:junit4]   2> 768 T992 oasc.SolrConfig.<init> Loaded SolrConfig: solrconfig.xml
[junit4:junit4]   2> 770 T992 oass.IndexSchema.readSchema Reading Solr Schema
[junit4:junit4]   2> 774 T992 oass.IndexSchema.readSchema Schema name=test
[junit4:junit4]   2> 1331 T992 oass.OpenExchangeRatesOrgProvider.init Initialized with rates=open-exchange-rates.json, refreshInterval=1440.
[junit4:junit4]   2> 1339 T992 oass.IndexSchema.readSchema default search field in schema is text
[junit4:junit4]   2> 1343 T992 oass.IndexSchema.readSchema unique key field: id
[junit4:junit4]   2> 1357 T992 oass.FileExchangeRateProvider.reload Reloading exchange rates from file currency.xml
[junit4:junit4]   2> 1361 T992 oass.FileExchangeRateProvider.reload Reloading exchange rates from file currency.xml
[junit4:junit4]   2> 1365 T992 oass.OpenExchangeRatesOrgProvider.reload Reloading exchange rates from open-exchange-rates.json
[junit4:junit4]   2> 1366 T992 oass.OpenExchangeRatesOrgProvider.reload Reloading exchange rates from open-exchange-rates.json
[junit4:junit4]   2> 1368 T992 oasc.SolrCore.<init> [collection1] Opening new SolrCore at C:\Users\JenkinsSlave\workspace\Lucene-Solr-trunk-Windows\solr\build\solr-core\test\J0\.\org.apache.solr.cloud.BasicDistributedZkTest-controljetty-1352378471744\collection1\, dataDir=.\org.apache.solr.cloud.BasicDistributedZkTest-1352378471569/control/data\
[junit4:junit4]   2> 1369 T992 oasc.JmxMonitoredMap.<init> JMX monitoring is enabled. Adding Solr mbeans to JMX Server: com.sun.jmx.mbeanserver.JmxMBeanServer@5e8d7d
[junit4:junit4]   2> 1369 T992 oasc.SolrCore.initDirectoryFactory solr.NRTCachingDirectoryFactory
[junit4:junit4]   2> 1370 T992 oasc.CachingDirectoryFactory.injectLockFactory WARNING No lockType configured for NRTCachingDirectory(org.apache.lucene.store.SimpleFSDirectory@C:\Users\JenkinsSlave\workspace\Lucene-Solr-trunk-Windows\solr\build\solr-core\test\J0\org.apache.solr.cloud.BasicDistributedZkTest-1352378471569\control\data lockFactory=org.apache.lucene.store.NativeFSLockFactory@1bdc112; maxCacheMB=48.0 maxMergeSizeMB=4.0) assuming 'simple'
[junit4:junit4]   2> 1370 T992 oasc.CachingDirectoryFactory.get return new directory for C:\Users\JenkinsSlave\workspace\Lucene-Solr-trunk-Windows\solr\build\solr-core\test\J0\.\org.apache.solr.cloud.BasicDistributedZkTest-1352378471569\control\data forceNew:false
[junit4:junit4]   2> 1371 T992 oasc.CachingDirectoryFactory.close Releasing directory:C:\Users\JenkinsSlave\workspace\Lucene-Solr-trunk-Windows\solr\build\solr-core\test\J0\.\org.apache.solr.cloud.BasicDistributedZkTest-1352378471569\control\data
[junit4:junit4]   2> 1371 T992 oasc.SolrCore.getNewIndexDir New index directory detected: old=null new=.\org.apache.solr.cloud.BasicDistributedZkTest-1352378471569/control/data\index/
[junit4:junit4]   2> 1372 T992 oasc.SolrCore.initIndex WARNING [collection1] Solr index directory '.\org.apache.solr.cloud.BasicDistributedZkTest-1352378471569\control\data\index' doesn't exist. Creating new index...
[junit4:junit4]   2> 1373 T992 oasc.CachingDirectoryFactory.get return new directory for C:\Users\JenkinsSlave\workspace\Lucene-Solr-trunk-Windows\solr\build\solr-core\test\J0\.\org.apache.solr.cloud.BasicDistributedZkTest-1352378471569\control\data\index forceNew:false
[junit4:junit4]   2> 1383 T992 oasc.SolrDeletionPolicy.onCommit SolrDeletionPolicy.onCommit: commits:num=1
[junit4:junit4]   2> 		commit{dir=NRTCachingDirectory(org.apache.lucene.store.SimpleFSDirectory@C:\Users\JenkinsSlave\workspace\Lucene-Solr-trunk-Windows\solr\build\solr-core\test\J0\org.apache.solr.cloud.BasicDistributedZkTest-1352378471569\control\data\index lockFactory=org.apache.lucene.store.NativeFSLockFactory@e0f294; maxCacheMB=48.0 maxMergeSizeMB=4.0),segFN=segments_1,generation=1,filenames=[segments_1]
[junit4:junit4]   2> 1383 T992 oasc.SolrDeletionPolicy.updateCommits newest commit = 1[segments_1]
[junit4:junit4]   2> 1385 T992 oasc.CachingDirectoryFactory.close Releasing directory:C:\Users\JenkinsSlave\workspace\Lucene-Solr-trunk-Windows\solr\build\solr-core\test\J0\.\org.apache.solr.cloud.BasicDistributedZkTest-1352378471569\control\data\index
[junit4:junit4]   2> 1385 T992 oasc.SolrCore.initWriters created xml: solr.XMLResponseWriter
[junit4:junit4]   2> 1385 T992 oasup.UpdateRequestProcessorChain.init inserting DistributedUpdateProcessorFactory into updateRequestProcessorChain "dedupe"
[junit4:junit4]   2> 1385 T992 oasup.UpdateRequestProcessorChain.init inserting DistributedUpdateProcessorFactory into updateRequestProcessorChain "dedupe-allfields"
[junit4:junit4]   2> 1386 T992 oasup.UpdateRequestProcessorChain.init inserting DistributedUpdateProcessorFactory into updateRequestProcessorChain "stored_sig"
[junit4:junit4]   2> 1386 T992 oasup.UpdateRequestProcessorChain.init inserting DistributedUpdateProcessorFactory into updateRequestProcessorChain "uniq-fields"
[junit4:junit4]   2> 1386 T992 oasup.UpdateRequestProcessorChain.init inserting DistributedUpdateProcessorFactory into updateRequestProcessorChain "distrib-dup-test-chain-implicit"
[junit4:junit4]   2> 1388 T992 oasc.RequestHandlers.initHandlersFromConfig adding lazy requestHandler: solr.ReplicationHandler
[junit4:junit4]   2> 1388 T992 oasc.RequestHandlers.initHandlersFromConfig created /replication: solr.ReplicationHandler
[junit4:junit4]   2> 1389 T992 oasc.RequestHandlers.initHandlersFromConfig created standard: solr.StandardRequestHandler
[junit4:junit4]   2> 1389 T992 oasc.RequestHandlers.initHandlersFromConfig created /get: solr.RealTimeGetHandler
[junit4:junit4]   2> 1389 T992 oasc.RequestHandlers.initHandlersFromConfig created dismax: solr.SearchHandler
[junit4:junit4]   2> 1391 T992 oasc.RequestHandlers.initHandlersFromConfig created mock: org.apache.solr.core.MockQuerySenderListenerReqHandler
[junit4:junit4]   2> 1391 T992 oasc.RequestHandlers.initHandlersFromConfig created /admin/: org.apache.solr.handler.admin.AdminHandlers
[junit4:junit4]   2> 1392 T992 oasc.RequestHandlers.initHandlersFromConfig created defaults: solr.StandardRequestHandler
[junit4:junit4]   2> 1392 T992 oasc.RequestHandlers.initHandlersFromConfig adding lazy requestHandler: solr.StandardRequestHandler
[junit4:junit4]   2> 1393 T992 oasc.RequestHandlers.initHandlersFromConfig created lazy: solr.StandardRequestHandler
[junit4:junit4]   2> 1393 T992 oasc.RequestHandlers.initHandlersFromConfig created /update: solr.UpdateRequestHandler
[junit4:junit4]   2> 1394 T992 oasc.RequestHandlers.initHandlersFromConfig created /terms: org.apache.solr.handler.component.SearchHandler
[junit4:junit4]   2> 1394 T992 oasc.RequestHandlers.initHandlersFromConfig created spellCheckCompRH: org.apache.solr.handler.component.SearchHandler
[junit4:junit4]   2> 1396 T992 oasc.RequestHandlers.initHandlersFromConfig created spellCheckCompRH_Direct: org.apache.solr.handler.component.SearchHandler
[junit4:junit4]   2> 1397 T992 oasc.RequestHandlers.initHandlersFromConfig created spellCheckWithWordbreak: org.apache.solr.handler.component.SearchHandler
[junit4:junit4]   2> 1397 T992 oasc.RequestHandlers.initHandlersFromConfig created spellCheckWithWordbreak_Direct: org.apache.solr.handler.component.SearchHandler
[junit4:junit4]   2> 1397 T992 oasc.RequestHandlers.initHandlersFromConfig created spellCheckCompRH1: org.apache.solr.handler.component.SearchHandler
[junit4:junit4]   2> 1399 T992 oasc.RequestHandlers.initHandlersFromConfig created tvrh: org.apache.solr.handler.component.SearchHandler
[junit4:junit4]   2> 1400 T992 oasc.RequestHandlers.initHandlersFromConfig created /mlt: solr.MoreLikeThisHandler
[junit4:junit4]   2> 1401 T992 oasc.RequestHandlers.initHandlersFromConfig created /debug/dump: solr.DumpRequestHandler
[junit4:junit4]   2> 1408 T992 oashl.XMLLoader.init xsltCacheLifetimeSeconds=60
[junit4:junit4]   2> 1421 T992 oasc.SolrCore.initDeprecatedSupport WARNING solrconfig.xml uses deprecated <admin/gettableFiles>, Please update your config to use the ShowFileRequestHandler.
[junit4:junit4]   2> 1422 T992 oasc.SolrCore.initDeprecatedSupport WARNING adding ShowFileRequestHandler with hidden files: [SCHEMA.XML, OLD_SYNONYMS.TXT, STOPWORDS.TXT, PROTWORDS.TXT, OPEN-EXCHANGE-RATES.JSON, SYNONYMS.TXT, CURRENCY.XML, MAPPING-ISOLATIN1ACCENT.TXT]
[junit4:junit4]   2> 1426 T992 oasc.CachingDirectoryFactory.close Releasing directory:C:\Users\JenkinsSlave\workspace\Lucene-Solr-trunk-Windows\solr\build\solr-core\test\J0\.\org.apache.solr.cloud.BasicDistributedZkTest-1352378471569\control\data
[junit4:junit4]   2> 1429 T992 oass.SolrIndexSearcher.<init> Opening Searcher@1675e68 main
[junit4:junit4]   2> 1430 T992 oasu.CommitTracker.<init> Hard AutoCommit: disabled
[junit4:junit4]   2> 1430 T992 oasu.CommitTracker.<init> Soft AutoCommit: disabled
[junit4:junit4]   2> 1431 T992 oashc.SpellCheckComponent.inform Initializing spell checkers
[junit4:junit4]   2> 1440 T992 oass.DirectSolrSpellChecker.init init: {name=direct,classname=DirectSolrSpellChecker,field=lowerfilt,minQueryLength=3}
[junit4:junit4]   2> 1491 T1015 oasc.SolrCore.registerSearcher [collection1] Registered new searcher Searcher@1675e68 main{StandardDirectoryReader(segments_1:1)}
[junit4:junit4]   2> 1494 T992 oasc.ZkController.publish numShards not found on descriptor - reading it from system property
[junit4:junit4]   2> 1495 T997 oazs.PrepRequestProcessor.pRequest Got user-level KeeperException when processing sessionid:0x13ae009d4990002 type:create cxid:0x56 zxid:0xfffffffffffffffe txntype:unknown reqpath:n/a Error Path:/solr/overseer/queue Error:KeeperErrorCode = NoNode for /solr/overseer/queue
[junit4:junit4]   2> 1499 T992 oasc.CoreContainer.registerCore registering core: collection1
[junit4:junit4]   2> 1499 T992 oasc.ZkController.register Register shard - core:collection1 address:http://127.0.0.1:59406/solr shardId:control_shard
[junit4:junit4]   2> 1499 T992 oascc.SolrZkClient.makePath makePath: /collections/control_collection/leader_elect/control_shard/election
[junit4:junit4]   2> 1508 T997 oazs.PrepRequestProcessor.pRequest Got user-level KeeperException when processing sessionid:0x13ae009d4990002 type:delete cxid:0x65 zxid:0xfffffffffffffffe txntype:unknown reqpath:n/a Error Path:/solr/collections/control_collection/leaders Error:KeeperErrorCode = NoNode for /solr/collections/control_collection/leaders
[junit4:junit4]   2> 1510 T992 oasc.ShardLeaderElectionContext.runLeaderProcess Running the leader process.
[junit4:junit4]   2> 1510 T997 oazs.PrepRequestProcessor.pRequest Got user-level KeeperException when processing sessionid:0x13ae009d4990002 type:create cxid:0x66 zxid:0xfffffffffffffffe txntype:unknown reqpath:n/a Error Path:/solr/overseer Error:KeeperErrorCode = NodeExists for /solr/overseer
[junit4:junit4]   2> 1902 T1013 oascc.ZkStateReader.updateClusterState Updating cloud state from ZooKeeper... 
[junit4:junit4]   2> 1903 T1013 oasc.Overseer$ClusterStateUpdater.updateState Update state numShards=null message={
[junit4:junit4]   2> 	  "operation":"state",
[junit4:junit4]   2> 	  "numShards":null,
[junit4:junit4]   2> 	  "shard":"control_shard",
[junit4:junit4]   2> 	  "roles":null,
[junit4:junit4]   2> 	  "state":"down",
[junit4:junit4]   2> 	  "core":"collection1",
[junit4:junit4]   2> 	  "collection":"control_collection",
[junit4:junit4]   2> 	  "node_name":"127.0.0.1:59406_solr",
[junit4:junit4]   2> 	  "base_url":"http://127.0.0.1:59406/solr"}
[junit4:junit4]   2> 1904 T997 oazs.PrepRequestProcessor.pRequest Got user-level KeeperException when processing sessionid:0x13ae009d4990002 type:create cxid:0x6d zxid:0xfffffffffffffffe txntype:unknown reqpath:n/a Error Path:/solr/overseer/queue-work Error:KeeperErrorCode = NoNode for /solr/overseer/queue-work
[junit4:junit4]   2> 1922 T1012 oascc.ZkStateReader$2.process A cluster state change has occurred - updating... (1)
[junit4:junit4]   2> 2333 T992 oasc.ShardLeaderElectionContext.waitForReplicasToComeUp Enough replicas found to continue.
[junit4:junit4]   2> 2333 T992 oasc.ShardLeaderElectionContext.runLeaderProcess I may be the new leader - try and sync
[junit4:junit4]   2> 2334 T992 oasc.SyncStrategy.sync Sync replicas to http://127.0.0.1:59406/solr/collection1/
[junit4:junit4]   2> 2334 T992 oasc.SyncStrategy.syncReplicas Sync Success - now sync replicas to me
[junit4:junit4]   2> 2334 T992 oasc.SyncStrategy.syncToMe http://127.0.0.1:59406/solr/collection1/ has no replicas
[junit4:junit4]   2> 2334 T992 oasc.ShardLeaderElectionContext.runLeaderProcess I am the new leader: http://127.0.0.1:59406/solr/collection1/
[junit4:junit4]   2> 2336 T992 oascc.SolrZkClient.makePath makePath: /collections/control_collection/leaders/control_shard
[junit4:junit4]   2> 2347 T997 oazs.PrepRequestProcessor.pRequest Got user-level KeeperException when processing sessionid:0x13ae009d4990002 type:create cxid:0x8f zxid:0xfffffffffffffffe txntype:unknown reqpath:n/a Error Path:/solr/overseer Error:KeeperErrorCode = NodeExists for /solr/overseer
[junit4:junit4]   2> 2759 T1013 oascc.ZkStateReader.updateClusterState Updating cloud state from ZooKeeper... 
[junit4:junit4]   2> 2768 T1012 oascc.ZkStateReader$2.process A cluster state change has occurred - updating... (1)
[junit4:junit4]   2> 2810 T992 oasc.ZkController.register We are http://127.0.0.1:59406/solr/collection1/ and leader is http://127.0.0.1:59406/solr/collection1/
[junit4:junit4]   2> 2810 T992 oasc.ZkController.register No LogReplay needed for core=collection1 baseURL=http://127.0.0.1:59406/solr
[junit4:junit4]   2> 2810 T992 oasc.ZkController.checkRecovery I am the leader, no recovery necessary
[junit4:junit4]   2> 2811 T992 oasc.ZkController.publish numShards not found on descriptor - reading it from system property
[junit4:junit4]   2> 2814 T992 oascc.ZkStateReader.updateClusterState Updating cloud state from ZooKeeper... 
[junit4:junit4]   2> 2817 T992 oass.SolrDispatchFilter.init user.dir=C:\Users\JenkinsSlave\workspace\Lucene-Solr-trunk-Windows\solr\build\solr-core\test\J0
[junit4:junit4]   2> 2817 T992 oass.SolrDispatchFilter.init SolrDispatchFilter.init() done
[junit4:junit4]   2> 2817 T992 oascsi.HttpClientUtil.createClient Creating new http client, config:maxConnections=128&maxConnectionsPerHost=32&followRedirects=false
[junit4:junit4]   2> 2826 T992 oascsi.HttpClientUtil.createClient Creating new http client, config:
[junit4:junit4]   2> 2831 T992 oaz.ZooKeeper.<init> Initiating client connection, connectString=127.0.0.1:59399/solr sessionTimeout=10000 watcher=org.apache.solr.common.cloud.ConnectionManager@a87b44
[junit4:junit4]   2> 2834 T1016 oaz.ClientCnxn$SendThread.startConnect Opening socket connection to server /127.0.0.1:59399
[junit4:junit4]   2> 2833 T992 oascc.ConnectionManager.waitForConnected Waiting for client to connect to ZooKeeper
[junit4:junit4]   2> 2841 T1016 oaz.ClientCnxn$SendThread.primeConnection Socket connection established to 127.0.0.1/127.0.0.1:59399, initiating session
[junit4:junit4]   2> 2842 T994 oazs.NIOServerCnxn$Factory.run Accepted socket connection from /127.0.0.1:59414
[junit4:junit4]   2> 2842 T994 oazs.NIOServerCnxn.readConnectRequest Client attempting to establish new session at /127.0.0.1:59414
[junit4:junit4]   2> 2843 T996 oazs.NIOServerCnxn.finishSessionInit Established session 0x13ae009d4990003 with negotiated timeout 10000 for client /127.0.0.1:59414
[junit4:junit4]   2> 2843 T1016 oaz.ClientCnxn$SendThread.readConnectResult Session establishment complete on server 127.0.0.1/127.0.0.1:59399, sessionid = 0x13ae009d4990003, negotiated timeout = 10000
[junit4:junit4]   2> 2843 T1017 oascc.ConnectionManager.process Watcher org.apache.solr.common.cloud.ConnectionManager@a87b44 name:ZooKeeperConnection Watcher:127.0.0.1:59399/solr got event WatchedEvent state:SyncConnected type:None path:null path:null type:None
[junit4:junit4]   2> 2843 T992 oascc.ConnectionManager.waitForConnected Client is connected to ZooKeeper
[junit4:junit4]   2> 2845 T992 oascc.ZkStateReader.createClusterStateWatchersAndUpdate Updating cluster state from ZooKeeper... 
[junit4:junit4]   2> 2846 T992 oasc.ChaosMonkey.monkeyLog monkey: init - expire sessions:true cause connection loss:true
[junit4:junit4]   2> 3106 T992 oejs.Server.doStart jetty-8.1.7.v20120910
[junit4:junit4]   2> 3109 T992 oejs.AbstractConnector.doStart Started SelectChannelConnector@0.0.0.0:59415
[junit4:junit4]   2> 3109 T992 oasc.SolrResourceLoader.locateSolrHome JNDI not configured for solr (NoInitialContextEx)
[junit4:junit4]   2> 3110 T992 oasc.SolrResourceLoader.locateSolrHome using system property solr.solr.home: C:\Users\JenkinsSlave\workspace\Lucene-Solr-trunk-Windows\solr\build\solr-core\test\J0\.\org.apache.solr.cloud.BasicDistributedZkTest-jetty1-1352378474407
[junit4:junit4]   2> 3110 T992 oasc.SolrResourceLoader.<init> new SolrResourceLoader for deduced Solr Home: 'C:\Users\JenkinsSlave\workspace\Lucene-Solr-trunk-Windows\solr\build\solr-core\test\J0\.\org.apache.solr.cloud.BasicDistributedZkTest-jetty1-1352378474407\'
[junit4:junit4]   2> 3136 T992 oass.SolrDispatchFilter.init SolrDispatchFilter.init()
[junit4:junit4]   2> 3137 T992 oasc.SolrResourceLoader.locateSolrHome JNDI not configured for solr (NoInitialContextEx)
[junit4:junit4]   2> 3137 T992 oasc.SolrResourceLoader.locateSolrHome using system property solr.solr.home: C:\Users\JenkinsSlave\workspace\Lucene-Solr-trunk-Windows\solr\build\solr-core\test\J0\.\org.apache.solr.cloud.BasicDistributedZkTest-jetty1-1352378474407
[junit4:junit4]   2> 3138 T992 oasc.CoreContainer$Initializer.initialize looking for solr.xml: C:\Users\JenkinsSlave\workspace\Lucene-Solr-trunk-Windows\solr\build\solr-core\test\J0\.\org.apache.solr.cloud.BasicDistributedZkTest-jetty1-1352378474407\solr.xml
[junit4:junit4]   2> 3138 T992 oasc.CoreContainer.<init> New CoreContainer 5753543
[junit4:junit4]   2> 3139 T992 oasc.CoreContainer.load Loading CoreContainer using Solr Home: 'C:\Users\JenkinsSlave\workspace\Lucene-Solr-trunk-Windows\solr\build\solr-core\test\J0\.\org.apache.solr.cloud.BasicDistributedZkTest-jetty1-1352378474407\'
[junit4:junit4]   2> 3139 T992 oasc.SolrResourceLoader.<init> new SolrResourceLoader for directory: 'C:\Users\JenkinsSlave\workspace\Lucene-Solr-trunk-Windows\solr\build\solr-core\test\J0\.\org.apache.solr.cloud.BasicDistributedZkTest-jetty1-1352378474407\'
[junit4:junit4]   2> 3160 T992 oasc.CoreContainer.load Registering Log Listener
[junit4:junit4]   2> 3175 T992 oasc.CoreContainer.initZooKeeper Zookeeper client=127.0.0.1:59399/solr
[junit4:junit4]   2> 3176 T992 oaz.ZooKeeper.<init> Initiating client connection, connectString=127.0.0.1:59399/solr sessionTimeout=5000 watcher=org.apache.solr.common.cloud.ConnectionManager@3d24f3
[junit4:junit4]   2> 3176 T1027 oaz.ClientCnxn$SendThread.startConnect Opening socket connection to server /127.0.0.1:59399
[junit4:junit4]   2> 3176 T992 oascc.ConnectionManager.waitForConnected Waiting for client to connect to ZooKeeper
[junit4:junit4]   2> 3179 T1027 oaz.ClientCnxn$SendThread.primeConnection Socket connection established to 127.0.0.1/127.0.0.1:59399, initiating session
[junit4:junit4]   2> 3179 T994 oazs.NIOServerCnxn$Factory.run Accepted socket connection from /127.0.0.1:59420
[junit4:junit4]   2> 3180 T994 oazs.NIOServerCnxn.readConnectRequest Client attempting to establish new session at /127.0.0.1:59420
[junit4:junit4]   2> 3191 T1027 oaz.ClientCnxn$SendThread.readConnectResult Session establishment complete on server 127.0.0.1/127.0.0.1:59399, sessionid = 0x13ae009d4990004, negotiated timeout = 5000
[junit4:junit4]   2> 3191 T996 oazs.NIOServerCnxn.finishSessionInit Established session 0x13ae009d4990004 with negotiated timeout 5000 for client /127.0.0.1:59420
[junit4:junit4]   2> 3192 T1028 oascc.ConnectionManager.process Watcher org.apache.solr.common.cloud.ConnectionManager@3d24f3 name:ZooKeeperConnection Watcher:127.0.0.1:59399/solr got event WatchedEvent state:SyncConnected type:None path:null path:null type:None
[junit4:junit4]   2> 3192 T992 oascc.ConnectionManager.waitForConnected Client is connected to ZooKeeper
[junit4:junit4]   2> 3194 T997 oazs.PrepRequestProcessor.pRequest Got user-level KeeperException when processing sessionid:0x13ae009d4990004 type:create cxid:0x1 zxid:0xfffffffffffffffe txntype:unknown reqpath:n/a Error Path:/solr/overseer Error:KeeperErrorCode = NodeExists for /solr/overseer
[junit4:junit4]   2> 3196 T1013 oascc.ZkStateReader.updateClusterState Updating cloud state from ZooKeeper... 
[junit4:junit4]   2> 3196 T1013 oasc.Overseer$ClusterStateUpdater.updateState Update state numShards=null message={
[junit4:junit4]   2> 	  "operation":"state",
[junit4:junit4]   2> 	  "numShards":null,
[junit4:junit4]   2> 	  "shard":"control_shard",
[junit4:junit4]   2> 	  "roles":null,
[junit4:junit4]   2> 	  "state":"active",
[junit4:junit4]   2> 	  "core":"collection1",
[junit4:junit4]   2> 	  "collection":"control_collection",
[junit4:junit4]   2> 	  "node_name":"127.0.0.1:59406_solr",
[junit4:junit4]   2> 	  "base_url":"http://127.0.0.1:59406/solr"}
[junit4:junit4]   2> 3197 T997 oazs.PrepRequestProcessor.pRequest Got user-level KeeperException when processing sessionid:0x13ae009d4990004 type:create cxid:0x2 zxid:0xfffffffffffffffe txntype:unknown reqpath:n/a Error Path:/solr/overseer Error:KeeperErrorCode = NodeExists for /solr/overseer
[junit4:junit4]   2> 3204 T992 oasc.ZkController.createEphemeralLiveNode Register node as live in ZooKeeper:/live_nodes/127.0.0.1:59415_solr
[junit4:junit4]   2> 3204 T997 oazs.PrepRequestProcessor.pRequest Got user-level KeeperException when processing sessionid:0x13ae009d4990004 type:delete cxid:0x4 zxid:0xfffffffffffffffe txntype:unknown reqpath:n/a Error Path:/solr/live_nodes/127.0.0.1:59415_solr Error:KeeperErrorCode = NoNode for /solr/live_nodes/127.0.0.1:59415_solr
[junit4:junit4]   2> 3207 T992 oascc.SolrZkClient.makePath makePath: /live_nodes/127.0.0.1:59415_solr
[junit4:junit4]   2> 3212 T1017 oascc.ZkStateReader$2.process A cluster state change has occurred - updating... (1)
[junit4:junit4]   2> 3212 T1012 oascc.ZkStateReader$2.process A cluster state change has occurred - updating... (1)
[junit4:junit4]   2> 3214 T992 oashc.HttpShardHandlerFactory.getParameter Setting socketTimeout to: 0
[junit4:junit4]   2> 3215 T992 oashc.HttpShardHandlerFactory.getParameter Setting urlScheme to: http://
[junit4:junit4]   2> 3216 T992 oashc.HttpShardHandlerFactory.getParameter Setting connTimeout to: 0
[junit4:junit4]   2> 3216 T992 oashc.HttpShardHandlerFactory.getParameter Setting maxConnectionsPerHost to: 20
[junit4:junit4]   2> 3216 T1017 oascc.ZkStateReader$3.process Updating live nodes... (2)
[junit4:junit4]   2> 3216 T992 oashc.HttpShardHandlerFactory.getParameter Setting corePoolSize to: 0
[junit4:junit4]   2> 3216 T992 oashc.HttpShardHandlerFactory.getParameter Setting maximumPoolSize to: 2147483647
[junit4:junit4]   2> 3216 T992 oashc.HttpShardHandlerFactory.getParameter Setting maxThreadIdleTime to: 5
[junit4:junit4]   2> 3217 T992 oashc.HttpShardHandlerFactory.getParameter Setting sizeOfQueue to: -1
[junit4:junit4]   2> 3217 T992 oashc.HttpShardHandlerFactory.getParameter Setting fairnessPolicy to: false
[junit4:junit4]   2> 3218 T992 oascsi.HttpClientUtil.createClient Creating new http client, config:maxConnectionsPerHost=20&maxConnections=10000&socketTimeout=0&connTimeout=0&retry=false
[junit4:junit4]   2> 3219 T1012 oascc.ZkStateReader$3.process Updating live nodes... (2)
[junit4:junit4]   2> 3219 T1012 oascc.ZkStateReader$2.process A cluster state change has occurred - updating... (2)
[junit4:junit4]   2> 3228 T992 oascc.ZkStateReader.createClusterStateWatchersAndUpdate Updating cluster state from ZooKeeper... 
[junit4:junit4]   2> 3235 T992 oasc.CoreContainer.create Creating SolrCore 'collection1' using instanceDir: C:\Users\JenkinsSlave\workspace\Lucene-Solr-trunk-Windows\solr\build\solr-core\test\J0\.\org.apache.solr.cloud.BasicDistributedZkTest-jetty1-1352378474407\collection1
[junit4:junit4]   2> 3235 T992 oasc.ZkController.createCollectionZkNode Check for collection zkNode:collection1
[junit4:junit4]   2> 3236 T992 oasc.ZkController.createCollectionZkNode Collection zkNode exists
[junit4:junit4]   2> 3236 T992 oasc.ZkController.readConfigName Load collection config from:/collections/collection1
[junit4:junit4]   2> 3238 T992 oasc.SolrResourceLoader.<init> new SolrResourceLoader for directory: 'C:\Users\JenkinsSlave\workspace\Lucene-Solr-trunk-Windows\solr\build\solr-core\test\J0\.\org.apache.solr.cloud.BasicDistributedZkTest-jetty1-1352378474407\collection1\'
[junit4:junit4]   2> 3240 T992 oasc.SolrResourceLoader.replaceClassLoader Adding 'file:/C:/Users/JenkinsSlave/workspace/Lucene-Solr-trunk-Windows/solr/build/solr-core/test/J0/org.apache.solr.cloud.BasicDistributedZkTest-jetty1-1352378474407/collection1/lib/classes/' to classloader
[junit4:junit4]   2> 3240 T992 oasc.SolrResourceLoader.replaceClassLoader Adding 'file:/C:/Users/JenkinsSlave/workspace/Lucene-Solr-trunk-Windows/solr/build/solr-core/test/J0/org.apache.solr.cloud.BasicDistributedZkTest-jetty1-1352378474407/collection1/lib/README' to classloader
[junit4:junit4]   2> 3285 T992 oasc.SolrConfig.<init> Using Lucene MatchVersion: LUCENE_50
[junit4:junit4]   2> 3350 T992 oasc.SolrConfig.<init> Loaded SolrConfig: solrconfig.xml
[junit4:junit4]   2> 3351 T992 oass.IndexSchema.readSchema Reading Solr Schema
[junit4:junit4]   2> 3355 T992 oass.IndexSchema.readSchema Schema name=test
[junit4:junit4]   2> 3953 T992 oass.OpenExchangeRatesOrgProvider.init Initialized with rates=open-exchange-rates.json, refreshInterval=1440.
[junit4:junit4]   2> 3961 T992 oass.IndexSchema.readSchema default search field in schema is text
[junit4:junit4]   2> 3965 T992 oass.IndexSchema.readSchema unique key field: id
[junit4:junit4]   2> 3994 T992 oass.FileExchangeRateProvider.reload Reloading exchange rates from file currency.xml
[junit4:junit4]   2> 3999 T992 oass.FileExchangeRateProvider.reload Reloading exchange rates from file currency.xml
[junit4:junit4]   2> 4003 T992 oass.OpenExchangeRatesOrgProvider.reload Reloading exchange rates from open-exchange-rates.json
[junit4:junit4]   2> 4005 T992 oass.OpenExchangeRatesOrgProvider.reload Reloading exchange rates from open-exchange-rates.json
[junit4:junit4]   2> 4006 T992 oasc.SolrCore.<init> [collection1] Opening new SolrCore at C:\Users\JenkinsSlave\workspace\Lucene-Solr-trunk-Windows\solr\build\solr-core\test\J0\.\org.apache.solr.cloud.BasicDistributedZkTest-jetty1-1352378474407\collection1\, dataDir=.\org.apache.solr.cloud.BasicDistributedZkTest-1352378471569/jetty1\
[junit4:junit4]   2> 4006 T992 oasc.JmxMonitoredMap.<init> JMX monitoring is enabled. Adding Solr mbeans to JMX Server: com.sun.jmx.mbeanserver.JmxMBeanServer@5e8d7d
[junit4:junit4]   2> 4007 T992 oasc.SolrCore.initDirectoryFactory solr.NRTCachingDirectoryFactory
[junit4:junit4]   2> 4008 T992 oasc.CachingDirectoryFactory.injectLockFactory WARNING No lockType configured for NRTCachingDirectory(org.apache.lucene.store.SimpleFSDirectory@C:\Users\JenkinsSlave\workspace\Lucene-Solr-trunk-Windows\solr\build\solr-core\test\J0\org.apache.solr.cloud.BasicDistributedZkTest-1352378471569\jetty1 lockFactory=org.apache.lucene.store.NativeFSLockFactory@12f6fbb; maxCacheMB=48.0 maxMergeSizeMB=4.0) assuming 'simple'
[junit4:junit4]   2> 4009 T992 oasc.CachingDirectoryFactory.get return new directory for C:\Users\JenkinsSlave\workspace\Lucene-Solr-trunk-Windows\solr\build\solr-core\test\J0\.\org.apache.solr.cloud.BasicDistributedZkTest-1352378471569\jetty1 forceNew:false
[junit4:junit4]   2> 4009 T992 oasc.CachingDirectoryFactory.close Releasing directory:C:\Users\JenkinsSlave\workspace\Lucene-Solr-trunk-Windows\solr\build\solr-core\test\J0\.\org.apache.solr.cloud.BasicDistributedZkTest-1352378471569\jetty1
[junit4:junit4]   2> 4010 T992 oasc.SolrCore.getNewIndexDir New index directory detected: old=null new=.\org.apache.solr.cloud.BasicDistributedZkTest-1352378471569/jetty1\index/
[junit4:junit4]   2> 4010 T992 oasc.SolrCore.initIndex WARNING [collection1] Solr index directory '.\org.apache.solr.cloud.BasicDistributedZkTest-1352378471569\jetty1\index' doesn't exist. Creating new index...
[junit4:junit4]   2> 4011 T992 oasc.CachingDirectoryFactory.get return new directory for C:\Users\JenkinsSlave\workspace\Lucene-Solr-trunk-Windows\solr\build\solr-core\test\J0\.\org.apache.solr.cloud.BasicDistributedZkTest-1352378471569\jetty1\index forceNew:false
[junit4:junit4]   2> 4022 T992 oasc.SolrDeletionPolicy.onCommit SolrDeletionPolicy.onCommit: commits:num=1
[junit4:junit4]   2> 		commit{dir=NRTCachingDirectory(org.apache.lucene.store.SimpleFSDirectory@C:\Users\JenkinsSlave\workspace\Lucene-Solr-trunk-Windows\solr\build\solr-core\test\J0\org.apache.solr.cloud.BasicDistributedZkTest-1352378471569\jetty1\index lockFactory=org.apache.lucene.store.NativeFSLockFactory@9c7caa; maxCacheMB=48.0 maxMergeSizeMB=4.0),segFN=segments_1,generation=1,filenames=[segments_1]
[junit4:junit4]   2> 4022 T992 oasc.SolrDeletionPolicy.updateCommits newest commit = 1[segments_1]
[junit4:junit4]   2> 4024 T992 oasc.CachingDirectoryFactory.close Releasing directory:C:\Users\JenkinsSlave\workspace\Lucene-Solr-trunk-Windows\solr\build\solr-core\test\J0\.\org.apache.solr.cloud.BasicDistributedZkTest-1352378471569\jetty1\index
[junit4:junit4]   2> 4025 T992 oasc.SolrCore.initWriters created xml: solr.XMLResponseWriter
[junit4:junit4]   2> 4026 T992 oasup.UpdateRequestProcessorChain.init inserting DistributedUpdateProcessorFactory into updateRequestProcessorChain "dedupe"
[junit4:junit4]   2> 4026 T992 oasup.UpdateRequestProcessorChain.init inserting DistributedUpdateProcessorFactory into updateRequestProcessorChain "dedupe-allfields"
[junit4:junit4]   2> 4027 T992 oasup.UpdateRequestProcessorChain.init inserting DistributedUpdateProcessorFactory into updateRequestProcessorChain "stored_sig"
[junit4:junit4]   2> 4027 T992 oasup.UpdateRequestProcessorChain.init inserting DistributedUpdateProcessorFactory into updateRequestProcessorChain "uniq-fields"
[junit4:junit4]   2> 4028 T992 oasup.UpdateRequestProcessorChain.init inserting DistributedUpdateProcessorFactory into updateRequestProcessorChain "distrib-dup-test-chain-implicit"
[junit4:junit4]   2> 4029 T992 oasc.RequestHandlers.initHandlersFromConfig adding lazy requestHandler: solr.ReplicationHandler
[junit4:junit4]   2> 4029 T992 oasc.RequestHandlers.initHandlersFromConfig created /replication: solr.ReplicationHandler
[junit4:junit4]   2> 4030 T992 oasc.RequestHandlers.initHandlersFromConfig created standard: solr.StandardRequestHandler
[junit4:junit4]   2> 4030 T992 oasc.RequestHandlers.initHandlersFromConfig created /get: solr.RealTimeGetHandler
[junit4:junit4]   2> 4031 T992 oasc.RequestHandlers.initHandlersFromConfig created dismax: solr.SearchHandler
[junit4:junit4]   2> 4036 T992 oasc.RequestHandlers.initHandlersFromConfig created mock: org.apache.solr.core.MockQuerySenderListenerReqHandler
[junit4:junit4]   2> 4036 T992 oasc.RequestHandlers.initHandlersFromConfig created /admin/: org.apache.solr.handler.admin.AdminHandlers
[junit4:junit4]   2> 4038 T992 oasc.RequestHandlers.initHandlersFromConfig created defaults: solr.StandardRequestHandler
[junit4:junit4]   2> 4038 T992 oasc.RequestHandlers.initHandlersFromConfig adding lazy requestHandler: solr.StandardRequestHandler
[junit4:junit4]   2> 4038 T992 oasc.RequestHandlers.initHandlersFromConfig created lazy: solr.StandardRequestHandler
[junit4:junit4]   2> 4039 T992 oasc.RequestHandlers.initHandlersFromConfig created /update: solr.UpdateRequestHandler
[junit4:junit4]   2> 4040 T992 oasc.RequestHandlers.initHandlersFromConfig created /terms: org.apache.solr.handler.component.SearchHandler
[junit4:junit4]   2> 4040 T992 oasc.RequestHandlers.initHandlersFromConfig created spellCheckCompRH: org.apache.solr.handler.component.SearchHandler
[junit4:junit4]   2> 4042 T992 oasc.RequestHandlers.initHandlersFromConfig created spellCheckCompRH_Direct: org.apache.solr.handler.component.SearchHandler
[junit4:junit4]   2> 4042 T992 oasc.RequestHandlers.initHandlersFromConfig created spellCheckWithWordbreak: org.apache.solr.handler.component.SearchHandler
[junit4:junit4]   2> 4043 T992 oasc.RequestHandlers.initHandlersFromConfig created spellCheckWithWordbreak_Direct: org.apache.solr.handler.component.SearchHandler
[junit4:junit4]   2> 4044 T992 oasc.RequestHandlers.initHandlersFromConfig created spellCheckCompRH1: org.apache.solr.handler.component.SearchHandler
[junit4:junit4]   2> 4044 T992 oasc.RequestHandlers.initHandlersFromConfig created tvrh: org.apache.solr.handler.component.SearchHandler
[junit4:junit4]   2> 4045 T992 oasc.RequestHandlers.initHandlersFromConfig created /mlt: solr.MoreLikeThisHandler
[junit4:junit4]   2> 4045 T992 oasc.RequestHandlers.initHandlersFromConfig created /debug/dump: solr.DumpRequestHandler
[junit4:junit4]   2> 4051 T992 oashl.XMLLoader.init xsltCacheLifetimeSeconds=60
[junit4:junit4]   2> 4055 T992 oasc.SolrCore.initDeprecatedSupport WARNING solrconfig.xml uses deprecated <admin/gettableFiles>, Please update your config to use the ShowFileRequestHandler.
[junit4:junit4]   2> 4057 T992 oasc.SolrCore.initDeprecatedSupport WARNING adding ShowFileRequestHandler with hidden files: [SCHEMA.XML, OLD_SYNONYMS.TXT, STOPWORDS.TXT, PROTWORDS.TXT, OPEN-EXCHANGE-RATES.JSON, SYNONYMS.TXT, CURRENCY.XML, MAPPING-ISOLATIN1ACCENT.TXT]
[junit4:junit4]   2> 4059 T992 oasc.CachingDirectoryFactory.close Releasing directory:C:\Users\JenkinsSlave\workspace\Lucene-Solr-trunk-Windows\solr\build\solr-core\test\J0\.\org.apache.solr.cloud.BasicDistributedZkTest-1352378471569\jetty1
[junit4:junit4]   2> 4061 T992 oass.SolrIndexSearcher.<init> Opening Searcher@194d4d4 main
[junit4:junit4]   2> 4063 T992 oasu.CommitTracker.<init> Hard AutoCommit: disabled
[junit4:junit4]   2> 4063 T992 oasu.CommitTracker.<init> Soft AutoCommit: disabled
[junit4:junit4]   2> 4063 T992 oashc.SpellCheckComponent.inform Initializing spell checkers
[junit4:junit4]   2> 4072 T992 oass.DirectSolrSpellChecker.init init: {name=direct,classname=DirectSolrSpellChecker,field=lowerfilt,minQueryLength=3}
[junit4:junit4]   2> 4145 T1029 oasc.SolrCore.registerSearcher [collection1] Registered new searcher Searcher@194d4d4 main{StandardDirectoryReader(segments_1:1)}
[junit4:junit4]   2> 4147 T992 oasc.ZkController.publish numShards not found on descriptor - reading it from system property
[junit4:junit4]   2> 4494 T1013 oascc.ZkStateReader.updateClusterState Updating cloud state from ZooKeeper... 
[junit4:junit4]   2> 4495 T1013 oasc.Overseer$ClusterStateUpdater.updateState Update state numShards=2 message={
[junit4:junit4]   2> 	  "operation":"state",
[junit4:junit4]   2> 	  "numShards":"2",
[junit4:junit4]   2> 	  "shard":null,
[junit4:junit4]   2> 	  "roles":null,
[junit4:junit4]   2> 	  "state":"down",
[junit4:junit4]   2> 	  "core":"collection1",
[junit4:junit4]   2> 	  "collection":"collection1",
[junit4:junit4]   2> 	  "node_name":"127.0.0.1:59415_solr",
[junit4:junit4]   2> 	  "base_url":"http://127.0.0.1:59415/solr"}
[junit4:junit4]   2> 4495 T1013 oasc.Overseer$ClusterStateUpdater.createCollection Create collection collection1 with numShards 2
[junit4:junit4]   2> 4503 T1012 oascc.ZkStateReader$2.process A cluster state change has occurred - updating... (2)
[junit4:junit4]   2> 4504 T1028 oascc.ZkStateReader$2.process A cluster state change has occurred - updating... (2)
[junit4:junit4]   2> 4504 T1017 oascc.ZkStateReader$2.process A cluster state change has occurred - updating... (2)
[junit4:junit4]   2> 4560 T992 oasc.CoreContainer.registerCore registering core: collection1
[junit4:junit4]   2> 4560 T992 oasc.ZkController.register Register shard - core:collection1 address:http://127.0.0.1:59415/solr shardId:shard1
[junit4:junit4]   2> 4561 T992 oascc.SolrZkClient.makePath makePath: /collections/collection1/leader_elect/shard1/election
[junit4:junit4]   2> 4573 T997 oazs.PrepRequestProcessor.pRequest Got user-level KeeperException when processing sessionid:0x13ae009d4990004 type:delete cxid:0x43 zxid:0xfffffffffffffffe txntype:unknown reqpath:n/a Error Path:/solr/collections/collection1/leaders Error:KeeperErrorCode = NoNode for /solr/collections/collection1/leaders
[junit4:junit4]   2> 4574 T992 oasc.ShardLeaderElectionContext.runLeaderProcess Running the leader process.
[junit4:junit4]   2> 4575 T997 oazs.PrepRequestProcessor.pRequest Got user-level KeeperException when processing sessionid:0x13ae009d4990004 type:create cxid:0x44 zxid:0xfffffffffffffffe txntype:unknown reqpath:n/a Error Path:/solr/overseer Error:KeeperErrorCode = NodeExists for /solr/overseer
[junit4:junit4]   2> 4579 T992 oasc.ShardLeaderElectionContext.waitForReplicasToComeUp Enough replicas found to continue.
[junit4:junit4]   2> 4579 T992 oasc.ShardLeaderElectionContext.runLeaderProcess I may be the new leader - try and sync
[junit4:junit4]   2> 4580 T992 oasc.SyncStrategy.sync Sync replicas to http://127.0.0.1:59415/solr/collection1/
[junit4:junit4]   2> 4580 T992 oasc.SyncStrategy.syncReplicas Sync Success - now sync replicas to me
[junit4:junit4]   2> 4581 T992 oasc.SyncStrategy.syncToMe http://127.0.0.1:59415/solr/collection1/ has no replicas
[junit4:junit4]   2> 4581 T992 oasc.ShardLeaderElectionContext.runLeaderProcess I am the new leader: http://127.0.0.1:59415/solr/collection1/
[junit4:junit4]   2> 4581 T992 oascc.SolrZkClient.makePath makePath: /collections/collection1/leaders/shard1
[junit4:junit4]   2> 4589 T997 oazs.PrepRequestProcessor.pRequest Got user-level KeeperException when processing sessionid:0x13ae009d4990004 type:create cxid:0x4e zxid:0xfffffffffffffffe txntype:unknown reqpath:n/a Error Path:/solr/overseer Error:KeeperErrorCode = NodeExists for /solr/overseer
[junit4:junit4]   2> 4921 T1013 oascc.ZkStateReader.updateClusterState Updating cloud state from ZooKeeper... 
[junit4:junit4]   2> 4934 T1012 oascc.ZkStateReader$2.process A cluster state change has occurred - updating... (2)
[junit4:junit4]   2> 4934 T1028 oascc.ZkStateReader$2.process A cluster state change has occurred - updating... (2)
[junit4:junit4]   2> 4934 T1017 oascc.ZkStateReader$2.process A cluster state change has occurred - updating... (2)
[junit4:junit4]   2> 4967 T992 oasc.ZkController.register We are http://127.0.0.1:59415/solr/collection1/ and leader is http://127.0.0.1:59415/solr/collection1/
[junit4:junit4]   2> 4969 T992 oasc.ZkController.register No LogReplay needed for core=collection1 baseURL=http://127.0.0.1:59415/solr
[junit4:junit4]   2> 4969 T992 oasc.ZkController.checkRecovery I am the leader, no recovery necessary
[junit4:junit4]   2> 4969 T992 oasc.ZkController.publish numShards not found on descriptor - reading it from system property
[junit4:junit4]   2> 4971 T992 oascc.ZkStateReader.updateClusterState Updating cloud state from ZooKeeper... 
[junit4:junit4]   2> 4972 T992 oass.SolrDispatchFilter.init user.dir=C:\Users\JenkinsSlave\workspace\Lucene-Solr-trunk-Windows\solr\build\solr-core\test\J0
[junit4:junit4]   2> 4972 T992 oass.SolrDispatchFilter.init SolrDispatchFilter.init() done
[junit4:junit4]   2> 4972 T992 oascsi.HttpClientUtil.createClient Creating new http client, config:maxConnections=128&maxConnectionsPerHost=32&followRedirects=false
[junit4:junit4]   2> 5275 T992 oejs.Server.doStart jetty-8.1.7.v20120910
[junit4:junit4]   2> 5278 T992 oejs.AbstractConnector.doStart Started SelectChannelConnector@0.0.0.0:59421
[junit4:junit4]   2> 5278 T992 oasc.SolrResourceLoader.locateSolrHome JNDI not configured for solr (NoInitialContextEx)
[junit4:junit4]   2> 5278 T992 oasc.SolrResourceLoader.locateSolrHome using system property solr.solr.home: C:\Users\JenkinsSlave\workspace\Lucene-Solr-trunk-Windows\solr\build\solr-core\test\J0\.\org.apache.solr.cloud.BasicDistributedZkTest-jetty2-1352378476542
[junit4:junit4]   2> 5279 T992 oasc.SolrResourceLoader.<init> new SolrResourceLoader for deduced Solr Home: 'C:\Users\JenkinsSlave\workspace\Lucene-Solr-trunk-Windows\solr\build\solr-core\test\J0\.\org.apache.solr.cloud.BasicDistributedZkTest-jetty2-1352378476542\'
[junit4:junit4]   2> 5306 T992 oass.SolrDispatchFilter.init SolrDispatchFilter.init()
[junit4:junit4]   2> 5306 T992 oasc.SolrResourceLoader.locateSolrHome JNDI not configured for solr (NoInitialContextEx)
[junit4:junit4]   2> 5306 T992 oasc.SolrResourceLoader.locateSolrHome using system property solr.solr.home: C:\Users\JenkinsSlave\workspace\Lucene-Solr-trunk-Windows\solr\build\solr-core\test\J0\.\org.apache.solr.cloud.BasicDistributedZkTest-jetty2-1352378476542
[junit4:junit4]   2> 5306 T992 oasc.CoreContainer$Initializer.initialize looking for solr.xml: C:\Users\JenkinsSlave\workspace\Lucene-Solr-trunk-Windows\solr\build\solr-core\test\J0\.\org.apache.solr.cloud.BasicDistributedZkTest-jetty2-1352378476542\solr.xml
[junit4:junit4]   2> 5306 T992 oasc.CoreContainer.<init> New CoreContainer 11421180
[junit4:junit4]   2> 5307 T992 oasc.CoreContainer.load Loading CoreContainer using Solr Home: 'C:\Users\JenkinsSlave\workspace\Lucene-Solr-trunk-Windows\solr\build\solr-core\test\J0\.\org.apache.solr.cloud.BasicDistributedZkTest-jetty2-1352378476542\'
[junit4:junit4]   2> 5307 T992 oasc.SolrResourceLoader.<init> new SolrResourceLoader for directory: 'C:\Users\JenkinsSlave\workspace\Lucene-Solr-trunk-Windows\solr\build\solr-core\test\J0\.\org.apache.solr.cloud.BasicDistributedZkTest-jetty2-1352378476542\'
[junit4:junit4]   2> 5332 T992 oasc.CoreContainer.load Registering Log Listener
[junit4:junit4]   2> 5347 T992 oasc.CoreContainer.initZooKeeper Zookeeper client=127.0.0.1:59399/solr
[junit4:junit4]   2> 5347 T992 oaz.ZooKeeper.<init> Initiating client connection, connectString=127.0.0.1:59399/solr sessionTimeout=5000 watcher=org.apache.solr.common.cloud.ConnectionManager@d91d34
[junit4:junit4]   2> 5349 T1039 oaz.ClientCnxn$SendThread.startConnect Opening socket connection to server /127.0.0.1:59399
[junit4:junit4]   2> 5349 T992 oascc.ConnectionManager.waitForConnected Waiting for client to connect to ZooKeeper
[junit4:junit4]   2> 5351 T1039 oaz.ClientCnxn$SendThread.primeConnection Socket connection established to 127.0.0.1/127.0.0.1:59399, initiating session
[junit4:junit4]   2> 5351 T994 oazs.NIOServerCnxn$Factory.run Accepted socket connection from /127.0.0.1:59426
[junit4:junit4]   2> 5351 T994 oazs.NIOServerCnxn.readConnectRequest Client attempting to establish new session at /127.0.0.1:59426
[junit4:junit4]   2> 5359 T996 oazs.NIOServerCnxn.finishSessionInit Established session 0x13ae009d4990005 with negotiated timeout 5000 for client /127.0.0.1:59426
[junit4:junit4]   2> 5359 T1039 oaz.ClientCnxn$SendThread.readConnectResult Session establishment complete on server 127.0.0.1/127.0.0.1:59399, sessionid = 0x13ae009d4990005, negotiated timeout = 5000
[junit4:junit4]   2> 5359 T1040 oascc.ConnectionManager.process Watcher org.apache.solr.common.cloud.ConnectionManager@d91d34 name:ZooKeeperConnection Watcher:127.0.0.1:59399/solr got event WatchedEvent state:SyncConnected type:None path:null path:null type:None
[junit4:junit4]   2> 5360 T992 oascc.ConnectionManager.waitForConnected Client is connected to ZooKeeper
[junit4:junit4]   2> 5361 T997 oazs.PrepRequestProcessor.pRequest Got user-level KeeperException when processing sessionid:0x13ae009d4990005 type:create cxid:0x1 zxid:0xfffffffffffffffe txntype:unknown reqpath:n/a Error Path:/solr/overseer Error:KeeperErrorCode = NodeExists for /solr/overseer
[junit4:junit4]   2> 5363 T1013 oascc.ZkStateReader.updateClusterState Updating cloud state from ZooKeeper... 
[junit4:junit4]   2> 5363 T997 oazs.PrepRequestProcessor.pRequest Got user-level KeeperException when processing sessionid:0x13ae009d4990005 type:create cxid:0x2 zxid:0xfffffffffffffffe txntype:unknown reqpath:n/a Error Path:/solr/overseer Error:KeeperErrorCode = NodeExists for /solr/overseer
[junit4:junit4]   2> 5365 T1013 oasc.Overseer$ClusterStateUpdater.updateState Update state numShards=2 message={
[junit4:junit4]   2> 	  "operation":"state",
[junit4:junit4]   2> 	  "numShards":"2",
[junit4:junit4]   2> 	  "shard":"shard1",
[junit4:junit4]   2> 	  "roles":null,
[junit4:junit4]   2> 	  "state":"active",
[junit4:junit4]   2> 	  "core":"collection1",
[junit4:junit4]   2> 	  "collection":"collection1",
[junit4:junit4]   2> 	  "node_name":"127.0.0.1:59415_solr",
[junit4:junit4]   2> 	  "base_url":"http://127.0.0.1:59415/solr"}
[junit4:junit4]   2> 5365 T992 oasc.ZkController.createEphemeralLiveNode Register node as live in ZooKeeper:/live_nodes/127.0.0.1:59421_solr
[junit4:junit4]   2> 5366 T997 oazs.PrepRequestProcessor.pRequest Got user-level KeeperException when processing sessionid:0x13ae009d4990005 type:delete cxid:0x4 zxid:0xfffffffffffffffe txntype:unknown reqpath:n/a Error Path:/solr/live_nodes/127.0.0.1:59421_solr Error:KeeperErrorCode = NoNode for /solr/live_nodes/127.0.0.1:59421_solr
[junit4:junit4]   2> 5367 T992 oascc.SolrZkClient.makePath makePath: /live_nodes/127.0.0.1:59421_solr
[junit4:junit4]   2> 5371 T1017 oascc.ZkStateReader$2.process A cluster state change has occurred - updating... (2)
[junit4:junit4]   2> 5371 T1028 oascc.ZkStateReader$2.process A cluster state change has occurred - updating... (2)
[junit4:junit4]   2> 5374 T992 oashc.HttpShardHandlerFactory.getParameter Setting socketTimeout to: 0
[junit4:junit4]   2> 5375 T992 oashc.HttpShardHandlerFactory.getParameter Setting urlScheme to: http://
[junit4:junit4]   2> 5375 T992 oashc.HttpShardHandlerFactory.getParameter Setting connTimeout to: 0
[junit4:junit4]   2> 5375 T992 oashc.HttpShardHandlerFactory.getParameter Setting maxConnectionsPerHost to: 20
[junit4:junit4]   2> 5375 T1028 oascc.ZkStateReader$3.process Updating live nodes... (3)
[junit4:junit4]   2> 5375 T992 oashc.HttpShardHandlerFactory.getParameter Setting corePoolSize to: 0
[junit4:junit4]   2> 5375 T1017 oascc.ZkStateReader$3.process Updating live nodes... (3)
[junit4:junit4]   2> 5375 T992 oashc.HttpShardHandlerFactory.getParameter Setting maximumPoolSize to: 2147483647
[junit4:junit4]   2> 5376 T992 oashc.HttpShardHandlerFactory.getParameter Setting maxThreadIdleTime to: 5
[junit4:junit4]   2> 5375 T1028 oascc.ZkStateReader$2.process A cluster state change has occurred - updating... (3)
[junit4:junit4]   2> 5376 T992 oashc.HttpShardHandlerFactory.getParameter Setting sizeOfQueue to: -1
[junit4:junit4]   2> 5376 T1017 oascc.ZkStateReader$2.process A cluster state change has occurred - updating... (3)
[junit4:junit4]   2> 5377 T992 oashc.HttpShardHandlerFactory.getParameter Setting fairnessPolicy to: false
[junit4:junit4]   2> 5377 T992 oascsi.HttpClientUtil.createClient Creating new http client, config:maxConnectionsPerHost=20&maxConnections=10000&socketTimeout=0&connTimeout=0&retry=false
[junit4:junit4]   2> 5379 T1012 oascc.ZkStateReader$3.process Updating live nodes... (3)
[junit4:junit4]   2> 5380 T1012 oascc.ZkStateReader$2.process A cluster state change has occurred - updating... (3)
[junit4:junit4]   2> 5381 T1012 oascc.ZkStateReader$2.process A cluster state change has occurred - updating... (3)
[junit4:junit4]   2> 5388 T992 oascc.ZkStateReader.createClusterStateWatchersAndUpdate Updating cluster state from ZooKeeper... 
[junit4:junit4]   2> 5395 T992 oasc.CoreContainer.create Creating SolrCore 'collection1' using instanceDir: C:\Users\JenkinsSlave\workspace\Lucene-Solr-trunk-Windows\solr\build\solr-core\test\J0\.\org.apache.solr.cloud.BasicDistributedZkTest-jetty2-1352378476542\collection1
[junit4:junit4]   2> 5395 T992 oasc.ZkController.createCollectionZkNode Check for collection zkNode:collection1
[junit4:junit4]   2> 5396 T992 oasc.ZkController.createCollectionZkNode Collection zkNode exists
[junit4:junit4]   2> 5396 T992 oasc.ZkController.readConfigName Load collection config from:/collections/collection1
[junit4:junit4]   2> 5399 T992 oasc.SolrResourceLoader.<init> new SolrResourceLoader for directory: 'C:\Users\JenkinsSlave\workspace\Lucene-Solr-trunk-Windows\solr\build\solr-core\test\J0\.\org.apache.solr.cloud.BasicDistributedZkTest-jetty2-1352378476542\collection1\'
[junit4:junit4]   2> 5400 T992 oasc.SolrResourceLoader.replaceClassLoader Adding 'file:/C:/Users/JenkinsSlave/workspace/Lucene-Solr-trunk-Windows/solr/build/solr-core/test/J0/org.apache.solr.cloud.BasicDistributedZkTest-jetty2-1352378476542/collection1/lib/classes/' to classloader
[junit4:junit4]   2> 5401 T992 oasc.SolrResourceLoader.replaceClassLoader Adding 'file:/C:/Users/JenkinsSlave/workspace/Lucene-Solr-trunk-Windows/solr/build/solr-core/test/J0/org.apache.solr.cloud.BasicDistributedZkTest-jetty2-1352378476542/collection1/lib/README' to classloader
[junit4:junit4]   2> 5448 T992 oasc.SolrConfig.<init> Using Lucene MatchVersion: LUCENE_50
[junit4:junit4]   2> 5521 T992 oasc.SolrConfig.<init> Loaded SolrConfig: solrconfig.xml
[junit4:junit4]   2> 5523 T992 oass.IndexSchema.readSchema Reading Solr Schema
[junit4:junit4]   2> 5526 T992 oass.IndexSchema.readSchema Schema name=test
[junit4:junit4]   2> 6091 T992 oass.OpenExchangeRatesOrgProvider.init Initialized with rates=open-exchange-rates.json, refreshInterval=1440.
[junit4:junit4]   2> 6102 T992 oass.IndexSchema.readSchema default search field in schema is text
[junit4:junit4]   2> 6106 T992 oass.IndexSchema.readSchema unique key field: id
[junit4:junit4]   2> 6124 T992 oass.FileExchangeRateProvider.reload Reloading exchange rates from file currency.xml
[junit4:junit4]   2> 6129 T992 oass.FileExchangeRateProvider.reload Reloading exchange rates from file currency.xml
[junit4:junit4]   2> 6135 T992 oass.OpenExchangeRatesOrgProvider.reload Reloading exchange rates from open-exchange-rates.json
[junit4:junit4]   2> 6137 T992 oass.OpenExchangeRatesOrgProvider.reload Reloading exchange rates from open-exchange-rates.json
[junit4:junit4]   2> 6139 T992 oasc.SolrCore.<init> [collection1] Opening new SolrCore at C:\Users\JenkinsSlave\workspace\Lucene-Solr-trunk-Windows\solr\build\solr-core\test\J0\.\org.apache.solr.cloud.BasicDistributedZkTest-jetty2-1352378476542\collection1\, dataDir=.\org.apache.solr.cloud.BasicDistributedZkTest-1352378471569/jetty2\
[junit4:junit4]   2> 6139 T992 oasc.JmxMonitoredMap.<init> JMX monitoring is enabled. Adding Solr mbeans to JMX Server: com.sun.jmx.mbeanserver.JmxMBeanServer@5e8d7d
[junit4:junit4]   2> 6140 T992 oasc.SolrCore.initDirectoryFactory solr.NRTCachingDirectoryFactory
[junit4:junit4]   2> 6141 T992 oasc.CachingDirectoryFactory.injectLockFactory WARNING No lockType configured for NRTCachingDirectory(org.apache.lucene.store.SimpleFSDirectory@C:\Users\JenkinsSlave\workspace\Lucene-Solr-trunk-Windows\solr\build\solr-core\test\J0\org.apache.solr.cloud.BasicDistributedZkTest-1352378471569\jetty2 lockFactory=org.apache.lucene.store.NativeFSLockFactory@132f9a2; maxCacheMB=48.0 maxMergeSizeMB=4.0) assuming 'simple'
[junit4:junit4]   2> 6141 T992 oasc.CachingDirectoryFactory.get return new directory for C:\Users\JenkinsSlave\workspace\Lucene-Solr-trunk-Windows\solr\build\solr-core\test\J0\.\org.apache.solr.cloud.BasicDistributedZkTest-1352378471569\jetty2 forceNew:false
[junit4:junit4]   2> 6142 T992 oasc.CachingDirectoryFactory.close Releasing directory:C:\Users\JenkinsSlave\workspace\Lucene-Solr-trunk-Windows\solr\build\solr-core\test\J0\.\org.apache.solr.cloud.BasicDistributedZkTest-1352378471569\jetty2
[junit4:junit4]   2> 6143 T992 oasc.SolrCore.getNewIndexDir New index directory detected: old=null new=.\org.apache.solr.cloud.BasicDistributedZkTest-1352378471569/jetty2\index/
[junit4:junit4]   2> 6143 T992 oasc.SolrCore.initIndex WARNING [collection1] Solr index directory '.\org.apache.solr.cloud.BasicDistributedZkTest-1352378471569\jetty2\index' doesn't exist. Creating new index...
[junit4:junit4]   2> 6144 T992 oasc.CachingDirectoryFactory.get return new directory for C:\Users\JenkinsSlave\workspace\Lucene-Solr-trunk-Windows\solr\build\solr-core\test\J0\.\org.apache.solr.cloud.BasicDistributedZkTest-1352378471569\jetty2\index forceNew:false
[junit4:junit4]   2> 6156 T992 oasc.SolrDeletionPolicy.onCommit SolrDeletionPolicy.onCommit: commits:num=1
[junit4:junit4]   2> 		commit{dir=NRTCachingDirectory(org.apache.lucene.store.SimpleFSDirectory@C:\Users\JenkinsSlave\workspace\Lucene-Solr-trunk-Windows\solr\build\solr-core\test\J0\org.apache.solr.cloud.BasicDistributedZkTest-1352378471569\jetty2\index lockFactory=org.apache.lucene.store.NativeFSLockFactory@1d8f34a; maxCacheMB=48.0 maxMergeSizeMB=4.0),segFN=segments_1,generation=1,filenames=[segments_1]
[junit4:junit4]   2> 6156 T992 oasc.SolrDeletionPolicy.updateCommits newest commit = 1[segments_1]
[junit4:junit4]   2> 6158 T992 oasc.CachingDirectoryFactory.close Releasing directory:C:\Users\JenkinsSlave\workspace\Lucene-Solr-trunk-Windows\solr\build\solr-core\test\J0\.\org.apache.solr.cloud.BasicDistributedZkTest-1352378471569\jetty2\index
[junit4:junit4]   2> 6159 T992 oasc.SolrCore.initWriters created xml: solr.XMLResponseWriter
[junit4:junit4]   2> 6160 T992 oasup.UpdateRequestProcessorChain.init inserting DistributedUpdateProcessorFactory into updateRequestProcessorChain "dedupe"
[junit4:junit4]   2> 6160 T992 oasup.UpdateRequestProcessorChain.init inserting DistributedUpdateProcessorFactory into updateRequestProcessorChain "dedupe-allfields"
[junit4:junit4]   2> 6160 T992 oasup.UpdateRequestProcessorChain.init inserting DistributedUpdateProcessorFactory into updateRequestProcessorChain "stored_sig"
[junit4:junit4]   2> 6160 T992 oasup.UpdateRequestProcessorChain.init inserting DistributedUpdateProcessorFactory into updateRequestProcessorChain "uniq-fields"
[junit4:junit4]   2> 6161 T992 oasup.UpdateRequestProcessorChain.init inserting DistributedUpdateProcessorFactory into updateRequestProcessorChain "distrib-dup-test-chain-implicit"
[junit4:junit4]   2> 6161 T992 oasc.RequestHandlers.initHandlersFromConfig adding lazy requestHandler: solr.ReplicationHandler
[junit4:junit4]   2> 6161 T992 oasc.RequestHandlers.initHandlersFromConfig created /replication: solr.ReplicationHandler
[junit4:junit4]   2> 6162 T992 oasc.RequestHandlers.initHandlersFromConfig created standard: solr.StandardRequestHandler
[junit4:junit4]   2> 6162 T992 oasc.RequestHandlers.initHandlersFromConfig created /get: solr.RealTimeGetHandler
[junit4:junit4]   2> 6162 T992 oasc.RequestHandlers.initHandlersFromConfig created dismax: solr.SearchHandler
[junit4:junit4]   2> 6163 T992 oasc.RequestHandlers.initHandlersFromConfig created mock: org.apache.solr.core.MockQuerySenderListenerReqHandler
[junit4:junit4]   2> 6163 T992 oasc.RequestHandlers.initHandlersFromConfig created /admin/: org.apache.solr.handler.admin.AdminHandlers
[junit4:junit4]   2> 6164 T992 oasc.RequestHandlers.initHandlersFromConfig created defaults: solr.StandardRequestHandler
[junit4:junit4]   2> 6164 T992 oasc.RequestHandlers.initHandlersFromConfig adding lazy requestHandler: solr.StandardRequestHandler
[junit4:junit4]   2> 6165 T992 oasc.RequestHandlers.initHandlersFromConfig created lazy: solr.StandardRequestHandler
[junit4:junit4]   2> 6165 T992 oasc.RequestHandlers.initHandlersFromConfig created /update: solr.UpdateRequestHandler
[junit4:junit4]   2> 6166 T992 oasc.RequestHandlers.initHandlersFromConfig created /terms: org.apache.solr.handler.component.SearchHandler
[junit4:junit4]   2> 6168 T992 oasc.RequestHandlers.initHandlersFromConfig created spellCheckCompRH: org.apache.solr.handler.component.SearchHandler
[junit4:junit4]   2> 6169 T992 oasc.RequestHandlers.initHandlersFromConfig created spellCheckCompRH_Direct: org.apache.solr.handler.component.SearchHandler
[junit4:junit4]   2> 6169 T992 oasc.RequestHandlers.initHandlersFromConfig created spellCheckWithWordbreak: org.apache.solr.handler.component.SearchHandler
[junit4:junit4]   2> 6170 T992 oasc.RequestHandlers.initHandlersFromConfig created spellCheckWithWordbreak_Direct: org.apache.solr.handler.component.SearchHandler
[junit4:junit4]   2> 6171 T992 oasc.RequestHandlers.initHandlersFromConfig created spellCheckCompRH1: org.apache.solr.handler.component.SearchHandler
[junit4:junit4]   2> 6172 T992 oasc.RequestHandlers.initHandlersFromConfig created tvrh: org.apache.solr.handler.component.SearchHandler
[junit4:junit4]   2> 6173 T992 oasc.RequestHandlers.initHandlersFromConfig created /mlt: solr.MoreLikeThisHandler
[junit4:junit4]   2> 6173 T992 oasc.RequestHandlers.initHandlersFromConfig created /debug/dump: solr.DumpRequestHandler
[junit4:junit4]   2> 6182 T992 oashl.XMLLoader.init xsltCacheLifetimeSeconds=60
[junit4:junit4]   2> 6186 T992 oasc.SolrCore.initDeprecatedSupport WARNING solrconfig.xml uses deprecated <admin/gettableFiles>, Please update your config to use the ShowFileRequestHandler.
[junit4:junit4]   2> 6189 T992 oasc.SolrCore.initDeprecatedSupport WARNING adding ShowFileRequestHandler with hidden files: [SCHEMA.XML, OLD_SYNONYMS.TXT, STOPWORDS.TXT, PROTWORDS.TXT, OPEN-EXCHANGE-RATES.JSON, SYNONYMS.TXT, CURRENCY.XML, MAPPING-ISOLATIN1ACCENT.TXT]
[junit4:junit4]   2> 6191 T992 oasc.CachingDirectoryFactory.close Releasing directory:C:\Users\JenkinsSlave\workspace\Lucene-Solr-trunk-Windows\solr\build\solr-core\test\J0\.\org.apache.solr.cloud.BasicDistributedZkTest-1352378471569\jetty2
[junit4:junit4]   2> 6202 T992 oass.SolrIndexSearcher.<init> Opening Searcher@a6e4b3 main
[junit4:junit4]   2> 6204 T992 oasu.CommitTracker.<init> Hard AutoCommit: disabled
[junit4:junit4]   2> 6204 T992 oasu.CommitTracker.<init> Soft AutoCommit: disabled
[junit4:junit4]   2> 6204 T992 oashc.SpellCheckComponent.inform Initializing spell checkers
[junit4:junit4]   2> 6216 T992 oass.DirectSolrSpellChecker.init init: {name=direct,classname=DirectSolrSpellChecker,field=lowerfilt,minQueryLength=3}
[junit4:junit4]   2> 6284 T1041 oasc.SolrCore.registerSearcher [collection1] Registered new searcher Searcher@a6e4b3 main{StandardDirectoryReader(segments_1:1)}
[junit4:junit4]   2> 6287 T992 oasc.ZkController.publish numShards not found on descriptor - reading it from system property
[junit4:junit4]   2> 6348 T1013 oascc.ZkStateReader.updateClusterState Updating cloud state from ZooKeeper... 
[junit4:junit4]   2> 6348 T1013 oasc.Overseer$ClusterStateUpdater.updateState Update state numShards=2 message={
[junit4:junit4]   2> 	  "operation":"state",
[junit4:junit4]   2> 	  "numShards":"2",
[junit4:junit4]   2> 	  "shard":null,
[junit4:junit4]   2> 	  "roles":null,
[junit4:junit4]   2> 	  "state":"down",
[junit4:junit4]   2> 	  "core":"collection1",
[junit4:junit4]   2> 	  "collection":"collection1",
[junit4:junit4]   2> 	  "node_name":"127.0.0.1:59421_solr",
[junit4:junit4]   2> 	  "base_url":"http://127.0.0.1:59421/solr"}
[junit4:junit4]   2> 6359 T1012 oascc.ZkStateReader$2.process A cluster state change has occurred - updating... (3)
[junit4:junit4]   2> 6359 T1017 oascc.ZkStateReader$2.process A cluster state change has occurred - updating... (3)
[junit4:junit4]   2> 6361 T1028 oascc.ZkStateReader$2.process A cluster state change has occurred - updating... (3)
[junit4:junit4]   2> 6362 T1040 oascc.ZkStateReader$2.process A cluster state change has occurred - updating... (3)
[junit4:junit4]   2> 6790 T992 oasc.CoreContainer.registerCore registering core: collection1
[junit4:junit4]   2> 6790 T992 oasc.ZkController.register Register shard - core:collection1 address:http://127.0.0.1:59421/solr shardId:shard2
[junit4:junit4]   2> 6793 T992 oascc.SolrZkClient.makePath makePath: /collections/collection1/leader_elect/shard2/election
[junit4:junit4]   2> 6814 T997 oazs.PrepRequestProcessor.pRequest Got user-level KeeperException when processing sessionid:0x13ae009d4990005 type:delete cxid:0x42 zxid:0xfffffffffffffffe txntype:unknown reqpath:n/a Error Path:/solr/collections/collection1/leaders/shard2 Error:KeeperErrorCode = NoNode for /solr/collections/collection1/leaders/shard2
[junit4:junit4]   2> 6817 T992 oasc.ShardLeaderElectionContext.runLeaderProcess Running the leader process.
[junit4:junit4]   2> 6819 T997 oazs.PrepRequestProcessor.pRequest Got user-level KeeperException when processing sessionid:0x13ae009d4990005 type:create cxid:0x43 zxid:0xfffffffffffffffe txntype:unknown reqpath:n/a Error Path:/solr/overseer Error:KeeperErrorCode = NodeExists for /solr/overseer
[junit4:junit4]   2> 6827 T992 oasc.ShardLeaderElectionContext.waitForReplicasToComeUp Enough replicas found to continue.
[junit4:junit4]   2> 6827 T992 oasc.ShardLeaderElectionContext.runLeaderProcess I may be the new leader - try and sync
[junit4:junit4]   2> 6828 T992 oasc.SyncStrategy.sync Sync replicas to http://127.0.0.1:59421/solr/collection1/
[junit4:junit4]   2> 6828 T992 oasc.SyncStrategy.syncReplicas Sync Success - now sync replicas to me
[junit4:junit4]   2> 6829 T992 oasc.SyncStrategy.syncToMe http://127.0.0.1:59421/solr/collection1/ has no replicas
[junit4:junit4]   2> 6829 T992 oasc.ShardLeaderElectionContext.runLeaderProcess I am the new leader: http://127.0.0.1:59421/solr/collection1/
[junit4:junit4]   2> 6829 T992 oascc.SolrZkClient.makePath makePath: /collections/collection1/leaders/shard2
[junit4:junit4]   2> 6842 T997 oazs.PrepRequestProcessor.pRequest Got user-level KeeperException when processing sessionid:0x13ae009d4990005 type:create cxid:0x4c zxid:0xfffffffffffffffe txntype:unknown reqpath:n/a Error Path:/solr/overseer Error:KeeperErrorCode = NodeExists for /solr/overseer
[junit4:junit4]   2> 6878 T1013 oascc.ZkStateReader.updateClusterState Updating cloud state from ZooKeeper... 
[junit4:junit4]   2> 6905 T1012 oascc.ZkStateReader$2.process A cluster state change has occurred - updating... (3)
[junit4:junit4]   2> 6905 T1017 oascc.ZkStateReader$2.process A cluster state change has occurred - updating... (3)
[junit4:junit4]   2> 6905 T1040 oascc.ZkStateReader$2.process A cluster state change has occurred - updating... (3)
[junit4:junit4]   2> 6905 T1028 oascc.ZkStateReader$2.process A cluster state change has occurred - updating... (3)
[junit4:junit4]   2> 6952 T992 oasc.ZkController.register We are http://127.0.0.1:59421/solr/collection1/ and leader is http://127.0.0.1:59421/solr/collection1/
[junit4:junit4]   2> 6952 T992 oasc.ZkController.register No LogReplay needed for core=collection1 baseURL=http://127.0.0.1:59421/solr
[junit4:junit4]   2> 6954 T992 oasc.ZkController.checkRecovery I am the leader, no recovery necessary
[junit4:junit4]   2> 6954 T992 oasc.ZkController.publish numShards not found on descriptor - reading it from system property
[junit4:junit4]   2> 6959 T992 oascc.ZkStateReader.updateClusterState Updating cloud state from ZooKeeper... 
[junit4:junit4]   2> 6960 T992 oass.SolrDispatchFilter.init user.dir=C:\Users\JenkinsSlave\workspace\Lucene-Solr-trunk-Windows\solr\build\solr-core\test\J0
[junit4:junit4]   2> 6962 T992 oass.SolrDispatchFilter.init SolrDispatchFilter.init() done
[junit4:junit4]   2> 6962 T992 oascsi.HttpClientUtil.createClient Creating new http client, config:maxConnections=128&maxConnectionsPerHost=32&followRedirects=false
[junit4:junit4]   2> 7293 T992 oejs.Server.doStart jetty-8.1.7.v20120910
[junit4:junit4]   2> 7295 T992 oejs.AbstractConnector.doStart Started SelectChannelConnector@0.0.0.0:59427
[junit4:junit4]   2> 7296 T992 oasc.SolrResourceLoader.locateSolrHome JNDI not configured for solr (NoInitialContextEx)
[junit4:junit4]   2> 7297 T992 oasc.SolrResourceLoader.locateSolrHome using system property solr.solr.home: C:\Users\JenkinsSlave\workspace\Lucene-Solr-trunk-Windows\solr\build\solr-core\test\J0\.\org.apache.solr.cloud.BasicDistributedZkTest-jetty3-1352378478537
[junit4:junit4]   2> 7297 T992 oasc.SolrResourceLoader.<init> new SolrResourceLoader for deduced Solr Home: 'C:\Users\JenkinsSlave\workspace\Lucene-Solr-trunk-Windows\solr\build\solr-core\test\J0\.\org.apache.solr.cloud.BasicDistributedZkTest-jetty3-1352378478537\'
[junit4:junit4]   2> 7328 T992 oass.SolrDispatchFilter.init SolrDispatchFilter.init()
[junit4:junit4]   2> 7329 T992 oasc.SolrResourceLoader.locateSolrHome JNDI not configured for solr (NoInitialContextEx)
[junit4:junit4]   2> 7329 T992 oasc.SolrResourceLoader.locateSolrHome using system property solr.solr.home: C:\Users\JenkinsSlave\workspace\Lucene-Solr-trunk-Windows\solr\build\solr-core\test\J0\.\org.apache.solr.cloud.BasicDistributedZkTest-jetty3-1352378478537
[junit4:junit4]   2> 7329 T992 oasc.CoreContainer$Initializer.initialize looking for solr.xml: C:\Users\JenkinsSlave\workspace\Lucene-Solr-trunk-Windows\solr\build\solr-core\test\J0\.\org.apache.solr.cloud.BasicDistributedZkTest-jetty3-1352378478537\solr.xml
[junit4:junit4]   2> 7329 T992 oasc.CoreContainer.<init> New CoreContainer 25716720
[junit4:junit4]   2> 7330 T992 oasc.CoreContainer.load Loading CoreContainer using Solr Home: 'C:\Users\JenkinsSlave\workspace\Lucene-Solr-trunk-Windows\solr\build\solr-core\test\J0\.\org.apache.solr.cloud.BasicDistributedZkTest-jetty3-1352378478537\'
[junit4:junit4]   2> 7330 T992 oasc.SolrResourceLoader.<init> new SolrResourceLoader for directory: 'C:\Users\JenkinsSlave\workspace\Lucene-Solr-trunk-Windows\solr\build\solr-core\test\J0\.\org.apache.solr.cloud.BasicDistributedZkTest-jetty3-1352378478537\'
[junit4:junit4]   2> 7357 T992 oasc.CoreContainer.load Registering Log Listener
[junit4:junit4]   2> 7371 T992 oasc.CoreContainer.initZooKeeper Zookeeper client=127.0.0.1:59399/solr
[junit4:junit4]   2> 7371 T992 oaz.ZooKeeper.<init> Initiating client connection, connectString=127.0.0.1:59399/solr sessionTimeout=5000 watcher=org.apache.solr.common.cloud.ConnectionManager@e5bd36
[junit4:junit4]   2> 7372 T1051 oaz.ClientCnxn$SendThread.startConnect Opening socket connection to server /127.0.0.1:59399
[junit4:junit4]   2> 7372 T992 oascc.ConnectionManager.waitForConnected Waiting for client to connect to ZooKeeper
[junit4:junit4]   2> 7374 T1051 oaz.ClientCnxn$SendThread.primeConnection Socket connection established to 127.0.0.1/127.0.0.1:59399, initiating session
[junit4:junit4]   2> 7374 T994 oazs.NIOServerCnxn$Factory.run Accepted socket connection from /127.0.0.1:59432
[junit4:junit4]   2> 7374 T994 oazs.NIOServerCnxn.readConnectRequest Client attempting to establish new session at /127.0.0.1:59432
[junit4:junit4]   2> 7386 T996 oazs.NIOServerCnxn.finishSessionInit Established session 0x13ae009d4990006 with negotiated timeout 5000 for client /127.0.0.1:59432
[junit4:junit4]   2> 7386 T1051 oaz.ClientCnxn$SendThread.readConnectResult Session establishment complete on server 127.0.0.1/127.0.0.1:59399, sessionid = 0x13ae009d4990006, negotiated timeout = 5000
[junit4:junit4]   2> 7386 T1052 oascc.ConnectionManager.process Watcher org.apache.solr.common.cloud.ConnectionManager@e5bd36 name:ZooKeeperConnection Watcher:127.0.0.1:59399/solr got event WatchedEvent state:SyncConnected type:None path:null path:null type:None
[junit4:junit4]   2> 7386 T992 oascc.ConnectionManager.waitForConnected Client is connected to ZooKeeper
[junit4:junit4]   2> 7388 T997 oazs.PrepRequestProcessor.pRequest Got user-level KeeperException when processing sessionid:0x13ae009d4990006 type:create cxid:0x1 zxid:0xfffffffffffffffe txntype:unknown reqpath:n/a Error Path:/solr/overseer Error:KeeperErrorCode = NodeExists for /solr/overseer
[junit4:junit4]   2> 7390 T997 oazs.PrepRequestProcessor.pRequest Got user-level KeeperException when processing sessionid:0x13ae009d4990006 type:create cxid:0x2 zxid:0xfffffffffffffffe txntype:unknown reqpath:n/a Error Path:/solr/overseer Error:KeeperErrorCode = NodeExists for /solr/overseer
[junit4:junit4]   2> 7392 T992 oasc.ZkController.createEphemeralLiveNode Register node as live in ZooKeeper:/live_nodes/127.0.0.1:59427_solr
[junit4:junit4]   2> 7393 T997 oazs.PrepRequestProcessor.pRequest Got user-level KeeperException when processing sessionid:0x13ae009d4990006 type:delete cxid:0x4 zxid:0xfffffffffffffffe txntype:unknown reqpath:n/a Error Path:/solr/live_nodes/127.0.0.1:59427_solr Error:KeeperErrorCode = NoNode for /solr/live_nodes/127.0.0.1:59427_solr
[junit4:junit4]   2> 7394 T992 oascc.SolrZkClient.makePath makePath: /live_nodes/127.0.0.1:59427_solr
[junit4:junit4]   2> 7399 T1028 oascc.ZkStateReader$2.process A cluster state change has occurred - updating... (3)
[junit4:junit4]   2> 7399 T1017 oascc.ZkStateReader$2.process A cluster state change has occurred - updating... (3)
[junit4:junit4]   2> 7399 T1040 oascc.ZkStateReader$2.process A cluster state change has occurred - updating... (3)
[junit4:junit4]   2> 7400 T1012 oascc.ZkStateReader$3.process Updating live nodes... (4)
[junit4:junit4]   2> 7400 T1012 oascc.ZkStateReader$2.process A cluster state change has occurred - updating... (4)
[junit4:junit4]   2> 7402 T992 oashc.HttpShardHandlerFactory.getParameter Setting socketTimeout to: 0
[junit4:junit4]   2> 7403 T992 oashc.HttpShardHandlerFactory.getParameter Setting urlScheme to: http://
[junit4:junit4]   2> 7403 T1040 oascc.ZkStateReader$3.process Updating live nodes... (4)
[junit4:junit4]   2> 7403 T992 oashc.HttpShardHandlerFactory.getParameter Setting connTimeout to: 0
[junit4:junit4]   2> 7403 T1028 oascc.ZkStateReader$3.process Updating live nodes... (4)
[junit4:junit4]   2> 7404 T992 oashc.HttpShardHandlerFactory.getParameter Setting maxConnectionsPerHost to: 20
[junit4:junit4]   2> 7404 T1017 oascc.ZkStateReader$3.process Updating live nodes... (4)
[junit4:junit4]   2> 7405 T992 oashc.HttpShardHandlerFactory.getParameter Setting corePoolSize to: 0
[junit4:junit4]   2> 7405 T992 oashc.HttpShardHandlerFactory.getParameter Setting maximumPoolSize to: 2147483647
[junit4:junit4]   2> 7405 T992 oashc.HttpShardHandlerFactory.getParameter Setting maxThreadIdleTime to: 5
[junit4:junit4]   2> 7406 T992 oashc.HttpShardHandlerFactory.getParameter Setting sizeOfQueue to: -1
[junit4:junit4]   2> 7406 T992 oashc.HttpShardHandlerFactory.getParameter Setting fairnessPolicy to: false
[junit4:junit4]   2> 7406 T992 oascsi.HttpClientUtil.createClient Creating new http client, config:maxConnectionsPerHost=20&maxConnections=10000&socketTimeout=0&connTimeout=0&retry=false
[junit4:junit4]   2> 7417 T992 oascc.ZkStateReader.createClusterStateWatchersAndUpdate Updating cluster state from ZooKeeper... 
[junit4:junit4]   2> 7422 T1013 oascc.ZkStateReader.updateClusterState Updating cloud state from ZooKeeper... 
[junit4:junit4]   2> 7423 T1013 oasc.Overseer$ClusterStateUpdater.updateState Update state numShards=2 message={
[junit4:junit4]   2> 	  "operation":"state",
[junit4:junit4]   2> 	  "numShards":"2",
[junit4:junit4]   2> 	  "shard":"shard2",
[junit4:junit4]   2> 	  "roles":null,
[junit4:junit4]   2> 	  "state":"active",
[junit4:junit4]   2> 	  "core":"collection1",
[junit4:junit4]   2> 	  "collection":"collection1",
[junit4:junit4]   2> 	  "node_name":"127.0.0.1:59421_solr",
[junit4:junit4]   2> 	  "base_url":"http://127.0.0.1:59421/solr"}
[junit4:junit4]   2> 7428 T992 oasc.CoreContainer.create Creating SolrCore 'collection1' using instanceDir: C:\Users\JenkinsSlave\workspace\Lucene-Solr-trunk-Windows\solr\build\solr-core\test\J0\.\org.apache.solr.cloud.BasicDistributedZkTest-jetty3-1352378478537\collection1
[junit4:junit4]   2> 7429 T992 oasc.ZkController.createCollectionZkNode Check for collection zkNode:collection1
[junit4:junit4]   2> 7430 T992 oasc.ZkController.createCollectionZkNode Collection zkNode exists
[junit4:junit4]   2> 7431 T992 oasc.ZkController.readConfigName Load collection config from:/collections/collection1
[junit4:junit4]   2> 7432 T1012 oascc.ZkStateReader$2.process A cluster state change has occurred - updating... (4)
[junit4:junit4]   2> 7432 T1017 oascc.ZkStateReader$2.process A cluster state change has occurred - updating... (4)
[junit4:junit4]   2> 7432 T1028 oascc.ZkStateReader$2.process A cluster state change has occurred - updating... (4)
[junit4:junit4]   2> 7433 T1040 oascc.ZkStateReader$2.process A cluster state change has occurred - updating... (4)
[junit4:junit4]   2> 7433 T1052 oascc.ZkStateReader$2.process A cluster state change has occurred - updating... (4)
[junit4:junit4]   2> 7436 T992 oasc.SolrResourceLoader.<init> new SolrResourceLoader for directory: 'C:\Users\JenkinsSlave\workspace\Lucene-Solr-trunk-Windows\solr\build\solr-core\test\J0\.\org.apache.solr.cloud.BasicDistributedZkTest-jetty3-1352378478537\collection1\'
[junit4:junit4]   2> 7439 T992 oasc.SolrResourceLoader.replaceClassLoader Adding 'file:/C:/Users/JenkinsSlave/workspace/Lucene-Solr-trunk-Windows/solr/build/solr-core/test/J0/org.apache.solr.cloud.BasicDistributedZkTest-jetty3-1352378478537/collection1/lib/classes/' to classloader
[junit4:junit4]   2> 7440 T992 oasc.SolrResourceLoader.replaceClassLoader Adding 'file:/C:/Users/JenkinsSlave/workspace/Lucene-Solr-trunk-Windows/solr/build/solr-core/test/J0/org.apache.solr.cloud.BasicDistributedZkTest-jetty3-1352378478537/collection1/lib/README' to classloader
[junit4:junit4]   2> 7493 T992 oasc.SolrConfig.<init> Using Lucene MatchVersion: LUCENE_50
[junit4:junit4]   2> 7569 T992 oasc.SolrConfig.<init> Loaded SolrConfig: solrconfig.xml
[junit4:junit4]   2> 7570 T992 oass.IndexSchema.readSchema Reading Solr Schema
[junit4:junit4]   2> 7574 T992 oass.IndexSchema.readSchema Schema name=test
[junit4:junit4]   2> 8252 T992 oass.OpenExchangeRatesOrgProvider.init Initialized with rates=open-exchange-rates.json, refreshInterval=1440.
[junit4:junit4]   2> 8263 T992 oass.IndexSchema.readSchema default search field in schema is text
[junit4:junit4]   2> 8267 T992 oass.IndexSchema.readSchema unique key field: id
[junit4:junit4]   2> 8285 T992 oass.FileExchangeRateProvider.reload Reloading exchange rates from file currency.xml
[junit4:junit4]   2> 8289 T992 oass.FileExchangeRateProvider.reload Reloading exchange rates from file currency.xml
[junit4:junit4]   2> 8297 T992 oass.OpenExchangeRatesOrgProvider.reload Reloading exchange rates from open-exchange-rates.json
[junit4:junit4]   2> 8299 T992 oass.OpenExchangeRatesOrgProvider.reload Reloading exchange rates from open-exchange-rates.json
[junit4:junit4]   2> 8300 T992 oasc.SolrCore.<init> [collection1] Opening new SolrCore at C:\Users\JenkinsSlave\workspace\Lucene-Solr-trunk-Windows\solr\build\solr-core\test\J0\.\org.apache.solr.cloud.BasicDistributedZkTest-jetty3-1352378478537\collection1\, dataDir=.\org.apache.solr.cloud.BasicDistributedZkTest-1352378471569/jetty3\
[junit4:junit4]   2> 8301 T992 oasc.JmxMonitoredMap.<init> JMX monitoring is enabled. Adding Solr mbeans to JMX Server: com.sun.jmx.mbeanserver.JmxMBeanServer@5e8d7d
[junit4:junit4]   2> 8301 T992 oasc.SolrCore.initDirectoryFactory solr.NRTCachingDirectoryFactory
[junit4:junit4]   2> 8303 T992 oasc.CachingDirectoryFactory.injectLockFactory WARNING No lockType configured for NRTCachingDirectory(org.apache.lucene.store.SimpleFSDirectory@C:\Users\JenkinsSlave\workspace\Lucene-Solr-trunk-Windows\solr\build\solr-core\test\J0\org.apache.solr.cloud.BasicDistributedZkTest-1352378471569\jetty3 lockFactory=org.apache.lucene.store.NativeFSLockFactory@159951e; maxCacheMB=48.0 maxMergeSizeMB=4.0) assuming 'simple'
[junit4:junit4]   2> 8303 T992 oasc.CachingDirectoryFactory.get return new directory for C:\Users\JenkinsSlave\workspace\Lucene-Solr-trunk-Windows\solr\build\solr-core\test\J0\.\org.apache.solr.cloud.BasicDistributedZkTest-1352378471569\jetty3 forceNew:false
[junit4:junit4]   2> 8304 T992 oasc.CachingDirectoryFactory.close Releasing directory:C:\Users\JenkinsSlave\workspace\Lucene-Solr-trunk-Windows\solr\build\solr-core\test\J0\.\org.apache.solr.cloud.BasicDistributedZkTest-1352378471569\jetty3
[junit4:junit4]   2> 8304 T992 oasc.SolrCore.getNewIndexDir New index directory detected: old=null new=.\org.apache.solr.cloud.BasicDistributedZkTest-1352378471569/jetty3\index/
[junit4:junit4]   2> 8305 T992 oasc.SolrCore.initIndex WARNING [collection1] Solr index directory '.\org.apache.solr.cloud.BasicDistributedZkTest-1352378471569\jetty3\index' doesn't exist. Creating new index...
[junit4:junit4]   2> 8306 T992 oasc.CachingDirectoryFactory.get return new directory for C:\Users\JenkinsSlave\workspace\Lucene-Solr-trunk-Windows\solr\build\solr-core\test\J0\.\org.apache.solr.cloud.BasicDistributedZkTest-1352378471569\jetty3\index forceNew:false
[junit4:junit4]   2> 8320 T992 oasc.SolrDeletionPolicy.onCommit SolrDeletionPolicy.onCommit: commits:num=1
[junit4:junit4]   2> 		commit{dir=NRTCachingDirectory(org.apache.lucene.store.SimpleFSDirectory@C:\Users\JenkinsSlave\workspace\Lucene-Solr-trunk-Windows\solr\build\solr-core\test\J0\org.apache.solr.cloud.BasicDistributedZkTest-1352378471569\jetty3\index lockFactory=org.apache.lucene.store.NativeFSLockFactory@1945d91; maxCacheMB=48.0 maxMergeSizeMB=4.0),segFN=segments_1,generation=1,filenames=[segments_1]
[junit4:junit4]   2> 8322 T992 oasc.SolrDeletionPolicy.updateCommits newest commit = 1[segments_1]
[junit4:junit4]   2> 8325 T992 oasc.CachingDirectoryFactory.close Releasing directory:C:\Users\JenkinsSlave\workspace\Lucene-Solr-trunk-Windows\solr\build\solr-core\test\J0\.\org.apache.solr.cloud.BasicDistributedZkTest-1352378471569\jetty3\index
[junit4:junit4]   2> 8325 T992 oasc.SolrCore.initWriters created xml: solr.XMLResponseWriter
[junit4:junit4]   2> 8329 T992 oasup.UpdateRequestProcessorChain.init inserting DistributedUpdateProcessorFactory into updateRequestProcessorChain "dedupe"
[junit4:junit4]   2> 8329 T992 oasup.UpdateRequestProcessorChain.init inserting DistributedUpdateProcessorFactory into updateRequestProcessorChain "dedupe-allfields"
[junit4:junit4]   2> 8329 T992 oasup.UpdateRequestProcessorChain.init inserting DistributedUpdateProcessorFactory into updateRequestProcessorChain "stored_sig"
[junit4:junit4]   2> 8331 T992 oasup.UpdateRequestProcessorChain.init inserting DistributedUpdateProcessorFactory into updateRequestProcessorChain "uniq-fields"
[junit4:junit4]   2> 8332 T992 oasup.UpdateRequestProcessorChain.init inserting DistributedUpdateProcessorFactory into updateRequestProcessorChain "distrib-dup-test-chain-implicit"
[junit4:junit4]   2> 8333 T992 oasc.RequestHandlers.initHandlersFromConfig adding lazy requestHandler: solr.ReplicationHandler
[junit4:junit4]   2> 8333 T992 oasc.RequestHandlers.initHandlersFromConfig created /replication: solr.ReplicationHandler
[junit4:junit4]   2> 8335 T992 oasc.RequestHandlers.initHandlersFromConfig created standard: solr.StandardRequestHandler
[junit4:junit4]   2> 8336 T992 oasc.RequestHandlers.initHandlersFromConfig created /get: solr.RealTimeGetHandler
[junit4:junit4]   2> 8336 T992 oasc.RequestHandlers.initHandlersFromConfig created dismax: solr.SearchHandler
[junit4:junit4]   2> 8337 T992 oasc.RequestHandlers.initHandlersFromConfig created mock: org.apache.solr.core.MockQuerySenderListenerReqHandler
[junit4:junit4]   2> 8337 T992 oasc.RequestHandlers.initHandlersFromConfig created /admin/: org.apache.solr.handler.admin.AdminHandlers
[junit4:junit4]   2> 8339 T992 oasc.RequestHandlers.initHandlersFromConfig created defaults: solr.StandardRequestHandler
[junit4:junit4]   2> 8339 T992 oasc.RequestHandlers.initHandlersFromConfig adding lazy requestHandler: solr.StandardRequestHandler
[junit4:junit4]   2> 8339 T992 oasc.RequestHandlers.initHandlersFromConfig created lazy: solr.StandardRequestHandler
[junit4:junit4]   2> 8341 T992 oasc.RequestHandlers.initHandlersFromConfig created /update: solr.UpdateRequestHandler
[junit4:junit4]   2> 8342 T992 oasc.RequestHandlers.initHandlersFromConfig created /terms: org.apache.solr.handler.component.SearchHandler
[junit4:junit4]   2> 8342 T992 oasc.RequestHandlers.initHandlersFromConfig created spellCheckCompRH: org.apache.solr.handler.component.SearchHandler
[junit4:junit4]   2> 8344 T992 oasc.RequestHandlers.initHandlersFromConfig created spellCheckCompRH_Direct: org.apache.solr.handler.component.SearchHandler
[junit4:junit4]   2> 8344 T992 oasc.RequestHandlers.initHandlersFromConfig created spellCheckWithWordbreak: org.apache.solr.handler.component.SearchHandler
[junit4:junit4]   2> 8345 T992 oasc.RequestHandlers.initHandlersFromConfig created spellCheckWithWordbreak_Direct: org.apache.solr.handler.component.SearchHandler
[junit4:junit4]   2> 8345 T992 oasc.RequestHandlers.initHandlersFromConfig created spellCheckCompRH1: org.apache.solr.handler.component.SearchHandler
[junit4:junit4]   2> 8346 T992 oasc.RequestHandlers.initHandlersFromConfig created tvrh: org.apache.solr.handler.component.SearchHandler
[junit4:junit4]   2> 8347 T992 oasc.RequestHandlers.initHandlersFromConfig created /mlt: solr.MoreLikeThisHandler
[junit4:junit4]   2> 8348 T992 oasc.RequestHandlers.initHandlersFromConfig created /debug/dump: solr.DumpRequestHandler
[junit4:junit4]   2> 8353 T992 oashl.XMLLoader.init xsltCacheLifetimeSeconds=60
[junit4:junit4]   2> 8364 T992 oasc.SolrCore.initDeprecatedSupport WARNING solrconfig.xml uses deprecated <admin/gettableFiles>, Please update your config to use the ShowFileRequestHandler.
[junit4:junit4]   2> 8365 T992 oasc.SolrCore.initDeprecatedSupport WARNING adding ShowFileRequestHandler with hidden files: [SCHEMA.XML, OLD_SYNONYMS.TXT, STOPWORDS.TXT, PROTWORDS.TXT, OPEN-EXCHANGE-RATES.JSON, SYNONYMS.TXT, CURRENCY.XML, MAPPING-ISOLATIN1ACCENT.TXT]
[junit4:junit4]   2> 8368 T992 oasc.CachingDirectoryFactory.close Releasing directory:C:\Users\JenkinsSlave\workspace\Lucene-Solr-trunk-Windows\solr\build\solr-core\test\J0\.\org.apache.solr.cloud.BasicDistributedZkTest-1352378471569\jetty3
[junit4:junit4]   2> 8371 T992 oass.SolrIndexSearcher.<init> Opening Searcher@d21798 main
[junit4:junit4]   2> 8371 T992 oasu.CommitTracker.<init> Hard AutoCommit: disabled
[junit4:junit4]   2> 8372 T992 oasu.CommitTracker.<init> Soft AutoCommit: disabled
[junit4:junit4]   2> 8372 T992 oashc.SpellCheckComponent.inform Initializing spell checkers
[junit4:junit4]   2> 8382 T992 oass.DirectSolrSpellChecker.init init: {name=direct,classname=DirectSolrSpellChecker,field=lowerfilt,minQueryLength=3}
[junit4:junit4]   2> 8460 T1053 oasc.SolrCore.registerSearcher [collection1] Registered new searcher Searcher@d21798 main{StandardDirectoryReader(segments_1:1)}
[junit4:junit4]   2> 8467 T992 oasc.ZkController.publish numShards not found on descriptor - reading it from system property
[junit4:junit4]   2> 8950 T1013 oascc.ZkStateReader.updateClusterState Updating cloud state from ZooKeeper... 
[junit4:junit4]   2> 8951 T1013 oasc.Overseer$ClusterStateUpdater.updateState Update state numShards=2 message={
[junit4:junit4]   2> 	  "operation":"state",
[junit4:junit4]   2> 	  "numShards":"2",
[junit4:junit4]   2> 	  "shard":null,
[junit4:junit4]   2> 	  "roles":null,
[junit4:junit4]   2> 	  "state":"down",
[junit4:junit4]   2> 	  "core":"collection1",
[junit4:junit4]   2> 	  "collection":"collection1",
[junit4:junit4]   2> 	  "node_name":"127.0.0.1:59427_solr",
[junit4:junit4]   2> 	  "base_url":"http://127.0.0.1:59427/solr"}
[junit4:junit4]   2> 8957 T1012 oascc.ZkStateReader$2.process A cluster state change has occurred - updating... (4)
[junit4:junit4]   2> 8957 T1028 oascc.ZkStateReader$2.process A cluster state change has occurred - updating... (4)
[junit4:junit4]   2> 8958 T1040 oascc.ZkStateReader$2.process A cluster state change has occurred - updating... (4)
[junit4:junit4]   2> 8958 T1052 oascc.ZkStateReader$2.process A cluster state change has occurred - updating... (4)
[junit4:junit4]   2> 8958 T1017 oascc.ZkStateReader$2.process A cluster state change has occurred - updating... (4)
[junit4:junit4]   2> 8970 T992 oasc.CoreContainer.registerCore registering core: collection1
[junit4:junit4]   2> 8970 T992 oasc.ZkController.register Register shard - core:collection1 address:http://127.0.0.1:59427/solr shardId:shard1
[junit4:junit4]   2> 8976 T992 oasc.ZkController.register We are http://127.0.0.1:59427/solr/collection1/ and leader is http://127.0.0.1:59415/solr/collection1/
[junit4:junit4]   2> 8976 T992 oasc.ZkController.register No LogReplay needed for core=collection1 baseURL=http://127.0.0.1:59427/solr
[junit4:junit4]   2> 8976 T992 oasc.ZkController.checkRecovery Core needs to recover:collection1
[junit4:junit4]   2> 8977 T992 oasu.DefaultSolrCoreState.doRecovery Running recovery - first canceling any ongoing recovery
[junit4:junit4]   2> ASYNC  NEW_CORE C94 name=collection1 org.apache.solr.core.SolrCore@58133e url=http://127.0.0.1:59427/solr/collection1 node=127.0.0.1:59427_solr
[junit4:junit4]   2> 8978 T1054 C94 P59427 oasc.RecoveryStrategy.run Starting recovery process.  core=collection1 recoveringAfterStartup=true
[junit4:junit4]   2> 8979 T1054 C94 P59427 oasc.RecoveryStrategy.doRecovery ###### startupVersions=[]
[junit4:junit4]   2> 8979 T1054 C94 P59427 oasc.ZkController.publish numShards not found on descriptor - reading it from system property
[junit4:junit4]   2> 8979 T992 oascc.ZkStateReader.updateClusterState Updating cloud state from ZooKeeper... 
[junit4:junit4]   2> 8981 T1054 C94 P59427 oasc.RecoveryStrategy.doRecovery Attempting to PeerSync from http://127.0.0.1:59415/solr/collection1/ core=collection1 - recoveringAfterStartup=true
[junit4:junit4]   2> 8981 T1054 C94 P59427 oasu.PeerSync.sync PeerSync: core=collection1 url=http://127.0.0.1:59427/solr START replicas=[http://127.0.0.1:59415/solr/collection1/] nUpdates=100
[junit4:junit4]   2> 8981 T992 oass.SolrDispatchFilter.init user.dir=C:\Users\JenkinsSlave\workspace\Lucene-Solr-trunk-Windows\solr\build\solr-core\test\J0
[junit4:junit4]   2> 8981 T1054 C94 P59427 oasu.PeerSync.sync WARNING no frame of reference to tell of we've missed updates
[junit4:junit4]   2> 8981 T992 oass.SolrDispatchFilter.init SolrDispatchFilter.init() done
[junit4:junit4]   2> 8982 T992 oascsi.HttpClientUtil.createClient Creating new http client, config:maxConnections=128&maxConnectionsPerHost=32&followRedirects=false
[junit4:junit4]   2> 8982 T1054 C94 P59427 oasc.RecoveryStrategy.doRecovery PeerSync Recovery was not successful - trying replication. core=collection1
[junit4:junit4]   2> 8983 T1054 C94 P59427 oasc.RecoveryStrategy.doRecovery Starting Replication Recovery. core=collection1
[junit4:junit4]   2> 8984 T1054 C94 P59427 oascsi.HttpClientUtil.createClient Creating new http client, config:maxConnections=128&maxConnectionsPerHost=32&followRedirects=false
[junit4:junit4]   2> ASYNC  NEW_CORE C95 name=collection1 org.apache.solr.core.SolrCore@1b29bf5 url=http://127.0.0.1:59415/solr/collection1 node=127.0.0.1:59415_solr
[junit4:junit4]   2> 8996 T1025 C95 P59415 REQ /get {distrib=false&qt=/get&wt=javabin&version=2&getVersions=100} status=0 QTime=0 
[junit4:junit4]   2> 9329 T992 oejs.Server.doStart jetty-8.1.7.v20120910
[junit4:junit4]   2> 9332 T992 oejs.AbstractConnector.doStart Started SelectChannelConnector@0.0.0.0:59435
[junit4:junit4]   2> 9333 T992 oasc.SolrResourceLoader.locateSolrHome JNDI not configured for solr (NoInitialContextEx)
[junit4:junit4]   2> 9333 T992 oasc.SolrResourceLoader.locateSolrHome using system property solr.solr.home: C:\Users\JenkinsSlave\workspace\Lucene-Solr-trunk-Windows\solr\build\solr-core\test\J0\.\org.apache.solr.cloud.BasicDistributedZkTest-jetty4-1352378480555
[junit4:junit4]   2> 9333 T992 oasc.SolrResourceLoader.<init> new SolrResourceLoader for deduced Solr Home: 'C:\Users\JenkinsSlave\workspace\Lucene-Solr-trunk-Windows\solr\build\solr-core\test\J0\.\org.apache.solr.cloud.BasicDistributedZkTest-jetty4-1352378480555\'
[junit4:junit4]   2> 9369 T992 oass.SolrDispatchFilter.init SolrDispatchFilter.init()
[junit4:junit4]   2> 9370 T992 oasc.SolrResourceLoader.locateSolrHome JNDI not configured for solr (NoInitialContextEx)
[junit4:junit4]   2> 9370 T992 oasc.SolrResourceLoader.locateSolrHome using system property solr.solr.home: C:\Users\JenkinsSlave\workspace\Lucene-Solr-trunk-Windows\solr\build\solr-core\test\J0\.\org.apache.solr.cloud.BasicDistributedZkTest-jetty4-1352378480555
[junit4:junit4]   2> 9371 T992 oasc.CoreContainer$Initializer.initialize looking for solr.xml: C:\Users\JenkinsSlave\workspace\Lucene-Solr-trunk-Windows\solr\build\solr-core\test\J0\.\org.apache.solr.cloud.BasicDistributedZkTest-jetty4-1352378480555\solr.xml
[junit4:junit4]   2> 9371 T992 oasc.CoreContainer.<init> New CoreContainer 693099
[junit4:junit4]   2> 9371 T992 oasc.CoreContainer.load Loading CoreContainer using Solr Home: 'C:\Users\JenkinsSlave\workspace\Lucene-Solr-trunk-Windows\solr\build\solr-core\test\J0\.\org.apache.solr.cloud.BasicDistributedZkTest-jetty4-1352378480555\'
[junit4:junit4]   2> 9371 T992 oasc.SolrResourceLoader.<init> new SolrResourceLoader for directory: 'C:\Users\JenkinsSlave\workspace\Lucene-Solr-trunk-Windows\solr\build\solr-core\test\J0\.\org.apache.solr.cloud.BasicDistributedZkTest-jetty4-1352378480555\'
[junit4:junit4]   2> 9401 T992 oasc.CoreContainer.load Registering Log Listener
[junit4:junit4]   2> 9418 T992 oasc.CoreContainer.initZooKeeper Zookeeper client=127.0.0.1:59399/solr
[junit4:junit4]   2> 9419 T992 oaz.ZooKeeper.<init> Initiating client connection, connectString=127.0.0.1:59399/solr sessionTimeout=5000 watcher=org.apache.solr.common.cloud.ConnectionManager@af77f5
[junit4:junit4]   2> 9420 T1065 oaz.ClientCnxn$SendThread.startConnect Opening socket connection to server /127.0.0.1:59399
[junit4:junit4]   2> 9420 T992 oascc.ConnectionManager.waitForConnected Waiting for client to connect to ZooKeeper
[junit4:junit4]   2> 9423 T1065 oaz.ClientCnxn$SendThread.primeConnection Socket connection established to 127.0.0.1/127.0.0.1:59399, initiating session
[junit4:junit4]   2> 9423 T994 oazs.NIOServerCnxn$Factory.run Accepted socket connection from /127.0.0.1:59440
[junit4:junit4]   2> 9423 T994 oazs.NIOServerCnxn.readConnectRequest Client attempting to establish new session at /127.0.0.1:59440
[junit4:junit4]   2> 9437 T996 oazs.NIOServerCnxn.finishSessionInit Established session 0x13ae009d4990007 with negotiated timeout 5000 for client /127.0.0.1:59440
[junit4:junit4]   2> 9437 T1065 oaz.ClientCnxn$SendThread.readConnectResult Session establishment complete on server 127.0.0.1/127.0.0.1:59399, sessionid = 0x13ae009d4990007, negotiated timeout = 5000
[junit4:junit4]   2> 9438 T1066 oascc.ConnectionManager.process Watcher org.apache.solr.common.cloud.ConnectionManager@af77f5 name:ZooKeeperConnection Watcher:127.0.0.1:59399/solr got event WatchedEvent state:SyncConnected type:None path:null path:null type:None
[junit4:junit4]   2> 9438 T992 oascc.ConnectionManager.waitForConnected Client is connected to ZooKeeper
[junit4:junit4]   2> 9439 T997 oazs.PrepRequestProcessor.pRequest Got user-level KeeperException when processing sessionid:0x13ae009d4990007 type:create cxid:0x1 zxid:0xfffffffffffffffe txntype:unknown reqpath:n/a Error Path:/solr/overseer Error:KeeperErrorCode = NodeExists for /solr/overseer
[junit4:junit4]   2> 9441 T997 oazs.PrepRequestProcessor.pRequest Got user-level KeeperException when processing sessionid:0x13ae009d4990007 type:create cxid:0x2 zxid:0xfffffffffffffffe txntype:unknown reqpath:n/a Error Path:/solr/overseer Error:KeeperErrorCode = NodeExists for /solr/overseer
[junit4:junit4]   2> 9443 T992 oasc.ZkController.createEphemeralLiveNode Register node as live in ZooKeeper:/live_nodes/127.0.0.1:59435_solr
[junit4:junit4]   2> 9444 T997 oazs.PrepRequestProcessor.pRequest Got user-level KeeperException when processing sessionid:0x13ae009d4990007 type:delete cxid:0x4 zxid:0xfffffffffffffffe txntype:unknown reqpath:n/a Error Path:/solr/live_nodes/127.0.0.1:59435_solr Error:KeeperErrorCode = NoNode for /solr/live_nodes/127.0.0.1:59435_solr
[junit4:junit4]   2> 9446 T992 oascc.SolrZkClient.makePath makePath: /live_nodes/127.0.0.1:59435_solr
[junit4:junit4]   2> 9450 T1028 oascc.ZkStateReader$2.process A cluster state change has occurred - updating... (4)
[junit4:junit4]   2> 9450 T1040 oascc.ZkStateReader$2.process A cluster state change has occurred - updating... (4)
[junit4:junit4]   2> 9450 T1017 oascc.ZkStateReader$2.process A cluster state change has occurred - updating... (4)
[junit4:junit4]   2> 9451 T1012 oascc.ZkStateReader$3.process Updating live nodes... (5)
[junit4:junit4]   2> 9451 T1012 oascc.ZkStateReader$2.process A cluster state change has occurred - updating... (5)
[junit4:junit4]   2> 9452 T1052 oascc.ZkStateReader$3.process Updating live nodes... (5)
[junit4:junit4]   2> 9452 T1052 oascc.ZkStateReader$2.process A cluster state change has occurred - updating... (5)
[junit4:junit4]   2> 9454 T992 oashc.HttpShardHandlerFactory.getParameter Setting socketTimeout to: 0
[junit4:junit4]   2> 9454 T1028 oascc.ZkStateReader$3.process Updating live nodes... (5)
[junit4:junit4]   2> 9454 T992 oashc.HttpShardHandlerFactory.getParameter Setting urlScheme to: http://
[junit4:junit4]   2> 9454 T992 oashc.HttpShardHandlerFactory.getParameter Setting connTimeout to: 0
[junit4:junit4]   2> 9454 T992 oashc.HttpShardHandlerFactory.getParameter Setting maxConnectionsPerHost to: 20
[junit4:junit4]   2> 9454 T1040 oascc.ZkStateReader$3.process Updating live nodes... (5)
[junit4:junit4]   2> 9454 T992 oashc.HttpShardHandlerFactory.getParameter Setting corePoolSize to: 0
[junit4:junit4]   2> 9455 T992 oashc.HttpShardHandlerFactory.getParameter Setting maximumPoolSize to: 2147483647
[junit4:junit4]   2> 9455 T1017 oascc.ZkStateReader$3.process Updating live nodes... (5)
[junit4:junit4]   2> 9455 T992 oashc.HttpShardHandlerFactory.getParameter Setting maxThreadIdleTime to: 5
[junit4:junit4]   2> 9456 T992 oashc.HttpShardHandlerFactory.getParameter Setting sizeOfQueue to: -1
[junit4:junit4]   2> 9456 T992 oashc.HttpShardHandlerFactory.getParameter Setting fairnessPolicy to: false
[junit4:junit4]   2> 9457 T992 oascsi.HttpClientUtil.createClient Creating new http client, config:maxConnectionsPerHost=20&maxConnections=10000&socketTimeout=0&connTimeout=0&retry=false
[junit4:junit4]   2> 9464 T1013 oascc.ZkStateReader.updateClusterState Updating cloud state from ZooKeeper... 
[junit4:junit4]   2> 9465 T1013 oasc.Overseer$ClusterStateUpdater.updateState Update state numShards=2 message={
[junit4:junit4]   2> 	  "operation":"state",
[junit4:junit4]   2> 	  "numShards":"2",
[junit4:junit4]   2> 	  "shard":"shard1",
[junit4:junit4]   2> 	  "roles":null,
[junit4:junit4]   2> 	  "state":"recovering",
[junit4:junit4]   2> 	  "core":"collection1",
[junit4:junit4]   2> 	  "collection":"collection1",
[junit4:junit4]   2> 	  "node_name":"127.0.0.1:59427_solr",
[junit4:junit4]   2> 	  "base_url":"http://127.0.0.1:59427/solr"}
[junit4:junit4]   2> 9472 T992 oascc.ZkStateReader.createClusterStateWatchersAndUpdate Updating cluster state from ZooKeeper... 
[junit4:junit4]   2> 9474 T1012 oascc.ZkStateReader$2.process A cluster state change has occurred - updating... (5)
[junit4:junit4]   2> 9475 T1028 oascc.ZkStateReader$2.process A cluster state change has occurred - updating... (5)
[junit4:junit4]   2> 9475 T1040 oascc.ZkStateReader$2.process A cluster state change has occurred - updating... (5)
[junit4:junit4]   2> 9475 T1052 oascc.ZkStateReader$2.process A cluster state change has occurred - updating... (5)
[junit4:junit4]   2> 9475 T1017 oascc.ZkStateReader$2.process A cluster state change has occurred - updating... (5)
[junit4:junit4]   2> 9475 T1066 oaz.ClientCnxn$EventThread.processEvent SEVERE Error while calling watcher  java.lang.NullPointerException
[junit4:junit4]   2> 	at org.apache.solr.common.cloud.ZkStateReader$2.process(ZkStateReader.java:189)
[junit4:junit4]   2> 	at org.apache.zookeeper.ClientCnxn$EventThread.processEvent(ClientCnxn.java:526)
[junit4:junit4]   2> 	at org.apache.zookeeper.ClientCnxn$EventThread.run(ClientCnxn.java:502)
[junit4:junit4]   2> 
[junit4:junit4]   2> 9486 T992 oasc.CoreContainer.create Creating SolrCore 'collection1' using instanceDir: C:\Users\JenkinsSlave\workspace\Lucene-Solr-trunk-Windows\solr\build\solr-core\test\J0\.\org.apache.solr.cloud.BasicDistributedZkTest-jetty4-1352378480555\collection1
[junit4:junit4]   2> 9486 T992 oasc.ZkController.createCollectionZkNode Check for collection zkNode:collection1
[junit4:junit4]   2> 9487 T992 oasc.ZkController.createCollectionZkNode Collection zkNode exists
[junit4:junit4]   2> 9488 T992 oasc.ZkController.readConfigName Load collection config from:/collections/collection1
[junit4:junit4]   2> 9492 T992 oasc.SolrResourceLoader.<init> new SolrResourceLoader for directory: 'C:\Users\JenkinsSlave\workspace\Lucene-Solr-trunk-Windows\solr\build\solr-core\test\J0\.\org.apache.solr.cloud.BasicDistributedZkTest-jetty4-1352378480555\collection1\'
[junit4:junit4]   2> 9493 T992 oasc.SolrResourceLoader.replaceClassLoader Adding 'file:/C:/Users/JenkinsSlave/workspace/Lucene-Solr-trunk-Windows/solr/build/solr-core/test/J0/org.apache.solr.cloud.BasicDistributedZkTest-jetty4-1352378480555/collection1/lib/classes/' to classloader
[junit4:junit4]   2> 9494 T992 oasc.SolrResourceLoader.replaceClassLoader Adding 'file:/C:/Users/JenkinsSlave/workspace/Lucene-Solr-trunk-Windows/solr/build/solr-core/test/J0/org.apache.solr.cloud.BasicDistributedZkTest-jetty4-1352378480555/collection1/lib/README' to classloader
[junit4:junit4]   2> 9538 T992 oasc.SolrConfig.<init> Using Lucene MatchVersion: LUCENE_50
[junit4:junit4]   2> 9618 T992 oasc.SolrConfig.<init> Loaded SolrConfig: solrconfig.xml
[junit4:junit4]   2> 9620 T992 oass.IndexSchema.readSchema Reading Solr Schema
[junit4:junit4]   2> 9624 T992 oass.IndexSchema.readSchema Schema name=test
[junit4:junit4]   2> 10300 T992 oass.OpenExchangeRatesOrgProvider.init Initialized with rates=open-exchange-rates.json, refreshInterval=1440.
[junit4:junit4]   2> 10311 T992 oass.IndexSchema.readSchema default search field in schema is text
[junit4:junit4]   2> 10314 T992 oass.IndexSchema.readSchema unique key field: id
[junit4:junit4]   2> 10329 T992 oass.FileExchangeRateProvider.reload Reloading exchange rates from file currency.xml
[junit4:junit4]   2> 10333 T992 oass.FileExchangeRateProvider.reload Reloading exchange rates from file currency.xml
[junit4:junit4]   2> 10336 T992 oass.OpenExchangeRatesOrgProvider.reload Reloading exchange rates from open-exchange-rates.json
[junit4:junit4]   2> 10337 T992 oass.OpenExchangeRatesOrgProvider.reload Reloading exchange rates from open-exchange-rates.json
[junit4:junit4]   2> 10339 T992 oasc.SolrCore.<init> [collection1] Opening new SolrCore at C:\Users\JenkinsSlave\workspace\Lucene-Solr-trunk-Windows\solr\build\solr-core\test\J0\.\org.apache.solr.cloud.BasicDistributedZkTest-jetty4-1352378480555\collection1\, dataDir=.\org.apache.solr.cloud.BasicDistributedZkTest-1352378471569/jetty4\
[junit4:junit4]   2> 10339 T992 oasc.JmxMonitoredMap.<init> JMX monitoring is enabled. Adding Solr mbeans to JMX Server: com.sun.jmx.mbeanserver.JmxMBeanServer@5e8d7d
[junit4:junit4]   2> 10341 T992 oasc.SolrCore.initDirectoryFactory solr.NRTCachingDirectoryFactory
[junit4:junit4]   2> 10342 T992 oasc.CachingDirectoryFactory.injectLockFactory WARNING No lockType configured for NRTCachingDirectory(org.apache.lucene.store.SimpleFSDirectory@C:\Users\JenkinsSlave\workspace\Lucene-Solr-trunk-Windows\solr\build\solr-core\test\J0\org.apache.solr.cloud.BasicDistributedZkTest-1352378471569\jetty4 lockFactory=org.apache.lucene.store.NativeFSLockFactory@1ce4cc7; maxCacheMB=48.0 maxMergeSizeMB=4.0) assuming 'simple'
[junit4:junit4]   2> 10342 T992 oasc.CachingDirectoryFactory.get return new directory for C:\Users\JenkinsSlave\workspace\Lucene-Solr-trunk-Windows\solr\build\solr-core\test\J0\.\org.apache.solr.cloud.BasicDistributedZkTest-1352378471569\jetty4 forceNew:false
[junit4:junit4]   2> 10343 T992 oasc.CachingDirectoryFactory.close Releasing directory:C:\Users\JenkinsSlave\workspace\Lucene-Solr-trunk-Windows\solr\build\solr-core\test\J0\.\org.apache.solr.cloud.BasicDistributedZkTest-1352378471569\jetty4
[junit4:junit4]   2> 10343 T992 oasc.SolrCore.getNewIndexDir New index directory detected: old=null new=.\org.apache.solr.cloud.BasicDistributedZkTest-1352378471569/jetty4\index/
[junit4:junit4]   2> 10345 T992 oasc.SolrCore.initIndex WARNING [collection1] Solr index directory '.\org.apache.solr.cloud.BasicDistributedZkTest-1352378471569\jetty4\index' doesn't exist. Creating new index...
[junit4:junit4]   2> 10346 T992 oasc.CachingDirectoryFactory.get return new directory for C:\Users\JenkinsSlave\workspace\Lucene-Solr-trunk-Windows\solr\build\solr-core\test\J0\.\org.apache.solr.cloud.BasicDistributedZkTest-1352378471569\jetty4\index forceNew:false
[junit4:junit4]   2> 10359 T992 oasc.SolrDeletionPolicy.onCommit SolrDeletionPolicy.onCommit: commits:num=1
[junit4:junit4]   2> 		commit{dir=NRTCachingDirectory(org.apache.lucene.store.SimpleFSDirectory@C:\Users\JenkinsSlave\workspace\Lucene-Solr-trunk-Windows\solr\build\solr-core\test\J0\org.apache.solr.cloud.BasicDistributedZkTest-1352378471569\jetty4\index lockFactory=org.apache.lucene.store.NativeFSLockFactory@194b891; maxCacheMB=48.0 maxMergeSizeMB=4.0),segFN=segments_1,generation=1,filenames=[segments_1]
[junit4:junit4]   2> 10359 T992 oasc.SolrDeletionPolicy.updateCommits newest commit = 1[segments_1]
[junit4:junit4]   2> 10361 T992 oasc.CachingDirectoryFactory.close Releasing directory:C:\Users\JenkinsSlave\workspace\Lucene-Solr-trunk-Windows\solr\build\solr-core\test\J0\.\org.apache.solr.cloud.BasicDistributedZkTest-1352378471569\jetty4\index
[junit4:junit4]   2> 10362 T992 oasc.SolrCore.initWriters created xml: solr.XMLResponseWriter
[junit4:junit4]   2> 10363 T992 oasup.UpdateRequestProcessorChain.init inserting DistributedUpdateProcessorFactory into updateRequestProcessorChain "dedupe"
[junit4:junit4]   2> 10363 T992 oasup.UpdateRequestProcessorChain.init inserting DistributedUpdateProcessorFactory into updateRequestProcessorChain "dedupe-allfields"
[junit4:junit4]   2> 10364 T992 oasup.UpdateRequestProcessorChain.init inserting DistributedUpdateProcessorFactory into updateRequestProcessorChain "stored_sig"
[junit4:junit4]   2> 10364 T992 oasup.UpdateRequestProcessorChain.init inserting DistributedUpdateProcessorFactory into updateRequestProcessorChain "uniq-fields"
[junit4:junit4]   2> 10365 T992 oasup.UpdateRequestProcessorChain.init inserting DistributedUpdateProcessorFactory into updateRequestProcessorChain "distrib-dup-test-chain-implicit"
[junit4:junit4]   2> 10366 T992 oasc.RequestHandlers.initHandlersFromConfig adding lazy requestHandler: solr.ReplicationHandler
[junit4:junit4]   2> 10366 T992 oasc.RequestHandlers.initHandlersFromConfig created /replication: solr.ReplicationHandler
[junit4:junit4]   2> 10367 T992 oasc.RequestHandlers.initHandlersFromConfig created standard: solr.StandardRequestHandler
[junit4:junit4]   2> 10368 T992 oasc.RequestHandlers.initHandlersFromConfig created /get: solr.RealTimeGetHandler
[junit4:junit4]   2> 10369 T992 oasc.RequestHandlers.initHandlersFromConfig created dismax: solr.SearchHandler
[junit4:junit4]   2> 10369 T992 oasc.RequestHandlers.initHandlersFromConfig created mock: org.apache.solr.core.MockQuerySenderListenerReqHandler
[junit4:junit4]   2> 10371 T992 oasc.RequestHandlers.initHandlersFromConfig created /admin/: org.apache.solr.handler.admin.AdminHandlers
[junit4:junit4]   2> 10371 T992 oasc.RequestHandlers.initHandlersFromConfig created defaults: solr.StandardRequestHandler
[junit4:junit4]   2> 10371 T992 oasc.RequestHandlers.initHandlersFromConfig adding lazy requestHandler: solr.StandardRequestHandler
[junit4:junit4]   2> 10371 T992 oasc.RequestHandlers.initHandlersFromConfig created lazy: solr.StandardRequestHandler
[junit4:junit4]   2> 10372 T992 oasc.RequestHandlers.initHandlersFromConfig created /update: solr.UpdateRequestHandler
[junit4:junit4]   2> 10373 T992 oasc.RequestHandlers.initHandlersFromConfig created /terms: org.apache.solr.handler.component.SearchHandler
[junit4:junit4]   2> 10374 T992 oasc.RequestHandlers.initHandlersFromConfig created spellCheckCompRH: org.apache.solr.handler.component.SearchHandler
[junit4:junit4]   2> 10375 T992 oasc.RequestHandlers.initHandlersFromConfig created spellCheckCompRH_Direct: org.apache.solr.handler.component.SearchHandler
[junit4:junit4]   2> 10376 T992 oasc.RequestHandlers.initHandlersFromConfig created spellCheckWithWordbreak: org.apache.solr.handler.component.SearchHandler
[junit4:junit4]   2> 10377 T992 oasc.RequestHandlers.initHandlersFromConfig created spellCheckWithWordbreak_Direct: org.apache.solr.handler.component.SearchHandler
[junit4:junit4]   2> 10378 T992 oasc.RequestHandlers.initHandlersFromConfig created spellCheckCompRH1: org.apache.solr.handler.component.SearchHandler
[junit4:junit4]   2> 10379 T992 oasc.RequestHandlers.initHandlersFromConfig created tvrh: org.apache.solr.handler.component.SearchHandler
[junit4:junit4]   2> 10379 T992 oasc.RequestHandlers.initHandlersFromConfig created /mlt: solr.MoreLikeThisHandler
[junit4:junit4]   2> 10381 T992 oasc.RequestHandlers.initHandlersFromConfig created /debug/dump: solr.DumpRequestHandler
[junit4:junit4]   2> 10389 T992 oashl.XMLLoader.init xsltCacheLifetimeSeconds=60
[junit4:junit4]   2> 10394 T992 oasc.SolrCore.initDeprecatedSupport WARNING solrconfig.xml uses deprecated <admin/gettableFiles>, Please update your config to use the ShowFileRequestHandler.
[junit4:junit4]   2> 10396 T992 oasc.SolrCore.initDeprecatedSupport WARNING adding ShowFileRequestHandler with hidden files: [SCHEMA.XML, OLD_SYNONYMS.TXT, STOPWORDS.TXT, PROTWORDS.TXT, OPEN-EXCHANGE-RATES.JSON, SYNONYMS.TXT, CURRENCY.XML, MAPPING-ISOLATIN1ACCENT.TXT]
[junit4:junit4]   2> 10399 T992 oasc.CachingDirectoryFactory.close Releasing directory:C:\Users\JenkinsSlave\workspace\Lucene-Solr-trunk-Windows\solr\build\solr-core\test\J0\.\org.apache.solr.cloud.BasicDistributedZkTest-1352378471569\jetty4
[junit4:junit4]   2> 10401 T992 oass.SolrIndexSearcher.<init> Opening Searcher@9e3de9 main
[junit4:junit4]   2> 10403 T992 oasu.CommitTracker.<init> Hard AutoCommit: disabled
[junit4:junit4]   2> 10403 T992 oasu.CommitTracker.<init> Soft AutoCommit: disabled
[junit4:junit4]   2> 10404 T992 oashc.SpellCheckComponent.inform Initializing spell checkers
[junit4:junit4]   2> 10414 T992 oass.DirectSolrSpellChecker.init init: {name=direct,classname=DirectSolrSpellChecker,field=lowerfilt,minQueryLength=3}
[junit4:junit4]   2> 10476 T1067 oasc.SolrCore.registerSearcher [collection1] Registered new searcher Searcher@9e3de9 main{StandardDirectoryReader(segments_1:1)}
[junit4:junit4]   2> 10480 T992 oasc.ZkController.publish numShards not found on descriptor - reading it from system property
[junit4:junit4]   2> 10488 T1013 oascc.ZkStateReader.updateClusterState Updating cloud state from ZooKeeper... 
[junit4:junit4]   2> 10488 T1013 oasc.Overseer$ClusterStateUpdater.updateState Update state numShards=2 message={
[junit4:junit4]   2> 	  "operation":"state",
[junit4:junit4]   2> 	  "numShards":"2",
[junit4:junit4]   2> 	  "shard":null,
[junit4:junit4]   2> 	  "roles":null,
[junit4:junit4]   2> 	  "state":"down",
[junit4:junit4]   2> 	  "core":"collection1",
[junit4:junit4]   2> 	  "collection":"collection1",
[junit4:junit4]   2> 	  "node_name":"127.0.0.1:59435_solr",
[junit4:junit4]   2> 	  "base_url":"http://127.0.0.1:59435/solr"}
[junit4:junit4]   2> 10495 T1012 oascc.ZkStateReader$2.process A cluster state change has occurred - updating... (5)
[junit4:junit4]   2> 10495 T1028 oascc.ZkStateReader$2.process A cluster state change has occurred - updating... (5)
[junit4:junit4]   2> 10495 T1017 oascc.ZkStateReader$2.process A cluster state change has occurred - updating... (5)
[junit4:junit4]   2> 10495 T1040 oascc.ZkStateReader$2.process A cluster state change has occurred - updating... (5)
[junit4:junit4]   2> 10496 T1052 oascc.ZkStateReader$2.process A cluster state change has occurred - updating... (5)
[junit4:junit4]   2>  C94_STATE=coll:collection1 core:collection1 props:{shard=shard1, roles=null, state=recovering, core=collection1, collection=collection1, node_name=127.0.0.1:59427_solr, base_url=http://127.0.0.1:59427/solr}
[junit4:junit4]   2> 11998 T1054 C94 P59427 oasc.RecoveryStrategy.doRecovery Begin buffering updates. core=collection1
[junit4:junit4]   2> 11998 T1054 C94 P59427 oasu.UpdateLog.bufferUpdates Starting to buffer updates. FSUpdateLog{state=ACTIVE, tlog=null}
[junit4:junit4]   2> 11998 T1054 C94 P59427 oasc.RecoveryStrategy.replicate Attempting to replicate from http://127.0.0.1:59415/solr/collection1/. core=collection1
[junit4:junit4]   2> 11998 T1054 C94 P59427 oascsi.HttpClientUtil.createClient Creating new http client, config:maxConnections=128&maxConnectionsPerHost=32&followRedirects=false
[junit4:junit4]   2> 12009 T1026 C95 P59415 oasu.DirectUpdateHandler2.commit start commit{flags=0,_version_=0,optimize=false,openSearcher=false,waitSearcher=true,expungeDeletes=false,softCommit=false}
[junit4:junit4]   2> 12011 T1026 C95 P59415 oasc.CachingDirectoryFactory.close Releasing directory:C:\Users\JenkinsSlave\workspace\Lucene-Solr-trunk-Windows\solr\build\solr-core\test\J0\.\org.apache.solr.cloud.BasicDistributedZkTest-1352378471569\jetty1
[junit4:junit4]   2> 12020 T1026 C95 P59415 oasc.SolrDeletionPolicy.onInit SolrDeletionPolicy.onInit: commits:num=1
[junit4:junit4]   2> 		commit{dir=NRTCachingDirectory(org.apache.lucene.store.SimpleFSDirectory@C:\Users\JenkinsSlave\workspace\Lucene-Solr-trunk-Windows\solr\build\solr-core\test\J0\org.apache.solr.cloud.BasicDistributedZkTest-1352378471569\jetty1\index lockFactory=org.apache.lucene.store.NativeFSLockFactory@9c7caa; maxCacheMB=48.0 maxMergeSizeMB=4.0),segFN=segments_1,generation=1,filenames=[segments_1]
[junit4:junit4]   2> 12021 T1026 C95 P59415 oasc.SolrDeletionPolicy.updateCommits newest commit = 1[segments_1]
[junit4:junit4]   2> 12022 T1026 C95 P59415 oasc.CachingDirectoryFactory.close Releasing directory:C:\Users\JenkinsSlave\workspace\Lucene-Solr-trunk-Windows\solr\build\solr-core\test\J0\.\org.apache.solr.cloud.BasicDistributedZkTest-1352378471569\jetty1
[junit4:junit4]   2> 12022 T1026 C95 P59415 oass.SolrIndexSearcher.<init> Opening Searcher@17fcfbd realtime
[junit4:junit4]   2> 12022 T1026 C95 P59415 oasu.DirectUpdateHandler2.commit end_commit_flush
[junit4:junit4]   2> 12022 T1026 C95 P59415 /update {waitSearcher=true&openSearcher=false&commit=true&commit_end_point=true&wt=javabin&softCommit=false&version=2} {commit=} 0 13
[junit4:junit4]   2> 12024 T1054 C94 P59427 oash.ReplicationHandler.inform Commits will be reserved for  10000
[junit4:junit4]   2> 12024 T1054 C94 P59427 oash.SnapPuller.<init>  No value set for 'pollInterval'. Timer Task not started.
[junit4:junit4]   2> 12028 T1025 C95 P59415 oash.ReplicationHandler.inform Commits will be reserved for  10000
[junit4:junit4]   2> 12028 T1025 C95 P59415 REQ /replication {command=indexversion&wt=javabin&qt=/replication&version=2} status=0 QTime=2 
[junit4:junit4]   2> 12029 T1054 C94 P59427 oasc.CachingDirectoryFactory.close Releasing directory:C:\Users\JenkinsSlave\workspace\Lucene-Solr-trunk-Windows\solr\build\solr-core\test\J0\.\org.apache.solr.cloud.BasicDistributedZkTest-1352378471569\jetty3
[junit4:junit4]   2> 12033 T1054 C94 P59427 oasc.SolrDeletionPolicy.onInit SolrDeletionPolicy.onInit: commits:num=1
[junit4:junit4]   2> 		commit{dir=NRTCachingDirectory(org.apache.lucene.store.SimpleFSDirectory@C:\Users\JenkinsSlave\workspace\Lucene-Solr-trunk-Windows\solr\build\solr-core\test\J0\org.apache.solr.cloud.BasicDistributedZkTest-1352378471569\jetty3\index lockFactory=org.apache.lucene.store.NativeFSLockFactory@1945d91; maxCacheMB=48.0 maxMergeSizeMB=4.0),segFN=segments_1,generation=1,filenames=[segments_1]
[junit4:junit4]   2> 12034 T1054 C94 P59427 oasc.SolrDeletionPolicy.updateCommits newest commit = 1[segments_1]
[junit4:junit4]   2> 12034 T1054 C94 P59427 oasu.DirectUpdateHandler2.commit start commit{flags=0,_version_=0,optimize=false,openSearcher=true,waitSearcher=true,expungeDeletes=false,softCommit=false}
[junit4:junit4]   2> 12046 T1054 C94 P59427 oasc.SolrDeletionPolicy.onCommit SolrDeletionPolicy.onCommit: commits:num=2
[junit4:junit4]   2> 		commit{dir=NRTCachingDirectory(org.apache.lucene.store.SimpleFSDirectory@C:\Users\JenkinsSlave\workspace\Lucene-Solr-trunk-Windows\solr\build\solr-core\test\J0\org.apache.solr.cloud.BasicDistributedZkTest-1352378471569\jetty3\index lockFactory=org.apache.lucene.store.NativeFSLockFactory@1945d91; maxCacheMB=48.0 maxMergeSizeMB=4.0),segFN=segments_1,generation=1,filenames=[segments_1]
[junit4:junit4]   2> 		commit{dir=NRTCachingDirectory(org.apache.lucene.store.SimpleFSDirectory@C:\Users\JenkinsSlave\workspace\Lucene-Solr-trunk-Windows\solr\build\solr-core\test\J0\org.apache.solr.cloud.BasicDistributedZkTest-1352378471569\jetty3\index lockFactory=org.apache.lucene.store.NativeFSLockFactory@1945d91; maxCacheMB=48.0 maxMergeSizeMB=4.0),segFN=segments_2,generation=2,filenames=[segments_2]
[junit4:junit4]   2> 12046 T1054 C94 P59427 oasc.SolrDeletionPolicy.updateCommits newest commit = 2[segments_2]
[junit4:junit4]   2> 12049 T1054 C94 P59427 oasc.CachingDirectoryFactory.close Releasing directory:C:\Users\JenkinsSlave\workspace\Lucene-Solr-trunk-Windows\solr\build\solr-core\test\J0\.\org.apache.solr.cloud.BasicDistributedZkTest-1352378471569\jetty3
[junit4:junit4]   2> 12055 T1054 C94 P59427 oass.SolrIndexSearcher.<init> Opening Searcher@1bbc6da main
[junit4:junit4]   2> 12055 T1054 C94 P59427 oasu.DirectUpdateHandler2.commit end_commit_flush
[junit4:junit4]   2> 12055 T1053 oasc.SolrCore.registerSearcher [collection1] Registered new searcher Searcher@1bbc6da main{StandardDirectoryReader(segments_2:2)}
[junit4:junit4]   2> 12056 T1053 oasc.CachingDirectoryFactory.close Releasing directory:C:\Users\JenkinsSlave\workspace\Lucene-Solr-trunk-Windows\solr\build\solr-core\test\J0\.\org.apache.solr.cloud.BasicDistributedZkTest-1352378471569\jetty3\index
[junit4:junit4]   2> 12056 T1054 C94 P59427 oasc.RecoveryStrategy.replay No replay needed. core=collection1
[junit4:junit4]   2> 12056 T1054 C94 P59427 oasc.RecoveryStrategy.doRecovery Replication Recovery was successful - registering as Active. core=collection1
[junit4:junit4]   2> 12056 T1054 C94 P59427 oasc.ZkController.publish numShards not found on descriptor - reading it from system property
[junit4:junit4]   2> 12059 T1054 C94 P59427 oasc.RecoveryStrategy.doRecovery Finished recovery process. core=collection1
[junit4:junit4]   2> 12510 T1013 oascc.ZkStateReader.updateClusterState Updating cloud state from ZooKeeper... 
[junit4:junit4]   2> 12512 T1013 oasc.Overseer$ClusterStateUpdater.updateState Update state numShards=2 message={
[junit4:junit4]   2> 	  "operation":"state",
[junit4:junit4]   2> 	  "numShards":"2",
[junit4:junit4]   2> 	  "shard":"shard1",
[junit4:junit4]   2> 	  "roles":null,
[junit4:junit4]   2> 	  "state":"active",
[junit4:junit4]   2> 	  "core":"collection1",
[junit4:junit4]   2> 	  "collection":"collection1",
[junit4:junit4]   2> 	  "node_name":"127.0.0.1:59427_solr",
[junit4:junit4]   2> 	  "base_url":"http://127.0.0.1:59427/solr"}
[junit4:junit4]   2> 12520 T1012 oascc.ZkStateReader$2.process A cluster state change has occurred - updating... (5)
[junit4:junit4]   2> 12520 T1028 oascc.ZkStateReader$2.process A cluster state change has occurred - updating... (5)
[junit4:junit4]   2> 12520 T1040 oascc.ZkStateReader$2.process A cluster state change has occurred - updating... (5)
[junit4:junit4]   2> 12520 T1017 oascc.ZkStateReader$2.process A cluster state change has occurred - updating... (5)
[junit4:junit4]   2> 12520 T1052 oascc.ZkStateReader$2.process A cluster state change has occurred - updating... (5)
[junit4:junit4]   2> 70762 T992 oasc.SolrException.log SEVERE null:org.apache.solr.common.SolrException: Could not get shard_id for core: collection1
[junit4:junit4]   2> 		at org.apache.solr.cloud.ZkController.doGetShardIdProcess(ZkController.java:998)
[junit4:junit4]   2> 		at org.apache.solr.cloud.ZkController.preRegister(ZkController.java:1056)
[junit4:junit4]   2> 		at org.apache.solr.core.CoreContainer.registerCore(CoreContainer.java:716)
[junit4:junit4]   2> 		at org.apache.solr.core.CoreContainer.register(CoreContainer.java:696)
[junit4:junit4]   2> 		at org.apache.solr.core.CoreContainer.load(CoreContainer.java:565)
[junit4:junit4]   2> 		at org.apache.solr.core.CoreContainer.load(CoreContainer.java:375)
[junit4:junit4]   2> 		at org.apache.solr.core.CoreContainer$Initializer.initialize(CoreContainer.java:307)
[junit4:junit4]   2> 		at org.apache.solr.servlet.SolrDispatchFilter.init(SolrDispatchFilter.java:107)
[junit4:junit4]   2> 		at org.eclipse.jetty.servlet.FilterHolder.doStart(FilterHolder.java:119)
[junit4:junit4]   2> 		at org.eclipse.jetty.util.component.AbstractLifeCycle.start(AbstractLifeCycle.java:64)
[junit4:junit4]   2> 		at org.eclipse.jetty.servlet.ServletHandler.initialize(ServletHandler.java:724)
[junit4:junit4]   2> 		at org.eclipse.jetty.servlet.ServletHandler.updateMappings(ServletHandler.java:1197)
[junit4:junit4]   2> 		at org.eclipse.jetty.servlet.ServletHandler.setFilterMappings(ServletHandler.java:1233)
[junit4:junit4]   2> 		at org.eclipse.jetty.servlet.ServletHandler.addFilterWithMapping(ServletHandler.java:935)
[junit4:junit4]   2> 		at org.eclipse.jetty.servlet.ServletHandler.addFilterWithMapping(ServletHandler.java:893)
[junit4:junit4]   2> 		at org.eclipse.jetty.servlet.ServletContextHandler.addFilter(ServletContextHandler.java:338)
[junit4:junit4]   2> 		at org.apache.solr.client.solrj.embedded.JettySolrRunner$1.lifeCycleStarted(JettySolrRunner.java:173)
[junit4:junit4]   2> 		at org.eclipse.jetty.util.component.AbstractLifeCycle.setStarted(AbstractLifeCycle.java:174)
[junit4:junit4]   2> 		at org.eclipse.jetty.util.component.AbstractLifeCycle.start(AbstractLifeCycle.java:65)
[junit4:junit4]   2> 		at org.apache.solr.client.solrj.embedded.JettySolrRunner.start(JettySolrRunner.java:225)
[junit4:junit4]   2> 		at org.apache.solr.client.solrj.embedded.JettySolrRunner.start(JettySolrRunner.java:205)
[junit4:junit4]   2> 		at org.apache.solr.BaseDistributedSearchTestCase.createJetty(BaseDistributedSearchTestCase.java:262)
[junit4:junit4]   2> 		at org.apache.solr.cloud.AbstractFullDistribZkTestBase.createJettys(AbstractFullDistribZkTestBase.java:292)
[junit4:junit4]   2> 		at org.apache.solr.cloud.AbstractFullDistribZkTestBase.createServers(AbstractFullDistribZkTestBase.java:245)
[junit4:junit4]   2> 		at org.apache.solr.BaseDistributedSearchTestCase.testDistribSearch(BaseDistributedSearchTestCase.java:693)
[junit4:junit4]   2> 		at sun.reflect.NativeMethodAccessorImpl.invoke0(Native Method)
[junit4:junit4]   2> 		at sun.reflect.NativeMethodAccessorImpl.invoke(NativeMethodAccessorImpl.java:39)
[junit4:junit4]   2> 		at sun.reflect.DelegatingMethodAccessorImpl.invoke(DelegatingMethodAccessorImpl.java:25)
[junit4:junit4]   2> 		at java.lang.reflect.Method.invoke(Method.java:597)
[junit4:junit4]   2> 		at com.carrotsearch.randomizedtesting.RandomizedRunner.invoke(RandomizedRunner.java:1559)
[junit4:junit4]   2> 		at com.carrotsearch.randomizedtesting.RandomizedRunner.access$600(RandomizedRunner.java:79)
[junit4:junit4]   2> 		at com.carrotsearch.randomizedtesting.RandomizedRunner$6.evaluate(RandomizedRunner.java:737)
[junit4:junit4]   2> 		at com.carrotsearch.randomizedtesting.RandomizedRunner$7.evaluate(RandomizedRunner.java:773)
[junit4:junit4]   2> 		at com.carrotsearch.randomizedtesting.RandomizedRunner$8.evaluate(RandomizedRunner.java:787)
[junit4:junit4]   2> 		at com.carrotsearch.randomizedtesting.rules.SystemPropertiesRestoreRule$1.evaluate(SystemPropertiesRestoreRule.java:53)
[junit4:junit4]   2> 		at org.apache.lucene.util.TestRuleSetupTeardownChained$1.evaluate(TestRuleSetupTeardownChained.java:50)
[junit4:junit4]   2> 		at org.apache.lucene.util.TestRuleFieldCacheSanity$1.evaluate(TestRuleFieldCacheSanity.java:51)
[junit4:junit4]   2> 		at org.apache.lucene.util.AbstractBeforeAfterRule$1.evaluate(AbstractBeforeAfterRule.java:45)
[junit4:junit4]   2> 		at com.carrotsearch.randomizedtesting.rules.SystemPropertiesInvariantRule$1.evaluate(SystemPropertiesInvariantRule.java:55)
[junit4:junit4]   2> 		at org.apache.lucene.util.TestRuleThreadAndTestName$1.evaluate(TestRuleThreadAndTestName.java:48)
[junit4:junit4]   2> 		at org.apache.lucene.util.TestRuleIgnoreAfterMaxFailures$1.evaluate(TestRuleIgnoreAfterMaxFailures.java:70)
[junit4:junit4]   2> 		at org.apache.lucene.util.TestRuleMarkFailure$1.evaluate(TestRuleMarkFailure.java:48)
[junit4:junit4]   2> 		at com.carrotsearch.randomizedtesting.rules.StatementAdapter.evaluate(StatementAdapter.java:36)
[junit4:junit4]   2> 		at com.carrotsearch.randomizedtesting.ThreadLeakControl$StatementRunner.run(ThreadLeakControl.java:358)
[junit4:junit4]   2> 		at com.carrotsearch.randomizedtesting.ThreadLeakControl.forkTimeoutingTask(ThreadLeakControl.java:782)
[junit4:junit4]   2> 		at com.carrotsearch.randomizedtesting.ThreadLeakControl$3.evaluate(ThreadLeakControl.java:442)
[junit4:junit4]   2> 		at com.carrotsearch.randomizedtesting.RandomizedRunner.runSingleTest(RandomizedRunner.java:746)
[junit4:junit4]   2> 		at com.carrotsearch.randomizedtesting.RandomizedRunner$3.evaluate(RandomizedRunner.java:648)
[junit4:junit4]   2> 		at com.carrotsearch.randomizedtesting.RandomizedRunner$4.evaluate(RandomizedRunner.java:682)
[junit4:junit4]   2> 		at com.carrotsearch.randomizedtesting.RandomizedRunner$5.evaluate(RandomizedRunner.java:693)
[junit4:junit4]   2> 		at com.carrotsearch.randomizedtesting.rules.StatementAdapter.evaluate(StatementAdapter.java:36)
[junit4:junit4]   2> 		at com.carrotsearch.randomizedtesting.rules.SystemPropertiesRestoreRule$1.evaluate(SystemPropertiesRestoreRule.java:53)
[junit4:junit4]   2> 		at org.apache.lucene.util.AbstractBeforeAfterRule$1.evaluate(AbstractBeforeAfterRule.java:45)
[junit4:junit4]   2> 		at org.apache.lucene.util.TestRuleStoreClassName$1.evaluate(TestRuleStoreClassName.java:42)
[junit4:junit4]   2> 		at com.carrotsearch.randomizedtesting.rules.SystemPropertiesInvariantRule$1.evaluate(SystemPropertiesInvariantRule.java:55)
[junit4:junit4]   2> 		at com.carrotsearch.randomizedtesting.rules.NoShadowingOrOverridesOnMethodsRule$1.evaluate(NoShadowingOrOverridesOnMethodsRule.java:39)
[junit4:junit4]   2> 		at com.carrotsearch.randomizedtesting.rules.NoShadowingOrOverridesOnMethodsRule$1.evaluate(NoShadowingOrOverridesOnMethodsRule.java:39)
[junit4:junit4]   2> 		at com.carrotsearch.randomizedtesting.rules.StatementAdapter.evaluate(StatementAdapter.java:36)
[junit4:junit4]   2> 		at org.apache.lucene.util.TestRuleAssertionsRequired$1.evaluate(TestRuleAssertionsRequired.java:43)
[junit4:junit4]   2> 		at org.apache.lucene.util.TestRuleMarkFailure$1.evaluate(TestRuleMarkFailure.java:48)
[junit4:junit4]   2> 		at org.apache.lucene.util.TestRuleIgnoreAfterMaxFailures$1.evaluate(TestRuleIgnoreAfterMaxFailures.java:70)
[junit4:junit4]   2> 		at org.apache.lucene.util.TestRuleIgnoreTestSuites$1.evaluate(TestRuleIgnoreTestSuites.java:55)
[junit4:junit4]   2> 		at com.carrotsearch.randomizedtesting.rules.StatementAdapter.evaluate(StatementAdapter.java:36)
[junit4:junit4]   2> 		at com.carrotsearch.randomizedtesting.ThreadLeakControl$StatementRunner.run(ThreadLeakControl.java:358)
[junit4:junit4]   2> 		at java.lang.Thread.run(Thread.java:662)
[junit4:junit4]   2> 	
[junit4:junit4]   2> 70763 T992 oasc.SolrCore.close [collection1]  CLOSING SolrCore org.apache.solr.core.SolrCore@137500e
[junit4:junit4]   2> 70774 T992 oasu.DirectUpdateHandler2.close closing DirectUpdateHandler2{commits=0,autocommits=0,soft autocommits=0,optimizes=0,rollbacks=0,expungeDeletes=0,docsPending=0,adds=0,deletesById=0,deletesByQuery=0,errors=0,cumulative_adds=0,cumulative_deletesById=0,cumulative_deletesByQuery=0,cumulative_errors=0}
[junit4:junit4]   2> 70774 T992 oasc.SolrCore.decrefSolrCoreState Closing SolrCoreState
[junit4:junit4]   2> 70775 T992 oasu.DefaultSolrCoreState.closeIndexWriter SolrCoreState ref count has reached 0 - closing IndexWriter
[junit4:junit4]   2> 70775 T992 oasu.DefaultSolrCoreState.closeIndexWriter closing IndexWriter with IndexWriterCloser
[junit4:junit4]   2> 70776 T992 oasc.SolrCore.closeSearcher [collection1] Closing main searcher on request.
[junit4:junit4]   2> 70776 T992 oasc.CachingDirectoryFactory.close Releasing directory:C:\Users\JenkinsSlave\workspace\Lucene-Solr-trunk-Windows\solr\build\solr-core\test\J0\.\org.apache.solr.cloud.BasicDistributedZkTest-1352378471569\jetty4\index
[junit4:junit4]   2> 70776 T992 oass.SolrDispatchFilter.init user.dir=C:\Users\JenkinsSlave\workspace\Lucene-Solr-trunk-Windows\solr\build\solr-core\test\J0
[junit4:junit4]   2> 70776 T992 oass.SolrDispatchFilter.init SolrDispatchFilter.init() done
[junit4:junit4]   2> 70778 T992 oascsi.HttpClientUtil.createClient Creating new http client, config:maxConnections=128&maxConnectionsPerHost=32&followRedirects=false
[junit4:junit4]   2> 70785 T992 oascc.ZkStateReader.updateClusterState Updating cloud state from ZooKeeper... 
[junit4:junit4]   2> 70786 T992 oasc.AbstractDistribZkTestBase.waitForRecoveriesToFinish Wait for recoveries to finish - collection: collection1 failOnTimeout:true timeout (sec):180
[junit4:junit4]   2> 70787 T992 oascc.ZkStateReader.updateClusterState Updating cloud state from ZooKeeper... 
[junit4:junit4]   2> 71759 T992 oascc.ZkStateReader.updateClusterState Updating cloud state from ZooKeeper... 
[junit4:junit4]   2> 72732 T992 oascc.ZkStateReader.updateClusterState Updating cloud state from ZooKeeper... 
[junit4:junit4]   2> 73704 T992 oascc.ZkStateReader.updateClusterState Updating cloud state from ZooKeeper... 
[junit4:junit4]   2> 74677 T992 oascc.ZkStateReader.updateClusterState Updating cloud state from ZooKeeper... 
[junit4:junit4]   2> 75649 T992 oascc.ZkStateReader.updateClusterState Updating cloud state from ZooKeeper... 
[junit4:junit4]   2> 76677 T992 oascc.ZkStateReader.updateClusterState Updating cloud state from ZooKeeper... 
[junit4:junit4]   2> 77746 T992 oascc.ZkStateReader.updateClusterState Updating cloud state from ZooKeeper... 
[junit4:junit4]   2> 78816 T992 oascc.ZkStateReader.updateClusterState Updating cloud state from ZooKeeper... 
[junit4:junit4]   2> 79885 T992 oascc.ZkStateReader.updateClusterState Updating cloud state from ZooKeeper... 
[junit4:junit4]   2> 80955 T992 oascc.ZkStateReader.updateClusterState Updating cloud state from ZooKeeper... 
[junit4:junit4]   2> 82025 T992 oascc.ZkStateReader.updateClusterState Updating cloud state from ZooKeeper... 
[junit4:junit4]   2> 83094 T992 oascc.ZkStateReader.updateClusterState Updating cloud state from ZooKeeper... 
[junit4:junit4]   2> 84164 T992 oascc.ZkStateReader.updateClusterState Updating cloud state from ZooKeeper... 
[junit4:junit4]   2> 85232 T992 oascc.ZkStateReader.updateClusterState Updating cloud state from ZooKeeper... 
[junit4:junit4]   2> 86302 T992 oascc.ZkStateReader.updateClusterState Updating cloud state from ZooKeeper... 
[junit4:junit4]   2> 87438 T992 oascc.ZkStateReader.updateClusterState Updating cloud state from ZooKeeper... 
[junit4:junit4]   2> 88614 T992 oascc.ZkStateReader.updateClusterState Updating cloud state from ZooKeeper... 
[junit4:junit4]   2> 89791 T992 oascc.ZkStateReader.updateClusterState Updating cloud state from ZooKeeper... 
[junit4:junit4]   2> 90970 T992 oascc.ZkStateReader.updateClusterState Updating cloud state from ZooKeeper... 
[junit4:junit4]   2> 92147 T992 oascc.ZkStateReader.updateClusterState Updating cloud state from ZooKeeper... 
[junit4:junit4]   2> 93324 T992 oascc.ZkStateReader.updateClusterState Updating cloud state from ZooKeeper... 
[junit4:junit4]   2> 94500 T992 oascc.ZkStateReader.updateClusterState Updating cloud state from ZooKeeper... 
[junit4:junit4]   2> 95676 T992 oascc.ZkStateReader.updateClusterState Updating cloud state from ZooKeeper... 
[junit4:junit4]   2> 96854 T992 oascc.ZkStateReader.updateClusterState Updating cloud state from ZooKeeper... 
[junit4:junit4]   2> 98032 T992 oascc.ZkStateReader.updateClusterState Updating cloud state from ZooKeeper... 
[junit4:junit4]   2> 99135 T992 oascc.ZkStateReader.updateClusterState Updating cloud state from ZooKeeper... 
[junit4:junit4]   2> 100193 T992 oascc.ZkStateReader.updateClusterState Updating cloud state from ZooKeeper... 
[junit4:junit4]   2> 101251 T992 oascc.ZkStateReader.updateClusterState Updating cloud state from ZooKeeper... 
[junit4:junit4]   2> 102311 T992 oascc.ZkStateReader.updateClusterState Updating cloud state from ZooKeeper... 
[junit4:junit4]   2> 103370 T992 oascc.ZkStateReader.updateClusterState Updating cloud state from ZooKeeper... 
[junit4:junit4]   2> 104428 T992 oascc.ZkStateReader.updateClusterState Updating cloud state from ZooKeeper... 
[junit4:junit4]   2> 105486 T992 oascc.ZkStateReader.updateClusterState Updating cloud state from ZooKeeper... 
[junit4:junit4]   2> 106546 T992 oascc.ZkStateReader.updateClusterState Updating cloud state from ZooKeeper... 
[junit4:junit4]   2> 107607 T992 oascc.ZkStateReader.updateClusterState Updating cloud state from ZooKeeper... 
[junit4:junit4]   2> 108665 T992 oascc.ZkStateReader.updateClusterState Updating cloud state from ZooKeeper... 
[junit4:junit4]   2> 109656 T992 oascc.ZkStateReader.updateClusterState Updating cloud state from ZooKeeper... 
[junit4:junit4]   2> 110610 T992 oascc.ZkStateReader.updateClusterState Updating cloud state from ZooKeeper... 
[junit4:junit4]   2> 111562 T992 oascc.ZkStateReader.updateClusterState Updating cloud state from ZooKeeper... 
[junit4:junit4]   2> 112515 T992 oascc.ZkStateReader.updateClusterState Updating cloud state from ZooKeeper... 
[junit4:junit4]   2> 113469 T992 oascc.ZkStateReader.updateClusterState Updating cloud state from ZooKeeper... 
[junit4:junit4]   2> 114422 T992 oascc.ZkStateReader.updateClusterState Updating cloud state from ZooKeeper... 
[junit4:junit4]   2> 115376 T992 oascc.ZkStateReader.updateClusterState Updating cloud state from ZooKeeper... 
[junit4:junit4]   2> 116329 T992 oascc.ZkStateReader.updateClusterState Updating cloud state from ZooKeeper... 
[junit4:junit4]   2> 117283 T992 oascc.ZkStateReader.updateClusterState Updating cloud state from ZooKeeper... 
[junit4:junit4]   2> 118236 T992 oascc.ZkStateReader.updateClusterState Updating cloud state from ZooKeeper... 
[junit4:junit4]   2> 119254 T992 oascc.ZkStateReader.updateClusterState Updating cloud state from ZooKeeper... 
[junit4:junit4]   2> 120303 T992 oascc.ZkStateReader.updateClusterState Updating cloud state from ZooKeeper... 
[junit4:junit4]   2> 121350 T992 oascc.ZkStateReader.updateClusterState Updating cloud state from ZooKeeper... 
[junit4:junit4]   2> 122399 T992 oascc.ZkStateReader.updateClusterState Updating cloud state from ZooKeeper... 
[junit4:junit4]   2> 123448 T992 oascc.ZkStateReader.updateClusterState Updating cloud state from ZooKeeper... 
[junit4:junit4]   2> 124495 T992 oascc.ZkStateReader.updateClusterState Updating cloud state from ZooKeeper... 
[junit4:junit4]   2> 125544 T992 oascc.ZkStateReader.updateClusterState Updating cloud state from ZooKeeper... 
[junit4:junit4]   2> 126593 T992 oascc.ZkStateReader.updateClusterState Updating cloud state from ZooKeeper... 
[junit4:junit4]   2> 127641 T992 oascc.ZkStateReader.updateClusterState Updating cloud state from ZooKeeper... 
[junit4:junit4]   2> 128690 T992 oascc.ZkStateReader.updateClusterState Updating cloud state from ZooKeeper... 
[junit4:junit4]   2> 129706 T992 oascc.ZkStateReader.updateClusterState Updating cloud state from ZooKeeper... 
[junit4:junit4]   2> 130707 T992 oascc.ZkStateReader.updateClusterState Updating cloud state from ZooKeeper... 
[junit4:junit4]   2> 131708 T992 oascc.ZkStateReader.updateClusterState Updating cloud state from ZooKeeper... 
[junit4:junit4]   2> 132710 T992 oascc.ZkStateReader.updateClusterState Updating cloud state from ZooKeeper... 
[junit4:junit4]   2> 133712 T992 oascc.ZkStateReader.updateClusterState Updating cloud state from ZooKeeper... 
[junit4:junit4]   2> 134713 T992 oascc.ZkStateReader.updateClusterState Updating cloud state from ZooKeeper... 
[junit4:junit4]   2> 135714 T992 oascc.ZkStateReader.updateClusterState Updating cloud state from ZooKeeper... 
[junit4:junit4]   2> 136715 T992 oascc.ZkStateReader.updateClusterState Updating cloud state from ZooKeeper... 
[junit4:junit4]   2> 137717 T992 oascc.ZkStateReader.updateClusterState Updating cloud state from ZooKeeper... 
[junit4:junit4]   2> 138719 T992 oascc.ZkStateReader.updateClusterState Updating cloud state from ZooKeeper... 
[junit4:junit4]   2> 139721 T992 oascc.ZkStateReader.updateClusterState Updating cloud state from ZooKeeper... 
[junit4:junit4]   2> 140723 T992 oascc.ZkStateReader.updateClusterState Updating cloud state from ZooKeeper... 
[junit4:junit4]   2> 141724 T992 oascc.ZkStateReader.updateClusterState Updating cloud state from ZooKeeper... 
[junit4:junit4]   2> 142725 T992 oascc.ZkStateReader.updateClusterState Updating cloud state from ZooKeeper... 
[junit4:junit4]   2> 143728 T992 oascc.ZkStateReader.updateClusterState Updating cloud state from ZooKeeper... 
[junit4:junit4]   2> 144730 T992 oascc.ZkStateReader.updateClusterState Updating cloud state from ZooKeeper... 
[junit4:junit4]   2> 145731 T992 oascc.ZkStateReader.updateClusterState Updating cloud state from ZooKeeper... 
[junit4:junit4]   2> 146733 T992 oascc.ZkStateReader.updateClusterState Updating cloud state from ZooKeeper... 
[junit4:junit4]   2> 147734 T992 oascc.ZkStateReader.updateClusterState Updating cloud state from ZooKeeper... 
[junit4:junit4]   2> 148737 T992 oascc.ZkStateReader.updateClusterState Updating cloud state from ZooKeeper... 
[junit4:junit4]   2> 149738 T992 oascc.ZkStateReader.updateClusterState Updating cloud state from ZooKeeper... 
[junit4:junit4]   2> 150739 T992 oascc.ZkStateReader.updateClusterState Updating cloud state from ZooKeeper... 
[junit4:junit4]   2> 151742 T992 oascc.ZkStateReader.updateClusterState Updating cloud state from ZooKeeper... 
[junit4:junit4]   2> 152743 T992 oascc.ZkStateReader.updateClusterState Updating cloud state from ZooKeeper... 
[junit4:junit4]   2> 153745 T992 oascc.ZkStateReader.updateClusterState Updating cloud state from ZooKeeper... 
[junit4:junit4]   2> 154747 T992 oascc.ZkStateReader.updateClusterState Updating cloud state from ZooKeeper... 
[junit4:junit4]   2> 155748 T992 oascc.ZkStateReader.updateClusterState Updating cloud state from ZooKeeper... 
[junit4:junit4]   2> 156750 T992 oascc.ZkStateReader.updateClusterState Updating cloud state from ZooKeeper... 
[junit4:junit4]   2> 157753 T992 oascc.ZkStateReader.updateClusterState Updating cloud state from ZooKeeper... 
[junit4:junit4]   2> 158755 T992 oascc.ZkStateReader.updateClusterState Updating cloud state from ZooKeeper... 
[junit4:junit4]   2> 159832 T992 oascc.ZkStateReader.updateClusterState Updating cloud state from ZooKeeper... 
[junit4:junit4]   2> 160935 T992 oascc.ZkStateReader.updateClusterState Updating cloud state from ZooKeeper... 
[junit4:junit4]   2> 162038 T992 oascc.ZkStateReader.updateClusterState Updating cloud state from ZooKeeper... 
[junit4:junit4]   2> 163139 T992 oascc.ZkStateReader.updateClusterState Updating cloud state from ZooKeeper... 
[junit4:junit4]   2> 164241 T992 oascc.ZkStateReader.updateClusterState Updating cloud state from ZooKeeper... 
[junit4:junit4]   2> 165343 T992 oascc.ZkStateReader.updateClusterState Updating cloud state from ZooKeeper... 
[junit4:junit4]   2> 166446 T992 oascc.ZkStateReader.updateClusterState Updating cloud state from ZooKeeper... 
[junit4:junit4]   2> 167549 T992 oascc.ZkStateReader.updateClusterState Updating cloud state from ZooKeeper... 
[junit4:junit4]   2> 168650 T992 oascc.ZkStateReader.updateClusterState Updating cloud state from ZooKeeper... 
[junit4:junit4]   2> 169752 T992 oascc.ZkStateReader.updateClusterState Updating cloud state from ZooKeeper... 
[junit4:junit4]   2> 170770 T992 oascc.ZkStateReader.updateClusterState Updating cloud state from ZooKeeper... 
[junit4:junit4]   2> 171764 T992 oascc.ZkStateReader.updateClusterState Updating cloud state from ZooKeeper... 
[junit4:junit4]   2> 172757 T992 oascc.ZkStateReader.updateClusterState Updating cloud state from ZooKeeper... 
[junit4:junit4]   2> 173748 T992 oascc.ZkStateReader.updateClusterState Updating cloud state from ZooKeeper... 
[junit4:junit4]   2> 174740 T992 oascc.ZkStateReader.updateClusterState Updating cloud state from ZooKeeper... 
[junit4:junit4]   2> 175733 T992 oascc.ZkStateReader.updateClusterState Updating cloud state from ZooKeeper... 
[junit4:junit4]   2> 176724 T992 oascc.ZkStateReader.updateClusterState Updating cloud state from ZooKeeper... 
[junit4:junit4]   2> 177717 T992 oascc.ZkStateReader.updateClusterState Updating cloud state from ZooKeeper... 
[junit4:junit4]   2> 178709 T992 oascc.ZkStateReader.updateClusterState Updating cloud state from ZooKeeper... 
[junit4:junit4]   2> 179700 T992 oascc.ZkStateReader.updateClusterState Updating cloud state from ZooKeeper... 
[junit4:junit4]   2> 180612 T992 oascc.ZkStateReader.updateClusterState Updating cloud state from ZooKeeper... 
[junit4:junit4]   2> 181505 T992 oascc.ZkStateReader.updateClusterState Updating cloud state from ZooKeeper... 
[junit4:junit4]   2> 182397 T992 oascc.ZkStateReader.updateClusterState Updating cloud state from ZooKeeper... 
[junit4:junit4]   2> 183290 T992 oascc.ZkStateReader.updateClusterState Updating cloud state from ZooKeeper... 
[junit4:junit4]   2> 184182 T992 oascc.ZkStateReader.updateClusterState Updating cloud state from ZooKeeper... 
[junit4:junit4]   2> 185075 T992 oascc.ZkStateReader.updateClusterState Updating cloud state from ZooKeeper... 
[junit4:junit4]   2> 185969 T992 oascc.ZkStateReader.updateClusterState Updating cloud state from ZooKeeper... 
[junit4:junit4]   2> 186861 T992 oascc.ZkStateReader.updateClusterState Updating cloud state from ZooKeeper... 
[junit4:junit4]   2> 187754 T992 oascc.ZkStateReader.updateClusterState Updating cloud state from ZooKeeper... 
[junit4:junit4]   2> 188646 T992 oascc.ZkStateReader.updateClusterState Updating cloud state from ZooKeeper... 
[junit4:junit4]   2> 189611 T992 oascc.ZkStateReader.updateClusterState Updating cloud state from ZooKeeper... 
[junit4:junit4]   2> 190592 T992 oascc.ZkStateReader.updateClusterState Updating cloud state from ZooKeeper... 
[junit4:junit4]   2> 191575 T992 oascc.ZkStateReader.updateClusterState Updating cloud state from ZooKeeper... 
[junit4:junit4]   2> 192556 T992 oascc.ZkStateReader.updateClusterState Updating cloud state from ZooKeeper... 
[junit4:junit4]   2> 193539 T992 oascc.ZkStateReader.updateClusterState Updating cloud state from ZooKeeper... 
[junit4:junit4]   2> 194521 T992 oascc.ZkStateReader.updateClusterState Updating cloud state from ZooKeeper... 
[junit4:junit4]   2> 195503 T992 oascc.ZkStateReader.updateClusterState Updating cloud state from ZooKeeper... 
[junit4:junit4]   2> 196485 T992 oascc.ZkStateReader.updateClusterState Updating cloud state from ZooKeeper... 
[junit4:junit4]   2> 197467 T992 oascc.ZkStateReader.updateClusterState Updating cloud state from ZooKeeper... 
[junit4:junit4]   2> 198448 T992 oascc.ZkStateReader.updateClusterState Updating cloud state from ZooKeeper... 
[junit4:junit4]   2> 199511 T992 oascc.ZkStateReader.updateClusterState Updating cloud state from ZooKeeper... 
[junit4:junit4]   2> 200591 T992 oascc.ZkStateReader.updateClusterState Updating cloud state from ZooKeeper... 
[junit4:junit4]   2> 201671 T992 oascc.ZkStateReader.updateClusterState Updating cloud state from ZooKeeper... 
[junit4:junit4]   2> 202753 T992 oascc.ZkStateReader.updateClusterState Updating cloud state from ZooKeeper... 
[junit4:junit4]   2> 203833 T992 oascc.ZkStateReader.updateClusterState Updating cloud state from ZooKeeper... 
[junit4:junit4]   2> 204913 T992 oascc.ZkStateReader.updateClusterState Updating cloud state from ZooKeeper... 
[junit4:junit4]   2> 205993 T992 oascc.ZkStateReader.updateClusterState Updating cloud state from ZooKeeper... 
[junit4:junit4]   2> 207072 T992 oascc.ZkStateReader.updateClusterState Updating cloud state from ZooKeeper... 
[junit4:junit4]   2> 208152 T992 oascc.ZkStateReader.updateClusterState Updating cloud state from ZooKeeper... 
[junit4:junit4]   2> 209232 T992 oascc.ZkStateReader.updateClusterState Updating cloud state from ZooKeeper... 
[junit4:junit4]   2> 210403 T992 oascc.ZkStateReader.updateClusterState Updating cloud state from ZooKeeper... 
[junit4:junit4]   2> 211593 T992 oascc.ZkStateReader.updateClusterState Updating cloud state from ZooKeeper... 
[junit4:junit4]   2> 212782 T992 oascc.ZkStateReader.updateClusterState Updating cloud state from ZooKeeper... 
[junit4:junit4]   2> 213970 T992 oascc.ZkStateReader.updateClusterState Updating cloud state from ZooKeeper... 
[junit4:junit4]   2> 215158 T992 oascc.ZkStateReader.updateClusterState Updating cloud state from ZooKeeper... 
[junit4:junit4]   2> 216346 T992 oascc.ZkStateReader.updateClusterState Updating cloud state from ZooKeeper... 
[junit4:junit4]   2> 217534 T992 oascc.ZkStateReader.updateClusterState Updating cloud state from ZooKeeper... 
[junit4:junit4]   2> 218722 T992 oascc.ZkStateReader.updateClusterState Updating cloud state from ZooKeeper... 
[junit4:junit4]   2> 219911 T992 oascc.ZkStateReader.updateClusterState Updating cloud state from ZooKeeper... 
[junit4:junit4]   2> 221100 T992 oascc.ZkStateReader.updateClusterState Updating cloud state from ZooKeeper... 
[junit4:junit4]   2> 222184 T992 oascc.ZkStateReader.updateClusterState Updating cloud state from ZooKeeper... 
[junit4:junit4]   2> 223253 T992 oascc.ZkStateReader.updateClusterState Updating cloud state from ZooKeeper... 
[junit4:junit4]   2> 224321 T992 oascc.ZkStateReader.updateClusterState Updating cloud state from ZooKeeper... 
[junit4:junit4]   2> 225392 T992 oascc.ZkStateReader.updateClusterState Updating cloud state from ZooKeeper... 
[junit4:junit4]   2> 226462 T992 oascc.ZkStateReader.updateClusterState Updating cloud state from ZooKeeper... 
[junit4:junit4]   2> 227530 T992 oascc.ZkStateReader.updateClusterState Updating cloud state from ZooKeeper... 
[junit4:junit4]   2> 228599 T992 oascc.ZkStateReader.updateClusterState Updating cloud state from ZooKeeper... 
[junit4:junit4]   2> 229669 T992 oascc.ZkStateReader.updateClusterState Updating cloud state from ZooKeeper... 
[junit4:junit4]   2> 230738 T992 oascc.ZkStateReader.updateClusterState Updating cloud state from ZooKeeper... 
[junit4:junit4]   2> 231806 T992 oascc.ZkStateReader.updateClusterState Updating cloud state from ZooKeeper... 
[junit4:junit4]   2> 232781 T992 oascc.ZkStateReader.updateClusterState Updating cloud state from ZooKeeper... 
[junit4:junit4]   2> 233743 T992 oascc.ZkStateReader.updateClusterState Updating cloud state from ZooKeeper... 
[junit4:junit4]   2> 234705 T992 oascc.ZkStateReader.updateClusterState Updating cloud state from ZooKeeper... 
[junit4:junit4]   2> 235666 T992 oascc.ZkStateReader.updateClusterState Updating cloud state from ZooKeeper... 
[junit4:junit4]   2> 236629 T992 oascc.ZkStateReader.updateClusterState Updating cloud state from ZooKeeper... 
[junit4:junit4]   2> 237591 T992 oascc.ZkStateReader.updateClusterState Updating cloud state from ZooKeeper... 
[junit4:junit4]   2> 238555 T992 oascc.ZkStateReader.updateClusterState Updating cloud state from ZooKeeper... 
[junit4:junit4]   2> 239518 T992 oascc.ZkStateReader.updateClusterState Updating cloud state from ZooKeeper... 
[junit4:junit4]   2> 240480 T992 oascc.ZkStateReader.updateClusterState Updating cloud state from ZooKeeper... 
[junit4:junit4]   2> 241442 T992 oascc.ZkStateReader.updateClusterState Updating cloud state from ZooKeeper... 
[junit4:junit4]   2> 242318 T992 oascc.ZkStateReader.updateClusterState Updating cloud state from ZooKeeper... 
[junit4:junit4]   2> 243184 T992 oascc.ZkStateReader.updateClusterState Updating cloud state from ZooKeeper... 
[junit4:junit4]   2> 244050 T992 oascc.ZkStateReader.updateClusterState Updating cloud state from ZooKeeper... 
[junit4:junit4]   2> 244916 T992 oascc.ZkStateReader.updateClusterState Updating cloud state from ZooKeeper... 
[junit4:junit4]   2> 245783 T992 oascc.ZkStateReader.updateClusterState Updating cloud state from ZooKeeper... 
[junit4:junit4]   2> 246649 T992 oascc.ZkStateReader.updateClusterState Updating cloud state from ZooKeeper... 
[junit4:junit4]   2> 247515 T992 oascc.ZkStateReader.updateClusterState Updating cloud state from ZooKeeper... 
[junit4:junit4]   2> 248380 T992 oascc.ZkStateReader.updateClusterState Updating cloud state from ZooKeeper... 
[junit4:junit4]   2> 249247 T992 oascc.ZkStateReader.updateClusterState Updating cloud state from ZooKeeper... 
[junit4:junit4]   2> 250113 T992 oascc.ZkStateReader.updateClusterState Updating cloud state from ZooKeeper... 
[junit4:junit4]   2> 251065 T992 oascc.ZkStateReader.updateClusterState Updating cloud state from ZooKeeper... 
[junit4:junit4]   2> 252017 T992 oascc.ZkStateReader.updateClusterState Updating cloud state from ZooKeeper... 
[junit4:junit4]   2> 252969 T992 oascc.ZkStateReader.updateClusterState Updating cloud state from ZooKeeper... 
[junit4:junit4]   2> 253921 T992 oascc.ZkStateReader.updateClusterState Updating cloud state from ZooKeeper... 
[junit4:junit4]   2> 254874 T992 oascc.ZkStateReader.updateClusterState Updating cloud state from ZooKeeper... 
[junit4:junit4]   1> 
[junit4:junit4]   1> Thread[qtp30228855-1023,5,TGRP-BasicDistributedZkTest]
[junit4:junit4]   1> sun.misc.Unsafe.park(Native Method)
[junit4:junit4]   1> java.util.concurrent.locks.LockSupport.parkNanos(LockSupport.java:196)
[junit4:junit4]   1> java.util.concurrent.locks.AbstractQueuedSynchronizer$ConditionObject.awaitNanos(AbstractQueuedSynchronizer.java:2025)
[junit4:junit4]   1> org.eclipse.jetty.util.BlockingArrayQueue.poll(BlockingArrayQueue.java:342)
[junit4:junit4]   1> org.eclipse.jetty.util.thread.QueuedThreadPool.idleJobPoll(QueuedThreadPool.java:526)
[junit4:junit4]   1> org.eclipse.jetty.util.thread.QueuedThreadPool.access$600(QueuedThreadPool.java:44)
[junit4:junit4]   1> org.eclipse.jetty.util.thread.QueuedThreadPool$3.run(QueuedThreadPool.java:572)
[junit4:junit4]   1> java.lang.Thread.run(Thread.java:662)
[junit4:junit4]   1> 
[junit4:junit4]   1> Session Sets (11):
[junit4:junit4]   1> 0 expire at Thu Nov 08 14:45:27 CAT 2012:
[junit4:junit4]   1> 0 expire at Thu Nov 08 14:45:28 CAT 2012:
[junit4:junit4]   1> 0 expire at Thu Nov 08 14:45:29 CAT 2012:
[junit4:junit4]   1> 1 expire at Thu Nov 08 14:45:30 CAT 2012:
[junit4:junit4]   1> 	0x13ae009d4990007
[junit4:junit4]   1> 3 expire at Thu Nov 08 14:45:31 CAT 2012:
[junit4:junit4]   1> 	0x13ae009d4990005
[junit4:junit4]   1> 	0x13ae009d4990004
[junit4:junit4]   1> 	0x13ae009d4990006
[junit4:junit4]   1> 1 expire at Thu Nov 08 14:45:32 CAT 2012:
[junit4:junit4]   1> 	0x13ae009d4990002
[junit4:junit4]   1> 0 expire at Thu Nov 08 14:45:33 CAT 2012:
[junit4:junit4]   1> 0 expire at Thu Nov 08 14:45:34 CAT 2012:
[junit4:junit4]   1> 0 expire at Thu Nov 08 14:45:35 CAT 2012:
[junit4:junit4]   1> 0 expire at Thu Nov 08 14:45:36 CAT 2012:
[junit4:junit4]   1> 1 expire at Thu Nov 08 14:45:37 CAT 2012:
[junit4:junit4]   1> 	0x13ae009d4990003
[junit4:junit4]   1> 
[junit4:junit4]   1> java.lang.Object.wait(Native Method)
[junit4:junit4]   1> org.apache.zookeeper.server.SessionTrackerImpl.run(SessionTrackerImpl.java:145)
[junit4:junit4]   1> 
[junit4:junit4]   1> Thread[qtp29876666-1033,5,TGRP-BasicDistributedZkTest]
[junit4:junit4]   1> sun.misc.Unsafe.park(Native Method)
[junit4:junit4]   1> java.util.concurrent.locks.LockSupport.parkNanos(LockSupport.java:196)
[junit4:junit4]   1> java.util.concurrent.locks.AbstractQueuedSynchronizer$ConditionObject.awaitNanos(AbstractQueuedSynchronizer.java:2025)
[junit4:junit4]   1> org.eclipse.jetty.util.BlockingArrayQueue.poll(BlockingArrayQueue.java:342)
[junit4:junit4]   1> org.eclipse.jetty.util.thread.QueuedThreadPool.idleJobPoll(QueuedThreadPool.java:526)
[junit4:junit4]   1> org.eclipse.jetty.util.thread.QueuedThreadPool.access$600(QueuedThreadPool.java:44)
[junit4:junit4]   1> org.eclipse.jetty.util.thread.QueuedThreadPool$3.run(QueuedThreadPool.java:572)
[junit4:junit4]   1> java.lang.Thread.run(Thread.java:662)
[junit4:junit4]   1> 
[junit4:junit4]   1> Thread[Reference Handler,10,system]
[junit4:junit4]   1> java.lang.Object.wait(Native Method)
[junit4:junit4]   1> java.lang.Object.wait(Object.java:485)
[junit4:junit4]   1> java.lang.ref.Reference$ReferenceHandler.run(Reference.java:116)
[junit4:junit4]   1> 
[junit4:junit4]   1> Thread[HashSessionScavenger-22,5,TGRP-BasicDistributedZkTest]
[junit4:junit4]   1> java.lang.Object.wait(Native Method)
[junit4:junit4]   1> java.util.TimerThread.mainLoop(Timer.java:509)
[junit4:junit4]   1> java.util.TimerThread.run(Timer.java:462)
[junit4:junit4]   1> 
[junit4:junit4]   1> Thread[searcherExecutor-710-thread-1,5,TGRP-BasicDistributedZkTest]
[junit4:junit4]   1> sun.misc.Unsafe.park(Native Method)
[junit4:junit4]   1> java.util.concurrent.locks.LockSupport.park(LockSupport.java:156)
[junit4:junit4]   1> java.util.concurrent.locks.AbstractQueuedSynchronizer$ConditionObject.await(AbstractQueuedSynchronizer.java:1987)
[junit4:junit4]   1> java.util.concurrent.LinkedBlockingQueue.take(LinkedBlockingQueue.java:399)
[junit4:junit4]   1> java.util.concurrent.ThreadPoolExecutor.getTask(ThreadPoolExecutor.java:947)
[junit4:junit4]   1> java.util.concurrent.ThreadPoolExecutor$Worker.run(ThreadPoolExecutor.java:907)
[junit4:junit4]   1> java.lang.Thread.run(Thread.java:662)
[junit4:junit4]   1> 
[junit4:junit4]   1> Thread[qtp31087460-1005,5,TGRP-BasicDistributedZkTest]
[junit4:junit4]   1> sun.misc.Unsafe.park(Native Method)
[junit4:junit4]   1> java.util.concurrent.locks.LockSupport.parkNanos(LockSupport.java:196)
[junit4:junit4]   1> java.util.concurrent.locks.AbstractQueuedSynchronizer$ConditionObject.awaitNanos(AbstractQueuedSynchronizer.java:2025)
[junit4:junit4]   1> org.eclipse.jetty.util.BlockingArrayQueue.poll(BlockingArrayQueue.java:342)
[junit4:junit4]   1> org.eclipse.jetty.util.thread.QueuedThreadPool.idleJobPoll(QueuedThreadPool.java:526)
[junit4:junit4]   1> org.eclipse.jetty.util.thread.QueuedThreadPool.access$600(QueuedThreadPool.java:44)
[junit4:junit4]   1> org.eclipse.jetty.util.thread.QueuedThreadPool$3.run(QueuedThreadPool.java:572)
[junit4:junit4]   1> java.lang.Thread.run(Thread.java:662)
[junit4:junit4]   1> 
[junit4:junit4]   1> Thread[Thread-349,5,Overseer state updater.]
[junit4:junit4]   1> java.lang.Thread.sleep(Native Method)
[junit4:junit4]   1> org.apache.solr.cloud.Overseer$ClusterStateUpdater.run(Overseer.java:156)
[junit4:junit4]   1> java.lang.Thread.run(Thread.java:662)
[junit4:junit4]   1> 
[junit4:junit4]   1> Thread[qtp30228855-1021,5,TGRP-BasicDistributedZkTest]
[junit4:junit4]   1> sun.misc.Unsafe.park(Native Method)
[junit4:junit4]   1> java.util.concurrent.locks.LockSupport.parkNanos(LockSupport.java:196)
[junit4:junit4]   1> java.util.concurrent.locks.AbstractQueuedSynchronizer$ConditionObject.awaitNanos(AbstractQueuedSynchronizer.java:2025)
[junit4:junit4]   1> org.eclipse.jetty.util.BlockingArrayQueue.poll(BlockingArrayQueue.java:342)
[junit4:junit4]   1> org.eclipse.jetty.util.thread.QueuedThreadPool.idleJobPoll(QueuedThreadPool.java:526)
[junit4:junit4]   1> org.eclipse.jetty.util.thread.QueuedThreadPool.access$600(QueuedThreadPool.java:44)
[junit4:junit4]   1> org.eclipse.jetty.util.thread.QueuedThreadPool$3.run(QueuedThreadPool.java:572)
[junit4:junit4]   1> java.lang.Thread.run(Thread.java:662)
[junit4:junit4]   1> 
[junit4:junit4]   1> Thread[qtp29034380-1062,5,TGRP-BasicDistributedZkTest]
[junit4:junit4]   1> sun.misc.Unsafe.park(Native Method)
[junit4:junit4]   1> java.util.concurrent.locks.LockSupport.parkNanos(LockSupport.java:196)
[junit4:junit4]   1> java.util.concurrent.locks.AbstractQueuedSynchronizer$ConditionObject.awaitNanos(AbstractQueuedSynchronizer.java:2025)
[junit4:junit4]   1> org.eclipse.jetty.util.BlockingArrayQueue.poll(BlockingArrayQueue.java:342)
[junit4:junit4]   1> org.eclipse.jetty.util.thread.QueuedThreadPool.idleJobPoll(QueuedThreadPool.java:526)
[junit4:junit4]   1> org.eclipse.jetty.util.thread.QueuedThreadPool.access$600(QueuedThreadPool.java:44)
[junit4:junit4]   1> org.eclipse.jetty.util.thread.QueuedThreadPool$3.run(QueuedThreadPool.java:572)
[junit4:junit4]   1> java.lang.Thread.run(Thread.java:662)
[junit4:junit4]   1> 
[junit4:junit4]   1> Thread[TEST-BasicDistributedZkTest.testDistribSearch-seed#[83A716744245D90]-EventThread,5,TGRP-BasicDistributedZkTest]
[junit4:junit4]   1> sun.misc.Unsafe.park(Native Method)
[junit4:junit4]   1> java.util.concurrent.locks.LockSupport.park(LockSupport.java:156)
[junit4:junit4]   1> java.util.concurrent.locks.AbstractQueuedSynchronizer$ConditionObject.await(AbstractQueuedSynchronizer.java:1987)
[junit4:junit4]   1> java.util.concurrent.LinkedBlockingQueue.take(LinkedBlockingQueue.java:399)
[junit4:junit4]   1> org.apache.zookeeper.ClientCnxn$EventThread.run(ClientCnxn.java:498)
[junit4:junit4]   1> 
[junit4:junit4]   1> Thread[qtp29034380-1061,5,TGRP-BasicDistributedZkTest]
[junit4:junit4]   1> sun.misc.Unsafe.park(Native Method)
[junit4:junit4]   1> java.util.concurrent.locks.LockSupport.parkNanos(LockSupport.java:196)
[junit4:junit4]   1> java.util.concurrent.locks.AbstractQueuedSynchronizer$ConditionObject.awaitNanos(AbstractQueuedSynchronizer.java:2025)
[junit4:junit4]   1> org.eclipse.jetty.util.BlockingArrayQueue.poll(BlockingArrayQueue.java:342)
[junit4:junit4]   1> org.eclipse.jetty.util.thread.QueuedThreadPool.idleJobPoll(QueuedThreadPool.java:526)
[junit4:junit4]   1> org.eclipse.jetty.util.thread.QueuedThreadPool.access$600(QueuedThreadPool.java:44)
[junit4:junit4]   1> org.eclipse.jetty.util.thread.QueuedThreadPool$3.run(QueuedThreadPool.java:572)
[junit4:junit4]   1> java.lang.Thread.run(Thread.java:662)
[junit4:junit4]   1> 
[junit4:junit4]   1> Thread[ProcessThread:-1,5,TGRP-BasicDistributedZkTest]
[junit4:junit4]   1> sun.misc.Unsafe.park(Native Method)
[junit4:junit4]   1> java.util.concurrent.locks.LockSupport.park(LockSupport.java:156)
[junit4:junit4]   1> java.util.concurrent.locks.AbstractQueuedSynchronizer$ConditionObject.await(AbstractQueuedSynchronizer.java:1987)
[junit4:junit4]   1> java.util.concurrent.LinkedBlockingQueue.take(LinkedBlockingQueue.java:399)
[junit4:junit4]   1> org.apache.zookeeper.server.PrepRequestProcessor.run(PrepRequestProcessor.java:105)
[junit4:junit4]   1> 
[junit4:junit4]   1> Thread[qtp30228855-1019 Selector0,5,TGRP-BasicDistributedZkTest]
[junit4:junit4]   1> sun.nio.ch.WindowsSelectorImpl$SubSelector.poll0(Native Method)
[junit4:junit4]   1> sun.nio.ch.WindowsSelectorImpl$SubSelector.poll(WindowsSelectorImpl.java:273)
[junit4:junit4]   1> sun.nio.ch.WindowsSelectorImpl$SubSelector.access$400(WindowsSelectorImpl.java:255)
[junit4:junit4]   1> sun.nio.ch.WindowsSelectorImpl.doSelect(WindowsSelectorImpl.java:136)
[junit4:junit4]   1> sun.nio.ch.SelectorImpl.lockAndDoSelect(SelectorImpl.java:69)
[junit4:junit4]   1> sun.nio.ch.SelectorImpl.select(SelectorImpl.java:80)
[junit4:junit4]   1> org.eclipse.jetty.io.nio.SelectorManager$SelectSet.doSelect(SelectorManager.java:569)
[junit4:junit4]   1> org.eclipse.jetty.io.nio.SelectorManager$1.run(SelectorManager.java:290)
[junit4:junit4]   1> org.eclipse.jetty.util.thread.QueuedThreadPool.runJob(QueuedThreadPool.java:608)
[junit4:junit4]   1> org.eclipse.jetty.util.thread.QueuedThreadPool$3.run(QueuedThreadPool.java:543)
[junit4:junit4]   1> java.lang.Thread.run(Thread.java:662)
[junit4:junit4]   1> 
[junit4:junit4]   1> Thread[qtp30228855-1022,5,TGRP-BasicDistributedZkTest]
[junit4:junit4]   1> sun.misc.Unsafe.park(Native Method)
[junit4:junit4]   1> java.util.concurrent.locks.LockSupport.parkNanos(LockSupport.java:196)
[junit4:junit4]   1> java.util.concurrent.locks.AbstractQueuedSynchronizer$ConditionObject.awaitNanos(AbstractQueuedSynchronizer.java:2025)
[junit4:junit4]   1> org.eclipse.jetty.util.BlockingArrayQueue.poll(BlockingArrayQueue.java:342)
[junit4:junit4]   1> org.eclipse.jetty.util.thread.QueuedThreadPool.idleJobPoll(QueuedThreadPool.java:526)
[junit4:junit4]   1> org.eclipse.jetty.util.thread.QueuedThreadPool.access$600(QueuedThreadPool.java:44)
[junit4:junit4]   1> org.eclipse.jetty.util.thread.QueuedThreadPool$3.run(QueuedThreadPool.java:572)
[junit4:junit4]   1> java.lang.Thread.run(Thread.java:662)
[junit4:junit4]   1> 
[junit4:junit4]   1> Thread[qtp29034380-1058 Acceptor0 SelectChannelConnector@0.0.0.0:59435,5,TGRP-BasicDistributedZkTest]
[junit4:junit4]   1> sun.nio.ch.ServerSocketChannelImpl.accept0(Native Method)
[junit4:junit4]   1> sun.nio.ch.ServerSocketChannelImpl.accept(ServerSocketChannelImpl.java:150)
[junit4:junit4]   1> org.eclipse.jetty.server.nio.SelectChannelConnector.accept(SelectChannelConnector.java:109)
[junit4:junit4]   1> org.eclipse.jetty.server.AbstractConnector$Acceptor.run(AbstractConnector.java:938)
[junit4:junit4]   1> org.eclipse.jetty.util.thread.QueuedThreadPool.runJob(QueuedThreadPool.java:608)
[junit4:junit4]   1> org.eclipse.jetty.util.thread.QueuedThreadPool$3.run(QueuedThreadPool.java:543)
[junit4:junit4]   1> java.lang.Thread.run(Thread.java:662)
[junit4:junit4]   1> 
[junit4:junit4]   1> Thread[qtp29034380-1064,5,TGRP-BasicDistributedZkTest]
[junit4:junit4]   1> sun.misc.Unsafe.park(Native Method)
[junit4:junit4]   1> java.util.concurrent.locks.LockSupport.parkNanos(LockSupport.java:196)
[junit4:junit4]   1> java.util.concurrent.locks.AbstractQueuedSynchronizer$ConditionObject.awaitNanos(AbstractQueuedSynchronizer.java:2025)
[junit4:junit4]   1> org.eclipse.jetty.util.BlockingArrayQueue.poll(BlockingArrayQueue.java:342)
[junit4:junit4]   1> org.eclipse.jetty.util.thread.QueuedThreadPool.idleJobPoll(QueuedThreadPool.java:526)
[junit4:junit4]   1> org.eclipse.jetty.util.thread.QueuedThreadPool.access$600(QueuedThreadPool.java:44)
[junit4:junit4]   1> org.eclipse.jetty.util.thread.QueuedThreadPool$3.run(QueuedThreadPool.java:572)
[junit4:junit4]   1> java.lang.Thread.run(Thread.java:662)
[junit4:junit4]   1> 
[junit4:junit4]   1> Thread[TEST-BasicDistributedZkTest.testDistribSearch-seed#[83A716744245D90]-EventThread,5,TGRP-BasicDistributedZkTest]
[junit4:junit4]   1> sun.misc.Unsafe.park(Native Method)
[junit4:junit4]   1> java.util.concurrent.locks.LockSupport.park(LockSupport.java:156)
[junit4:junit4]   1> java.util.concurrent.locks.AbstractQueuedSynchronizer$ConditionObject.await(AbstractQueuedSynchronizer.java:1987)
[junit4:junit4]   1> java.util.concurrent.LinkedBlockingQueue.take(LinkedBlockingQueue.java:399)
[junit4:junit4]   1> org.apache.zookeeper.ClientCnxn$EventThread.run(ClientCnxn.java:498)
[junit4:junit4]   1> 
[junit4:junit4]   1> Thread[metrics-meter-tick-thread-2,5,TGRP-ConvertedLegacyTest]
[junit4:junit4]   1> sun.misc.Unsafe.park(Native Method)
[junit4:junit4]   1> java.util.concurrent.locks.LockSupport.parkNanos(LockSupport.java:196)
[junit4:junit4]   1> java.util.concurrent.locks.AbstractQueuedSynchronizer$ConditionObject.awaitNanos(AbstractQueuedSynchronizer.java:2025)
[junit4:junit4]   1> java.util.concurrent.DelayQueue.take(DelayQueue.java:164)
[junit4:junit4]   1> java.util.concurrent.ScheduledThreadPoolExecutor$DelayedWorkQueue.take(ScheduledThreadPoolExecutor.java:609)
[junit4:junit4]   1> java.util.concurrent.ScheduledThreadPoolExecutor$DelayedWorkQueue.take(ScheduledThreadPoolExecutor.java:602)
[junit4:junit4]   1> java.util.concurrent.ThreadPoolExecutor.getTask(ThreadPoolExecutor.java:947)
[junit4:junit4]   1> java.util.concurrent.ThreadPoolExecutor$Worker.run(ThreadPoolExecutor.java:907)
[junit4:junit4]   1> java.lang.Thread.run(Thread.java:662)
[junit4:junit4]   1> 
[junit4:junit4]   1> Thread[TEST-BasicDistributedZkTest.testDistribSearch-seed#[83A716744245D90]-SendThread(127.0.0.1:59399),5,TGRP-BasicDistributedZkTest]
[junit4:junit4]   1> sun.nio.ch.WindowsSelectorImpl$SubSelector.poll0(Native Method)
[junit4:junit4]   1> sun.nio.ch.WindowsSelectorImpl$SubSelector.poll(WindowsSelectorImpl.java:273)
[junit4:junit4]   1> sun.nio.ch.WindowsSelectorImpl$SubSelector.access$400(WindowsSelectorImpl.java:255)
[junit4:junit4]   1> sun.nio.ch.WindowsSelectorImpl.doSelect(WindowsSelectorImpl.java:136)
[junit4:junit4]   1> sun.nio.ch.SelectorImpl.lockAndDoSelect(SelectorImpl.java:69)
[junit4:junit4]   1> sun.nio.ch.SelectorImpl.select(SelectorImpl.java:80)
[junit4:junit4]   1> org.apache.zookeeper.ClientCnxn$SendThread.run(ClientCnxn.java:1131)
[junit4:junit4]   1> 
[junit4:junit4]   1> Thread[qtp22037543-1045,5,TGRP-BasicDistributedZkTest]
[junit4:junit4]   1> sun.misc.Unsafe.park(Native Method)
[junit4:junit4]   1> java.util.concurrent.locks.LockSupport.parkNanos(LockSupport.java:196)
[junit4:junit4]   1> java.util.concurrent.locks.AbstractQueuedSynchronizer$ConditionObject.awaitNanos(AbstractQueuedSynchronizer.java:2025)
[junit4:junit4]   1> org.eclipse.jetty.util.BlockingArrayQueue.poll(BlockingArrayQueue.java:342)
[junit4:junit4]   1> org.eclipse.jetty.util.thread.QueuedThreadPool.idleJobPoll(QueuedThreadPool.java:526)
[junit4:junit4]   1> org.eclipse.jetty.util.thread.QueuedThreadPool.access$600(QueuedThreadPool.java:44)
[junit4:junit4]   1> org.eclipse.jetty.util.thread.QueuedThreadPool$3.run(QueuedThreadPool.java:572)
[junit4:junit4]   1> java.lang.Thread.run(Thread.java:662)
[junit4:junit4]   1> 
[junit4:junit4]   1> Thread[qtp22037543-1048,5,TGRP-BasicDistributedZkTest]
[junit4:junit4]   1> sun.misc.Unsafe.park(Native Method)
[junit4:junit4]   1> java.util.concurrent.locks.LockSupport.parkNanos(LockSupport.java:196)
[junit4:junit4]   1> java.util.concurrent.locks.AbstractQueuedSynchronizer$ConditionObject.awaitNanos(AbstractQueuedSynchronizer.java:2025)
[junit4:junit4]   1> org.eclipse.jetty.util.BlockingArrayQueue.poll(BlockingArrayQueue.java:342)
[junit4:junit4]   1> org.eclipse.jetty.util.thread.QueuedThreadPool.idleJobPoll(QueuedThreadPool.java:526)
[junit4:junit4]   1> org.eclipse.jetty.util.thread.QueuedThreadPool.access$600(QueuedThreadPool.java:44)
[junit4:junit4]   1> org.eclipse.jetty.util.thread.QueuedThreadPool$3.run(QueuedThreadPool.java:572)
[junit4:junit4]   1> java.lang.Thread.run(Thread.java:662)
[junit4:junit4]   1> 
[junit4:junit4]   1> Thread[NIOServerCxn.Factory:0.0.0.0/0.0.0.0:0,5,TGRP-BasicDistributedZkTest]
[junit4:junit4]   1> sun.nio.ch.WindowsSelectorImpl$SubSelector.poll0(Native Method)
[junit4:junit4]   1> sun.nio.ch.WindowsSelectorImpl$SubSelector.poll(WindowsSelectorImpl.java:273)
[junit4:junit4]   1> sun.nio.ch.WindowsSelectorImpl$SubSelector.access$400(WindowsSelectorImpl.java:255)
[junit4:junit4]   1> sun.nio.ch.WindowsSelectorImpl.doSelect(WindowsSelectorImpl.java:136)
[junit4:junit4]   1> sun.nio.ch.SelectorImpl.lockAndDoSelect(SelectorImpl.java:69)
[junit4:junit4]   1> sun.nio.ch.SelectorImpl.select(SelectorImpl.java:80)
[junit4:junit4]   1> org.apache.zookeeper.server.NIOServerCnxn$Factory.run(NIOServerCnxn.java:232)
[junit4:junit4]   1> 
[junit4:junit4]   1> Thread[TEST-BasicDistributedZkTest.testDistribSearch-seed#[83A716744245D90]-EventThread,5,TGRP-BasicDistributedZkTest]
[junit4:junit4]   1> sun.misc.Unsafe.park(Native Method)
[junit4:junit4]   1> java.util.concurrent.locks.LockSupport.park(LockSupport.java:156)
[junit4:junit4]   1> java.util.concurrent.locks.AbstractQueuedSynchronizer$ConditionObject.await(AbstractQueuedSynchronizer.java:1987)
[junit4:junit4]   1> java.util.concurrent.LinkedBlockingQueue.take(LinkedBlockingQueue.java:399)
[junit4:junit4]   1> org.apache.zookeeper.ClientCnxn$EventThread.run(ClientCnxn.java:498)
[junit4:junit4]   1> 
[junit4:junit4]   1> Thread[Overseer-88629475513270274-127.0.0.1:59406_solr-n_0000000000,5,Overseer collection creation process.]
[junit4:junit4]   1> sun.misc.Unsafe.park(Native Method)
[junit4:junit4]   1> java.util.concurrent.locks.LockSupport.park(LockSupport.java:156)
[junit4:junit4]   1> java.util.concurrent.locks.AbstractQueuedSynchronizer.parkAndCheckInterrupt(AbstractQueuedSynchronizer.java:811)
[junit4:junit4]   1> java.util.concurrent.locks.AbstractQueuedSynchronizer.doAcquireSharedInterruptibly(AbstractQueuedSynchronizer.java:969)
[junit4:junit4]   1> java.util.concurrent.locks.AbstractQueuedSynchronizer.acquireSharedInterruptibly(AbstractQueuedSynchronizer.java:1281)
[junit4:junit4]   1> java.util.concurrent.CountDownLatch.await(CountDownLatch.java:207)
[junit4:junit4]   1> org.apache.solr.cloud.DistributedQueue$LatchChildWatcher.await(DistributedQueue.java:179)
[junit4:junit4]   1> org.apache.solr.cloud.DistributedQueue.peek(DistributedQueue.java:277)
[junit4:junit4]   1> org.apache.solr.cloud.OverseerCollectionProcessor.run(OverseerCollectionProcessor.java:86)
[junit4:junit4]   1> java.lang.Thread.run(Thread.java:662)
[junit4:junit4]   1> 
[junit4:junit4]   1> Thread[qtp31087460-1010,5,TGRP-BasicDistributedZkTest]
[junit4:junit4]   1> sun.misc.Unsafe.park(Native Method)
[junit4:junit4]   1> java.util.concurrent.locks.LockSupport.parkNanos(LockSupport.java:196)
[junit4:junit4]   1> java.util.concur

[...truncated too long message...]

junit4]   1>                 "base_url":"http://127.0.0.1:59406/solr",
[junit4:junit4]   1>                 "leader":"true"}}}}}
[junit4:junit4]   1>  /zookeeper (1)
[junit4:junit4]   1>  DATA:
[junit4:junit4]   1>      
[junit4:junit4]   1> 
[junit4:junit4]   2> NOTE: reproduce with: ant test  -Dtestcase=BasicDistributedZkTest -Dtests.method=testDistribSearch -Dtests.seed=83A716744245D90 -Dtests.slow=true -Dtests.locale=nl -Dtests.timezone=Africa/Gaborone -Dtests.file.encoding=Cp1252
[junit4:junit4] FAILURE  266s | BasicDistributedZkTest.testDistribSearch <<<
[junit4:junit4]    > Throwable #1: java.lang.AssertionError: There are still nodes recoverying - waited for 180 seconds
[junit4:junit4]    > 	at __randomizedtesting.SeedInfo.seed([83A716744245D90:89DCFF7F337B3DAC]:0)
[junit4:junit4]    > 	at org.junit.Assert.fail(Assert.java:93)
[junit4:junit4]    > 	at org.apache.solr.cloud.AbstractDistribZkTestBase.waitForRecoveriesToFinish(AbstractDistribZkTestBase.java:166)
[junit4:junit4]    > 	at org.apache.solr.cloud.AbstractDistribZkTestBase.waitForRecoveriesToFinish(AbstractDistribZkTestBase.java:116)
[junit4:junit4]    > 	at org.apache.solr.cloud.AbstractDistribZkTestBase.waitForRecoveriesToFinish(AbstractDistribZkTestBase.java:111)
[junit4:junit4]    > 	at org.apache.solr.cloud.AbstractFullDistribZkTestBase.waitForRecoveriesToFinish(AbstractFullDistribZkTestBase.java:553)
[junit4:junit4]    > 	at org.apache.solr.cloud.BasicDistributedZkTest.doTest(BasicDistributedZkTest.java:169)
[junit4:junit4]    > 	at org.apache.solr.BaseDistributedSearchTestCase.testDistribSearch(BaseDistributedSearchTestCase.java:695)
[junit4:junit4]    > 	at sun.reflect.NativeMethodAccessorImpl.invoke0(Native Method)
[junit4:junit4]    > 	at sun.reflect.NativeMethodAccessorImpl.invoke(NativeMethodAccessorImpl.java:39)
[junit4:junit4]    > 	at sun.reflect.DelegatingMethodAccessorImpl.invoke(DelegatingMethodAccessorImpl.java:25)
[junit4:junit4]    > 	at java.lang.reflect.Method.invoke(Method.java:597)
[junit4:junit4]    > 	at com.carrotsearch.randomizedtesting.RandomizedRunner.invoke(RandomizedRunner.java:1559)
[junit4:junit4]    > 	at com.carrotsearch.randomizedtesting.RandomizedRunner.access$600(RandomizedRunner.java:79)
[junit4:junit4]    > 	at com.carrotsearch.randomizedtesting.RandomizedRunner$6.evaluate(RandomizedRunner.java:737)
[junit4:junit4]    > 	at com.carrotsearch.randomizedtesting.RandomizedRunner$7.evaluate(RandomizedRunner.java:773)
[junit4:junit4]    > 	at com.carrotsearch.randomizedtesting.RandomizedRunner$8.evaluate(RandomizedRunner.java:787)
[junit4:junit4]    > 	at com.carrotsearch.randomizedtesting.rules.SystemPropertiesRestoreRule$1.evaluate(SystemPropertiesRestoreRule.java:53)
[junit4:junit4]    > 	at org.apache.lucene.util.TestRuleSetupTeardownChained$1.evaluate(TestRuleSetupTeardownChained.java:50)
[junit4:junit4]    > 	at org.apache.lucene.util.TestRuleFieldCacheSanity$1.evaluate(TestRuleFieldCacheSanity.java:51)
[junit4:junit4]    > 	at org.apache.lucene.util.AbstractBeforeAfterRule$1.evaluate(AbstractBeforeAfterRule.java:45)
[junit4:junit4]    > 	at com.carrotsearch.randomizedtesting.rules.SystemPropertiesInvariantRule$1.evaluate(SystemPropertiesInvariantRule.java:55)
[junit4:junit4]    > 	at org.apache.lucene.util.TestRuleThreadAndTestName$1.evaluate(TestRuleThreadAndTestName.java:48)
[junit4:junit4]    > 	at org.apache.lucene.util.TestRuleIgnoreAfterMaxFailures$1.evaluate(TestRuleIgnoreAfterMaxFailures.java:70)
[junit4:junit4]    > 	at org.apache.lucene.util.TestRuleMarkFailure$1.evaluate(TestRuleMarkFailure.java:48)
[junit4:junit4]    > 	at com.carrotsearch.randomizedtesting.rules.StatementAdapter.evaluate(StatementAdapter.java:36)
[junit4:junit4]    > 	at com.carrotsearch.randomizedtesting.ThreadLeakControl$StatementRunner.run(ThreadLeakControl.java:358)
[junit4:junit4]    > 	at com.carrotsearch.randomizedtesting.ThreadLeakControl.forkTimeoutingTask(ThreadLeakControl.java:782)
[junit4:junit4]    > 	at com.carrotsearch.randomizedtesting.ThreadLeakControl$3.evaluate(ThreadLeakControl.java:442)
[junit4:junit4]    > 	at com.carrotsearch.randomizedtesting.RandomizedRunner.runSingleTest(RandomizedRunner.java:746)
[junit4:junit4]    > 	at com.carrotsearch.randomizedtesting.RandomizedRunner$3.evaluate(RandomizedRunner.java:648)
[junit4:junit4]    > 	at com.carrotsearch.randomizedtesting.RandomizedRunner$4.evaluate(RandomizedRunner.java:682)
[junit4:junit4]    > 	at com.carrotsearch.randomizedtesting.RandomizedRunner$5.evaluate(RandomizedRunner.java:693)
[junit4:junit4]    > 	at com.carrotsearch.randomizedtesting.rules.StatementAdapter.evaluate(StatementAdapter.java:36)
[junit4:junit4]    > 	at com.carrotsearch.randomizedtesting.rules.SystemPropertiesRestoreRule$1.evaluate(SystemPropertiesRestoreRule.java:53)
[junit4:junit4]    > 	at org.apache.lucene.util.AbstractBeforeAfterRule$1.evaluate(AbstractBeforeAfterRule.java:45)
[junit4:junit4]    > 	at org.apache.lucene.util.TestRuleStoreClassName$1.evaluate(TestRuleStoreClassName.java:42)
[junit4:junit4]    > 	at com.carrotsearch.randomizedtesting.rules.SystemPropertiesInvariantRule$1.evaluate(SystemPropertiesInvariantRule.java:55)
[junit4:junit4]    > 	at com.carrotsearch.randomizedtesting.rules.NoShadowingOrOverridesOnMethodsRule$1.evaluate(NoShadowingOrOverridesOnMethodsRule.java:39)
[junit4:junit4]    > 	at com.carrotsearch.randomizedtesting.rules.NoShadowingOrOverridesOnMethodsRule$1.evaluate(NoShadowingOrOverridesOnMethodsRule.java:39)
[junit4:junit4]    > 	at com.carrotsearch.randomizedtesting.rules.StatementAdapter.evaluate(StatementAdapter.java:36)
[junit4:junit4]    > 	at org.apache.lucene.util.TestRuleAssertionsRequired$1.evaluate(TestRuleAssertionsRequired.java:43)
[junit4:junit4]    > 	at org.apache.lucene.util.TestRuleMarkFailure$1.evaluate(TestRuleMarkFailure.java:48)
[junit4:junit4]    > 	at org.apache.lucene.util.TestRuleIgnoreAfterMaxFailures$1.evaluate(TestRuleIgnoreAfterMaxFailures.java:70)
[junit4:junit4]    > 	at org.apache.lucene.util.TestRuleIgnoreTestSuites$1.evaluate(TestRuleIgnoreTestSuites.java:55)
[junit4:junit4]    > 	at com.carrotsearch.randomizedtesting.rules.StatementAdapter.evaluate(StatementAdapter.java:36)
[junit4:junit4]    > 	at com.carrotsearch.randomizedtesting.ThreadLeakControl$StatementRunner.run(ThreadLeakControl.java:358)
[junit4:junit4]    > 	at java.lang.Thread.run(Thread.java:662)
[junit4:junit4]   2> 266097 T992 oas.SolrTestCaseJ4.deleteCore ###deleteCore
[junit4:junit4]   2> NOTE: test params are: codec=Lucene41: {}, sim=DefaultSimilarity, locale=nl, timezone=Africa/Gaborone
[junit4:junit4]   2> NOTE: Windows 7 6.1 x86/Sun Microsystems Inc. 1.6.0_37 (32-bit)/cpus=2,threads=1,free=50598240,total=111075328
[junit4:junit4]   2> NOTE: All tests run in this JVM: [ConvertedLegacyTest, BasicZkTest, TestAnalyzedSuggestions, SpellPossibilityIteratorTest, CircularListTest, StatsComponentTest, QueryElevationComponentTest, TestRangeQuery, TestStressLucene, TestStressReorder, RequiredFieldsTest, UUIDFieldTest, DOMUtilTest, TestTrie, ScriptEngineTest, SpellingQueryConverterTest, TestSolrDeletionPolicy2, RequestHandlersTest, ZkCLITest, SpatialFilterTest, IndexSchemaRuntimeFieldTest, TestXIncludeConfig, DirectUpdateHandlerOptimizeTest, TestCSVLoader, AnalysisAfterCoreReloadTest, BadIndexSchemaTest, SampleTest, TestUtils, TermsComponentTest, BinaryUpdateRequestHandlerTest, TestFiltering, TestFastOutputStream, ResponseLogComponentTest, PathHierarchyTokenizerFactoryTest, IndexBasedSpellCheckerTest, WordBreakSolrSpellCheckerTest, TestReload, TestWordDelimiterFilterFactory, FastVectorHighlighterTest, SolrCmdDistributorTest, MBeansHandlerTest, TestIndexSearcher, TestPropInjectDefaults, LoggingHandlerTest, CopyFieldTest, SuggesterWFSTTest, MoreLikeThisHandlerTest, TestRTGBase, PrimUtilsTest, HighlighterConfigTest, DistributedSpellCheckComponentTest, JsonLoaderTest, TestDocSet, TestLazyCores, MultiTermTest, ReturnFieldsTest, TestSurroundQueryParser, UniqFieldsUpdateProcessorFactoryTest, LeaderElectionIntegrationTest, TestFastLRUCache, TestConfig, XmlUpdateRequestHandlerTest, TestStressRecovery, DateFieldTest, TimeZoneUtilsTest, CSVRequestHandlerTest, TestRandomFaceting, DirectSolrConnectionTest, TestFunctionQuery, DisMaxRequestHandlerTest, URLClassifyProcessorTest, FullSolrCloudDistribCmdsTest, TestLuceneMatchVersion, TestFoldingMultitermQuery, TestSolrQueryParser, UpdateParamsTest, ShowFileRequestHandlerTest, TestPseudoReturnFields, NumericFieldsTest, FieldMutatingUpdateProcessorTest, BasicFunctionalityTest, BadComponentTest, HighlighterTest, TestWriterPerf, StandardRequestHandlerTest, TestDocumentBuilder, TestFastWriter, TestSolrIndexConfig, BasicDistributedZkTest]
[junit4:junit4] Completed in 266.12s, 1 test, 1 failure <<< FAILURES!

[...truncated 427 lines...]
BUILD FAILED
C:\Users\JenkinsSlave\workspace\Lucene-Solr-trunk-Windows\build.xml:335: The following error occurred while executing this line:
C:\Users\JenkinsSlave\workspace\Lucene-Solr-trunk-Windows\build.xml:39: The following error occurred while executing this line:
C:\Users\JenkinsSlave\workspace\Lucene-Solr-trunk-Windows\solr\build.xml:178: The following error occurred while executing this line:
C:\Users\JenkinsSlave\workspace\Lucene-Solr-trunk-Windows\lucene\module-build.xml:61: The following error occurred while executing this line:
C:\Users\JenkinsSlave\workspace\Lucene-Solr-trunk-Windows\lucene\common-build.xml:1163: The following error occurred while executing this line:
C:\Users\JenkinsSlave\workspace\Lucene-Solr-trunk-Windows\lucene\common-build.xml:827: There were test failures: 233 suites, 970 tests, 1 failure, 12 ignored (7 assumptions)

Total time: 43 minutes 50 seconds
Build step 'Invoke Ant' marked build as failure
Archiving artifacts
Recording test results
Description set: Java: 32bit/jdk1.6.0_37 -server -XX:+UseConcMarkSweepGC
Email was triggered for: Failure
Sending email for trigger: Failure



Mime
View raw message