lucene-dev mailing list archives

Site index · List index
Message view « Date » · « Thread »
Top « Date » · « Thread »
From Policeman Jenkins Server <jenk...@sd-datasolutions.de>
Subject [JENKINS] Lucene-Solr-4.x-Windows (32bit/jdk1.6.0_37) - Build # 1493 - Failure!
Date Fri, 09 Nov 2012 09:30:49 GMT
Build: http://jenkins.sd-datasolutions.de/job/Lucene-Solr-4.x-Windows/1493/
Java: 32bit/jdk1.6.0_37 -server -XX:+UseParallelGC

1 tests failed.
REGRESSION:  org.apache.solr.client.solrj.impl.CloudSolrServerTest.testDistribSearch

Error Message:
There are still nodes recoverying - waited for 30 seconds

Stack Trace:
java.lang.AssertionError: There are still nodes recoverying - waited for 30 seconds
	at __randomizedtesting.SeedInfo.seed([396C51FA20B77DCA:B88ADFE257E81DF6]:0)
	at org.junit.Assert.fail(Assert.java:93)
	at org.apache.solr.cloud.AbstractDistribZkTestBase.waitForRecoveriesToFinish(AbstractDistribZkTestBase.java:165)
	at org.apache.solr.cloud.AbstractFullDistribZkTestBase.waitForRecoveriesToFinish(AbstractFullDistribZkTestBase.java:558)
	at org.apache.solr.cloud.AbstractFullDistribZkTestBase.waitForThingsToLevelOut(AbstractFullDistribZkTestBase.java:1133)
	at org.apache.solr.client.solrj.impl.CloudSolrServerTest.doTest(CloudSolrServerTest.java:95)
	at org.apache.solr.BaseDistributedSearchTestCase.testDistribSearch(BaseDistributedSearchTestCase.java:695)
	at sun.reflect.NativeMethodAccessorImpl.invoke0(Native Method)
	at sun.reflect.NativeMethodAccessorImpl.invoke(NativeMethodAccessorImpl.java:39)
	at sun.reflect.DelegatingMethodAccessorImpl.invoke(DelegatingMethodAccessorImpl.java:25)
	at java.lang.reflect.Method.invoke(Method.java:597)
	at com.carrotsearch.randomizedtesting.RandomizedRunner.invoke(RandomizedRunner.java:1559)
	at com.carrotsearch.randomizedtesting.RandomizedRunner.access$600(RandomizedRunner.java:79)
	at com.carrotsearch.randomizedtesting.RandomizedRunner$6.evaluate(RandomizedRunner.java:737)
	at com.carrotsearch.randomizedtesting.RandomizedRunner$7.evaluate(RandomizedRunner.java:773)
	at com.carrotsearch.randomizedtesting.RandomizedRunner$8.evaluate(RandomizedRunner.java:787)
	at com.carrotsearch.randomizedtesting.rules.SystemPropertiesRestoreRule$1.evaluate(SystemPropertiesRestoreRule.java:53)
	at org.apache.lucene.util.TestRuleSetupTeardownChained$1.evaluate(TestRuleSetupTeardownChained.java:50)
	at org.apache.lucene.util.TestRuleFieldCacheSanity$1.evaluate(TestRuleFieldCacheSanity.java:51)
	at org.apache.lucene.util.AbstractBeforeAfterRule$1.evaluate(AbstractBeforeAfterRule.java:45)
	at com.carrotsearch.randomizedtesting.rules.SystemPropertiesInvariantRule$1.evaluate(SystemPropertiesInvariantRule.java:55)
	at org.apache.lucene.util.TestRuleThreadAndTestName$1.evaluate(TestRuleThreadAndTestName.java:48)
	at org.apache.lucene.util.TestRuleIgnoreAfterMaxFailures$1.evaluate(TestRuleIgnoreAfterMaxFailures.java:70)
	at org.apache.lucene.util.TestRuleMarkFailure$1.evaluate(TestRuleMarkFailure.java:48)
	at com.carrotsearch.randomizedtesting.rules.StatementAdapter.evaluate(StatementAdapter.java:36)
	at com.carrotsearch.randomizedtesting.ThreadLeakControl$StatementRunner.run(ThreadLeakControl.java:358)
	at com.carrotsearch.randomizedtesting.ThreadLeakControl.forkTimeoutingTask(ThreadLeakControl.java:782)
	at com.carrotsearch.randomizedtesting.ThreadLeakControl$3.evaluate(ThreadLeakControl.java:442)
	at com.carrotsearch.randomizedtesting.RandomizedRunner.runSingleTest(RandomizedRunner.java:746)
	at com.carrotsearch.randomizedtesting.RandomizedRunner$3.evaluate(RandomizedRunner.java:648)
	at com.carrotsearch.randomizedtesting.RandomizedRunner$4.evaluate(RandomizedRunner.java:682)
	at com.carrotsearch.randomizedtesting.RandomizedRunner$5.evaluate(RandomizedRunner.java:693)
	at com.carrotsearch.randomizedtesting.rules.StatementAdapter.evaluate(StatementAdapter.java:36)
	at com.carrotsearch.randomizedtesting.rules.SystemPropertiesRestoreRule$1.evaluate(SystemPropertiesRestoreRule.java:53)
	at org.apache.lucene.util.AbstractBeforeAfterRule$1.evaluate(AbstractBeforeAfterRule.java:45)
	at org.apache.lucene.util.TestRuleStoreClassName$1.evaluate(TestRuleStoreClassName.java:42)
	at com.carrotsearch.randomizedtesting.rules.SystemPropertiesInvariantRule$1.evaluate(SystemPropertiesInvariantRule.java:55)
	at com.carrotsearch.randomizedtesting.rules.NoShadowingOrOverridesOnMethodsRule$1.evaluate(NoShadowingOrOverridesOnMethodsRule.java:39)
	at com.carrotsearch.randomizedtesting.rules.NoShadowingOrOverridesOnMethodsRule$1.evaluate(NoShadowingOrOverridesOnMethodsRule.java:39)
	at com.carrotsearch.randomizedtesting.rules.StatementAdapter.evaluate(StatementAdapter.java:36)
	at org.apache.lucene.util.TestRuleAssertionsRequired$1.evaluate(TestRuleAssertionsRequired.java:43)
	at org.apache.lucene.util.TestRuleMarkFailure$1.evaluate(TestRuleMarkFailure.java:48)
	at org.apache.lucene.util.TestRuleIgnoreAfterMaxFailures$1.evaluate(TestRuleIgnoreAfterMaxFailures.java:70)
	at org.apache.lucene.util.TestRuleIgnoreTestSuites$1.evaluate(TestRuleIgnoreTestSuites.java:55)
	at com.carrotsearch.randomizedtesting.rules.StatementAdapter.evaluate(StatementAdapter.java:36)
	at com.carrotsearch.randomizedtesting.ThreadLeakControl$StatementRunner.run(ThreadLeakControl.java:358)
	at java.lang.Thread.run(Thread.java:662)




Build Log:
[...truncated 8691 lines...]
[junit4:junit4] Suite: org.apache.solr.client.solrj.impl.CloudSolrServerTest
[junit4:junit4]   2> 0 T91 oasc.AbstractZkTestCase.<clinit> WARNING TEST_HOME() does not exist - solrj test?
[junit4:junit4]   2> 15 T91 oas.SolrTestCaseJ4.setUp ###Starting testDistribSearch
[junit4:junit4]   2> Creating dataDir: C:\Users\JenkinsSlave\workspace\Lucene-Solr-4.x-Windows\solr\build\solr-solrj\test\J0\.\solrtest-CloudSolrServerTest-1352453189560
[junit4:junit4]   2> 15 T91 oasc.ZkTestServer.run STARTING ZK TEST SERVER
[junit4:junit4]   2> 94 T92 oaz.Environment.logEnv Server environment:zookeeper.version=3.3.6-1366786, built on 07/29/2012 06:22 GMT
[junit4:junit4]   2> 94 T92 oaz.Environment.logEnv Server environment:host.name=JenkinsSlave-PC
[junit4:junit4]   2> 94 T92 oaz.Environment.logEnv Server environment:java.version=1.6.0_37
[junit4:junit4]   2> 94 T92 oaz.Environment.logEnv Server environment:java.vendor=Sun Microsystems Inc.
[junit4:junit4]   2> 94 T92 oaz.Environment.logEnv Server environment:java.home=C:\Users\JenkinsSlave\tools\java\32bit\jdk1.6.0_37\jre
[junit4:junit4]   2> 94 T92 oaz.Environment.logEnv Server environment:java.class.path=C:\Users\JenkinsSlave\workspace\Lucene-Solr-4.x-Windows\solr\build\solr-solrj\classes\test;C:\Users\JenkinsSlave\workspace\Lucene-Solr-4.x-Windows\solr\build\solr-test-framework\classes\java;C:\Users\JenkinsSlave\workspace\Lucene-Solr-4.x-Windows\solr\solrj\src\test-files;C:\Users\JenkinsSlave\workspace\Lucene-Solr-4.x-Windows\lucene\build\test-framework\classes\java;C:\Users\JenkinsSlave\workspace\Lucene-Solr-4.x-Windows\lucene\build\codecs\classes\java;C:\Users\JenkinsSlave\workspace\Lucene-Solr-4.x-Windows\solr\solrj\lib\commons-io-2.1.jar;C:\Users\JenkinsSlave\workspace\Lucene-Solr-4.x-Windows\solr\solrj\lib\httpclient-4.1.3.jar;C:\Users\JenkinsSlave\workspace\Lucene-Solr-4.x-Windows\solr\solrj\lib\httpcore-4.1.4.jar;C:\Users\JenkinsSlave\workspace\Lucene-Solr-4.x-Windows\solr\solrj\lib\httpmime-4.1.3.jar;C:\Users\JenkinsSlave\workspace\Lucene-Solr-4.x-Windows\solr\solrj\lib\jcl-over-slf4j-1.6.4.jar;C:\Users\JenkinsSlave\workspace\Lucene-Solr-4.x-Windows\solr\solrj\lib\log4j-over-slf4j-1.6.4.jar;C:\Users\JenkinsSlave\workspace\Lucene-Solr-4.x-Windows\solr\solrj\lib\slf4j-api-1.6.4.jar;C:\Users\JenkinsSlave\workspace\Lucene-Solr-4.x-Windows\solr\solrj\lib\slf4j-jdk14-1.6.4.jar;C:\Users\JenkinsSlave\workspace\Lucene-Solr-4.x-Windows\solr\solrj\lib\wstx-asl-3.2.7.jar;C:\Users\JenkinsSlave\workspace\Lucene-Solr-4.x-Windows\solr\solrj\lib\zookeeper-3.3.6.jar;C:\Users\JenkinsSlave\workspace\Lucene-Solr-4.x-Windows\lucene\test-framework\lib\junit-4.10.jar;C:\Users\JenkinsSlave\workspace\Lucene-Solr-4.x-Windows\lucene\test-framework\lib\randomizedtesting-runner-2.0.4.jar;C:\Users\JenkinsSlave\workspace\Lucene-Solr-4.x-Windows\solr\build\solr-solrj\classes\java;C:\Users\JenkinsSlave\workspace\Lucene-Solr-4.x-Windows\solr\build\solr-core\classes\java;C:\Users\JenkinsSlave\workspace\Lucene-Solr-4.x-Windows\lucene\build\analysis\common\lucene-analyzers-common-4.1-SNAPSHOT.jar;C:\Users\JenkinsSlave\workspace\Lucene-Solr-4.x-Windows\lucene\build\analysis\kuromoji\lucene-analyzers-kuromoji-4.1-SNAPSHOT.jar;C:\Users\JenkinsSlave\workspace\Lucene-Solr-4.x-Windows\lucene\build\analysis\phonetic\lucene-analyzers-phonetic-4.1-SNAPSHOT.jar;C:\Users\JenkinsSlave\workspace\Lucene-Solr-4.x-Windows\lucene\build\highlighter\lucene-highlighter-4.1-SNAPSHOT.jar;C:\Users\JenkinsSlave\workspace\Lucene-Solr-4.x-Windows\lucene\build\memory\lucene-memory-4.1-SNAPSHOT.jar;C:\Users\JenkinsSlave\workspace\Lucene-Solr-4.x-Windows\lucene\build\misc\lucene-misc-4.1-SNAPSHOT.jar;C:\Users\JenkinsSlave\workspace\Lucene-Solr-4.x-Windows\lucene\build\spatial\lucene-spatial-4.1-SNAPSHOT.jar;C:\Users\JenkinsSlave\workspace\Lucene-Solr-4.x-Windows\lucene\build\suggest\lucene-suggest-4.1-SNAPSHOT.jar;C:\Users\JenkinsSlave\workspace\Lucene-Solr-4.x-Windows\lucene\build\grouping\lucene-grouping-4.1-SNAPSHOT.jar;C:\Users\JenkinsSlave\workspace\Lucene-Solr-4.x-Windows\lucene\build\queries\lucene-queries-4.1-SNAPSHOT.jar;C:\Users\JenkinsSlave\workspace\Lucene-Solr-4.x-Windows\lucene\build\queryparser\lucene-queryparser-4.1-SNAPSHOT.jar;C:\Users\JenkinsSlave\workspace\Lucene-Solr-4.x-Windows\solr\core\lib\commons-cli-1.2.jar;C:\Users\JenkinsSlave\workspace\Lucene-Solr-4.x-Windows\solr\core\lib\commons-codec-1.7.jar;C:\Users\JenkinsSlave\workspace\Lucene-Solr-4.x-Windows\solr\core\lib\commons-fileupload-1.2.1.jar;C:\Users\JenkinsSlave\workspace\Lucene-Solr-4.x-Windows\solr\core\lib\commons-lang-2.6.jar;C:\Users\JenkinsSlave\workspace\Lucene-Solr-4.x-Windows\solr\core\lib\easymock-2.2.jar;C:\Users\JenkinsSlave\workspace\Lucene-Solr-4.x-Windows\solr\core\lib\guava-r05.jar;C:\Users\JenkinsSlave\workspace\Lucene-Solr-4.x-Windows\solr\core\lib\javax.servlet-api-3.0.1.jar;C:\Users\JenkinsSlave\workspace\Lucene-Solr-4.x-Windows\solr\core\lib\spatial4j-0.3.jar;C:\Users\JenkinsSlave\workspace\Lucene-Solr-4.x-Windows\solr\example\lib\jetty-continuation-8.1.7.v20120910.jar;C:\Users\JenkinsSlave\workspace\Lucene-Solr-4.x-Windows\solr\example\lib\jetty-deploy-8.1.7.v20120910.jar;C:\Users\JenkinsSlave\workspace\Lucene-Solr-4.x-Windows\solr\example\lib\jetty-http-8.1.7.v20120910.jar;C:\Users\JenkinsSlave\workspace\Lucene-Solr-4.x-Windows\solr\example\lib\jetty-io-8.1.7.v20120910.jar;C:\Users\JenkinsSlave\workspace\Lucene-Solr-4.x-Windows\solr\example\lib\jetty-jmx-8.1.7.v20120910.jar;C:\Users\JenkinsSlave\workspace\Lucene-Solr-4.x-Windows\solr\example\lib\jetty-security-8.1.7.v20120910.jar;C:\Users\JenkinsSlave\workspace\Lucene-Solr-4.x-Windows\solr\example\lib\jetty-server-8.1.7.v20120910.jar;C:\Users\JenkinsSlave\workspace\Lucene-Solr-4.x-Windows\solr\example\lib\jetty-servlet-8.1.7.v20120910.jar;C:\Users\JenkinsSlave\workspace\Lucene-Solr-4.x-Windows\solr\example\lib\jetty-util-8.1.7.v20120910.jar;C:\Users\JenkinsSlave\workspace\Lucene-Solr-4.x-Windows\solr\example\lib\jetty-webapp-8.1.7.v20120910.jar;C:\Users\JenkinsSlave\workspace\Lucene-Solr-4.x-Windows\solr\example\lib\jetty-xml-8.1.7.v20120910.jar;C:\Users\JenkinsSlave\workspace\Lucene-Solr-4.x-Windows\solr\example\lib\servlet-api-3.0.jar;C:\Users\JenkinsSlave\workspace\Lucene-Solr-4.x-Windows\solr\example\example-DIH\solr\db\lib\hsqldb-1.8.0.10.jar;C:\Users\JenkinsSlave\workspace\Lucene-Solr-4.x-Windows\lucene\build\core\classes\java;C:\Users\JenkinsSlave\tools\Ant\ANT_1.8.2\lib\ant-launcher.jar;C:\Users\JenkinsSlave\.ant\lib\ivy-2.2.0.jar;C:\Users\JenkinsSlave\tools\Ant\ANT_1.8.2\lib\ant-antlr.jar;C:\Users\JenkinsSlave\tools\Ant\ANT_1.8.2\lib\ant-apache-bcel.jar;C:\Users\JenkinsSlave\tools\Ant\ANT_1.8.2\lib\ant-apache-bsf.jar;C:\Users\JenkinsSlave\tools\Ant\ANT_1.8.2\lib\ant-apache-log4j.jar;C:\Users\JenkinsSlave\tools\Ant\ANT_1.8.2\lib\ant-apache-oro.jar;C:\Users\JenkinsSlave\tools\Ant\ANT_1.8.2\lib\ant-apache-regexp.jar;C:\Users\JenkinsSlave\tools\Ant\ANT_1.8.2\lib\ant-apache-resolver.jar;C:\Users\JenkinsSlave\tools\Ant\ANT_1.8.2\lib\ant-apache-xalan2.jar;C:\Users\JenkinsSlave\tools\Ant\ANT_1.8.2\lib\ant-commons-logging.jar;C:\Users\JenkinsSlave\tools\Ant\ANT_1.8.2\lib\ant-commons-net.jar;C:\Users\JenkinsSlave\tools\Ant\ANT_1.8.2\lib\ant-jai.jar;C:\Users\JenkinsSlave\tools\Ant\ANT_1.8.2\lib\ant-javamail.jar;C:\Users\JenkinsSlave\tools\Ant\ANT_1.8.2\lib\ant-jdepend.jar;C:\Users\JenkinsSlave\tools\Ant\ANT_1.8.2\lib\ant-jmf.jar;C:\Users\JenkinsSlave\tools\Ant\ANT_1.8.2\lib\ant-jsch.jar;C:\Users\JenkinsSlave\tools\Ant\ANT_1.8.2\lib\ant-junit.jar;C:\Users\JenkinsSlave\tools\Ant\ANT_1.8.2\lib\ant-junit4.jar;C:\Users\JenkinsSlave\tools\Ant\ANT_1.8.2\lib\ant-netrexx.jar;C:\Users\JenkinsSlave\tools\Ant\ANT_1.8.2\lib\ant-swing.jar;C:\Users\JenkinsSlave\tools\Ant\ANT_1.8.2\lib\ant-testutil.jar;C:\Users\JenkinsSlave\tools\Ant\ANT_1.8.2\lib\ant.jar;C:\Users\JenkinsSlave\tools\java\32bit\jdk1.6.0_37\lib\tools.jar;C:\Users\JenkinsSlave\.ivy2\cache\com.carrotsearch.randomizedtesting\junit4-ant\jars\junit4-ant-2.0.4.jar
[junit4:junit4]   2> 94 T92 oaz.Environment.logEnv Server environment:java.library.path=C:\Users\JenkinsSlave\tools\java\32bit\jdk1.6.0_37\jre\bin;C:\Windows\Sun\Java\bin;C:\Windows\system32;C:\Windows;C:\Users\JenkinsSlave\tools\java\32bit\jdk1.6.0_37\bin;C:\Windows\system32;C:\Windows;C:\Windows\System32\Wbem;C:\Windows\System32\WindowsPowerShell\v1.0\;C:\Program Files (x86)\Subversion\bin;.
[junit4:junit4]   2> 94 T92 oaz.Environment.logEnv Server environment:java.io.tmpdir=.
[junit4:junit4]   2> 94 T92 oaz.Environment.logEnv Server environment:java.compiler=<NA>
[junit4:junit4]   2> 94 T92 oaz.Environment.logEnv Server environment:os.name=Windows 7
[junit4:junit4]   2> 94 T92 oaz.Environment.logEnv Server environment:os.arch=x86
[junit4:junit4]   2> 94 T92 oaz.Environment.logEnv Server environment:os.version=6.1
[junit4:junit4]   2> 94 T92 oaz.Environment.logEnv Server environment:user.name=JenkinsSlave
[junit4:junit4]   2> 94 T92 oaz.Environment.logEnv Server environment:user.home=C:\Users\JenkinsSlave
[junit4:junit4]   2> 94 T92 oaz.Environment.logEnv Server environment:user.dir=C:\Users\JenkinsSlave\workspace\Lucene-Solr-4.x-Windows\solr\build\solr-solrj\test\J0
[junit4:junit4]   2> 109 T92 oazs.ZooKeeperServer.setTickTime tickTime set to 1000
[junit4:junit4]   2> 140 T92 oazs.NIOServerCnxn$Factory.<init> binding to port 0.0.0.0/0.0.0.0:0
[junit4:junit4]   2> 172 T92 oazsp.FileTxnSnapLog.save Snapshotting: 0
[junit4:junit4]   2> 250 T91 oasc.ZkTestServer.run start zk server on port:64344
[junit4:junit4]   2> 297 T91 oaz.Environment.logEnv Client environment:zookeeper.version=3.3.6-1366786, built on 07/29/2012 06:22 GMT
[junit4:junit4]   2> 297 T91 oaz.Environment.logEnv Client environment:host.name=JenkinsSlave-PC
[junit4:junit4]   2> 297 T91 oaz.Environment.logEnv Client environment:java.version=1.6.0_37
[junit4:junit4]   2> 297 T91 oaz.Environment.logEnv Client environment:java.vendor=Sun Microsystems Inc.
[junit4:junit4]   2> 297 T91 oaz.Environment.logEnv Client environment:java.home=C:\Users\JenkinsSlave\tools\java\32bit\jdk1.6.0_37\jre
[junit4:junit4]   2> 297 T91 oaz.Environment.logEnv Client environment:java.class.path=C:\Users\JenkinsSlave\workspace\Lucene-Solr-4.x-Windows\solr\build\solr-solrj\classes\test;C:\Users\JenkinsSlave\workspace\Lucene-Solr-4.x-Windows\solr\build\solr-test-framework\classes\java;C:\Users\JenkinsSlave\workspace\Lucene-Solr-4.x-Windows\solr\solrj\src\test-files;C:\Users\JenkinsSlave\workspace\Lucene-Solr-4.x-Windows\lucene\build\test-framework\classes\java;C:\Users\JenkinsSlave\workspace\Lucene-Solr-4.x-Windows\lucene\build\codecs\classes\java;C:\Users\JenkinsSlave\workspace\Lucene-Solr-4.x-Windows\solr\solrj\lib\commons-io-2.1.jar;C:\Users\JenkinsSlave\workspace\Lucene-Solr-4.x-Windows\solr\solrj\lib\httpclient-4.1.3.jar;C:\Users\JenkinsSlave\workspace\Lucene-Solr-4.x-Windows\solr\solrj\lib\httpcore-4.1.4.jar;C:\Users\JenkinsSlave\workspace\Lucene-Solr-4.x-Windows\solr\solrj\lib\httpmime-4.1.3.jar;C:\Users\JenkinsSlave\workspace\Lucene-Solr-4.x-Windows\solr\solrj\lib\jcl-over-slf4j-1.6.4.jar;C:\Users\JenkinsSlave\workspace\Lucene-Solr-4.x-Windows\solr\solrj\lib\log4j-over-slf4j-1.6.4.jar;C:\Users\JenkinsSlave\workspace\Lucene-Solr-4.x-Windows\solr\solrj\lib\slf4j-api-1.6.4.jar;C:\Users\JenkinsSlave\workspace\Lucene-Solr-4.x-Windows\solr\solrj\lib\slf4j-jdk14-1.6.4.jar;C:\Users\JenkinsSlave\workspace\Lucene-Solr-4.x-Windows\solr\solrj\lib\wstx-asl-3.2.7.jar;C:\Users\JenkinsSlave\workspace\Lucene-Solr-4.x-Windows\solr\solrj\lib\zookeeper-3.3.6.jar;C:\Users\JenkinsSlave\workspace\Lucene-Solr-4.x-Windows\lucene\test-framework\lib\junit-4.10.jar;C:\Users\JenkinsSlave\workspace\Lucene-Solr-4.x-Windows\lucene\test-framework\lib\randomizedtesting-runner-2.0.4.jar;C:\Users\JenkinsSlave\workspace\Lucene-Solr-4.x-Windows\solr\build\solr-solrj\classes\java;C:\Users\JenkinsSlave\workspace\Lucene-Solr-4.x-Windows\solr\build\solr-core\classes\java;C:\Users\JenkinsSlave\workspace\Lucene-Solr-4.x-Windows\lucene\build\analysis\common\lucene-analyzers-common-4.1-SNAPSHOT.jar;C:\Users\JenkinsSlave\workspace\Lucene-Solr-4.x-Windows\lucene\build\analysis\kuromoji\lucene-analyzers-kuromoji-4.1-SNAPSHOT.jar;C:\Users\JenkinsSlave\workspace\Lucene-Solr-4.x-Windows\lucene\build\analysis\phonetic\lucene-analyzers-phonetic-4.1-SNAPSHOT.jar;C:\Users\JenkinsSlave\workspace\Lucene-Solr-4.x-Windows\lucene\build\highlighter\lucene-highlighter-4.1-SNAPSHOT.jar;C:\Users\JenkinsSlave\workspace\Lucene-Solr-4.x-Windows\lucene\build\memory\lucene-memory-4.1-SNAPSHOT.jar;C:\Users\JenkinsSlave\workspace\Lucene-Solr-4.x-Windows\lucene\build\misc\lucene-misc-4.1-SNAPSHOT.jar;C:\Users\JenkinsSlave\workspace\Lucene-Solr-4.x-Windows\lucene\build\spatial\lucene-spatial-4.1-SNAPSHOT.jar;C:\Users\JenkinsSlave\workspace\Lucene-Solr-4.x-Windows\lucene\build\suggest\lucene-suggest-4.1-SNAPSHOT.jar;C:\Users\JenkinsSlave\workspace\Lucene-Solr-4.x-Windows\lucene\build\grouping\lucene-grouping-4.1-SNAPSHOT.jar;C:\Users\JenkinsSlave\workspace\Lucene-Solr-4.x-Windows\lucene\build\queries\lucene-queries-4.1-SNAPSHOT.jar;C:\Users\JenkinsSlave\workspace\Lucene-Solr-4.x-Windows\lucene\build\queryparser\lucene-queryparser-4.1-SNAPSHOT.jar;C:\Users\JenkinsSlave\workspace\Lucene-Solr-4.x-Windows\solr\core\lib\commons-cli-1.2.jar;C:\Users\JenkinsSlave\workspace\Lucene-Solr-4.x-Windows\solr\core\lib\commons-codec-1.7.jar;C:\Users\JenkinsSlave\workspace\Lucene-Solr-4.x-Windows\solr\core\lib\commons-fileupload-1.2.1.jar;C:\Users\JenkinsSlave\workspace\Lucene-Solr-4.x-Windows\solr\core\lib\commons-lang-2.6.jar;C:\Users\JenkinsSlave\workspace\Lucene-Solr-4.x-Windows\solr\core\lib\easymock-2.2.jar;C:\Users\JenkinsSlave\workspace\Lucene-Solr-4.x-Windows\solr\core\lib\guava-r05.jar;C:\Users\JenkinsSlave\workspace\Lucene-Solr-4.x-Windows\solr\core\lib\javax.servlet-api-3.0.1.jar;C:\Users\JenkinsSlave\workspace\Lucene-Solr-4.x-Windows\solr\core\lib\spatial4j-0.3.jar;C:\Users\JenkinsSlave\workspace\Lucene-Solr-4.x-Windows\solr\example\lib\jetty-continuation-8.1.7.v20120910.jar;C:\Users\JenkinsSlave\workspace\Lucene-Solr-4.x-Windows\solr\example\lib\jetty-deploy-8.1.7.v20120910.jar;C:\Users\JenkinsSlave\workspace\Lucene-Solr-4.x-Windows\solr\example\lib\jetty-http-8.1.7.v20120910.jar;C:\Users\JenkinsSlave\workspace\Lucene-Solr-4.x-Windows\solr\example\lib\jetty-io-8.1.7.v20120910.jar;C:\Users\JenkinsSlave\workspace\Lucene-Solr-4.x-Windows\solr\example\lib\jetty-jmx-8.1.7.v20120910.jar;C:\Users\JenkinsSlave\workspace\Lucene-Solr-4.x-Windows\solr\example\lib\jetty-security-8.1.7.v20120910.jar;C:\Users\JenkinsSlave\workspace\Lucene-Solr-4.x-Windows\solr\example\lib\jetty-server-8.1.7.v20120910.jar;C:\Users\JenkinsSlave\workspace\Lucene-Solr-4.x-Windows\solr\example\lib\jetty-servlet-8.1.7.v20120910.jar;C:\Users\JenkinsSlave\workspace\Lucene-Solr-4.x-Windows\solr\example\lib\jetty-util-8.1.7.v20120910.jar;C:\Users\JenkinsSlave\workspace\Lucene-Solr-4.x-Windows\solr\example\lib\jetty-webapp-8.1.7.v20120910.jar;C:\Users\JenkinsSlave\workspace\Lucene-Solr-4.x-Windows\solr\example\lib\jetty-xml-8.1.7.v20120910.jar;C:\Users\JenkinsSlave\workspace\Lucene-Solr-4.x-Windows\solr\example\lib\servlet-api-3.0.jar;C:\Users\JenkinsSlave\workspace\Lucene-Solr-4.x-Windows\solr\example\example-DIH\solr\db\lib\hsqldb-1.8.0.10.jar;C:\Users\JenkinsSlave\workspace\Lucene-Solr-4.x-Windows\lucene\build\core\classes\java;C:\Users\JenkinsSlave\tools\Ant\ANT_1.8.2\lib\ant-launcher.jar;C:\Users\JenkinsSlave\.ant\lib\ivy-2.2.0.jar;C:\Users\JenkinsSlave\tools\Ant\ANT_1.8.2\lib\ant-antlr.jar;C:\Users\JenkinsSlave\tools\Ant\ANT_1.8.2\lib\ant-apache-bcel.jar;C:\Users\JenkinsSlave\tools\Ant\ANT_1.8.2\lib\ant-apache-bsf.jar;C:\Users\JenkinsSlave\tools\Ant\ANT_1.8.2\lib\ant-apache-log4j.jar;C:\Users\JenkinsSlave\tools\Ant\ANT_1.8.2\lib\ant-apache-oro.jar;C:\Users\JenkinsSlave\tools\Ant\ANT_1.8.2\lib\ant-apache-regexp.jar;C:\Users\JenkinsSlave\tools\Ant\ANT_1.8.2\lib\ant-apache-resolver.jar;C:\Users\JenkinsSlave\tools\Ant\ANT_1.8.2\lib\ant-apache-xalan2.jar;C:\Users\JenkinsSlave\tools\Ant\ANT_1.8.2\lib\ant-commons-logging.jar;C:\Users\JenkinsSlave\tools\Ant\ANT_1.8.2\lib\ant-commons-net.jar;C:\Users\JenkinsSlave\tools\Ant\ANT_1.8.2\lib\ant-jai.jar;C:\Users\JenkinsSlave\tools\Ant\ANT_1.8.2\lib\ant-javamail.jar;C:\Users\JenkinsSlave\tools\Ant\ANT_1.8.2\lib\ant-jdepend.jar;C:\Users\JenkinsSlave\tools\Ant\ANT_1.8.2\lib\ant-jmf.jar;C:\Users\JenkinsSlave\tools\Ant\ANT_1.8.2\lib\ant-jsch.jar;C:\Users\JenkinsSlave\tools\Ant\ANT_1.8.2\lib\ant-junit.jar;C:\Users\JenkinsSlave\tools\Ant\ANT_1.8.2\lib\ant-junit4.jar;C:\Users\JenkinsSlave\tools\Ant\ANT_1.8.2\lib\ant-netrexx.jar;C:\Users\JenkinsSlave\tools\Ant\ANT_1.8.2\lib\ant-swing.jar;C:\Users\JenkinsSlave\tools\Ant\ANT_1.8.2\lib\ant-testutil.jar;C:\Users\JenkinsSlave\tools\Ant\ANT_1.8.2\lib\ant.jar;C:\Users\JenkinsSlave\tools\java\32bit\jdk1.6.0_37\lib\tools.jar;C:\Users\JenkinsSlave\.ivy2\cache\com.carrotsearch.randomizedtesting\junit4-ant\jars\junit4-ant-2.0.4.jar
[junit4:junit4]   2> 297 T91 oaz.Environment.logEnv Client environment:java.library.path=C:\Users\JenkinsSlave\tools\java\32bit\jdk1.6.0_37\jre\bin;C:\Windows\Sun\Java\bin;C:\Windows\system32;C:\Windows;C:\Users\JenkinsSlave\tools\java\32bit\jdk1.6.0_37\bin;C:\Windows\system32;C:\Windows;C:\Windows\System32\Wbem;C:\Windows\System32\WindowsPowerShell\v1.0\;C:\Program Files (x86)\Subversion\bin;.
[junit4:junit4]   2> 297 T91 oaz.Environment.logEnv Client environment:java.io.tmpdir=.
[junit4:junit4]   2> 297 T91 oaz.Environment.logEnv Client environment:java.compiler=<NA>
[junit4:junit4]   2> 297 T91 oaz.Environment.logEnv Client environment:os.name=Windows 7
[junit4:junit4]   2> 297 T91 oaz.Environment.logEnv Client environment:os.arch=x86
[junit4:junit4]   2> 297 T91 oaz.Environment.logEnv Client environment:os.version=6.1
[junit4:junit4]   2> 297 T91 oaz.Environment.logEnv Client environment:user.name=JenkinsSlave
[junit4:junit4]   2> 297 T91 oaz.Environment.logEnv Client environment:user.home=C:\Users\JenkinsSlave
[junit4:junit4]   2> 297 T91 oaz.Environment.logEnv Client environment:user.dir=C:\Users\JenkinsSlave\workspace\Lucene-Solr-4.x-Windows\solr\build\solr-solrj\test\J0
[junit4:junit4]   2> 297 T91 oaz.ZooKeeper.<init> Initiating client connection, connectString=127.0.0.1:64344 sessionTimeout=10000 watcher=org.apache.solr.common.cloud.ConnectionManager@1e2ad75
[junit4:junit4]   2> 328 T97 oaz.ClientCnxn$SendThread.startConnect Opening socket connection to server /127.0.0.1:64344
[junit4:junit4]   2> 328 T91 oascc.ConnectionManager.waitForConnected Waiting for client to connect to ZooKeeper
[junit4:junit4]   2> 328 T97 oaz.ClientCnxn$SendThread.primeConnection Socket connection established to 127.0.0.1/127.0.0.1:64344, initiating session
[junit4:junit4]   2> 328 T93 oazs.NIOServerCnxn$Factory.run Accepted socket connection from /127.0.0.1:64347
[junit4:junit4]   2> 344 T93 oazs.NIOServerCnxn.readConnectRequest Client attempting to establish new session at /127.0.0.1:64347
[junit4:junit4]   2> 344 T95 oazsp.FileTxnLog.append Creating new log file: log.1
[junit4:junit4]   2> 390 T95 oazs.NIOServerCnxn.finishSessionInit Established session 0x13ae47df0640000 with negotiated timeout 10000 for client /127.0.0.1:64347
[junit4:junit4]   2> 390 T97 oaz.ClientCnxn$SendThread.readConnectResult Session establishment complete on server 127.0.0.1/127.0.0.1:64344, sessionid = 0x13ae47df0640000, negotiated timeout = 10000
[junit4:junit4]   2> 406 T98 oascc.ConnectionManager.process Watcher org.apache.solr.common.cloud.ConnectionManager@1e2ad75 name:ZooKeeperConnection Watcher:127.0.0.1:64344 got event WatchedEvent state:SyncConnected type:None path:null path:null type:None
[junit4:junit4]   2> 406 T91 oascc.ConnectionManager.waitForConnected Client is connected to ZooKeeper
[junit4:junit4]   2> 406 T91 oascc.SolrZkClient.makePath makePath: /solr
[junit4:junit4]   2> 469 T96 oazs.PrepRequestProcessor.pRequest Processed session termination for sessionid: 0x13ae47df0640000
[junit4:junit4]   2> 484 T91 oaz.ZooKeeper.close Session: 0x13ae47df0640000 closed
[junit4:junit4]   2> 484 T93 oazs.NIOServerCnxn.closeSock Closed socket connection for client /127.0.0.1:64347 which had sessionid 0x13ae47df0640000
[junit4:junit4]   2> 484 T98 oaz.ClientCnxn$EventThread.run EventThread shut down
[junit4:junit4]   2> 484 T91 oaz.ZooKeeper.<init> Initiating client connection, connectString=127.0.0.1:64344/solr sessionTimeout=10000 watcher=org.apache.solr.common.cloud.ConnectionManager@179a22d
[junit4:junit4]   2> 484 T99 oaz.ClientCnxn$SendThread.startConnect Opening socket connection to server /127.0.0.1:64344
[junit4:junit4]   2> 484 T91 oascc.ConnectionManager.waitForConnected Waiting for client to connect to ZooKeeper
[junit4:junit4]   2> 484 T99 oaz.ClientCnxn$SendThread.primeConnection Socket connection established to 127.0.0.1/127.0.0.1:64344, initiating session
[junit4:junit4]   2> 484 T93 oazs.NIOServerCnxn$Factory.run Accepted socket connection from /127.0.0.1:64350
[junit4:junit4]   2> 484 T93 oazs.NIOServerCnxn.readConnectRequest Client attempting to establish new session at /127.0.0.1:64350
[junit4:junit4]   2> 500 T95 oazs.NIOServerCnxn.finishSessionInit Established session 0x13ae47df0640001 with negotiated timeout 10000 for client /127.0.0.1:64350
[junit4:junit4]   2> 500 T99 oaz.ClientCnxn$SendThread.readConnectResult Session establishment complete on server 127.0.0.1/127.0.0.1:64344, sessionid = 0x13ae47df0640001, negotiated timeout = 10000
[junit4:junit4]   2> 500 T100 oascc.ConnectionManager.process Watcher org.apache.solr.common.cloud.ConnectionManager@179a22d name:ZooKeeperConnection Watcher:127.0.0.1:64344/solr got event WatchedEvent state:SyncConnected type:None path:null path:null type:None
[junit4:junit4]   2> 515 T91 oascc.ConnectionManager.waitForConnected Client is connected to ZooKeeper
[junit4:junit4]   2> 531 T91 oascc.SolrZkClient.makePath makePath: /collections/collection1
[junit4:junit4]   2> 578 T91 oascc.SolrZkClient.makePath makePath: /collections/collection1/shards
[junit4:junit4]   2> 594 T91 oascc.SolrZkClient.makePath makePath: /collections/control_collection
[junit4:junit4]   2> 625 T91 oascc.SolrZkClient.makePath makePath: /collections/control_collection/shards
[junit4:junit4]   2> 640 T91 oasc.AbstractZkTestCase.putConfig put C:\Users\JenkinsSlave\workspace\Lucene-Solr-4.x-Windows\solr\solrj\src\test-files\solrj\solr\collection1\conf\solrconfig.xml to /configs/conf1/solrconfig.xml
[junit4:junit4]   2> 640 T91 oascc.SolrZkClient.makePath makePath: /configs/conf1/solrconfig.xml
[junit4:junit4]   2> 703 T91 oasc.AbstractZkTestCase.putConfig put C:\Users\JenkinsSlave\workspace\Lucene-Solr-4.x-Windows\solr\solrj\src\test-files\solrj\solr\collection1\conf\schema.xml to /configs/conf1/schema.xml
[junit4:junit4]   2> 719 T91 oascc.SolrZkClient.makePath makePath: /configs/conf1/schema.xml
[junit4:junit4]   2> 734 T91 oasc.AbstractZkTestCase.putConfig put C:\Users\JenkinsSlave\workspace\Lucene-Solr-4.x-Windows\solr\solrj\src\test-files\solrj\solr\collection1\conf\solrconfig.xml to /configs/conf1/solrconfig.xml
[junit4:junit4]   2> 734 T91 oascc.SolrZkClient.makePath makePath: /configs/conf1/solrconfig.xml
[junit4:junit4]   2> 765 T91 oasc.AbstractZkTestCase.putConfig skipping C:\Users\JenkinsSlave\workspace\Lucene-Solr-4.x-Windows\solr\solrj\src\test-files\solrj\solr\collection1\conf\stopwords.txt because it doesn't exist
[junit4:junit4]   2> 765 T91 oasc.AbstractZkTestCase.putConfig skipping C:\Users\JenkinsSlave\workspace\Lucene-Solr-4.x-Windows\solr\solrj\src\test-files\solrj\solr\collection1\conf\protwords.txt because it doesn't exist
[junit4:junit4]   2> 765 T91 oasc.AbstractZkTestCase.putConfig skipping C:\Users\JenkinsSlave\workspace\Lucene-Solr-4.x-Windows\solr\solrj\src\test-files\solrj\solr\collection1\conf\currency.xml because it doesn't exist
[junit4:junit4]   2> 765 T91 oasc.AbstractZkTestCase.putConfig skipping C:\Users\JenkinsSlave\workspace\Lucene-Solr-4.x-Windows\solr\solrj\src\test-files\solrj\solr\collection1\conf\open-exchange-rates.json because it doesn't exist
[junit4:junit4]   2> 765 T91 oasc.AbstractZkTestCase.putConfig skipping C:\Users\JenkinsSlave\workspace\Lucene-Solr-4.x-Windows\solr\solrj\src\test-files\solrj\solr\collection1\conf\mapping-ISOLatin1Accent.txt because it doesn't exist
[junit4:junit4]   2> 765 T91 oasc.AbstractZkTestCase.putConfig skipping C:\Users\JenkinsSlave\workspace\Lucene-Solr-4.x-Windows\solr\solrj\src\test-files\solrj\solr\collection1\conf\old_synonyms.txt because it doesn't exist
[junit4:junit4]   2> 765 T91 oasc.AbstractZkTestCase.putConfig skipping C:\Users\JenkinsSlave\workspace\Lucene-Solr-4.x-Windows\solr\solrj\src\test-files\solrj\solr\collection1\conf\synonyms.txt because it doesn't exist
[junit4:junit4]   2> 765 T96 oazs.PrepRequestProcessor.pRequest Processed session termination for sessionid: 0x13ae47df0640001
[junit4:junit4]   2> 781 T91 oaz.ZooKeeper.close Session: 0x13ae47df0640001 closed
[junit4:junit4]   2> 781 T100 oaz.ClientCnxn$EventThread.run EventThread shut down
[junit4:junit4]   2> 781 T93 oazs.NIOServerCnxn.closeSock Closed socket connection for client /127.0.0.1:64350 which had sessionid 0x13ae47df0640001
[junit4:junit4]   2> 781 T91 oejs.Server.doStart jetty-8.1.7.v20120910
[junit4:junit4]   2> 781 T91 oejs.AbstractConnector.doStart Started SelectChannelConnector@0.0.0.0:64351
[junit4:junit4]   2> 781 T91 oasc.SolrResourceLoader.locateSolrHome JNDI not configured for solr (NoInitialContextEx)
[junit4:junit4]   2> 781 T91 oasc.SolrResourceLoader.locateSolrHome using system property solr.solr.home: C:\Users\JenkinsSlave\workspace\Lucene-Solr-4.x-Windows\solr\solrj\src\test-files\solrj\solr
[junit4:junit4]   2> 797 T91 oasc.SolrResourceLoader.<init> new SolrResourceLoader for deduced Solr Home: 'C:\Users\JenkinsSlave\workspace\Lucene-Solr-4.x-Windows\solr\solrj\src\test-files\solrj\solr\'
[junit4:junit4]   2> 828 T91 oass.SolrDispatchFilter.init SolrDispatchFilter.init()
[junit4:junit4]   2> 828 T91 oasc.SolrResourceLoader.locateSolrHome JNDI not configured for solr (NoInitialContextEx)
[junit4:junit4]   2> 828 T91 oasc.SolrResourceLoader.locateSolrHome using system property solr.solr.home: C:\Users\JenkinsSlave\workspace\Lucene-Solr-4.x-Windows\solr\solrj\src\test-files\solrj\solr
[junit4:junit4]   2> 828 T91 oasc.CoreContainer$Initializer.initialize looking for solr.xml: C:\Users\JenkinsSlave\workspace\Lucene-Solr-4.x-Windows\solr\solrj\src\test-files\solrj\solr\solr.xml
[junit4:junit4]   2> 828 T91 oasc.CoreContainer.<init> New CoreContainer 7501974
[junit4:junit4]   2> 844 T91 oasc.CoreContainer.load Loading CoreContainer using Solr Home: 'C:\Users\JenkinsSlave\workspace\Lucene-Solr-4.x-Windows\solr\solrj\src\test-files\solrj\solr\'
[junit4:junit4]   2> 844 T91 oasc.SolrResourceLoader.<init> new SolrResourceLoader for directory: 'C:\Users\JenkinsSlave\workspace\Lucene-Solr-4.x-Windows\solr\solrj\src\test-files\solrj\solr\'
[junit4:junit4]   2> 859 T91 oasc.CoreContainer.load Registering Log Listener
[junit4:junit4]   2> 875 T91 oasc.CoreContainer.initZooKeeper Zookeeper client=127.0.0.1:64344/solr
[junit4:junit4]   2> 890 T91 oaz.ZooKeeper.<init> Initiating client connection, connectString=127.0.0.1:64344/solr sessionTimeout=8000 watcher=org.apache.solr.common.cloud.ConnectionManager@1ce0e18
[junit4:junit4]   2> 890 T110 oaz.ClientCnxn$SendThread.startConnect Opening socket connection to server /127.0.0.1:64344
[junit4:junit4]   2> 890 T91 oascc.ConnectionManager.waitForConnected Waiting for client to connect to ZooKeeper
[junit4:junit4]   2> 890 T110 oaz.ClientCnxn$SendThread.primeConnection Socket connection established to 127.0.0.1/127.0.0.1:64344, initiating session
[junit4:junit4]   2> 890 T93 oazs.NIOServerCnxn$Factory.run Accepted socket connection from /127.0.0.1:64356
[junit4:junit4]   2> 890 T93 oazs.NIOServerCnxn.readConnectRequest Client attempting to establish new session at /127.0.0.1:64356
[junit4:junit4]   2> 922 T95 oazs.NIOServerCnxn.finishSessionInit Established session 0x13ae47df0640002 with negotiated timeout 8000 for client /127.0.0.1:64356
[junit4:junit4]   2> 922 T110 oaz.ClientCnxn$SendThread.readConnectResult Session establishment complete on server 127.0.0.1/127.0.0.1:64344, sessionid = 0x13ae47df0640002, negotiated timeout = 8000
[junit4:junit4]   2> 922 T111 oascc.ConnectionManager.process Watcher org.apache.solr.common.cloud.ConnectionManager@1ce0e18 name:ZooKeeperConnection Watcher:127.0.0.1:64344/solr got event WatchedEvent state:SyncConnected type:None path:null path:null type:None
[junit4:junit4]   2> 922 T91 oascc.ConnectionManager.waitForConnected Client is connected to ZooKeeper
[junit4:junit4]   2> 953 T96 oazs.PrepRequestProcessor.pRequest Got user-level KeeperException when processing sessionid:0x13ae47df0640002 type:create cxid:0x2 zxid:0xfffffffffffffffe txntype:unknown reqpath:n/a Error Path:/solr/overseer Error:KeeperErrorCode = NodeExists for /solr/overseer
[junit4:junit4]   2> 984 T91 oascc.SolrZkClient.makePath makePath: /live_nodes
[junit4:junit4]   2> 1015 T91 oasc.ZkController.createEphemeralLiveNode Register node as live in ZooKeeper:/live_nodes/127.0.0.1:64351_solr
[junit4:junit4]   2> 1031 T96 oazs.PrepRequestProcessor.pRequest Got user-level KeeperException when processing sessionid:0x13ae47df0640002 type:delete cxid:0x7 zxid:0xfffffffffffffffe txntype:unknown reqpath:n/a Error Path:/solr/live_nodes/127.0.0.1:64351_solr Error:KeeperErrorCode = NoNode for /solr/live_nodes/127.0.0.1:64351_solr
[junit4:junit4]   2> 1047 T91 oascc.SolrZkClient.makePath makePath: /live_nodes/127.0.0.1:64351_solr
[junit4:junit4]   2> 1078 T91 oashc.HttpShardHandlerFactory.getParameter Setting socketTimeout to: 0
[junit4:junit4]   2> 1078 T91 oashc.HttpShardHandlerFactory.getParameter Setting urlScheme to: http://
[junit4:junit4]   2> 1078 T91 oashc.HttpShardHandlerFactory.getParameter Setting connTimeout to: 0
[junit4:junit4]   2> 1078 T91 oashc.HttpShardHandlerFactory.getParameter Setting maxConnectionsPerHost to: 20
[junit4:junit4]   2> 1078 T91 oashc.HttpShardHandlerFactory.getParameter Setting corePoolSize to: 0
[junit4:junit4]   2> 1078 T91 oashc.HttpShardHandlerFactory.getParameter Setting maximumPoolSize to: 2147483647
[junit4:junit4]   2> 1078 T91 oashc.HttpShardHandlerFactory.getParameter Setting maxThreadIdleTime to: 5
[junit4:junit4]   2> 1078 T91 oashc.HttpShardHandlerFactory.getParameter Setting sizeOfQueue to: -1
[junit4:junit4]   2> 1078 T91 oashc.HttpShardHandlerFactory.getParameter Setting fairnessPolicy to: false
[junit4:junit4]   2> 1078 T91 oascsi.HttpClientUtil.createClient Creating new http client, config:maxConnectionsPerHost=20&maxConnections=10000&socketTimeout=0&connTimeout=0&retry=false
[junit4:junit4]   2> 1094 T91 oascc.SolrZkClient.makePath makePath: /overseer_elect/election
[junit4:junit4]   2> 1156 T96 oazs.PrepRequestProcessor.pRequest Got user-level KeeperException when processing sessionid:0x13ae47df0640002 type:delete cxid:0x15 zxid:0xfffffffffffffffe txntype:unknown reqpath:n/a Error Path:/solr/overseer_elect/leader Error:KeeperErrorCode = NoNode for /solr/overseer_elect/leader
[junit4:junit4]   2> 1172 T91 oascc.SolrZkClient.makePath makePath: /overseer_elect/leader
[junit4:junit4]   2> 1203 T91 oasc.Overseer.start Overseer (id=88634372242276354-127.0.0.1:64351_solr-n_0000000000) starting
[junit4:junit4]   2> 1203 T96 oazs.PrepRequestProcessor.pRequest Got user-level KeeperException when processing sessionid:0x13ae47df0640002 type:create cxid:0x1a zxid:0xfffffffffffffffe txntype:unknown reqpath:n/a Error Path:/solr/overseer Error:KeeperErrorCode = NodeExists for /solr/overseer
[junit4:junit4]   2> 1250 T96 oazs.PrepRequestProcessor.pRequest Got user-level KeeperException when processing sessionid:0x13ae47df0640002 type:create cxid:0x1b zxid:0xfffffffffffffffe txntype:unknown reqpath:n/a Error Path:/solr/overseer Error:KeeperErrorCode = NodeExists for /solr/overseer
[junit4:junit4]   2> 1281 T96 oazs.PrepRequestProcessor.pRequest Got user-level KeeperException when processing sessionid:0x13ae47df0640002 type:create cxid:0x1c zxid:0xfffffffffffffffe txntype:unknown reqpath:n/a Error Path:/solr/overseer Error:KeeperErrorCode = NodeExists for /solr/overseer
[junit4:junit4]   2> 1297 T96 oazs.PrepRequestProcessor.pRequest Got user-level KeeperException when processing sessionid:0x13ae47df0640002 type:create cxid:0x1d zxid:0xfffffffffffffffe txntype:unknown reqpath:n/a Error Path:/solr/overseer Error:KeeperErrorCode = NodeExists for /solr/overseer
[junit4:junit4]   2> 1328 T113 oasc.OverseerCollectionProcessor.run Process current queue of collection messages
[junit4:junit4]   2> 1328 T91 oascc.SolrZkClient.makePath makePath: /clusterstate.json
[junit4:junit4]   2> 1344 T91 oascc.ZkStateReader.createClusterStateWatchersAndUpdate Updating cluster state from ZooKeeper... 
[junit4:junit4]   2> 1375 T112 oasc.Overseer$ClusterStateUpdater.run Starting to work on the main queue
[junit4:junit4]   2> 1390 T91 oasc.CoreContainer.create Creating SolrCore 'collection1' using instanceDir: C:\Users\JenkinsSlave\workspace\Lucene-Solr-4.x-Windows\solr\solrj\src\test-files\solrj\solr\collection1
[junit4:junit4]   2> 1390 T91 oasc.ZkController.createCollectionZkNode Check for collection zkNode:control_collection
[junit4:junit4]   2> 1390 T91 oasc.ZkController.createCollectionZkNode Collection zkNode exists
[junit4:junit4]   2> 1406 T91 oasc.ZkController.readConfigName Load collection config from:/collections/control_collection
[junit4:junit4]   2> 1406 T91 oasc.SolrResourceLoader.<init> new SolrResourceLoader for directory: 'C:\Users\JenkinsSlave\workspace\Lucene-Solr-4.x-Windows\solr\solrj\src\test-files\solrj\solr\collection1\'
[junit4:junit4]   2> 1469 T91 oasc.SolrConfig.<init> Using Lucene MatchVersion: LUCENE_41
[junit4:junit4]   2> 1515 T91 oasc.SolrConfig.<init> Loaded SolrConfig: solrconfig.xml
[junit4:junit4]   2> 1515 T91 oass.IndexSchema.readSchema Reading Solr Schema
[junit4:junit4]   2> 1547 T91 oass.IndexSchema.readSchema Schema name=test
[junit4:junit4]   2> 2297 T91 oass.IndexSchema.readSchema default search field in schema is text
[junit4:junit4]   2> 2297 T91 oass.IndexSchema.readSchema unique key field: id
[junit4:junit4]   2> 2297 T91 oass.IndexSchema.readSchema WARNING Field text is not multivalued and destination for multiple copyFields (2)
[junit4:junit4]   2> 2297 T91 oass.IndexSchema.readSchema WARNING Field lowerfilt1and2 is not multivalued and destination for multiple copyFields (2)
[junit4:junit4]   2> 2297 T91 oasc.SolrCore.<init> [collection1] Opening new SolrCore at C:\Users\JenkinsSlave\workspace\Lucene-Solr-4.x-Windows\solr\solrj\src\test-files\solrj\solr\collection1\, dataDir=.\org.apache.solr.client.solrj.impl.CloudSolrServerTest-1352453189560/control/data\
[junit4:junit4]   2> 2312 T91 oasc.SolrCore.<init> JMX monitoring not detected for core: collection1
[junit4:junit4]   2> 2328 T91 oasc.SolrCore.getNewIndexDir New index directory detected: old=null new=.\org.apache.solr.client.solrj.impl.CloudSolrServerTest-1352453189560/control/data\index/
[junit4:junit4]   2> 2328 T91 oasc.SolrCore.initIndex WARNING [collection1] Solr index directory '.\org.apache.solr.client.solrj.impl.CloudSolrServerTest-1352453189560\control\data\index' doesn't exist. Creating new index...
[junit4:junit4]   2> 2359 T91 oasc.CachingDirectoryFactory.get return new directory for C:\Users\JenkinsSlave\workspace\Lucene-Solr-4.x-Windows\solr\build\solr-solrj\test\J0\.\org.apache.solr.client.solrj.impl.CloudSolrServerTest-1352453189560\control\data\index forceNew:false
[junit4:junit4]   2> 2390 T91 oasc.SolrDeletionPolicy.onCommit SolrDeletionPolicy.onCommit: commits:num=1
[junit4:junit4]   2> 		commit{dir=C:\Users\JenkinsSlave\workspace\Lucene-Solr-4.x-Windows\solr\build\solr-solrj\test\J0\org.apache.solr.client.solrj.impl.CloudSolrServerTest-1352453189560\control\data\index,segFN=segments_1,generation=1,filenames=[segments_1]
[junit4:junit4]   2> 2390 T91 oasc.SolrDeletionPolicy.updateCommits newest commit = 1
[junit4:junit4]   2> 2406 T91 oasc.RequestHandlers.initHandlersFromConfig created /get: solr.RealTimeGetHandler
[junit4:junit4]   2> 2406 T91 oasc.RequestHandlers.initHandlersFromConfig adding lazy requestHandler: solr.ReplicationHandler
[junit4:junit4]   2> 2406 T91 oasc.RequestHandlers.initHandlersFromConfig created /replication: solr.ReplicationHandler
[junit4:junit4]   2> 2406 T91 oasc.RequestHandlers.initHandlersFromConfig created standard: solr.StandardRequestHandler
[junit4:junit4]   2> 2406 T91 oasc.RequestHandlers.initHandlersFromConfig created /update: solr.UpdateRequestHandler
[junit4:junit4]   2> 2406 T91 oasc.RequestHandlers.initHandlersFromConfig created /admin/: org.apache.solr.handler.admin.AdminHandlers
[junit4:junit4]   2> 2422 T91 oashl.XMLLoader.init xsltCacheLifetimeSeconds=60
[junit4:junit4]   2> 2422 T91 oass.SolrIndexSearcher.<init> Opening Searcher@1acb189 main
[junit4:junit4]   2> 2437 T91 oasu.CommitTracker.<init> Hard AutoCommit: disabled
[junit4:junit4]   2> 2437 T91 oasu.CommitTracker.<init> Soft AutoCommit: disabled
[junit4:junit4]   2> 2437 T114 oasc.SolrCore.registerSearcher [collection1] Registered new searcher Searcher@1acb189 main{StandardDirectoryReader(segments_1:1)}
[junit4:junit4]   2> 2437 T91 oasc.ZkController.publish numShards not found on descriptor - reading it from system property
[junit4:junit4]   2> 2437 T96 oazs.PrepRequestProcessor.pRequest Got user-level KeeperException when processing sessionid:0x13ae47df0640002 type:create cxid:0x39 zxid:0xfffffffffffffffe txntype:unknown reqpath:n/a Error Path:/solr/overseer/queue Error:KeeperErrorCode = NoNode for /solr/overseer/queue
[junit4:junit4]   2> 2469 T91 oasc.CoreContainer.register registering core: collection1
[junit4:junit4]   2> 2469 T91 oasc.ZkController.register Register shard - core:collection1 address:http://127.0.0.1:64351/solr shardId:control_shard
[junit4:junit4]   2> 2484 T91 oascsi.HttpClientUtil.createClient Creating new http client, config:maxConnections=10000&maxConnectionsPerHost=20&connTimeout=30000&socketTimeout=30000&retry=false
[junit4:junit4]   2> 2500 T91 oascc.SolrZkClient.makePath makePath: /collections/control_collection/leader_elect/control_shard/election
[junit4:junit4]   2> 2562 T96 oazs.PrepRequestProcessor.pRequest Got user-level KeeperException when processing sessionid:0x13ae47df0640002 type:delete cxid:0x48 zxid:0xfffffffffffffffe txntype:unknown reqpath:n/a Error Path:/solr/collections/control_collection/leaders Error:KeeperErrorCode = NoNode for /solr/collections/control_collection/leaders
[junit4:junit4]   2> 2562 T91 oasc.ShardLeaderElectionContext.runLeaderProcess Running the leader process.
[junit4:junit4]   2> 2562 T96 oazs.PrepRequestProcessor.pRequest Got user-level KeeperException when processing sessionid:0x13ae47df0640002 type:create cxid:0x49 zxid:0xfffffffffffffffe txntype:unknown reqpath:n/a Error Path:/solr/overseer Error:KeeperErrorCode = NodeExists for /solr/overseer
[junit4:junit4]   2> 2906 T112 oascc.ZkStateReader.updateClusterState Updating cloud state from ZooKeeper... 
[junit4:junit4]   2> 2906 T112 oasc.Overseer$ClusterStateUpdater.updateState Update state numShards=null message={
[junit4:junit4]   2> 	  "operation":"state",
[junit4:junit4]   2> 	  "numShards":null,
[junit4:junit4]   2> 	  "shard":"control_shard",
[junit4:junit4]   2> 	  "roles":null,
[junit4:junit4]   2> 	  "state":"down",
[junit4:junit4]   2> 	  "core":"collection1",
[junit4:junit4]   2> 	  "collection":"control_collection",
[junit4:junit4]   2> 	  "node_name":"127.0.0.1:64351_solr",
[junit4:junit4]   2> 	  "base_url":"http://127.0.0.1:64351/solr"}
[junit4:junit4]   2> 2922 T96 oazs.PrepRequestProcessor.pRequest Got user-level KeeperException when processing sessionid:0x13ae47df0640002 type:create cxid:0x50 zxid:0xfffffffffffffffe txntype:unknown reqpath:n/a Error Path:/solr/overseer/queue-work Error:KeeperErrorCode = NoNode for /solr/overseer/queue-work
[junit4:junit4]   2> 3047 T111 oascc.ZkStateReader$2.process A cluster state change has occurred - updating... (1)
[junit4:junit4]   2> 3094 T91 oasc.ShardLeaderElectionContext.waitForReplicasToComeUp Enough replicas found to continue.
[junit4:junit4]   2> 3094 T91 oasc.ShardLeaderElectionContext.runLeaderProcess I may be the new leader - try and sync
[junit4:junit4]   2> 3094 T91 oasc.SyncStrategy.sync Sync replicas to http://127.0.0.1:64351/solr/collection1/
[junit4:junit4]   2> 3094 T91 oasc.SyncStrategy.syncReplicas Sync Success - now sync replicas to me
[junit4:junit4]   2> 3094 T91 oasc.SyncStrategy.syncToMe http://127.0.0.1:64351/solr/collection1/ has no replicas
[junit4:junit4]   2> 3094 T91 oasc.ShardLeaderElectionContext.runLeaderProcess I am the new leader: http://127.0.0.1:64351/solr/collection1/
[junit4:junit4]   2> 3094 T91 oascc.SolrZkClient.makePath makePath: /collections/control_collection/leaders/control_shard
[junit4:junit4]   2> 3140 T96 oazs.PrepRequestProcessor.pRequest Got user-level KeeperException when processing sessionid:0x13ae47df0640002 type:create cxid:0x6e zxid:0xfffffffffffffffe txntype:unknown reqpath:n/a Error Path:/solr/overseer Error:KeeperErrorCode = NodeExists for /solr/overseer
[junit4:junit4]   2> 3562 T112 oascc.ZkStateReader.updateClusterState Updating cloud state from ZooKeeper... 
[junit4:junit4]   2> 3609 T111 oascc.ZkStateReader$2.process A cluster state change has occurred - updating... (1)
[junit4:junit4]   2> 3656 T91 oasc.ZkController.register We are http://127.0.0.1:64351/solr/collection1/ and leader is http://127.0.0.1:64351/solr/collection1/
[junit4:junit4]   2> 3656 T91 oasc.ZkController.register No LogReplay needed for core=collection1 baseURL=http://127.0.0.1:64351/solr
[junit4:junit4]   2> 3656 T91 oasc.ZkController.checkRecovery I am the leader, no recovery necessary
[junit4:junit4]   2> 3656 T91 oasc.ZkController.publish numShards not found on descriptor - reading it from system property
[junit4:junit4]   2> 3656 T91 oascc.ZkStateReader.updateClusterState Updating cloud state from ZooKeeper... 
[junit4:junit4]   2> 3656 T91 oass.SolrDispatchFilter.init user.dir=C:\Users\JenkinsSlave\workspace\Lucene-Solr-4.x-Windows\solr\build\solr-solrj\test\J0
[junit4:junit4]   2> 3656 T91 oass.SolrDispatchFilter.init SolrDispatchFilter.init() done
[junit4:junit4]   2> 3656 T91 oascsi.HttpClientUtil.createClient Creating new http client, config:maxConnections=128&maxConnectionsPerHost=32&followRedirects=false
[junit4:junit4]   2> 4094 T91 oejs.Server.doStart jetty-8.1.7.v20120910
[junit4:junit4]   2> 4094 T91 oejs.AbstractConnector.doStart Started SelectChannelConnector@0.0.0.0:64357
[junit4:junit4]   2> 4094 T91 oasc.SolrResourceLoader.locateSolrHome JNDI not configured for solr (NoInitialContextEx)
[junit4:junit4]   2> 4094 T91 oasc.SolrResourceLoader.locateSolrHome using system property solr.solr.home: C:\Users\JenkinsSlave\workspace\Lucene-Solr-4.x-Windows\solr\build\solr-solrj\test\J0\.\solrtest-jetty1-1352453193217
[junit4:junit4]   2> 4094 T91 oasc.SolrResourceLoader.<init> new SolrResourceLoader for deduced Solr Home: 'C:\Users\JenkinsSlave\workspace\Lucene-Solr-4.x-Windows\solr\build\solr-solrj\test\J0\.\solrtest-jetty1-1352453193217\'
[junit4:junit4]   2> 4125 T112 oascc.ZkStateReader.updateClusterState Updating cloud state from ZooKeeper... 
[junit4:junit4]   2> 4125 T112 oasc.Overseer$ClusterStateUpdater.updateState Update state numShards=null message={
[junit4:junit4]   2> 	  "operation":"state",
[junit4:junit4]   2> 	  "numShards":null,
[junit4:junit4]   2> 	  "shard":"control_shard",
[junit4:junit4]   2> 	  "roles":null,
[junit4:junit4]   2> 	  "state":"active",
[junit4:junit4]   2> 	  "core":"collection1",
[junit4:junit4]   2> 	  "collection":"control_collection",
[junit4:junit4]   2> 	  "node_name":"127.0.0.1:64351_solr",
[junit4:junit4]   2> 	  "base_url":"http://127.0.0.1:64351/solr"}
[junit4:junit4]   2> 4125 T91 oass.SolrDispatchFilter.init SolrDispatchFilter.init()
[junit4:junit4]   2> 4125 T91 oasc.SolrResourceLoader.locateSolrHome JNDI not configured for solr (NoInitialContextEx)
[junit4:junit4]   2> 4125 T91 oasc.SolrResourceLoader.locateSolrHome using system property solr.solr.home: C:\Users\JenkinsSlave\workspace\Lucene-Solr-4.x-Windows\solr\build\solr-solrj\test\J0\.\solrtest-jetty1-1352453193217
[junit4:junit4]   2> 4125 T91 oasc.CoreContainer$Initializer.initialize looking for solr.xml: C:\Users\JenkinsSlave\workspace\Lucene-Solr-4.x-Windows\solr\build\solr-solrj\test\J0\.\solrtest-jetty1-1352453193217\solr.xml
[junit4:junit4]   2> 4125 T91 oasc.CoreContainer.<init> New CoreContainer 3183161
[junit4:junit4]   2> 4125 T91 oasc.CoreContainer.load Loading CoreContainer using Solr Home: 'C:\Users\JenkinsSlave\workspace\Lucene-Solr-4.x-Windows\solr\build\solr-solrj\test\J0\.\solrtest-jetty1-1352453193217\'
[junit4:junit4]   2> 4125 T91 oasc.SolrResourceLoader.<init> new SolrResourceLoader for directory: 'C:\Users\JenkinsSlave\workspace\Lucene-Solr-4.x-Windows\solr\build\solr-solrj\test\J0\.\solrtest-jetty1-1352453193217\'
[junit4:junit4]   2> 4156 T91 oasc.CoreContainer.load Registering Log Listener
[junit4:junit4]   2> 4172 T91 oasc.CoreContainer.initZooKeeper Zookeeper client=127.0.0.1:64344/solr
[junit4:junit4]   2> 4172 T91 oaz.ZooKeeper.<init> Initiating client connection, connectString=127.0.0.1:64344/solr sessionTimeout=8000 watcher=org.apache.solr.common.cloud.ConnectionManager@a896b8
[junit4:junit4]   2> 4172 T126 oaz.ClientCnxn$SendThread.startConnect Opening socket connection to server /127.0.0.1:64344
[junit4:junit4]   2> 4172 T91 oascc.ConnectionManager.waitForConnected Waiting for client to connect to ZooKeeper
[junit4:junit4]   2> 4172 T126 oaz.ClientCnxn$SendThread.primeConnection Socket connection established to 127.0.0.1/127.0.0.1:64344, initiating session
[junit4:junit4]   2> 4172 T93 oazs.NIOServerCnxn$Factory.run Accepted socket connection from /127.0.0.1:64362
[junit4:junit4]   2> 4172 T93 oazs.NIOServerCnxn.readConnectRequest Client attempting to establish new session at /127.0.0.1:64362
[junit4:junit4]   2> 4203 T95 oazs.NIOServerCnxn.finishSessionInit Established session 0x13ae47df0640003 with negotiated timeout 8000 for client /127.0.0.1:64362
[junit4:junit4]   2> 4203 T126 oaz.ClientCnxn$SendThread.readConnectResult Session establishment complete on server 127.0.0.1/127.0.0.1:64344, sessionid = 0x13ae47df0640003, negotiated timeout = 8000
[junit4:junit4]   2> 4203 T127 oascc.ConnectionManager.process Watcher org.apache.solr.common.cloud.ConnectionManager@a896b8 name:ZooKeeperConnection Watcher:127.0.0.1:64344/solr got event WatchedEvent state:SyncConnected type:None path:null path:null type:None
[junit4:junit4]   2> 4203 T91 oascc.ConnectionManager.waitForConnected Client is connected to ZooKeeper
[junit4:junit4]   2> 4203 T96 oazs.PrepRequestProcessor.pRequest Got user-level KeeperException when processing sessionid:0x13ae47df0640003 type:create cxid:0x1 zxid:0xfffffffffffffffe txntype:unknown reqpath:n/a Error Path:/solr/overseer Error:KeeperErrorCode = NodeExists for /solr/overseer
[junit4:junit4]   2> 4219 T96 oazs.PrepRequestProcessor.pRequest Got user-level KeeperException when processing sessionid:0x13ae47df0640003 type:create cxid:0x2 zxid:0xfffffffffffffffe txntype:unknown reqpath:n/a Error Path:/solr/overseer Error:KeeperErrorCode = NodeExists for /solr/overseer
[junit4:junit4]   2> 4234 T91 oasc.ZkController.createEphemeralLiveNode Register node as live in ZooKeeper:/live_nodes/127.0.0.1:64357_solr
[junit4:junit4]   2> 4234 T96 oazs.PrepRequestProcessor.pRequest Got user-level KeeperException when processing sessionid:0x13ae47df0640003 type:delete cxid:0x4 zxid:0xfffffffffffffffe txntype:unknown reqpath:n/a Error Path:/solr/live_nodes/127.0.0.1:64357_solr Error:KeeperErrorCode = NoNode for /solr/live_nodes/127.0.0.1:64357_solr
[junit4:junit4]   2> 4250 T111 oascc.ZkStateReader$2.process A cluster state change has occurred - updating... (1)
[junit4:junit4]   2> 4250 T91 oascc.SolrZkClient.makePath makePath: /live_nodes/127.0.0.1:64357_solr
[junit4:junit4]   2> 4281 T91 oashc.HttpShardHandlerFactory.getParameter Setting socketTimeout to: 0
[junit4:junit4]   2> 4281 T91 oashc.HttpShardHandlerFactory.getParameter Setting urlScheme to: http://
[junit4:junit4]   2> 4281 T91 oashc.HttpShardHandlerFactory.getParameter Setting connTimeout to: 0
[junit4:junit4]   2> 4281 T91 oashc.HttpShardHandlerFactory.getParameter Setting maxConnectionsPerHost to: 20
[junit4:junit4]   2> 4281 T91 oashc.HttpShardHandlerFactory.getParameter Setting corePoolSize to: 0
[junit4:junit4]   2> 4281 T91 oashc.HttpShardHandlerFactory.getParameter Setting maximumPoolSize to: 2147483647
[junit4:junit4]   2> 4281 T91 oashc.HttpShardHandlerFactory.getParameter Setting maxThreadIdleTime to: 5
[junit4:junit4]   2> 4281 T91 oashc.HttpShardHandlerFactory.getParameter Setting sizeOfQueue to: -1
[junit4:junit4]   2> 4281 T91 oashc.HttpShardHandlerFactory.getParameter Setting fairnessPolicy to: false
[junit4:junit4]   2> 4281 T91 oascsi.HttpClientUtil.createClient Creating new http client, config:maxConnectionsPerHost=20&maxConnections=10000&socketTimeout=0&connTimeout=0&retry=false
[junit4:junit4]   2> 4297 T111 oascc.ZkStateReader$3.process Updating live nodes... (2)
[junit4:junit4]   2> 4312 T91 oascc.ZkStateReader.createClusterStateWatchersAndUpdate Updating cluster state from ZooKeeper... 
[junit4:junit4]   2> 4328 T91 oasc.CoreContainer.create Creating SolrCore 'collection1' using instanceDir: C:\Users\JenkinsSlave\workspace\Lucene-Solr-4.x-Windows\solr\build\solr-solrj\test\J0\.\solrtest-jetty1-1352453193217\collection1
[junit4:junit4]   2> 4328 T91 oasc.ZkController.createCollectionZkNode Check for collection zkNode:collection1
[junit4:junit4]   2> 4328 T91 oasc.ZkController.createCollectionZkNode Collection zkNode exists
[junit4:junit4]   2> 4328 T91 oasc.ZkController.readConfigName Load collection config from:/collections/collection1
[junit4:junit4]   2> 4328 T91 oasc.SolrResourceLoader.<init> new SolrResourceLoader for directory: 'C:\Users\JenkinsSlave\workspace\Lucene-Solr-4.x-Windows\solr\build\solr-solrj\test\J0\.\solrtest-jetty1-1352453193217\collection1\'
[junit4:junit4]   2> 4390 T91 oasc.SolrConfig.<init> Using Lucene MatchVersion: LUCENE_41
[junit4:junit4]   2> 4437 T91 oasc.SolrConfig.<init> Loaded SolrConfig: solrconfig.xml
[junit4:junit4]   2> 4469 T91 oass.IndexSchema.readSchema Reading Solr Schema
[junit4:junit4]   2> 4719 T91 oass.IndexSchema.readSchema Schema name=test
[junit4:junit4]   2> 5297 T91 oass.IndexSchema.readSchema default search field in schema is text
[junit4:junit4]   2> 5297 T91 oass.IndexSchema.readSchema unique key field: id
[junit4:junit4]   2> 5297 T91 oass.IndexSchema.readSchema WARNING Field text is not multivalued and destination for multiple copyFields (2)
[junit4:junit4]   2> 5297 T91 oass.IndexSchema.readSchema WARNING Field lowerfilt1and2 is not multivalued and destination for multiple copyFields (2)
[junit4:junit4]   2> 5297 T91 oasc.SolrCore.<init> [collection1] Opening new SolrCore at C:\Users\JenkinsSlave\workspace\Lucene-Solr-4.x-Windows\solr\build\solr-solrj\test\J0\.\solrtest-jetty1-1352453193217\collection1\, dataDir=.\org.apache.solr.client.solrj.impl.CloudSolrServerTest-1352453189560/jetty1\
[junit4:junit4]   2> 5297 T91 oasc.SolrCore.<init> JMX monitoring not detected for core: collection1
[junit4:junit4]   2> 5297 T91 oasc.SolrCore.getNewIndexDir New index directory detected: old=null new=.\org.apache.solr.client.solrj.impl.CloudSolrServerTest-1352453189560/jetty1\index/
[junit4:junit4]   2> 5297 T91 oasc.SolrCore.initIndex WARNING [collection1] Solr index directory '.\org.apache.solr.client.solrj.impl.CloudSolrServerTest-1352453189560\jetty1\index' doesn't exist. Creating new index...
[junit4:junit4]   2> 5297 T91 oasc.CachingDirectoryFactory.get return new directory for C:\Users\JenkinsSlave\workspace\Lucene-Solr-4.x-Windows\solr\build\solr-solrj\test\J0\.\org.apache.solr.client.solrj.impl.CloudSolrServerTest-1352453189560\jetty1\index forceNew:false
[junit4:junit4]   2> 5328 T91 oasc.SolrDeletionPolicy.onCommit SolrDeletionPolicy.onCommit: commits:num=1
[junit4:junit4]   2> 		commit{dir=C:\Users\JenkinsSlave\workspace\Lucene-Solr-4.x-Windows\solr\build\solr-solrj\test\J0\org.apache.solr.client.solrj.impl.CloudSolrServerTest-1352453189560\jetty1\index,segFN=segments_1,generation=1,filenames=[segments_1]
[junit4:junit4]   2> 5328 T91 oasc.SolrDeletionPolicy.updateCommits newest commit = 1
[junit4:junit4]   2> 5328 T91 oasc.RequestHandlers.initHandlersFromConfig created /get: solr.RealTimeGetHandler
[junit4:junit4]   2> 5328 T91 oasc.RequestHandlers.initHandlersFromConfig adding lazy requestHandler: solr.ReplicationHandler
[junit4:junit4]   2> 5328 T91 oasc.RequestHandlers.initHandlersFromConfig created /replication: solr.ReplicationHandler
[junit4:junit4]   2> 5328 T91 oasc.RequestHandlers.initHandlersFromConfig created standard: solr.StandardRequestHandler
[junit4:junit4]   2> 5328 T91 oasc.RequestHandlers.initHandlersFromConfig created /update: solr.UpdateRequestHandler
[junit4:junit4]   2> 5328 T91 oasc.RequestHandlers.initHandlersFromConfig created /admin/: org.apache.solr.handler.admin.AdminHandlers
[junit4:junit4]   2> 5344 T91 oashl.XMLLoader.init xsltCacheLifetimeSeconds=60
[junit4:junit4]   2> 5344 T91 oass.SolrIndexSearcher.<init> Opening Searcher@ebdfff main
[junit4:junit4]   2> 5359 T91 oasu.CommitTracker.<init> Hard AutoCommit: disabled
[junit4:junit4]   2> 5359 T91 oasu.CommitTracker.<init> Soft AutoCommit: disabled
[junit4:junit4]   2> 5359 T128 oasc.SolrCore.registerSearcher [collection1] Registered new searcher Searcher@ebdfff main{StandardDirectoryReader(segments_1:1)}
[junit4:junit4]   2> 5359 T91 oasc.ZkController.publish numShards not found on descriptor - reading it from system property
[junit4:junit4]   2> 5844 T112 oascc.ZkStateReader.updateClusterState Updating cloud state from ZooKeeper... 
[junit4:junit4]   2> 5844 T112 oasc.Overseer$ClusterStateUpdater.updateState Update state numShards=2 message={
[junit4:junit4]   2> 	  "operation":"state",
[junit4:junit4]   2> 	  "numShards":"2",
[junit4:junit4]   2> 	  "shard":null,
[junit4:junit4]   2> 	  "roles":null,
[junit4:junit4]   2> 	  "state":"down",
[junit4:junit4]   2> 	  "core":"collection1",
[junit4:junit4]   2> 	  "collection":"collection1",
[junit4:junit4]   2> 	  "node_name":"127.0.0.1:64357_solr",
[junit4:junit4]   2> 	  "base_url":"http://127.0.0.1:64357/solr"}
[junit4:junit4]   2> 5844 T112 oasc.Overseer$ClusterStateUpdater.createCollection Create collection collection1 with numShards 2
[junit4:junit4]   2> 5890 T111 oascc.ZkStateReader$2.process A cluster state change has occurred - updating... (2)
[junit4:junit4]   2> 5890 T127 oascc.ZkStateReader$2.process A cluster state change has occurred - updating... (2)
[junit4:junit4]   2> 6375 T91 oasc.CoreContainer.register registering core: collection1
[junit4:junit4]   2> 6375 T91 oasc.ZkController.register Register shard - core:collection1 address:http://127.0.0.1:64357/solr shardId:shard1
[junit4:junit4]   2> 6375 T91 oascc.SolrZkClient.makePath makePath: /collections/collection1/leader_elect/shard1/election
[junit4:junit4]   2> 6422 T96 oazs.PrepRequestProcessor.pRequest Got user-level KeeperException when processing sessionid:0x13ae47df0640003 type:delete cxid:0x25 zxid:0xfffffffffffffffe txntype:unknown reqpath:n/a Error Path:/solr/collections/collection1/leaders Error:KeeperErrorCode = NoNode for /solr/collections/collection1/leaders
[junit4:junit4]   2> 6437 T91 oasc.ShardLeaderElectionContext.runLeaderProcess Running the leader process.
[junit4:junit4]   2> 6437 T96 oazs.PrepRequestProcessor.pRequest Got user-level KeeperException when processing sessionid:0x13ae47df0640003 type:create cxid:0x26 zxid:0xfffffffffffffffe txntype:unknown reqpath:n/a Error Path:/solr/overseer Error:KeeperErrorCode = NodeExists for /solr/overseer
[junit4:junit4]   2> 6453 T91 oasc.ShardLeaderElectionContext.waitForReplicasToComeUp Enough replicas found to continue.
[junit4:junit4]   2> 6453 T91 oasc.ShardLeaderElectionContext.runLeaderProcess I may be the new leader - try and sync
[junit4:junit4]   2> 6453 T91 oasc.SyncStrategy.sync Sync replicas to http://127.0.0.1:64357/solr/collection1/
[junit4:junit4]   2> 6453 T91 oasc.SyncStrategy.syncReplicas Sync Success - now sync replicas to me
[junit4:junit4]   2> 6453 T91 oasc.SyncStrategy.syncToMe http://127.0.0.1:64357/solr/collection1/ has no replicas
[junit4:junit4]   2> 6469 T91 oasc.ShardLeaderElectionContext.runLeaderProcess I am the new leader: http://127.0.0.1:64357/solr/collection1/
[junit4:junit4]   2> 6469 T91 oascc.SolrZkClient.makePath makePath: /collections/collection1/leaders/shard1
[junit4:junit4]   2> 6500 T96 oazs.PrepRequestProcessor.pRequest Got user-level KeeperException when processing sessionid:0x13ae47df0640003 type:create cxid:0x30 zxid:0xfffffffffffffffe txntype:unknown reqpath:n/a Error Path:/solr/overseer Error:KeeperErrorCode = NodeExists for /solr/overseer
[junit4:junit4]   2> 6937 T112 oascc.ZkStateReader.updateClusterState Updating cloud state from ZooKeeper... 
[junit4:junit4]   2> 7000 T111 oascc.ZkStateReader$2.process A cluster state change has occurred - updating... (2)
[junit4:junit4]   2> 7000 T127 oascc.ZkStateReader$2.process A cluster state change has occurred - updating... (2)
[junit4:junit4]   2> 7015 T91 oasc.ZkController.register We are http://127.0.0.1:64357/solr/collection1/ and leader is http://127.0.0.1:64357/solr/collection1/
[junit4:junit4]   2> 7015 T91 oasc.ZkController.register No LogReplay needed for core=collection1 baseURL=http://127.0.0.1:64357/solr
[junit4:junit4]   2> 7015 T91 oasc.ZkController.checkRecovery I am the leader, no recovery necessary
[junit4:junit4]   2> 7015 T91 oasc.ZkController.publish numShards not found on descriptor - reading it from system property
[junit4:junit4]   2> 7031 T91 oascc.ZkStateReader.updateClusterState Updating cloud state from ZooKeeper... 
[junit4:junit4]   2> 7047 T91 oass.SolrDispatchFilter.init user.dir=C:\Users\JenkinsSlave\workspace\Lucene-Solr-4.x-Windows\solr\build\solr-solrj\test\J0
[junit4:junit4]   2> 7047 T91 oass.SolrDispatchFilter.init SolrDispatchFilter.init() done
[junit4:junit4]   2> 7047 T91 oascsi.HttpClientUtil.createClient Creating new http client, config:maxConnections=128&maxConnectionsPerHost=32&followRedirects=false
[junit4:junit4]   2> 7219 T91 oejs.Server.doStart jetty-8.1.7.v20120910
[junit4:junit4]   2> 7234 T91 oejs.AbstractConnector.doStart Started SelectChannelConnector@0.0.0.0:64363
[junit4:junit4]   2> 7234 T91 oasc.SolrResourceLoader.locateSolrHome JNDI not configured for solr (NoInitialContextEx)
[junit4:junit4]   2> 7234 T91 oasc.SolrResourceLoader.locateSolrHome using system property solr.solr.home: C:\Users\JenkinsSlave\workspace\Lucene-Solr-4.x-Windows\solr\build\solr-solrj\test\J0\.\solrtest-jetty2-1352453196592
[junit4:junit4]   2> 7234 T91 oasc.SolrResourceLoader.<init> new SolrResourceLoader for deduced Solr Home: 'C:\Users\JenkinsSlave\workspace\Lucene-Solr-4.x-Windows\solr\build\solr-solrj\test\J0\.\solrtest-jetty2-1352453196592\'
[junit4:junit4]   2> 7265 T91 oass.SolrDispatchFilter.init SolrDispatchFilter.init()
[junit4:junit4]   2> 7265 T91 oasc.SolrResourceLoader.locateSolrHome JNDI not configured for solr (NoInitialContextEx)
[junit4:junit4]   2> 7265 T91 oasc.SolrResourceLoader.locateSolrHome using system property solr.solr.home: C:\Users\JenkinsSlave\workspace\Lucene-Solr-4.x-Windows\solr\build\solr-solrj\test\J0\.\solrtest-jetty2-1352453196592
[junit4:junit4]   2> 7265 T91 oasc.CoreContainer$Initializer.initialize looking for solr.xml: C:\Users\JenkinsSlave\workspace\Lucene-Solr-4.x-Windows\solr\build\solr-solrj\test\J0\.\solrtest-jetty2-1352453196592\solr.xml
[junit4:junit4]   2> 7265 T91 oasc.CoreContainer.<init> New CoreContainer 32652452
[junit4:junit4]   2> 7265 T91 oasc.CoreContainer.load Loading CoreContainer using Solr Home: 'C:\Users\JenkinsSlave\workspace\Lucene-Solr-4.x-Windows\solr\build\solr-solrj\test\J0\.\solrtest-jetty2-1352453196592\'
[junit4:junit4]   2> 7265 T91 oasc.SolrResourceLoader.<init> new SolrResourceLoader for directory: 'C:\Users\JenkinsSlave\workspace\Lucene-Solr-4.x-Windows\solr\build\solr-solrj\test\J0\.\solrtest-jetty2-1352453196592\'
[junit4:junit4]   2> 7297 T91 oasc.CoreContainer.load Registering Log Listener
[junit4:junit4]   2> 7312 T91 oasc.CoreContainer.initZooKeeper Zookeeper client=127.0.0.1:64344/solr
[junit4:junit4]   2> 7312 T91 oaz.ZooKeeper.<init> Initiating client connection, connectString=127.0.0.1:64344/solr sessionTimeout=8000 watcher=org.apache.solr.common.cloud.ConnectionManager@465648
[junit4:junit4]   2> 7312 T138 oaz.ClientCnxn$SendThread.startConnect Opening socket connection to server /127.0.0.1:64344
[junit4:junit4]   2> 7312 T91 oascc.ConnectionManager.waitForConnected Waiting for client to connect to ZooKeeper
[junit4:junit4]   2> 7328 T93 oazs.NIOServerCnxn$Factory.run Accepted socket connection from /127.0.0.1:64368
[junit4:junit4]   2> 7328 T138 oaz.ClientCnxn$SendThread.primeConnection Socket connection established to 127.0.0.1/127.0.0.1:64344, initiating session
[junit4:junit4]   2> 7328 T93 oazs.NIOServerCnxn.readConnectRequest Client attempting to establish new session at /127.0.0.1:64368
[junit4:junit4]   2> 7359 T95 oazs.NIOServerCnxn.finishSessionInit Established session 0x13ae47df0640004 with negotiated timeout 8000 for client /127.0.0.1:64368
[junit4:junit4]   2> 7359 T138 oaz.ClientCnxn$SendThread.readConnectResult Session establishment complete on server 127.0.0.1/127.0.0.1:64344, sessionid = 0x13ae47df0640004, negotiated timeout = 8000
[junit4:junit4]   2> 7359 T139 oascc.ConnectionManager.process Watcher org.apache.solr.common.cloud.ConnectionManager@465648 name:ZooKeeperConnection Watcher:127.0.0.1:64344/solr got event WatchedEvent state:SyncConnected type:None path:null path:null type:None
[junit4:junit4]   2> 7359 T91 oascc.ConnectionManager.waitForConnected Client is connected to ZooKeeper
[junit4:junit4]   2> 7359 T96 oazs.PrepRequestProcessor.pRequest Got user-level KeeperException when processing sessionid:0x13ae47df0640004 type:create cxid:0x1 zxid:0xfffffffffffffffe txntype:unknown reqpath:n/a Error Path:/solr/overseer Error:KeeperErrorCode = NodeExists for /solr/overseer
[junit4:junit4]   2> 7375 T96 oazs.PrepRequestProcessor.pRequest Got user-level KeeperException when processing sessionid:0x13ae47df0640004 type:create cxid:0x2 zxid:0xfffffffffffffffe txntype:unknown reqpath:n/a Error Path:/solr/overseer Error:KeeperErrorCode = NodeExists for /solr/overseer
[junit4:junit4]   2> 7375 T91 oasc.ZkController.createEphemeralLiveNode Register node as live in ZooKeeper:/live_nodes/127.0.0.1:64363_solr
[junit4:junit4]   2> 7375 T96 oazs.PrepRequestProcessor.pRequest Got user-level KeeperException when processing sessionid:0x13ae47df0640004 type:delete cxid:0x4 zxid:0xfffffffffffffffe txntype:unknown reqpath:n/a Error Path:/solr/live_nodes/127.0.0.1:64363_solr Error:KeeperErrorCode = NoNode for /solr/live_nodes/127.0.0.1:64363_solr
[junit4:junit4]   2> 7390 T91 oascc.SolrZkClient.makePath makePath: /live_nodes/127.0.0.1:64363_solr
[junit4:junit4]   2> 7406 T111 oascc.ZkStateReader$3.process Updating live nodes... (3)
[junit4:junit4]   2> 7406 T127 oascc.ZkStateReader$3.process Updating live nodes... (3)
[junit4:junit4]   2> 7406 T91 oashc.HttpShardHandlerFactory.getParameter Setting socketTimeout to: 0
[junit4:junit4]   2> 7406 T91 oashc.HttpShardHandlerFactory.getParameter Setting urlScheme to: http://
[junit4:junit4]   2> 7406 T91 oashc.HttpShardHandlerFactory.getParameter Setting connTimeout to: 0
[junit4:junit4]   2> 7406 T91 oashc.HttpShardHandlerFactory.getParameter Setting maxConnectionsPerHost to: 20
[junit4:junit4]   2> 7406 T91 oashc.HttpShardHandlerFactory.getParameter Setting corePoolSize to: 0
[junit4:junit4]   2> 7406 T91 oashc.HttpShardHandlerFactory.getParameter Setting maximumPoolSize to: 2147483647
[junit4:junit4]   2> 7406 T91 oashc.HttpShardHandlerFactory.getParameter Setting maxThreadIdleTime to: 5
[junit4:junit4]   2> 7406 T91 oashc.HttpShardHandlerFactory.getParameter Setting sizeOfQueue to: -1
[junit4:junit4]   2> 7406 T91 oashc.HttpShardHandlerFactory.getParameter Setting fairnessPolicy to: false
[junit4:junit4]   2> 7406 T91 oascsi.HttpClientUtil.createClient Creating new http client, config:maxConnectionsPerHost=20&maxConnections=10000&socketTimeout=0&connTimeout=0&retry=false
[junit4:junit4]   2> 7437 T91 oascc.ZkStateReader.createClusterStateWatchersAndUpdate Updating cluster state from ZooKeeper... 
[junit4:junit4]   2> 7453 T91 oasc.CoreContainer.create Creating SolrCore 'collection1' using instanceDir: C:\Users\JenkinsSlave\workspace\Lucene-Solr-4.x-Windows\solr\build\solr-solrj\test\J0\.\solrtest-jetty2-1352453196592\collection1
[junit4:junit4]   2> 7453 T91 oasc.ZkController.createCollectionZkNode Check for collection zkNode:collection1
[junit4:junit4]   2> 7453 T91 oasc.ZkController.createCollectionZkNode Collection zkNode exists
[junit4:junit4]   2> 7453 T91 oasc.ZkController.readConfigName Load collection config from:/collections/collection1
[junit4:junit4]   2> 7453 T91 oasc.SolrResourceLoader.<init> new SolrResourceLoader for directory: 'C:\Users\JenkinsSlave\workspace\Lucene-Solr-4.x-Windows\solr\build\solr-solrj\test\J0\.\solrtest-jetty2-1352453196592\collection1\'
[junit4:junit4]   2> 7500 T91 oasc.SolrConfig.<init> Using Lucene MatchVersion: LUCENE_41
[junit4:junit4]   2> 7531 T112 oascc.ZkStateReader.updateClusterState Updating cloud state from ZooKeeper... 
[junit4:junit4]   2> 7531 T112 oasc.Overseer$ClusterStateUpdater.updateState Update state numShards=2 message={
[junit4:junit4]   2> 	  "operation":"state",
[junit4:junit4]   2> 	  "numShards":"2",
[junit4:junit4]   2> 	  "shard":"shard1",
[junit4:junit4]   2> 	  "roles":null,
[junit4:junit4]   2> 	  "state":"active",
[junit4:junit4]   2> 	  "core":"collection1",
[junit4:junit4]   2> 	  "collection":"collection1",
[junit4:junit4]   2> 	  "node_name":"127.0.0.1:64357_solr",
[junit4:junit4]   2> 	  "base_url":"http://127.0.0.1:64357/solr"}
[junit4:junit4]   2> 7547 T91 oasc.SolrConfig.<init> Loaded SolrConfig: solrconfig.xml
[junit4:junit4]   2> 7562 T91 oass.IndexSchema.readSchema Reading Solr Schema
[junit4:junit4]   2> 7578 T111 oascc.ZkStateReader$2.process A cluster state change has occurred - updating... (3)
[junit4:junit4]   2> 7578 T127 oascc.ZkStateReader$2.process A cluster state change has occurred - updating... (3)
[junit4:junit4]   2> 7578 T139 oascc.ZkStateReader$2.process A cluster state change has occurred - updating... (3)
[junit4:junit4]   2> 7594 T91 oass.IndexSchema.readSchema Schema name=test
[junit4:junit4]   2> 8156 T91 oass.IndexSchema.readSchema default search field in schema is text
[junit4:junit4]   2> 8156 T91 oass.IndexSchema.readSchema unique key field: id
[junit4:junit4]   2> 8156 T91 oass.IndexSchema.readSchema WARNING Field text is not multivalued and destination for multiple copyFields (2)
[junit4:junit4]   2> 8156 T91 oass.IndexSchema.readSchema WARNING Field lowerfilt1and2 is not multivalued and destination for multiple copyFields (2)
[junit4:junit4]   2> 8172 T91 oasc.SolrCore.<init> [collection1] Opening new SolrCore at C:\Users\JenkinsSlave\workspace\Lucene-Solr-4.x-Windows\solr\build\solr-solrj\test\J0\.\solrtest-jetty2-1352453196592\collection1\, dataDir=.\org.apache.solr.client.solrj.impl.CloudSolrServerTest-1352453189560/jetty2\
[junit4:junit4]   2> 8172 T91 oasc.SolrCore.<init> JMX monitoring not detected for core: collection1
[junit4:junit4]   2> 8172 T91 oasc.SolrCore.getNewIndexDir New index directory detected: old=null new=.\org.apache.solr.client.solrj.impl.CloudSolrServerTest-1352453189560/jetty2\index/
[junit4:junit4]   2> 8172 T91 oasc.SolrCore.initIndex WARNING [collection1] Solr index directory '.\org.apache.solr.client.solrj.impl.CloudSolrServerTest-1352453189560\jetty2\index' doesn't exist. Creating new index...
[junit4:junit4]   2> 8172 T91 oasc.CachingDirectoryFactory.get return new directory for C:\Users\JenkinsSlave\workspace\Lucene-Solr-4.x-Windows\solr\build\solr-solrj\test\J0\.\org.apache.solr.client.solrj.impl.CloudSolrServerTest-1352453189560\jetty2\index forceNew:false
[junit4:junit4]   2> 8219 T91 oasc.SolrDeletionPolicy.onCommit SolrDeletionPolicy.onCommit: commits:num=1
[junit4:junit4]   2> 		commit{dir=C:\Users\JenkinsSlave\workspace\Lucene-Solr-4.x-Windows\solr\build\solr-solrj\test\J0\org.apache.solr.client.solrj.impl.CloudSolrServerTest-1352453189560\jetty2\index,segFN=segments_1,generation=1,filenames=[segments_1]
[junit4:junit4]   2> 8234 T91 oasc.SolrDeletionPolicy.updateCommits newest commit = 1
[junit4:junit4]   2> 8234 T91 oasc.RequestHandlers.initHandlersFromConfig created /get: solr.RealTimeGetHandler
[junit4:junit4]   2> 8234 T91 oasc.RequestHandlers.initHandlersFromConfig adding lazy requestHandler: solr.ReplicationHandler
[junit4:junit4]   2> 8234 T91 oasc.RequestHandlers.initHandlersFromConfig created /replication: solr.ReplicationHandler
[junit4:junit4]   2> 8234 T91 oasc.RequestHandlers.initHandlersFromConfig created standard: solr.StandardRequestHandler
[junit4:junit4]   2> 8234 T91 oasc.RequestHandlers.initHandlersFromConfig created /update: solr.UpdateRequestHandler
[junit4:junit4]   2> 8234 T91 oasc.RequestHandlers.initHandlersFromConfig created /admin/: org.apache.solr.handler.admin.AdminHandlers
[junit4:junit4]   2> 8234 T91 oashl.XMLLoader.init xsltCacheLifetimeSeconds=60
[junit4:junit4]   2> 8250 T91 oass.SolrIndexSearcher.<init> Opening Searcher@1eec5fe main
[junit4:junit4]   2> 8250 T91 oasu.CommitTracker.<init> Hard AutoCommit: disabled
[junit4:junit4]   2> 8250 T91 oasu.CommitTracker.<init> Soft AutoCommit: disabled
[junit4:junit4]   2> 8250 T140 oasc.SolrCore.registerSearcher [collection1] Registered new searcher Searcher@1eec5fe main{StandardDirectoryReader(segments_1:1)}
[junit4:junit4]   2> 8250 T91 oasc.ZkController.publish numShards not found on descriptor - reading it from system property
[junit4:junit4]   2> 8594 T112 oascc.ZkStateReader.updateClusterState Updating cloud state from ZooKeeper... 
[junit4:junit4]   2> 8594 T112 oasc.Overseer$ClusterStateUpdater.updateState Update state numShards=2 message={
[junit4:junit4]   2> 	  "operation":"state",
[junit4:junit4]   2> 	  "numShards":"2",
[junit4:junit4]   2> 	  "shard":null,
[junit4:junit4]   2> 	  "roles":null,
[junit4:junit4]   2> 	  "state":"down",
[junit4:junit4]   2> 	  "core":"collection1",
[junit4:junit4]   2> 	  "collection":"collection1",
[junit4:junit4]   2> 	  "node_name":"127.0.0.1:64363_solr",
[junit4:junit4]   2> 	  "base_url":"http://127.0.0.1:64363/solr"}
[junit4:junit4]   2> 8640 T111 oascc.ZkStateReader$2.process A cluster state change has occurred - updating... (3)
[junit4:junit4]   2> 8640 T139 oascc.ZkStateReader$2.process A cluster state change has occurred - updating... (3)
[junit4:junit4]   2> 8640 T127 oascc.ZkStateReader$2.process A cluster state change has occurred - updating... (3)
[junit4:junit4]   2> 8750 T91 oasc.CoreContainer.register registering core: collection1
[junit4:junit4]   2> 8750 T91 oasc.ZkController.register Register shard - core:collection1 address:http://127.0.0.1:64363/solr shardId:shard2
[junit4:junit4]   2> 8750 T91 oascc.SolrZkClient.makePath makePath: /collections/collection1/leader_elect/shard2/election
[junit4:junit4]   2> 8797 T96 oazs.PrepRequestProcessor.pRequest Got user-level KeeperException when processing sessionid:0x13ae47df0640004 type:delete cxid:0x25 zxid:0xfffffffffffffffe txntype:unknown reqpath:n/a Error Path:/solr/collections/collection1/leaders/shard2 Error:KeeperErrorCode = NoNode for /solr/collections/collection1/leaders/shard2
[junit4:junit4]   2> 8812 T91 oasc.ShardLeaderElectionContext.runLeaderProcess Running the leader process.
[junit4:junit4]   2> 8812 T96 oazs.PrepRequestProcessor.pRequest Got user-level KeeperException when processing sessionid:0x13ae47df0640004 type:create cxid:0x26 zxid:0xfffffffffffffffe txntype:unknown reqpath:n/a Error Path:/solr/overseer Error:KeeperErrorCode = NodeExists for /solr/overseer
[junit4:junit4]   2> 8844 T91 oasc.ShardLeaderElectionContext.waitForReplicasToComeUp Enough replicas found to continue.
[junit4:junit4]   2> 8844 T91 oasc.ShardLeaderElectionContext.runLeaderProcess I may be the new leader - try and sync
[junit4:junit4]   2> 8844 T91 oasc.SyncStrategy.sync Sync replicas to http://127.0.0.1:64363/solr/collection1/
[junit4:junit4]   2> 8844 T91 oasc.SyncStrategy.syncReplicas Sync Success - now sync replicas to me
[junit4:junit4]   2> 8844 T91 oasc.SyncStrategy.syncToMe http://127.0.0.1:64363/solr/collection1/ has no replicas
[junit4:junit4]   2> 8844 T91 oasc.ShardLeaderElectionContext.runLeaderProcess I am the new leader: http://127.0.0.1:64363/solr/collection1/
[junit4:junit4]   2> 8844 T91 oascc.SolrZkClient.makePath makePath: /collections/collection1/leaders/shard2
[junit4:junit4]   2> 8875 T96 oazs.PrepRequestProcessor.pRequest Got user-level KeeperException when processing sessionid:0x13ae47df0640004 type:create cxid:0x2f zxid:0xfffffffffffffffe txntype:unknown reqpath:n/a Error Path:/solr/overseer Error:KeeperErrorCode = NodeExists for /solr/overseer
[junit4:junit4]   2> 9172 T112 oascc.ZkStateReader.updateClusterState Updating cloud state from ZooKeeper... 
[junit4:junit4]   2> 9234 T111 oascc.ZkStateReader$2.process A cluster state change has occurred - updating... (3)
[junit4:junit4]   2> 9234 T139 oascc.ZkStateReader$2.process A cluster state change has occurred - updating... (3)
[junit4:junit4]   2> 9234 T127 oascc.ZkStateReader$2.process A cluster state change has occurred - updating... (3)
[junit4:junit4]   2> 9281 T91 oasc.ZkController.register We are http://127.0.0.1:64363/solr/collection1/ and leader is http://127.0.0.1:64363/solr/collection1/
[junit4:junit4]   2> 9281 T91 oasc.ZkController.register No LogReplay needed for core=collection1 baseURL=http://127.0.0.1:64363/solr
[junit4:junit4]   2> 9281 T91 oasc.ZkController.checkRecovery I am the leader, no recovery necessary
[junit4:junit4]   2> 9281 T91 oasc.ZkController.publish numShards not found on descriptor - reading it from system property
[junit4:junit4]   2> 9297 T91 oascc.ZkStateReader.updateClusterState Updating cloud state from ZooKeeper... 
[junit4:junit4]   2> 9297 T91 oass.SolrDispatchFilter.init user.dir=C:\Users\JenkinsSlave\workspace\Lucene-Solr-4.x-Windows\solr\build\solr-solrj\test\J0
[junit4:junit4]   2> 9297 T91 oass.SolrDispatchFilter.init SolrDispatchFilter.init() done
[junit4:junit4]   2> 9297 T91 oascsi.HttpClientUtil.createClient Creating new http client, config:maxConnections=128&maxConnectionsPerHost=32&followRedirects=false
[junit4:junit4]   2> 9484 T91 oejs.Server.doStart jetty-8.1.7.v20120910
[junit4:junit4]   2> 9484 T91 oejs.AbstractConnector.doStart Started SelectChannelConnector@0.0.0.0:64369
[junit4:junit4]   2> 9484 T91 oasc.SolrResourceLoader.locateSolrHome JNDI not configured for solr (NoInitialContextEx)
[junit4:junit4]   2> 9484 T91 oasc.SolrResourceLoader.locateSolrHome using system property solr.solr.home: C:\Users\JenkinsSlave\workspace\Lucene-Solr-4.x-Windows\solr\build\solr-solrj\test\J0\.\solrtest-jetty3-1352453198857
[junit4:junit4]   2> 9484 T91 oasc.SolrResourceLoader.<init> new SolrResourceLoader for deduced Solr Home: 'C:\Users\JenkinsSlave\workspace\Lucene-Solr-4.x-Windows\solr\build\solr-solrj\test\J0\.\solrtest-jetty3-1352453198857\'
[junit4:junit4]   2> 9531 T91 oass.SolrDispatchFilter.init SolrDispatchFilter.init()
[junit4:junit4]   2> 9531 T91 oasc.SolrResourceLoader.locateSolrHome JNDI not configured for solr (NoInitialContextEx)
[junit4:junit4]   2> 9531 T91 oasc.SolrResourceLoader.locateSolrHome using system property solr.solr.home: C:\Users\JenkinsSlave\workspace\Lucene-Solr-4.x-Windows\solr\build\solr-solrj\test\J0\.\solrtest-jetty3-1352453198857
[junit4:junit4]   2> 9531 T91 oasc.CoreContainer$Initializer.initialize looking for solr.xml: C:\Users\JenkinsSlave\workspace\Lucene-Solr-4.x-Windows\solr\build\solr-solrj\test\J0\.\solrtest-jetty3-1352453198857\solr.xml
[junit4:junit4]   2> 9531 T91 oasc.CoreContainer.<init> New CoreContainer 9552656
[junit4:junit4]   2> 9531 T91 oasc.CoreContainer.load Loading CoreContainer using Solr Home: 'C:\Users\JenkinsSlave\workspace\Lucene-Solr-4.x-Windows\solr\build\solr-solrj\test\J0\.\solrtest-jetty3-1352453198857\'
[junit4:junit4]   2> 9531 T91 oasc.SolrResourceLoader.<init> new SolrResourceLoader for directory: 'C:\Users\JenkinsSlave\workspace\Lucene-Solr-4.x-Windows\solr\build\solr-solrj\test\J0\.\solrtest-jetty3-1352453198857\'
[junit4:junit4]   2> 9547 T91 oasc.CoreContainer.load Registering Log Listener
[junit4:junit4]   2> 9578 T91 oasc.CoreContainer.initZooKeeper Zookeeper client=127.0.0.1:64344/solr
[junit4:junit4]   2> 9578 T91 oaz.ZooKeeper.<init> Initiating client connection, connectString=127.0.0.1:64344/solr sessionTimeout=8000 watcher=org.apache.solr.common.cloud.ConnectionManager@b4dcd9
[junit4:junit4]   2> 9578 T150 oaz.ClientCnxn$SendThread.startConnect Opening socket connection to server /127.0.0.1:64344
[junit4:junit4]   2> 9578 T91 oascc.ConnectionManager.waitForConnected Waiting for client to connect to ZooKeeper
[junit4:junit4]   2> 9578 T150 oaz.ClientCnxn$SendThread.primeConnection Socket connection established to 127.0.0.1/127.0.0.1:64344, initiating session
[junit4:junit4]   2> 9578 T93 oazs.NIOServerCnxn$Factory.run Accepted socket connection from /127.0.0.1:64374
[junit4:junit4]   2> 9578 T93 oazs.NIOServerCnxn.readConnectRequest Client attempting to establish new session at /127.0.0.1:64374
[junit4:junit4]   2> 9594 T95 oazs.NIOServerCnxn.finishSessionInit Established session 0x13ae47df0640005 with negotiated timeout 8000 for client /127.0.0.1:64374
[junit4:junit4]   2> 9594 T150 oaz.ClientCnxn$SendThread.readConnectResult Session establishment complete on server 127.0.0.1/127.0.0.1:64344, sessionid = 0x13ae47df0640005, negotiated timeout = 8000
[junit4:junit4]   2> 9594 T151 oascc.ConnectionManager.process Watcher org.apache.solr.common.cloud.ConnectionManager@b4dcd9 name:ZooKeeperConnection Watcher:127.0.0.1:64344/solr got event WatchedEvent state:SyncConnected type:None path:null path:null type:None
[junit4:junit4]   2> 9594 T91 oascc.ConnectionManager.waitForConnected Client is connected to ZooKeeper
[junit4:junit4]   2> 9594 T96 oazs.PrepRequestProcessor.pRequest Got user-level KeeperException when processing sessionid:0x13ae47df0640005 type:create cxid:0x1 zxid:0xfffffffffffffffe txntype:unknown reqpath:n/a Error Path:/solr/overseer Error:KeeperErrorCode = NodeExists for /solr/overseer
[junit4:junit4]   2> 9609 T96 oazs.PrepRequestProcessor.pRequest Got user-level KeeperException when processing sessionid:0x13ae47df0640005 type:create cxid:0x2 zxid:0xfffffffffffffffe txntype:unknown reqpath:n/a Error Path:/solr/overseer Error:KeeperErrorCode = NodeExists for /solr/overseer
[junit4:junit4]   2> 9625 T91 oasc.ZkController.createEphemeralLiveNode Register node as live in ZooKeeper:/live_nodes/127.0.0.1:64369_solr
[junit4:junit4]   2> 9625 T96 oazs.PrepRequestProcessor.pRequest Got user-level KeeperException when processing sessionid:0x13ae47df0640005 type:delete cxid:0x4 zxid:0xfffffffffffffffe txntype:unknown reqpath:n/a Error Path:/solr/live_nodes/127.0.0.1:64369_solr Error:KeeperErrorCode = NoNode for /solr/live_nodes/127.0.0.1:64369_solr
[junit4:junit4]   2> 9640 T91 oascc.SolrZkClient.makePath makePath: /live_nodes/127.0.0.1:64369_solr
[junit4:junit4]   2> 9656 T139 oascc.ZkStateReader$3.process Updating live nodes... (4)
[junit4:junit4]   2> 9656 T111 oascc.ZkStateReader$3.process Updating live nodes... (4)
[junit4:junit4]   2> 9656 T127 oascc.ZkStateReader$3.process Updating live nodes... (4)
[junit4:junit4]   2> 9656 T91 oashc.HttpShardHandlerFactory.getParameter Setting socketTimeout to: 0
[junit4:junit4]   2> 9656 T91 oashc.HttpShardHandlerFactory.getParameter Setting urlScheme to: http://
[junit4:junit4]   2> 9656 T91 oashc.HttpShardHandlerFactory.getParameter Setting connTimeout to: 0
[junit4:junit4]   2> 9656 T91 oashc.HttpShardHandlerFactory.getParameter Setting maxConnectionsPerHost to: 20
[junit4:junit4]   2> 9656 T91 oashc.HttpShardHandlerFactory.getParameter Setting corePoolSize to: 0
[junit4:junit4]   2> 9672 T91 oashc.HttpShardHandlerFactory.getParameter Setting maximumPoolSize to: 2147483647
[junit4:junit4]   2> 9672 T91 oashc.HttpShardHandlerFactory.getParameter Setting maxThreadIdleTime to: 5
[junit4:junit4]   2> 9672 T91 oashc.HttpShardHandlerFactory.getParameter Setting sizeOfQueue to: -1
[junit4:junit4]   2> 9672 T91 oashc.HttpShardHandlerFactory.getParameter Setting fairnessPolicy to: false
[junit4:junit4]   2> 9672 T91 oascsi.HttpClientUtil.createClient Creating new http client, config:maxConnectionsPerHost=20&maxConnections=10000&socketTimeout=0&connTimeout=0&retry=false
[junit4:junit4]   2> 9703 T91 oascc.ZkStateReader.createClusterStateWatchersAndUpdate Updating cluster state from ZooKeeper... 
[junit4:junit4]   2> 9703 T91 oasc.CoreContainer.create Creating SolrCore 'collection1' using instanceDir: C:\Users\JenkinsSlave\workspace\Lucene-Solr-4.x-Windows\solr\build\solr-solrj\test\J0\.\solrtest-jetty3-1352453198857\collection1
[junit4:junit4]   2> 9703 T91 oasc.ZkController.createCollectionZkNode Check for collection zkNode:collection1
[junit4:junit4]   2> 9719 T91 oasc.ZkController.createCollectionZkNode Collection zkNode exists
[junit4:junit4]   2> 9719 T91 oasc.ZkController.readConfigName Load collection config from:/collections/collection1
[junit4:junit4]   2> 9719 T91 oasc.SolrResourceLoader.<init> new SolrResourceLoader for directory: 'C:\Users\JenkinsSlave\workspace\Lucene-Solr-4.x-Windows\solr\build\solr-solrj\test\J0\.\solrtest-jetty3-1352453198857\collection1\'
[junit4:junit4]   2> 9765 T112 oascc.ZkStateReader.updateClusterState Updating cloud state from ZooKeeper... 
[junit4:junit4]   2> 9765 T112 oasc.Overseer$ClusterStateUpdater.updateState Update state numShards=2 message={
[junit4:junit4]   2> 	  "operation":"state",
[junit4:junit4]   2> 	  "numShards":"2",
[junit4:junit4]   2> 	  "shard":"shard2",
[junit4:junit4]   2> 	  "roles":null,
[junit4:junit4]   2> 	  "state":"active",
[junit4:junit4]   2> 	  "core":"collection1",
[junit4:junit4]   2> 	  "collection":"collection1",
[junit4:junit4]   2> 	  "node_name":"127.0.0.1:64363_solr",
[junit4:junit4]   2> 	  "base_url":"http://127.0.0.1:64363/solr"}
[junit4:junit4]   2> 9765 T91 oasc.SolrConfig.<init> Using Lucene MatchVersion: LUCENE_41
[junit4:junit4]   2> 9797 T139 oascc.ZkStateReader$2.process A cluster state change has occurred - updating... (4)
[junit4:junit4]   2> 9797 T127 oascc.ZkStateReader$2.process A cluster state change has occurred - updating... (4)
[junit4:junit4]   2> 9797 T111 oascc.ZkStateReader$2.process A cluster state change has occurred - updating... (4)
[junit4:junit4]   2> 9797 T151 oascc.ZkStateReader$2.process A cluster state change has occurred - updating... (4)
[junit4:junit4]   2> 9844 T91 oasc.SolrConfig.<init> Loaded SolrConfig: solrconfig.xml
[junit4:junit4]   2> 9844 T91 oass.IndexSchema.readSchema Reading Solr Schema
[junit4:junit4]   2> 9875 T91 oass.IndexSchema.readSchema Schema name=test
[junit4:junit4]   2> 10453 T91 oass.IndexSchema.readSchema default search field in schema is text
[junit4:junit4]   2> 10469 T91 oass.IndexSchema.readSchema unique key field: id
[junit4:junit4]   2> 10469 T91 oass.IndexSchema.readSchema WARNING Field text is not multivalued and destination for multiple copyFields (2)
[junit4:junit4]   2> 10469 T91 oass.IndexSchema.readSchema WARNING Field lowerfilt1and2 is not multivalued and destination for multiple copyFields (2)
[junit4:junit4]   2> 10469 T91 oasc.SolrCore.<init> [collection1] Opening new SolrCore at C:\Users\JenkinsSlave\workspace\Lucene-Solr-4.x-Windows\solr\build\solr-solrj\test\J0\.\solrtest-jetty3-1352453198857\collection1\, dataDir=.\org.apache.solr.client.solrj.impl.CloudSolrServerTest-1352453189560/jetty3\
[junit4:junit4]   2> 10469 T91 oasc.SolrCore.<init> JMX monitoring not detected for core: collection1
[junit4:junit4]   2> 10469 T91 oasc.SolrCore.getNewIndexDir New index directory detected: old=null new=.\org.apache.solr.client.solrj.impl.CloudSolrServerTest-1352453189560/jetty3\index/
[junit4:junit4]   2> 10469 T91 oasc.SolrCore.initIndex WARNING [collection1] Solr index directory '.\org.apache.solr.client.solrj.impl.CloudSolrServerTest-1352453189560\jetty3\index' doesn't exist. Creating new index...
[junit4:junit4]   2> 10469 T91 oasc.CachingDirectoryFactory.get return new directory for C:\Users\JenkinsSlave\workspace\Lucene-Solr-4.x-Windows\solr\build\solr-solrj\test\J0\.\org.apache.solr.client.solrj.impl.CloudSolrServerTest-1352453189560\jetty3\index forceNew:false
[junit4:junit4]   2> 10515 T91 oasc.SolrDeletionPolicy.onCommit SolrDeletionPolicy.onCommit: commits:num=1
[junit4:junit4]   2> 		commit{dir=C:\Users\JenkinsSlave\workspace\Lucene-Solr-4.x-Windows\solr\build\solr-solrj\test\J0\org.apache.solr.client.solrj.impl.CloudSolrServerTest-1352453189560\jetty3\index,segFN=segments_1,generation=1,filenames=[segments_1]
[junit4:junit4]   2> 10515 T91 oasc.SolrDeletionPolicy.updateCommits newest commit = 1
[junit4:junit4]   2> 10515 T91 oasc.RequestHandlers.initHandlersFromConfig created /get: solr.RealTimeGetHandler
[junit4:junit4]   2> 10515 T91 oasc.RequestHandlers.initHandlersFromConfig adding lazy requestHandler: solr.ReplicationHandler
[junit4:junit4]   2> 10515 T91 oasc.RequestHandlers.initHandlersFromConfig created /replication: solr.ReplicationHandler
[junit4:junit4]   2> 10515 T91 oasc.RequestHandlers.initHandlersFromConfig created standard: solr.StandardRequestHandler
[junit4:junit4]   2> 10515 T91 oasc.RequestHandlers.initHandlersFromConfig created /update: solr.UpdateRequestHandler
[junit4:junit4]   2> 10515 T91 oasc.RequestHandlers.initHandlersFromConfig created /admin/: org.apache.solr.handler.admin.AdminHandlers
[junit4:junit4]   2> 10531 T91 oashl.XMLLoader.init xsltCacheLifetimeSeconds=60
[junit4:junit4]   2> 10531 T91 oass.SolrIndexSearcher.<init> Opening Searcher@1be1e75 main
[junit4:junit4]   2> 10531 T91 oasu.CommitTracker.<init> Hard AutoCommit: disabled
[junit4:junit4]   2> 10531 T91 oasu.CommitTracker.<init> Soft AutoCommit: disabled
[junit4:junit4]   2> 10547 T152 oasc.SolrCore.registerSearcher [collection1] Registered new searcher Searcher@1be1e75 main{StandardDirectoryReader(segments_1:1)}
[junit4:junit4]   2> 10547 T91 oasc.ZkController.publish numShards not found on descriptor - reading it from system property
[junit4:junit4]   2> 10890 T112 oascc.ZkStateReader.updateClusterState Updating cloud state from ZooKeeper... 
[junit4:junit4]   2> 10890 T112 oasc.Overseer$ClusterStateUpdater.updateState Update state numShards=2 message={
[junit4:junit4]   2> 	  "operation":"state",
[junit4:junit4]   2> 	  "numShards":"2",
[junit4:junit4]   2> 	  "shard":null,
[junit4:junit4]   2> 	  "roles":null,
[junit4:junit4]   2> 	  "state":"down",
[junit4:junit4]   2> 	  "core":"collection1",
[junit4:junit4]   2> 	  "collection":"collection1",
[junit4:junit4]   2> 	  "node_name":"127.0.0.1:64369_solr",
[junit4:junit4]   2> 	  "base_url":"http://127.0.0.1:64369/solr"}
[junit4:junit4]   2> 10937 T139 oascc.ZkStateReader$2.process A cluster state change has occurred - updating... (4)
[junit4:junit4]   2> 10937 T127 oascc.ZkStateReader$2.process A cluster state change has occurred - updating... (4)
[junit4:junit4]   2> 10937 T111 oascc.ZkStateReader$2.process A cluster state change has occurred - updating... (4)
[junit4:junit4]   2> 10937 T151 oascc.ZkStateReader$2.process A cluster state change has occurred - updating... (4)
[junit4:junit4]   2> 11047 T91 oasc.CoreContainer.register registering core: collection1
[junit4:junit4]   2> 11047 T91 oasc.ZkController.register Register shard - core:collection1 address:http://127.0.0.1:64369/solr shardId:shard1
[junit4:junit4]   2> 11062 T91 oasc.ZkController.register We are http://127.0.0.1:64369/solr/collection1/ and leader is http://127.0.0.1:64357/solr/collection1/
[junit4:junit4]   2> 11062 T91 oasc.ZkController.register No LogReplay needed for core=collection1 baseURL=http://127.0.0.1:64369/solr
[junit4:junit4]   2> 11062 T91 oasc.ZkController.checkRecovery Core needs to recover:collection1
[junit4:junit4]   2> 11062 T91 oasu.DefaultSolrCoreState.doRecovery Running recovery - first canceling any ongoing recovery
[junit4:junit4]   2> ASYNC  NEW_CORE C7 name=collection1 org.apache.solr.core.SolrCore@1efa79f url=http://127.0.0.1:64369/solr/collection1 node=127.0.0.1:64369_solr
[junit4:junit4]   2> 11078 T153 C7 P64369 oasc.RecoveryStrategy.run Starting recovery process.  core=collection1 recoveringAfterStartup=true
[junit4:junit4]   2> 11078 T153 C7 P64369 oasc.RecoveryStrategy.doRecovery ###### startupVersions=[]
[junit4:junit4]   2> 11078 T91 oascc.ZkStateReader.updateClusterState Updating cloud state from ZooKeeper... 
[junit4:junit4]   2> 11078 T153 C7 P64369 oasc.ZkController.publish numShards not found on descriptor - reading it from system property
[junit4:junit4]   2> 11078 T91 oass.SolrDispatchFilter.init user.dir=C:\Users\JenkinsSlave\workspace\Lucene-Solr-4.x-Windows\solr\build\solr-solrj\test\J0
[junit4:junit4]   2> 11078 T91 oass.SolrDispatchFilter.init SolrDispatchFilter.init() done
[junit4:junit4]   2> 11078 T91 oascsi.HttpClientUtil.createClient Creating new http client, config:maxConnections=128&maxConnectionsPerHost=32&followRedirects=false
[junit4:junit4]   2> 11109 T153 C7 P64369 oasc.RecoveryStrategy.doRecovery Attempting to PeerSync from http://127.0.0.1:64357/solr/collection1/ core=collection1 - recoveringAfterStartup=true
[junit4:junit4]   2> 11125 T153 C7 P64369 oascsi.HttpClientUtil.createClient Creating new http client, config:maxConnectionsPerHost=20&maxConnections=10000&connTimeout=30000&socketTimeout=30000&retry=false
[junit4:junit4]   2> 11125 T153 C7 P64369 oasu.PeerSync.sync PeerSync: core=collection1 url=http://127.0.0.1:64369/solr START replicas=[http://127.0.0.1:64357/solr/collection1/] nUpdates=100
[junit4:junit4]   2> 11140 T153 C7 P64369 oasu.PeerSync.sync WARNING no frame of reference to tell of we've missed updates
[junit4:junit4]   2> 11172 T153 C7 P64369 oasc.RecoveryStrategy.doRecovery PeerSync Recovery was not successful - trying replication. core=collection1
[junit4:junit4]   2> 11172 T153 C7 P64369 oasc.RecoveryStrategy.doRecovery Starting Replication Recovery. core=collection1
[junit4:junit4]   2> 11172 T153 C7 P64369 oascsi.HttpClientUtil.createClient Creating new http client, config:maxConnections=128&maxConnectionsPerHost=32&followRedirects=false
[junit4:junit4]   2> ASYNC  NEW_CORE C8 name=collection1 org.apache.solr.core.SolrCore@5995ba url=http://127.0.0.1:64357/solr/collection1 node=127.0.0.1:64357_solr
[junit4:junit4]   2> 11172 T118 C8 P64357 REQ /get {distrib=false&qt=/get&wt=javabin&version=2&getVersions=100} status=0 QTime=0 
[junit4:junit4]   2> 11281 T91 oejs.Server.doStart jetty-8.1.7.v20120910
[junit4:junit4]   2> 11281 T91 oejs.AbstractConnector.doStart Started SelectChannelConnector@0.0.0.0:64377
[junit4:junit4]   2> 11281 T91 oasc.SolrResourceLoader.locateSolrHome JNDI not configured for solr (NoInitialContextEx)
[junit4:junit4]   2> 11297 T91 oasc.SolrResourceLoader.locateSolrHome using system property solr.solr.home: C:\Users\JenkinsSlave\workspace\Lucene-Solr-4.x-Windows\solr\build\solr-solrj\test\J0\.\solrtest-jetty4-1352453200639
[junit4:junit4]   2> 11297 T91 oasc.SolrResourceLoader.<init> new SolrResourceLoader for deduced Solr Home: 'C:\Users\JenkinsSlave\workspace\Lucene-Solr-4.x-Windows\solr\build\solr-solrj\test\J0\.\solrtest-jetty4-1352453200639\'
[junit4:junit4]   2> 11328 T91 oass.SolrDispatchFilter.init SolrDispatchFilter.init()
[junit4:junit4]   2> 11328 T91 oasc.SolrResourceLoader.locateSolrHome JNDI not configured for solr (NoInitialContextEx)
[junit4:junit4]   2> 11328 T91 oasc.SolrResourceLoader.locateSolrHome using system property solr.solr.home: C:\Users\JenkinsSlave\workspace\Lucene-Solr-4.x-Windows\solr\build\solr-solrj\test\J0\.\solrtest-jetty4-1352453200639
[junit4:junit4]   2> 11328 T91 oasc.CoreContainer$Initializer.initialize looking for solr.xml: C:\Users\JenkinsSlave\workspace\Lucene-Solr-4.x-Windows\solr\build\solr-solrj\test\J0\.\solrtest-jetty4-1352453200639\solr.xml
[junit4:junit4]   2> 11328 T91 oasc.CoreContainer.<init> New CoreContainer 19319578
[junit4:junit4]   2> 11328 T91 oasc.CoreContainer.load Loading CoreContainer using Solr Home: 'C:\Users\JenkinsSlave\workspace\Lucene-Solr-4.x-Windows\solr\build\solr-solrj\test\J0\.\solrtest-jetty4-1352453200639\'
[junit4:junit4]   2> 11328 T91 oasc.SolrResourceLoader.<init> new SolrResourceLoader for directory: 'C:\Users\JenkinsSlave\workspace\Lucene-Solr-4.x-Windows\solr\build\solr-solrj\test\J0\.\solrtest-jetty4-1352453200639\'
[junit4:junit4]   2> 11344 T91 oasc.CoreContainer.load Registering Log Listener
[junit4:junit4]   2> 11359 T91 oasc.CoreContainer.initZooKeeper Zookeeper client=127.0.0.1:64344/solr
[junit4:junit4]   2> 11359 T91 oaz.ZooKeeper.<init> Initiating client connection, connectString=127.0.0.1:64344/solr sessionTimeout=8000 watcher=org.apache.solr.common.cloud.ConnectionManager@1bc345a
[junit4:junit4]   2> 11359 T164 oaz.ClientCnxn$SendThread.startConnect Opening socket connection to server /127.0.0.1:64344
[junit4:junit4]   2> 11359 T91 oascc.ConnectionManager.waitForConnected Waiting for client to connect to ZooKeeper
[junit4:junit4]   2> 11359 T164 oaz.ClientCnxn$SendThread.primeConnection Socket connection established to 127.0.0.1/127.0.0.1:64344, initiating session
[junit4:junit4]   2> 11359 T93 oazs.NIOServerCnxn$Factory.run Accepted socket connection from /127.0.0.1:64382
[junit4:junit4]   2> 11359 T93 oazs.NIOServerCnxn.readConnectRequest Client attempting to establish new session at /127.0.0.1:64382
[junit4:junit4]   2> 11375 T95 oazs.NIOServerCnxn.finishSessionInit Established session 0x13ae47df0640006 with negotiated timeout 8000 for client /127.0.0.1:64382
[junit4:junit4]   2> 11375 T164 oaz.ClientCnxn$SendThread.readConnectResult Session establishment complete on server 127.0.0.1/127.0.0.1:64344, sessionid = 0x13ae47df0640006, negotiated timeout = 8000
[junit4:junit4]   2> 11375 T165 oascc.ConnectionManager.process Watcher org.apache.solr.common.cloud.ConnectionManager@1bc345a name:ZooKeeperConnection Watcher:127.0.0.1:64344/solr got event WatchedEvent state:SyncConnected type:None path:null path:null type:None
[junit4:junit4]   2> 11375 T91 oascc.ConnectionManager.waitForConnected Client is connected to ZooKeeper
[junit4:junit4]   2> 11375 T96 oazs.PrepRequestProcessor.pRequest Got user-level KeeperException when processing sessionid:0x13ae47df0640006 type:create cxid:0x1 zxid:0xfffffffffffffffe txntype:unknown reqpath:n/a Error Path:/solr/overseer Error:KeeperErrorCode = NodeExists for /solr/overseer
[junit4:junit4]   2> 11390 T96 oazs.PrepRequestProcessor.pRequest Got user-level KeeperException when processing sessionid:0x13ae47df0640006 type:create cxid:0x2 zxid:0xfffffffffffffffe txntype:unknown reqpath:n/a Error Path:/solr/overseer Error:KeeperErrorCode = NodeExists for /solr/overseer
[junit4:junit4]   2> 11390 T91 oasc.ZkController.createEphemeralLiveNode Register node as live in ZooKeeper:/live_nodes/127.0.0.1:64377_solr
[junit4:junit4]   2> 11406 T96 oazs.PrepRequestProcessor.pRequest Got user-level KeeperException when processing sessionid:0x13ae47df0640006 type:delete cxid:0x4 zxid:0xfffffffffffffffe txntype:unknown reqpath:n/a Error Path:/solr/live_nodes/127.0.0.1:64377_solr Error:KeeperErrorCode = NoNode for /solr/live_nodes/127.0.0.1:64377_solr
[junit4:junit4]   2> 11422 T91 oascc.SolrZkClient.makePath makePath: /live_nodes/127.0.0.1:64377_solr
[junit4:junit4]   2> 11437 T139 oascc.ZkStateReader$3.process Updating live nodes... (5)
[junit4:junit4]   2> 11437 T127 oascc.ZkStateReader$3.process Updating live nodes... (5)
[junit4:junit4]   2> 11437 T111 oascc.ZkStateReader$3.process Updating live nodes... (5)
[junit4:junit4]   2> 11437 T151 oascc.ZkStateReader$3.process Updating live nodes... (5)
[junit4:junit4]   2> 11437 T91 oashc.HttpShardHandlerFactory.getParameter Setting socketTimeout to: 0
[junit4:junit4]   2> 11437 T91 oashc.HttpShardHandlerFactory.getParameter Setting urlScheme to: http://
[junit4:junit4]   2> 11437 T91 oashc.HttpShardHandlerFactory.getParameter Setting connTimeout to: 0
[junit4:junit4]   2> 11437 T91 oashc.HttpShardHandlerFactory.getParameter Setting maxConnectionsPerHost to: 20
[junit4:junit4]   2> 11437 T91 oashc.HttpShardHandlerFactory.getParameter Setting corePoolSize to: 0
[junit4:junit4]   2> 11437 T91 oashc.HttpShardHandlerFactory.getParameter Setting maximumPoolSize to: 2147483647
[junit4:junit4]   2> 11437 T91 oashc.HttpShardHandlerFactory.getParameter Setting maxThreadIdleTime to: 5
[junit4:junit4]   2> 11437 T91 oashc.HttpShardHandlerFactory.getParameter Setting sizeOfQueue to: -1
[junit4:junit4]   2> 11437 T91 oashc.HttpShardHandlerFactory.getParameter Setting fairnessPolicy to: false
[junit4:junit4]   2> 11437 T91 oascsi.HttpClientUtil.createClient Creating new http client, config:maxConnectionsPerHost=20&maxConnections=10000&socketTimeout=0&connTimeout=0&retry=false
[junit4:junit4]   2> 11453 T112 oascc.ZkStateReader.updateClusterState Updating cloud state from ZooKeeper... 
[junit4:junit4]   2> 11453 T112 oasc.Overseer$ClusterStateUpdater.updateState Update state numShards=2 message={
[junit4:junit4]   2> 	  "operation":"state",
[junit4:junit4]   2> 	  "numShards":"2",
[junit4:junit4]   2> 	  "shard":"shard1",
[junit4:junit4]   2> 	  "roles":null,
[junit4:junit4]   2> 	  "state":"recovering",
[junit4:junit4]   2> 	  "core":"collection1",
[junit4:junit4]   2> 	  "collection":"collection1",
[junit4:junit4]   2> 	  "node_name":"127.0.0.1:64369_solr",
[junit4:junit4]   2> 	  "base_url":"http://127.0.0.1:64369/solr"}
[junit4:junit4]   2> 11484 T91 oascc.ZkStateReader.createClusterStateWatchersAndUpdate Updating cluster state from ZooKeeper... 
[junit4:junit4]   2> 11484 T139 oascc.ZkStateReader$2.process A cluster state change has occurred - updating... (5)
[junit4:junit4]   2> 11484 T127 oascc.ZkStateReader$2.process A cluster state change has occurred - updating... (5)
[junit4:junit4]   2> 11484 T165 oaz.ClientCnxn$EventThread.processEvent SEVERE Error while calling watcher  java.lang.NullPointerException
[junit4:junit4]   2> 	at org.apache.solr.common.cloud.ZkStateReader$2.process(ZkStateReader.java:189)
[junit4:junit4]   2> 	at org.apache.zookeeper.ClientCnxn$EventThread.processEvent(ClientCnxn.java:526)
[junit4:junit4]   2> 	at org.apache.zookeeper.ClientCnxn$EventThread.run(ClientCnxn.java:502)
[junit4:junit4]   2> 
[junit4:junit4]   2> 11484 T151 oascc.ZkStateReader$2.process A cluster state change has occurred - updating... (5)
[junit4:junit4]   2> 11484 T111 oascc.ZkStateReader$2.process A cluster state change has occurred - updating... (5)
[junit4:junit4]   2> 11484 T91 oasc.CoreContainer.create Creating SolrCore 'collection1' using instanceDir: C:\Users\JenkinsSlave\workspace\Lucene-Solr-4.x-Windows\solr\build\solr-solrj\test\J0\.\solrtest-jetty4-1352453200639\collection1
[junit4:junit4]   2> 11484 T91 oasc.ZkController.createCollectionZkNode Check for collection zkNode:collection1
[junit4:junit4]   2> 11500 T91 oasc.ZkController.createCollectionZkNode Collection zkNode exists
[junit4:junit4]   2> 11500 T91 oasc.ZkController.readConfigName Load collection config from:/collections/collection1
[junit4:junit4]   2> 11500 T91 oasc.SolrResourceLoader.<init> new SolrResourceLoader for directory: 'C:\Users\JenkinsSlave\workspace\Lucene-Solr-4.x-Windows\solr\build\solr-solrj\test\J0\.\solrtest-jetty4-1352453200639\collection1\'
[junit4:junit4]   2> 11547 T91 oasc.SolrConfig.<init> Using Lucene MatchVersion: LUCENE_41
[junit4:junit4]   2> 11609 T91 oasc.SolrConfig.<init> Loaded SolrConfig: solrconfig.xml
[junit4:junit4]   2> 11609 T91 oass.IndexSchema.readSchema Reading Solr Schema
[junit4:junit4]   2> 11609 T91 oass.IndexSchema.readSchema Schema name=test
[junit4:junit4]   2> 12203 T91 oass.IndexSchema.readSchema default search field in schema is text
[junit4:junit4]   2> 12203 T91 oass.IndexSchema.readSchema unique key field: id
[junit4:junit4]   2> 12203 T91 oass.IndexSchema.readSchema WARNING Field text is not multivalued and destination for multiple copyFields (2)
[junit4:junit4]   2> 12203 T91 oass.IndexSchema.readSchema WARNING Field lowerfilt1and2 is not multivalued and destination for multiple copyFields (2)
[junit4:junit4]   2> 12203 T91 oasc.SolrCore.<init> [collection1] Opening new SolrCore at C:\Users\JenkinsSlave\workspace\Lucene-Solr-4.x-Windows\solr\build\solr-solrj\test\J0\.\solrtest-jetty4-1352453200639\collection1\, dataDir=.\org.apache.solr.client.solrj.impl.CloudSolrServerTest-1352453189560/jetty4\
[junit4:junit4]   2> 12203 T91 oasc.SolrCore.<init> JMX monitoring not detected for core: collection1
[junit4:junit4]   2> 12203 T91 oasc.SolrCore.getNewIndexDir New index directory detected: old=null new=.\org.apache.solr.client.solrj.impl.CloudSolrServerTest-1352453189560/jetty4\index/
[junit4:junit4]   2> 12203 T91 oasc.SolrCore.initIndex WARNING [collection1] Solr index directory '.\org.apache.solr.client.solrj.impl.CloudSolrServerTest-1352453189560\jetty4\index' doesn't exist. Creating new index...
[junit4:junit4]   2> 12203 T91 oasc.CachingDirectoryFactory.get return new directory for C:\Users\JenkinsSlave\workspace\Lucene-Solr-4.x-Windows\solr\build\solr-solrj\test\J0\.\org.apache.solr.client.solrj.impl.CloudSolrServerTest-1352453189560\jetty4\index forceNew:false
[junit4:junit4]   2> 12250 T91 oasc.SolrDeletionPolicy.onCommit SolrDeletionPolicy.onCommit: commits:num=1
[junit4:junit4]   2> 		commit{dir=C:\Users\JenkinsSlave\workspace\Lucene-Solr-4.x-Windows\solr\build\solr-solrj\test\J0\org.apache.solr.client.solrj.impl.CloudSolrServerTest-1352453189560\jetty4\index,segFN=segments_1,generation=1,filenames=[segments_1]
[junit4:junit4]   2> 12250 T91 oasc.SolrDeletionPolicy.updateCommits newest commit = 1
[junit4:junit4]   2> 12265 T91 oasc.RequestHandlers.initHandlersFromConfig created /get: solr.RealTimeGetHandler
[junit4:junit4]   2> 12265 T91 oasc.RequestHandlers.initHandlersFromConfig adding lazy requestHandler: solr.ReplicationHandler
[junit4:junit4]   2> 12265 T91 oasc.RequestHandlers.initHandlersFromConfig created /replication: solr.ReplicationHandler
[junit4:junit4]   2> 12265 T91 oasc.RequestHandlers.initHandlersFromConfig created standard: solr.StandardRequestHandler
[junit4:junit4]   2> 12265 T91 oasc.RequestHandlers.initHandlersFromConfig created /update: solr.UpdateRequestHandler
[junit4:junit4]   2> 12265 T91 oasc.RequestHandlers.initHandlersFromConfig created /admin/: org.apache.solr.handler.admin.AdminHandlers
[junit4:junit4]   2> 12265 T91 oashl.XMLLoader.init xsltCacheLifetimeSeconds=60
[junit4:junit4]   2> 12281 T91 oass.SolrIndexSearcher.<init> Opening Searcher@1609812 main
[junit4:junit4]   2> 12281 T91 oasu.CommitTracker.<init> Hard AutoCommit: disabled
[junit4:junit4]   2> 12281 T91 oasu.CommitTracker.<init> Soft AutoCommit: disabled
[junit4:junit4]   2> 12281 T166 oasc.SolrCore.registerSearcher [collection1] Registered new searcher Searcher@1609812 main{StandardDirectoryReader(segments_1:1)}
[junit4:junit4]   2> 12281 T91 oasc.ZkController.publish numShards not found on descriptor - reading it from system property
[junit4:junit4]   2> 12500 T112 oascc.ZkStateReader.updateClusterState Updating cloud state from ZooKeeper... 
[junit4:junit4]   2> 12500 T112 oasc.Overseer$ClusterStateUpdater.updateState Update state numShards=2 message={
[junit4:junit4]   2> 	  "operation":"state",
[junit4:junit4]   2> 	  "numShards":"2",
[junit4:junit4]   2> 	  "shard":null,
[junit4:junit4]   2> 	  "roles":null,
[junit4:junit4]   2> 	  "state":"down",
[junit4:junit4]   2> 	  "core":"collection1",
[junit4:junit4]   2> 	  "collection":"collection1",
[junit4:junit4]   2> 	  "node_name":"127.0.0.1:64377_solr",
[junit4:junit4]   2> 	  "base_url":"http://127.0.0.1:64377/solr"}
[junit4:junit4]   2> 12562 T139 oascc.ZkStateReader$2.process A cluster state change has occurred - updating... (5)
[junit4:junit4]   2> 12562 T127 oascc.ZkStateReader$2.process A cluster state change has occurred - updating... (5)
[junit4:junit4]   2> 12562 T111 oascc.ZkStateReader$2.process A cluster state change has occurred - updating... (5)
[junit4:junit4]   2> 12562 T151 oascc.ZkStateReader$2.process A cluster state change has occurred - updating... (5)
[junit4:junit4]   2>  C7_STATE=coll:collection1 core:collection1 props:{shard=shard1, roles=null, state=recovering, core=collection1, collection=collection1, node_name=127.0.0.1:64369_solr, base_url=http://127.0.0.1:64369/solr}
[junit4:junit4]   2> 14187 T153 C7 P64369 oasc.RecoveryStrategy.doRecovery Begin buffering updates. core=collection1
[junit4:junit4]   2> 14187 T153 C7 P64369 oasu.UpdateLog.bufferUpdates Starting to buffer updates. FSUpdateLog{state=ACTIVE, tlog=null}
[junit4:junit4]   2> 14187 T153 C7 P64369 oasc.RecoveryStrategy.replicate Attempting to replicate from http://127.0.0.1:64357/solr/collection1/. core=collection1
[junit4:junit4]   2> 14187 T153 C7 P64369 oascsi.HttpClientUtil.createClient Creating new http client, config:maxConnections=128&maxConnectionsPerHost=32&followRedirects=false
[junit4:junit4]   2> 14203 T121 C8 P64357 oascsi.HttpClientUtil.createClient Creating new http client, config:maxConnections=500&maxConnectionsPerHost=16
[junit4:junit4]   2> 14219 T121 C8 P64357 oasu.DirectUpdateHandler2.commit start commit{flags=0,_version_=0,optimize=false,openSearcher=false,waitSearcher=true,expungeDeletes=false,softCommit=false}
[junit4:junit4]   2> 14219 T121 C8 P64357 oasc.SolrDeletionPolicy.onInit SolrDeletionPolicy.onInit: commits:num=1
[junit4:junit4]   2> 		commit{dir=C:\Users\JenkinsSlave\workspace\Lucene-Solr-4.x-Windows\solr\build\solr-solrj\test\J0\org.apache.solr.client.solrj.impl.CloudSolrServerTest-1352453189560\jetty1\index,segFN=segments_1,generation=1,filenames=[segments_1]
[junit4:junit4]   2> 14219 T121 C8 P64357 oasc.SolrDeletionPolicy.updateCommits newest commit = 1
[junit4:junit4]   2> 14219 T121 C8 P64357 oass.SolrIndexSearcher.<init> Opening Searcher@3bfb66 realtime
[junit4:junit4]   2> 14219 T121 C8 P64357 oasu.DirectUpdateHandler2.commit end_commit_flush
[junit4:junit4]   2> 14219 T121 C8 P64357 /update {waitSearcher=true&openSearcher=false&commit=true&commit_end_point=true&wt=javabin&softCommit=false&version=2} {commit=} 0 32
[junit4:junit4]   2> 14219 T153 C7 P64369 oash.ReplicationHandler.inform Commits will be reserved for  10000
[junit4:junit4]   2> 14219 T153 C7 P64369 oascsi.HttpClientUtil.createClient Creating new http client, config:connTimeout=5000&socketTimeout=20000&allowCompression=false&maxConnections=10000&maxConnectionsPerHost=10000
[junit4:junit4]   2> 14234 T153 C7 P64369 oash.SnapPuller.<init>  No value set for 'pollInterval'. Timer Task not started.
[junit4:junit4]   2> 14234 T125 C8 P64357 oash.ReplicationHandler.inform Commits will be reserved for  10000
[junit4:junit4]   2> 14234 T125 C8 P64357 REQ /replication {command=indexversion&wt=javabin&qt=/replication&version=2} status=0 QTime=0 
[junit4:junit4]   2> 14250 T153 C7 P64369 oasc.SolrDeletionPolicy.onInit SolrDeletionPolicy.onInit: commits:num=1
[junit4:junit4]   2> 		commit{dir=C:\Users\JenkinsSlave\workspace\Lucene-Solr-4.x-Windows\solr\build\solr-solrj\test\J0\org.apache.solr.client.solrj.impl.CloudSolrServerTest-1352453189560\jetty3\index,segFN=segments_1,generation=1,filenames=[segments_1]
[junit4:junit4]   2> 14250 T153 C7 P64369 oasc.SolrDeletionPolicy.updateCommits newest commit = 1
[junit4:junit4]   2> 14250 T153 C7 P64369 oasu.DirectUpdateHandler2.commit start commit{flags=0,_version_=0,optimize=false,openSearcher=true,waitSearcher=true,expungeDeletes=false,softCommit=false}
[junit4:junit4]   2> 14281 T153 C7 P64369 oasc.SolrDeletionPolicy.onCommit SolrDeletionPolicy.onCommit: commits:num=2
[junit4:junit4]   2> 		commit{dir=C:\Users\JenkinsSlave\workspace\Lucene-Solr-4.x-Windows\solr\build\solr-solrj\test\J0\org.apache.solr.client.solrj.impl.CloudSolrServerTest-1352453189560\jetty3\index,segFN=segments_1,generation=1,filenames=[segments_1]
[junit4:junit4]   2> 		commit{dir=C:\Users\JenkinsSlave\workspace\Lucene-Solr-4.x-Windows\solr\build\solr-solrj\test\J0\org.apache.solr.client.solrj.impl.CloudSolrServerTest-1352453189560\jetty3\index,segFN=segments_2,generation=2,filenames=[segments_2]
[junit4:junit4]   2> 14281 T153 C7 P64369 oasc.SolrDeletionPolicy.updateCommits newest commit = 2
[junit4:junit4]   2> 14281 T153 C7 P64369 oass.SolrIndexSearcher.<init> Opening Searcher@f1399 main
[junit4:junit4]   2> 14281 T153 C7 P64369 oasu.DirectUpdateHandler2.commit end_commit_flush
[junit4:junit4]   2> 14281 T152 oasc.SolrCore.registerSearcher [collection1] Registered new searcher Searcher@f1399 main{StandardDirectoryReader(segments_2:2)}
[junit4:junit4]   2> 14281 T153 C7 P64369 oasc.RecoveryStrategy.replay No replay needed. core=collection1
[junit4:junit4]   2> 14281 T153 C7 P64369 oasc.RecoveryStrategy.doRecovery Replication Recovery was successful - registering as Active. core=collection1
[junit4:junit4]   2> 14281 T153 C7 P64369 oasc.ZkController.publish numShards not found on descriptor - reading it from system property
[junit4:junit4]   2> 14297 T153 C7 P64369 oasc.RecoveryStrategy.doRecovery Finished recovery process. core=collection1
[junit4:junit4]   2> 14562 T112 oascc.ZkStateReader.updateClusterState Updating cloud state from ZooKeeper... 
[junit4:junit4]   2> 14562 T112 oasc.Overseer$ClusterStateUpdater.updateState Update state numShards=2 message={
[junit4:junit4]   2> 	  "operation":"state",
[junit4:junit4]   2> 	  "numShards":"2",
[junit4:junit4]   2> 	  "shard":"shard1",
[junit4:junit4]   2> 	  "roles":null,
[junit4:junit4]   2> 	  "state":"active",
[junit4:junit4]   2> 	  "core":"collection1",
[junit4:junit4]   2> 	  "collection":"collection1",
[junit4:junit4]   2> 	  "node_name":"127.0.0.1:64369_solr",
[junit4:junit4]   2> 	  "base_url":"http://127.0.0.1:64369/solr"}
[junit4:junit4]   2> 14609 T139 oascc.ZkStateReader$2.process A cluster state change has occurred - updating... (5)
[junit4:junit4]   2> 14609 T127 oascc.ZkStateReader$2.process A cluster state change has occurred - updating... (5)
[junit4:junit4]   2> 14609 T111 oascc.ZkStateReader$2.process A cluster state change has occurred - updating... (5)
[junit4:junit4]   2> 14609 T151 oascc.ZkStateReader$2.process A cluster state change has occurred - updating... (5)
[junit4:junit4]   2> 72297 T91 oasc.SolrException.log SEVERE null:org.apache.solr.common.SolrException: Could not get shard_id for core: collection1
[junit4:junit4]   2> 		at org.apache.solr.cloud.ZkController.doGetShardIdProcess(ZkController.java:996)
[junit4:junit4]   2> 		at org.apache.solr.cloud.ZkController.preRegister(ZkController.java:1054)
[junit4:junit4]   2> 		at org.apache.solr.core.CoreContainer.register(CoreContainer.java:661)
[junit4:junit4]   2> 		at org.apache.solr.core.CoreContainer.load(CoreContainer.java:531)
[junit4:junit4]   2> 		at org.apache.solr.core.CoreContainer.load(CoreContainer.java:351)
[junit4:junit4]   2> 		at org.apache.solr.core.CoreContainer$Initializer.initialize(CoreContainer.java:303)
[junit4:junit4]   2> 		at org.apache.solr.servlet.SolrDispatchFilter.init(SolrDispatchFilter.java:107)
[junit4:junit4]   2> 		at org.eclipse.jetty.servlet.FilterHolder.doStart(FilterHolder.java:119)
[junit4:junit4]   2> 		at org.eclipse.jetty.util.component.AbstractLifeCycle.start(AbstractLifeCycle.java:64)
[junit4:junit4]   2> 		at org.eclipse.jetty.servlet.ServletHandler.initialize(ServletHandler.java:724)
[junit4:junit4]   2> 		at org.eclipse.jetty.servlet.ServletHandler.updateMappings(ServletHandler.java:1197)
[junit4:junit4]   2> 		at org.eclipse.jetty.servlet.ServletHandler.setFilterMappings(ServletHandler.java:1233)
[junit4:junit4]   2> 		at org.eclipse.jetty.servlet.ServletHandler.addFilterWithMapping(ServletHandler.java:935)
[junit4:junit4]   2> 		at org.eclipse.jetty.servlet.ServletHandler.addFilterWithMapping(ServletHandler.java:893)
[junit4:junit4]   2> 		at org.eclipse.jetty.servlet.ServletContextHandler.addFilter(ServletContextHandler.java:338)
[junit4:junit4]   2> 		at org.apache.solr.client.solrj.embedded.JettySolrRunner$1.lifeCycleStarted(JettySolrRunner.java:173)
[junit4:junit4]   2> 		at org.eclipse.jetty.util.component.AbstractLifeCycle.setStarted(AbstractLifeCycle.java:174)
[junit4:junit4]   2> 		at org.eclipse.jetty.util.component.AbstractLifeCycle.start(AbstractLifeCycle.java:65)
[junit4:junit4]   2> 		at org.apache.solr.client.solrj.embedded.JettySolrRunner.start(JettySolrRunner.java:225)
[junit4:junit4]   2> 		at org.apache.solr.client.solrj.embedded.JettySolrRunner.start(JettySolrRunner.java:205)
[junit4:junit4]   2> 		at org.apache.solr.BaseDistributedSearchTestCase.createJetty(BaseDistributedSearchTestCase.java:262)
[junit4:junit4]   2> 		at org.apache.solr.cloud.AbstractFullDistribZkTestBase.createJettys(AbstractFullDistribZkTestBase.java:294)
[junit4:junit4]   2> 		at org.apache.solr.cloud.AbstractFullDistribZkTestBase.createServers(AbstractFullDistribZkTestBase.java:268)
[junit4:junit4]   2> 		at org.apache.solr.BaseDistributedSearchTestCase.testDistribSearch(BaseDistributedSearchTestCase.java:693)
[junit4:junit4]   2> 		at sun.reflect.NativeMethodAccessorImpl.invoke0(Native Method)
[junit4:junit4]   2> 		at sun.reflect.NativeMethodAccessorImpl.invoke(NativeMethodAccessorImpl.java:39)
[junit4:junit4]   2> 		at sun.reflect.DelegatingMethodAccessorImpl.invoke(DelegatingMethodAccessorImpl.java:25)
[junit4:junit4]   2> 		at java.lang.reflect.Method.invoke(Method.java:597)
[junit4:junit4]   2> 		at com.carrotsearch.randomizedtesting.RandomizedRunner.invoke(RandomizedRunner.java:1559)
[junit4:junit4]   2> 		at com.carrotsearch.randomizedtesting.RandomizedRunner.access$600(RandomizedRunner.java:79)
[junit4:junit4]   2> 		at com.carrotsearch.randomizedtesting.RandomizedRunner$6.evaluate(RandomizedRunner.java:737)
[junit4:junit4]   2> 		at com.carrotsearch.randomizedtesting.RandomizedRunner$7.evaluate(RandomizedRunner.java:773)
[junit4:junit4]   2> 		at com.carrotsearch.randomizedtesting.RandomizedRunner$8.evaluate(RandomizedRunner.java:787)
[junit4:junit4]   2> 		at com.carrotsearch.randomizedtesting.rules.SystemPropertiesRestoreRule$1.evaluate(SystemPropertiesRestoreRule.java:53)
[junit4:junit4]   2> 		at org.apache.lucene.util.TestRuleSetupTeardownChained$1.evaluate(TestRuleSetupTeardownChained.java:50)
[junit4:junit4]   2> 		at org.apache.lucene.util.TestRuleFieldCacheSanity$1.evaluate(TestRuleFieldCacheSanity.java:51)
[junit4:junit4]   2> 		at org.apache.lucene.util.AbstractBeforeAfterRule$1.evaluate(AbstractBeforeAfterRule.java:45)
[junit4:junit4]   2> 		at com.carrotsearch.randomizedtesting.rules.SystemPropertiesInvariantRule$1.evaluate(SystemPropertiesInvariantRule.java:55)
[junit4:junit4]   2> 		at org.apache.lucene.util.TestRuleThreadAndTestName$1.evaluate(TestRuleThreadAndTestName.java:48)
[junit4:junit4]   2> 		at org.apache.lucene.util.TestRuleIgnoreAfterMaxFailures$1.evaluate(TestRuleIgnoreAfterMaxFailures.java:70)
[junit4:junit4]   2> 		at org.apache.lucene.util.TestRuleMarkFailure$1.evaluate(TestRuleMarkFailure.java:48)
[junit4:junit4]   2> 		at com.carrotsearch.randomizedtesting.rules.StatementAdapter.evaluate(StatementAdapter.java:36)
[junit4:junit4]   2> 		at com.carrotsearch.randomizedtesting.ThreadLeakControl$StatementRunner.run(ThreadLeakControl.java:358)
[junit4:junit4]   2> 		at com.carrotsearch.randomizedtesting.ThreadLeakControl.forkTimeoutingTask(ThreadLeakControl.java:782)
[junit4:junit4]   2> 		at com.carrotsearch.randomizedtesting.ThreadLeakControl$3.evaluate(ThreadLeakControl.java:442)
[junit4:junit4]   2> 		at com.carrotsearch.randomizedtesting.RandomizedRunner.runSingleTest(RandomizedRunner.java:746)
[junit4:junit4]   2> 		at com.carrotsearch.randomizedtesting.RandomizedRunner$3.evaluate(RandomizedRunner.java:648)
[junit4:junit4]   2> 		at com.carrotsearch.randomizedtesting.RandomizedRunner$4.evaluate(RandomizedRunner.java:682)
[junit4:junit4]   2> 		at com.carrotsearch.randomizedtesting.RandomizedRunner$5.evaluate(RandomizedRunner.java:693)
[junit4:junit4]   2> 		at com.carrotsearch.randomizedtesting.rules.StatementAdapter.evaluate(StatementAdapter.java:36)
[junit4:junit4]   2> 		at com.carrotsearch.randomizedtesting.rules.SystemPropertiesRestoreRule$1.evaluate(SystemPropertiesRestoreRule.java:53)
[junit4:junit4]   2> 		at org.apache.lucene.util.AbstractBeforeAfterRule$1.evaluate(AbstractBeforeAfterRule.java:45)
[junit4:junit4]   2> 		at org.apache.lucene.util.TestRuleStoreClassName$1.evaluate(TestRuleStoreClassName.java:42)
[junit4:junit4]   2> 		at com.carrotsearch.randomizedtesting.rules.SystemPropertiesInvariantRule$1.evaluate(SystemPropertiesInvariantRule.java:55)
[junit4:junit4]   2> 		at com.carrotsearch.randomizedtesting.rules.NoShadowingOrOverridesOnMethodsRule$1.evaluate(NoShadowingOrOverridesOnMethodsRule.java:39)
[junit4:junit4]   2> 		at com.carrotsearch.randomizedtesting.rules.NoShadowingOrOverridesOnMethodsRule$1.evaluate(NoShadowingOrOverridesOnMethodsRule.java:39)
[junit4:junit4]   2> 		at com.carrotsearch.randomizedtesting.rules.StatementAdapter.evaluate(StatementAdapter.java:36)
[junit4:junit4]   2> 		at org.apache.lucene.util.TestRuleAssertionsRequired$1.evaluate(TestRuleAssertionsRequired.java:43)
[junit4:junit4]   2> 		at org.apache.lucene.util.TestRuleMarkFailure$1.evaluate(TestRuleMarkFailure.java:48)
[junit4:junit4]   2> 		at org.apache.lucene.util.TestRuleIgnoreAfterMaxFailures$1.evaluate(TestRuleIgnoreAfterMaxFailures.java:70)
[junit4:junit4]   2> 		at org.apache.lucene.util.TestRuleIgnoreTestSuites$1.evaluate(TestRuleIgnoreTestSuites.java:55)
[junit4:junit4]   2> 		at com.carrotsearch.randomizedtesting.rules.StatementAdapter.evaluate(StatementAdapter.java:36)
[junit4:junit4]   2> 		at com.carrotsearch.randomizedtesting.ThreadLeakControl$StatementRunner.run(ThreadLeakControl.java:358)
[junit4:junit4]   2> 		at java.lang.Thread.run(Thread.java:662)
[junit4:junit4]   2> 	
[junit4:junit4]   2> 72297 T91 oasc.SolrCore.close [collection1]  CLOSING SolrCore org.apache.solr.core.SolrCore@1146a9a
[junit4:junit4]   2> 72297 T91 oasu.DirectUpdateHandler2.close closing DirectUpdateHandler2{commits=0,autocommits=0,soft autocommits=0,optimizes=0,rollbacks=0,expungeDeletes=0,docsPending=0,adds=0,deletesById=0,deletesByQuery=0,errors=0,cumulative_adds=0,cumulative_deletesById=0,cumulative_deletesByQuery=0,cumulative_errors=0}
[junit4:junit4]   2> 72297 T91 oasc.SolrCore.decrefSolrCoreState Closing SolrCoreState
[junit4:junit4]   2> 72297 T91 oasu.DefaultSolrCoreState.closeIndexWriter SolrCoreState ref count has reached 0 - closing IndexWriter
[junit4:junit4]   2> 72297 T91 oasu.DefaultSolrCoreState.closeIndexWriter closing IndexWriter with IndexWriterCloser
[junit4:junit4]   2> 72297 T91 oasc.SolrCore.closeSearcher [collection1] Closing main searcher on request.
[junit4:junit4]   2> 72297 T91 oass.SolrDispatchFilter.init user.dir=C:\Users\JenkinsSlave\workspace\Lucene-Solr-4.x-Windows\solr\build\solr-solrj\test\J0
[junit4:junit4]   2> 72297 T91 oass.SolrDispatchFilter.init SolrDispatchFilter.init() done
[junit4:junit4]   2> 72297 T91 oascsi.HttpClientUtil.createClient Creating new http client, config:maxConnections=128&maxConnectionsPerHost=32&followRedirects=false
[junit4:junit4]   2> 72531 T91 oejs.Server.doStart jetty-8.1.7.v20120910
[junit4:junit4]   2> 72531 T91 oejs.AbstractConnector.doStart Started SelectChannelConnector@0.0.0.0:64385
[junit4:junit4]   2> 72531 T91 oasc.SolrResourceLoader.locateSolrHome JNDI not configured for solr (NoInitialContextEx)
[junit4:junit4]   2> 72531 T91 oasc.SolrResourceLoader.locateSolrHome using system property solr.solr.home: C:\Users\JenkinsSlave\workspace\Lucene-Solr-4.x-Windows\solr\build\solr-solrj\test\J0\.\solrtest-jetty5-1352453261857
[junit4:junit4]   2> 72531 T91 oasc.SolrResourceLoader.<init> new SolrResourceLoader for deduced Solr Home: 'C:\Users\JenkinsSlave\workspace\Lucene-Solr-4.x-Windows\solr\build\solr-solrj\test\J0\.\solrtest-jetty5-1352453261857\'
[junit4:junit4]   2> 72578 T91 oass.SolrDispatchFilter.init SolrDispatchFilter.init()
[junit4:junit4]   2> 72578 T91 oasc.SolrResourceLoader.locateSolrHome JNDI not configured for solr (NoInitialContextEx)
[junit4:junit4]   2> 72578 T91 oasc.SolrResourceLoader.locateSolrHome using system property solr.solr.home: C:\Users\JenkinsSlave\workspace\Lucene-Solr-4.x-Windows\solr\build\solr-solrj\test\J0\.\solrtest-jetty5-1352453261857
[junit4:junit4]   2> 72578 T91 oasc.CoreContainer$Initializer.initialize looking for solr.xml: C:\Users\JenkinsSlave\workspace\Lucene-Solr-4.x-Windows\solr\build\solr-solrj\test\J0\.\solrtest-jetty5-1352453261857\solr.xml
[junit4:junit4]   2> 72578 T91 oasc.CoreContainer.<init> New CoreContainer 3343105
[junit4:junit4]   2> 72578 T91 oasc.CoreContainer.load Loading CoreContainer using Solr Home: 'C:\Users\JenkinsSlave\workspace\Lucene-Solr-4.x-Windows\solr\build\solr-solrj\test\J0\.\solrtest-jetty5-1352453261857\'
[junit4:junit4]   2> 72578 T91 oasc.SolrResourceLoader.<init> new SolrResourceLoader for directory: 'C:\Users\JenkinsSlave\workspace\Lucene-Solr-4.x-Windows\solr\build\solr-solrj\test\J0\.\solrtest-jetty5-1352453261857\'
[junit4:junit4]   2> 72594 T91 oasc.CoreContainer.load Registering Log Listener
[junit4:junit4]   2> 72609 T91 oasc.CoreContainer.initZooKeeper Zookeeper client=127.0.0.1:64344/solr
[junit4:junit4]   2> 72609 T91 oaz.ZooKeeper.<init> Initiating client connection, connectString=127.0.0.1:64344/solr sessionTimeout=8000 watcher=org.apache.solr.common.cloud.ConnectionManager@1eee3fb
[junit4:junit4]   2> 72609 T176 oaz.ClientCnxn$SendThread.startConnect Opening socket connection to server /127.0.0.1:64344
[junit4:junit4]   2> 72609 T91 oascc.ConnectionManager.waitForConnected Waiting for client to connect to ZooKeeper
[junit4:junit4]   2> 72625 T176 oaz.ClientCnxn$SendThread.primeConnection Socket connection established to 127.0.0.1/127.0.0.1:64344, initiating session
[junit4:junit4]   2> 72625 T93 oazs.NIOServerCnxn$Factory.run Accepted socket connection from /127.0.0.1:64390
[junit4:junit4]   2> 72625 T93 oazs.NIOServerCnxn.readConnectRequest Client attempting to establish new session at /127.0.0.1:64390
[junit4:junit4]   2> 72625 T95 oazs.NIOServerCnxn.finishSessionInit Established session 0x13ae47df0640007 with negotiated timeout 8000 for client /127.0.0.1:64390
[junit4:junit4]   2> 72625 T176 oaz.ClientCnxn$SendThread.readConnectResult Session establishment complete on server 127.0.0.1/127.0.0.1:64344, sessionid = 0x13ae47df0640007, negotiated timeout = 8000
[junit4:junit4]   2> 72625 T177 oascc.ConnectionManager.process Watcher org.apache.solr.common.cloud.ConnectionManager@1eee3fb name:ZooKeeperConnection Watcher:127.0.0.1:64344/solr got event WatchedEvent state:SyncConnected type:None path:null path:null type:None
[junit4:junit4]   2> 72625 T91 oascc.ConnectionManager.waitForConnected Client is connected to ZooKeeper
[junit4:junit4]   2> 72625 T96 oazs.PrepRequestProcessor.pRequest Got user-level KeeperException when processing sessionid:0x13ae47df0640007 type:create cxid:0x1 zxid:0xfffffffffffffffe txntype:unknown reqpath:n/a Error Path:/solr/overseer Error:KeeperErrorCode = NodeExists for /solr/overseer
[junit4:junit4]   2> 72625 T96 oazs.PrepRequestProcessor.pRequest Got user-level KeeperException when processing sessionid:0x13ae47df0640007 type:create cxid:0x2 zxid:0xfffffffffffffffe txntype:unknown reqpath:n/a Error Path:/solr/overseer Error:KeeperErrorCode = NodeExists for /solr/overseer
[junit4:junit4]   2> 72640 T91 oasc.ZkController.createEphemeralLiveNode Register node as live in ZooKeeper:/live_nodes/127.0.0.1:64385_solr
[junit4:junit4]   2> 72640 T96 oazs.PrepRequestProcessor.pRequest Got user-level KeeperException when processing sessionid:0x13ae47df0640007 type:delete cxid:0x4 zxid:0xfffffffffffffffe txntype:unknown reqpath:n/a Error Path:/solr/live_nodes/127.0.0.1:64385_solr Error:KeeperErrorCode = NoNode for /solr/live_nodes/127.0.0.1:64385_solr
[junit4:junit4]   2> 72640 T91 oascc.SolrZkClient.makePath makePath: /live_nodes/127.0.0.1:64385_solr
[junit4:junit4]   2> 72640 T127 oascc.ZkStateReader$3.process Updating live nodes... (6)
[junit4:junit4]   2> 72640 T139 oascc.ZkStateReader$3.process Updating live nodes... (6)
[junit4:junit4]   2> 72640 T151 oascc.ZkStateReader$3.process Updating live nodes... (6)
[junit4:junit4]   2> 72640 T111 oascc.ZkStateReader$3.process Updating live nodes... (6)
[junit4:junit4]   2> 72640 T91 oashc.HttpShardHandlerFactory.getParameter Setting socketTimeout to: 0
[junit4:junit4]   2> 72640 T91 oashc.HttpShardHandlerFactory.getParameter Setting urlScheme to: http://
[junit4:junit4]   2> 72640 T91 oashc.HttpShardHandlerFactory.getParameter Setting connTimeout to: 0
[junit4:junit4]   2> 72640 T91 oashc.HttpShardHandlerFactory.getParameter Setting maxConnectionsPerHost to: 20
[junit4:junit4]   2> 72640 T91 oashc.HttpShardHandlerFactory.getParameter Setting corePoolSize to: 0
[junit4:junit4]   2> 72640 T91 oashc.HttpShardHandlerFactory.getParameter Setting maximumPoolSize to: 2147483647
[junit4:junit4]   2> 72640 T91 oashc.HttpShardHandlerFactory.getParameter Setting maxThreadIdleTime to: 5
[junit4:junit4]   2> 72656 T91 oashc.HttpShardHandlerFactory.getParameter Setting sizeOfQueue to: -1
[junit4:junit4]   2> 72656 T91 oashc.HttpShardHandlerFactory.getParameter Setting fairnessPolicy to: false
[junit4:junit4]   2> 72656 T91 oascsi.HttpClientUtil.createClient Creating new http client, config:maxConnectionsPerHost=20&maxConnections=10000&socketTimeout=0&connTimeout=0&retry=false
[junit4:junit4]   2> 72656 T165 oascc.ZkStateReader$3.process Updating live nodes... (6)
[junit4:junit4]   2> 72672 T91 oascc.ZkStateReader.createClusterStateWatchersAndUpdate Updating cluster state from ZooKeeper... 
[junit4:junit4]   2> 72672 T91 oasc.CoreContainer.create Creating SolrCore 'collection1' using instanceDir: C:\Users\JenkinsSlave\workspace\Lucene-Solr-4.x-Windows\solr\build\solr-solrj\test\J0\.\solrtest-jetty5-1352453261857\collection1
[junit4:junit4]   2> 72672 T91 oasc.ZkController.createCollectionZkNode Check for collection zkNode:collection1
[junit4:junit4]   2> 72672 T91 oasc.ZkController.createCollectionZkNode Collection zkNode exists
[junit4:junit4]   2> 72672 T91 oasc.ZkController.readConfigName Load collection config from:/collections/collection1
[junit4:junit4]   2> 72672 T91 oasc.SolrResourceLoader.<init> new SolrResourceLoader for directory: 'C:\Users\JenkinsSlave\workspace\Lucene-Solr-4.x-Windows\solr\build\solr-solrj\test\J0\.\solrtest-jetty5-1352453261857\collection1\'
[junit4:junit4]   2> 72719 T91 oasc.SolrConfig.<init> Using Lucene MatchVersion: LUCENE_41
[junit4:junit4]   2> 72781 T91 oasc.SolrConfig.<init> Loaded SolrConfig: solrconfig.xml
[junit4:junit4]   2> 72781 T91 oass.IndexSchema.readSchema Reading Solr Schema
[junit4:junit4]   2> 72797 T91 oass.IndexSchema.readSchema Schema name=test
[junit4:junit4]   2> 73422 T91 oass.IndexSchema.readSchema default search field in schema is text
[junit4:junit4]   2> 73422 T91 oass.IndexSchema.readSchema unique key field: id
[junit4:junit4]   2> 73422 T91 oass.IndexSchema.readSchema WARNING Field text is not multivalued and destination for multiple copyFields (2)
[junit4:junit4]   2> 73422 T91 oass.IndexSchema.readSchema WARNING Field lowerfilt1and2 is not multivalued and destination for multiple copyFields (2)
[junit4:junit4]   2> 73422 T91 oasc.SolrCore.<init> [collection1] Opening new SolrCore at C:\Users\JenkinsSlave\workspace\Lucene-Solr-4.x-Windows\solr\build\solr-solrj\test\J0\.\solrtest-jetty5-1352453261857\collection1\, dataDir=.\org.apache.solr.client.solrj.impl.CloudSolrServerTest-1352453189560/jetty5\
[junit4:junit4]   2> 73422 T91 oasc.SolrCore.<init> JMX monitoring not detected for core: collection1
[junit4:junit4]   2> 73437 T91 oasc.SolrCore.getNewIndexDir New index directory detected: old=null new=.\org.apache.solr.client.solrj.impl.CloudSolrServerTest-1352453189560/jetty5\index/
[junit4:junit4]   2> 73437 T91 oasc.SolrCore.initIndex WARNING [collection1] Solr index directory '.\org.apache.solr.client.solrj.impl.CloudSolrServerTest-1352453189560\jetty5\index' doesn't exist. Creating new index...
[junit4:junit4]   2> 73437 T91 oasc.CachingDirectoryFactory.get return new directory for C:\Users\JenkinsSlave\workspace\Lucene-Solr-4.x-Windows\solr\build\solr-solrj\test\J0\.\org.apache.solr.client.solrj.impl.CloudSolrServerTest-1352453189560\jetty5\index forceNew:false
[junit4:junit4]   2> 73437 T91 oasc.SolrDeletionPolicy.onCommit SolrDeletionPolicy.onCommit: commits:num=1
[junit4:junit4]   2> 		commit{dir=C:\Users\JenkinsSlave\workspace\Lucene-Solr-4.x-Windows\solr\build\solr-solrj\test\J0\org.apache.solr.client.solrj.impl.CloudSolrServerTest-1352453189560\jetty5\index,segFN=segments_1,generation=1,filenames=[segments_1]
[junit4:junit4]   2> 73453 T91 oasc.SolrDeletionPolicy.updateCommits newest commit = 1
[junit4:junit4]   2> 73453 T91 oasc.RequestHandlers.initHandlersFromConfig created /get: solr.RealTimeGetHandler
[junit4:junit4]   2> 73453 T91 oasc.RequestHandlers.initHandlersFromConfig adding lazy requestHandler: solr.ReplicationHandler
[junit4:junit4]   2> 73453 T91 oasc.RequestHandlers.initHandlersFromConfig created /replication: solr.ReplicationHandler
[junit4:junit4]   2> 73453 T91 oasc.RequestHandlers.initHandlersFromConfig created standard: solr.StandardRequestHandler
[junit4:junit4]   2> 73453 T91 oasc.RequestHandlers.initHandlersFromConfig created /update: solr.UpdateRequestHandler
[junit4:junit4]   2> 73453 T91 oasc.RequestHandlers.initHandlersFromConfig created /admin/: org.apache.solr.handler.admin.AdminHandlers
[junit4:junit4]   2> 73469 T91 oashl.XMLLoader.init xsltCacheLifetimeSeconds=60
[junit4:junit4]   2> 73484 T91 oass.SolrIndexSearcher.<init> Opening Searcher@438d57 main
[junit4:junit4]   2> 73484 T91 oasu.CommitTracker.<init> Hard AutoCommit: disabled
[junit4:junit4]   2> 73484 T91 oasu.CommitTracker.<init> Soft AutoCommit: disabled
[junit4:junit4]   2> 73484 T178 oasc.SolrCore.registerSearcher [collection1] Registered new searcher Searcher@438d57 main{StandardDirectoryReader(segments_1:1)}
[junit4:junit4]   2> 73484 T91 oasc.ZkController.publish numShards not found on descriptor - reading it from system property
[junit4:junit4]   2> 73656 T112 oascc.ZkStateReader.updateClusterState Updating cloud state from ZooKeeper... 
[junit4:junit4]   2> 73656 T112 oasc.Overseer$ClusterStateUpdater.updateState Update state numShards=2 message={
[junit4:junit4]   2> 	  "operation":"state",
[junit4:junit4]   2> 	  "numShards":"2",
[junit4:junit4]   2> 	  "shard":null,
[junit4:junit4]   2> 	  "roles":null,
[junit4:junit4]   2> 	  "state":"down",
[junit4:junit4]   2> 	  "core":"collection1",
[junit4:junit4]   2> 	  "collection":"collection1",
[junit4:junit4]   2> 	  "node_name":"127.0.0.1:64385_solr",
[junit4:junit4]   2> 	  "base_url":"http://127.0.0.1:64385/solr"}
[junit4:junit4]   2> 73703 T139 oascc.ZkStateReader$2.process A cluster state change has occurred - updating... (6)
[junit4:junit4]   2> 73703 T127 oascc.ZkStateReader$2.process A cluster state change has occurred - updating... (6)
[junit4:junit4]   2> 73703 T111 oascc.ZkStateReader$2.process A cluster state change has occurred - updating... (6)
[junit4:junit4]   2> 73703 T151 oascc.ZkStateReader$2.process A cluster state change has occurred - updating... (6)
[junit4:junit4]   2> 73703 T177 oascc.ZkStateReader$2.process A cluster state change has occurred - updating... (6)
[junit4:junit4]   2> 73984 T91 oasc.CoreContainer.register registering core: collection1
[junit4:junit4]   2> 73984 T91 oasc.ZkController.register Register shard - core:collection1 address:http://127.0.0.1:64385/solr shardId:shard1
[junit4:junit4]   2> 73984 T91 oasc.ZkController.register We are http://127.0.0.1:64385/solr/collection1/ and leader is http://127.0.0.1:64357/solr/collection1/
[junit4:junit4]   2> 73984 T91 oasc.ZkController.register No LogReplay needed for core=collection1 baseURL=http://127.0.0.1:64385/solr
[junit4:junit4]   2> 73984 T91 oasc.ZkController.checkRecovery Core needs to recover:collection1
[junit4:junit4]   2> 73984 T91 oasu.DefaultSolrCoreState.doRecovery Running recovery - first canceling any ongoing recovery
[junit4:junit4]   2> ASYNC  NEW_CORE C9 name=collection1 org.apache.solr.core.SolrCore@1334b1a url=http://127.0.0.1:64385/solr/collection1 node=127.0.0.1:64385_solr
[junit4:junit4]   2> 73984 T179 C9 P64385 oasc.RecoveryStrategy.run Starting recovery process.  core=collection1 recoveringAfterStartup=true
[junit4:junit4]   2> 73984 T179 C9 P64385 oasc.RecoveryStrategy.doRecovery ###### startupVersions=[]
[junit4:junit4]   2> 73984 T179 C9 P64385 oasc.ZkController.publish numShards not found on descriptor - reading it from system property
[junit4:junit4]   2> 73984 T91 oascc.ZkStateReader.updateClusterState Updating cloud state from ZooKeeper... 
[junit4:junit4]   2> 74000 T179 C9 P64385 oasc.RecoveryStrategy.doRecovery Attempting to PeerSync from http://127.0.0.1:64357/solr/collection1/ core=collection1 - recoveringAfterStartup=true
[junit4:junit4]   2> 74000 T179 C9 P64385 oasu.PeerSync.sync PeerSync: core=collection1 url=http://127.0.0.1:64385/solr START replicas=[http://127.0.0.1:64357/solr/collection1/] nUpdates=100
[junit4:junit4]   2> 74000 T179 C9 P64385 oasu.PeerSync.sync WARNING no frame of reference to tell of we've missed updates
[junit4:junit4]   2> 74000 T91 oass.SolrDispatchFilter.init user.dir=C:\Users\JenkinsSlave\workspace\Lucene-Solr-4.x-Windows\solr\build\solr-solrj\test\J0
[junit4:junit4]   2> 74000 T179 C9 P64385 oasc.RecoveryStrategy.doRecovery PeerSync Recovery was not successful - trying replication. core=collection1
[junit4:junit4]   2> 74000 T91 oass.SolrDispatchFilter.init SolrDispatchFilter.init() done
[junit4:junit4]   2> 74000 T179 C9 P64385 oasc.RecoveryStrategy.doRecovery Starting Replication Recovery. core=collection1
[junit4:junit4]   2> 74000 T91 oascsi.HttpClientUtil.createClient Creating new http client, config:maxConnections=128&maxConnectionsPerHost=32&followRedirects=false
[junit4:junit4]   2> 74000 T179 C9 P64385 oascsi.HttpClientUtil.createClient Creating new http client, config:maxConnections=128&maxConnectionsPerHost=32&followRedirects=false
[junit4:junit4]   2> 74015 T123 C8 P64357 REQ /get {distrib=false&qt=/get&wt=javabin&version=2&getVersions=100} status=0 QTime=0 
[junit4:junit4]   2> 74234 T112 oascc.ZkStateReader.updateClusterState Updating cloud state from ZooKeeper... 
[junit4:junit4]   2> 74234 T112 oasc.Overseer$ClusterStateUpdater.updateState Update state numShards=2 message={
[junit4:junit4]   2> 	  "operation":"state",
[junit4:junit4]   2> 	  "numShards":"2",
[junit4:junit4]   2> 	  "shard":"shard1",
[junit4:junit4]   2> 	  "roles":null,
[junit4:junit4]   2> 	  "state":"recovering",
[junit4:junit4]   2> 	  "core":"collection1",
[junit4:junit4]   2> 	  "collection":"collection1",
[junit4:junit4]   2> 	  "node_name":"127.0.0.1:64385_solr",
[junit4:junit4]   2> 	  "base_url":"http://127.0.0.1:64385/solr"}
[junit4:junit4]   2> 74281 T139 oascc.ZkStateReader$2.process A cluster state change has occurred - updating... (6)
[junit4:junit4]   2> 74281 T127 oascc.ZkStateReader$2.process A cluster state change has occurred - updating... (6)
[junit4:junit4]   2> 74281 T111 oascc.ZkStateReader$2.process A cluster state change has occurred - updating... (6)
[junit4:junit4]   2> 74281 T177 oascc.ZkStateReader$2.process A cluster state change has occurred - updating... (6)
[junit4:junit4]   2> 74281 T151 oascc.ZkStateReader$2.process A cluster state change has occurred - updating... (6)
[junit4:junit4]   2> 74281 T91 oejs.Server.doStart jetty-8.1.7.v20120910
[junit4:junit4]   2> 74281 T91 oejs.AbstractConnector.doStart Started SelectChannelConnector@0.0.0.0:64392
[junit4:junit4]   2> 74297 T91 oasc.SolrResourceLoader.locateSolrHome JNDI not configured for solr (NoInitialContextEx)
[junit4:junit4]   2> 74297 T91 oasc.SolrResourceLoader.locateSolrHome using system property solr.solr.home: C:\Users\JenkinsSlave\workspace\Lucene-Solr-4.x-Windows\solr\build\solr-solrj\test\J0\.\solrtest-jetty6-1352453263560
[junit4:junit4]   2> 74297 T91 oasc.SolrResourceLoader.<init> new SolrResourceLoader for deduced Solr Home: 'C:\Users\JenkinsSlave\workspace\Lucene-Solr-4.x-Windows\solr\build\solr-solrj\test\J0\.\solrtest-jetty6-1352453263560\'
[junit4:junit4]   2> 74344 T91 oass.SolrDispatchFilter.init SolrDispatchFilter.init()
[junit4:junit4]   2> 74344 T91 oasc.SolrResourceLoader.locateSolrHome JNDI not configured for solr (NoInitialContextEx)
[junit4:junit4]   2> 74344 T91 oasc.SolrResourceLoader.locateSolrHome using system property solr.solr.home: C:\Users\JenkinsSlave\workspace\Lucene-Solr-4.x-Windows\solr\build\solr-solrj\test\J0\.\solrtest-jetty6-1352453263560
[junit4:junit4]   2> 74344 T91 oasc.CoreContainer$Initializer.initialize looking for solr.xml: C:\Users\JenkinsSlave\workspace\Lucene-Solr-4.x-Windows\solr\build\solr-solrj\test\J0\.\solrtest-jetty6-1352453263560\solr.xml
[junit4:junit4]   2> 74344 T91 oasc.CoreContainer.<init> New CoreContainer 27262319
[junit4:junit4]   2> 74344 T91 oasc.CoreContainer.load Loading CoreContainer using Solr Home: 'C:\Users\JenkinsSlave\workspace\Lucene-Solr-4.x-Windows\solr\build\solr-solrj\test\J0\.\solrtest-jetty6-1352453263560\'
[junit4:junit4]   2> 74344 T91 oasc.SolrResourceLoader.<init> new SolrResourceLoader for directory: 'C:\Users\JenkinsSlave\workspace\Lucene-Solr-4.x-Windows\solr\build\solr-solrj\test\J0\.\solrtest-jetty6-1352453263560\'
[junit4:junit4]   2> 74375 T91 oasc.CoreContainer.load Registering Log Listener
[junit4:junit4]   2> 74406 T91 oasc.CoreContainer.initZooKeeper Zookeeper client=127.0.0.1:64344/solr
[junit4:junit4]   2> 74406 T91 oaz.ZooKeeper.<init> Initiating client connection, connectString=127.0.0.1:64344/solr sessionTimeout=8000 watcher=org.apache.solr.common.cloud.ConnectionManager@88cf9e
[junit4:junit4]   2> 74406 T190 oaz.ClientCnxn$SendThread.startConnect Opening socket connection to server /127.0.0.1:64344
[junit4:junit4]   2> 74406 T91 oascc.ConnectionManager.waitForConnected Waiting for client to connect to ZooKeeper
[junit4:junit4]   2> 74422 T190 oaz.ClientCnxn$SendThread.primeConnection Socket connection established to 127.0.0.1/127.0.0.1:64344, initiating session
[junit4:junit4]   2> 74422 T93 oazs.NIOServerCnxn$Factory.run Accepted socket connection from /127.0.0.1:64397
[junit4:junit4]   2> 74422 T93 oazs.NIOServerCnxn.readConnectRequest Client attempting to establish new session at /127.0.0.1:64397
[junit4:junit4]   2> 74422 T95 oazs.NIOServerCnxn.finishSessionInit Established session 0x13ae47df0640008 with negotiated timeout 8000 for client /127.0.0.1:64397
[junit4:junit4]   2> 74422 T190 oaz.ClientCnxn$SendThread.readConnectResult Session establishment complete on server 127.0.0.1/127.0.0.1:64344, sessionid = 0x13ae47df0640008, negotiated timeout = 8000
[junit4:junit4]   2> 74422 T191 oascc.ConnectionManager.process Watcher org.apache.solr.common.cloud.ConnectionManager@88cf9e name:ZooKeeperConnection Watcher:127.0.0.1:64344/solr got event WatchedEvent state:SyncConnected type:None path:null path:null type:None
[junit4:junit4]   2> 74422 T91 oascc.ConnectionManager.waitForConnected Client is connected to ZooKeeper
[junit4:junit4]   2> 74422 T96 oazs.PrepRequestProcessor.pRequest Got user-level KeeperException when processing sessionid:0x13ae47df0640008 type:create cxid:0x1 zxid:0xfffffffffffffffe txntype:unknown reqpath:n/a Error Path:/solr/overseer Error:KeeperErrorCode = NodeExists for /solr/overseer
[junit4:junit4]   2> 74422 T96 oazs.PrepRequestProcessor.pRequest Got user-level KeeperException when processing sessionid:0x13ae47df0640008 type:create cxid:0x2 zxid:0xfffffffffffffffe txntype:unknown reqpath:n/a Error Path:/solr/overseer Error:KeeperErrorCode = NodeExists for /solr/overseer
[junit4:junit4]   2> 74437 T91 oasc.ZkController.createEphemeralLiveNode Register node as live in ZooKeeper:/live_nodes/127.0.0.1:64392_solr
[junit4:junit4]   2> 74437 T96 oazs.PrepRequestProcessor.pRequest Got user-level KeeperException when processing sessionid:0x13ae47df0640008 type:delete cxid:0x4 zxid:0xfffffffffffffffe txntype:unknown reqpath:n/a Error Path:/solr/live_nodes/127.0.0.1:64392_solr Error:KeeperErrorCode = NoNode for /solr/live_nodes/127.0.0.1:64392_solr
[junit4:junit4]   2> 74437 T91 oascc.SolrZkClient.makePath makePath: /live_nodes/127.0.0.1:64392_solr
[junit4:junit4]   2> 74453 T139 oascc.ZkStateReader$3.process Updating live nodes... (7)
[junit4:junit4]   2> 74453 T127 oascc.ZkStateReader$3.process Updating live nodes... (7)
[junit4:junit4]   2> 74453 T165 oascc.ZkStateReader$3.process Updating live nodes... (7)
[junit4:junit4]   2> 74453 T177 oascc.ZkStateReader$3.process Updating live nodes... (7)
[junit4:junit4]   2> 74453 T111 oascc.ZkStateReader$3.process Updating live nodes... (7)
[junit4:junit4]   2> 74453 T151 oascc.ZkStateReader$3.process Updating live nodes... (7)
[junit4:junit4]   2> 74453 T91 oashc.HttpShardHandlerFactory.getParameter Setting socketTimeout to: 0
[junit4:junit4]   2> 74453 T91 oashc.HttpShardHandlerFactory.getParameter Setting urlScheme to: http://
[junit4:junit4]   2> 74453 T91 oashc.HttpShardHandlerFactory.getParameter Setting connTimeout to: 0
[junit4:junit4]   2> 74453 T91 oashc.HttpShardHandlerFactory.getParameter Setting maxConnectionsPerHost to: 20
[junit4:junit4]   2> 74453 T91 oashc.HttpShardHandlerFactory.getParameter Setting corePoolSize to: 0
[junit4:junit4]   2> 74453 T91 oashc.HttpShardHandlerFactory.getParameter Setting maximumPoolSize to: 2147483647
[junit4:junit4]   2> 74453 T91 oashc.HttpShardHandlerFactory.getParameter Setting maxThreadIdleTime to: 5
[junit4:junit4]   2> 74453 T91 oashc.HttpShardHandlerFactory.getParameter Setting sizeOfQueue to: -1
[junit4:junit4]   2> 74453 T91 oashc.HttpShardHandlerFactory.getParameter Setting fairnessPolicy to: false
[junit4:junit4]   2> 74453 T91 oascsi.HttpClientUtil.createClient Creating new http client, config:maxConnectionsPerHost=20&maxConnections=10000&socketTimeout=0&connTimeout=0&retry=false
[junit4:junit4]   2> 74484 T91 oascc.ZkStateReader.createClusterStateWatchersAndUpdate Updating cluster state from ZooKeeper... 
[junit4:junit4]   2> 74484 T91 oasc.CoreContainer.create Creating SolrCore 'collection1' using instanceDir: C:\Users\JenkinsSlave\workspace\Lucene-Solr-4.x-Windows\solr\build\solr-solrj\test\J0\.\solrtest-jetty6-1352453263560\collection1
[junit4:junit4]   2> 74484 T91 oasc.ZkController.createCollectionZkNode Check for collection zkNode:collection1
[junit4:junit4]   2> 74484 T91 oasc.ZkController.createCollectionZkNode Collection zkNode exists
[junit4:junit4]   2> 74484 T91 oasc.ZkController.readConfigName Load collection config from:/collections/collection1
[junit4:junit4]   2> 74500 T91 oasc.SolrResourceLoader.<init> new SolrResourceLoader for directory: 'C:\Users\JenkinsSlave\workspace\Lucene-Solr-4.x-Windows\solr\build\solr-solrj\test\J0\.\solrtest-jetty6-1352453263560\collection1\'
[junit4:junit4]   2> 74547 T91 oasc.SolrConfig.<init> Using Lucene MatchVersion: LUCENE_41
[junit4:junit4]   2> 74609 T91 oasc.SolrConfig.<init> Loaded SolrConfig: solrconfig.xml
[junit4:junit4]   2> 74609 T91 oass.IndexSchema.readSchema Reading Solr Schema
[junit4:junit4]   2> 74625 T91 oass.IndexSchema.readSchema Schema name=test
[junit4:junit4]   2> 75359 T91 oass.IndexSchema.readSchema default search field in schema is text
[junit4:junit4]   2> 75375 T91 oass.IndexSchema.readSchema unique key field: id
[junit4:junit4]   2> 75375 T91 oass.IndexSchema.readSchema WARNING Field text is not multivalued and destination for multiple copyFields (2)
[junit4:junit4]   2> 75375 T91 oass.IndexSchema.readSchema WARNING Field lowerfilt1and2 is not multivalued and destination for multiple copyFields (2)
[junit4:junit4]   2> 75375 T91 oasc.SolrCore.<init> [collection1] Opening new SolrCore at C:\Users\JenkinsSlave\workspace\Lucene-Solr-4.x-Windows\solr\build\solr-solrj\test\J0\.\solrtest-jetty6-1352453263560\collection1\, dataDir=.\org.apache.solr.client.solrj.impl.CloudSolrServerTest-1352453189560/jetty6\
[junit4:junit4]   2> 75375 T91 oasc.SolrCore.<init> JMX monitoring not detected for core: collection1
[junit4:junit4]   2> 75375 T91 oasc.SolrCore.getNewIndexDir New index directory detected: old=null new=.\org.apache.solr.client.solrj.impl.CloudSolrServerTest-1352453189560/jetty6\index/
[junit4:junit4]   2> 75375 T91 oasc.SolrCore.initIndex WARNING [collection1] Solr index directory '.\org.apache.solr.client.solrj.impl.CloudSolrServerTest-1352453189560\jetty6\index' doesn't exist. Creating new index...
[junit4:junit4]   2> 75375 T91 oasc.CachingDirectoryFactory.get return new directory for C:\Users\JenkinsSlave\workspace\Lucene-Solr-4.x-Windows\solr\build\solr-solrj\test\J0\.\org.apache.solr.client.solrj.impl.CloudSolrServerTest-1352453189560\jetty6\index forceNew:false
[junit4:junit4]   2> 75406 T91 oasc.SolrDeletionPolicy.onCommit SolrDeletionPolicy.onCommit: commits:num=1
[junit4:junit4]   2> 		commit{dir=C:\Users\JenkinsSlave\workspace\Lucene-Solr-4.x-Windows\solr\build\solr-solrj\test\J0\org.apache.solr.client.solrj.impl.CloudSolrServerTest-1352453189560\jetty6\index,segFN=segments_1,generation=1,filenames=[segments_1]
[junit4:junit4]   2> 75406 T91 oasc.SolrDeletionPolicy.updateCommits newest commit = 1
[junit4:junit4]   2> 75422 T91 oasc.RequestHandlers.initHandlersFromConfig created /get: solr.RealTimeGetHandler
[junit4:junit4]   2> 75422 T91 oasc.RequestHandlers.initHandlersFromConfig adding lazy requestHandler: solr.ReplicationHandler
[junit4:junit4]   2> 75422 T91 oasc.RequestHandlers.initHandlersFromConfig created /replication: solr.ReplicationHandler
[junit4:junit4]   2> 75422 T91 oasc.RequestHandlers.initHandlersFromConfig created standard: solr.StandardRequestHandler
[junit4:junit4]   2> 75422 T91 oasc.RequestHandlers.initHandlersFromConfig created /update: solr.UpdateRequestHandler
[junit4:junit4]   2> 75422 T91 oasc.RequestHandlers.initHandlersFromConfig created /admin/: org.apache.solr.handler.admin.AdminHandlers
[junit4:junit4]   2> 75437 T91 oashl.XMLLoader.init xsltCacheLifetimeSeconds=60
[junit4:junit4]   2> 75437 T91 oass.SolrIndexSearcher.<init> Opening Searcher@67211b main
[junit4:junit4]   2> 75453 T91 oasu.CommitTracker.<init> Hard AutoCommit: disabled
[junit4:junit4]   2> 75453 T91 oasu.CommitTracker.<init> Soft AutoCommit: disabled
[junit4:junit4]   2> 75453 T192 oasc.SolrCore.registerSearcher [collection1] Registered new searcher Searcher@67211b main{StandardDirectoryReader(segments_1:1)}
[junit4:junit4]   2> 75453 T91 oasc.ZkController.publish numShards not found on descriptor - reading it from system property
[junit4:junit4]   2> 75797 T112 oascc.ZkStateReader.updateClusterState Updating cloud state from ZooKeeper... 
[junit4:junit4]   2> 75797 T112 oasc.Overseer$ClusterStateUpdater.updateState Update state numShards=2 message={
[junit4:junit4]   2> 	  "operation":"state",
[junit4:junit4]   2> 	  "numShards":"2",
[junit4:junit4]   2> 	  "shard":null,
[junit4:junit4]   2> 	  "roles":null,
[junit4:junit4]   2> 	  "state":"down",
[junit4:junit4]   2> 	  "core":"collection1",
[junit4:junit4]   2> 	  "collection":"collection1",
[junit4:junit4]   2> 	  "node_name":"127.0.0.1:64392_solr",
[junit4:junit4]   2> 	  "base_url":"http://127.0.0.1:64392/solr"}
[junit4:junit4]   2> 75812 T139 oascc.ZkStateReader$2.process A cluster state change has occurred - updating... (7)
[junit4:junit4]   2> 75812 T127 oascc.ZkStateReader$2.process A cluster state change has occurred - updating... (7)
[junit4:junit4]   2> 75812 T191 oascc.ZkStateReader$2.process A cluster state change has occurred - updating... (7)
[junit4:junit4]   2> 75812 T151 oascc.ZkStateReader$2.process A cluster state change has occurred - updating... (7)
[junit4:junit4]   2> 75812 T111 oascc.ZkStateReader$2.process A cluster state change has occurred - updating... (7)
[junit4:junit4]   2> 75812 T177 oascc.ZkStateReader$2.process A cluster state change has occurred - updating... (7)
[junit4:junit4]   2> 75969 T91 oasc.CoreContainer.register registering core: collection1
[junit4:junit4]   2> 75969 T91 oasc.ZkController.register Register shard - core:collection1 address:http://127.0.0.1:64392/solr shardId:shard2
[junit4:junit4]   2> 75969 T91 oasc.ZkController.register We are http://127.0.0.1:64392/solr/collection1/ and leader is http://127.0.0.1:64363/solr/collection1/
[junit4:junit4]   2> 75969 T91 oasc.ZkController.register No LogReplay needed for core=collection1 baseURL=http://127.0.0.1:64392/solr
[junit4:junit4]   2> 75969 T91 oasc.ZkController.checkRecovery Core needs to recover:collection1
[junit4:junit4]   2> 75969 T91 oasu.DefaultSolrCoreState.doRecovery Running recovery - first canceling any ongoing recovery
[junit4:junit4]   2> ASYNC  NEW_CORE C10 name=collection1 org.apache.solr.core.SolrCore@87c801 url=http://127.0.0.1:64392/solr/collection1 node=127.0.0.1:64392_solr
[junit4:junit4]   2> 75969 T193 C10 P64392 oasc.RecoveryStrategy.run Starting recovery process.  core=collection1 recoveringAfterStartup=true
[junit4:junit4]   2> 75969 T193 C10 P64392 oasc.RecoveryStrategy.doRecovery ###### startupVersions=[]
[junit4:junit4]   2> 75969 T91 oascc.ZkStateReader.updateClusterState Updating cloud state from ZooKeeper... 
[junit4:junit4]   2> 75969 T193 C10 P64392 oasc.ZkController.publish numShards not found on descriptor - reading it from system property
[junit4:junit4]   2> 75969 T91 oass.SolrDispatchFilter.init user.dir=C:\Users\JenkinsSlave\workspace\Lucene-Solr-4.x-Windows\solr\build\solr-solrj\test\J0
[junit4:junit4]   2> 75969 T91 oass.SolrDispatchFilter.init SolrDispatchFilter.init() done
[junit4:junit4]   2> 75969 T91 oascsi.HttpClientUtil.createClient Creating new http client, config:maxConnections=128&maxConnectionsPerHost=32&followRedirects=false
[junit4:junit4]   2> 75984 T91 oaz.ZooKeeper.<init> Initiating client connection, connectString=127.0.0.1:64344/solr sessionTimeout=10000 watcher=org.apache.solr.common.cloud.ConnectionManager@17ef0a7
[junit4:junit4]   2> 75984 T91 oascc.ConnectionManager.waitForConnected Waiting for client to connect to ZooKeeper
[junit4:junit4]   2> 75984 T194 oaz.ClientCnxn$SendThread.startConnect Opening socket connection to server /127.0.0.1:64344
[junit4:junit4]   2> 75984 T193 C10 P64392 oasc.RecoveryStrategy.doRecovery Attempting to PeerSync from http://127.0.0.1:64363/solr/collection1/ core=collection1 - recoveringAfterStartup=true
[junit4:junit4]   2> 75984 T93 oazs.NIOServerCnxn$Factory.run Accepted socket connection from /127.0.0.1:64400
[junit4:junit4]   2> 75984 T194 oaz.ClientCnxn$SendThread.primeConnection Socket connection established to 127.0.0.1/127.0.0.1:64344, initiating session
[junit4:junit4]   2> 75984 T193 C10 P64392 oasu.PeerSync.sync PeerSync: core=collection1 url=http://127.0.0.1:64392/solr START replicas=[http://127.0.0.1:64363/solr/collection1/] nUpdates=100
[junit4:junit4]   2> 75984 T93 oazs.NIOServerCnxn.readConnectRequest Client attempting to establish new session at /127.0.0.1:64400
[junit4:junit4]   2> 75984 T193 C10 P64392 oasu.PeerSync.sync WARNING no frame of reference to tell of we've missed updates
[junit4:junit4]   2> 75984 T193 C10 P64392 oasc.RecoveryStrategy.doRecovery PeerSync Recovery was not successful - trying replication. core=collection1
[junit4:junit4]   2> 76000 T193 C10 P64392 oasc.RecoveryStrategy.doRecovery Starting Replication Recovery. core=collection1
[junit4:junit4]   2> 76000 T194 oaz.ClientCnxn$SendThread.readConnectResult Session establishment complete on server 127.0.0.1/127.0.0.1:64344, sessionid = 0x13ae47df0640009, negotiated timeout = 10000
[junit4:junit4]   2> 76000 T193 C10 P64392 oascsi.HttpClientUtil.createClient Creating new http client, config:maxConnections=128&maxConnectionsPerHost=32&followRedirects=false
[junit4:junit4]   2> 76000 T95 oazs.NIOServerCnxn.finishSessionInit Established session 0x13ae47df0640009 with negotiated timeout 10000 for client /127.0.0.1:64400
[junit4:junit4]   2> 76000 T195 oascc.ConnectionManager.process Watcher org.apache.solr.common.cloud.ConnectionManager@17ef0a7 name:ZooKeeperConnection Watcher:127.0.0.1:64344/solr got event WatchedEvent state:SyncConnected type:None path:null path:null type:None
[junit4:junit4]   2> 76000 T91 oascc.ConnectionManager.waitForConnected Client is connected to ZooKeeper
[junit4:junit4]   2> ASYNC  NEW_CORE C11 name=collection1 org.apache.solr.core.SolrCore@169bc15 url=http://127.0.0.1:64363/solr/collection1 node=127.0.0.1:64363_solr
[junit4:junit4]   2> 76000 T133 C11 P64363 REQ /get {distrib=false&qt=/get&wt=javabin&version=2&getVersions=100} status=0 QTime=0 
[junit4:junit4]   2> 76000 T91 oascc.ZkStateReader.createClusterStateWatchersAndUpdate Updating cluster state from ZooKeeper... 
[junit4:junit4]   2> 76015 T91 oasc.ChaosMonkey.monkeyLog monkey: init - expire sessions:true cause connection loss:true
[junit4:junit4]   2> 76015 T91 oascsi.HttpClientUtil.createClient Creating new http client, config:
[junit4:junit4]   2> 76015 T91 oascc.ZkStateReader.updateClusterState Updating cloud state from ZooKeeper... 
[junit4:junit4]   2> 76015 T91 oasc.AbstractFullDistribZkTestBase.waitForThingsToLevelOut Wait for recoveries to finish - wait 30 for each attempt
[junit4:junit4]   2> 76015 T91 oasc.AbstractDistribZkTestBase.waitForRecoveriesToFinish Wait for recoveries to finish - collection: collection1 failOnTimeout:true timeout (sec):30
[junit4:junit4]   2> 76015 T91 oascc.ZkStateReader.updateClusterState Updating cloud state from ZooKeeper... 
[junit4:junit4]   2> 76312 T112 oascc.ZkStateReader.updateClusterState Updating cloud state from ZooKeeper... 
[junit4:junit4]   2> 76312 T112 oasc.Overseer$ClusterStateUpdater.updateState Update state numShards=2 message={
[junit4:junit4]   2> 	  "operation":"state",
[junit4:junit4]   2> 	  "numShards":"2",
[junit4:junit4]   2> 	  "shard":"shard2",
[junit4:junit4]   2> 	  "roles":null,
[junit4:junit4]   2> 	  "state":"recovering",
[junit4:junit4]   2> 	  "core":"collection1",
[junit4:junit4]   2> 	  "collection":"collection1",
[junit4:junit4]   2> 	  "node_name":"127.0.0.1:64392_solr",
[junit4:junit4]   2> 	  "base_url":"http://127.0.0.1:64392/solr"}
[junit4:junit4]   2> 76328 T139 oascc.ZkStateReader$2.process A cluster state change has occurred - updating... (7)
[junit4:junit4]   2> 76328 T177 oascc.ZkStateReader$2.process A cluster state change has occurred - updating... (7)
[junit4:junit4]   2> 76328 T191 oascc.ZkStateReader$2.process A cluster state change has occurred - updating... (7)
[junit4:junit4]   2> 76328 T111 oascc.ZkStateReader$2.process A cluster state change has occurred - updating... (7)
[junit4:junit4]   2> 76328 T151 oascc.ZkStateReader$2.process A cluster state change has occurred - updating... (7)
[junit4:junit4]   2> 76328 T195 oascc.ZkStateReader$2.process A cluster state change has occurred - updating... (7)
[junit4:junit4]   2> 76328 T127 oascc.ZkStateReader$2.process A cluster state change has occurred - updating... (7)
[junit4:junit4]   2>  C9_STATE=coll:collection1 core:collection1 props:{shard=shard1, roles=null, state=recovering, core=collection1, collection=collection1, node_name=127.0.0.1:64385_solr, base_url=http://127.0.0.1:64385/solr}
[junit4:junit4]   2> 77015 T179 C9 P64385 oasc.RecoveryStrategy.doRecovery Begin buffering updates. core=collection1
[junit4:junit4]   2> 77015 T179 C9 P64385 oasu.UpdateLog.bufferUpdates Starting to buffer updates. FSUpdateLog{state=ACTIVE, tlog=null}
[junit4:junit4]   2> 77015 T179 C9 P64385 oasc.RecoveryStrategy.replicate Attempting to replicate from http://127.0.0.1:64357/solr/collection1/. core=collection1
[junit4:junit4]   2> 77015 T179 C9 P64385 oascsi.HttpClientUtil.createClient Creating new http client, config:maxConnections=128&maxConnectionsPerHost=32&followRedirects=false
[junit4:junit4]   2> 77015 T122 C8 P64357 oasu.DirectUpdateHandler2.commit start commit{flags=0,_version_=0,optimize=false,openSearcher=false,waitSearcher=true,expungeDeletes=false,softCommit=false}
[junit4:junit4]   2> 77015 T122 C8 P64357 oasu.DirectUpdateHandler2.commit end_commit_flush
[junit4:junit4]   2> 77015 T122 C8 P64357 /update {waitSearcher=true&openSearcher=false&commit=true&commit_end_point=true&wt=javabin&softCommit=false&version=2} {commit=} 0 0
[junit4:junit4]   2> 77015 T179 C9 P64385 oash.ReplicationHandler.inform Commits will be reserved for  10000
[junit4:junit4]   2> 77031 T179 C9 P64385 oash.SnapPuller.<init>  No value set for 'pollInterval'. Timer Task not started.
[junit4:junit4]   2> 77031 T91 oascc.ZkStateReader.updateClusterState Updating cloud state from ZooKeeper... 
[junit4:junit4]   2> 77047 T120 C8 P64357 REQ /replication {command=indexversion&wt=javabin&qt=/replication&version=2} status=0 QTime=0 
[junit4:junit4]   2> 77047 T179 C9 P64385 oasc.SolrDeletionPolicy.onInit SolrDeletionPolicy.onInit: commits:num=1
[junit4:junit4]   2> 		commit{dir=C:\Users\JenkinsSlave\workspace\Lucene-Solr-4.x-Windows\solr\build\solr-solrj\test\J0\org.apache.solr.client.solrj.impl.CloudSolrServerTest-1352453189560\jetty5\index,segFN=segments_1,generation=1,filenames=[segments_1]
[junit4:junit4]   2> 77047 T179 C9 P64385 oasc.SolrDeletionPolicy.updateCommits newest commit = 1
[junit4:junit4]   2> 77047 T179 C9 P64385 oasu.DirectUpdateHandler2.commit start commit{flags=0,_version_=0,optimize=false,openSearcher=true,waitSearcher=true,expungeDeletes=false,softCommit=false}
[junit4:junit4]   2> 77062 T179 C9 P64385 oasc.SolrDeletionPolicy.onCommit SolrDeletionPolicy.onCommit: commits:num=2
[junit4:junit4]   2> 		commit{dir=C:\Users\JenkinsSlave\workspace\Lucene-Solr-4.x-Windows\solr\build\solr-solrj\test\J0\org.apache.solr.client.solrj.impl.CloudSolrServerTest-1352453189560\jetty5\index,segFN=segments_1,generation=1,filenames=[segments_1]
[junit4:junit4]   2> 		commit{dir=C:\Users\JenkinsSlave\workspace\Lucene-Solr-4.x-Windows\solr\build\solr-solrj\test\J0\org.apache.solr.client.solrj.impl.CloudSolrServerTest-1352453189560\jetty5\index,segFN=segments_2,generation=2,filenames=[segments_2]
[junit4:junit4]   2> 77062 T179 C9 P64385 oasc.SolrDeletionPolicy.updateCommits newest commit = 2
[junit4:junit4]   2> 77062 T179 C9 P64385 oass.SolrIndexSearcher.<init> Opening Searcher@380dbe main
[junit4:junit4]   2> 77062 T179 C9 P64385 oasu.DirectUpdateHandler2.commit end_commit_flush
[junit4:junit4]   2> 77062 T178 oasc.SolrCore.registerSearcher [collection1] Registered new searcher Searcher@380dbe main{StandardDirectoryReader(segments_2:2)}
[junit4:junit4]   2> 77062 T179 C9 P64385 oasc.RecoveryStrategy.replay No replay needed. core=collection1
[junit4:junit4]   2> 77062 T179 C9 P64385 oasc.RecoveryStrategy.doRecovery Replication Recovery was successful - registering as Active. core=collection1
[junit4:junit4]   2> 77062 T179 C9 P64385 oasc.ZkController.publish numShards not found on descriptor - reading it from system property
[junit4:junit4]   2> 77078 T179 C9 P64385 oasc.RecoveryStrategy.doRecovery Finished recovery process. core=collection1
[junit4:junit4]   2> 77344 T112 oascc.ZkStateReader.updateClusterState Updating cloud state from ZooKeeper... 
[junit4:junit4]   2> 77344 T112 oasc.Overseer$ClusterStateUpdater.updateState Update state numShards=2 message={
[junit4:junit4]   2> 	  "operation":"state",
[junit4:junit4]   2> 	  "numShards":"2",
[junit4:junit4]   2> 	  "shard":"shard1",
[junit4:junit4]   2> 	  "roles":null,
[junit4:junit4]   2> 	  "state":"active",
[junit4:junit4]   2> 	  "core":"collection1",
[junit4:junit4]   2> 	  "collection":"collection1",
[junit4:junit4]   2> 	  "node_name":"127.0.0.1:64385_solr",
[junit4:junit4]   2> 	  "base_url":"http://127.0.0.1:64385/solr"}
[junit4:junit4]   2> 77359 T139 oascc.ZkStateReader$2.process A cluster state change has occurred - updating... (7)
[junit4:junit4]   2> 77359 T191 oascc.ZkStateReader$2.process A cluster state change has occurred - updating... (7)
[junit4:junit4]   2> 77359 T177 oascc.ZkStateReader$2.process A cluster state change has occurred - updating... (7)
[junit4:junit4]   2> 77359 T111 oascc.ZkStateReader$2.process A cluster state change has occurred - updating... (7)
[junit4:junit4]   2> 77359 T151 oascc.ZkStateReader$2.process A cluster state change has occurred - updating... (7)
[junit4:junit4]   2> 77359 T195 oascc.ZkStateReader$2.process A cluster state change has occurred - updating... (7)
[junit4:junit4]   2> 77359 T127 oascc.ZkStateReader$2.process A cluster state change has occurred - updating... (7)
[junit4:junit4]   2> 78031 T91 oascc.ZkStateReader.updateClusterState Updating cloud state from ZooKeeper... 
[junit4:junit4]   2>  C10_STATE=coll:collection1 core:collection1 props:{shard=shard2, roles=null, state=recovering, core=collection1, collection=collection1, node_name=127.0.0.1:64392_solr, base_url=http://127.0.0.1:64392/solr}
[junit4:junit4]   2> 79000 T193 C10 P64392 oasc.RecoveryStrategy.doRecovery Begin buffering updates. core=collection1
[junit4:junit4]   2> 79000 T193 C10 P64392 oasu.UpdateLog.bufferUpdates Starting to buffer updates. FSUpdateLog{state=ACTIVE, tlog=null}
[junit4:junit4]   2> 79000 T193 C10 P64392 oasc.RecoveryStrategy.replicate Attempting to replicate from http://127.0.0.1:64363/solr/collection1/. core=collection1
[junit4:junit4]   2> 79000 T193 C10 P64392 oascsi.HttpClientUtil.createClient Creating new http client, config:maxConnections=128&maxConnectionsPerHost=32&followRedirects=false
[junit4:junit4]   2> 79000 T136 C11 P64363 oasu.DirectUpdateHandler2.commit start commit{flags=0,_version_=0,optimize=false,openSearcher=false,waitSearcher=true,expungeDeletes=false,softCommit=false}
[junit4:junit4]   2> 79015 T136 C11 P64363 oasc.SolrDeletionPolicy.onInit SolrDeletionPolicy.onInit: commits:num=1
[junit4:junit4]   2> 		commit{dir=C:\Users\JenkinsSlave\workspace\Lucene-Solr-4.x-Windows\solr\build\solr-solrj\test\J0\org.apache.solr.client.solrj.impl.CloudSolrServerTest-1352453189560\jetty2\index,segFN=segments_1,generation=1,filenames=[segments_1]
[junit4:junit4]   2> 79015 T136 C11 P64363 oasc.SolrDeletionPolicy.updateCommits newest commit = 1
[junit4:junit4]   2> 79015 T136 C11 P64363 oass.SolrIndexSearcher.<init> Opening Searcher@176ed77 realtime
[junit4:junit4]   2> 79015 T136 C11 P64363 oasu.DirectUpdateHandler2.commit end_commit_flush
[junit4:junit4]   2> 79015 T136 C11 P64363 /update {waitSearcher=true&openSearcher=false&commit=true&commit_end_point=true&wt=javabin&softCommit=false&version=2} {commit=} 0 15
[junit4:junit4]   2> 79015 T193 C10 P64392 oash.ReplicationHandler.inform Commits will be reserved for  10000
[junit4:junit4]   2> 79015 T193 C10 P64392 oash.SnapPuller.<init>  No value set for 'pollInterval'. Timer Task not started.
[junit4:junit4]   2> 79015 T137 C11 P64363 oash.ReplicationHandler.inform Commits will be reserved for  10000
[junit4:junit4]   2> 79015 T137 C11 P64363 REQ /replication {command=indexversion&wt=javabin&qt=/replication&version=2} status=0 QTime=0 
[junit4:junit4]   2> 79031 T91 oascc.ZkStateReader.updateClusterState Updating cloud state from ZooKeeper... 
[junit4:junit4]   2> 79031 T193 C10 P64392 oasc.SolrDeletionPolicy.onInit SolrDeletionPolicy.onInit: commits:num=1
[junit4:junit4]   2> 		commit{dir=C:\Users\JenkinsSlave\workspace\Lucene-Solr-4.x-Windows\solr\build\solr-solrj\test\J0\org.apache.solr.client.solrj.impl.CloudSolrServerTest-1352453189560\jetty6\index,segFN=segments_1,generation=1,filenames=[segments_1]
[junit4:junit4]   2> 79031 T193 C10 P64392 oasc.SolrDeletionPolicy.updateCommits newest commit = 1
[junit4:junit4]   2> 79031 T193 C10 P64392 oasu.DirectUpdateHandler2.commit start commit{flags=0,_version_=0,optimize=false,openSearcher=true,waitSearcher=true,expungeDeletes=false,softCommit=false}
[junit4:junit4]   2> 79047 T193 C10 P64392 oasc.SolrDeletionPolicy.onCommit SolrDeletionPolicy.onCommit: commits:num=2
[junit4:junit4]   2> 		commit{dir=C:\Users\JenkinsSlave\workspace\Lucene-Solr-4.x-Windows\solr\build\solr-solrj\test\J0\org.apache.solr.client.solrj.impl.CloudSolrServerTest-1352453189560\jetty6\index,segFN=segments_1,generation=1,filenames=[segments_1]
[junit4:junit4]   2> 		commit{dir=C:\Users\JenkinsSlave\workspace\Lucene-Solr-4.x-Windows\solr\build\solr-solrj\test\J0\org.apache.solr.client.solrj.impl.CloudSolrServerTest-1352453189560\jetty6\index,segFN=segments_2,generation=2,filenames=[segments_2]
[junit4:junit4]   2> 79047 T193 C10 P64392 oasc.SolrDeletionPolicy.updateCommits newest commit = 2
[junit4:junit4]   2> 79047 T193 C10 P64392 oass.SolrIndexSearcher.<init> Opening Searcher@de4f4b main
[junit4:junit4]   2> 79047 T193 C10 P64392 oasu.DirectUpdateHandler2.commit end_commit_flush
[junit4:junit4]   2> 79047 T192 oasc.SolrCore.registerSearcher [collection1] Registered new searcher Searcher@de4f4b main{StandardDirectoryReader(segments_2:2)}
[junit4:junit4]   2> 79047 T193 C10 P64392 oasc.RecoveryStrategy.replay No replay needed. core=collection1
[junit4:junit4]   2> 79047 T193 C10 P64392 oasc.RecoveryStrategy.doRecovery Replication Recovery was successful - registering as Active. core=collection1
[junit4:junit4]   2> 79047 T193 C10 P64392 oasc.ZkController.publish numShards not found on descriptor - reading it from system property
[junit4:junit4]   2> 79062 T193 C10 P64392 oasc.RecoveryStrategy.doRecovery Finished recovery process. core=collection1
[junit4:junit4]   2> 79359 T112 oascc.ZkStateReader.updateClusterState Updating cloud state from ZooKeeper... 
[junit4:junit4]   2> 79359 T112 oasc.Overseer$ClusterStateUpdater.updateState Update state numShards=2 message={
[junit4:junit4]   2> 	  "operation":"state",
[junit4:junit4]   2> 	  "numShards":"2",
[junit4:junit4]   2> 	  "shard":"shard2",
[junit4:junit4]   2> 	  "roles":null,
[junit4:junit4]   2> 	  "state":"active",
[junit4:junit4]   2> 	  "core":"collection1",
[junit4:junit4]   2> 	  "collection":"collection1",
[junit4:junit4]   2> 	  "node_name":"127.0.0.1:64392_solr",
[junit4:junit4]   2> 	  "base_url":"http://127.0.0.1:64392/solr"}
[junit4:junit4]   2> 79422 T139 oascc.ZkStateReader$2.process A cluster state change has occurred - updating... (7)
[junit4:junit4]   2> 79422 T177 oascc.ZkStateReader$2.process A cluster state change has occurred - updating... (7)
[junit4:junit4]   2> 79422 T191 oascc.ZkStateReader$2.process A cluster state change has occurred - updating... (7)
[junit4:junit4]   2> 79422 T111 oascc.ZkStateReader$2.process A cluster state change has occurred - updating... (7)
[junit4:junit4]   2> 79422 T151 oascc.ZkStateReader$2.process A cluster state change has occurred - updating... (7)
[junit4:junit4]   2> 79422 T195 oascc.ZkStateReader$2.process A cluster state change has occurred - updating... (7)
[junit4:junit4]   2> 79422 T127 oascc.ZkStateReader$2.process A cluster state change has occurred - updating... (7)
[junit4:junit4]   2> 80031 T91 oascc.ZkStateReader.updateClusterState Updating cloud state from ZooKeeper... 
[junit4:junit4]   2> 81031 T91 oascc.ZkStateReader.updateClusterState Updating cloud state from ZooKeeper... 
[junit4:junit4]   2> 82031 T91 oascc.ZkStateReader.updateClusterState Updating cloud state from ZooKeeper... 
[junit4:junit4]   2> 83031 T91 oascc.ZkStateReader.updateClusterState Updating cloud state from ZooKeeper... 
[junit4:junit4]   2> 84031 T91 oascc.ZkStateReader.updateClusterState Updating cloud state from ZooKeeper... 
[junit4:junit4]   2> 85031 T91 oascc.ZkStateReader.updateClusterState Updating cloud state from ZooKeeper... 
[junit4:junit4]   2> 86031 T91 oascc.ZkStateReader.updateClusterState Updating cloud state from ZooKeeper... 
[junit4:junit4]   2> 87031 T91 oascc.ZkStateReader.updateClusterState Updating cloud state from ZooKeeper... 
[junit4:junit4]   2> 88031 T91 oascc.ZkStateReader.updateClusterState Updating cloud state from ZooKeeper... 
[junit4:junit4]   2> 89031 T91 oascc.ZkStateReader.updateClusterState Updating cloud state from ZooKeeper... 
[junit4:junit4]   2> 90031 T91 oascc.ZkStateReader.updateClusterState Updating cloud state from ZooKeeper... 
[junit4:junit4]   2> 91031 T91 oascc.ZkStateReader.updateClusterState Updating cloud state from ZooKeeper... 
[junit4:junit4]   2> 92031 T91 oascc.ZkStateReader.updateClusterState Updating cloud state from ZooKeeper... 
[junit4:junit4]   2> 93031 T91 oascc.ZkStateReader.updateClusterState Updating cloud state from ZooKeeper... 
[junit4:junit4]   2> 94031 T91 oascc.ZkStateReader.updateClusterState Updating cloud state from ZooKeeper... 
[junit4:junit4]   2> 95031 T91 oascc.ZkStateReader.updateClusterState Updating cloud state from ZooKeeper... 
[junit4:junit4]   2> 96031 T91 oascc.ZkStateReader.updateClusterState Updating cloud state from ZooKeeper... 
[junit4:junit4]   2> 97031 T91 oascc.ZkStateReader.updateClusterState Updating cloud state from ZooKeeper... 
[junit4:junit4]   2> 98031 T91 oascc.ZkStateReader.updateClusterState Updating cloud state from ZooKeeper... 
[junit4:junit4]   2> 99031 T91 oascc.ZkStateReader.updateClusterState Updating cloud state from ZooKeeper... 
[junit4:junit4]   2> 100031 T91 oascc.ZkStateReader.updateClusterState Updating cloud state from ZooKeeper... 
[junit4:junit4]   2> 101031 T91 oascc.ZkStateReader.updateClusterState Updating cloud state from ZooKeeper... 
[junit4:junit4]   2> 102031 T91 oascc.ZkStateReader.updateClusterState Updating cloud state from ZooKeeper... 
[junit4:junit4]   2> 103031 T91 oascc.ZkStateReader.updateClusterState Updating cloud state from ZooKeeper... 
[junit4:junit4]   2> 104031 T91 oascc.ZkStateReader.updateClusterState Updating cloud state from ZooKeeper... 
[junit4:junit4]   2> 105031 T91 oascc.ZkStateReader.updateClusterState Updating cloud state from ZooKeeper... 
[junit4:junit4]   2> 106031 T91 oascc.ZkStateReader.updateClusterState Updating cloud state from ZooKeeper... 
[junit4:junit4]   1> 
[junit4:junit4]   1> Thread[qtp25359322-171,5,TGRP-CloudSolrServerTest]
[junit4:junit4]   1> sun.misc.Unsafe.park(Native Method)
[junit4:junit4]   1> java.util.concurrent.locks.LockSupport.parkNanos(LockSupport.java:196)
[junit4:junit4]   1> java.util.concurrent.locks.AbstractQueuedSynchronizer$ConditionObject.awaitNanos(AbstractQueuedSynchronizer.java:2025)
[junit4:junit4]   1> org.eclipse.jetty.util.BlockingArrayQueue.poll(BlockingArrayQueue.java:342)
[junit4:junit4]   1> org.eclipse.jetty.util.thread.QueuedThreadPool.idleJobPoll(QueuedThreadPool.java:526)
[junit4:junit4]   1> org.eclipse.jetty.util.thread.QueuedThreadPool.access$600(QueuedThreadPool.java:44)
[junit4:junit4]   1> org.eclipse.jetty.util.thread.QueuedThreadPool$3.run(QueuedThreadPool.java:572)
[junit4:junit4]   1> java.lang.Thread.run(Thread.java:662)
[junit4:junit4]   1> 
[junit4:junit4]   1> Thread[searcherExecutor-53-thread-1,5,TGRP-CloudSolrServerTest]
[junit4:junit4]   1> sun.misc.Unsafe.park(Native Method)
[junit4:junit4]   1> java.util.concurrent.locks.LockSupport.park(LockSupport.java:156)
[junit4:junit4]   1> java.util.concurrent.locks.AbstractQueuedSynchronizer$ConditionObject.await(AbstractQueuedSynchronizer.java:1987)
[junit4:junit4]   1> java.util.concurrent.LinkedBlockingQueue.take(LinkedBlockingQueue.java:399)
[junit4:junit4]   1> java.util.concurrent.ThreadPoolExecutor.getTask(ThreadPoolExecutor.java:947)
[junit4:junit4]   1> java.util.concurrent.ThreadPoolExecutor$Worker.run(ThreadPoolExecutor.java:907)
[junit4:junit4]   1> java.lang.Thread.run(Thread.java:662)
[junit4:junit4]   1> 
[junit4:junit4]   1> Thread[TEST-CloudSolrServerTest.testDistribSearch-seed#[396C51FA20B77DCA]-SendThread(127.0.0.1:64344),5,TGRP-CloudSolrServerTest]
[junit4:junit4]   1> sun.nio.ch.WindowsSelectorImpl$SubSelector.poll0(Native Method)
[junit4:junit4]   1> sun.nio.ch.WindowsSelectorImpl$SubSelector.poll(WindowsSelectorImpl.java:273)
[junit4:junit4]   1> sun.nio.ch.WindowsSelectorImpl$SubSelector.access$400(WindowsSelectorImpl.java:255)
[junit4:junit4]   1> sun.nio.ch.WindowsSelectorImpl.doSelect(WindowsSelectorImpl.java:136)
[junit4:junit4]   1> sun.nio.ch.SelectorImpl.lockAndDoSelect(SelectorImpl.java:69)
[junit4:junit4]   1> sun.nio.ch.SelectorImpl.select(SelectorImpl.java:80)
[junit4:junit4]   1> org.apache.zookeeper.ClientCnxn$SendThread.run(ClientCnxn.java:1131)
[junit4:junit4]   1> 
[junit4:junit4]   1> Thread[searcherExecutor-80-thread-1,5,TGRP-CloudSolrServerTest]
[junit4:junit4]   1> sun.misc.Unsafe.park(Native Method)
[junit4:junit4]   1> java.util.concurrent.locks.LockSupport.park(LockSupport.java:156)
[junit4:junit4]   1> java.util.concurrent.locks.AbstractQueuedSynchronizer$ConditionObject.await(AbstractQueuedSynchronizer.java:1987)
[junit4:junit4]   1> java.util.concurrent.LinkedBlockingQueue.take(LinkedBlockingQueue.java:399)
[junit4:junit4]   1> java.util.concurrent.ThreadPoolExecutor.getTask(ThreadPoolExecutor.java:947)
[junit4:junit4]   1> java.util.concurrent.ThreadPoolExecutor$Worker.run(ThreadPoolExecutor.java:907)
[junit4:junit4]   1> java.lang.Thread.run(Thread.java:662)
[junit4:junit4]   1> 
[junit4:junit4]   1> Thread[Attach Listener,5,system]
[junit4:junit4]   1> 
[junit4:junit4]   1> Thread[TEST-CloudSolrServerTest.testDistribSearch-seed#[396C51FA20B77DCA]-SendThread(127.0.0.1:64344),5,TGRP-CloudSolrServerTest]
[junit4:junit4]   1> sun.nio.ch.WindowsSelectorImpl$SubSelector.poll0(Native Method)
[junit4:junit4]   1> sun.nio.ch.WindowsSelectorImpl$SubSelector.poll(WindowsSelectorImpl.java:273)
[junit4:junit4]   1> sun.nio.ch.WindowsSelectorImpl$SubSelector.access$400(WindowsSelectorImpl.java:255)
[junit4:junit4]   1> sun.nio.ch.WindowsSelectorImpl.doSelect(WindowsSelectorImpl.java:136)
[junit4:junit4]   1> sun.nio.ch.SelectorImpl.lockAndDoSelect(SelectorImpl.java:69)
[junit4:junit4]   1> sun.nio.ch.SelectorImpl.select(SelectorImpl.java:80)
[junit4:junit4]   1> org.apache.zookeeper.ClientCnxn$SendThread.run(ClientCnxn.java:1131)
[junit4:junit4]   1> 
[junit4:junit4]   1> Thread[Signal Dispatcher,9,system]
[junit4:junit4]   1> 
[junit4:junit4]   1> Thread[qtp16725612-188,5,TGRP-CloudSolrServerTest]
[junit4:junit4]   1> sun.misc.Unsafe.park(Native Method)
[junit4:junit4]   1> java.util.concurrent.locks.LockSupport.parkNanos(LockSupport.java:196)
[junit4:junit4]   1> java.util.concurrent.locks.AbstractQueuedSynchronizer$ConditionObject.awaitNanos(AbstractQueuedSynchronizer.java:2025)
[junit4:junit4]   1> org.eclipse.jetty.util.BlockingArrayQueue.poll(BlockingArrayQueue.java:342)
[junit4:junit4]   1> org.eclipse.jetty.util.thread.QueuedThreadPool.idleJobPoll(QueuedThreadPool.java:526)
[junit4:junit4]   1> org.eclipse.jetty.util.thread.QueuedThreadPool.access$600(QueuedThreadPool.java:44)
[junit4:junit4]   1> org.eclipse.jetty.util.thread.QueuedThreadPool$3.run(QueuedThreadPool.java:572)
[junit4:junit4]   1> java.lang.Thread.run(Thread.java:662)
[junit4:junit4]   1> 
[junit4:junit4]   1> Thread[TEST-CloudSolrServerTest.testDistribSearch-seed#[396C51FA20B77DCA]-EventThread,5,TGRP-CloudSolrServerTest]
[junit4:junit4]   1> sun.misc.Unsafe.park(Native Method)
[junit4:junit4]   1> java.util.concurrent.locks.LockSupport.park(LockSupport.java:156)
[junit4:junit4]   1> java.util.concurrent.locks.AbstractQueuedSynchronizer$ConditionObject.await(AbstractQueuedSynchronizer.java:1987)
[junit4:junit4]   1> java.util.concurrent.LinkedBlockingQueue.take(LinkedBlockingQueue.java:399)
[junit4:junit4]   1> org.apache.zookeeper.ClientCnxn$EventThread.run(ClientCnxn.java:498)
[junit4:junit4]   1> 
[junit4:junit4]   1> Thread[HashSessionScavenger-6,5,TGRP-CloudSolrServerTest]
[junit4:junit4]   1> java.lang.Object.wait(Native Method)
[junit4:junit4]   1> java.util.TimerThread.mainLoop(Timer.java:509)
[junit4:junit4]   1> java.util.TimerThread.run(Timer.java:462)
[junit4:junit4]   1> 
[junit4:junit4]   1> Thread[TEST-CloudSolrServerTest.testDistribSearch-seed#[396C51FA20B77DCA],5,TGRP-CloudSolrServerTest]
[junit4:junit4]   1> java.lang.Thread.dumpThreads(Native Method)
[junit4:junit4]   1> java.lang.Thread.getAllStackTraces(Thread.java:1530)
[junit4:junit4]   1> org.apache.solr.cloud.AbstractDistribZkTestBase.waitForRecoveriesToFinish(AbstractDistribZkTestBase.java:156)
[junit4:junit4]   1> org.apache.solr.cloud.AbstractFullDistribZkTestBase.waitForRecoveriesToFinish(AbstractFullDistribZkTestBase.java:558)
[junit4:junit4]   1> org.apache.solr.cloud.AbstractFullDistribZkTestBase.waitForThingsToLevelOut(AbstractFullDistribZkTestBase.java:1133)
[junit4:junit4]   1> org.apache.solr.client.solrj.impl.CloudSolrServerTest.doTest(CloudSolrServerTest.java:95)
[junit4:junit4]   1> org.apache.solr.BaseDistributedSearchTestCase.testDistribSearch(BaseDistributedSearchTestCase.java:695)
[junit4:junit4]   1> sun.reflect.NativeMethodAccessorImpl.invoke0(Native Method)
[junit4:junit4]   1> sun.reflect.NativeMethodAccessorImpl.invoke(NativeMethodAccessorImpl.java:39)
[junit4:junit4]   1> sun.reflect.DelegatingMethodAccessorImpl.invoke(DelegatingMethodAccessorImpl.java:25)
[junit4:junit4]   1> java.lang.reflect.Method.invoke(Method.java:597)
[junit4:junit4]   1> com.carrotsearch.randomizedtesting.RandomizedRunner.invoke(RandomizedRunner.java:1559)
[junit4:junit4]   1> com.carrotsearch.randomizedtesting.RandomizedRunner.access$600(RandomizedRunner.java:79)
[junit4:junit4]   1> com.carrotsearch.randomizedtesting.RandomizedRunner$6.evaluate(RandomizedRunner.java:737)
[junit4:junit4]   1> com.carrotsearch.randomizedtesting.RandomizedRunner$7.evaluate(RandomizedRunner.java:773)
[junit4:junit4]   1> com.carrotsearch.randomizedtesting.RandomizedRunner$8.evaluate(RandomizedRunner.java:787)
[junit4:junit4]   1> com.carrotsearch.randomizedtesting.rules.SystemPropertiesRestoreRule$1.evaluate(SystemPropertiesRestoreRule.java:53)
[junit4:junit4]   1> org.apache.lucene.util.TestRuleSetupTeardownChained$1.evaluate(TestRuleSetupTeardownChained.java:50)
[junit4:junit4]   1> org.apache.lucene.util.TestRuleFieldCacheSanity$1.evaluate(TestRuleFieldCacheSanity.java:51)
[junit4:junit4]   1> org.apache.lucene.util.AbstractBeforeAfterRule$1.evaluate(AbstractBeforeAfterRule.java:45)
[junit4:junit4]   1> com.carrotsearch.randomizedtesting.rules.SystemPropertiesInvariantRule$1.evaluate(SystemPropertiesInvariantRule.java:55)
[junit4:junit4]   1> org.apache.lucene.util.TestRuleThreadAndTestName$1.evaluate(TestRuleThreadAndTestName.java:48)
[junit4:junit4]   1> org.apache.lucene.util.TestRuleIgnoreAfterMaxFailures$1.evaluate(TestRuleIgnoreAfterMaxFailures.java:70)
[junit4:junit4]   1> org.apache.lucene.util.TestRuleMarkFailure$1.evaluate(TestRuleMarkFailure.java:48)
[junit4:junit4]   1> com.carrotsearch.randomizedtesting.rules.StatementAdapter.evaluate(StatementAdapter.java:36)
[junit4:junit4]   1> com.carrotsearch.randomizedtesting.ThreadLeakControl$StatementRunner.run(ThreadLeakControl.java:358)
[junit4:junit4]   1> com.carrotsearch.randomizedtesting.ThreadLeakControl.forkTimeoutingTask(ThreadLeakControl.java:782)
[junit4:junit4]   1> com.carrotsearch.randomizedtesting.ThreadLeakControl$3.evaluate(ThreadLeakControl.java:442)
[junit4:junit4]   1> com.carrotsearch.randomizedtesting.RandomizedRunner.runSingleTest(RandomizedRunner.java:746)
[junit4:junit4]   1> com.carrotsearch.randomizedtesting.RandomizedRunner$3.evaluate(RandomizedRunner.java:648)
[junit4:junit4]   1> com.carrotsearch.randomizedtesting.RandomizedRunner$4.evaluate(RandomizedRunner.java:682)
[junit4:junit4]   1> com.carrotsearch.randomizedtesting.RandomizedRunner$5.evaluate(RandomizedRunner.java:693)
[junit4:junit4]   1> com.carrotsearch.randomizedtesting.rules.StatementAdapter.evaluate(StatementAdapter.java:36)
[junit4:junit4]   1> com.carrotsearch.randomizedtesting.rules.SystemPropertiesRestoreRule$1.evaluate(SystemPropertiesRestoreRule.java:53)
[junit4:junit4]   1> org.apache.lucene.util.AbstractBeforeAfterRule$1.evaluate(AbstractBeforeAfterRule.java:45)
[junit4:junit4]   1> org.apache.lucene.util.TestRuleStoreClassName$1.evaluate(TestRuleStoreClassName.java:42)
[junit4:junit4]   1> com.carrotsearch.randomizedtesting.rules.SystemPropertiesInvariantRule$1.evaluate(SystemPropertiesInvariantRule.java:55)
[junit4:junit4]   1> com.carrotsearch.randomizedtesting.rules.NoShadowingOrOverridesOnMethodsRule$1.evaluate(NoShadowingOrOverridesOnMethodsRule.java:39)
[junit4:junit4]   1> com.carrotsearch.randomizedtesting.rules.NoShadowingOrOverridesOnMethodsRule$1.evaluate(NoShadowingOrOverridesOnMethodsRule.java:39)
[junit4:junit4]   1> com.carrotsearch.randomizedtesting.rules.StatementAdapter.evaluate(StatementAdapter.java:36)
[junit4:junit4]   1> org.apache.lucene.util.TestRuleAssertionsRequired$1.evaluate(TestRuleAssertionsRequired.java:43)
[junit4:junit4]   1> org.apache.lucene.util.TestRuleMarkFailure$1.evaluate(TestRuleMarkFailure.java:48)
[junit4:junit4]   1> org.apache.lucene.util.TestRuleIgnoreAfterMaxFailures$1.evaluate(TestRuleIgnoreAfterMaxFailures.java:70)
[junit4:junit4]   1> org.apache.lucene.util.TestRuleIgnoreTestSuites$1.evaluate(TestRuleIgnoreTestSuites.java:55)
[junit4:junit4]   1> com.carrotsearch.randomizedtesting.rules.StatementAdapter.evaluate(StatementAdapter.java:36)
[junit4:junit4]   1> com.carrotsearch.randomizedtesting.ThreadLeakControl$StatementRunner.run(ThreadLeakControl.java:358)
[junit4:junit4]   1> java.lang.Thread.run(Thread.java:662)
[junit4:junit4]   1> 
[junit4:junit4]   1> Thread[TEST-CloudSolrServerTest.testDistribSearch-seed#[396C51FA20B77DCA]-EventThread,5,TGRP-CloudSolrServerTest]
[junit4:junit4]   1> sun.misc.Unsafe.park(Native Method)
[junit4:junit4]   1> java.util.concurrent.locks.LockSupport.park(LockSupport.java:156)
[junit4:junit4]   1> java.util.concurrent.locks.AbstractQueuedSynchronizer$ConditionObject.await(AbstractQueuedSynchronizer.java:1987)
[junit4:junit4]   1> java.util.concurrent.LinkedBlockingQueue.take(LinkedBlockingQueue.java:399)
[junit4:junit4]   1> org.apache.zookeeper.ClientCnxn$EventThread.run(ClientCnxn.java:498)
[junit4:junit4]   1> 
[junit4:junit4]   1> Thread[qtp13497424-120,5,TGRP-CloudSolrServerTest]
[junit4:junit4]   1> sun.misc.Unsafe.park(Native Method)
[junit4:junit4]   1> java.util.concurrent.locks.LockSupport.parkNanos(LockSupport.java:196)
[junit4:junit4]   1> java.util.concurrent.locks.AbstractQueuedSynchronizer$ConditionObject.awaitNanos(AbstractQueuedSynchronizer.java:2025)
[junit4:junit4]   1> org.eclipse.jetty.util.BlockingArrayQueue.poll(BlockingArrayQueue.java:342)
[junit4:junit4]   1> org.eclipse.jetty.util.thread.QueuedThreadPool.idleJobPoll(QueuedThreadPool.java:526)
[junit4:junit4]   1> org.eclipse.jetty.util.thread.QueuedThreadPool.access$600(QueuedThreadPool.java:44)
[junit4:junit4]   1> org.eclipse.jetty.util.thread.QueuedThreadPool$3.run(QueuedThreadPool.java:572)
[junit4:junit4]   1> java.lang.Thread.run(Thread.java:662)
[junit4:junit4]   1> 
[junit4:junit4]   1> Thread[qtp13497424-122,5,TGRP-CloudSolrServerTest]
[junit4:junit4]   1> sun.misc.Unsafe.park(Nat

[...truncated too long message...]

1",
[junit4:junit4]   1>                 "collection":"collection1",
[junit4:junit4]   1>                 "node_name":"127.0.0.1:64363_solr",
[junit4:junit4]   1>                 "base_url":"http://127.0.0.1:64363/solr",
[junit4:junit4]   1>                 "leader":"true"},
[junit4:junit4]   1>               "127.0.0.1:64377_solr_collection1":{
[junit4:junit4]   1>                 "shard":null,
[junit4:junit4]   1>                 "roles":null,
[junit4:junit4]   1>                 "state":"down",
[junit4:junit4]   1>                 "core":"collection1",
[junit4:junit4]   1>                 "collection":"collection1",
[junit4:junit4]   1>                 "node_name":"127.0.0.1:64377_solr",
[junit4:junit4]   1>                 "base_url":"http://127.0.0.1:64377/solr"},
[junit4:junit4]   1>               "127.0.0.1:64392_solr_collection1":{
[junit4:junit4]   1>                 "shard":"shard2",
[junit4:junit4]   1>                 "roles":null,
[junit4:junit4]   1>                 "state":"active",
[junit4:junit4]   1>                 "core":"collection1",
[junit4:junit4]   1>                 "collection":"collection1",
[junit4:junit4]   1>                 "node_name":"127.0.0.1:64392_solr",
[junit4:junit4]   1>                 "base_url":"http://127.0.0.1:64392/solr"}}}},
[junit4:junit4]   1>         "control_collection":{"control_shard":{"replicas":{"127.0.0.1:64351_solr_collection1":{
[junit4:junit4]   1>                 "shard":"control_shard",
[junit4:junit4]   1>                 "roles":null,
[junit4:junit4]   1>                 "state":"active",
[junit4:junit4]   1>                 "core":"collection1",
[junit4:junit4]   1>                 "collection":"control_collection",
[junit4:junit4]   1>                 "node_name":"127.0.0.1:64351_solr",
[junit4:junit4]   1>                 "base_url":"http://127.0.0.1:64351/solr",
[junit4:junit4]   1>                 "leader":"true"}}}}}
[junit4:junit4]   1>  /zookeeper (1)
[junit4:junit4]   1>  DATA:
[junit4:junit4]   1>      
[junit4:junit4]   1> 
[junit4:junit4]   2> NOTE: reproduce with: ant test  -Dtestcase=CloudSolrServerTest -Dtests.method=testDistribSearch -Dtests.seed=396C51FA20B77DCA -Dtests.slow=true -Dtests.locale=nl -Dtests.timezone=America/Godthab -Dtests.file.encoding=Cp1252
[junit4:junit4] FAILURE  120s | CloudSolrServerTest.testDistribSearch <<<
[junit4:junit4]    > Throwable #1: java.lang.AssertionError: There are still nodes recoverying - waited for 30 seconds
[junit4:junit4]    > 	at __randomizedtesting.SeedInfo.seed([396C51FA20B77DCA:B88ADFE257E81DF6]:0)
[junit4:junit4]    > 	at org.junit.Assert.fail(Assert.java:93)
[junit4:junit4]    > 	at org.apache.solr.cloud.AbstractDistribZkTestBase.waitForRecoveriesToFinish(AbstractDistribZkTestBase.java:165)
[junit4:junit4]    > 	at org.apache.solr.cloud.AbstractFullDistribZkTestBase.waitForRecoveriesToFinish(AbstractFullDistribZkTestBase.java:558)
[junit4:junit4]    > 	at org.apache.solr.cloud.AbstractFullDistribZkTestBase.waitForThingsToLevelOut(AbstractFullDistribZkTestBase.java:1133)
[junit4:junit4]    > 	at org.apache.solr.client.solrj.impl.CloudSolrServerTest.doTest(CloudSolrServerTest.java:95)
[junit4:junit4]    > 	at org.apache.solr.BaseDistributedSearchTestCase.testDistribSearch(BaseDistributedSearchTestCase.java:695)
[junit4:junit4]    > 	at sun.reflect.NativeMethodAccessorImpl.invoke0(Native Method)
[junit4:junit4]    > 	at sun.reflect.NativeMethodAccessorImpl.invoke(NativeMethodAccessorImpl.java:39)
[junit4:junit4]    > 	at sun.reflect.DelegatingMethodAccessorImpl.invoke(DelegatingMethodAccessorImpl.java:25)
[junit4:junit4]    > 	at java.lang.reflect.Method.invoke(Method.java:597)
[junit4:junit4]    > 	at com.carrotsearch.randomizedtesting.RandomizedRunner.invoke(RandomizedRunner.java:1559)
[junit4:junit4]    > 	at com.carrotsearch.randomizedtesting.RandomizedRunner.access$600(RandomizedRunner.java:79)
[junit4:junit4]    > 	at com.carrotsearch.randomizedtesting.RandomizedRunner$6.evaluate(RandomizedRunner.java:737)
[junit4:junit4]    > 	at com.carrotsearch.randomizedtesting.RandomizedRunner$7.evaluate(RandomizedRunner.java:773)
[junit4:junit4]    > 	at com.carrotsearch.randomizedtesting.RandomizedRunner$8.evaluate(RandomizedRunner.java:787)
[junit4:junit4]    > 	at com.carrotsearch.randomizedtesting.rules.SystemPropertiesRestoreRule$1.evaluate(SystemPropertiesRestoreRule.java:53)
[junit4:junit4]    > 	at org.apache.lucene.util.TestRuleSetupTeardownChained$1.evaluate(TestRuleSetupTeardownChained.java:50)
[junit4:junit4]    > 	at org.apache.lucene.util.TestRuleFieldCacheSanity$1.evaluate(TestRuleFieldCacheSanity.java:51)
[junit4:junit4]    > 	at org.apache.lucene.util.AbstractBeforeAfterRule$1.evaluate(AbstractBeforeAfterRule.java:45)
[junit4:junit4]    > 	at com.carrotsearch.randomizedtesting.rules.SystemPropertiesInvariantRule$1.evaluate(SystemPropertiesInvariantRule.java:55)
[junit4:junit4]    > 	at org.apache.lucene.util.TestRuleThreadAndTestName$1.evaluate(TestRuleThreadAndTestName.java:48)
[junit4:junit4]    > 	at org.apache.lucene.util.TestRuleIgnoreAfterMaxFailures$1.evaluate(TestRuleIgnoreAfterMaxFailures.java:70)
[junit4:junit4]    > 	at org.apache.lucene.util.TestRuleMarkFailure$1.evaluate(TestRuleMarkFailure.java:48)
[junit4:junit4]    > 	at com.carrotsearch.randomizedtesting.rules.StatementAdapter.evaluate(StatementAdapter.java:36)
[junit4:junit4]    > 	at com.carrotsearch.randomizedtesting.ThreadLeakControl$StatementRunner.run(ThreadLeakControl.java:358)
[junit4:junit4]    > 	at com.carrotsearch.randomizedtesting.ThreadLeakControl.forkTimeoutingTask(ThreadLeakControl.java:782)
[junit4:junit4]    > 	at com.carrotsearch.randomizedtesting.ThreadLeakControl$3.evaluate(ThreadLeakControl.java:442)
[junit4:junit4]    > 	at com.carrotsearch.randomizedtesting.RandomizedRunner.runSingleTest(RandomizedRunner.java:746)
[junit4:junit4]    > 	at com.carrotsearch.randomizedtesting.RandomizedRunner$3.evaluate(RandomizedRunner.java:648)
[junit4:junit4]    > 	at com.carrotsearch.randomizedtesting.RandomizedRunner$4.evaluate(RandomizedRunner.java:682)
[junit4:junit4]    > 	at com.carrotsearch.randomizedtesting.RandomizedRunner$5.evaluate(RandomizedRunner.java:693)
[junit4:junit4]    > 	at com.carrotsearch.randomizedtesting.rules.StatementAdapter.evaluate(StatementAdapter.java:36)
[junit4:junit4]    > 	at com.carrotsearch.randomizedtesting.rules.SystemPropertiesRestoreRule$1.evaluate(SystemPropertiesRestoreRule.java:53)
[junit4:junit4]    > 	at org.apache.lucene.util.AbstractBeforeAfterRule$1.evaluate(AbstractBeforeAfterRule.java:45)
[junit4:junit4]    > 	at org.apache.lucene.util.TestRuleStoreClassName$1.evaluate(TestRuleStoreClassName.java:42)
[junit4:junit4]    > 	at com.carrotsearch.randomizedtesting.rules.SystemPropertiesInvariantRule$1.evaluate(SystemPropertiesInvariantRule.java:55)
[junit4:junit4]    > 	at com.carrotsearch.randomizedtesting.rules.NoShadowingOrOverridesOnMethodsRule$1.evaluate(NoShadowingOrOverridesOnMethodsRule.java:39)
[junit4:junit4]    > 	at com.carrotsearch.randomizedtesting.rules.NoShadowingOrOverridesOnMethodsRule$1.evaluate(NoShadowingOrOverridesOnMethodsRule.java:39)
[junit4:junit4]    > 	at com.carrotsearch.randomizedtesting.rules.StatementAdapter.evaluate(StatementAdapter.java:36)
[junit4:junit4]    > 	at org.apache.lucene.util.TestRuleAssertionsRequired$1.evaluate(TestRuleAssertionsRequired.java:43)
[junit4:junit4]    > 	at org.apache.lucene.util.TestRuleMarkFailure$1.evaluate(TestRuleMarkFailure.java:48)
[junit4:junit4]    > 	at org.apache.lucene.util.TestRuleIgnoreAfterMaxFailures$1.evaluate(TestRuleIgnoreAfterMaxFailures.java:70)
[junit4:junit4]    > 	at org.apache.lucene.util.TestRuleIgnoreTestSuites$1.evaluate(TestRuleIgnoreTestSuites.java:55)
[junit4:junit4]    > 	at com.carrotsearch.randomizedtesting.rules.StatementAdapter.evaluate(StatementAdapter.java:36)
[junit4:junit4]    > 	at com.carrotsearch.randomizedtesting.ThreadLeakControl$StatementRunner.run(ThreadLeakControl.java:358)
[junit4:junit4]    > 	at java.lang.Thread.run(Thread.java:662)
[junit4:junit4]   2> 119905 T91 oas.SolrTestCaseJ4.deleteCore ###deleteCore
[junit4:junit4]   2> NOTE: test params are: codec=Lucene41: {}, sim=RandomSimilarityProvider(queryNorm=false,coord=crazy): {}, locale=nl, timezone=America/Godthab
[junit4:junit4]   2> NOTE: Windows 7 6.1 x86/Sun Microsystems Inc. 1.6.0_37 (32-bit)/cpus=2,threads=1,free=42751760,total=198508544
[junit4:junit4]   2> NOTE: All tests run in this JVM: [TestNamedListCodec, SolrExampleBinaryTest, QueryResponseTest, SolrExceptionTest, TestJavaBinCodec, TestFastInputStream, ClientUtilsTest, IteratorChainTest, LargeVolumeJettyTest, MultiCoreExampleJettyTest, NamedListTest, CloudSolrServerTest]
[junit4:junit4] Completed in 119.92s, 1 test, 1 failure <<< FAILURES!

[...truncated 102 lines...]
BUILD FAILED
C:\Users\JenkinsSlave\workspace\Lucene-Solr-4.x-Windows\build.xml:335: The following error occurred while executing this line:
C:\Users\JenkinsSlave\workspace\Lucene-Solr-4.x-Windows\build.xml:39: The following error occurred while executing this line:
C:\Users\JenkinsSlave\workspace\Lucene-Solr-4.x-Windows\solr\build.xml:185: The following error occurred while executing this line:
C:\Users\JenkinsSlave\workspace\Lucene-Solr-4.x-Windows\lucene\module-build.xml:61: The following error occurred while executing this line:
C:\Users\JenkinsSlave\workspace\Lucene-Solr-4.x-Windows\lucene\common-build.xml:1163: The following error occurred while executing this line:
C:\Users\JenkinsSlave\workspace\Lucene-Solr-4.x-Windows\lucene\common-build.xml:827: There were test failures: 43 suites, 239 tests, 1 failure

Total time: 43 minutes 44 seconds
Build step 'Invoke Ant' marked build as failure
Archiving artifacts
Recording test results
Description set: Java: 32bit/jdk1.6.0_37 -server -XX:+UseParallelGC
Email was triggered for: Failure
Sending email for trigger: Failure



Mime
View raw message