lucene-dev mailing list archives

Site index · List index
Message view « Date » · « Thread »
Top « Date » · « Thread »
From Policeman Jenkins Server <jenk...@sd-datasolutions.de>
Subject [JENKINS] Lucene-Solr-4.x-Linux (32bit/ibm-j9-jdk7) - Build # 2263 - Failure!
Date Thu, 08 Nov 2012 07:45:44 GMT
Build: http://jenkins.sd-datasolutions.de/job/Lucene-Solr-4.x-Linux/2263/
Java: 32bit/ibm-j9-jdk7 -Xjit:exclude={org/apache/lucene/util/fst/FST.pack(IIF)Lorg/apache/lucene/util/fst/FST;}

1 tests failed.
REGRESSION:  org.apache.solr.update.AutoCommitTest.testMaxTime

Error Message:
shouldn't find any query failed XPath: //result[@numFound=0]  xml response was: <?xml version="1.0" encoding="UTF-8"?> <response> <lst name="responseHeader"><int name="status">0</int><int name="QTime">1049</int></lst><result name="response" numFound="1" start="0"><doc><int name="id">529</int><int name="range_facet_si">529</int><arr name="range_facet_l"><long>529</long></arr><arr name="range_facet_sl"><long>529</long></arr><arr name="field_t"><str>what's inside?</str></arr><arr name="subject"><str>info</str></arr><int name="intDefault">42</int><date name="timestamp">2012-11-08T07:27:14.054Z</date><arr name="multiDefault"><str>muLti-Default</str></arr></doc></result> </response>   request was: q=id:529&start=0&qt=standard&version=2.2&rows=20

Stack Trace:
java.lang.AssertionError: shouldn't find any query failed XPath: //result[@numFound=0]
 xml response was: <?xml version="1.0" encoding="UTF-8"?>
<response>
<lst name="responseHeader"><int name="status">0</int><int name="QTime">1049</int></lst><result name="response" numFound="1" start="0"><doc><int name="id">529</int><int name="range_facet_si">529</int><arr name="range_facet_l"><long>529</long></arr><arr name="range_facet_sl"><long>529</long></arr><arr name="field_t"><str>what's inside?</str></arr><arr name="subject"><str>info</str></arr><int name="intDefault">42</int><date name="timestamp">2012-11-08T07:27:14.054Z</date><arr name="multiDefault"><str>muLti-Default</str></arr></doc></result>
</response>

 request was: q=id:529&start=0&qt=standard&version=2.2&rows=20
	at __randomizedtesting.SeedInfo.seed([47EE07ED97E323FB:DD1A7A0F0979BFC7]:0)
	at org.junit.Assert.fail(Assert.java:93)
	at org.apache.solr.util.AbstractSolrTestCase.assertQ(AbstractSolrTestCase.java:276)
	at org.apache.solr.update.AutoCommitTest.testMaxTime(AutoCommitTest.java:217)
	at sun.reflect.NativeMethodAccessorImpl.invoke0(Native Method)
	at sun.reflect.NativeMethodAccessorImpl.invoke(NativeMethodAccessorImpl.java:88)
	at sun.reflect.DelegatingMethodAccessorImpl.invoke(DelegatingMethodAccessorImpl.java:55)
	at java.lang.reflect.Method.invoke(Method.java:613)
	at com.carrotsearch.randomizedtesting.RandomizedRunner.invoke(RandomizedRunner.java:1559)
	at com.carrotsearch.randomizedtesting.RandomizedRunner.access$600(RandomizedRunner.java:79)
	at com.carrotsearch.randomizedtesting.RandomizedRunner$6.evaluate(RandomizedRunner.java:737)
	at com.carrotsearch.randomizedtesting.RandomizedRunner$7.evaluate(RandomizedRunner.java:773)
	at com.carrotsearch.randomizedtesting.RandomizedRunner$8.evaluate(RandomizedRunner.java:787)
	at com.carrotsearch.randomizedtesting.rules.SystemPropertiesRestoreRule$1.evaluate(SystemPropertiesRestoreRule.java:53)
	at org.apache.lucene.util.TestRuleSetupTeardownChained$1.evaluate(TestRuleSetupTeardownChained.java:50)
	at org.apache.lucene.util.TestRuleFieldCacheSanity$1.evaluate(TestRuleFieldCacheSanity.java:51)
	at org.apache.lucene.util.AbstractBeforeAfterRule$1.evaluate(AbstractBeforeAfterRule.java:45)
	at com.carrotsearch.randomizedtesting.rules.SystemPropertiesInvariantRule$1.evaluate(SystemPropertiesInvariantRule.java:55)
	at org.apache.lucene.util.TestRuleThreadAndTestName$1.evaluate(TestRuleThreadAndTestName.java:48)
	at org.apache.lucene.util.TestRuleIgnoreAfterMaxFailures$1.evaluate(TestRuleIgnoreAfterMaxFailures.java:70)
	at org.apache.lucene.util.TestRuleMarkFailure$1.evaluate(TestRuleMarkFailure.java:48)
	at com.carrotsearch.randomizedtesting.rules.StatementAdapter.evaluate(StatementAdapter.java:36)
	at com.carrotsearch.randomizedtesting.ThreadLeakControl$StatementRunner.run(ThreadLeakControl.java:358)
	at com.carrotsearch.randomizedtesting.ThreadLeakControl.forkTimeoutingTask(ThreadLeakControl.java:782)
	at com.carrotsearch.randomizedtesting.ThreadLeakControl$3.evaluate(ThreadLeakControl.java:442)
	at com.carrotsearch.randomizedtesting.RandomizedRunner.runSingleTest(RandomizedRunner.java:746)
	at com.carrotsearch.randomizedtesting.RandomizedRunner$3.evaluate(RandomizedRunner.java:648)
	at com.carrotsearch.randomizedtesting.RandomizedRunner$4.evaluate(RandomizedRunner.java:682)
	at com.carrotsearch.randomizedtesting.RandomizedRunner$5.evaluate(RandomizedRunner.java:693)
	at com.carrotsearch.randomizedtesting.rules.StatementAdapter.evaluate(StatementAdapter.java:36)
	at com.carrotsearch.randomizedtesting.rules.SystemPropertiesRestoreRule$1.evaluate(SystemPropertiesRestoreRule.java:53)
	at org.apache.lucene.util.AbstractBeforeAfterRule$1.evaluate(AbstractBeforeAfterRule.java:45)
	at org.apache.lucene.util.TestRuleStoreClassName$1.evaluate(TestRuleStoreClassName.java:42)
	at com.carrotsearch.randomizedtesting.rules.SystemPropertiesInvariantRule$1.evaluate(SystemPropertiesInvariantRule.java:55)
	at com.carrotsearch.randomizedtesting.rules.NoShadowingOrOverridesOnMethodsRule$1.evaluate(NoShadowingOrOverridesOnMethodsRule.java:39)
	at com.carrotsearch.randomizedtesting.rules.NoShadowingOrOverridesOnMethodsRule$1.evaluate(NoShadowingOrOverridesOnMethodsRule.java:39)
	at com.carrotsearch.randomizedtesting.rules.StatementAdapter.evaluate(StatementAdapter.java:36)
	at org.apache.lucene.util.TestRuleAssertionsRequired$1.evaluate(TestRuleAssertionsRequired.java:43)
	at org.apache.lucene.util.TestRuleMarkFailure$1.evaluate(TestRuleMarkFailure.java:48)
	at org.apache.lucene.util.TestRuleIgnoreAfterMaxFailures$1.evaluate(TestRuleIgnoreAfterMaxFailures.java:70)
	at org.apache.lucene.util.TestRuleIgnoreTestSuites$1.evaluate(TestRuleIgnoreTestSuites.java:55)
	at com.carrotsearch.randomizedtesting.rules.StatementAdapter.evaluate(StatementAdapter.java:36)
	at com.carrotsearch.randomizedtesting.ThreadLeakControl$StatementRunner.run(ThreadLeakControl.java:358)
	at java.lang.Thread.run(Thread.java:779)




Build Log:
[...truncated 8472 lines...]
[junit4:junit4] Suite: org.apache.solr.update.AutoCommitTest
[junit4:junit4]   2> 2287 T349 oasu.AbstractSolrTestCase.setUp ####SETUP_START testMaxTime
[junit4:junit4]   2> 2289 T349 oasc.SolrResourceLoader.<init> new SolrResourceLoader for directory: '/mnt/ssd/jenkins/workspace/Lucene-Solr-4.x-Linux/solr/build/solr-core/test-files/solr/collection1/'
[junit4:junit4]   2> 2290 T349 oasc.SolrResourceLoader.replaceClassLoader Adding 'file:/mnt/ssd/jenkins/workspace/Lucene-Solr-4.x-Linux/solr/build/solr-core/test-files/solr/collection1/lib/README' to classloader
[junit4:junit4]   2> 2292 T349 oasc.SolrResourceLoader.replaceClassLoader Adding 'file:/mnt/ssd/jenkins/workspace/Lucene-Solr-4.x-Linux/solr/build/solr-core/test-files/solr/collection1/lib/classes/' to classloader
[junit4:junit4]   2> 2332 T349 oasc.SolrConfig.<init> Using Lucene MatchVersion: LUCENE_41
[junit4:junit4]   2> 2382 T349 oasc.SolrConfig.<init> Loaded SolrConfig: solrconfig.xml
[junit4:junit4]   2> 2383 T349 oass.IndexSchema.readSchema Reading Solr Schema
[junit4:junit4]   2> 2387 T349 oass.IndexSchema.readSchema Schema name=test
[junit4:junit4]   2> 2694 T349 oass.OpenExchangeRatesOrgProvider.init Initialized with rates=open-exchange-rates.json, refreshInterval=1440.
[junit4:junit4]   2> 2700 T349 oass.IndexSchema.readSchema default search field in schema is text
[junit4:junit4]   2> 2703 T349 oass.IndexSchema.readSchema unique key field: id
[junit4:junit4]   2> 2709 T349 oass.FileExchangeRateProvider.reload Reloading exchange rates from file currency.xml
[junit4:junit4]   2> 2712 T349 oass.FileExchangeRateProvider.reload Reloading exchange rates from file currency.xml
[junit4:junit4]   2> 2716 T349 oass.OpenExchangeRatesOrgProvider.reload Reloading exchange rates from open-exchange-rates.json
[junit4:junit4]   2> 2717 T349 oass.OpenExchangeRatesOrgProvider.reload Reloading exchange rates from open-exchange-rates.json
[junit4:junit4]   2> 2717 T349 oasc.SolrResourceLoader.locateSolrHome JNDI not configured for solr (NoInitialContextEx)
[junit4:junit4]   2> 2718 T349 oasc.SolrResourceLoader.locateSolrHome using system property solr.solr.home: /mnt/ssd/jenkins/workspace/Lucene-Solr-4.x-Linux/solr/build/solr-core/test-files/solr
[junit4:junit4]   2> 2718 T349 oasc.SolrResourceLoader.<init> new SolrResourceLoader for directory: '/mnt/ssd/jenkins/workspace/Lucene-Solr-4.x-Linux/solr/build/solr-core/test-files/solr/'
[junit4:junit4]   2> 2724 T349 oasc.CoreContainer.<init> New CoreContainer -1745440879
[junit4:junit4]   2> 2725 T349 oasc.SolrCore.<init> [collection1] Opening new SolrCore at /mnt/ssd/jenkins/workspace/Lucene-Solr-4.x-Linux/solr/build/solr-core/test-files/solr/collection1/, dataDir=/mnt/ssd/jenkins/workspace/Lucene-Solr-4.x-Linux/solr/build/solr-core/test/J0/./org.apache.solr.update.AutoCommitTest-1352359631987/
[junit4:junit4]   2> 2725 T349 oasc.JmxMonitoredMap.<init> JMX monitoring is enabled. Adding Solr mbeans to JMX Server: com.sun.jmx.mbeanserver.JmxMBeanServer@19d467ab
[junit4:junit4]   2> 2726 T349 oasc.SolrCore.getNewIndexDir New index directory detected: old=null new=/mnt/ssd/jenkins/workspace/Lucene-Solr-4.x-Linux/solr/build/solr-core/test/J0/./org.apache.solr.update.AutoCommitTest-1352359631987/index/
[junit4:junit4]   2> 2727 T349 oasc.SolrCore.initIndex WARNING [collection1] Solr index directory '/mnt/ssd/jenkins/workspace/Lucene-Solr-4.x-Linux/solr/build/solr-core/test/J0/./org.apache.solr.update.AutoCommitTest-1352359631987/index' doesn't exist. Creating new index...
[junit4:junit4]   2> 2728 T349 oasc.CachingDirectoryFactory.get return new directory for /mnt/ssd/jenkins/workspace/Lucene-Solr-4.x-Linux/solr/build/solr-core/test/J0/./org.apache.solr.update.AutoCommitTest-1352359631987/index forceNew:false
[junit4:junit4]   2> 2729 T349 oasc.SolrDeletionPolicy.onCommit SolrDeletionPolicy.onCommit: commits:num=1
[junit4:junit4]   2> 		commit{dir=MockDirWrapper(org.apache.lucene.store.RAMDirectory@6f4074ad lockFactory=org.apache.lucene.store.NativeFSLockFactory@236ed1c5),segFN=segments_1,generation=1,filenames=[segments_1]
[junit4:junit4]   2> 2730 T349 oasc.SolrDeletionPolicy.updateCommits newest commit = 1
[junit4:junit4]   2> 2730 T349 oasc.SolrCore.initWriters created xml: solr.XMLResponseWriter
[junit4:junit4]   2> 2734 T349 oasup.UpdateRequestProcessorChain.init inserting DistributedUpdateProcessorFactory into updateRequestProcessorChain "dedupe"
[junit4:junit4]   2> 2734 T349 oasup.UpdateRequestProcessorChain.init inserting DistributedUpdateProcessorFactory into updateRequestProcessorChain "dedupe-allfields"
[junit4:junit4]   2> 2735 T349 oasup.UpdateRequestProcessorChain.init inserting DistributedUpdateProcessorFactory into updateRequestProcessorChain "stored_sig"
[junit4:junit4]   2> 2735 T349 oasup.UpdateRequestProcessorChain.init inserting DistributedUpdateProcessorFactory into updateRequestProcessorChain "uniq-fields"
[junit4:junit4]   2> 2736 T349 oasup.UpdateRequestProcessorChain.init inserting DistributedUpdateProcessorFactory into updateRequestProcessorChain "distrib-dup-test-chain-implicit"
[junit4:junit4]   2> 2736 T349 oasc.RequestHandlers.initHandlersFromConfig adding lazy requestHandler: solr.ReplicationHandler
[junit4:junit4]   2> 2737 T349 oasc.RequestHandlers.initHandlersFromConfig created /replication: solr.ReplicationHandler
[junit4:junit4]   2> 2738 T349 oasc.RequestHandlers.initHandlersFromConfig created standard: solr.StandardRequestHandler
[junit4:junit4]   2> 2739 T349 oasc.RequestHandlers.initHandlersFromConfig created /get: solr.RealTimeGetHandler
[junit4:junit4]   2> 2740 T349 oasc.RequestHandlers.initHandlersFromConfig created dismax: solr.SearchHandler
[junit4:junit4]   2> 2741 T349 oasc.RequestHandlers.initHandlersFromConfig created mock: org.apache.solr.core.MockQuerySenderListenerReqHandler
[junit4:junit4]   2> 2742 T349 oasc.RequestHandlers.initHandlersFromConfig created /admin/: org.apache.solr.handler.admin.AdminHandlers
[junit4:junit4]   2> 2743 T349 oasc.RequestHandlers.initHandlersFromConfig created defaults: solr.StandardRequestHandler
[junit4:junit4]   2> 2743 T349 oasc.RequestHandlers.initHandlersFromConfig adding lazy requestHandler: solr.StandardRequestHandler
[junit4:junit4]   2> 2744 T349 oasc.RequestHandlers.initHandlersFromConfig created lazy: solr.StandardRequestHandler
[junit4:junit4]   2> 2745 T349 oasc.RequestHandlers.initHandlersFromConfig created /update: solr.UpdateRequestHandler
[junit4:junit4]   2> 2746 T349 oasc.RequestHandlers.initHandlersFromConfig created /terms: org.apache.solr.handler.component.SearchHandler
[junit4:junit4]   2> 2747 T349 oasc.RequestHandlers.initHandlersFromConfig created spellCheckCompRH: org.apache.solr.handler.component.SearchHandler
[junit4:junit4]   2> 2748 T349 oasc.RequestHandlers.initHandlersFromConfig created spellCheckCompRH_Direct: org.apache.solr.handler.component.SearchHandler
[junit4:junit4]   2> 2749 T349 oasc.RequestHandlers.initHandlersFromConfig created spellCheckWithWordbreak: org.apache.solr.handler.component.SearchHandler
[junit4:junit4]   2> 2750 T349 oasc.RequestHandlers.initHandlersFromConfig created spellCheckWithWordbreak_Direct: org.apache.solr.handler.component.SearchHandler
[junit4:junit4]   2> 2751 T349 oasc.RequestHandlers.initHandlersFromConfig created spellCheckCompRH1: org.apache.solr.handler.component.SearchHandler
[junit4:junit4]   2> 2752 T349 oasc.RequestHandlers.initHandlersFromConfig created tvrh: org.apache.solr.handler.component.SearchHandler
[junit4:junit4]   2> 2753 T349 oasc.RequestHandlers.initHandlersFromConfig created /mlt: solr.MoreLikeThisHandler
[junit4:junit4]   2> 2754 T349 oasc.RequestHandlers.initHandlersFromConfig created /debug/dump: solr.DumpRequestHandler
[junit4:junit4]   2> 2755 T349 oashl.XMLLoader.init xsltCacheLifetimeSeconds=60
[junit4:junit4]   2> 2756 T349 oasc.SolrCore.initDeprecatedSupport WARNING solrconfig.xml uses deprecated <admin/gettableFiles>, Please update your config to use the ShowFileRequestHandler.
[junit4:junit4]   2> 2758 T349 oasc.SolrCore.initDeprecatedSupport WARNING adding ShowFileRequestHandler with hidden files: [BAD-SCHEMA-NOT-INDEXED-BUT-TF.XML, SCHEMA-REQUIRED-FIELDS.XML, SOLRCONFIG-MASTER1-KEEPONEBACKUP.XML, BAD-SCHEMA-NONTEXT-ANALYZER.XML, SOLRCONFIG-PROPINJECT.XML, SOLRCONFIG-PROPINJECT-INDEXDEFAULT.XML, STOP-2.TXT, SCHEMA11.XML, BAD-SCHEMA-UNIQUEKEY-USES-DEFAULT.XML, SCHEMA15.XML, SOLRCONFIG-NATIVELOCK.XML, SCHEMA-SIM.XML, CONDITIONAL.UPDATEPROCESSOR.JS, BAD-SOLRCONFIG-MISSING-SCRIPTFILE.XML, SOLRCONFIG-SCRIPT-UPDATEPROCESSOR.XML, SOLRCONFIG-REPEATER.XML, SOLRCONFIG-SPELLCHECKER.XML, SOLRCONFIG-NOCACHE.XML, SCHEMA-CHARFILTERS.XML, SOLRCONFIG-SOLCOREPROPERTIES.XML, SOLRCONFIG_CODEC.XML, BAD-SCHEMA-EXTERNAL-FILEFIELD.XML, HYPHENATION.DTD, TRIVIAL.UPDATEPROCESSOR1.JS, SCHEMA.XML, SOLRCONFIG-MERGEPOLICY.XML, SOLRCONFIG-PHRASESUGGEST.XML, SOLRCONFIG-SLAVE1.XML, SOLRCONFIG-BASIC.XML, SCHEMA-LMJELINEKMERCER.XML, JASUGGEST.TXT, BAD-MP-SOLRCONFIG.XML, BAD-SCHEMA-DUP-FIELD.XML, BAD-SCHEMA-UNIQUEKEY-MULTIVALUED.XML, SOLRCONFIG-MASTER.XML, SOLRCONFIG-HIGHLIGHT.XML, SCHEMA-TFIDF.XML, SCHEMA-REPLICATION1.XML, SYNONYMS.TXT, SOLRCONFIG-ELEVATE.XML, STOPWITHBOM.TXT, SOLRCONFIG-QUERYSENDER.XML, WDFTYPES.TXT, SOLRCONFIG-SNIPPET-PROCESSOR.XML, SOLRCONFIG-DELPOLICY1.XML, BAD_SOLRCONFIG.XML, HUNSPELL-TEST.DIC, SCHEMA-NUMERIC.XML, SCHEMA-LUCENEMATCHVERSION.XML, KEEP-2.TXT, SCHEMA-STOP-KEEP.XML, SCHEMA-IB.XML, STOP-SNOWBALL.TXT, SOLRCONFIG-INDEXCONFIG.XML, SOLRCONFIG-SLAVE.XML, BAD-SCHEMA-NOT-INDEXED-BUT-NORMS.XML, STOPWORDSWRONGENCODING.TXT, THROW.ERROR.ON.ADD.UPDATEPROCESSOR.JS, STOPTYPES-1.TXT, SOLRCONFIG-SPELLCHECKCOMPONENT.XML, SOLRCONFIG-TLOG.XML, COMPOUNDDICTIONARY.TXT, DA_COMPOUNDDICTIONARY.TXT, SOLRCONFIG-TERMINDEX.XML, BAD-SOLRCONFIG-INVALID-SCRIPTFILE.XML, SCHEMASURROUND.XML, OPEN-EXCHANGE-RATES.JSON, BAD-SCHEMA-DUP-FIELDTYPE.XML, PHRASESUGGEST.TXT, BAD-SCHEMA-CURRENCY-FT-MULTIVALUED.XML, SOLRCONFIG-MASTER2.XML, OLD_SYNONYMS.TXT, BAD-SCHEMA-UNIQUEKEY-IS-COPYFIELD-DEST.XML, SCHEMA-NOT-REQUIRED-UNIQUE-KEY.XML, BAD-SCHEMA-CODEC-GLOBAL-VS-FT-MISMATCH.XML, SCHEMA-LMDIRICHLET.XML, BAD-SCHEMA-NOT-INDEXED-BUT-POS.XML, SCHEMA-REVERSED.XML, BAD-SCHEMA-CURRENCY-MULTIVALUED.XML, SCHEMA-FOLDING.XML, SOLRCONFIG-CACHING.XML, MAPPING-ISOLATIN1ACCENT.TXT, ADDFIELDS.UPDATEPROCESSOR.JS, SCHEMA-BM25.XML, STOP-1.TXT, SOLRCONFIG-ENABLEPLUGIN.XML, MISSING.FUNCTIONS.UPDATEPROCESSOR.JS, SCHEMA12.XML, SOLRCONFIG-TRANSFORMERS.XML, SCHEMA-COPYFIELD-TEST.XML, SOLRCONFIG-BASIC-LUCENEVERSION31.XML, BAD-SCHEMA-DUP-DYNAMICFIELD.XML, CURRENCY.XML, DA_UTF8.XML, MISSLEADING.EXTENSION.UPDATEPROCESSOR.JS.TXT, SOLRCONFIG-SOLR-749.XML, STOPWORDS.TXT, HUNSPELL-TEST.AFF, SOLRCONFIG_PERF.XML, SOLRCONFIG-SIMPLELOCK.XML, FRENCHARTICLES.TXT, SOLRCONFIG-LAZYWRITER.XML, SOLRCONFIG-RESPONSE-LOG-COMPONENT.XML, SCHEMA-REPLICATION2.XML, SCHEMA-SNIPPET-TYPE.XML, SCHEMA-SPATIAL.XML, SOLRCONFIG-XINCLUDE.XML, SCHEMA-SPELLCHECKER.XML, XSLT, SOLRCONFIG-DELPOLICY2.XML, TRIVIAL.UPDATEPROCESSOR0.JS, KEEP-1.TXT, BAD-SCHEMA-CURRENCY-DYNAMIC-MULTIVALUED.XML, SCHEMA-TRIE.XML, SCHEMA-BINARYFIELD.XML, SCHEMA-COLLATEFILTER.XML, BAD-SCHEMA-OMIT-TF-BUT-NOT-POS.XML, SCHEMA-MINIMAL.XML, STOPTYPES-2.TXT, SCHEMA_CODEC.XML, STEMDICT.TXT, ELEVATE.XML, SCHEMA-COLLATE.XML, PROTWORDS.TXT, SCHEMA-XINCLUDE.XML, SCHEMA-SNIPPET-FIELD.XML, SOLRCONFIG-REQHANDLER.INCL, SCHEMA-PHRASESUGGEST.XML, SCHEMA-DFR.XML, BAD-SCHEMA-ANALYZER-CLASS-AND-NESTED.XML, SOLRCONFIG-MASTER1.XML, SOLRCONFIG-FUNCTIONQUERY.XML, SOLRCONFIG-MASTER3.XML, SOLRCONFIG-UPDATE-PROCESSOR-CHAINS.XML, SOLRCONFIG-ALTDIRECTORY.XML, BAD-SCHEMA-SIM-GLOBAL-VS-FT-MISMATCH.XML, SOLRCONFIG-QUERYSENDER-NOQUERY.XML, BAD-SOLRCONFIG-BOGUS-SCRIPTENGINE-NAME.XML]
[junit4:junit4]   2> 2760 T349 oass.SolrIndexSearcher.<init> Opening Searcher@dce4df4d main
[junit4:junit4]   2> 2760 T349 oass.SolrIndexSearcher.getIndexDir WARNING WARNING: Directory impl does not support setting indexDir: org.apache.lucene.store.MockDirectoryWrapper
[junit4:junit4]   2> 2761 T349 oasu.CommitTracker.<init> Hard AutoCommit: disabled
[junit4:junit4]   2> 2761 T349 oasu.CommitTracker.<init> Soft AutoCommit: disabled
[junit4:junit4]   2> 2763 T349 oashc.SpellCheckComponent.inform Initializing spell checkers
[junit4:junit4]   2> 2863 T349 oass.DirectSolrSpellChecker.init init: {name=direct,classname=DirectSolrSpellChecker,field=lowerfilt,minQueryLength=3}
[junit4:junit4]   2> 2889 T349 oashc.HttpShardHandlerFactory.getParameter Setting socketTimeout to: 0
[junit4:junit4]   2> 2890 T349 oashc.HttpShardHandlerFactory.getParameter Setting urlScheme to: http://
[junit4:junit4]   2> 2891 T349 oashc.HttpShardHandlerFactory.getParameter Setting connTimeout to: 0
[junit4:junit4]   2> 2892 T349 oashc.HttpShardHandlerFactory.getParameter Setting maxConnectionsPerHost to: 20
[junit4:junit4]   2> 2893 T349 oashc.HttpShardHandlerFactory.getParameter Setting corePoolSize to: 0
[junit4:junit4]   2> 2895 T349 oashc.HttpShardHandlerFactory.getParameter Setting maximumPoolSize to: 2147483647
[junit4:junit4]   2> 2896 T349 oashc.HttpShardHandlerFactory.getParameter Setting maxThreadIdleTime to: 5
[junit4:junit4]   2> 2897 T349 oashc.HttpShardHandlerFactory.getParameter Setting sizeOfQueue to: -1
[junit4:junit4]   2> 2898 T349 oashc.HttpShardHandlerFactory.getParameter Setting fairnessPolicy to: false
[junit4:junit4]   2> 2899 T349 oascsi.HttpClientUtil.createClient Creating new http client, config:maxConnectionsPerHost=20&maxConnections=10000&socketTimeout=0&connTimeout=0&retry=false
[junit4:junit4]   2> 2919 T350 oasc.SolrCore.registerSearcher [collection1] Registered new searcher Searcher@dce4df4d main{StandardDirectoryReader(segments_1:1)}
[junit4:junit4]   2> 2927 T349 oasc.CoreContainer.register registering core: collection1
[junit4:junit4]   2> 2928 T349 oasu.AbstractSolrTestCase.setUp ####SETUP_END testMaxTime
[junit4:junit4]   2> 4353 T349 oasc.SolrDeletionPolicy.onInit SolrDeletionPolicy.onInit: commits:num=1
[junit4:junit4]   2> 		commit{dir=MockDirWrapper(org.apache.lucene.store.RAMDirectory@6f4074ad lockFactory=org.apache.lucene.store.NativeFSLockFactory@236ed1c5),segFN=segments_1,generation=1,filenames=[segments_1]
[junit4:junit4]   2> 4354 T349 oasc.SolrDeletionPolicy.updateCommits newest commit = 1
[junit4:junit4]   2> 4357 T349 UPDATE [collection1] {add=[529]} 0 1427
[junit4:junit4]   2> 5357 T351 oasu.DirectUpdateHandler2.commit start commit{flags=0,_version_=0,optimize=false,openSearcher=true,waitSearcher=true,expungeDeletes=false,softCommit=true}
[junit4:junit4]   2> 5364 T351 oass.SolrIndexSearcher.<init> Opening Searcher@87ee92b9 main
[junit4:junit4]   2> 5365 T351 oass.SolrIndexSearcher.getIndexDir WARNING WARNING: Directory impl does not support setting indexDir: org.apache.lucene.store.MockDirectoryWrapper
[junit4:junit4]   2> 5366 T351 oasu.DirectUpdateHandler2.commit end_commit_flush
[junit4:junit4]   2> 5369 T350 oasc.SolrCore.registerSearcher [collection1] Registered new searcher Searcher@87ee92b9 main{StandardDirectoryReader(segments_1:3:nrt _0(4.1):C1)}
[junit4:junit4]   2> ASYNC  NEW_CORE C50 name=collection1 org.apache.solr.core.SolrCore@e50e6847
[junit4:junit4]   2> 5578 T349 C50 REQ [collection1] webapp=null path=null params={q=id:529&start=0&qt=standard&version=2.2&rows=20} hits=1 status=0 QTime=1049 
[junit4:junit4]   2> 5619 T349 oasu.AbstractSolrTestCase.tearDown ####TEARDOWN_START testMaxTime
[junit4:junit4]   2> 5620 T349 oasc.CoreContainer.shutdown Shutting down CoreContainer instance=-1745440879
[junit4:junit4]   2> 5620 T349 oasc.SolrCore.close [collection1]  CLOSING SolrCore org.apache.solr.core.SolrCore@e50e6847
[junit4:junit4]   2> 5641 T349 oasu.DirectUpdateHandler2.close closing DirectUpdateHandler2{commits=1,autocommits=0,soft autocommit maxTime=1000ms,soft autocommits=1,optimizes=0,rollbacks=0,expungeDeletes=0,docsPending=1,adds=0,deletesById=0,deletesByQuery=0,errors=0,cumulative_adds=1,cumulative_deletesById=0,cumulative_deletesByQuery=0,cumulative_errors=0}
[junit4:junit4]   2> 5642 T349 oasc.SolrCore.decrefSolrCoreState Closing SolrCoreState
[junit4:junit4]   2> 5642 T349 oasu.DefaultSolrCoreState.closeIndexWriter SolrCoreState ref count has reached 0 - closing IndexWriter
[junit4:junit4]   2> 5643 T349 oasu.DefaultSolrCoreState.closeIndexWriter closing IndexWriter with IndexWriterCloser
[junit4:junit4]   2> 5644 T349 C50 oasc.SolrDeletionPolicy.onCommit SolrDeletionPolicy.onCommit: commits:num=2
[junit4:junit4]   2> 		commit{dir=MockDirWrapper(org.apache.lucene.store.RAMDirectory@6f4074ad lockFactory=org.apache.lucene.store.NativeFSLockFactory@236ed1c5),segFN=segments_1,generation=1,filenames=[segments_1]
[junit4:junit4]   2> 		commit{dir=MockDirWrapper(org.apache.lucene.store.RAMDirectory@6f4074ad lockFactory=org.apache.lucene.store.NativeFSLockFactory@236ed1c5),segFN=segments_2,generation=2,filenames=[_0.si, segments_2, _0_Lucene41_0.pos, _0_Lucene41_0.doc, _0_Lucene41_0.tim, _0.fnm, _0.fdt, _0_Lucene41_0.tip, _0.fdx, _0_nrm.cfs, _0_nrm.cfe]
[junit4:junit4]   2> 5645 T349 C50 oasc.SolrDeletionPolicy.updateCommits newest commit = 2
[junit4:junit4]   2> 5646 T349 oasc.SolrCore.closeSearcher [collection1] Closing main searcher on request.
[junit4:junit4]   2> NOTE: reproduce with: ant test  -Dtestcase=AutoCommitTest -Dtests.method=testMaxTime -Dtests.seed=47EE07ED97E323FB -Dtests.multiplier=3 -Dtests.slow=true -Dtests.locale=ar_IQ -Dtests.timezone=Africa/Malabo -Dtests.file.encoding=ISO-8859-1
[junit4:junit4] FAILURE 3.40s J0 | AutoCommitTest.testMaxTime <<<
[junit4:junit4]    > Throwable #1: java.lang.AssertionError: shouldn't find any query failed XPath: //result[@numFound=0]
[junit4:junit4]    >  xml response was: <?xml version="1.0" encoding="UTF-8"?>
[junit4:junit4]    > <response>
[junit4:junit4]    > <lst name="responseHeader"><int name="status">0</int><int name="QTime">1049</int></lst><result name="response" numFound="1" start="0"><doc><int name="id">529</int><int name="range_facet_si">529</int><arr name="range_facet_l"><long>529</long></arr><arr name="range_facet_sl"><long>529</long></arr><arr name="field_t"><str>what's inside?</str></arr><arr name="subject"><str>info</str></arr><int name="intDefault">42</int><date name="timestamp">2012-11-08T07:27:14.054Z</date><arr name="multiDefault"><str>muLti-Default</str></arr></doc></result>
[junit4:junit4]    > </response>
[junit4:junit4]    > 
[junit4:junit4]    >  request was: q=id:529&start=0&qt=standard&version=2.2&rows=20
[junit4:junit4]    > 	at __randomizedtesting.SeedInfo.seed([47EE07ED97E323FB:DD1A7A0F0979BFC7]:0)
[junit4:junit4]    > 	at org.junit.Assert.fail(Assert.java:93)
[junit4:junit4]    > 	at org.apache.solr.util.AbstractSolrTestCase.assertQ(AbstractSolrTestCase.java:276)
[junit4:junit4]    > 	at org.apache.solr.update.AutoCommitTest.testMaxTime(AutoCommitTest.java:217)
[junit4:junit4]    > 	at sun.reflect.NativeMethodAccessorImpl.invoke0(Native Method)
[junit4:junit4]    > 	at sun.reflect.NativeMethodAccessorImpl.invoke(NativeMethodAccessorImpl.java:88)
[junit4:junit4]    > 	at sun.reflect.DelegatingMethodAccessorImpl.invoke(DelegatingMethodAccessorImpl.java:55)
[junit4:junit4]    > 	at java.lang.reflect.Method.invoke(Method.java:613)
[junit4:junit4]    > 	at com.carrotsearch.randomizedtesting.RandomizedRunner.invoke(RandomizedRunner.java:1559)
[junit4:junit4]    > 	at com.carrotsearch.randomizedtesting.RandomizedRunner.access$600(RandomizedRunner.java:79)
[junit4:junit4]    > 	at com.carrotsearch.randomizedtesting.RandomizedRunner$6.evaluate(RandomizedRunner.java:737)
[junit4:junit4]    > 	at com.carrotsearch.randomizedtesting.RandomizedRunner$7.evaluate(RandomizedRunner.java:773)
[junit4:junit4]    > 	at com.carrotsearch.randomizedtesting.RandomizedRunner$8.evaluate(RandomizedRunner.java:787)
[junit4:junit4]    > 	at com.carrotsearch.randomizedtesting.rules.SystemPropertiesRestoreRule$1.evaluate(SystemPropertiesRestoreRule.java:53)
[junit4:junit4]    > 	at org.apache.lucene.util.TestRuleSetupTeardownChained$1.evaluate(TestRuleSetupTeardownChained.java:50)
[junit4:junit4]    > 	at org.apache.lucene.util.TestRuleFieldCacheSanity$1.evaluate(TestRuleFieldCacheSanity.java:51)
[junit4:junit4]    > 	at org.apache.lucene.util.AbstractBeforeAfterRule$1.evaluate(AbstractBeforeAfterRule.java:45)
[junit4:junit4]    > 	at com.carrotsearch.randomizedtesting.rules.SystemPropertiesInvariantRule$1.evaluate(SystemPropertiesInvariantRule.java:55)
[junit4:junit4]    > 	at org.apache.lucene.util.TestRuleThreadAndTestName$1.evaluate(TestRuleThreadAndTestName.java:48)
[junit4:junit4]    > 	at org.apache.lucene.util.TestRuleIgnoreAfterMaxFailures$1.evaluate(TestRuleIgnoreAfterMaxFailures.java:70)
[junit4:junit4]    > 	at org.apache.lucene.util.TestRuleMarkFailure$1.evaluate(TestRuleMarkFailure.java:48)
[junit4:junit4]    > 	at com.carrotsearch.randomizedtesting.rules.StatementAdapter.evaluate(StatementAdapter.java:36)
[junit4:junit4]    > 	at com.carrotsearch.randomizedtesting.ThreadLeakControl$StatementRunner.run(ThreadLeakControl.java:358)
[junit4:junit4]    > 	at com.carrotsearch.randomizedtesting.ThreadLeakControl.forkTimeoutingTask(ThreadLeakControl.java:782)
[junit4:junit4]    > 	at com.carrotsearch.randomizedtesting.ThreadLeakControl$3.evaluate(ThreadLeakControl.java:442)
[junit4:junit4]    > 	at com.carrotsearch.randomizedtesting.RandomizedRunner.runSingleTest(RandomizedRunner.java:746)
[junit4:junit4]    > 	at com.carrotsearch.randomizedtesting.RandomizedRunner$3.evaluate(RandomizedRunner.java:648)
[junit4:junit4]    > 	at com.carrotsearch.randomizedtesting.RandomizedRunner$4.evaluate(RandomizedRunner.java:682)
[junit4:junit4]    > 	at com.carrotsearch.randomizedtesting.RandomizedRunner$5.evaluate(RandomizedRunner.java:693)
[junit4:junit4]    > 	at com.carrotsearch.randomizedtesting.rules.StatementAdapter.evaluate(StatementAdapter.java:36)
[junit4:junit4]    > 	at com.carrotsearch.randomizedtesting.rules.SystemPropertiesRestoreRule$1.evaluate(SystemPropertiesRestoreRule.java:53)
[junit4:junit4]    > 	at org.apache.lucene.util.AbstractBeforeAfterRule$1.evaluate(AbstractBeforeAfterRule.java:45)
[junit4:junit4]    > 	at org.apache.lucene.util.TestRuleStoreClassName$1.evaluate(TestRuleStoreClassName.java:42)
[junit4:junit4]    > 	at com.carrotsearch.randomizedtesting.rules.SystemPropertiesInvariantRule$1.evaluate(SystemPropertiesInvariantRule.java:55)
[junit4:junit4]    > 	at com.carrotsearch.randomizedtesting.rules.NoShadowingOrOverridesOnMethodsRule$1.evaluate(NoShadowingOrOverridesOnMethodsRule.java:39)
[junit4:junit4]    > 	at com.carrotsearch.randomizedtesting.rules.NoShadowingOrOverridesOnMethodsRule$1.evaluate(NoShadowingOrOverridesOnMethodsRule.java:39)
[junit4:junit4]    > 	at com.carrotsearch.randomizedtesting.rules.StatementAdapter.evaluate(StatementAdapter.java:36)
[junit4:junit4]    > 	at org.apache.lucene.util.TestRuleAssertionsRequired$1.evaluate(TestRuleAssertionsRequired.java:43)
[junit4:junit4]    > 	at org.apache.lucene.util.TestRuleMarkFailure$1.evaluate(TestRuleMarkFailure.java:48)
[junit4:junit4]    > 	at org.apache.lucene.util.TestRuleIgnoreAfterMaxFailures$1.evaluate(TestRuleIgnoreAfterMaxFailures.java:70)
[junit4:junit4]    > 	at org.apache.lucene.util.TestRuleIgnoreTestSuites$1.evaluate(TestRuleIgnoreTestSuites.java:55)
[junit4:junit4]    > 	at com.carrotsearch.randomizedtesting.rules.StatementAdapter.evaluate(StatementAdapter.java:36)
[junit4:junit4]    > 	at com.carrotsearch.randomizedtesting.ThreadLeakControl$StatementRunner.run(ThreadLeakControl.java:358)
[junit4:junit4]    > 	at java.lang.Thread.run(Thread.java:779)
[junit4:junit4]   2> 5690 T349 oasu.AbstractSolrTestCase.setUp ####SETUP_START testCommitWithin
[junit4:junit4]   2> 5691 T349 oasc.SolrResourceLoader.<init> new SolrResourceLoader for directory: '/mnt/ssd/jenkins/workspace/Lucene-Solr-4.x-Linux/solr/build/solr-core/test-files/solr/collection1/'
[junit4:junit4]   2> 5692 T349 oasc.SolrResourceLoader.replaceClassLoader Adding 'file:/mnt/ssd/jenkins/workspace/Lucene-Solr-4.x-Linux/solr/build/solr-core/test-files/solr/collection1/lib/README' to classloader
[junit4:junit4]   2> 5692 T349 oasc.SolrResourceLoader.replaceClassLoader Adding 'file:/mnt/ssd/jenkins/workspace/Lucene-Solr-4.x-Linux/solr/build/solr-core/test-files/solr/collection1/lib/classes/' to classloader
[junit4:junit4]   2> 5722 T349 oasc.SolrConfig.<init> Using Lucene MatchVersion: LUCENE_41
[junit4:junit4]   2> 5770 T349 oasc.SolrConfig.<init> Loaded SolrConfig: solrconfig.xml
[junit4:junit4]   2> 5770 T349 oass.IndexSchema.readSchema Reading Solr Schema
[junit4:junit4]   2> 5775 T349 oass.IndexSchema.readSchema Schema name=test
[junit4:junit4]   2> 6069 T349 oass.OpenExchangeRatesOrgProvider.init Initialized with rates=open-exchange-rates.json, refreshInterval=1440.
[junit4:junit4]   2> 6074 T349 oass.IndexSchema.readSchema default search field in schema is text
[junit4:junit4]   2> 6077 T349 oass.IndexSchema.readSchema unique key field: id
[junit4:junit4]   2> 6083 T349 oass.FileExchangeRateProvider.reload Reloading exchange rates from file currency.xml
[junit4:junit4]   2> 6087 T349 oass.FileExchangeRateProvider.reload Reloading exchange rates from file currency.xml
[junit4:junit4]   2> 6090 T349 oass.OpenExchangeRatesOrgProvider.reload Reloading exchange rates from open-exchange-rates.json
[junit4:junit4]   2> 6091 T349 oass.OpenExchangeRatesOrgProvider.reload Reloading exchange rates from open-exchange-rates.json
[junit4:junit4]   2> 6092 T349 oasc.SolrResourceLoader.locateSolrHome JNDI not configured for solr (NoInitialContextEx)
[junit4:junit4]   2> 6092 T349 oasc.SolrResourceLoader.locateSolrHome using system property solr.solr.home: /mnt/ssd/jenkins/workspace/Lucene-Solr-4.x-Linux/solr/build/solr-core/test-files/solr
[junit4:junit4]   2> 6092 T349 oasc.SolrResourceLoader.<init> new SolrResourceLoader for directory: '/mnt/ssd/jenkins/workspace/Lucene-Solr-4.x-Linux/solr/build/solr-core/test-files/solr/'
[junit4:junit4]   2> 6099 T349 oasc.CoreContainer.<init> New CoreContainer -1124462245
[junit4:junit4]   2> 6099 T349 oasc.SolrCore.<init> [collection1] Opening new SolrCore at /mnt/ssd/jenkins/workspace/Lucene-Solr-4.x-Linux/solr/build/solr-core/test-files/solr/collection1/, dataDir=/mnt/ssd/jenkins/workspace/Lucene-Solr-4.x-Linux/solr/build/solr-core/test/J0/./org.apache.solr.update.AutoCommitTest-1352359635389/
[junit4:junit4]   2> 6100 T349 oasc.JmxMonitoredMap.<init> JMX monitoring is enabled. Adding Solr mbeans to JMX Server: com.sun.jmx.mbeanserver.JmxMBeanServer@19d467ab
[junit4:junit4]   2> 6101 T349 oasc.SolrCore.getNewIndexDir New index directory detected: old=null new=/mnt/ssd/jenkins/workspace/Lucene-Solr-4.x-Linux/solr/build/solr-core/test/J0/./org.apache.solr.update.AutoCommitTest-1352359635389/index/
[junit4:junit4]   2> 6101 T349 oasc.SolrCore.initIndex WARNING [collection1] Solr index directory '/mnt/ssd/jenkins/workspace/Lucene-Solr-4.x-Linux/solr/build/solr-core/test/J0/./org.apache.solr.update.AutoCommitTest-1352359635389/index' doesn't exist. Creating new index...
[junit4:junit4]   2> 6102 T349 oasc.CachingDirectoryFactory.get return new directory for /mnt/ssd/jenkins/workspace/Lucene-Solr-4.x-Linux/solr/build/solr-core/test/J0/./org.apache.solr.update.AutoCommitTest-1352359635389/index forceNew:false
[junit4:junit4]   2> 6103 T349 oasc.SolrDeletionPolicy.onCommit SolrDeletionPolicy.onCommit: commits:num=1
[junit4:junit4]   2> 		commit{dir=MockDirWrapper(org.apache.lucene.store.RAMDirectory@e1968b30 lockFactory=org.apache.lucene.store.NativeFSLockFactory@943d8d9a),segFN=segments_1,generation=1,filenames=[segments_1]
[junit4:junit4]   2> 6104 T349 oasc.SolrDeletionPolicy.updateCommits newest commit = 1
[junit4:junit4]   2> 6104 T349 oasc.SolrCore.initWriters created xml: solr.XMLResponseWriter
[junit4:junit4]   2> 6107 T349 oasup.UpdateRequestProcessorChain.init inserting DistributedUpdateProcessorFactory into updateRequestProcessorChain "dedupe"
[junit4:junit4]   2> 6107 T349 oasup.UpdateRequestProcessorChain.init inserting DistributedUpdateProcessorFactory into updateRequestProcessorChain "dedupe-allfields"
[junit4:junit4]   2> 6108 T349 oasup.UpdateRequestProcessorChain.init inserting DistributedUpdateProcessorFactory into updateRequestProcessorChain "stored_sig"
[junit4:junit4]   2> 6108 T349 oasup.UpdateRequestProcessorChain.init inserting DistributedUpdateProcessorFactory into updateRequestProcessorChain "uniq-fields"
[junit4:junit4]   2> 6109 T349 oasup.UpdateRequestProcessorChain.init inserting DistributedUpdateProcessorFactory into updateRequestProcessorChain "distrib-dup-test-chain-implicit"
[junit4:junit4]   2> 6109 T349 oasc.RequestHandlers.initHandlersFromConfig adding lazy requestHandler: solr.ReplicationHandler
[junit4:junit4]   2> 6110 T349 oasc.RequestHandlers.initHandlersFromConfig created /replication: solr.ReplicationHandler
[junit4:junit4]   2> 6111 T349 oasc.RequestHandlers.initHandlersFromConfig created standard: solr.StandardRequestHandler
[junit4:junit4]   2> 6111 T349 oasc.RequestHandlers.initHandlersFromConfig created /get: solr.RealTimeGetHandler
[junit4:junit4]   2> 6112 T349 oasc.RequestHandlers.initHandlersFromConfig created dismax: solr.SearchHandler
[junit4:junit4]   2> 6113 T349 oasc.RequestHandlers.initHandlersFromConfig created mock: org.apache.solr.core.MockQuerySenderListenerReqHandler
[junit4:junit4]   2> 6114 T349 oasc.RequestHandlers.initHandlersFromConfig created /admin/: org.apache.solr.handler.admin.AdminHandlers
[junit4:junit4]   2> 6114 T349 oasc.RequestHandlers.initHandlersFromConfig created defaults: solr.StandardRequestHandler
[junit4:junit4]   2> 6115 T349 oasc.RequestHandlers.initHandlersFromConfig adding lazy requestHandler: solr.StandardRequestHandler
[junit4:junit4]   2> 6115 T349 oasc.RequestHandlers.initHandlersFromConfig created lazy: solr.StandardRequestHandler
[junit4:junit4]   2> 6116 T349 oasc.RequestHandlers.initHandlersFromConfig created /update: solr.UpdateRequestHandler
[junit4:junit4]   2> 6117 T349 oasc.RequestHandlers.initHandlersFromConfig created /terms: org.apache.solr.handler.component.SearchHandler
[junit4:junit4]   2> 6118 T349 oasc.RequestHandlers.initHandlersFromConfig created spellCheckCompRH: org.apache.solr.handler.component.SearchHandler
[junit4:junit4]   2> 6118 T349 oasc.RequestHandlers.initHandlersFromConfig created spellCheckCompRH_Direct: org.apache.solr.handler.component.SearchHandler
[junit4:junit4]   2> 6119 T349 oasc.RequestHandlers.initHandlersFromConfig created spellCheckWithWordbreak: org.apache.solr.handler.component.SearchHandler
[junit4:junit4]   2> 6120 T349 oasc.RequestHandlers.initHandlersFromConfig created spellCheckWithWordbreak_Direct: org.apache.solr.handler.component.SearchHandler
[junit4:junit4]   2> 6121 T349 oasc.RequestHandlers.initHandlersFromConfig created spellCheckCompRH1: org.apache.solr.handler.component.SearchHandler
[junit4:junit4]   2> 6121 T349 oasc.RequestHandlers.initHandlersFromConfig created tvrh: org.apache.solr.handler.component.SearchHandler
[junit4:junit4]   2> 6122 T349 oasc.RequestHandlers.initHandlersFromConfig created /mlt: solr.MoreLikeThisHandler
[junit4:junit4]   2> 6123 T349 oasc.RequestHandlers.initHandlersFromConfig created /debug/dump: solr.DumpRequestHandler
[junit4:junit4]   2> 6124 T349 oashl.XMLLoader.init xsltCacheLifetimeSeconds=60
[junit4:junit4]   2> 6126 T349 oasc.SolrCore.initDeprecatedSupport WARNING solrconfig.xml uses deprecated <admin/gettableFiles>, Please update your config to use the ShowFileRequestHandler.
[junit4:junit4]   2> 6127 T349 oasc.SolrCore.initDeprecatedSupport WARNING adding ShowFileRequestHandler with hidden files: [BAD-SCHEMA-NOT-INDEXED-BUT-TF.XML, SCHEMA-REQUIRED-FIELDS.XML, SOLRCONFIG-MASTER1-KEEPONEBACKUP.XML, BAD-SCHEMA-NONTEXT-ANALYZER.XML, SOLRCONFIG-PROPINJECT.XML, SOLRCONFIG-PROPINJECT-INDEXDEFAULT.XML, STOP-2.TXT, SCHEMA11.XML, BAD-SCHEMA-UNIQUEKEY-USES-DEFAULT.XML, SCHEMA15.XML, SOLRCONFIG-NATIVELOCK.XML, SCHEMA-SIM.XML, CONDITIONAL.UPDATEPROCESSOR.JS, BAD-SOLRCONFIG-MISSING-SCRIPTFILE.XML, SOLRCONFIG-SCRIPT-UPDATEPROCESSOR.XML, SOLRCONFIG-REPEATER.XML, SOLRCONFIG-SPELLCHECKER.XML, SOLRCONFIG-NOCACHE.XML, SCHEMA-CHARFILTERS.XML, SOLRCONFIG-SOLCOREPROPERTIES.XML, SOLRCONFIG_CODEC.XML, BAD-SCHEMA-EXTERNAL-FILEFIELD.XML, HYPHENATION.DTD, TRIVIAL.UPDATEPROCESSOR1.JS, SCHEMA.XML, SOLRCONFIG-MERGEPOLICY.XML, SOLRCONFIG-PHRASESUGGEST.XML, SOLRCONFIG-SLAVE1.XML, SOLRCONFIG-BASIC.XML, SCHEMA-LMJELINEKMERCER.XML, JASUGGEST.TXT, BAD-MP-SOLRCONFIG.XML, BAD-SCHEMA-DUP-FIELD.XML, BAD-SCHEMA-UNIQUEKEY-MULTIVALUED.XML, SOLRCONFIG-MASTER.XML, SOLRCONFIG-HIGHLIGHT.XML, SCHEMA-TFIDF.XML, SCHEMA-REPLICATION1.XML, SYNONYMS.TXT, SOLRCONFIG-ELEVATE.XML, STOPWITHBOM.TXT, SOLRCONFIG-QUERYSENDER.XML, WDFTYPES.TXT, SOLRCONFIG-SNIPPET-PROCESSOR.XML, SOLRCONFIG-DELPOLICY1.XML, BAD_SOLRCONFIG.XML, HUNSPELL-TEST.DIC, SCHEMA-NUMERIC.XML, SCHEMA-LUCENEMATCHVERSION.XML, KEEP-2.TXT, SCHEMA-STOP-KEEP.XML, SCHEMA-IB.XML, STOP-SNOWBALL.TXT, SOLRCONFIG-INDEXCONFIG.XML, SOLRCONFIG-SLAVE.XML, BAD-SCHEMA-NOT-INDEXED-BUT-NORMS.XML, STOPWORDSWRONGENCODING.TXT, THROW.ERROR.ON.ADD.UPDATEPROCESSOR.JS, STOPTYPES-1.TXT, SOLRCONFIG-SPELLCHECKCOMPONENT.XML, SOLRCONFIG-TLOG.XML, COMPOUNDDICTIONARY.TXT, DA_COMPOUNDDICTIONARY.TXT, SOLRCONFIG-TERMINDEX.XML, BAD-SOLRCONFIG-INVALID-SCRIPTFILE.XML, SCHEMASURROUND.XML, OPEN-EXCHANGE-RATES.JSON, BAD-SCHEMA-DUP-FIELDTYPE.XML, PHRASESUGGEST.TXT, BAD-SCHEMA-CURRENCY-FT-MULTIVALUED.XML, SOLRCONFIG-MASTER2.XML, OLD_SYNONYMS.TXT, BAD-SCHEMA-UNIQUEKEY-IS-COPYFIELD-DEST.XML, SCHEMA-NOT-REQUIRED-UNIQUE-KEY.XML, BAD-SCHEMA-CODEC-GLOBAL-VS-FT-MISMATCH.XML, SCHEMA-LMDIRICHLET.XML, BAD-SCHEMA-NOT-INDEXED-BUT-POS.XML, SCHEMA-REVERSED.XML, BAD-SCHEMA-CURRENCY-MULTIVALUED.XML, SCHEMA-FOLDING.XML, SOLRCONFIG-CACHING.XML, MAPPING-ISOLATIN1ACCENT.TXT, ADDFIELDS.UPDATEPROCESSOR.JS, SCHEMA-BM25.XML, STOP-1.TXT, SOLRCONFIG-ENABLEPLUGIN.XML, MISSING.FUNCTIONS.UPDATEPROCESSOR.JS, SCHEMA12.XML, SOLRCONFIG-TRANSFORMERS.XML, SCHEMA-COPYFIELD-TEST.XML, SOLRCONFIG-BASIC-LUCENEVERSION31.XML, BAD-SCHEMA-DUP-DYNAMICFIELD.XML, CURRENCY.XML, DA_UTF8.XML, MISSLEADING.EXTENSION.UPDATEPROCESSOR.JS.TXT, SOLRCONFIG-SOLR-749.XML, STOPWORDS.TXT, HUNSPELL-TEST.AFF, SOLRCONFIG_PERF.XML, SOLRCONFIG-SIMPLELOCK.XML, FRENCHARTICLES.TXT, SOLRCONFIG-LAZYWRITER.XML, SOLRCONFIG-RESPONSE-LOG-COMPONENT.XML, SCHEMA-REPLICATION2.XML, SCHEMA-SNIPPET-TYPE.XML, SCHEMA-SPATIAL.XML, SOLRCONFIG-XINCLUDE.XML, SCHEMA-SPELLCHECKER.XML, XSLT, SOLRCONFIG-DELPOLICY2.XML, TRIVIAL.UPDATEPROCESSOR0.JS, KEEP-1.TXT, BAD-SCHEMA-CURRENCY-DYNAMIC-MULTIVALUED.XML, SCHEMA-TRIE.XML, SCHEMA-BINARYFIELD.XML, SCHEMA-COLLATEFILTER.XML, BAD-SCHEMA-OMIT-TF-BUT-NOT-POS.XML, SCHEMA-MINIMAL.XML, STOPTYPES-2.TXT, SCHEMA_CODEC.XML, STEMDICT.TXT, ELEVATE.XML, SCHEMA-COLLATE.XML, PROTWORDS.TXT, SCHEMA-XINCLUDE.XML, SCHEMA-SNIPPET-FIELD.XML, SOLRCONFIG-REQHANDLER.INCL, SCHEMA-PHRASESUGGEST.XML, SCHEMA-DFR.XML, BAD-SCHEMA-ANALYZER-CLASS-AND-NESTED.XML, SOLRCONFIG-MASTER1.XML, SOLRCONFIG-FUNCTIONQUERY.XML, SOLRCONFIG-MASTER3.XML, SOLRCONFIG-UPDATE-PROCESSOR-CHAINS.XML, SOLRCONFIG-ALTDIRECTORY.XML, BAD-SCHEMA-SIM-GLOBAL-VS-FT-MISMATCH.XML, SOLRCONFIG-QUERYSENDER-NOQUERY.XML, BAD-SOLRCONFIG-BOGUS-SCRIPTENGINE-NAME.XML]
[junit4:junit4]   2> 6129 T349 oass.SolrIndexSearcher.<init> Opening Searcher@5f89ad32 main
[junit4:junit4]   2> 6129 T349 oass.SolrIndexSearcher.getIndexDir WARNING WARNING: Directory impl does not support setting indexDir: org.apache.lucene.store.MockDirectoryWrapper
[junit4:junit4]   2> 6130 T349 oasu.CommitTracker.<init> Hard AutoCommit: disabled
[junit4:junit4]   2> 6130 T349 oasu.CommitTracker.<init> Soft AutoCommit: disabled
[junit4:junit4]   2> 6131 T349 oashc.SpellCheckComponent.inform Initializing spell checkers
[junit4:junit4]   2> 6282 T349 oass.DirectSolrSpellChecker.init init: {name=direct,classname=DirectSolrSpellChecker,field=lowerfilt,minQueryLength=3}
[junit4:junit4]   2> 6298 T349 oashc.HttpShardHandlerFactory.getParameter Setting socketTimeout to: 0
[junit4:junit4]   2> 6299 T349 oashc.HttpShardHandlerFactory.getParameter Setting urlScheme to: http://
[junit4:junit4]   2> 6299 T349 oashc.HttpShardHandlerFactory.getParameter Setting connTimeout to: 0
[junit4:junit4]   2> 6300 T349 oashc.HttpShardHandlerFactory.getParameter Setting maxConnectionsPerHost to: 20
[junit4:junit4]   2> 6300 T349 oashc.HttpShardHandlerFactory.getParameter Setting corePoolSize to: 0
[junit4:junit4]   2> 6300 T349 oashc.HttpShardHandlerFactory.getParameter Setting maximumPoolSize to: 2147483647
[junit4:junit4]   2> 6301 T349 oashc.HttpShardHandlerFactory.getParameter Setting maxThreadIdleTime to: 5
[junit4:junit4]   2> 6301 T349 oashc.HttpShardHandlerFactory.getParameter Setting sizeOfQueue to: -1
[junit4:junit4]   2> 6302 T349 oashc.HttpShardHandlerFactory.getParameter Setting fairnessPolicy to: false
[junit4:junit4]   2> 6302 T349 oascsi.HttpClientUtil.createClient Creating new http client, config:maxConnectionsPerHost=20&maxConnections=10000&socketTimeout=0&connTimeout=0&retry=false
[junit4:junit4]   2> 6313 T352 oasc.SolrCore.registerSearcher [collection1] Registered new searcher Searcher@5f89ad32 main{StandardDirectoryReader(segments_1:1)}
[junit4:junit4]   2> 6320 T349 oasc.CoreContainer.register registering core: collection1
[junit4:junit4]   2> 6322 T349 oasu.AbstractSolrTestCase.setUp ####SETUP_END testCommitWithin
[junit4:junit4]   2> 6384 T349 oasc.SolrDeletionPolicy.onInit SolrDeletionPolicy.onInit: commits:num=1
[junit4:junit4]   2> 		commit{dir=MockDirWrapper(org.apache.lucene.store.RAMDirectory@e1968b30 lockFactory=org.apache.lucene.store.NativeFSLockFactory@943d8d9a),segFN=segments_1,generation=1,filenames=[segments_1]
[junit4:junit4]   2> 6384 T349 oasc.SolrDeletionPolicy.updateCommits newest commit = 1
[junit4:junit4]   2> 6386 T349 UPDATE [collection1] {add=[529]} 0 63
[junit4:junit4]   2> ASYNC  NEW_CORE C51 name=collection1 org.apache.solr.core.SolrCore@432eeaa2
[junit4:junit4]   2> 6441 T349 C51 REQ [collection1] webapp=null path=null params={q=id:529&start=0&qt=standard&version=2.2&rows=20} hits=0 status=0 QTime=54 
[junit4:junit4]   2> 7386 T353 oasu.DirectUpdateHandler2.commit start commit{flags=0,_version_=0,optimize=false,openSearcher=true,waitSearcher=true,expungeDeletes=false,softCommit=true}
[junit4:junit4]   2> 7439 T353 oass.SolrIndexSearcher.<init> Opening Searcher@6a70b129 main
[junit4:junit4]   2> 7440 T353 oass.SolrIndexSearcher.getIndexDir WARNING WARNING: Directory impl does not support setting indexDir: org.apache.lucene.store.MockDirectoryWrapper
[junit4:junit4]   2> 7440 T353 oasu.DirectUpdateHandler2.commit end_commit_flush
[junit4:junit4]   2> 7442 T352 oasc.SolrCore.registerSearcher [collection1] Registered new searcher Searcher@6a70b129 main{StandardDirectoryReader(segments_1:3:nrt _0(4.1):C1)}
[junit4:junit4]   2> 7468 T349 UPDATE [collection1] {add=[530]} 0 63
[junit4:junit4]   2> 7469 T349 C51 REQ [collection1] webapp=null path=null params={q=id:530&start=0&qt=standard&version=2.2&rows=20} hits=0 status=0 QTime=0 
[junit4:junit4]   2> 7471 T349 UPDATE [collection1] {delete=[529]} 0 63
[junit4:junit4]   2> 7471 T349 C51 REQ [collection1] webapp=null path=null params={q=id:529&start=0&qt=standard&version=2.2&rows=20} hits=1 status=0 QTime=0 
[junit4:junit4]   2> 8471 T353 oasu.DirectUpdateHandler2.commit start commit{flags=0,_version_=0,optimize=false,openSearcher=true,waitSearcher=true,expungeDeletes=false,softCommit=true}
[junit4:junit4]   2> 8474 T353 oass.SolrIndexSearcher.<init> Opening Searcher@33ba7ae2 main
[junit4:junit4]   2> 8474 T353 oass.SolrIndexSearcher.getIndexDir WARNING WARNING: Directory impl does not support setting indexDir: org.apache.lucene.store.MockDirectoryWrapper
[junit4:junit4]   2> 8474 T353 oasu.DirectUpdateHandler2.commit end_commit_flush
[junit4:junit4]   2> 8477 T352 oasc.SolrCore.registerSearcher [collection1] Registered new searcher Searcher@33ba7ae2 main{StandardDirectoryReader(segments_1:7:nrt _1(4.1):C1)}
[junit4:junit4]   2> 8723 T349 C51 REQ [collection1] webapp=null path=null params={q=id:529&start=0&qt=standard&version=2.2&rows=20} hits=0 status=0 QTime=0 
[junit4:junit4]   2> 8724 T349 C51 REQ [collection1] webapp=null path=null params={q=id:530&start=0&qt=standard&version=2.2&rows=20} hits=1 status=0 QTime=0 
[junit4:junit4]   2> 8726 T349 UPDATE [collection1] {add=[500]} 0 63
[junit4:junit4]   2> 8727 T349 UPDATE [collection1] {add=[500]} 0 63
[junit4:junit4]   2> 8728 T349 UPDATE [collection1] {add=[500]} 0 63
[junit4:junit4]   2> 8729 T349 UPDATE [collection1] {add=[500]} 0 63
[junit4:junit4]   2> 8730 T349 UPDATE [collection1] {add=[500]} 0 63
[junit4:junit4]   2> 8730 T349 UPDATE [collection1] {add=[500]} 0 63
[junit4:junit4]   2> 8731 T349 UPDATE [collection1] {add=[500]} 0 63
[junit4:junit4]   2> 8732 T349 UPDATE [collection1] {add=[500]} 0 63
[junit4:junit4]   2> 8733 T349 UPDATE [collection1] {add=[500]} 0 63
[junit4:junit4]   2> 8735 T349 UPDATE [collection1] {add=[500]} 0 63
[junit4:junit4]   2> 8735 T349 C51 REQ [collection1] webapp=null path=null params={q=id:500&start=0&qt=standard&version=2.2&rows=20} hits=0 status=0 QTime=0 
[junit4:junit4]   2> 8737 T349 UPDATE [collection1] {delete=[530]} 0 63
[junit4:junit4]   2> 8737 T349 UPDATE [collection1] {delete=[530]} 0 63
[junit4:junit4]   2> 8738 T349 UPDATE [collection1] {delete=[530]} 0 63
[junit4:junit4]   2> 8738 T349 UPDATE [collection1] {delete=[530]} 0 63
[junit4:junit4]   2> 8739 T349 UPDATE [collection1] {delete=[530]} 0 63
[junit4:junit4]   2> 8739 T349 UPDATE [collection1] {delete=[530]} 0 63
[junit4:junit4]   2> 8740 T349 UPDATE [collection1] {delete=[530]} 0 63
[junit4:junit4]   2> 8740 T349 UPDATE [collection1] {delete=[530]} 0 63
[junit4:junit4]   2> 8741 T349 UPDATE [collection1] {delete=[530]} 0 63
[junit4:junit4]   2> 8741 T349 UPDATE [collection1] {delete=[530]} 0 63
[junit4:junit4]   2> 8742 T349 C51 REQ [collection1] webapp=null path=null params={q=id:530&start=0&qt=standard&version=2.2&rows=20} hits=1 status=0 QTime=0 
[junit4:junit4]   2> 9727 T353 oasu.DirectUpdateHandler2.commit start commit{flags=0,_version_=0,optimize=false,openSearcher=true,waitSearcher=true,expungeDeletes=false,softCommit=true}
[junit4:junit4]   2> 9728 T353 oass.SolrIndexSearcher.<init> Opening Searcher@e214a6cc main
[junit4:junit4]   2> 9728 T353 oass.SolrIndexSearcher.getIndexDir WARNING WARNING: Directory impl does not support setting indexDir: org.apache.lucene.store.MockDirectoryWrapper
[junit4:junit4]   2> 9729 T353 oasu.DirectUpdateHandler2.commit end_commit_flush
[junit4:junit4]   2> 9731 T352 oasc.SolrCore.registerSearcher [collection1] Registered new searcher Searcher@e214a6cc main{StandardDirectoryReader(segments_1:11:nrt _2(4.1):C10/9)}
[junit4:junit4]   2> 9744 T349 C51 REQ [collection1] webapp=null path=null params={q=id:500&start=0&qt=standard&version=2.2&rows=20} hits=1 status=0 QTime=0 
[junit4:junit4]   2> 9745 T349 C51 REQ [collection1] webapp=null path=null params={q=id:530&start=0&qt=standard&version=2.2&rows=20} hits=0 status=0 QTime=0 
[junit4:junit4]   2> 9746 T349 oasu.AbstractSolrTestCase.tearDown ####TEARDOWN_START testCommitWithin
[junit4:junit4]   2> 9747 T349 oasc.CoreContainer.shutdown Shutting down CoreContainer instance=-1124462245
[junit4:junit4]   2> 9747 T349 oasc.SolrCore.close [collection1]  CLOSING SolrCore org.apache.solr.core.SolrCore@432eeaa2
[junit4:junit4]   2> 9760 T349 oasu.DirectUpdateHandler2.close closing DirectUpdateHandler2{commits=3,autocommits=0,soft autocommits=3,optimizes=0,rollbacks=0,expungeDeletes=0,docsPending=12,adds=0,deletesById=0,deletesByQuery=0,errors=0,cumulative_adds=12,cumulative_deletesById=11,cumulative_deletesByQuery=0,cumulative_errors=0}
[junit4:junit4]   2> 9761 T349 oasc.SolrCore.decrefSolrCoreState Closing SolrCoreState
[junit4:junit4]   2> 9761 T349 oasu.DefaultSolrCoreState.closeIndexWriter SolrCoreState ref count has reached 0 - closing IndexWriter
[junit4:junit4]   2> 9762 T349 oasu.DefaultSolrCoreState.closeIndexWriter closing IndexWriter with IndexWriterCloser
[junit4:junit4]   2> 9762 T349 C51 oasc.SolrDeletionPolicy.onCommit SolrDeletionPolicy.onCommit: commits:num=2
[junit4:junit4]   2> 		commit{dir=MockDirWrapper(org.apache.lucene.store.RAMDirectory@e1968b30 lockFactory=org.apache.lucene.store.NativeFSLockFactory@943d8d9a),segFN=segments_1,generation=1,filenames=[segments_1]
[junit4:junit4]   2> 		commit{dir=MockDirWrapper(org.apache.lucene.store.RAMDirectory@e1968b30 lockFactory=org.apache.lucene.store.NativeFSLockFactory@943d8d9a),segFN=segments_2,generation=2,filenames=[_2.si, _2_nrm.cfe, _2_Lucene41_0.pos, _2_1.del, segments_2, _2_Lucene41_0.doc, _2_Lucene41_0.tim, _2_Lucene41_0.tip, _2.fnm, _2.fdt, _2.fdx, _2_nrm.cfs]
[junit4:junit4]   2> 9763 T349 C51 oasc.SolrDeletionPolicy.updateCommits newest commit = 2
[junit4:junit4]   2> 9764 T349 oasc.SolrCore.closeSearcher [collection1] Closing main searcher on request.
[junit4:junit4]   2> 9775 T349 oasu.AbstractSolrTestCase.setUp ####SETUP_START testMaxDocs
[junit4:junit4]   2> 9776 T349 oasc.SolrResourceLoader.<init> new SolrResourceLoader for directory: '/mnt/ssd/jenkins/workspace/Lucene-Solr-4.x-Linux/solr/build/solr-core/test-files/solr/collection1/'
[junit4:junit4]   2> 9777 T349 oasc.SolrResourceLoader.replaceClassLoader Adding 'file:/mnt/ssd/jenkins/workspace/Lucene-Solr-4.x-Linux/solr/build/solr-core/test-files/solr/collection1/lib/README' to classloader
[junit4:junit4]   2> 9778 T349 oasc.SolrResourceLoader.replaceClassLoader Adding 'file:/mnt/ssd/jenkins/workspace/Lucene-Solr-4.x-Linux/solr/build/solr-core/test-files/solr/collection1/lib/classes/' to classloader
[junit4:junit4]   2> 9804 T349 oasc.SolrConfig.<init> Using Lucene MatchVersion: LUCENE_41
[junit4:junit4]   2> 9846 T349 oasc.SolrConfig.<init> Loaded SolrConfig: solrconfig.xml
[junit4:junit4]   2> 9847 T349 oass.IndexSchema.readSchema Reading Solr Schema
[junit4:junit4]   2> 9851 T349 oass.IndexSchema.readSchema Schema name=test
[junit4:junit4]   2> 10151 T349 oass.OpenExchangeRatesOrgProvider.init Initialized with rates=open-exchange-rates.json, refreshInterval=1440.
[junit4:junit4]   2> 10156 T349 oass.IndexSchema.readSchema default search field in schema is text
[junit4:junit4]   2> 10159 T349 oass.IndexSchema.readSchema unique key field: id
[junit4:junit4]   2> 10164 T349 oass.FileExchangeRateProvider.reload Reloading exchange rates from file currency.xml
[junit4:junit4]   2> 10167 T349 oass.FileExchangeRateProvider.reload Reloading exchange rates from file currency.xml
[junit4:junit4]   2> 10170 T349 oass.OpenExchangeRatesOrgProvider.reload Reloading exchange rates from open-exchange-rates.json
[junit4:junit4]   2> 10171 T349 oass.OpenExchangeRatesOrgProvider.reload Reloading exchange rates from open-exchange-rates.json
[junit4:junit4]   2> 10172 T349 oasc.SolrResourceLoader.locateSolrHome JNDI not configured for solr (NoInitialContextEx)
[junit4:junit4]   2> 10172 T349 oasc.SolrResourceLoader.locateSolrHome using system property solr.solr.home: /mnt/ssd/jenkins/workspace/Lucene-Solr-4.x-Linux/solr/build/solr-core/test-files/solr
[junit4:junit4]   2> 10173 T349 oasc.SolrResourceLoader.<init> new SolrResourceLoader for directory: '/mnt/ssd/jenkins/workspace/Lucene-Solr-4.x-Linux/solr/build/solr-core/test-files/solr/'
[junit4:junit4]   2> 10179 T349 oasc.CoreContainer.<init> New CoreContainer 139192990
[junit4:junit4]   2> 10179 T349 oasc.SolrCore.<init> [collection1] Opening new SolrCore at /mnt/ssd/jenkins/workspace/Lucene-Solr-4.x-Linux/solr/build/solr-core/test-files/solr/collection1/, dataDir=/mnt/ssd/jenkins/workspace/Lucene-Solr-4.x-Linux/solr/build/solr-core/test/J0/./org.apache.solr.update.AutoCommitTest-1352359639475/
[junit4:junit4]   2> 10180 T349 oasc.JmxMonitoredMap.<init> JMX monitoring is enabled. Adding Solr mbeans to JMX Server: com.sun.jmx.mbeanserver.JmxMBeanServer@19d467ab
[junit4:junit4]   2> 10181 T349 oasc.SolrCore.getNewIndexDir New index directory detected: old=null new=/mnt/ssd/jenkins/workspace/Lucene-Solr-4.x-Linux/solr/build/solr-core/test/J0/./org.apache.solr.update.AutoCommitTest-1352359639475/index/
[junit4:junit4]   2> 10181 T349 oasc.SolrCore.initIndex WARNING [collection1] Solr index directory '/mnt/ssd/jenkins/workspace/Lucene-Solr-4.x-Linux/solr/build/solr-core/test/J0/./org.apache.solr.update.AutoCommitTest-1352359639475/index' doesn't exist. Creating new index...
[junit4:junit4]   2> 10182 T349 oasc.CachingDirectoryFactory.get return new directory for /mnt/ssd/jenkins/workspace/Lucene-Solr-4.x-Linux/solr/build/solr-core/test/J0/./org.apache.solr.update.AutoCommitTest-1352359639475/index forceNew:false
[junit4:junit4]   2> 10183 T349 oasc.SolrDeletionPolicy.onCommit SolrDeletionPolicy.onCommit: commits:num=1
[junit4:junit4]   2> 		commit{dir=MockDirWrapper(org.apache.lucene.store.RAMDirectory@fa0aaf46 lockFactory=org.apache.lucene.store.NativeFSLockFactory@83dc9c9c),segFN=segments_1,generation=1,filenames=[segments_1]
[junit4:junit4]   2> 10184 T349 oasc.SolrDeletionPolicy.updateCommits newest commit = 1
[junit4:junit4]   2> 10184 T349 oasc.SolrCore.initWriters created xml: solr.XMLResponseWriter
[junit4:junit4]   2> 10186 T349 oasup.UpdateRequestProcessorChain.init inserting DistributedUpdateProcessorFactory into updateRequestProcessorChain "dedupe"
[junit4:junit4]   2> 10187 T349 oasup.UpdateRequestProcessorChain.init inserting DistributedUpdateProcessorFactory into updateRequestProcessorChain "dedupe-allfields"
[junit4:junit4]   2> 10187 T349 oasup.UpdateRequestProcessorChain.init inserting DistributedUpdateProcessorFactory into updateRequestProcessorChain "stored_sig"
[junit4:junit4]   2> 10188 T349 oasup.UpdateRequestProcessorChain.init inserting DistributedUpdateProcessorFactory into updateRequestProcessorChain "uniq-fields"
[junit4:junit4]   2> 10188 T349 oasup.UpdateRequestProcessorChain.init inserting DistributedUpdateProcessorFactory into updateRequestProcessorChain "distrib-dup-test-chain-implicit"
[junit4:junit4]   2> 10189 T349 oasc.RequestHandlers.initHandlersFromConfig adding lazy requestHandler: solr.ReplicationHandler
[junit4:junit4]   2> 10189 T349 oasc.RequestHandlers.initHandlersFromConfig created /replication: solr.ReplicationHandler
[junit4:junit4]   2> 10190 T349 oasc.RequestHandlers.initHandlersFromConfig created standard: solr.StandardRequestHandler
[junit4:junit4]   2> 10190 T349 oasc.RequestHandlers.initHandlersFromConfig created /get: solr.RealTimeGetHandler
[junit4:junit4]   2> 10191 T349 oasc.RequestHandlers.initHandlersFromConfig created dismax: solr.SearchHandler
[junit4:junit4]   2> 10192 T349 oasc.RequestHandlers.initHandlersFromConfig created mock: org.apache.solr.core.MockQuerySenderListenerReqHandler
[junit4:junit4]   2> 10192 T349 oasc.RequestHandlers.initHandlersFromConfig created /admin/: org.apache.solr.handler.admin.AdminHandlers
[junit4:junit4]   2> 10193 T349 oasc.RequestHandlers.initHandlersFromConfig created defaults: solr.StandardRequestHandler
[junit4:junit4]   2> 10194 T349 oasc.RequestHandlers.initHandlersFromConfig adding lazy requestHandler: solr.StandardRequestHandler
[junit4:junit4]   2> 10194 T349 oasc.RequestHandlers.initHandlersFromConfig created lazy: solr.StandardRequestHandler
[junit4:junit4]   2> 10195 T349 oasc.RequestHandlers.initHandlersFromConfig created /update: solr.UpdateRequestHandler
[junit4:junit4]   2> 10195 T349 oasc.RequestHandlers.initHandlersFromConfig created /terms: org.apache.solr.handler.component.SearchHandler
[junit4:junit4]   2> 10196 T349 oasc.RequestHandlers.initHandlersFromConfig created spellCheckCompRH: org.apache.solr.handler.component.SearchHandler
[junit4:junit4]   2> 10197 T349 oasc.RequestHandlers.initHandlersFromConfig created spellCheckCompRH_Direct: org.apache.solr.handler.component.SearchHandler
[junit4:junit4]   2> 10198 T349 oasc.RequestHandlers.initHandlersFromConfig created spellCheckWithWordbreak: org.apache.solr.handler.component.SearchHandler
[junit4:junit4]   2> 10198 T349 oasc.RequestHandlers.initHandlersFromConfig created spellCheckWithWordbreak_Direct: org.apache.solr.handler.component.SearchHandler
[junit4:junit4]   2> 10199 T349 oasc.RequestHandlers.initHandlersFromConfig created spellCheckCompRH1: org.apache.solr.handler.component.SearchHandler
[junit4:junit4]   2> 10200 T349 oasc.RequestHandlers.initHandlersFromConfig created tvrh: org.apache.solr.handler.component.SearchHandler
[junit4:junit4]   2> 10200 T349 oasc.RequestHandlers.initHandlersFromConfig created /mlt: solr.MoreLikeThisHandler
[junit4:junit4]   2> 10201 T349 oasc.RequestHandlers.initHandlersFromConfig created /debug/dump: solr.DumpRequestHandler
[junit4:junit4]   2> 10202 T349 oashl.XMLLoader.init xsltCacheLifetimeSeconds=60
[junit4:junit4]   2> 10204 T349 oasc.SolrCore.initDeprecatedSupport WARNING solrconfig.xml uses deprecated <admin/gettableFiles>, Please update your config to use the ShowFileRequestHandler.
[junit4:junit4]   2> 10205 T349 oasc.SolrCore.initDeprecatedSupport WARNING adding ShowFileRequestHandler with hidden files: [BAD-SCHEMA-NOT-INDEXED-BUT-TF.XML, SCHEMA-REQUIRED-FIELDS.XML, SOLRCONFIG-MASTER1-KEEPONEBACKUP.XML, BAD-SCHEMA-NONTEXT-ANALYZER.XML, SOLRCONFIG-PROPINJECT.XML, SOLRCONFIG-PROPINJECT-INDEXDEFAULT.XML, STOP-2.TXT, SCHEMA11.XML, BAD-SCHEMA-UNIQUEKEY-USES-DEFAULT.XML, SCHEMA15.XML, SOLRCONFIG-NATIVELOCK.XML, SCHEMA-SIM.XML, CONDITIONAL.UPDATEPROCESSOR.JS, BAD-SOLRCONFIG-MISSING-SCRIPTFILE.XML, SOLRCONFIG-SCRIPT-UPDATEPROCESSOR.XML, SOLRCONFIG-REPEATER.XML, SOLRCONFIG-SPELLCHECKER.XML, SOLRCONFIG-NOCACHE.XML, SCHEMA-CHARFILTERS.XML, SOLRCONFIG-SOLCOREPROPERTIES.XML, SOLRCONFIG_CODEC.XML, BAD-SCHEMA-EXTERNAL-FILEFIELD.XML, HYPHENATION.DTD, TRIVIAL.UPDATEPROCESSOR1.JS, SCHEMA.XML, SOLRCONFIG-MERGEPOLICY.XML, SOLRCONFIG-PHRASESUGGEST.XML, SOLRCONFIG-SLAVE1.XML, SOLRCONFIG-BASIC.XML, SCHEMA-LMJELINEKMERCER.XML, JASUGGEST.TXT, BAD-MP-SOLRCONFIG.XML, BAD-SCHEMA-DUP-FIELD.XML, BAD-SCHEMA-UNIQUEKEY-MULTIVALUED.XML, SOLRCONFIG-MASTER.XML, SOLRCONFIG-HIGHLIGHT.XML, SCHEMA-TFIDF.XML, SCHEMA-REPLICATION1.XML, SYNONYMS.TXT, SOLRCONFIG-ELEVATE.XML, STOPWITHBOM.TXT, SOLRCONFIG-QUERYSENDER.XML, WDFTYPES.TXT, SOLRCONFIG-SNIPPET-PROCESSOR.XML, SOLRCONFIG-DELPOLICY1.XML, BAD_SOLRCONFIG.XML, HUNSPELL-TEST.DIC, SCHEMA-NUMERIC.XML, SCHEMA-LUCENEMATCHVERSION.XML, KEEP-2.TXT, SCHEMA-STOP-KEEP.XML, SCHEMA-IB.XML, STOP-SNOWBALL.TXT, SOLRCONFIG-INDEXCONFIG.XML, SOLRCONFIG-SLAVE.XML, BAD-SCHEMA-NOT-INDEXED-BUT-NORMS.XML, STOPWORDSWRONGENCODING.TXT, THROW.ERROR.ON.ADD.UPDATEPROCESSOR.JS, STOPTYPES-1.TXT, SOLRCONFIG-SPELLCHECKCOMPONENT.XML, SOLRCONFIG-TLOG.XML, COMPOUNDDICTIONARY.TXT, DA_COMPOUNDDICTIONARY.TXT, SOLRCONFIG-TERMINDEX.XML, BAD-SOLRCONFIG-INVALID-SCRIPTFILE.XML, SCHEMASURROUND.XML, OPEN-EXCHANGE-RATES.JSON, BAD-SCHEMA-DUP-FIELDTYPE.XML, PHRASESUGGEST.TXT, BAD-SCHEMA-CURRENCY-FT-MULTIVALUED.XML, SOLRCONFIG-MASTER2.XML, OLD_SYNONYMS.TXT, BAD-SCHEMA-UNIQUEKEY-IS-COPYFIELD-DEST.XML, SCHEMA-NOT-REQUIRED-UNIQUE-KEY.XML, BAD-SCHEMA-CODEC-GLOBAL-VS-FT-MISMATCH.XML, SCHEMA-LMDIRICHLET.XML, BAD-SCHEMA-NOT-INDEXED-BUT-POS.XML, SCHEMA-REVERSED.XML, BAD-SCHEMA-CURRENCY-MULTIVALUED.XML, SCHEMA-FOLDING.XML, SOLRCONFIG-CACHING.XML, MAPPING-ISOLATIN1ACCENT.TXT, ADDFIELDS.UPDATEPROCESSOR.JS, SCHEMA-BM25.XML, STOP-1.TXT, SOLRCONFIG-ENABLEPLUGIN.XML, MISSING.FUNCTIONS.UPDATEPROCESSOR.JS, SCHEMA12.XML, SOLRCONFIG-TRANSFORMERS.XML, SCHEMA-COPYFIELD-TEST.XML, SOLRCONFIG-BASIC-LUCENEVERSION31.XML, BAD-SCHEMA-DUP-DYNAMICFIELD.XML, CURRENCY.XML, DA_UTF8.XML, MISSLEADING.EXTENSION.UPDATEPROCESSOR.JS.TXT, SOLRCONFIG-SOLR-749.XML, STOPWORDS.TXT, HUNSPELL-TEST.AFF, SOLRCONFIG_PERF.XML, SOLRCONFIG-SIMPLELOCK.XML, FRENCHARTICLES.TXT, SOLRCONFIG-LAZYWRITER.XML, SOLRCONFIG-RESPONSE-LOG-COMPONENT.XML, SCHEMA-REPLICATION2.XML, SCHEMA-SNIPPET-TYPE.XML, SCHEMA-SPATIAL.XML, SOLRCONFIG-XINCLUDE.XML, SCHEMA-SPELLCHECKER.XML, XSLT, SOLRCONFIG-DELPOLICY2.XML, TRIVIAL.UPDATEPROCESSOR0.JS, KEEP-1.TXT, BAD-SCHEMA-CURRENCY-DYNAMIC-MULTIVALUED.XML, SCHEMA-TRIE.XML, SCHEMA-BINARYFIELD.XML, SCHEMA-COLLATEFILTER.XML, BAD-SCHEMA-OMIT-TF-BUT-NOT-POS.XML, SCHEMA-MINIMAL.XML, STOPTYPES-2.TXT, SCHEMA_CODEC.XML, STEMDICT.TXT, ELEVATE.XML, SCHEMA-COLLATE.XML, PROTWORDS.TXT, SCHEMA-XINCLUDE.XML, SCHEMA-SNIPPET-FIELD.XML, SOLRCONFIG-REQHANDLER.INCL, SCHEMA-PHRASESUGGEST.XML, SCHEMA-DFR.XML, BAD-SCHEMA-ANALYZER-CLASS-AND-NESTED.XML, SOLRCONFIG-MASTER1.XML, SOLRCONFIG-FUNCTIONQUERY.XML, SOLRCONFIG-MASTER3.XML, SOLRCONFIG-UPDATE-PROCESSOR-CHAINS.XML, SOLRCONFIG-ALTDIRECTORY.XML, BAD-SCHEMA-SIM-GLOBAL-VS-FT-MISMATCH.XML, SOLRCONFIG-QUERYSENDER-NOQUERY.XML, BAD-SOLRCONFIG-BOGUS-SCRIPTENGINE-NAME.XML]
[junit4:junit4]   2> 10207 T349 oass.SolrIndexSearcher.<init> Opening Searcher@2e21c453 main
[junit4:junit4]   2> 10207 T349 oass.SolrIndexSearcher.getIndexDir WARNING WARNING: Directory impl does not support setting indexDir: org.apache.lucene.store.MockDirectoryWrapper
[junit4:junit4]   2> 10208 T349 oasu.CommitTracker.<init> Hard AutoCommit: disabled
[junit4:junit4]   2> 10208 T349 oasu.CommitTracker.<init> Soft AutoCommit: disabled
[junit4:junit4]   2> 10209 T349 oashc.SpellCheckComponent.inform Initializing spell checkers
[junit4:junit4]   2> 10213 T349 oass.DirectSolrSpellChecker.init init: {name=direct,classname=DirectSolrSpellChecker,field=lowerfilt,minQueryLength=3}
[junit4:junit4]   2> 10229 T349 oashc.HttpShardHandlerFactory.getParameter Setting socketTimeout to: 0
[junit4:junit4]   2> 10230 T349 oashc.HttpShardHandlerFactory.getParameter Setting urlScheme to: http://
[junit4:junit4]   2> 10230 T349 oashc.HttpShardHandlerFactory.getParameter Setting connTimeout to: 0
[junit4:junit4]   2> 10231 T349 oashc.HttpShardHandlerFactory.getParameter Setting maxConnectionsPerHost to: 20
[junit4:junit4]   2> 10231 T349 oashc.HttpShardHandlerFactory.getParameter Setting corePoolSize to: 0
[junit4:junit4]   2> 10232 T349 oashc.HttpShardHandlerFactory.getParameter Setting maximumPoolSize to: 2147483647
[junit4:junit4]   2> 10232 T349 oashc.HttpShardHandlerFactory.getParameter Setting maxThreadIdleTime to: 5
[junit4:junit4]   2> 10233 T349 oashc.HttpShardHandlerFactory.getParameter Setting sizeOfQueue to: -1
[junit4:junit4]   2> 10233 T349 oashc.HttpShardHandlerFactory.getParameter Setting fairnessPolicy to: false
[junit4:junit4]   2> 10234 T349 oascsi.HttpClientUtil.createClient Creating new http client, config:maxConnectionsPerHost=20&maxConnections=10000&socketTimeout=0&connTimeout=0&retry=false
[junit4:junit4]   2> 10244 T354 oasc.SolrCore.registerSearcher [collection1] Registered new searcher Searcher@2e21c453 main{StandardDirectoryReader(segments_1:1)}
[junit4:junit4]   2> 10249 T349 oasc.CoreContainer.register registering core: collection1
[junit4:junit4]   2> 10251 T349 oasu.AbstractSolrTestCase.setUp ####SETUP_END testMaxDocs
[junit4:junit4]   2> 10253 T349 oasc.SolrDeletionPolicy.onInit SolrDeletionPolicy.onInit: commits:num=1
[junit4:junit4]   2> 		commit{dir=MockDirWrapper(org.apache.lucene.store.RAMDirectory@fa0aaf46 lockFactory=org.apache.lucene.store.NativeFSLockFactory@83dc9c9c),segFN=segments_1,generation=1,filenames=[segments_1]
[junit4:junit4]   2> 10254 T349 oasc.SolrDeletionPolicy.updateCommits newest commit = 1
[junit4:junit4]   2> 10255 T349 UPDATE [collection1] {add=[0]} 0 3
[junit4:junit4]   2> 10256 T349 UPDATE [collection1] {add=[1]} 0 3
[junit4:junit4]   2> 10257 T349 UPDATE [collection1] {add=[2]} 0 3
[junit4:junit4]   2> 10258 T349 UPDATE [collection1] {add=[3]} 0 3
[junit4:junit4]   2> 10260 T349 UPDATE [collection1] {add=[4]} 0 3
[junit4:junit4]   2> 10261 T349 UPDATE [collection1] {add=[5]} 0 3
[junit4:junit4]   2> 10262 T349 UPDATE [collection1] {add=[6]} 0 3
[junit4:junit4]   2> 10263 T349 UPDATE [collection1] {add=[7]} 0 3
[junit4:junit4]   2> 10265 T349 UPDATE [collection1] {add=[8]} 0 3
[junit4:junit4]   2> 10268 T349 UPDATE [collection1] {add=[9]} 0 3
[junit4:junit4]   2> 10270 T349 UPDATE [collection1] {add=[10]} 0 3
[junit4:junit4]   2> 10271 T349 UPDATE [collection1] {add=[11]} 0 3
[junit4:junit4]   2> 10272 T349 UPDATE [collection1] {add=[12]} 0 3
[junit4:junit4]   2> 10272 T349 UPDATE [collection1] {add=[13]} 0 3
[junit4:junit4]   2> ASYNC  NEW_CORE C52 name=collection1 org.apache.solr.core.SolrCore@a663c2b0
[junit4:junit4]   2> 10273 T349 C52 REQ [collection1] webapp=null path=null params={q=id:1&start=0&qt=standard&version=2.2&rows=20} hits=0 status=0 QTime=0 
[junit4:junit4]   2> 10277 T349 UPDATE [collection1] {add=[14]} 0 3
[junit4:junit4]   2> 10278 T355 oasu.DirectUpdateHandler2.commit start commit{flags=0,_version_=0,optimize=false,openSearcher=true,waitSearcher=true,expungeDeletes=false,softCommit=true}
[junit4:junit4]   2> 10282 T355 oass.SolrIndexSearcher.<init> Opening Searcher@5e016970 main
[junit4:junit4]   2> 10282 T355 oass.SolrIndexSearcher.getIndexDir WARNING WARNING: Directory impl does not support setting indexDir: org.apache.lucene.store.MockDirectoryWrapper
[junit4:junit4]   2> 10283 T355 oasu.DirectUpdateHandler2.commit end_commit_flush
[junit4:junit4]   2> 10285 T354 oasc.SolrCore.registerSearcher [collection1] Registered new searcher Searcher@5e016970 main{StandardDirectoryReader(segments_1:5:nrt _0(4.1):C10 _1(4.1):C5)}
[junit4:junit4]   2> 10529 T349 UPDATE [collection1] {add=[15]} 0 3
[junit4:junit4]   2> 10529 T349 C52 REQ [collection1] webapp=null path=null params={q=id:14&start=0&qt=standard&version=2.2&rows=20} hits=1 status=0 QTime=0 
[junit4:junit4]   2> 10531 T349 C52 REQ [collection1] webapp=null path=null params={q=id:15&start=0&qt=standard&version=2.2&rows=20} hits=0 status=0 QTime=0 
[junit4:junit4]   2> 10532 T349 oasu.AbstractSolrTestCase.tearDown ####TEARDOWN_START testMaxDocs
[junit4:junit4]   2> 10533 T349 oasc.CoreContainer.shutdown Shutting down CoreContainer instance=139192990
[junit4:junit4]   2> 10533 T349 oasc.SolrCore.close [collection1]  CLOSING SolrCore org.apache.solr.core.SolrCore@a663c2b0
[junit4:junit4]   2> 10546 T349 oasu.DirectUpdateHandler2.close closing DirectUpdateHandler2{commits=1,autocommits=0,soft autocommit maxDocs=14,soft autocommits=1,optimizes=0,rollbacks=0,expungeDeletes=0,docsPending=16,adds=1,deletesById=0,deletesByQuery=0,errors=0,cumulative_adds=16,cumulative_deletesById=0,cumulative_deletesByQuery=0,cumulative_errors=0}
[junit4:junit4]   2> 10547 T349 oasc.SolrCore.decrefSolrCoreState Closing SolrCoreState
[junit4:junit4]   2> 10547 T349 oasu.DefaultSolrCoreState.closeIndexWriter SolrCoreState ref count has reached 0 - closing IndexWriter
[junit4:junit4]   2> 10548 T349 oasu.DefaultSolrCoreState.closeIndexWriter closing IndexWriter with IndexWriterCloser
[junit4:junit4]   2> 10550 T349 C52 oasc.SolrDeletionPolicy.onCommit SolrDeletionPolicy.onCommit: commits:num=2
[junit4:junit4]   2> 		commit{dir=MockDirWrapper(org.apache.lucene.store.RAMDirectory@fa0aaf46 lockFactory=org.apache.lucene.store.NativeFSLockFactory@83dc9c9c),segFN=segments_1,generation=1,filenames=[segments_1]
[junit4:junit4]   2> 		commit{dir=MockDirWrapper(org.apache.lucene.store.RAMDirectory@fa0aaf46 lockFactory=org.apache.lucene.store.NativeFSLockFactory@83dc9c9c),segFN=segments_2,generation=2,filenames=[_1_Lucene41_0.pos, _2_Lucene41_0.doc, _1_Lucene41_0.tim, _0_Lucene41_0.doc, _1_Lucene41_0.tip, _0_nrm.cfe, _1_nrm.cfe, _2_nrm.cfe, _1.si, segments_2, _0_nrm.cfs, _1_nrm.cfs, _2_nrm.cfs, _2_Lucene41_0.pos, _0_Lucene41_0.pos, _2_Lucene41_0.tim, _1_Lucene41_0.doc, _0_Lucene41_0.tim, _0.fnm, _1.fnm, _2_Lucene41_0.tip, _2.fnm, _0_Lucene41_0.tip, _2.si, _0.si, _0.fdt, _1.fdt, _2.fdt, _0.fdx, _1.fdx, _2.fdx]
[junit4:junit4]   2> 10550 T349 C52 oasc.SolrDeletionPolicy.updateCommits newest commit = 2
[junit4:junit4]   2> 10551 T349 oasc.SolrCore.closeSearcher [collection1] Closing main searcher on request.
[junit4:junit4]   2> NOTE: test params are: codec=Compressing(storedFieldsFormat=CompressingStoredFieldsFormat(compressionMode=FAST, chunkSize=100)), sim=RandomSimilarityProvider(queryNorm=true,coord=yes): {}, locale=ar_IQ, timezone=Africa/Malabo
[junit4:junit4]   2> NOTE: Linux 3.2.0-32-generic x86/IBM Corporation 1.7.0 (32-bit)/cpus=8,threads=1,free=16268368,total=145096704
[junit4:junit4]   2> NOTE: All tests run in this JVM: [TestLFUCache, TestIBSimilarityFactory, CacheHeaderTest, TestIndexSearcher, SimpleFacetsTest, PathHierarchyTokenizerFactoryTest, DirectUpdateHandlerOptimizeTest, FileBasedSpellCheckerTest, CurrencyFieldTest, CopyFieldTest, NoCacheHeaderTest, TestDefaultSimilarityFactory, TestBadConfig, MBeansHandlerTest, TestPerFieldSimilarity, TestConfig, FieldAnalysisRequestHandlerTest, TestStressReorder, SolrPluginUtilsTest, SpellCheckComponentTest, TestReload, TestStressRecovery, HighlighterConfigTest, JSONWriterTest, TestSearchPerf, ZkControllerTest, SpatialFilterTest, TestXIncludeConfig, AutoCommitTest]
[junit4:junit4] Completed on J0 in 8.31s, 3 tests, 1 failure <<< FAILURES!

[...truncated 588 lines...]
BUILD FAILED
/mnt/ssd/jenkins/workspace/Lucene-Solr-4.x-Linux/build.xml:348: The following error occurred while executing this line:
/mnt/ssd/jenkins/workspace/Lucene-Solr-4.x-Linux/build.xml:39: The following error occurred while executing this line:
/mnt/ssd/jenkins/workspace/Lucene-Solr-4.x-Linux/solr/build.xml:178: The following error occurred while executing this line:
/mnt/ssd/jenkins/workspace/Lucene-Solr-4.x-Linux/lucene/module-build.xml:61: The following error occurred while executing this line:
/mnt/ssd/jenkins/workspace/Lucene-Solr-4.x-Linux/lucene/common-build.xml:1163: The following error occurred while executing this line:
/mnt/ssd/jenkins/workspace/Lucene-Solr-4.x-Linux/lucene/common-build.xml:827: There were test failures: 233 suites, 970 tests, 1 failure, 8 ignored (3 assumptions)

Total time: 42 minutes 58 seconds
Build step 'Invoke Ant' marked build as failure
Archiving artifacts
Recording test results
Description set: Java: 32bit/ibm-j9-jdk7 -Xjit:exclude={org/apache/lucene/util/fst/FST.pack(IIF)Lorg/apache/lucene/util/fst/FST;}
Email was triggered for: Failure
Sending email for trigger: Failure



Mime
View raw message