lucene-dev mailing list archives

Site index · List index
Message view « Date » · « Thread »
Top « Date » · « Thread »
From "Uwe Schindler" <...@thetaphi.de>
Subject RE: [JENKINS] Lucene-Solr-4.x-Windows (64bit/jdk1.7.0_09) - Build # 1565 - Failure!
Date Mon, 12 Nov 2012 12:37:16 GMT
The windows machine has 2 virtual cores (Oracle VirtualBOX). :-)

Thanks for fixing!

Uwe

-----
Uwe Schindler
H.-H.-Meier-Allee 63, D-28213 Bremen
http://www.thetaphi.de
eMail: uwe@thetaphi.de


> -----Original Message-----
> From: Michael McCandless [mailto:lucene@mikemccandless.com]
> Sent: Monday, November 12, 2012 12:37 PM
> To: dev@lucene.apache.org
> Subject: Re: [JENKINS] Lucene-Solr-4.x-Windows (64bit/jdk1.7.0_09) - Build #
> 1565 - Failure!
> 
> I committed a fix ... it was a test bug ... happens only on machines w/ not so
> many cores!
> 
> Mike McCandless
> 
> http://blog.mikemccandless.com
> 
> On Mon, Nov 12, 2012 at 6:17 AM, Policeman Jenkins Server <jenkins@sd-
> datasolutions.de> wrote:
> > Build:
> > http://jenkins.sd-datasolutions.de/job/Lucene-Solr-4.x-Windows/1565/
> > Java: 64bit/jdk1.7.0_09 -XX:+UseSerialGC
> >
> > 1 tests failed.
> > REGRESSION:
> >
> org.apache.lucene.index.TestConcurrentMergeScheduler.testMaxMergeCo
> unt
> >
> > Error Message:
> > count should be <= maxMergeCount (= 3)
> >
> > Stack Trace:
> > java.lang.IllegalArgumentException: count should be <= maxMergeCount
> (= 3)
> >         at
> __randomizedtesting.SeedInfo.seed([A8CD823A02390E3F:7FAA1389BEF891B
> 9]:0)
> >         at
> org.apache.lucene.index.ConcurrentMergeScheduler.setMaxThreadCount(C
> oncurrentMergeScheduler.java:90)
> >         at
> org.apache.lucene.index.TestConcurrentMergeScheduler.testMaxMergeCo
> unt(TestConcurrentMergeScheduler.java:303)
> >         at sun.reflect.NativeMethodAccessorImpl.invoke0(Native Method)
> >         at
> sun.reflect.NativeMethodAccessorImpl.invoke(NativeMethodAccessorImpl.j
> ava:57)
> >         at
> sun.reflect.DelegatingMethodAccessorImpl.invoke(DelegatingMethodAcces
> sorImpl.java:43)
> >         at java.lang.reflect.Method.invoke(Method.java:601)
> >         at
> com.carrotsearch.randomizedtesting.RandomizedRunner.invoke(Randomize
> dRunner.java:1559)
> >         at
> com.carrotsearch.randomizedtesting.RandomizedRunner.access$600(Rando
> mizedRunner.java:79)
> >         at
> com.carrotsearch.randomizedtesting.RandomizedRunner$6.evaluate(Rando
> mizedRunner.java:737)
> >         at
> com.carrotsearch.randomizedtesting.RandomizedRunner$7.evaluate(Rando
> mizedRunner.java:773)
> >         at
> com.carrotsearch.randomizedtesting.RandomizedRunner$8.evaluate(Rando
> mizedRunner.java:787)
> >         at
> org.apache.lucene.util.TestRuleSetupTeardownChained$1.evaluate(TestRule
> SetupTeardownChained.java:50)
> >         at
> org.apache.lucene.util.TestRuleFieldCacheSanity$1.evaluate(TestRuleFieldCa
> cheSanity.java:51)
> >         at
> org.apache.lucene.util.AbstractBeforeAfterRule$1.evaluate(AbstractBeforeA
> fterRule.java:45)
> >         at
> com.carrotsearch.randomizedtesting.rules.SystemPropertiesInvariantRule$1
> .evaluate(SystemPropertiesInvariantRule.java:55)
> >         at
> org.apache.lucene.util.TestRuleThreadAndTestName$1.evaluate(TestRuleTh
> readAndTestName.java:48)
> >         at
> org.apache.lucene.util.TestRuleIgnoreAfterMaxFailures$1.evaluate(TestRule
> IgnoreAfterMaxFailures.java:70)
> >         at
> org.apache.lucene.util.TestRuleMarkFailure$1.evaluate(TestRuleMarkFailure
> .java:48)
> >         at
> com.carrotsearch.randomizedtesting.rules.StatementAdapter.evaluate(Stat
> ementAdapter.java:36)
> >         at
> com.carrotsearch.randomizedtesting.ThreadLeakControl$StatementRunner.
> run(ThreadLeakControl.java:358)
> >         at
> com.carrotsearch.randomizedtesting.ThreadLeakControl.forkTimeoutingTask
> (ThreadLeakControl.java:782)
> >         at
> com.carrotsearch.randomizedtesting.ThreadLeakControl$3.evaluate(ThreadL
> eakControl.java:442)
> >         at
> com.carrotsearch.randomizedtesting.RandomizedRunner.runSingleTest(Ran
> domizedRunner.java:746)
> >         at
> com.carrotsearch.randomizedtesting.RandomizedRunner$3.evaluate(Rando
> mizedRunner.java:648)
> >         at
> com.carrotsearch.randomizedtesting.RandomizedRunner$4.evaluate(Rando
> mizedRunner.java:682)
> >         at
> com.carrotsearch.randomizedtesting.RandomizedRunner$5.evaluate(Rando
> mizedRunner.java:693)
> >         at
> org.apache.lucene.util.AbstractBeforeAfterRule$1.evaluate(AbstractBeforeA
> fterRule.java:45)
> >         at
> org.apache.lucene.util.TestRuleStoreClassName$1.evaluate(TestRuleStoreCl
> assName.java:42)
> >         at
> com.carrotsearch.randomizedtesting.rules.SystemPropertiesInvariantRule$1
> .evaluate(SystemPropertiesInvariantRule.java:55)
> >         at
> com.carrotsearch.randomizedtesting.rules.NoShadowingOrOverridesOnMet
> hodsRule$1.evaluate(NoShadowingOrOverridesOnMethodsRule.java:39)
> >         at
> com.carrotsearch.randomizedtesting.rules.NoShadowingOrOverridesOnMet
> hodsRule$1.evaluate(NoShadowingOrOverridesOnMethodsRule.java:39)
> >         at
> com.carrotsearch.randomizedtesting.rules.StatementAdapter.evaluate(Stat
> ementAdapter.java:36)
> >         at
> org.apache.lucene.util.TestRuleAssertionsRequired$1.evaluate(TestRuleAss
> ertionsRequired.java:43)
> >         at
> org.apache.lucene.util.TestRuleMarkFailure$1.evaluate(TestRuleMarkFailure
> .java:48)
> >         at
> org.apache.lucene.util.TestRuleIgnoreAfterMaxFailures$1.evaluate(TestRule
> IgnoreAfterMaxFailures.java:70)
> >         at
> org.apache.lucene.util.TestRuleIgnoreTestSuites$1.evaluate(TestRuleIgnore
> TestSuites.java:55)
> >         at
> com.carrotsearch.randomizedtesting.rules.StatementAdapter.evaluate(Stat
> ementAdapter.java:36)
> >         at
> com.carrotsearch.randomizedtesting.ThreadLeakControl$StatementRunner.
> run(ThreadLeakControl.java:358)
> >         at java.lang.Thread.run(Thread.java:722)
> >
> >
> >
> >
> > Build Log:
> > [...truncated 835 lines...]
> > [junit4:junit4] Suite:
> org.apache.lucene.index.TestConcurrentMergeScheduler
> > [junit4:junit4]   2> NOTE: reproduce with: ant test  -
> Dtestcase=TestConcurrentMergeScheduler -
> Dtests.method=testMaxMergeCount -Dtests.seed=A8CD823A02390E3F -
> Dtests.slow=true -Dtests.locale=es_GT -Dtests.timezone=Africa/Ndjamena -
> Dtests.file.encoding=ISO-8859-1
> > [junit4:junit4] ERROR   0.01s |
> TestConcurrentMergeScheduler.testMaxMergeCount <<<
> > [junit4:junit4]    > Throwable #1: java.lang.IllegalArgumentException: count
> should be <= maxMergeCount (= 3)
> > [junit4:junit4]    >    at
> __randomizedtesting.SeedInfo.seed([A8CD823A02390E3F:7FAA1389BEF891B
> 9]:0)
> > [junit4:junit4]    >    at
> org.apache.lucene.index.ConcurrentMergeScheduler.setMaxThreadCount(C
> oncurrentMergeScheduler.java:90)
> > [junit4:junit4]    >    at
> org.apache.lucene.index.TestConcurrentMergeScheduler.testMaxMergeCo
> unt(TestConcurrentMergeScheduler.java:303)
> > [junit4:junit4]    >    at
> sun.reflect.NativeMethodAccessorImpl.invoke0(Native Method)
> > [junit4:junit4]    >    at
> sun.reflect.NativeMethodAccessorImpl.invoke(NativeMethodAccessorImpl.j
> ava:57)
> > [junit4:junit4]    >    at
> sun.reflect.DelegatingMethodAccessorImpl.invoke(DelegatingMethodAcces
> sorImpl.java:43)
> > [junit4:junit4]    >    at java.lang.reflect.Method.invoke(Method.java:601)
> > [junit4:junit4]    >    at
> com.carrotsearch.randomizedtesting.RandomizedRunner.invoke(Randomize
> dRunner.java:1559)
> > [junit4:junit4]    >    at
> com.carrotsearch.randomizedtesting.RandomizedRunner.access$600(Rando
> mizedRunner.java:79)
> > [junit4:junit4]    >    at
> com.carrotsearch.randomizedtesting.RandomizedRunner$6.evaluate(Rando
> mizedRunner.java:737)
> > [junit4:junit4]    >    at
> com.carrotsearch.randomizedtesting.RandomizedRunner$7.evaluate(Rando
> mizedRunner.java:773)
> > [junit4:junit4]    >    at
> com.carrotsearch.randomizedtesting.RandomizedRunner$8.evaluate(Rando
> mizedRunner.java:787)
> > [junit4:junit4]    >    at
> org.apache.lucene.util.TestRuleSetupTeardownChained$1.evaluate(TestRule
> SetupTeardownChained.java:50)
> > [junit4:junit4]    >    at
> org.apache.lucene.util.TestRuleFieldCacheSanity$1.evaluate(TestRuleFieldCa
> cheSanity.java:51)
> > [junit4:junit4]    >    at
> org.apache.lucene.util.AbstractBeforeAfterRule$1.evaluate(AbstractBeforeA
> fterRule.java:45)
> > [junit4:junit4]    >    at
> com.carrotsearch.randomizedtesting.rules.SystemPropertiesInvariantRule$1
> .evaluate(SystemPropertiesInvariantRule.java:55)
> > [junit4:junit4]    >    at
> org.apache.lucene.util.TestRuleThreadAndTestName$1.evaluate(TestRuleTh
> readAndTestName.java:48)
> > [junit4:junit4]    >    at
> org.apache.lucene.util.TestRuleIgnoreAfterMaxFailures$1.evaluate(TestRule
> IgnoreAfterMaxFailures.java:70)
> > [junit4:junit4]    >    at
> org.apache.lucene.util.TestRuleMarkFailure$1.evaluate(TestRuleMarkFailure
> .java:48)
> > [junit4:junit4]    >    at
> com.carrotsearch.randomizedtesting.rules.StatementAdapter.evaluate(Stat
> ementAdapter.java:36)
> > [junit4:junit4]    >    at
> com.carrotsearch.randomizedtesting.ThreadLeakControl$StatementRunner.
> run(ThreadLeakControl.java:358)
> > [junit4:junit4]    >    at
> com.carrotsearch.randomizedtesting.ThreadLeakControl.forkTimeoutingTask
> (ThreadLeakControl.java:782)
> > [junit4:junit4]    >    at
> com.carrotsearch.randomizedtesting.ThreadLeakControl$3.evaluate(ThreadL
> eakControl.java:442)
> > [junit4:junit4]    >    at
> com.carrotsearch.randomizedtesting.RandomizedRunner.runSingleTest(Ran
> domizedRunner.java:746)
> > [junit4:junit4]    >    at
> com.carrotsearch.randomizedtesting.RandomizedRunner$3.evaluate(Rando
> mizedRunner.java:648)
> > [junit4:junit4]    >    at
> com.carrotsearch.randomizedtesting.RandomizedRunner$4.evaluate(Rando
> mizedRunner.java:682)
> > [junit4:junit4]    >    at
> com.carrotsearch.randomizedtesting.RandomizedRunner$5.evaluate(Rando
> mizedRunner.java:693)
> > [junit4:junit4]    >    at
> org.apache.lucene.util.AbstractBeforeAfterRule$1.evaluate(AbstractBeforeA
> fterRule.java:45)
> > [junit4:junit4]    >    at
> org.apache.lucene.util.TestRuleStoreClassName$1.evaluate(TestRuleStoreCl
> assName.java:42)
> > [junit4:junit4]    >    at
> com.carrotsearch.randomizedtesting.rules.SystemPropertiesInvariantRule$1
> .evaluate(SystemPropertiesInvariantRule.java:55)
> > [junit4:junit4]    >    at
> com.carrotsearch.randomizedtesting.rules.NoShadowingOrOverridesOnMet
> hodsRule$1.evaluate(NoShadowingOrOverridesOnMethodsRule.java:39)
> > [junit4:junit4]    >    at
> com.carrotsearch.randomizedtesting.rules.NoShadowingOrOverridesOnMet
> hodsRule$1.evaluate(NoShadowingOrOverridesOnMethodsRule.java:39)
> > [junit4:junit4]    >    at
> com.carrotsearch.randomizedtesting.rules.StatementAdapter.evaluate(Stat
> ementAdapter.java:36)
> > [junit4:junit4]    >    at
> org.apache.lucene.util.TestRuleAssertionsRequired$1.evaluate(TestRuleAss
> ertionsRequired.java:43)
> > [junit4:junit4]    >    at
> org.apache.lucene.util.TestRuleMarkFailure$1.evaluate(TestRuleMarkFailure
> .java:48)
> > [junit4:junit4]    >    at
> org.apache.lucene.util.TestRuleIgnoreAfterMaxFailures$1.evaluate(TestRule
> IgnoreAfterMaxFailures.java:70)
> > [junit4:junit4]    >    at
> org.apache.lucene.util.TestRuleIgnoreTestSuites$1.evaluate(TestRuleIgnore
> TestSuites.java:55)
> > [junit4:junit4]    >    at
> com.carrotsearch.randomizedtesting.rules.StatementAdapter.evaluate(Stat
> ementAdapter.java:36)
> > [junit4:junit4]    >    at
> com.carrotsearch.randomizedtesting.ThreadLeakControl$StatementRunner.
> run(ThreadLeakControl.java:358)
> > [junit4:junit4]    >    at java.lang.Thread.run(Thread.java:722)
> > [junit4:junit4]   2> NOTE: test params are:
> codec=Compressing(storedFieldsFormat=CompressingStoredFieldsFormat(c
> ompressionMode=FAST, chunkSize=22)), sim=DefaultSimilarity,
> locale=es_GT, timezone=Africa/Ndjamena
> > [junit4:junit4]   2> NOTE: Windows 7 6.1 amd64/Oracle Corporation 1.7.0_09
> (64-bit)/cpus=2,threads=1,free=112531656,total=248209408
> > [junit4:junit4]   2> NOTE: All tests run in this JVM: [TestNeverDelete,
> TestByteBlockPool, TestNRTReaderWithThreads, TestBytesRefHash,
> TestPerFieldPostingsFormat2, TestTransactions, TestMultiPhraseQuery,
> TestOmitPositions, TestPerFieldPostingsFormat, TestFieldValueFilter,
> TestVirtualMethod, TestPrefixRandom, TestLazyProxSkipping, TestField,
> TestVersionComparator, TestTopDocsCollector, TestIOUtils,
> TestRAMDirectory, TestStressIndexing2, TestFieldCacheRewriteMethod,
> TestDocBoost, Test2BTerms, TestUTF32ToUTF8, TestStressNRT,
> TestDoubleBarrelLRUCache, TestNRTThreads, TestNorms,
> TestLevenshteinAutomata, TestDoc, MultiCollectorTest,
> TestTermRangeFilter, TestIndexWriterMergePolicy, TestMixedCodecs,
> Nested1, TestDuelingCodecs, TestFixedBitSet, TestCharFilter, TestBoolean2,
> Nested, TestBitUtil, TestStressAdvance, TestCrashCausesCorruptIndex,
> TestAssertions, TestPrefixFilter, TestFieldCache, TestForUtil, TestSimilarity2,
> TestAtomicUpdate, TestWildcardRandom, TestWeakIdentityMap,
> TestMultiTermConstantScore, TestDateFilter, TestConjunctions, TestSpans,
> TestByteSlices, TestDocumentWriter, TestIndexableBinaryStringTools,
> TestReuseDocsEnum, TestSpanMultiTermQueryWrapper, TestPhraseQuery,
> TestSpanSearchEquivalence, TestSpansAdvanced,
> TestMultiThreadTermVectors, TestIndexWriterUnicode, TestPagedBytes,
> TestIndexWriterConfig, TestFSTs, TestComplexExplanationsOfNonMatches,
> TestCachingTokenFilter, TestIdentityHashSet, TestDirectory,
> TestNoMergeScheduler, TestArrayUtil, TestCharTermAttributeImpl,
> TestTerm, TestDeletionPolicy, Nested1, TestPayloadsOnVectors, TestCrash,
> TestFilterIterator, TestTransactionRollback, TestCachingCollector,
> TestBooleanQuery, TestAllFilesHaveCodecHeader, Test2BPostingsBytes,
> TestExternalCodecs, TestSegmentReader, TestSizeBoundedForceMerge,
> TestPerSegmentDeletes, TestNewestSegment, TestRegexpRandom2,
> TestWorstCaseTestBehavior, TestCheckIndex, TestMergeSchedulerExternal,
> TestSpecialOperations, TestIntsRef, TestNumericRangeQuery64,
> TestIndexWriterForceMerge, TestRecyclingIntBlockAllocator,
> TestLucene3xPostingsFormat, TestQueryWrapperFilter, TestPayloadSpans,
> TestDocIdSet, TestIndexableField, TestMultiFields, TestFlex,
> TestCustomNorms, TestIndexWriterReader, TestSegmentTermEnum,
> Test2BDocs, TestMatchAllDocsQuery, TestTieredMergePolicy,
> TestSearcherManager, TestIndexWriterExceptions, TestNumericUtils,
> TestPriorityQueue, TestNRTCachingDirectory, TestSnapshotDeletionPolicy,
> TestSearch, TestAttributeSource, TestSubScorerFreqs, TestNamedSPILoader,
> TestDocTermOrds, TestBooleanScorer,
> TestMultiValuedNumericRangeQuery, TestDocumentsWriterStallControl,
> Test4GBStoredFields, TestElevationComparator, TestCopyBytes,
> TestDocValuesTypeCompatibility, TestTermScorer, TestSimpleAttributeImpl,
> TestLucene40PostingsReader, TestCompoundFile, TestFilteredQuery,
> TestIndexWriterOnJRECrash, Test2BPositions, TestShardSearching,
> TestFieldInfos, TestSegmentTermDocs, TestImpersonation,
> TestFilterAtomicReader, TestCodecs, TestForceMergeForever,
> TestCloseableThreadLocal, TestPositionIncrement,
> TestFieldCacheTermsFilter, TestIndexInput, TestRegexpQuery, TestWildcard,
> TestBlockPostingsFormat, TestDocsAndPositions, TestStressIndexing,
> TestMultiTermQueryRewrites, TestCachingWrapperFilter, TestSort,
> TestMockCharFilter, TestReaderClosed, TestVersion, TestSmallFloat,
> TestSimpleSearchEquivalence, TestByteArrayDataInput,
> TestSpansAdvanced2, TestIndexWriterWithThreads, TestPackedInts,
> TestGraphTokenizers, TestLookaheadTokenFilter,
> TestNumericRangeQuery32, TestBasics, TestAddIndexes, TestTermsEnum,
> TestIndexWriter, TestIndexWriterMerging, TestMultiMMap,
> TestOpenBitSet, TestTimeLimitingCollector, TestFlushByRamOrCountsPolicy,
> TestTopDocsMerge, TestSearchAfter, TestMinimize,
> TestSloppyPhraseQuery, TestPersistentSnapshotDeletionPolicy,
> TestBackwardsCompatibility, TestNRTManager, TestIndexWriterDelete,
> TestDirectoryReaderReopen, TestSearchWithThreads,
> TestBufferedIndexInput, TestCollectionUtil, TestLongPostings,
> TestIndexWriterCommit, TestDirectoryReader, TestToken,
> TestTypePromotion, TestSimpleExplanations, TestMockAnalyzer,
> TestDeterminizeLexicon, TestIndexWriterNRTIsCurrent,
> TestDocValuesIndexing, TestConcurrentMergeScheduler]
> > [junit4:junit4] Completed in 1.14s, 5 tests, 1 error <<< FAILURES!
> >
> > [...truncated 394 lines...]
> > BUILD FAILED
> > C:\Users\JenkinsSlave\workspace\Lucene-Solr-4.x-
> Windows\build.xml:337: The following error occurred while executing this
> line:
> > C:\Users\JenkinsSlave\workspace\Lucene-Solr-4.x-Windows\build.xml:39:
> The following error occurred while executing this line:
> > C:\Users\JenkinsSlave\workspace\Lucene-Solr-4.x-
> Windows\lucene\build.xml:50: The following error occurred while executing
> this line:
> > C:\Users\JenkinsSlave\workspace\Lucene-Solr-4.x-
> Windows\lucene\common-build.xml:1163: The following error occurred
> while executing this line:
> > C:\Users\JenkinsSlave\workspace\Lucene-Solr-4.x-
> Windows\lucene\common-
> > build.xml:827: There were test failures: 325 suites, 1862 tests, 1
> > error, 21 ignored (10 assumptions)
> >
> > Total time: 7 minutes 40 seconds
> > Build step 'Invoke Ant' marked build as failure Archiving artifacts
> > Recording test results Description set: Java: 64bit/jdk1.7.0_09
> > -XX:+UseSerialGC Email was triggered for: Failure Sending email for
> > trigger: Failure
> >
> >
> >
> >
> > ---------------------------------------------------------------------
> > To unsubscribe, e-mail: dev-unsubscribe@lucene.apache.org For
> > additional commands, e-mail: dev-help@lucene.apache.org
> 
> ---------------------------------------------------------------------
> To unsubscribe, e-mail: dev-unsubscribe@lucene.apache.org For additional
> commands, e-mail: dev-help@lucene.apache.org


---------------------------------------------------------------------
To unsubscribe, e-mail: dev-unsubscribe@lucene.apache.org
For additional commands, e-mail: dev-help@lucene.apache.org


Mime
View raw message