lucene-dev mailing list archives

Site index · List index
Message view « Date » · « Thread »
Top « Date » · « Thread »
From Chris Hostetter <hossman_luc...@fucit.org>
Subject Re: [JENKINS] Lucene-Solr-trunk-Linux (32bit/jdk1.7.0_07) - Build # 2100 - Failure!
Date Tue, 30 Oct 2012 22:53:06 GMT

This was giving me serious deja-vu -- i thought i had adequatly worked 
arround this stupid fucking 
getMessage-is-localized-even-though-that's-the-whole-fucking-point-of-getLocallizedMessage

problems a long time ago, and sure enough -- i had, but a recent commit 
seems to have reverted some of this in the process of adding tigher 
controls arround what exceptions get thrown...

https://svn.apache.org/viewvc/lucene/dev/trunk/solr/core/src/test/org/apache/solr/core/CoreContainerCoreInitFailuresTest.java?r1=1403710&r2=1403709&pathrev=1403710
https://issues.apache.org/jira/browse/SOLR-1028?focusedCommentId=13487324&page=com.atlassian.jira.plugin.system.issuetabpanels:comment-tabpanel#comment-13487324



: Date: Tue, 30 Oct 2012 21:06:18 +0000 (UTC)
: From: Policeman Jenkins Server <jenkins@sd-datasolutions.de>
: Reply-To: dev@lucene.apache.org
: To: dev@lucene.apache.org
: Subject: [JENKINS] Lucene-Solr-trunk-Linux (32bit/jdk1.7.0_07) - Build # 2100
:     - Failure!
: 
: Build: http://jenkins.sd-datasolutions.de/job/Lucene-Solr-trunk-Linux/2100/
: Java: 32bit/jdk1.7.0_07 -server -XX:+UseConcMarkSweepGC
: 
: 1 tests failed.
: REGRESSION:  org.apache.solr.core.CoreContainerCoreInitFailuresTest.testFlowBadFromStart
: 
: Error Message:
: reload exception doesn't refer to prolog 프롤로그에서는 콘텐츠가 허용되지
않습니다.
: 
: Stack Trace:
: java.lang.AssertionError: reload exception doesn't refer to prolog 프롤로그에서는
콘텐츠가 허용되지 않습니다.
: 	at __randomizedtesting.SeedInfo.seed([F661F6E616E4E41:959CD4968591C045]:0)
: 	at org.junit.Assert.fail(Assert.java:93)
: 	at org.junit.Assert.assertTrue(Assert.java:43)
: 	at org.apache.solr.core.CoreContainerCoreInitFailuresTest.testFlowBadFromStart(CoreContainerCoreInitFailuresTest.java:254)
: 	at sun.reflect.NativeMethodAccessorImpl.invoke0(Native Method)
: 	at sun.reflect.NativeMethodAccessorImpl.invoke(NativeMethodAccessorImpl.java:57)
: 	at sun.reflect.DelegatingMethodAccessorImpl.invoke(DelegatingMethodAccessorImpl.java:43)
: 	at java.lang.reflect.Method.invoke(Method.java:601)
: 	at com.carrotsearch.randomizedtesting.RandomizedRunner.invoke(RandomizedRunner.java:1559)
: 	at com.carrotsearch.randomizedtesting.RandomizedRunner.access$600(RandomizedRunner.java:79)
: 	at com.carrotsearch.randomizedtesting.RandomizedRunner$6.evaluate(RandomizedRunner.java:737)
: 	at com.carrotsearch.randomizedtesting.RandomizedRunner$7.evaluate(RandomizedRunner.java:773)
: 	at com.carrotsearch.randomizedtesting.RandomizedRunner$8.evaluate(RandomizedRunner.java:787)
: 	at com.carrotsearch.randomizedtesting.rules.SystemPropertiesRestoreRule$1.evaluate(SystemPropertiesRestoreRule.java:53)
: 	at org.apache.lucene.util.TestRuleSetupTeardownChained$1.evaluate(TestRuleSetupTeardownChained.java:50)
: 	at org.apache.lucene.util.TestRuleFieldCacheSanity$1.evaluate(TestRuleFieldCacheSanity.java:51)
: 	at org.apache.lucene.util.AbstractBeforeAfterRule$1.evaluate(AbstractBeforeAfterRule.java:45)
: 	at com.carrotsearch.randomizedtesting.rules.SystemPropertiesInvariantRule$1.evaluate(SystemPropertiesInvariantRule.java:55)
: 	at org.apache.lucene.util.TestRuleThreadAndTestName$1.evaluate(TestRuleThreadAndTestName.java:48)
: 	at org.apache.lucene.util.TestRuleIgnoreAfterMaxFailures$1.evaluate(TestRuleIgnoreAfterMaxFailures.java:70)
: 	at org.apache.lucene.util.TestRuleMarkFailure$1.evaluate(TestRuleMarkFailure.java:48)
: 	at com.carrotsearch.randomizedtesting.rules.StatementAdapter.evaluate(StatementAdapter.java:36)
: 	at com.carrotsearch.randomizedtesting.ThreadLeakControl$StatementRunner.run(ThreadLeakControl.java:358)
: 	at com.carrotsearch.randomizedtesting.ThreadLeakControl.forkTimeoutingTask(ThreadLeakControl.java:782)
: 	at com.carrotsearch.randomizedtesting.ThreadLeakControl$3.evaluate(ThreadLeakControl.java:442)
: 	at com.carrotsearch.randomizedtesting.RandomizedRunner.runSingleTest(RandomizedRunner.java:746)
: 	at com.carrotsearch.randomizedtesting.RandomizedRunner$3.evaluate(RandomizedRunner.java:648)
: 	at com.carrotsearch.randomizedtesting.RandomizedRunner$4.evaluate(RandomizedRunner.java:682)
: 	at com.carrotsearch.randomizedtesting.RandomizedRunner$5.evaluate(RandomizedRunner.java:693)
: 	at com.carrotsearch.randomizedtesting.rules.StatementAdapter.evaluate(StatementAdapter.java:36)
: 	at com.carrotsearch.randomizedtesting.rules.SystemPropertiesRestoreRule$1.evaluate(SystemPropertiesRestoreRule.java:53)
: 	at org.apache.lucene.util.AbstractBeforeAfterRule$1.evaluate(AbstractBeforeAfterRule.java:45)
: 	at org.apache.lucene.util.TestRuleStoreClassName$1.evaluate(TestRuleStoreClassName.java:42)
: 	at com.carrotsearch.randomizedtesting.rules.SystemPropertiesInvariantRule$1.evaluate(SystemPropertiesInvariantRule.java:55)
: 	at com.carrotsearch.randomizedtesting.rules.NoShadowingOrOverridesOnMethodsRule$1.evaluate(NoShadowingOrOverridesOnMethodsRule.java:39)
: 	at com.carrotsearch.randomizedtesting.rules.NoShadowingOrOverridesOnMethodsRule$1.evaluate(NoShadowingOrOverridesOnMethodsRule.java:39)
: 	at com.carrotsearch.randomizedtesting.rules.StatementAdapter.evaluate(StatementAdapter.java:36)
: 	at org.apache.lucene.util.TestRuleAssertionsRequired$1.evaluate(TestRuleAssertionsRequired.java:43)
: 	at org.apache.lucene.util.TestRuleMarkFailure$1.evaluate(TestRuleMarkFailure.java:48)
: 	at org.apache.lucene.util.TestRuleIgnoreAfterMaxFailures$1.evaluate(TestRuleIgnoreAfterMaxFailures.java:70)
: 	at org.apache.lucene.util.TestRuleIgnoreTestSuites$1.evaluate(TestRuleIgnoreTestSuites.java:55)
: 	at com.carrotsearch.randomizedtesting.rules.StatementAdapter.evaluate(StatementAdapter.java:36)
: 	at com.carrotsearch.randomizedtesting.ThreadLeakControl$StatementRunner.run(ThreadLeakControl.java:358)
: 	at java.lang.Thread.run(Thread.java:722)
: 
: 
: 
: 
: Build Log:
: [...truncated 8532 lines...]
: [junit4:junit4] Suite: org.apache.solr.core.CoreContainerCoreInitFailuresTest
: [junit4:junit4]   2> 2 T451 oas.SolrTestCaseJ4.setUp ###Starting testFlowWithEmpty
: [junit4:junit4]   2> 3 T451 oasc.CoreContainer.<init> New CoreContainer 4592391
: [junit4:junit4]   2> 3 T451 oasc.CoreContainer.load Loading CoreContainer using Solr
Home: '/mnt/ssd/jenkins/workspace/Lucene-Solr-trunk-Linux/solr/build/solr-core/test/J0/./org.apache.solr.core.CoreContainerCoreInitFailuresTest_empty_flow'
: [junit4:junit4]   2> 4 T451 oasc.SolrResourceLoader.<init> new SolrResourceLoader
for directory: '/mnt/ssd/jenkins/workspace/Lucene-Solr-trunk-Linux/solr/build/solr-core/test/J0/./org.apache.solr.core.CoreContainerCoreInitFailuresTest_empty_flow/'
: [junit4:junit4]   2> 17 T451 oasc.CoreContainer.load Registering Log Listener
: [junit4:junit4]   2> 33 T451 oasc.CoreContainer.create Creating SolrCore 'bogus' using
instanceDir: /mnt/ssd/jenkins/workspace/Lucene-Solr-trunk-Linux/solr/build/solr-core/test/J0/./org.apache.solr.core.CoreContainerCoreInitFailuresTest_empty_flow/bogus_path
: [junit4:junit4]   2> 33 T451 oasc.SolrResourceLoader.<init> new SolrResourceLoader
for directory: '/mnt/ssd/jenkins/workspace/Lucene-Solr-trunk-Linux/solr/build/solr-core/test/J0/./org.apache.solr.core.CoreContainerCoreInitFailuresTest_empty_flow/bogus_path/'
: [junit4:junit4]   2> 41 T451 oasc.CoreContainer.recordAndThrow SEVERE Unable to create
core: bogus Ignoring exception matching \Qbogus_path\E
: [junit4:junit4]   2> 43 T451 oasc.CoreContainer.shutdown Shutting down CoreContainer
instance=4592391
: [junit4:junit4]   2> 44 T451 oas.SolrTestCaseJ4.tearDown ###Ending testFlowWithEmpty
: [junit4:junit4]   2> 49 T451 oas.SolrTestCaseJ4.setUp ###Starting testFlowBadFromStart
: [junit4:junit4]   2> 49 T451 oasc.CoreContainer.<init> New CoreContainer 16250839
: [junit4:junit4]   2> 54 T451 oasc.CoreContainer.load Loading CoreContainer using Solr
Home: '/mnt/ssd/jenkins/workspace/Lucene-Solr-trunk-Linux/solr/build/solr-core/test/J0/./org.apache.solr.core.CoreContainerCoreInitFailuresTest_bad_flow'
: [junit4:junit4]   2> 54 T451 oasc.SolrResourceLoader.<init> new SolrResourceLoader
for directory: '/mnt/ssd/jenkins/workspace/Lucene-Solr-trunk-Linux/solr/build/solr-core/test/J0/./org.apache.solr.core.CoreContainerCoreInitFailuresTest_bad_flow/'
: [junit4:junit4]   2> 69 T451 oasc.CoreContainer.load Registering Log Listener
: [junit4:junit4]   2> 80 T451 oasc.CoreContainer.create Creating SolrCore 'col_ok' using
instanceDir: /mnt/ssd/jenkins/workspace/Lucene-Solr-trunk-Linux/solr/build/solr-core/test/J0/./org.apache.solr.core.CoreContainerCoreInitFailuresTest_bad_flow/col_ok
: [junit4:junit4]   2> 81 T451 oasc.SolrResourceLoader.<init> new SolrResourceLoader
for directory: '/mnt/ssd/jenkins/workspace/Lucene-Solr-trunk-Linux/solr/build/solr-core/test/J0/./org.apache.solr.core.CoreContainerCoreInitFailuresTest_bad_flow/col_ok/'
: [junit4:junit4]   2> 98 T451 oasc.SolrConfig.<init> Using Lucene MatchVersion:
LUCENE_50
: [junit4:junit4]   2> 121 T451 oasc.SolrConfig.<init> Loaded SolrConfig: solrconfig.xml
: [junit4:junit4]   2> 122 T451 oass.IndexSchema.readSchema Reading Solr Schema
: [junit4:junit4]   2> 124 T451 oass.IndexSchema.readSchema Schema name=minimal
: [junit4:junit4]   2> 133 T451 oass.IndexSchema.readSchema WARNING no uniqueKey specified
in schema.
: [junit4:junit4]   2> 134 T451 oasc.SolrCore.<init> [col_ok] Opening new SolrCore
at /mnt/ssd/jenkins/workspace/Lucene-Solr-trunk-Linux/solr/build/solr-core/test/J0/./org.apache.solr.core.CoreContainerCoreInitFailuresTest_bad_flow/col_ok/,
dataDir=/mnt/ssd/jenkins/workspace/Lucene-Solr-trunk-Linux/solr/build/solr-core/test/J0/./org.apache.solr.core.CoreContainerCoreInitFailuresTest_bad_flow/col_ok/data/
: [junit4:junit4]   2> 134 T451 oasc.SolrCore.<init> JMX monitoring not detected
for core: col_ok
: [junit4:junit4]   2> 134 T451 oasc.SolrCore.initDirectoryFactory org.apache.solr.core.MockDirectoryFactory
: [junit4:junit4]   2> 135 T451 oasc.CachingDirectoryFactory.injectLockFactory WARNING
No lockType configured for MockDirWrapper(org.apache.lucene.store.RAMDirectory@fb0e10 lockFactory=org.apache.lucene.store.SingleInstanceLockFactory@584732)
assuming 'simple'
: [junit4:junit4]   2> 135 T451 oasc.CachingDirectoryFactory.get return new directory for
/mnt/ssd/jenkins/workspace/Lucene-Solr-trunk-Linux/solr/build/solr-core/test/J0/./org.apache.solr.core.CoreContainerCoreInitFailuresTest_bad_flow/col_ok/data
forceNew:false
: [junit4:junit4]   2> 136 T451 oasc.CachingDirectoryFactory.close Releasing directory:/mnt/ssd/jenkins/workspace/Lucene-Solr-trunk-Linux/solr/build/solr-core/test/J0/./org.apache.solr.core.CoreContainerCoreInitFailuresTest_bad_flow/col_ok/data
: [junit4:junit4]   2> 136 T451 oasc.SolrCore.getNewIndexDir New index directory detected:
old=null new=/mnt/ssd/jenkins/workspace/Lucene-Solr-trunk-Linux/solr/build/solr-core/test/J0/./org.apache.solr.core.CoreContainerCoreInitFailuresTest_bad_flow/col_ok/data/index/
: [junit4:junit4]   2> 136 T451 oasc.SolrCore.initIndex WARNING [col_ok] Solr index directory
'/mnt/ssd/jenkins/workspace/Lucene-Solr-trunk-Linux/solr/build/solr-core/test/J0/./org.apache.solr.core.CoreContainerCoreInitFailuresTest_bad_flow/col_ok/data/index'
doesn't exist. Creating new index...
: [junit4:junit4]   2> 137 T451 oasc.CachingDirectoryFactory.get return new directory for
/mnt/ssd/jenkins/workspace/Lucene-Solr-trunk-Linux/solr/build/solr-core/test/J0/./org.apache.solr.core.CoreContainerCoreInitFailuresTest_bad_flow/col_ok/data/index
forceNew:false
: [junit4:junit4]   2> 138 T451 oasc.SolrDeletionPolicy.onCommit SolrDeletionPolicy.onCommit:
commits:num=1
: [junit4:junit4]   2> 		commit{dir=MockDirWrapper(org.apache.lucene.store.RAMDirectory@c87dff
lockFactory=org.apache.lucene.store.NativeFSLockFactory@114a734),segFN=segments_1,generation=1,filenames=[segments_1]
: [junit4:junit4]   2> 139 T451 oasc.SolrDeletionPolicy.updateCommits newest commit = 1[segments_1]
: [junit4:junit4]   2> 139 T451 oasc.CachingDirectoryFactory.close Releasing directory:/mnt/ssd/jenkins/workspace/Lucene-Solr-trunk-Linux/solr/build/solr-core/test/J0/./org.apache.solr.core.CoreContainerCoreInitFailuresTest_bad_flow/col_ok/data/index
: [junit4:junit4]   2> 140 T451 oasc.RequestHandlers.initHandlersFromConfig created standard:
solr.StandardRequestHandler
: [junit4:junit4]   2> 142 T451 oasc.CachingDirectoryFactory.close Releasing directory:/mnt/ssd/jenkins/workspace/Lucene-Solr-trunk-Linux/solr/build/solr-core/test/J0/./org.apache.solr.core.CoreContainerCoreInitFailuresTest_bad_flow/col_ok/data
: [junit4:junit4]   2> 143 T451 oass.SolrIndexSearcher.<init> Opening Searcher@19362f0
main
: [junit4:junit4]   2> 143 T451 oasu.CommitTracker.<init> Hard AutoCommit: disabled
: [junit4:junit4]   2> 143 T451 oasu.CommitTracker.<init> Soft AutoCommit: disabled
: [junit4:junit4]   2> 144 T451 oashc.HttpShardHandlerFactory.getParameter Setting socketTimeout
to: 0
: [junit4:junit4]   2> 144 T451 oashc.HttpShardHandlerFactory.getParameter Setting urlScheme
to: http://
: [junit4:junit4]   2> 144 T451 oashc.HttpShardHandlerFactory.getParameter Setting connTimeout
to: 0
: [junit4:junit4]   2> 145 T451 oashc.HttpShardHandlerFactory.getParameter Setting maxConnectionsPerHost
to: 20
: [junit4:junit4]   2> 145 T451 oashc.HttpShardHandlerFactory.getParameter Setting corePoolSize
to: 0
: [junit4:junit4]   2> 145 T451 oashc.HttpShardHandlerFactory.getParameter Setting maximumPoolSize
to: 2147483647
: [junit4:junit4]   2> 146 T451 oashc.HttpShardHandlerFactory.getParameter Setting maxThreadIdleTime
to: 5
: [junit4:junit4]   2> 146 T451 oashc.HttpShardHandlerFactory.getParameter Setting sizeOfQueue
to: -1
: [junit4:junit4]   2> 146 T451 oashc.HttpShardHandlerFactory.getParameter Setting fairnessPolicy
to: false
: [junit4:junit4]   2> 147 T451 oascsi.HttpClientUtil.createClient Creating new http client,
config:maxConnectionsPerHost=20&maxConnections=10000&socketTimeout=0&connTimeout=0&retry=false
: [junit4:junit4]   2> 150 T452 oasc.SolrCore.registerSearcher [col_ok] Registered new
searcher Searcher@19362f0 main{StandardDirectoryReader(segments_1:1)}
: [junit4:junit4]   2> 150 T451 oasc.CoreContainer.registerCore registering core: col_ok
: [junit4:junit4]   2> 152 T451 oasc.CoreContainer.create Creating SolrCore 'col_bad' using
instanceDir: /mnt/ssd/jenkins/workspace/Lucene-Solr-trunk-Linux/solr/build/solr-core/test/J0/./org.apache.solr.core.CoreContainerCoreInitFailuresTest_bad_flow/col_bad
: [junit4:junit4]   2> 152 T451 oasc.SolrResourceLoader.<init> new SolrResourceLoader
for directory: '/mnt/ssd/jenkins/workspace/Lucene-Solr-trunk-Linux/solr/build/solr-core/test/J0/./org.apache.solr.core.CoreContainerCoreInitFailuresTest_bad_flow/col_bad/'
: [junit4:junit4]   2> 172 T451 oasc.SolrConfig.<init> Using Lucene MatchVersion:
LUCENE_50
: [junit4:junit4]   2> 197 T451 oasc.SolrConfig.<init> Loaded SolrConfig: solrconfig.xml
: [junit4:junit4]   2> 198 T451 oass.IndexSchema.readSchema Reading Solr Schema
: [junit4:junit4]   2> 200 T451 oass.IndexSchema.readSchema Schema name=minimal
: [junit4:junit4]   2> 210 T451 oass.IndexSchema.readSchema WARNING no uniqueKey specified
in schema.
: [junit4:junit4]   2> 211 T451 oasc.SolrCore.<init> [col_bad] Opening new SolrCore
at /mnt/ssd/jenkins/workspace/Lucene-Solr-trunk-Linux/solr/build/solr-core/test/J0/./org.apache.solr.core.CoreContainerCoreInitFailuresTest_bad_flow/col_bad/,
dataDir=/mnt/ssd/jenkins/workspace/Lucene-Solr-trunk-Linux/solr/build/solr-core/test/J0/./org.apache.solr.core.CoreContainerCoreInitFailuresTest_bad_flow/col_bad/data/
: [junit4:junit4]   2> 211 T451 oasc.SolrCore.<init> JMX monitoring not detected
for core: col_bad
: [junit4:junit4]   2> 212 T451 oasc.SolrCore.initDirectoryFactory org.apache.solr.core.MockDirectoryFactory
: [junit4:junit4]   2> 212 T451 oasc.CachingDirectoryFactory.injectLockFactory WARNING
No lockType configured for MockDirWrapper(org.apache.lucene.store.RAMDirectory@4bb435 lockFactory=org.apache.lucene.store.SingleInstanceLockFactory@243e32)
assuming 'simple'
: [junit4:junit4]   2> 213 T451 oasc.CachingDirectoryFactory.get return new directory for
/mnt/ssd/jenkins/workspace/Lucene-Solr-trunk-Linux/solr/build/solr-core/test/J0/./org.apache.solr.core.CoreContainerCoreInitFailuresTest_bad_flow/col_bad/data
forceNew:false
: [junit4:junit4]   2> 213 T451 oasc.CachingDirectoryFactory.close Releasing directory:/mnt/ssd/jenkins/workspace/Lucene-Solr-trunk-Linux/solr/build/solr-core/test/J0/./org.apache.solr.core.CoreContainerCoreInitFailuresTest_bad_flow/col_bad/data
: [junit4:junit4]   2> 213 T451 oasc.SolrCore.getNewIndexDir New index directory detected:
old=null new=/mnt/ssd/jenkins/workspace/Lucene-Solr-trunk-Linux/solr/build/solr-core/test/J0/./org.apache.solr.core.CoreContainerCoreInitFailuresTest_bad_flow/col_bad/data/index/
: [junit4:junit4]   2> 214 T451 oasc.SolrCore.initIndex WARNING [col_bad] Solr index directory
'/mnt/ssd/jenkins/workspace/Lucene-Solr-trunk-Linux/solr/build/solr-core/test/J0/./org.apache.solr.core.CoreContainerCoreInitFailuresTest_bad_flow/col_bad/data/index'
doesn't exist. Creating new index...
: [junit4:junit4]   2> 214 T451 oasc.CachingDirectoryFactory.get return new directory for
/mnt/ssd/jenkins/workspace/Lucene-Solr-trunk-Linux/solr/build/solr-core/test/J0/./org.apache.solr.core.CoreContainerCoreInitFailuresTest_bad_flow/col_bad/data/index
forceNew:false
: [junit4:junit4]   2> 215 T451 oasc.CachingDirectoryFactory.close Releasing directory:/mnt/ssd/jenkins/workspace/Lucene-Solr-trunk-Linux/solr/build/solr-core/test/J0/./org.apache.solr.core.CoreContainerCoreInitFailuresTest_bad_flow/col_bad/data/index
: [junit4:junit4]   2> 215 T451 oasc.CachingDirectoryFactory.close Closing directory:/mnt/ssd/jenkins/workspace/Lucene-Solr-trunk-Linux/solr/build/solr-core/test/J0/./org.apache.solr.core.CoreContainerCoreInitFailuresTest_bad_flow/col_bad/data/index
: [junit4:junit4]   2> 216 T451 oasc.SolrCore.close [col_bad]  CLOSING SolrCore org.apache.solr.core.SolrCore@1559fb9
: [junit4:junit4]   2> 216 T451 oasc.SolrCore.decrefSolrCoreState Closing SolrCoreState
: [junit4:junit4]   2> 216 T451 oasu.DefaultSolrCoreState.closeIndexWriter SolrCoreState
ref count has reached 0 - closing IndexWriter
: [junit4:junit4]   2> 217 T451 oasc.SolrCore.closeSearcher [col_bad] Closing main searcher
on request.
: [junit4:junit4]   2> 217 T451 oasc.CoreContainer.recordAndThrow SEVERE Unable to create
core: col_bad Ignoring exception matching \QDummyMergePolicy\E
: [junit4:junit4]   2> 219 T451 oasc.SolrException.log Ignoring exception matching \QDummyMergePolicy\E
: [junit4:junit4]   2> 220 T451 oasc.CoreContainer.create Creating SolrCore 'col_bad' using
instanceDir: /mnt/ssd/jenkins/workspace/Lucene-Solr-trunk-Linux/solr/build/solr-core/test/J0/./org.apache.solr.core.CoreContainerCoreInitFailuresTest_bad_flow/col_bad
: [junit4:junit4]   2> 220 T451 oasc.SolrResourceLoader.<init> new SolrResourceLoader
for directory: '/mnt/ssd/jenkins/workspace/Lucene-Solr-trunk-Linux/solr/build/solr-core/test/J0/./org.apache.solr.core.CoreContainerCoreInitFailuresTest_bad_flow/col_bad/'
: [junit4:junit4]   2> 237 T451 oasc.SolrConfig.<init> Using Lucene MatchVersion:
LUCENE_50
: [junit4:junit4]   2> 265 T451 oasc.SolrConfig.<init> Loaded SolrConfig: solrconfig.xml
: [junit4:junit4]   2> 266 T451 oass.IndexSchema.readSchema Reading Solr Schema
: [junit4:junit4]   2> 268 T451 oass.IndexSchema.readSchema Schema name=minimal
: [junit4:junit4]   2> 280 T451 oass.IndexSchema.readSchema WARNING no uniqueKey specified
in schema.
: [junit4:junit4]   2> 281 T451 oasc.SolrCore.<init> [col_bad] Opening new SolrCore
at /mnt/ssd/jenkins/workspace/Lucene-Solr-trunk-Linux/solr/build/solr-core/test/J0/./org.apache.solr.core.CoreContainerCoreInitFailuresTest_bad_flow/col_bad/,
dataDir=/mnt/ssd/jenkins/workspace/Lucene-Solr-trunk-Linux/solr/build/solr-core/test/J0/./org.apache.solr.core.CoreContainerCoreInitFailuresTest_bad_flow/col_bad/data/
: [junit4:junit4]   2> 281 T451 oasc.SolrCore.<init> JMX monitoring not detected
for core: col_bad
: [junit4:junit4]   2> 282 T451 oasc.SolrCore.initDirectoryFactory org.apache.solr.core.MockDirectoryFactory
: [junit4:junit4]   2> 286 T451 oasc.CachingDirectoryFactory.injectLockFactory WARNING
No lockType configured for MockDirWrapper(org.apache.lucene.store.MMapDirectory@/mnt/ssd/jenkins/workspace/Lucene-Solr-trunk-Linux/solr/build/solr-core/test/J0/index1899619001tmp
lockFactory=org.apache.lucene.store.NativeFSLockFactory@7171c2) assuming 'simple'
: [junit4:junit4]   2> 287 T451 oasc.CachingDirectoryFactory.get return new directory for
/mnt/ssd/jenkins/workspace/Lucene-Solr-trunk-Linux/solr/build/solr-core/test/J0/./org.apache.solr.core.CoreContainerCoreInitFailuresTest_bad_flow/col_bad/data
forceNew:false
: [junit4:junit4]   2> 287 T451 oasc.CachingDirectoryFactory.close Releasing directory:/mnt/ssd/jenkins/workspace/Lucene-Solr-trunk-Linux/solr/build/solr-core/test/J0/./org.apache.solr.core.CoreContainerCoreInitFailuresTest_bad_flow/col_bad/data
: [junit4:junit4]   2> 287 T451 oasc.SolrCore.getNewIndexDir New index directory detected:
old=null new=/mnt/ssd/jenkins/workspace/Lucene-Solr-trunk-Linux/solr/build/solr-core/test/J0/./org.apache.solr.core.CoreContainerCoreInitFailuresTest_bad_flow/col_bad/data/index/
: [junit4:junit4]   2> 288 T451 oasc.SolrCore.initIndex WARNING [col_bad] Solr index directory
'/mnt/ssd/jenkins/workspace/Lucene-Solr-trunk-Linux/solr/build/solr-core/test/J0/./org.apache.solr.core.CoreContainerCoreInitFailuresTest_bad_flow/col_bad/data/index'
doesn't exist. Creating new index...
: [junit4:junit4]   2> 288 T451 oasc.CachingDirectoryFactory.get return new directory for
/mnt/ssd/jenkins/workspace/Lucene-Solr-trunk-Linux/solr/build/solr-core/test/J0/./org.apache.solr.core.CoreContainerCoreInitFailuresTest_bad_flow/col_bad/data/index
forceNew:false
: [junit4:junit4]   2> 290 T451 oasc.SolrDeletionPolicy.onCommit SolrDeletionPolicy.onCommit:
commits:num=1
: [junit4:junit4]   2> 		commit{dir=MockDirWrapper(org.apache.lucene.store.RAMDirectory@ccf7b8
lockFactory=org.apache.lucene.store.NativeFSLockFactory@4fc9d5),segFN=segments_1,generation=1,filenames=[segments_1]
: [junit4:junit4]   2> 290 T451 oasc.SolrDeletionPolicy.updateCommits newest commit = 1[segments_1]
: [junit4:junit4]   2> 290 T451 oasc.CachingDirectoryFactory.close Releasing directory:/mnt/ssd/jenkins/workspace/Lucene-Solr-trunk-Linux/solr/build/solr-core/test/J0/./org.apache.solr.core.CoreContainerCoreInitFailuresTest_bad_flow/col_bad/data/index
: [junit4:junit4]   2> 291 T451 oasc.RequestHandlers.initHandlersFromConfig created standard:
solr.StandardRequestHandler
: [junit4:junit4]   2> 293 T451 oasc.CachingDirectoryFactory.close Releasing directory:/mnt/ssd/jenkins/workspace/Lucene-Solr-trunk-Linux/solr/build/solr-core/test/J0/./org.apache.solr.core.CoreContainerCoreInitFailuresTest_bad_flow/col_bad/data
: [junit4:junit4]   2> 294 T451 oass.SolrIndexSearcher.<init> Opening Searcher@534f4c
main
: [junit4:junit4]   2> 294 T451 oasu.CommitTracker.<init> Hard AutoCommit: disabled
: [junit4:junit4]   2> 295 T451 oasu.CommitTracker.<init> Soft AutoCommit: disabled
: [junit4:junit4]   2> 295 T453 oasc.SolrCore.registerSearcher [col_bad] Registered new
searcher Searcher@534f4c main{StandardDirectoryReader(segments_1:1)}
: [junit4:junit4]   2> 295 T451 oasc.CoreContainer.registerCore registering core: col_bad
: [junit4:junit4]   2> 295 T451 oasc.CoreContainer.create Creating SolrCore 'bogus' using
instanceDir: /mnt/ssd/jenkins/workspace/Lucene-Solr-trunk-Linux/solr/build/solr-core/test/J0/./org.apache.solr.core.CoreContainerCoreInitFailuresTest_bad_flow/bogus_path
: [junit4:junit4]   2> 296 T451 oasc.SolrResourceLoader.<init> new SolrResourceLoader
for directory: '/mnt/ssd/jenkins/workspace/Lucene-Solr-trunk-Linux/solr/build/solr-core/test/J0/./org.apache.solr.core.CoreContainerCoreInitFailuresTest_bad_flow/bogus_path/'
: [junit4:junit4]   2> 305 T451 oasc.CoreContainer.recordAndThrow SEVERE Unable to create
core: bogus Ignoring exception matching \Qbogus_path\E
: [junit4:junit4]   2> 306 T451 oasc.CoreContainer.registerCore registering core: bogus
: [junit4:junit4]   2> 306 T451 oasc.CoreContainer.reload Reloading SolrCore 'col_bad'
using instanceDir: /mnt/ssd/jenkins/workspace/Lucene-Solr-trunk-Linux/solr/build/solr-core/test/J0/./org.apache.solr.core.CoreContainerCoreInitFailuresTest_bad_flow/col_bad
: [junit4:junit4]   2> 307 T451 oasc.SolrResourceLoader.<init> new SolrResourceLoader
for directory: '/mnt/ssd/jenkins/workspace/Lucene-Solr-trunk-Linux/solr/build/solr-core/test/J0/./org.apache.solr.core.CoreContainerCoreInitFailuresTest_bad_flow/col_bad/'
: [junit4:junit4]   2> 326 T451 oasc.SolrException.log Ignoring exception matching \QSAX\E
: [junit4:junit4]   2> 326 T451 oasc.CoreContainer.recordAndThrow SEVERE Unable to reload
core: col_bad Ignoring exception matching \QSAX\E
: [junit4:junit4]   2> 327 T451 oasc.CoreContainer.shutdown Shutting down CoreContainer
instance=16250839
: [junit4:junit4]   2> 327 T451 oasc.SolrCore.close [col_bad]  CLOSING SolrCore org.apache.solr.core.SolrCore@134c964
: [junit4:junit4]   2> 328 T451 oasu.DirectUpdateHandler2.close closing DirectUpdateHandler2{commits=0,autocommits=0,soft
autocommits=0,optimizes=0,rollbacks=0,expungeDeletes=0,docsPending=0,adds=0,deletesById=0,deletesByQuery=0,errors=0,cumulative_adds=0,cumulative_deletesById=0,cumulative_deletesByQuery=0,cumulative_errors=0}
: [junit4:junit4]   2> 328 T451 oasc.SolrCore.decrefSolrCoreState Closing SolrCoreState
: [junit4:junit4]   2> 328 T451 oasu.DefaultSolrCoreState.closeIndexWriter SolrCoreState
ref count has reached 0 - closing IndexWriter
: [junit4:junit4]   2> 329 T451 oasu.DefaultSolrCoreState.closeIndexWriter closing IndexWriter
with IndexWriterCloser
: [junit4:junit4]   2> 329 T451 oasc.SolrCore.closeSearcher [col_bad] Closing main searcher
on request.
: [junit4:junit4]   2> 329 T451 oasc.CachingDirectoryFactory.close Releasing directory:/mnt/ssd/jenkins/workspace/Lucene-Solr-trunk-Linux/solr/build/solr-core/test/J0/./org.apache.solr.core.CoreContainerCoreInitFailuresTest_bad_flow/col_bad/data/index
: [junit4:junit4]   2> 330 T451 oasc.SolrCore.close [bogus]  CLOSING SolrCore org.apache.solr.core.SolrCore@142e37f
: [junit4:junit4]   2> 330 T451 oasu.DirectUpdateHandler2.close closing DirectUpdateHandler2{commits=0,autocommits=0,soft
autocommits=0,optimizes=0,rollbacks=0,expungeDeletes=0,docsPending=0,adds=0,deletesById=0,deletesByQuery=0,errors=0,cumulative_adds=0,cumulative_deletesById=0,cumulative_deletesByQuery=0,cumulative_errors=0}
: [junit4:junit4]   2> 330 T451 oasc.SolrCore.decrefSolrCoreState Closing SolrCoreState
: [junit4:junit4]   2> 331 T451 oasu.DefaultSolrCoreState.closeIndexWriter SolrCoreState
ref count has reached 0 - closing IndexWriter
: [junit4:junit4]   2> 331 T451 oasu.DefaultSolrCoreState.closeIndexWriter closing IndexWriter
with IndexWriterCloser
: [junit4:junit4]   2> 331 T451 oasc.SolrCore.closeSearcher [bogus] Closing main searcher
on request.
: [junit4:junit4]   2> 332 T451 oasc.CachingDirectoryFactory.close Releasing directory:/mnt/ssd/jenkins/workspace/Lucene-Solr-trunk-Linux/solr/build/solr-core/test/J0/./org.apache.solr.core.CoreContainerCoreInitFailuresTest_bad_flow/col_ok/data/index
: [junit4:junit4]   2> 335 T451 oas.SolrTestCaseJ4.tearDown ###Ending testFlowBadFromStart
: [junit4:junit4]   2> NOTE: reproduce with: ant test  -Dtestcase=CoreContainerCoreInitFailuresTest
-Dtests.method=testFlowBadFromStart -Dtests.seed=F661F6E616E4E41 -Dtests.multiplier=3 -Dtests.slow=true
-Dtests.locale=ko -Dtests.timezone=GB -Dtests.file.encoding=UTF-8
: [junit4:junit4] FAILURE 0.30s J0 | CoreContainerCoreInitFailuresTest.testFlowBadFromStart
<<<
: [junit4:junit4]    > Throwable #1: java.lang.AssertionError: reload exception doesn't
refer to prolog 프롤로그에서는 콘텐츠가 허용되지 않습니다.
: [junit4:junit4]    > 	at __randomizedtesting.SeedInfo.seed([F661F6E616E4E41:959CD4968591C045]:0)
: [junit4:junit4]    > 	at org.junit.Assert.fail(Assert.java:93)
: [junit4:junit4]    > 	at org.junit.Assert.assertTrue(Assert.java:43)
: [junit4:junit4]    > 	at org.apache.solr.core.CoreContainerCoreInitFailuresTest.testFlowBadFromStart(CoreContainerCoreInitFailuresTest.java:254)
: [junit4:junit4]    > 	at sun.reflect.NativeMethodAccessorImpl.invoke0(Native Method)
: [junit4:junit4]    > 	at sun.reflect.NativeMethodAccessorImpl.invoke(NativeMethodAccessorImpl.java:57)
: [junit4:junit4]    > 	at sun.reflect.DelegatingMethodAccessorImpl.invoke(DelegatingMethodAccessorImpl.java:43)
: [junit4:junit4]    > 	at java.lang.reflect.Method.invoke(Method.java:601)
: [junit4:junit4]    > 	at com.carrotsearch.randomizedtesting.RandomizedRunner.invoke(RandomizedRunner.java:1559)
: [junit4:junit4]    > 	at com.carrotsearch.randomizedtesting.RandomizedRunner.access$600(RandomizedRunner.java:79)
: [junit4:junit4]    > 	at com.carrotsearch.randomizedtesting.RandomizedRunner$6.evaluate(RandomizedRunner.java:737)
: [junit4:junit4]    > 	at com.carrotsearch.randomizedtesting.RandomizedRunner$7.evaluate(RandomizedRunner.java:773)
: [junit4:junit4]    > 	at com.carrotsearch.randomizedtesting.RandomizedRunner$8.evaluate(RandomizedRunner.java:787)
: [junit4:junit4]    > 	at com.carrotsearch.randomizedtesting.rules.SystemPropertiesRestoreRule$1.evaluate(SystemPropertiesRestoreRule.java:53)
: [junit4:junit4]    > 	at org.apache.lucene.util.TestRuleSetupTeardownChained$1.evaluate(TestRuleSetupTeardownChained.java:50)
: [junit4:junit4]    > 	at org.apache.lucene.util.TestRuleFieldCacheSanity$1.evaluate(TestRuleFieldCacheSanity.java:51)
: [junit4:junit4]    > 	at org.apache.lucene.util.AbstractBeforeAfterRule$1.evaluate(AbstractBeforeAfterRule.java:45)
: [junit4:junit4]    > 	at com.carrotsearch.randomizedtesting.rules.SystemPropertiesInvariantRule$1.evaluate(SystemPropertiesInvariantRule.java:55)
: [junit4:junit4]    > 	at org.apache.lucene.util.TestRuleThreadAndTestName$1.evaluate(TestRuleThreadAndTestName.java:48)
: [junit4:junit4]    > 	at org.apache.lucene.util.TestRuleIgnoreAfterMaxFailures$1.evaluate(TestRuleIgnoreAfterMaxFailures.java:70)
: [junit4:junit4]    > 	at org.apache.lucene.util.TestRuleMarkFailure$1.evaluate(TestRuleMarkFailure.java:48)
: [junit4:junit4]    > 	at com.carrotsearch.randomizedtesting.rules.StatementAdapter.evaluate(StatementAdapter.java:36)
: [junit4:junit4]    > 	at com.carrotsearch.randomizedtesting.ThreadLeakControl$StatementRunner.run(ThreadLeakControl.java:358)
: [junit4:junit4]    > 	at com.carrotsearch.randomizedtesting.ThreadLeakControl.forkTimeoutingTask(ThreadLeakControl.java:782)
: [junit4:junit4]    > 	at com.carrotsearch.randomizedtesting.ThreadLeakControl$3.evaluate(ThreadLeakControl.java:442)
: [junit4:junit4]    > 	at com.carrotsearch.randomizedtesting.RandomizedRunner.runSingleTest(RandomizedRunner.java:746)
: [junit4:junit4]    > 	at com.carrotsearch.randomizedtesting.RandomizedRunner$3.evaluate(RandomizedRunner.java:648)
: [junit4:junit4]    > 	at com.carrotsearch.randomizedtesting.RandomizedRunner$4.evaluate(RandomizedRunner.java:682)
: [junit4:junit4]    > 	at com.carrotsearch.randomizedtesting.RandomizedRunner$5.evaluate(RandomizedRunner.java:693)
: [junit4:junit4]    > 	at com.carrotsearch.randomizedtesting.rules.StatementAdapter.evaluate(StatementAdapter.java:36)
: [junit4:junit4]    > 	at com.carrotsearch.randomizedtesting.rules.SystemPropertiesRestoreRule$1.evaluate(SystemPropertiesRestoreRule.java:53)
: [junit4:junit4]    > 	at org.apache.lucene.util.AbstractBeforeAfterRule$1.evaluate(AbstractBeforeAfterRule.java:45)
: [junit4:junit4]    > 	at org.apache.lucene.util.TestRuleStoreClassName$1.evaluate(TestRuleStoreClassName.java:42)
: [junit4:junit4]    > 	at com.carrotsearch.randomizedtesting.rules.SystemPropertiesInvariantRule$1.evaluate(SystemPropertiesInvariantRule.java:55)
: [junit4:junit4]    > 	at com.carrotsearch.randomizedtesting.rules.NoShadowingOrOverridesOnMethodsRule$1.evaluate(NoShadowingOrOverridesOnMethodsRule.java:39)
: [junit4:junit4]    > 	at com.carrotsearch.randomizedtesting.rules.NoShadowingOrOverridesOnMethodsRule$1.evaluate(NoShadowingOrOverridesOnMethodsRule.java:39)
: [junit4:junit4]    > 	at com.carrotsearch.randomizedtesting.rules.StatementAdapter.evaluate(StatementAdapter.java:36)
: [junit4:junit4]    > 	at org.apache.lucene.util.TestRuleAssertionsRequired$1.evaluate(TestRuleAssertionsRequired.java:43)
: [junit4:junit4]    > 	at org.apache.lucene.util.TestRuleMarkFailure$1.evaluate(TestRuleMarkFailure.java:48)
: [junit4:junit4]    > 	at org.apache.lucene.util.TestRuleIgnoreAfterMaxFailures$1.evaluate(TestRuleIgnoreAfterMaxFailures.java:70)
: [junit4:junit4]    > 	at org.apache.lucene.util.TestRuleIgnoreTestSuites$1.evaluate(TestRuleIgnoreTestSuites.java:55)
: [junit4:junit4]    > 	at com.carrotsearch.randomizedtesting.rules.StatementAdapter.evaluate(StatementAdapter.java:36)
: [junit4:junit4]    > 	at com.carrotsearch.randomizedtesting.ThreadLeakControl$StatementRunner.run(ThreadLeakControl.java:358)
: [junit4:junit4]    > 	at java.lang.Thread.run(Thread.java:722)
: [junit4:junit4]   2> 344 T451 oas.SolrTestCaseJ4.deleteCore ###deleteCore
: [junit4:junit4]   2> NOTE: test params are: codec=Lucene41: {}, sim=RandomSimilarityProvider(queryNorm=true,coord=yes):
{}, locale=ko, timezone=GB
: [junit4:junit4]   2> NOTE: Linux 3.2.0-32-generic i386/Oracle Corporation 1.7.0_07 (32-bit)/cpus=8,threads=1,free=57569488,total=176320512
: [junit4:junit4]   2> NOTE: All tests run in this JVM: [TestDefaultSimilarityFactory,
DirectSolrConnectionTest, JsonLoaderTest, NotRequiredUniqueKeyTest, TermsComponentTest, MoreLikeThisHandlerTest,
BinaryUpdateRequestHandlerTest, TestLFUCache, TestWordDelimiterFilterFactory, SystemInfoHandlerTest,
TestExtendedDismaxParser, TermVectorComponentDistributedTest, TestSystemIdResolver, ClusterStateUpdateTest,
TestRandomFaceting, TestFaceting, AutoCommitTest, PathHierarchyTokenizerFactoryTest, ScriptEngineTest,
TestQueryTypes, TestLMDirichletSimilarityFactory, TestPseudoReturnFields, PluginInfoTest,
CoreContainerCoreInitFailuresTest]
: [junit4:junit4] Completed on J0 in 0.36s, 2 tests, 1 failure <<< FAILURES!
: 
: [...truncated 600 lines...]
: BUILD FAILED
: /mnt/ssd/jenkins/workspace/Lucene-Solr-trunk-Linux/build.xml:335: The following error occurred
while executing this line:
: /mnt/ssd/jenkins/workspace/Lucene-Solr-trunk-Linux/build.xml:39: The following error occurred
while executing this line:
: /mnt/ssd/jenkins/workspace/Lucene-Solr-trunk-Linux/solr/build.xml:178: The following error
occurred while executing this line:
: /mnt/ssd/jenkins/workspace/Lucene-Solr-trunk-Linux/lucene/module-build.xml:61: The following
error occurred while executing this line:
: /mnt/ssd/jenkins/workspace/Lucene-Solr-trunk-Linux/lucene/common-build.xml:1159: The following
error occurred while executing this line:
: /mnt/ssd/jenkins/workspace/Lucene-Solr-trunk-Linux/lucene/common-build.xml:827: There were
test failures: 233 suites, 965 tests, 1 failure, 7 ignored (2 assumptions)
: 
: Total time: 23 minutes 8 seconds
: Build step 'Invoke Ant' marked build as failure
: Archiving artifacts
: Recording test results
: Description set: Java: 32bit/jdk1.7.0_07 -server -XX:+UseConcMarkSweepGC
: Email was triggered for: Failure
: Sending email for trigger: Failure
: 
: 
: 

-Hoss

Mime
View raw message